##TITLE=1198
##JCAMPDX= 6.0         $$ Bruker NMR JCAMP-DX V2.0
##DATA TYPE= NMR SPECTRUM
##DATA CLASS= XYDATA
##ORIGIN= NUTS EXPORT
##OWNER= Administrator
$$ 1.72 TOPSPIN		Version 2.1
$$ 2016-02-24 12:13:48.141 -0800  Administrator@X
$$ Compression mode = diff/dup
##.OBSERVE FREQUENCY= 90.275459
##.ACQUISITION MODE= SIMULTANEOUS (DQD)
##.ACQUISITION SCHEME= undefined
##.AVERAGES= 16
##.DIGITISER RES= 22
##SPECTROMETER/DATA SYSTEM= 
##.PULSE SEQUENCE= zg30
##.SOLVENT NAME= None
##.SHIFT REFERENCE= INTERNAL, None, 1, 14.73655
##AUDIT TRAIL= $$ (NUMBER, WHEN, WHO, WHERE, PROCESS, VERSION, WHAT)
$$ ##TITLE= Audit trail, TOPSPIN		Version 2.1
$$ ##JCAMPDX= 5.01
$$ ##ORIGIN= Bruker BioSpin GmbH
$$ ##OWNER= Administrator
$$ $$ E:/data/jwist/nmr/1198/1/pdata/1/auditp.txt
$$ ##AUDIT TRAIL=  $$ (NUMBER, WHEN, WHO, WHERE, PROCESS, VERSION, WHAT)
(   1,<2016-02-23 07:49:04.006 -0800>,<Administrator>,<X>,<jcamp>,<TOPSPIN 2.1>,
      <fromjdx created from
       E:\data\jwist\nmr\uniandes\1198
       data hash MD5: 8K
       CB 25 1B 00 01 5E EE CE 71 11 49 47 14 A2 3A 80>)
(   2,<2016-02-24 12:06:48.563 -0800>,<Administrator>,<X>,<proc1d>,<TOPSPIN 2.1>,
      <abs ABSG = 5 
       data hash MD5: 8K
       69 F5 A4 8B A0 B1 7E 45 A8 19 35 6C 22 FA 11 02>)
$$ ##END=
$$ 
$$ $$ hash MD5
$$ $$ 81 4F BC 1E 27 64 F5 7D 64 D9 73 0F 2B D3 93 EA
##$RELAX= 
##$RELAX= 
##$RELAX= 
##$RELAX= 
$$ Bruker specific parameters
$$ --------------------------
##$DU= <E:>
##$EXPNO= 1
##$NAME= <1198>
##$PROCNO= 1
##$TYPE= <nmr>
##$USER= <jwist>
##$ACQT0= 0
##$AMP= (0..31)
100 100 100 100 100 100 100 100 100 100 100 100 100 100 100 100 100 100
100 100 100 100 100 100 100 100 100 100 100 100 100 100
##$ANAVPT= 1
##$AQSEQ= 0
##$AQ_mod= 3
##$AUNM= <au_zg>
##$AUTOPOS= <>
##$BF1= 90.275459
##$BF2= 400.02
##$BF3= 400.02
##$BF4= 400.02
##$BF5= 400.02
##$BF6= 400.02
##$BF7= 400.02
##$BF8= 400.02
##$BYTORDA= 0
##$CFDGTYP= 0
##$CFRGTYP= 0
##$CHEMSTR= <none>
##$CNST= (0..63)
1 1 145 1 1 1 1 1 1 1 1 1 1 1 1 1 1 1 1 1 1 1 1 1 1 1 1 1 1 1 1 1 1 1 1
1 1 1 1 1 1 1 1 1 1 1 1 1 1 1 1 1 1 1 1 1 1 1 1 1 1 1 1 1
##$CPDPRG= <>
##$CPDPRG1= <>
##$CPDPRG2= <>
##$CPDPRG3= <>
##$CPDPRG4= <mlev>
##$CPDPRG5= <mlev>
##$CPDPRG6= <mlev>
##$CPDPRG7= <mlev>
##$CPDPRG8= <mlev>
##$CPDPRGB= <>
##$CPDPRGT= <>
##$D= (0..63)
0 1 0 0 0 0 0 0 0 0 0 0 0 0 0 0 0 0 0 0 0 0 0 0 0 0 0 0 0 0 0 0 0 0 0 0
0 0 0 0 0 0 0 0 0 0 0 0 0 0 0 0 0 0 0 0 0 0 0 0 0 0 0 0
##$DATE= 0
##$DBL= (0..7)
120 120 120 120 120 120 120 120
##$DBP= (0..7)
150 150 150 150 150 150 150 150
##$DBP07= 0
##$DBPNAM0= <>
##$DBPNAM1= <>
##$DBPNAM2= <>
##$DBPNAM3= <>
##$DBPNAM4= <>
##$DBPNAM5= <>
##$DBPNAM6= <>
##$DBPNAM7= <>
##$DBPOAL= (0..7)
0.5 0.5 0.5 0.5 0.5 0.5 0.5 0.5
##$DBPOFFS= (0..7)
0 0 0 0 0 0 0 0
##$DE= 6.5
##$DECBNUC= <off>
##$DECIM= 2432
##$DECNUC= <off>
##$DECSTAT= 4
##$DIGMOD= 1
##$DIGTYP= 12
##$DL= (0..7)
0 120 120 120 120 120 120 120
##$DP= (0..7)
150 150 150 150 150 150 150 150
##$DP07= 0
##$DPNAME0= <>
##$DPNAME1= <>
##$DPNAME2= <>
$$ [...]
0 0 0 0 0 0 0 0 0 0 0 0 0 0 0 0 0 0 0 0 0 0 0 0 0 0 0 0 0 0 0 0
##$SUBNAM0= <"">
##$SUBNAM1= <"">
##$SUBNAM2= <"">
##$SUBNAM3= <"">
##$SUBNAM4= <"">
##$SUBNAM5= <"">
##$SUBNAM6= <"">
##$SUBNAM7= <"">
##$SUBNAM8= <"">
##$SUBNAM9= <"">
##$SW= 20.5580556627758
##$SWIBOX= (0..15)
0 0 3 4 0 0 0 0 0 0 0 0 0 0 0 0
##$SW_h= 8223.68421052631
##$SWfinal= 0
##$TD= 65536
##$TD0= 1
##$TE= 300
##$TE2= 300
##$TE3= 300
##$TEG= 300
##$TL= (0..7)
0 120 120 120 120 120 120 120
##$TP= (0..7)
150 150 150 150 150 150 150 150
##$TP07= 0
##$TPNAME0= <>
##$TPNAME1= <>
##$TPNAME2= <>
##$TPNAME3= <>
##$TPNAME4= <>
##$TPNAME5= <>
##$TPNAME6= <>
##$TPNAME7= <>
##$TPOAL= (0..7)
0.5 0.5 0.5 0.5 0.5 0.5 0.5 0.5
##$TPOFFS= (0..7)
0 0 0 0 0 0 0 0
##$TUNHIN= 0
##$TUNHOUT= 0
##$TUNXOUT= 0
##$USERA1= <user>
##$USERA2= <user>
##$USERA3= <user>
##$USERA4= <user>
##$USERA5= <user>
##$V9= 5
##$VALIST= <valist>
##$VCLIST= <CCCCCCCCCCCCCCC>
##$VD= 0
##$VDLIST= <DDDDDDDDDDDDDDD>
##$VPLIST= <PPPPPPPPPPPPPPP>
##$VTLIST= <TTTTTTTTTTTTTTT>
##$WBST= 1024
##$WBSW= 4
##$XGAIN= (0..3)
0 0 0 0
##$XL= 0
##$YL= 0
##$YMAX_a= 1139587200
##$YMIN_a= -2067236.352
##$ZGOPTNS= <>
##$ZL1= 120
##$ZL2= 120
##$ZL3= 120
##$ZL4= 120
##$ABSF1= 0
##$ABSF2= -16.58467
##$ABSG= 5
##$ABSL= 3
##$ALPHA= 0
##$AQORDER= 0
##$ASSFAC= 0
##$ASSFACI= 0
##$ASSFACX= 0
##$ASSWID= 0
##$AUNMP= <proc_1d>
##$AXLEFT= 0
##$AXNAME= <>
##$AXNUC= <off>
##$AXRIGHT= 0
##$AXTYPE= 0
##$AXUNIT= <>
##$AZFE= 0.1
##$AZFW= 0.1
##$BCFW= 1
##$BC_mod= 2
##$BYTORDP= 0
##$COROFFS= 0
##$CY= 15
##$DATMOD= 1
##$DC= 2
##$DFILT= <>
##$DTYPP= 0
##$F1P= 0
##$F2P= 0
##$FCOR= 0.5
##$FTSIZE= 0
##$FT_mod= 4
##$GAMMA= 1
##$GB= 0
##$INTBC= 1
##$INTSCL= 1
##$ISEN= 128
##$LB= 0.3
##$LEV0= 0
##$LPBIN= 0
##$MAXI= 10000
##$MC2= 0
##$MEAN= 0
##$ME_mod= 0
##$MI= 0
##$NCOEF= 0
##$NC_proc= -9
##$NLEV= 6
##$NOISF1= 0
##$NOISF2= 0
##$NSP= 1
##$NTH_PI= 0
##$NZP= 0
##$OFFSET= 14.73655
##$PC= 1
##$PHC0= 0
##$PHC1= 0
##$PH_mod= 0
##$PKNL= yes
##$PPARMOD= 0
##$PPDIAG= 0
##$PPIPTYP= 0
##$PPMPNUM= 2147483647
##$PPRESOL= 1
##$PSCAL= 0
##$PSIGN= 0
##$PYNMP= <proc.py>
##$REVERSE= no
##$SF= 90.2741286709314
##$SI= 8192
##$SIGF1= 0
##$SIGF2= 0
##$SINO= 400
##$SIOLD= 32768
##$SPECTYP= <>
##$SREGLST= <1H.CDCl3>
##$SSB= 0
##$STSI= 8192
##$STSR= 0
##$SW_p= 1497.18866228788
##$SYMM= 0
##$S_DEV= 0
##$TDeff= 0
##$TDoff= 0
##$TI= <>
##$TILT= no
##$TM1= 0
##$TM2= 0
##$TOPLEV= 0
##$USERP1= <user>
##$USERP2= <user>
##$USERP3= <user>
##$USERP4= <user>
##$USERP5= <user>
##$WDW= 1
##$XDIM= 8192
##$YMAX_p= 1138213871
##$YMIN_p= -2280166
##$CURPLOT= <PDFCreator>
##$CURPRIN= <$PDFCreator>
##$DFORMAT= <normdp>
##$LAYOUT= <+/1D_H.xwp>
##$LFORMAT= <normlp>
##$PFORMAT= <normpl>
##$SURQMSG= 1
$$ End of Bruker specific parameters
$$ ---------------------------------
##XUNITS= HZ
##YUNITS= ARBITRARY UNITS
##XFACTOR= 0.182762287876938
##YFACTOR= 1
##DELTAX= -0.182762287876938
##NPOINTS= 8192
##FIRSTX= 1497.0059
##FIRSTY= 839964
##LASTX= 0
##MAXY= 1138213871
##MINY= -2280166
##XYDATA= (X++(Y..Y))
8191 839964 -356433 -159678 -299306 945002 590336 -42855 -711374 -272948 507494 624386
8181 624386 204192 484927 782047 322944 898082 -20281 -244373 -102383 140983 -347296
8170 -31223 -40780 136031 -537076 341177 -591510 -172006 -223029 30589 491057 -527129 342940
8158 -96172 74508 138693 -239487 567612 -363526 -676168 168822 160822 394488 851387 -513921
8146 319299 793098 -67886 187801 -221084 -353490 -707078 856774 115092 -144796 -471244
8136 -471244 -435707 -123176 35242 699519 536917 229420 -387835 -737314 -271176 508306
8125 -31120 -585907 104491 -339701 -611348 -168242 51120 525972 -844934 692320 -78008
8114 1205807 -706790 -853500 -364304 220124 752842 217529 210601 187290 190092 429951
8104 429951 -359820 680297 -15776 463190 793679 -271030 -302524 831807 -295875 -404677
8094 -404677 171576 -469703 -451526 -25284 -54720 6467 -646583 614222 97365 536926 -757144
8082 806257 -1069954 -288886 -983400 -421978 261301 107973 76503 -496149 -233730 -164845
8072 -164845 -1255127 -246720 5974 -198544 594825 343716 -1262143 274652 53754 -164582
8061 851513 65370 650876 -248416 -1022269 -317464 357645 1082932 811868 418437 -1007184
8050 -572709 481285 41778 -524191 -475760 1097919 186352 708385 -231339 -726647 -47426
8039 -23053 -303318 -413086 104857 -660268 -354290 -46262 481413 -405052 197377 366657
8029 366657 237441 -1186621 443908 -461495 87692 448465 -105192 -413089 1020838 -360720
8018 960057 -583803 604367 35868 -154261 -140615 50184 -240807 566954 -40963 162639
8007 301220 -835078 240975 -112985 -893953 225623 968368 1759755 -59544 694467 716833
7997 716833 -318592 -534817 -254913 18848 -81661 168036 -360503 842541 -447340 210937
7986 75105 366793 739890 -120419 -776439 -912780 236000 748878 486589 -197587 154013
7975 528654 201344 -136716 -500376 -453411 412754 622024 191296 -338247 -253390 -483412
7965 -483412 20262 370338 141343 279964 637211 639642 413210 -986212 -656098 620192
7954 -760283 166312 172334 -97611 -426436 772547 632651 -1255722 573023 1138155 319351
7943 482564 -537965 -311775 51120 -11967 229073 788579 396278 243594 279327 -744267
7932 548938 461793 -466566 -901869 401067 851525 -578591 -597635 125721 110775 1187925
7922 1187925 129012 29588 -839370 -1020200 -757638 593437 494529 283494 -204532 146610
7911 -428454 652289 -75861 -225451 -1078017 -267605 626774 -46588 579504 1143647 290574
7900 -536897 783471 -320991 -933420 -977017 -404165 -16656 -293211 317018 -439790 -629814
7890 -629814 -359037 -502980 -449802 -586063 -161171 -461782 -507417 145316 90466 -341213
7879 215266 -404828 461925 -367063 -51220 22447 525172 -281798 484608 -134456 289422
7868 -617384 21536 740842 -565322 -102526 72525 -76005 -163096 130230 -539002 -614826 232998
7856 668663 -641078 -359523 257392 -424635 377113 -193296 -115514 349852 -439691 78413
7845 532006 -883711 -98340 484279 -514668 -9871 -988850 -224979 243467 -233749 886987
7834 -422227 -734065 350832 -137643 -259528 -507363 -1074686 848871 446414 360374 -319073
7823 309638 630640 20314 -209082 559408 -48866 412426 765687 715493 747732 -1307451
7812 -47435 327845 -447336 206985 -687491 -462735 -454043 -482214 -4528 303173 503356 11315
7800 783916 267301 -640481 466969 256532 254479 358411 -599031 -896505 461828 48131
7789 -510461 579074 216067 24068 -52217 -749046 -221171 74768 -14314 182810 -623071
7778 -107992 -572881 -235977 372798 -10168 284753 -205220 -129945 361585 -621954 324746
7767 -554855 282278 -397643 94403 -147244 -114971 -188682 613639 623385 -192723 -318656 101715
7755 359272 -787073 228755 -578645 602049 -744998 -484366 -180213 12836 908350 -823718
7744 -290699 823440 441004 -380726 38119 158981 -363227 518468 -59035 -27771 -816730
7734 -816730 -473144 210410 -86515 313392 -410027 356473 -149857 -219963 244458 10001
7723 -983239 143712 -516726 141234 197596 57350 -572366 -977314 -1394550 -174922 -324893
7713 -324893 -191215 182078 55661 636316 455628 1371644 -1083858 516191 267409 291524
7703 291524 125687 263978 -5280 652691 255945 68607 324661 -525715 -418652 -660772
7693 -660772 571156 420173 113542 624064 -56836 526902 470130 -512849 90347 128808
7683 128808 5478 966052 -202780 -588253 1039970 -109917 -489244 -498394 469863 127401
7672 -284691 -873936 56435 101560 428284 513858 687496 -3633 -246250 -250274 -180570 -887570
7661 -887570 272694 65407 -436790 498196 219742 -465749 969462 803138 37775 288732
7651 288732 -524757 351864 -412472 -1023721 -613017 357302 745479 -339367 593066 642812
7641 642812 -405168 126370 34293 207433 -144737 -341260 -1053367 287646 578036 -115636
7630 272546 -212741 -344749 -47188 -1103355 65629 19127 -115437 16237 -24631 -208859
7620 -208859 516224 -362274 -350405 -110695 -513545 1310804 -1083724 477458 105842 432595
7610 432595 171571 -226667 -467209 -41127 -99909 -1191906 -196478 -371483 -179895 65965
7599 409618 383608 329949 -387771 -477781 -90093 -944518 906465 -913077 838066 279580
7588 -185210 -60688 643418 -606266 -702927 877212 25352 -738955 320481 -283568 364221
7577 -1066708 456601 261640 147576 484071 -656039 -772151 -633286 1004202 140060
7567 61838 -564222 -7051 -32024 -63140 301007 -635836 907448 -307409 311715 -168934 -727919
7556 -727919 265990 -564353 74741 139373 -950042 -621729 -667176 -710574 -544053 1442117
7545 -422976 121914 -117578 493361 107949 158761 -302937 1521955 -245342 -32225 -65378
7535 -65378 446747 163226 -193510 644761 234265 -137830 -245733 -85348 -951011 240030
7524 473632 720035 -676570 289193 105516 -126287 396596 -1013318 193597 -429372 -513207
7514 -513207 -249393 583764 138459 141153 -326166 373360 -177927 -123519 504841 405650
7504 405650 -192740 -726107 138798 -163655 -1314492 -457266 348761 -342811 -265871 122364
7493 -578935 277781 32674 628271 299709 -873140 248793 -162711 481527 -1051769 -170986
7482 -250202 -72394 24006 150614 -1030424 1593721 280074 81564 -435920 -41022 485460
7471 -97048 -253573 -76785 -453981 -336073 -410164 -282527 425205 134538 -496607 282294
7460 104780 -137244 -882565 -634094 -27223 -102335 -18215 493936 92681 108194 -578244 -326187
7449 -326187 -205713 -540407 -972381 -118211 -708392 791410 -812530 -106326 70981 -156190
7438 -433538 780570 -602697 -346028 236785 -1359985 656428 34506 427881 -278008 866470
7427 -1025722 -633882 -702843 155940 -332858 126565 244486 -1552985 -504247 -537878 713099
7416 1467948 -245553 156017 120339 -287561 -22694 -122883 -403295 -255675 121832 194188
7406 194188 -326351 -45098 408698 -428768 106949 388714 -265967 -1280585 -140707 -1149692
7396 -1149692 -409174 699984 106232 213919 -499641 874222 -50281 -36288 85223 -435311
7385 -385478 62690 -801908 -93131 821982 850312 119858 570077 895879 -38861 -117538 440200
7373 -548300 -72992 194443 128055 575715 -529520 -248259 317160 95125 -1366972 -423695
7362 163741 -7604 -220422 -287832 -1043370 796420 476082 407137 -1048303 496576 385135
7352 385135 207135 347086 -418177 -725201 -448032 -251248 -148159 613872 -211294 368979
7341 344580 -196938 525671 -349670 86731 -346242 64048 417506 157077 561736 159995
7330 -289873 864865 835861 -330295 -289155 87344 -463387 444568 -763058 -1267198 -292169
7319 7019 -997343 -487722 -78452 -118719 -217353 108460 1356898 -449255 -26161 -700283 63803
7307 -285710 -243543 259423 94742 362702 157061 534588 350452 -1607763 -261531 153884
7296 -225835 -550259 -194746 466941 313526 456047 -495575 -472350 529306 899667 113933
7285 912838 28288 -1001669 -379403 -121681 652136 679970 -405282 -61544 -683949 127757
7274 95176 -774524 -642753 -1074182 -357195 -1258639 -1192404 -266520 -9308 -649632 386330
7263 478167 93843 -335536 -186356 -320823 641924 642625 -37633 -349252 -386439 -64202 -1160717
7252 -1160717 -103760 -265874 6186 -575767 323493 487523 594209 398815 168605 1131867
7242 1131867 106521 786647 -339562 -641451 -578797 -1056814 643728 65870 130573 1136332
7232 1136332 375691 -36277 885001 361928 -35703 -612536 -658425 408262 383877 -253370
7221 -303354 586181 -131451 315204 -168443 18628 -923259 41029 -303866 464325 -133498
7210 -803513 299526 -416568 -558200 -297399 283401 -284725 853642 440139 1617932 57549
7199 33166 458831 -381167 96209 -1101164 769364 -426474 -368936 667032 598618 -922852
7188 720349 -39265 886112 1172513 -99100 292773 714855 219944 136682 -1101139 567150
7177 -463 -946957 -251467 173174 57144 639994 -898882 -148096 84545 91907 460741 790664
7166 790664 524618 -353267 420047 21393 332883 507158 -313383 -87908 -83106 270880
7155 -422173 -273498 -443800 -454357 294892 528047 -196237 1026612 -253704 907194 -788867
7144 -382656 220673 693444 48007 198217 -748787 -204336 687761 101204 575511 363226
7134 363226 581020 -635296 -1189085 -549403 112295 -546453 466988 249583 675250 161908
7123 654647 190970 561852 297343 -350654 200964 -271928 -682870 579404 517646 -56110
7112 233875 437846 240920 556507 -216930 -320671 257058 210149 -269400 518761 -262867
7101 1409006 -391503 882 -111562 216311 -347206 128635 293181 709631 -282942 -160892
7091 -160892 -347578 147207 1151433 564875 -282290 178703 366288 32658 -607659 632598
7080 206807 -678758 -448165 260124 -220450 427935 180320 930593 247267 -297819 245605
7069 -709081 403687 271272 785513 155946 411627 -111443 -1369746 1104942 -27409 -1136208
7059 -1136208 174191 -347343 881648 -888142 741745 55857 -544525 756658 -422285 -497869
7049 -497869 522226 192690 -212621 961074 -260878 599473 273521 -409807 -455695 -330064
7039 -330064 119150 -380370 1137901 133036 458347 418602 -754198 -678232 180582 -679386
7028 -530204 683426 510048 58655 1038301 -576356 281945 -92648 -255274 406419 -421806
7017 982287 -151091 -210293 -609976 137733 506050 913791 -615363 -676614 381366 1205363
7007 1205363 159024 -274963 -741206 -117401 32802 172766 303514 1265238 105234 232398
6997 232398 -203637 -17593 115201 389309 -110727 346164 7919 634282 779877 94496
6986 25050 32917 -101551 197642 374468 -1154176 814649 -423692 -891474 -715672 652576
6975 -196133 652947 167245 433158 746687 645496 -25038 341226 -348253 718427 -7404
6964 899020 45700 408892 -307211 -247635 1201507 789531 -398637 41866 223809 340216
6954 340216 333231 -342425 -103139 214483 -144758 697664 -580617 -1196883 140130 -453095
6943 786125 800131 279096 89325 199075 224344 262924 -148030 -341897 -885973 278494
6932 -86380 -4280 -89605 -329041 839522 330773 709320 9596 -125904 114401 -995435 -263096
6920 715001 -1730644 -300449 -40175 1046465 388211 -6362 -276521 906887 827192 993769
6910 993769 426650 276299 724475 -406868 -964772 477707 -294724 -1172 395802 341706
6900 341706 481657 166440 262359 -460410 -732107 -164637 -337006 -15808 218861 98714
6889 1222216 546549 487330 -490928 696572 -271446 220758 -221949 -31313 -106917 252166
6878 -603725 -13730 -1198327 762804 -800160 -243958 901044 -241057 122633 367027 183901
6868 183901 177414 -30287 219225 282371 374700 -150443 146173 -957017 273486 558326 -256097
6856 1071174 -457490 180116 561212 -885532 32137 557104 -182057 262525 -477660 -667447
6846 -667447 -35473 -1004 600761 167774 43523 -665944 1091404 856048 82068 124216 270300
6835 270300 164991 -899805 351173 -208279 -442612 -611921 -350639 -1261325 687508 -628170
6824 213207 625016 43545 -464709 276827 -235012 395931 -196292 620507 630907 666906
6814 666906 192441 576600 310007 -623209 418356 -210221 -368783 158734 968875 138568
6803 707045 -48509 -224 956859 123479 185075 149391 46634 -768825 -147102 -340995 -328553
6792 -328553 -446670 407499 -11162 -180480 462744 -575438 -27957 675683 765948 23188
6781 496428 -540731 303708 -668428 1289099 -178653 -495943 65359 -386586 340091 544017
6771 544017 -885336 337980 -195374 -643225 302075 -451952 1000739 -443464 -153524 -216353
6761 -216353 843634 256516 -256872 443178 594876 78926 70880 401265 175619 -464747
6750 -818907 780725 1002565 626389 190821 819701 -13179 -140524 -344157 280624 -250176
6739 -3250 250843 438376 248054 728451 -1348592 -225635 -736983 -238155 -99775 -281907
6729 -281907 -414376 -11293 96877 -281352 -529533 -221683 570517 -303328 311720 -617422
6718 -449861 300866 -235061 -589229 293594 124257 -304663 365679 -107785 45948 -285693
6707 264840 197901 466835 -11239 56476 260385 1078693 304681 301228 -469711 68531 -330697
6695 321720 737595 -76354 -140225 -973119 -153278 -413757 -729533 -5436 -896188 -224828
6684 -671677 -705854 191296 -655424 98877 998588 1580345 659895 -305099 922289 334638
6673 -492117 411174 666786 522014 -433254 -475115 -14192 -357110 -77436 427005 1486967
6663 1486967 -659727 83817 559586 -59301 -32557 62282 270274 -57286 -186191 -587480
6653 -587480 54173 57875 398473 -564481 78196 63464 407645 -440110 -869562 316345 520236
6642 520236 -678239 233234 -137850 732663 -1065878 488155 -897715 83389 1190958 604318
6632 604318 304398 -121985 1032685 -100258 800972 -128709 -771159 87062 635012 502513
6622 502513 -512673 818123 204344 408228 1120016 30587 -640025 271441 -1253187 -215769
6611 -388207 -233989 358499 269516 334133 510877 194053 224877 563924 -309444 456098
6600 182793 853103 -591658 -88773 1228192 -788475 -804758 580813 203569 -99434 -637447
6590 -637447 215131 159934 -672479 851330 1338852 -846778 -752473 424199 1744743 458696
6579 281639 -975224 230630 350533 51619 -600062 561247 231100 -88294 719222 -285228
6568 350255 -24436 -55577 99649 111516 -527880 587857 220331 -311035 90461 717750 293902
6556 -411032 1408190 -36073 1135981 810948 -72677 -748431 286918 -571107 1114993 -269882
6545 -339429 624750 406210 -269546 -1098391 -213572 -199154 -649632 -1060686 227586 428883
6535 428883 -722523 479732 215620 714388 301283 -338637 -50814 1077711 714781 -84885
6524 441016 1315589 -1240750 66973 -375318 -622027 646784 -142133 -23786 -744096 -447575
6514 -447575 733682 367163 134275 -303923 -662763 -152228 -654941 743913 1041968 414326
6503 -114499 89857 472390 -155764 429519 -474604 -367528 237722 -677154 -702175 310626
6492 317348 -487962 258599 336487 -767831 -70423 -671960 94567 -1113 569316 35 97888
6481 97888 1068702 111323 647960 -1552555 511376 189900 -790520 111170 -498050 2231
6470 -306446 16170 -161436 -365155 -357419 375308 315460 507003 -829773 788201 232223
6459 -360619 79754 419263 -78348 349736 -480163 1005711 531650 -171274 271655 346457
6449 346457 4491 17852 -140306 343070 723534 -315265 295085 226012 118026 -524486
6438 -49816 483220 826305 -622097 -59877 -44473 -773005 143005 416968 -88845 672540
6427 -374969 764271 621464 -432703 348648 -563695 -597959 -725409 933509 -435028 596177
6416 27382 375579 -192191 -451739 623496 -115795 589263 743921 777236 -338378 875607
6405 -91015 -1080166 410297 339673 -89350 -486631 -295624 740693 248179 -114798 -685649
6395 -685649 273355 261095 -163324 246815 -943557 756309 814191 -1910 -641884 461500
6384 990933 -128274 121605 6941 607028 -1069236 591713 882039 -55410 -573533 239543
6373 -374324 -455712 645107 -944633 141849 20524 490558 236111 36448 1235569 970882
6363 970882 398994 255649 -56655 -651072 -267569 -167716 646377 801014 -42236 -1582320
6353 -1582320 785179 -306904 27442 320317 -734904 976721 -98981 751971 554860 -447115
6342 -713347 -635004 202634 175505 -179816 -950370 -228957 393639 50092 -61519 1277876
6331 898487 -211013 153532 1591230 59328 2497 -1114173 -304188 607682 453058 -421438
6320 -993855 244158 93116 202682 -404040 104371 685999 1110443 -294488 687522 -167523
6309 -168041 9104 -539766 -927869 -186500 -171660 539498 348001 287576 681294 -787131
6298 -458949 228655 -214236 -29927 -441588 663295 -49421 470756 -263465 -695095 -152390
6287 -928085 537242 681098 -240005 141929 -451495 92230 672308 -70622 1034766 1839611
6277 1839611 -1155608 -442925 -1012289 -54359 844691 24957 -16537 -857264 -347335 898848
6266 -747255 49391 181974 1198781 175779 -763767 16494 500818 -11720 -1028068 603646
6255 -338974 -32315 505766 605063 -626326 334154 71466 -896757 222442 12489 381607
6245 381607 -446842 318563 158785 -362465 -591877 -148009 13746 -1268338 464232 -628413
6234 264476 380149 -79153 -117592 -1015168 -408489 186413 304132 -629285 125360 -63609
6223 -34980 -897744 -909052 398551 -865109 -97666 213071 -901598 -192524 421828 -327275
6212 248164 -443083 -108796 752850 267424 942190 751676 696329 -237610 374689 183149
6201 85304 110339 113869 54935 -796575 -27094 -293901 -224325 -460925 -231606 528143 -868649
6189 246939 -459678 973862 -35861 -90705 533362 35125 313079 136890 -984964 877629
6178 -807937 42942 701822 -325314 1017596 424635 -390 -860616 377332 -1250382 -87186
6167 -15574 1580772 8863 201306 392212 331213 57734 341311 36087 -48976 -584089 54301
6155 252372 -261237 186687 -447755 -190294 -553378 151056 -31292 589686 1353512 425690
6144 -508787 701500 55789 481181 238924 183547 -359253 -716199 1256454 -445516 580448
6133 960780 60088 903779 -536561 332728 549730 499468 903349 -411042 -347129 -107090
6122 -261803 77051 -1027934 389191 897516 768401 -220361 -55077 -215426 -54751 -133692
6112 -133692 1284965 216326 -348504 -345527 -304663 181640 -211672 -260409 185957 317954
6102 317954 -128095 1853 940761 -378250 -113134 60844 220486 -182046 556666 -958956
6091 -204883 211268 -963363 411251 407050 -180830 -408264 888012 -1466782 408565 -21110
6080 277789 -525647 -247740 -240682 44903 1099512 -9591 317977 -175191 -151751 424647 1342549
6069 1342549 168931 -94863 680701 531594 445974 -300126 405292 -503624 -433598 962507
6058 117076 -144163 197733 257516 -923787 909050 -115582 520710 929676 -429806 91797
6047 -945126 -94819 399135 268962 1024036 -21594 -318169 -191320 198183 -514136 -23769
6036 418469 -417756 -748126 268062 479387 77847 24467 711438 1177225 155139 292733
6026 292733 697078 76911 291816 224608 -603944 1394766 361413 380219 -505167 215590
6015 1067418 209678 993922 -699402 -279703 -910629 1017420 918461 118574 -250209 454670
6004 75133 139500 371290 134088 -64714 640674 -714224 -935556 112870 85585 120764 666918
5993 666918 190607 -905735 -833694 454345 367152 -1338984 485630 -521115 529354 229679
5982 -815467 80376 537436 -150336 -775134 562564 505061 -190904 -893527 136456 254568
5972 254568 -1224760 -614105 955524 315874 338751 910492 -684550 491349 -86863 582667
5961 296806 -170303 -377318 -83085 155851 457763 472442 -54574 44584 -598145 -292140
5950 362024 -522370 473809 -654298 -582279 -391988 -339426 -32913 1212096 21008 39777
5940 39777 -571727 -121343 -578737 960669 215530 918840 522372 1304529 -328419 755816
5929 633267 -233730 1078855 -37999 -6438 811041 -18070 -531278 -505864 618302 -335739
5918 63945 -634609 980562 22934 730842 92189 421727 816801 245731 241956 316004 25508
5906 -626971 -216028 612193 70303 412125 -1170661 483414 -394349 -623409 688137 256324
5895 71806 -217672 -161039 -588758 -430238 -144230 483280 -173304 -1464258 -710285 485544
5884 -457763 -157423 -661947 -212616 132778 1026012 -749809 233535 -456847 501920 -650288
5873 -841984 -658898 -184995 -635254 589239 -64796 246800 -1106628 58471 1130385 999100
5863 999100 -35354 -544496 -106952 7520 -189304 658863 746197 502780 642850 767559
5853 767559 1082732 -437615 872372 -600360 379898 -496355 495678 1110879 -1005439 -608351
5843 -608351 -119615 -283167 1030910 251933 -712900 -280487 -116874 232081 82861 -510775
5832 72163 347390 -140776 -798414 48202 -226461 -548741 -602734 -343895 534975 -263979
5821 878570 -971520 -580588 461607 -386501 -674994 243808 -51342 601731 -743531 620708
5810 -682571 -471356 -1662509 553697 -613392 8956 -677366 -10474 -390622 -335058 125496
5799 773442 -300979 666965 -590753 465767 -855440 -218249 646269 -479868 -218486 -674928
5789 -674928 -170859 -147559 -313187 -476256 89762 -304730 439975 -850519 -559446 -141398
5778 -529750 -33366 -500055 -165977 -579931 -1630 320670 -171108 -217960 185746 8333 1030535
5767 1030535 -526718 865659 -778635 -1335955 -119707 928091 149074 -485046 -236480 -1381579
5757 -1381579 92713 -820450 484369 280837 139256 637674 364508 353485 -516673 67759
5746 6047 62094 540029 -1099156 391001 -174008 688948 -598495 -269555 915959 725218
5736 725218 -578098 -195912 -347743 -35702 -510094 -382374 521025 216615 555790 114676
5725 -672550 262590 -151900 -661113 359530 -398002 186415 218897 -297485 -222508 681908
5714 -477035 -815756 -55213 43312 -191985 -453907 411080 -669530 -831102 -1119139 836919
5703 -210926 421611 392645 405150 218486 661070 -944346 -314883 -99117 -131159 -123777 -838828
5692 -838828 -507352 -539908 -452657 425633 379763 -1493946 581911 -248855 723128 -545399
5681 -704424 -558297 -294923 99010 584080 -163234 174889 -439306 -513855 150923 -691114
5670 -275168 -190998 574642 -376453 255042 -183030 512976 -910697 360284 1738274 -347929
5659 -113236 103023 -74445 -13834 -424264 31609 157755 83707 1308604 382588 257851
5649 257851 -82437 -304967 22902 276531 -89359 -767058 235625 87332 -766496 -173414
5638 -530604 -942067 585925 361342 -794057 -188690 -9307 166490 394512 -357946 -129413
5627 560431 1057251 -843113 121673 -174084 407213 537950 -260592 31936 -37007 -4576
5616 -832817 -464003 -453589 -552744 522116 -301006 -351010 203144 -412620 -52002 -913528
5606 -913528 183345 -553253 -4221 15914 289489 291192 727071 807109 -1058453 987151 -969036
5594 -649896 -266244 -649569 -218815 -231453 1115779 -14043 -899642 -588698 950020 244131
5583 524865 -209696 622973 667674 275638 -171181 -663569 98441 491299 689085 -381352
5572 -192271 -593015 -250847 1021112 283983 242149 735355 -306414 381350 73786 -282417
5561 -635037 -1156106 -494456 562969 -428628 121916 -567091 6492 -438803 -1037188 916234
5550 -152679 43557 -450381 1107263 -626228 750166 -1148701 -437907 258550 211584 -1270
5539 123282 -95717 273569 193833 288175 323125 904379 793408 -418362 -708022 -251698
5528 -1150639 970195 521301 -549673 -486567 -645671 88665 124632 -559783 -819241 -756650
5518 -756650 528082 -153263 -320051 234057 230084 -105151 -753733 -357322 450223 108328
5507 163233 -819686 247441 973576 127871 354806 -142740 238305 -361129 -196149 -1302977
5497 -1302977 -44878 -372443 118167 -869366 -1408901 628971 -932003 734156 451131 153770
5486 -1110758 34695 -355851 795745 -282929 -820933 381349 -125423 680059 8933 -479408
5475 227256 -53726 298633 -429327 879447 -687169 231460 437898 796399 206164 887224
5465 887224 779804 1239167 -13085 555844 847270 599047 1448040 373449 313640 312200
5455 312200 -319512 126021 182435 -413951 1398621 278458 -519657 383601 550092 174886
5444 -255615 37850 44595 81548 364260 327995 -969325 279529 -511936 303253 -753941 122174
5432 42387 73190 484409 369804 -745761 -782031 -6270 -335405 447522 -1167757 -796989
5422 -796989 489744 157023 417709 9722 113223 -215404 -189728 -450772 214390 159168
5412 159168 -544245 81492 -706402 -1008922 498989 -616074 310716 -125436 322121 -113520
5401 -20779 -618215 367453 1647520 34276 -651737 -745366 -458580 -132883 -71378 167277
5390 -47698 -759314 118315 722026 -1114967 753893 -642269 -1116832 685979 -1117224 126482
5379 43084 667782 -260927 -252166 -246477 1107818 -335965 -533030 -726511 -528825 -1432963
5369 -1432963 -355149 50407 328475 118095 114050 365493 -1698327 392730 -134068 -157058
5359 -157058 101037 766173 -169202 495932 672107 340377 381383 -596491 533025 -374194
5348 -63366 -450907 94415 103162 141604 -648882 -141961 966559 -879160 598510 -352746 490556
5336 775778 89224 386733 667858 150774 502042 268093 -1196191 -225404 352164 968646
5326 968646 -664088 217095 -339928 -625080 9318 -151930 -431452 -630590 346334 -109316
5315 -352488 -21196 549198 544617 442755 161181 233399 -284207 -330775 816128 234008 422447
5304 422447 548933 1583708 410737 475271 -397668 1033904 435908 1315031 1411306 11516
5293 1026318 482592 122673 666945 11601 57185 -536207 583039 1175437 1226139 762792
5283 762792 704437 720322 873934 -350758 -222235 442863 -403974 751618 698379 397332
5273 397332 1600540 76324 -123348 429618 528953 394302 735812 1161289 707149 8785
5262 89173 -398247 203867 341597 -675744 -200095 -179614 1229409 -774558 -610206 -396191
5252 -396191 -270753 313948 555098 -342440 -75179 -130479 234060 -629688 2114 624700
5242 624700 -937417 491056 191017 -293853 -604133 541713 -53750 -387072 -354825 -78868
5231 -686622 -194601 -852533 -802881 35762 183205 409496 -394357 -402051 -128146 77150 1230158
5220 1230158 -115905 -236753 -167138 401163 -347398 389351 -215339 -297278 -180050 -654182
5210 -654182 -277371 -203152 199770 -411067 -782801 -906728 -138240 809960 -519215 236983
5199 362398 172420 964970 -1094831 -147658 282 -331009 -328989 -708410 -872279 -91509 -80787
5188 -80787 -959409 -1258448 -110064 -157200 -11312 164271 358797 232812 122186 576295
5178 576295 -636667 -904478 -124226 -232294 505972 -438704 -820182 -334332 -556578 -49225
5167 597902 57191 -779969 -566505 549100 523971 262297 211566 1457731 -248295 -39955
5156 -431167 447379 -132761 -186054 -187125 48348 -736594 -624513 -371633 43038 1517 -727619
5144 -263284 -9894 587046 -584972 -424255 -168307 -413095 -473563 247279 -1130566 -435836
5133 -320690 348950 190687 -576856 -296848 910391 840190 -244795 -444533 32080 -419050
5122 541402 -952672 -500636 -143833 278505 -1033299 -509073 66352 222962 -342860 -595340
5112 -595340 -894412 579059 -1107533 -395406 -573648 -4882 -768852 -324503 263717 -394782
5101 111005 317272 -361196 -373553 -823159 398913 -221700 -1037388 50540 -260315 -278820
5091 -278820 -412013 189513 270847 -579658 659818 -435936 5844 -454007 221244 451567
5081 451567 -505949 335700 -251641 -865095 241257 -861157 120266 -40581 -788182 -341287
5070 -597880 1094709 -158748 -858223 -367298 632554 -894825 -103358 213997 -177768 377666
5059 -967443 -305514 -372161 -215576 336783 -618696 313055 -436601 695341 1098195 1154425
5049 1154425 796446 972995 395879 622092 449455 1090899 -231690 68248 702522 -355363
5038 54141 -573665 -892225 -284577 -24578 -609890 -699588 -212261 -762247 66069 352690
5028 352690 -960176 295659 475783 300066 -59970 -451239 -964365 435852 -394714 358846
5017 -219816 -381200 389255 -57825 -533066 -966323 -180509 416887 -374258 -66141 146742
5006 288458 -419233 -378382 251780 260886 -552279 228922 -379956 -233123 -927506 -483202
4996 -483202 -17907 -540772 -722133 -941894 -42936 -223275 750433 -133905 473723 184839
4985 -717421 -605922 728232 -162252 -60482 -602809 47823 -873383 -485919 -1403031 -222991
4974 -370056 -136705 -614011 -159477 -494959 151061 143258 216350 -140637 271910 183209
4964 183209 -792787 192175 -654798 -1029197 -271564 -463179 -443338 -273482 -6859 -265035
4954 -265035 -497612 175537 -902352 -1587538 412714 870311 -135899 77984 125980 -418408
4943 156946 361100 5127 -468607 120570 272499 -1918995 43364 -173347 -470444 274378
4932 601921 -1012552 1269805 998819 -536295 165005 509953 542069 778984 -568739 -1203248
4922 -1203248 -132798 269491 -402906 261526 520455 -997768 -390679 -239272 296135 -91593
4911 514980 553747 -302974 462830 927067 41160 718900 -130143 26380 702071 260066
4900 751948 -926537 124448 -406646 -1428237 -638884 -810044 -630996 -297325 -999942 -515231
4890 -515231 -93497 -786899 150930 87287 365660 -614463 164132 108168 604139 -171185
4879 927409 -1034732 206709 278742 -1462216 649112 414456 -952743 60856 721687 423542
4869 423542 -881195 454450 -338799 540654 423243 182951 -263163 -314528 731835 3606
4858 -601230 -741684 -221145 399743 -585510 217138 -220789 832738 -27077 -267885 -922390
4848 -922390 -991167 186774 294636 183874 -136296 1346284 -358334 -114282 -281878 -735170
4838 -735170 610704 -578844 -647626 297863 -644390 -369620 -693379 -89907 -158178 -442514
4828 -442514 -497987 -596468 -476325 469161 -133640 -194746 -645485 89567 591660 297081
4818 297081 -714810 106256 -101283 -276056 -274190 96828 -138873 -131888 329240 20833 -148821
4806 -188429 -896197 1204865 9673 1355023 430678 1171356 1046242 1004583 1154412 2205361
4796 2205361 2071029 2259257 4337789 4141504 3675395 4076614 3815816 4739274 3053067
4787 3053067 2718541 2650765 1639374 846606 914510 445326 -603954 284172 -290485 567944
4776 -161849 -106235 599617 -847489 1034426 -295433 -468685 -292754 -553559 -1035548 183326
4765 170840 -1427822 260555 -193275 284221 -342154 820397 -389146 144156 114259 523146
4755 523146 114368 -760841 -593107 538722 329623 -687412 41984 -403659 -444823 -386660
4745 -386660 -470321 -598526 -654028 -308122 -598120 -760119 -133126 57130 -735652 -346740
4734 -495940 -203285 -488678 -191927 15734 -850266 -485933 22272 -224210 -385189 -87929
4723 -317004 900830 -60917 -1260234 1086560 -147060 276661 -505888 -990454 -103373 -1088164
4713 -1088164 -113532 -1473107 -1419051 342524 -13020 35402 -82574 -662376 -93250 -577308
4703 -577308 142345 -34513 -574381 -605320 204955 -140864 134883 -236025 -791766 277580
4692 -59025 -122735 120242 721619 -739339 -78058 169525 425301 -744842 689045 593076
4682 593076 604115 68849 -761839 -189137 6731 193897 -759673 -911965 -1269568 -584740
4671 -398088 -1229805 1310510 682056 383331 -401794 -920168 596145 -682037 383203 -341507
4660 -729834 -1225170 -563898 -410531 -628363 556682 298401 230071 -931889 461539 -105990
4649 353550 286243 -197320 -1374643 -347807 -163212 -231032 361626 330157 -742208 445905
4638 -205596 498677 -27385 426007 60200 244280 -655543 -1244583 719208 151159 209798
4628 209798 -35690 -3676 205489 -434752 -1802546 -980517 493799 -397324 382208 257548
4618 257548 456984 -84956 725806 162873 -109755 191054 -123559 -896413 153964 -298378
4607 -460929 128134 -707184 -143208 132511 515750 1244589 -314699 275387 -644414 -983095
4597 -983095 -291122 -377900 -86823 -387106 -864541 -122905 -66324 -492049 -409869 163317
4586 -226567 -128004 -763649 -50175 706306 -3579 -844026 154630 -232696 442888 -258807
4575 -348663 74504 99847 -831737 288261 -78587 956931 -344830 129535 -1440515 -290821
4564 324855 442867 138480 -633363 -279319 -294427 123615 -1234980 -158505 -145455 184011
4553 -423994 -1085760 636344 1291442 -1166420 258212 -474723 55444 318861 -271739 155004
4542 328819 841578 1446497 157527 212558 10052 -95174 646447 1898532 2372889 1705998
4532 1705998 774914 1248758 1397482 638430 -110382 1101764 58551 1590186 790684
4522 1949582 1284736 -136333 369251 -515243 173637 -452297 98342 308503 -271865 -216841
4512 -216841 -429082 928981 -1386044 -332109 -191582 -105840 -735874 -39317 742744 863301
4502 863301 628530 195614 614667 2018295 1431779 843215 1187514 781221 2221712
4493 2221712 788859 1765990 804176 837690 903972 416269 1223927 766944 2045641 1807281
4483 1807281 76954 352642 1018474 1092945 -337350 408352 -198136 40685 -26155 164026
4472 -346719 -700793 41323 364625 -30409 120347 519935 209892 511176 1068460 -159599
4461 19827 849494 -7366 -1068515 -323328 -365598 -590140 -1203290 -342392 374120 -16310
4450 9514 -187892 324331 -418867 -13139 -866419 439915 132427 -357333 -279286 -260631 -626489
4439 -626489 -610395 -380284 -704671 690238 -396004 -328198 543446 -217677 93327 -355988
4428 -560055 -421084 6143 -373028 -493129 -279406 -288915 -552889 -131806 -161284 -523050 -958032
4417 -958032 -165751 347490 644667 327444 576493 -18746 92573 676470 472397 348197
4407 348197 720637 914900 349867 294274 84568 455983 1252357 383707 1113521 1315463
4397 1315463 1170780 327217 -115961 -36900 834736 1428868 772696 2203948 818176 1144532
4387 1144532 1703335 702075 1396046 657440 -135436 -368697 1254040 463210 743996
4378 743996 124173 -398368 382640 -50814 1011282 835875 10227 708291 -35947 314979
4367 -1107148 228867 29394 1475489 349296 -210112 516109 -519459 794026 464504 -95929
4356 105492 -359198 943022 28795 -813751 -668650 848098 581550 536698 852806 135186
4345 -506658 493481 1014900 313663 -380405 -1111338 504735 966250 -260299 -235009 250056
4334 82833 88667 919844 743917 1158326 1710975 461383 740112 892376 568480 247144
4323 -416719 483575 -753216 198278 -538290 -801771 -136485 137121 -621976 -53458 158707
4312 884409 -138880 -1015739 453386 -392240 -554347 -1318566 -1220066 -350493 421798 70762
4301 -127697 766962 930486 -974469 -68546 114432 754115 128134 80713 322059 -32561
4290 272272 909394 -159467 -64553 -318312 -320166 393242 974555 558492 101469 759070
4280 759070 1107422 1087135 1106271 1971231 1246431 1648542 1729118 1116958 -99362 553116
4269 722267 419866 12505 -25704 -370602 627988 -186413 77456 -689329 54283 -231734
4258 173446 -296380 594688 41405 368762 -185544 26099 21168 -429203 -794071 -550683
4248 -550683 143776 514651 329495 441810 -507249 573769 -1542651 423103 -851590 -305611
4237 286958 434088 -52636 -60130 -441896 426128 1554762 37379 903869 17782 900143
4227 900143 835304 431521 234585 222994 -139829 -589180 501563 314355 252075 -359580
4216 645146 -254765 -1391734 206401 170744 343471 -21913 670492 736723 -477557 341824
4205 -550409 -1272659 -758940 851992 -4913 -576123 -509894 -1035024 -670299 -12198 -238832
4195 -238832 -750139 472184 -1539794 -85021 -43369 386891 -973824 -926028 242023 -229860
4184 814799 -225404 -445385 16618 716701 -203695 -435452 -836680 1138281 231708 1035727
4174 1035727 190082 23860 119783 -558950 720203 -1192450 -578896 728417 -936940 153284
4163 -177801 -674264 -963366 -769141 -511940 400620 -775266 -611761 -673024 -478800 -1951
4152 523024 -1011774 233585 -474334 -326190 -214398 -174286 -414750 -1125743 -780991 -172560
4141 -819552 -336049 -119810 -136531 -1263780 -93685 -23878 153960 -346089 -151354 -409740
4131 -409740 -677853 -268079 -589953 -1003987 285914 149384 -1325001 -47387 -610413 -43968
4120 -1219346 187290 -441783 52981 -117853 -704432 -723715 -532566 -27049 -85756 -289360
4110 -289360 -333731 -244470 294837 -418206 -78577 1064378 414310 -854253 -88641 42090
4099 -250089 -1920573 -637842 893209 4709829 1242224 -77027 -170040 198258 68893 -596023
4088 120948 -199392 504265 -717707 73503 269258 -83339 700191 477642 454772 -534241
4077 464329 -646028 313629 107463 -423822 -753380 -348730 -328080 -1149158 -471612 -990099
4067 -990099 -834793 -809023 186985 12563 -662595 -125338 69903 -270919 480865 553226
4057 553226 -165452 649308 746245 770478 846423 460032 2160553 973393 993530 1095587
4047 1095587 794699 259316 -612451 -105915 903405 935829 517693 1271526 820110 133686
4036 189150 1527686 -195537 810198 822142 -1045465 -117554 -406666 -461794 25796 -891027
4025 -106987 57531 -160412 -384501 -279373 -146086 366592 842920 -57520 332278 437918
4015 437918 -110778 311276 -254316 993594 -283166 -29047 -305872 -128041 -265602 -740571
4005 -740571 331211 320113 688408 -443968 -372633 -231155 -127052 -504229 59648 -1257560
3994 596046 48372 -117860 -590270 -234263 163726 1132596 645851 1170817 660520 1235150
3984 1235150 1734004 1493531 822465 996711 -42994 296628 -130725 1754112 557734 1751372
3974 1751372 989682 1601176 777023 129509 825995 88881 257495 393853 564515 1092041
3964 1092041 1173615 2176789 826299 619617 1444615 840621 -775596 108793 -277088 -372667
3954 -372667 -739605 -1565295 -477641 -95523 -419453 -1797079 -714033 234356 -138214 -681280
3944 -681280 -176794 -1355764 -1290574 -1242792 -792578 -920412 -933047 475630 -528747 -766661
3934 -766661 -368159 -500089 -10963 -1657389 186487 -290018 -1181244 415337 -1306864 -1315914
3924 -1315914 258139 210177 -1930328 253517 -350476 -202342 -951744 -878362 -564340 -664014
3914 -664014 186071 -1937538 -1313244 -1752886 -1543824 -1200618 -1117508 -101534 -78839 -743761
3904 -743761 -131755 -1357317 -1423711 -497848 -645650 -887148 254266 -309791 707206 -1044690
3893 -379948 225913 -770783 -1316409 -850834 -251116 -721989 -447903 -549112 -1094737 -1082795
3883 -1082795 -496900 -1234525 -351159 -662288 -211561 214077 -919323 -215157 -228814 -570663
3873 -570663 1119103 -390105 545485 977268 250395 1224387 -278677 924689 369336 189792
3863 189792 679431 383662 -451753 653309 -394074 36684 -66571 305307 596803 209898
3852 -674157 -221893 247266 44682 485682 -742950 433793 104233 43986 278650 -245469
3841 547274 645746 1337115 1086915 2525803 1705748 2227644 797285 1031438 2045878 1923679
3831 1923679 251144 2148273 2956889 1156354 1869739 2419796 1951486 4090791 4210768
3822 4210768 4743929 5546403 6564940 5345013 6162847 3988552 3829490 2873244 1830470
3813 1830470 2177263 1140121 1417283 383213 1416599 351297 732908 1150870 941632
3804 941632 47851 -411754 -563136 214250 -568426 35903 -182549 816021 -1024959 106219
3793 224662 -316350 186605 -715879 -59836 391919 323994 -1084857 340721 -254562 -991670
3783 -991670 -1366794 -404574 -267698 16633 -2650 -1149869 571646 -231509 103511 19204
3772 -217679 -1355682 -611061 -77896 -718235 -467694 114110 -1665940 75033 -1300025 -328075
3761 -493278 -685616 -499586 -581332 -243238 227975 -1023690 -82460 -1357165 -250559 -191505
3751 -191505 -962402 -1179315 7675 -789334 -638119 -477687 -152904 -1366681 -862186 -416058
3740 -1205899 -1725915 -56107 -483963 -1002955 -323867 -1384043 -720827 -483594 -739930 -1160105
3730 -1160105 -227065 -763976 -1072535 -99558 253898 -492932 -672467 -1011233 287375 -758974
3719 -442892 -32602 422743 -994294 -145220 -1121938 -293344 -842541 -1058426 -519624 -211733
3708 -34402 387152 47363 -562248 -1822613 -1810657 -1320494 -1780602 -899782 -155154 -885086
3698 -885086 240981 -16373 -988993 -1334924 -677336 -525603 -1084526 -1357241 -1016068 -275534
3687 -375705 40732 -722990 -757624 -477378 -623628 272042 -478879 -115689 -951602 -1850491
3677 -1850491 -182212 670450 -1096790 -1170335 -674536 -922672 102534 -1561793 -1285129
3668 -1285129 -881489 -141977 -342496 -234280 -251503 285256 -685310 -797765 -406924 -608978
3658 -608978 -591897 -2099551 44377 -646124 224461 371079 -593341 495356 -23112 259697
3647 -1375955 -665112 -940893 -869538 -253926 279252 149392 180812 -304375 -251451 1165440
3636 208189 289786 -249673 -244876 802864 103150 536491 1131624 828198 749028 131234
3625 2012512 683038 369373 20891 -1166245 -2280166 -1651239 -1355624 -590504 -1237481
3616 -1237481 -1214249 -1172073 -1577385 -1805545 -498216 -135016 485720 -418278 -1195301 -413796
3605 97372 988958 625120 418977 -172187 338982 100584 459179 1032813 1929520 673779
3594 1900214 1012602 2068541 1367809 1631173 2617481 2963789 2936850 3174102 4317083
3585 4317083 4536928 4167461 4975083 5710000 5079926 5580348 5157122 6348744 6054542
3576 6054542 8081237 7908892 8403683 10082218 10573425 10612025 9743872 10440904 11015568
3567 11015568 11072088 11619105 12434409 12258994 12923771 13342788 15122702 15739351 17637537
3558 17637537 18621291 18674741 20486911 19635658 19209876 18121055 15824426 15409398 12215745
3549 12215745 10786957 9357145 7650341 6378225 6961085 5471882 5456727 5856292 4711153
3540 4711153 5431231 6390412 5474650 5754920 5055222 4714437 4708500 5987682 5298737 4625153
3530 4625153 3928016 3501216 4037488 5283904 3630352 3968993 3570353 4320130 5181523
3521 5181523 4408613 4337142 4484808 3573658 3824748 2128702 1056273 1454820 2172855
3512 2172855 1806986 1749342 2040369 1369861 1689049 1491118 1987970 2130007 1658668 1166337
3502 1166337 862422 540076 1987202 851288 1815598 848645 1646044 1740466 2075530 1301601
3492 1301601 815929 1523729 276713 1259969 1457305 2132338 1419339 850212 1488894 827608
3482 827608 1282481 2432652 1698662 1476161 1164059 96246 850130 813485 262281 1336165
3472 1336165 1117761 1654046 1155578 346839 1140149 1587346 1111920 1875021 1232172 1681418
3462 1681418 506601 424903 1292966 1260934 152165 671045 582181 829702 910310 574151
3452 574151 845224 1606793 1195883 1102412 -217296 1110545 416499 -327721 -655686 -18531
3441 1261184 989028 312904 1232172 518160 490229 611290 1733823 1184165 777867 1109873
3431 1109873 549975 869694 1269285 141580 815091 927963 802242 1340074 1478035 656507
3420 721764 386638 874807 -200670 817931 1134069 1375455 1561034 1405621 1319328 1905804
3410 1905804 960376 985188 683856 889405 970537 908311 258820 1610226 1358560 256462
3399 1362620 957867 481434 840073 81017 772457 1759321 1011529 543802 359211 235548
3389 235548 2195214 684032 744178 897508 982743 2263498 660669 2076080 1760420 1803160
3379 1803160 1874573 566145 2019958 1974123 2109537 3269463 3258445 2011459 3347002
3370 3347002 3241776 2869288 3150111 3809303 2570511 3746823 2983680 1935353 3452658
3361 3452658 3475948 4033765 3538912 3402458 4306901 3719376 5893067 4206278 4326850
3352 4326850 5451455 6667195 7505080 7251381 8480946 8631216 9689774 9932716 12033195
3343 12033195 11313578 11708073 13716392 13148328 14113192 15081129 16171945 16486058 17927596
3334 17927596 19305645 19556783 21208241 21542324 23406263 25304506 26518205 27089345 29110469
3325 29110469 31199690 32099534 34783699 36345561 38730206 42239716 45248491 49454833
3317 49454833 55107064 61510399 68599815 76510479 84198935 90827551 98729000 107727153
3309 107727153 118381627 129921861 142713423 158905177 177624164 200585583 226190458
3302 226190458 259801990 303102098 359964574 437953707 548657080 703490757 893362131
3295 893362131 1071030497 1138213871 1052926718 861644301 655002396 485820460 367568188
3288 367568188 289409100 236013917 198650478 171511167 150210705 134011811 120276149
3281 120276149 109235143 99819738 91717614 86793473 79986197 75083562 69573694 66083667
3273 66083667 62263401 58762110 55007380 53572523 51368129 47841752 46651632 44780551
3265 44780551 42379551 40043064 37923664 36677225 34442115 34226845 33153975 31919313
3257 31919313 31109612 30717703 29774883 29387583 28183643 28231031 26726548 27156913 25759951
3248 25759951 24731629 25483019 23238186 22963017 23026792 22956424 21719208 21986761 20528873
3239 20528873 19462666 20091692 19689038 19088240 18745491 18635701 18471129 17627644 17208096
3230 17208096 16944709 16783210 15382671 15160244 15551706 15699456 14506279 14326862 14474101
3221 14474101 15900828 13656517 14316269 13499414 12855103 13277288 13823378 13044924 11764199
3212 11764199 12972818 12074557 12553065 13463189 12490177 12112622 11481627 11798857 11516023
3203 11516023 11197861 11697364 11207171 11122994 10787938 10328979 10970307 11116532 9856805
3194 9856805 10041431 9491849 9886396 9940463 9845026 10147413 10454409 9785022 9135603 8953640
3184 8953640 8872029 10027923 9194186 9465856 7113015 8744559 7963559 8050911 7457816
3175 7457816 7620945 7434378 7625668 7830270 8415801 7660916 7079087 8890859 7578919
3166 7578919 7354468 8486817 7239902 7943196 7226202 7587481 6577624 6824215 6739031
3157 6739031 8379287 5905623 7700504 7481178 6230171 6015454 7036192 6508643 7093670
3148 7093670 7519978 6230062 6002547 6491320 5878781 6751555 5390473 6535632 6574871
3139 6574871 6906974 6705574 7010543 7181367 5623168 6335690 5613076 6419806 6216361
3130 6216361 6238196 6526271 5643403 5046744 5863205 5484658 5826495 6673677 4797532 4623787
3120 4623787 5721850 6258762 6426010 5617898 5744187 6232461 5865695 7244337 6561156
3111 6561156 5127383 5681194 5497214 5963475 6879271 8253309 8499410 8454184 8908671
3102 8908671 8945366 9989165 8973701 7545053 7304246 7337359 5687016 6118978 5578653
3093 5578653 5536503 5279827 6563246 4879626 6143591 5400004 5281057 5351039 6095326
3084 6095326 5822780 5466267 5067771 5461339 5616828 6059549 5182846 4881120 5563970 5557669
3074 5557669 6164744 6711403 6044111 5863220 6898329 6977022 6229860 7251658 6604337
3065 6604337 6958488 5860096 7019112 6087120 6999353 8032418 8005644 6511991 7956193
3056 7956193 7982157 9861048 9205540 10805393 11359230 11325291 11770585 13019208 13493686
3047 13493686 12427046 12869270 14084614 13490038 15618792 14618713 14796235 16140094 16958129
3038 16958129 17059364 17750936 18835724 18704001 20870646 22315372 22805730 23651929 21108688
3029 21108688 20190536 16638144 15724088 15212465 14957867 13977765 14418463 14420890 14647574 13782673
3019 13782673 13372430 12365706 12597000 11707013 12155396 9461634 10025729 9763969 9829889
3010 9829889 8616834 10193667 9196676 7375878 8829321 7970572 7465103 7317011 7621527
3001 7621527 6813468 8311970 7136296 6573998 7814965 6880444 6052420 5862348 5356885
2992 5356885 6257374 6025832 6591986 6332285 6366472 5802644 6453792 6165420 5855545 6251207
2982 6251207 6470741 6043108 6462323 5110531 6351507 6156323 6754740 6488902 5505240
2973 5505240 5723755 6166526 5862289 6350629 5705914 6886991 5542884 4971898 4508433
2964 4508433 4306088 3543104 4107224 4053872 4668681 4147875 3555901 3785175 3575154 3705102
2954 3705102 5323946 5067335 5633508 5246849 3980576 3372222 3905629 4589053 4867997
2945 4867997 5374270 4425951 3989121 4495395 4748229 4087145 4616460 4392625 3501653 4910075
2935 4910075 5455264 4638535 3800302 4491413 3788861 4181477 4942734 5103927 4176609 4046988
2925 4046988 3673143 5028834 4751246 4506939 3990248 4779669 4780100 3890162 3313057 5036881
2915 5036881 3474689 3949234 3837539 3003925 3896775 4032890 4004142 3213025 3798166 2648651
2905 2648651 3825664 3315126 3486573 3479844 2639580 4267156 3848780 3391494 5052863
2896 5052863 4289914 3903797 3951856 4467884 4545640 3431973 4069347 4938145 5175135 4793119
2886 4793119 5103326 4971678 5853279 5872673 6499810 5698981 7498088 8427819 11297007
2877 11297007 14996660 19345529 21723199 21755909 21457355 21879187 18759515 12637475 7869676
2868 7869676 5995190 5519488 3677258 4261909 3514849 4615085 4889978 3050311 4438805
2859 4438805 3967716 3220147 4102786 3760211 3290659 3387381 3084742 3829145 3214700 3040063
2849 3040063 3981587 2599656 2571453 2535571 2122345 3739200 2674199 3999215 3684296
2840 3684296 3708321 3110267 3751253 3738928 4229899 4141799 3494596 3194017 3180670 3561565
2830 3561565 4058171 3137563 3560443 3939803 3313084 3106718 2858368 3110755 3767622 3494186
2820 3494186 4046607 4201204 2613465 2876096 3186854 2348686 4188790 2924126 3127367
2811 3127367 2912305 3715611 3934214 3109362 3021278 4008394 3304888 3825061 2541972 3836803
2801 3836803 3548530 3839330 2379091 3226948 3497782 3822889 3259676 3314447 2845444 3751160
2791 3751160 3715310 3713764 4088026 3814610 4269769 4818114 3778747 4480180 4708014 4415145
2781 4415145 4625060 4222624 4414621 4666522 5873304 5589142 5011093 5650580 6744213
2772 6744213 7734421 8754327 9237144 10219675 9283230 8798370 7266470 5427371 5835441
2763 5835441 4778679 3505853 4257989 4465869 3388117 3559646 2883816 3975922 3530493
2754 3530493 3349769 3808533 2942754 3745583 3855677 2060620 2394971 2891627 2733436
2745 2733436 2517389 3098526 2143665 2924484 3164631 2837483 2149888 2799638 1994796 1190978
2735 1190978 2593369 2295409 2360458 2921123 2836669 2124503 2073330 1997069 1803562 1842502
2725 1842502 2007908 1596290 1708449 1882048 1979360 1916928 1979938 1695300 1781862 2434697
2715 2434697 2505389 1358033 2184950 2823452 2300226 2455913 2646928 1409976 1048545
2706 1048545 2584075 2122805 2854495 3449482 3393718 2775779 2070800 2204478 1700204 953756
2696 953756 1623499 2565628 2482221 3586142 2181777 2204356 2405111 2155307 1529184 2678678
2686 2678678 2074572 1247235 3096122 1958002 1776299 2277092 1496862 2953561 1522580
2677 1522580 2792912 1543693 2329162 3196552 2085063 1897222 2284358 2611078 3534791
2668 3534791 3112969 2078284 4500623 4533458 4144407 4297564 4804002 5573608 6915631
2659 6915631 10097783 16268479 24829704 35796306 30815644 19920359 9067571 5881471
2651 5881471 5529804 5137690 3520872 3422647 3270151 3234391 3637928 3166457 1360204 2302879
2641 2302879 2815474 2193479 1741979 2425073 2947911 1656222 2780662 2430030 2159783
2632 2159783 2307329 2034523 1441206 1126930 923758 1654987 789800 1487239 1522150 1111109
2622 1111109 1727654 2407175 1949544 2202571 2532910 2956434 2629878 2966875 1816513
2613 1816513 2006055 1197198 1311990 2064223 2074568 1590322 811164 1116423 2275187 1514464
2603 1514464 917069 1111739 2366250 2705817 2006025 1018490 1702635 1145693 1360336
2594 1360336 1429059 1993911 1456940 2222498 1333784 2093711 2514695 3000703 1937400 3029617
2584 3029617 3257068 3114855 3641315 2978399 4347100 4746586 4954585 4149336 4869336
2575 4869336 5256536 5662170 7231580 7327966 10270562 11400166 15348843 26786544 39957878
2566 39957878 48507901 41444485 26248461 16726934 11484192 11042987 12772150 15866818
2558 15866818 22070350 30750939 32643433 24665592 16246920 12746008 12338088 14079546
2550 14079546 20621004 29624671 40935411 44232327 33546012 19296690 12620361 11765984
2542 11765984 11281784 15447056 21519530 30368580 30916575 23067258 15118102 9533875
2534 9533875 8224849 9111791 9414543 12257326 15074511 16817008 13237266 7922869 5166424
2525 5166424 4795901 4459681 4333383 5051373 2834580 2731324 2358245 3001486 4278072
2516 4278072 2702819 3550350 4015418 4184551 3463317 4685635 4415474 4916386 4991826
2507 4991826 5692932 5271222 4373864 5032476 5775056 4630405 4800570 3836145 2967976
2498 2967976 3600992 2957080 3193298 2756236 2073415 1815554 2164926 2478971 1553465 1436920
2488 1436920 1418679 100471 1101624 1859577 1387707 1565054 1163330 1518854 262092 1143954
2478 1143954 999768 920096 1135336 1454513 1300602 1103173 546320 1701084 964521 539766
2468 539766 1804100 1224723 424163 48563 1042564 1146198 1563689 949500 1416145 368293
2457 330107 1304146 733481 620033 -745254 481203 421517 1386344 538692 341792 387070
2447 387070 621276 91578 813722 1150330 163931 -272578 390688 1914115 889831 1069772
2437 1069772 -161869 -44903 537983 -225176 77648 51770 401188 558095 1364219 -245272
2426 994517 132035 853170 797601 607890 -42620 874101 156520 738907 642383 718916
2416 718916 67898 536625 681768 324128 -298214 369683 706830 910857 -112378 901634
2405 542463 231934 614141 575997 922366 313855 1039105 425477 303880 -137714 1209619
2394 676377 36128 110120 187184 477242 457540 211023 770906 58983 454004 577666 86417
2382 171681 886705 -124732 -329770 -614167 416251 139536 351269 -12996 1541202 1214825
2372 1214825 -237949 -65124 -71498 868304 250091 879112 -107738 539203 1132898 77953
2361 203682 1529539 816101 284424 360491 -309423 707701 851355 958658 996329 473362
2350 1182779 1632613 1077904 453564 605416 114709 84291 -496525 962466 406227 238596
2340 238596 1201462 -65430 1187229 848593 842759 389949 505972 74156 815332 -407521
2329 123224 714899 1648591 574732 -49590 902024 978119 1411591 945991 1568905 426444
2318 1559823 1940563 2093976 1741534 1370148 1095019 1639604 1160189 2005319 1856145 1314781
2308 1314781 438569 1544822 1877956 1382163 2113123 840115 2027268 1765462 1564073
2299 1564073 1014525 1331794 1885095 2579709 2780245 2047404 2360069 1926751 1470905 2648341
2289 2648341 2543217 2822094 3420459 1923210 2088425 3189066 3720363 3586061 2319215
2280 2319215 2191571 1741880 2455965 2343683 2514026 1765330 1924922 1601188 2454542 1080698
2269 1708774 2332242 1851328 1735471 2549406 1547790 1943423 1795825 923748 1264088
2260 1264088 1009996 1444546 2944568 1149871 2147111 1222816 1022489 2267028 1256719
2251 1256719 1880203 1781768 995206 1363717 1354372 1382404 1390470 1032456 989835 1668111 1621395
2240 1621395 675097 959647 1659430 767407 421688 424641 1120844 982488 1063780 1112817
2230 1112817 447103 1211406 986526 -79056 525505 2047571 1147878 1008506 1062159 1881253
2220 1881253 1736252 374228 1183084 950534 1654432 1460795 1057751 613748 1063697 1631920
2210 1631920 1325647 1151984 1129873 2620211 1397462 877178 651806 1992132 925034
2200 1432850 593082 63075 1524749 1065911 695651 415504 1679037 1075819 1224219
2191 1224219 1021899 1345916 822573 1359584 1731732 1458760 99837 944564 1571691 577315
2180 1248988 329877 1297488 869387 2289608 1079685 1815363 1689346 1110722 1541251
2171 1541251 1623109 2169351 2817483 2141583 1806165 1001243 1357026 1722026 1675891 1192508
2161 1192508 2253831 744402 1800095 2310508 1981754 1036553 2078937 869546 1537660
2152 1537660 1668175 2709538 1310710 1273804 1381282 1053561 591697 2555690 1249540
2142 1485023 1479866 707223 1155188 1748563 1391154 1367058 1356275 1549781 851384 197020
2131 2334592 2621798 2491212 2539316 1760540 2174213 1745647 1235674 1696966 1701043 1855649
2121 1855649 1505935 1609855 1543791 2340961 1193555 1740870 1523770 2161199 1187877 2419228
2111 2419228 2310676 2264588 3380742 2383360 2899964 3397112 2052085 2641395 3028466
2102 3028466 2791410 2446835 3159541 3765240 3302395 4370944 3493381 4601356 4461587
2093 4461587 4900379 5321253 4663343 5297722 4999750 5472850 5708896 6081135 4804735
2084 4804735 3365007 3885729 4437683 5073094 5042907 4612336 5332230 4688669 4863797 4831566
2074 4831566 4627816 5169538 4173214 4838331 5349336 5053431 3914262 3839542 4676184 4042362
2064 4042362 4739229 4466881 4411622 4857100 4841267 5003611 4244355 3978669 4741592 4287491
2054 4287491 4245552 3838557 4715659 5477051 4018923 4193052 5009230 3879297 4275125
2045 4275125 3497450 4037664 2972759 4358287 3009735 4199169 4256060 4399991 4729780
2036 4729780 4793329 4836912 4843119 4062895 5095152 4956466 3442038 4280762 3211775 4331589
2026 4331589 3888779 3794131 4351772 4368742 3820465 3347964 1695817 3473558 3955941 2105140
2016 2105140 2655621 2915286 2719272 3071100 3383504 3584293 3708795 2609618 3329578
2007 3329578 3528323 3949789 4031288 2248596 2065905 2961999 4090029 2354957 3697006
1998 3697006 4500431 4119602 3673750 4764922 4012384 4198342 4304941 3960470 4248831
1989 4248831 4014441 4493269 3493953 4468910 4230940 4457867 4219899 3386476 5156062
1980 5156062 4624721 4132805 4040250 4078256 2963751 4935583 4121112 4182161 4740364 4713864
1970 4713864 5272580 4390018 4229889 5344640 4510721 5598338 5939461 6101896 5309965
1961 5309965 5711506 5615385 6093728 5576745 6688946 5556028 6383047 6280276 6974689
1952 6974689 6660975 7122430 6796431 7615776 7482802 7301189 7538393 6394222 6046724
1943 6046724 6877339 6879028 6645709 7716455 7178498 7858078 7454266 6249688 6818167 7686167
1933 7686167 7505592 7884634 7606269 6855841 6476614 7225835 7383698 6265146 6520291
1924 6520291 6198925 7094584 6739939 7738512 7550270 7620077 7387804 7982413 7911935 6730418
1914 6730418 6781797 8474650 6933200 8110470 7542334 8423671 7734704 6768747 7795495
1905 7795495 8025059 7174305 7459168 7928351 6998752 7740834 6538852 6363432 7099885
1896 7099885 8216242 8478585 11130433 15317770 20502995 17151646 12395882 8178742
1888 8178742 6618372 6402515 6422178 6732659 5929029 5185815 5707243 6197440 5633942 4382316
1878 4382316 5301572 5183517 4001527 4153297 4514477 5683082 3559528 4233031 3203622
1869 3203622 3577607 3642345 3741900 3742640 3985557 3968890 4423777 4311881 4675634 3431708
1859 3431708 3988999 3564275 3694048 3168974 4490685 3180717 3334558 3981968 4200835
1850 4200835 3996791 4014445 3752035 4546906 2930770 3416395 3852358 3451201 4773949
1841 4773949 3383610 2969145 3435320 3636792 3367226 3136572 3586368 3916356 3565385
1832 3565385 3697232 4317015 4181088 4335978 5355636 4749696 3521164 5219226 4230313
1823 4230313 4070841 4780233 5425627 5245166 5002754 6005527 4913709 5018436 5529692
1814 5529692 5720437 5574799 5872042 5257926 6248931 6749441 4405792 4679489 5734498
1805 5734498 5197188 4780711 4699084 4074737 4428312 4220223 3902568 4344721 4717756 4094951
1795 4094951 4585236 4026946 4181873 4038816 2911697 4715779 4856374 4602218 5081247
1786 5081247 4030933 4299020 5449796 5516157 5339832 6133235 6121263 5607020 6018475 5657322
1776 5657322 6247467 5248876 6242479 6341106 7196471 6208637 6283204 7050507 5974100 6151070
1766 6151070 7557353 7254581 7618946 7777488 5946399 6275439 6946497 7288339 7285606 7769787
1756 7769787 7981584 8068967 7968958 8386583 8418160 9208011 8193575 7988100 8600290 9607745
1746 9607745 8636321 9005826 8672868 9520583 9517355 9280144 9411575 10312542 10534599 9894448
1736 9894448 11534235 11028742 10440307 11667937 10849104 10763967 11305008 10868642 11052821
1727 11052821 9433226 10268159 10968437 9262316 9045093 8624606 9511769 9347284 8752721
1718 8752721 9295823 8857421 9462477 8281678 8080336 9353555 8974039 9208412 9114594
1709 9114594 9118570 9804018 8608892 8676870 8716178 9526046 10369196 9195067 8360907 9065820
1699 9065820 9620718 9453185 9139221 8606634 8126784 8725208 9062512 8305674 8236452 8143168
1689 8143168 8232669 6524539 7842842 6868409 6630235 7457021 6204576 6015556 6786538
1680 6786538 6073232 5551927 5657312 5266570 6495285 5380064 5724045 5092667 5258986
1671 5258986 5413531 5652556 4831230 5900722 5053286 5813020 4874962 4265610 5302851
1662 5302851 4458493 5989304 5336436 5122353 5048047 4806319 4682351 5052977 3995123
1653 3995123 6599607 5075324 4121921 4420360 4851408 4254362 4916836 4911663 4447227 4743113
1643 4743113 4960664 4126567 5201208 5844234 5757149 4698289 5677190 5197404 4806707
1634 4806707 5677580 6542821 5741504 5489564 6221176 5555030 6124853 6523669 6151927 6228697
1624 6228697 6722236 7298209 7515270 7157357 7534165 6961725 8248871 8012818 8569343
1615 8569343 8006636 7910874 8913354 8590266 8853420 9019295 10230162 9156999 9636221
1606 9636221 11286901 11347821 10523494 11388257 11042652 11346265 12036439 12823894 13642070 13542743
1596 13542743 14530905 14175580 14966113 14604134 16598381 15986037 18360701 18307975 19047314
1587 19047314 20662687 20945324 22212026 23152586 24830938 26089452 27808767 29166099
1579 29166099 30596136 31580222 32342613 34637934 34483847 35822754 35481278 36404954 36936440
1570 36936440 39547671 39327032 40631641 43094907 42248095 44276163 46247401 48630288
1562 48630288 50618424 52487777 55330955 57523895 60842211 65276689 68779839 74192239
1554 74192239 79698848 87178706 96431109 103502394 112176751 115637925 115665117 110650646
1546 110650646 104395088 94992779 86534599 75063812 64110146 53438082 45635267 38201604
1538 38201604 33244487 29987211 27179984 24698902 23626334 21376166 20278512 19436347
1530 19436347 17756551 17696724 15683106 15988337 15521985 14326547 13792101 13675961 13240846
1521 13240846 12388452 12287163 12082963 10982253 11372487 11022883 10292864 11107550 9744189
1512 9744189 11137437 9190398 10110049 8812228 8379689 8475023 9076214 7836766 7625415
1503 7625415 7991601 6564253 7844361 7944311 7288038 7101782 7132103 7275578 6996141 6239522
1493 6239522 6825879 5929998 5869190 6493951 7291258 5933045 6261874 5758191 5159790 5328366
1483 5328366 5793391 5110001 4091765 3978745 5130367 4478726 4096398 4211223 5170337
1474 5170337 3993900 4851129 4949062 3795669 4540261 3829750 3708040 4393756 3093936
1465 3093936 3724870 2833117 3458933 4237326 3827368 4271427 4482016 4550270 2836764 4229564
1455 4229564 3903582 3474688 4229027 4043336 2167533 3841940 3166268 3910885 2379152
1446 2379152 3816507 3816168 3292054 3546180 3476725 4341670 3226712 4341004 4406720 4502134
1436 4502134 4154669 3154405 2255518 3479385 2736660 2715857 3086223 4073038 3396878
1427 3396878 3009488 4222098 3962198 4140058 3534560 4346792 4712560 4391737 4377604 5399760
1417 5399760 4870557 4625003 5238586 5428234 4739292 6012334 4652674 4512087 4597805
1408 4597805 5795589 6437853 6799031 6496146 8416878 6835531 7885865 8917257 9574889
1399 9574889 10938571 11275694 13803666 13114743 11602014 10965829 9362478 9009944 8777731
1390 8777731 8950511 9120221 8400587 7746491 8410796 7464862 8080017 9761670 8737403
1381 8737403 8346994 9587818 8788835 7280733 7878489 7442517 7690579 8432722 7826258
1372 7826258 6936147 7807318 7880793 6902622 7318116 8909163 8018035 9219453 9183367 9726355
1362 9726355 11357856 11996590 12041918 13033422 12423904 12709874 13935366 12410908 12730674
1353 12730674 11015241 9571170 8992380 8368023 7506099 8231889 7628015 6563855 7953712
1344 7953712 7168082 7403381 7712922 7849919 6867174 7314446 6050103 6497889 7063949
1335 7063949 6003386 7962599 8217366 8514119 9333624 10110635 10516958 10532115 9292361
1326 9292361 9640321 8743609 9099251 8423214 8448618 7642535 7655653 6223909 6191461 6703783
1316 6703783 5694954 5771055 6037620 5068731 5071619 4357708 5059478 4855009 4416046 4438908
1306 4438908 4342474 3624987 4663148 3910846 3628562 3830631 4918461 3351572 2805613
1297 2805613 4113606 3860001 4709757 3689178 2896441 3731352 3783929 3728987 3773374 3688738
1287 3688738 3569800 3546094 2237782 4121279 2924585 2724245 3057410 2354799 2703838
1278 2703838 2710863 962240 2304563 1582502 2243867 2896017 2844681 1862529 2393339 1507958
1268 1507958 2215410 2322287 2830574 1517166 1301486 2429809 1678580 1602168 2002430
1259 2002430 2345861 1649421 1169046 1410081 2483628 1445177 1331399 1481302 1945063
1250 1945063 1945464 338699 574623 1285685 1442763 1039715 76539 1081493 751665 271821
1239 549739 250634 1029802 1048139 1619437 1264529 723254 216284 1350787 445483 473045
1229 473045 842624 510764 -359206 585863 962615 623080 17306 1055565 772866 1170615
1219 1170615 661102 465958 1439711 460186 104789 205586 498384 -552815 156240 1079826
1209 1079826 733653 406937 1283934 1260837 -39699 593077 -734592 473675 334359 1160677
1199 1160677 1186228 1009540 630101 976168 156924 1115857 329383 1042046 760407 -1191886
1188 -62451 198120 310214 727460 1099140 455013 721736 337707 94992 1270518 850141
1178 850141 725701 1139887 1052314 389766 1886323 677473 1205329 566338 749108 486951
1168 486951 705051 164881 -250359 927744 -814085 -534539 735728 906733 -724500 650218
1157 545259 1142765 -694287 70132 -756229 -983551 1123336 -222702 -232419 -1175000 -1129931
1147 -1129931 574530 202833 241762 -630668 -609657 1047706 -460111 231622 -106273 -605448
1137 -605448 155921 -87762 483657 56679 1163142 -711257 1293768 286187 35854 -903627
1126 48218 -1159037 -25941 -155434 660736 486700 100698 905 -998470 -53781 361501 99921
1114 -171385 840892 -780043 693036 -417945 -364638 -906273 44059 -642469 577178 724188
1104 724188 -170721 478050 -812632 -61970 -261067 471677 -621880 -94445 -20129 304556
1093 492538 -415157 211100 -171281 120642 -797800 483309 263748 258717 175862 -713902
1082 447918 -81908 -97173 434890 -474836 308109 -734222 262742 1207996 1487139 -625779
1071 -185866 140384 -705330 -562373 -48214 590361 -354165 431868 592240 450021 -224676
1060 238290 -89268 43972 -694720 473788 -177862 -238151 76856 974009 261947 718271
1050 718271 -67003 -181045 -548526 327130 931427 -398097 448379 268296 -742760 -272088
1039 -57415 392266 -420129 -128140 22537 285344 -248518 643539 -330129 -776437 1205160
1028 1109063 -442648 202632 -394197 -495921 732531 194585 638145 -525974 -14828 -473409
1018 -473409 186219 286232 -211768 -970888 -664023 297691 -579696 -906171 -619781 -303693
1007 -403861 -909531 -800287 -322915 10586 -302054 -637222 522650 -405922 -543454 -550425
997 -550425 -629587 72564 -240066 -1139960 -427565 22687 -1096338 -453571 -932595 -110113
986 -1458511 -237179 64602 -544463 -594935 -383774 -801348 -1045864 -433292 -751022 128305
975 -181230 504563 -334377 -702789 -296032 684678 -1162385 324183 -364734 -623570 -1026277
965 -1026277 51720 -526088 894952 171738 165325 -399678 424375 -716625 497574 -36192
954 -762469 -229738 51602 -657262 335248 -884590 619411 497814 -550500 -1099614 -313943
943 -446287 -302150 902852 -620591 -203042 -516115 622332 904717 1747231 1641010 2547527
933 2547527 1829981 3069300 4057229 3719590 1920193 1780190 2253051 2371098 3724602
924 3724602 3424347 4386685 4971681 7195078 7254764 9218068 9723708 13392998 23000466
915 23000466 42015422 70637036 77160731 54909515 25445244 10042543 5931491 5822232
907 5822232 5141582 4060550 3034303 3854841 2094901 3194993 2392495 2107630 1432111
898 1432111 2534769 2067123 2008056 2561341 2246788 1878988 1043733 625759 1164203 2647288
888 2647288 704070 1163670 722150 1349688 204171 1705184 442934 254861 -593178 186942
877 398233 154869 152658 906161 241936 600689 -142892 188215 -958819 581634 702825
867 702825 -300846 130107 -28249 380690 275584 -312848 -917152 -46383 1633346 43446
856 1388331 -394590 -67046 -49261 -475379 -412536 -427515 1576321 25856 -369534 148482
845 -271994 454409 -481649 50197 307101 -135385 -405839 17980 -233526 -453800 -967449
835 -967449 320631 39433 106396 453936 329414 -297890 -537098 553358 -31958 347333
824 167010 812032 458144 -913598 -586524 906887 101419 -150062 -33926 -400094 -342324
814 -342324 -1481609 492578 391120 799614 25390 -968991 -188269 -987065 -222724 505265
803 -1030806 -306397 -515875 -1338728 -803243 -409582 197585 -561262 183123 -945386 -272677
792 475295 503398 -669650 572407 -732734 -485490 -153253 169768 -674568 -159543 -630629
782 -630629 -57746 94786 -370152 712174 -17464 -536159 351611 -1170088 -341195 -1047788
772 -1047788 -563468 61140 -1146185 -647525 -1836929 -148379 -57779 397364 -610273 6665
761 218102 528868 -329773 -279100 -275531 -786008 643995 -405103 -1288313 -322689 92023 -1011342
749 -1090706 250217 -1707159 -721560 -85144 -130710 -91795 -353423 -382601 -118402 -584826
739 -584826 -596081 -496230 -450650 -277069 -1410111 -202799 106977 -751116 521734 -94692
728 -320974 -227767 -214942 521338 -1005930 -817997 -1101104 -383761 119566 -802512 -367789
717 -375433 287643 -25150 -422422 -792558 -1219523 -842136 -500075 103105 -574734 -665310
707 -665310 -278700 852358 -1580613 -350224 -1311193 -1078689 -615784 -578861 -238322 -474293
697 -474293 55689 -750135 -373750 -31668 -1407857 -961324 -1044198 -363167 174504 700402
687 700402 -790978 -1138550 -811817 -897242 1035637 50118 159256 -283027 -795966 -340712
676 479599 -487480 -377310 -693122 -251686 -427720 -381545 -14857 210520 373434 -208608
665 -191611 -335893 -763821 -87364 -1015513 309649 46590 -428435 1252060 -273074 883647
654 -443341 -382297 -40675 583059 -375284 144005 820479 -344708 71161 -224648 875767
643 -432775 -182277 23678 -64252 -462966 -692719 -588134 -177884 -414801 483386 443592
633 443592 200023 -838680 -32135 -482548 301983 572980 5323 -180893 -11780 364182 -1391310
621 -901169 281708 253195 -363091 -969137 51953 -78442 -1012164 60641 -322165 -197580 -848673
610 -848673 742793 648247 -530714 -367210 -844729 -951047 -610900 160864 -303337 -1577522
600 -1577522 221318 -1484992 -115717 461495 -296587 -1233868 -426252 396212 -474504 -961220
590 -961220 -22015 -399673 -868978 -794537 -180959 -426003 -620359 208774 -309674 -390873
580 -390873 -847368 207562 -36448 -739723 -210100 -522716 -561411 -615977 -69965 -159344 -836498
569 -836498 -29362 127021 194319 -280588 -35112 368061 -739163 201612 299638 -584862 -1570738
558 -1570738 -167109 -172502 -466663 -478710 -518915 -834064 -469275 -457765 -934189 -748597 -70971
546 -519744 -961347 -386117 -502087 99769 -49477 -204866 267969 -243769 -296243 -1588267
536 -1588267 -811810 350183 -514316 -768000 -957682 119837 -1300178 -1072064 -618669 -979865
526 -979865 -946819 -584557 155563 450244 -162849 -1213701 -346088 -24265 -142250 67446
515 -464231 52155 -955679 -765433 -959186 -454570 -386176 -515925 -477225 34051 -340429 -196253
504 -196253 26771 478661 -613126 236078 -542875 -500580 -902187 76046 -84918 -457338 -435004
493 -435004 -214525 -116925 624771 -582201 -1114869 -126896 -1080425 243933 671270 291184
482 -1328963 -29687 -609961 -266585 -165897 233800 56475 678383 -795323 -369508 147955
471 -105651 -717144 -359421 622943 -537921 260125 456062 -1426719 -73660 -634968 343821
460 -489867 -590883 -37049 349360 -745443 -1079413 -632583 -464791 424409 -357044 -451393
450 -451393 -342476 369577 -305887 653977 284690 232333 -28405 -125816 253958 -237689
439 166663 -305526 -169458 -360045 -524007 -1376095 354344 -436813 -294082 -1124149 267863
428 -107033 655735 -394999 -331108 -698832 -1696827 -467621 53490 6795 -435674 -629823 -801954
417 -801954 221435 -207717 -493509 97244 205695 -391388 700616 -677776 -97257 -224831
407 -224831 -738453 708885 -170813 -7567 305696 706000 -302717 -394954 218345 653471
397 653471 -256425 678926 204231 193921 -495298 -115461 -423751 503928 215096 350202
387 350202 964542 -438909 388424 107279 -192808 -891231 267371 -498632 1068548 -918573
376 -632925 635251 -1171642 191768 155373 -234301 -949606 -658317 52299 154662 635906
366 635906 -91680 131006 890269 -135297 -484510 -795323 -365782 201999 -386313 -252705
356 -252705 401096 1086643 -191328 -230259 1041019 -72085 162907 94798 -1103294 1112630
345 397356 432163 310300 -763882 -822767 -177650 935434 102409 36873 -604661 -220147
334 -538095 423956 -264677 -964061 484394 -224715 366655 -43956 195673 -488344 -121736
323 -774519 -245092 -195920 -774460 -215334 -131342 342793 -385244 680766 96602 591736
313 591736 -246888 -421960 67544 -433157 -913889 -1324988 41065 -253295 -424262 30946
302 120077 214330 -485528 -629865 139206 -1030152 -762838 495709 99474 -351031 -568064
292 -568064 5432 -67214 15788 625129 -95193 -6042 -60762 146662 486184 495980 -845902 317431
279 74302 -49017 243920 -258788 588135 907700 153603 -386988 886948 -379657 317258
268 -93281 -841227 -592307 607908 108798 -582823 -181323 -340461 209520 5328 -20686 75155
256 -302601 -601508 260801 27944 711056 -974853 -79771 -393007 -150721 66476 795164
246 795164 -108915 -267521 624498 -90137 -71075 148691 -550580 620484 173119 -24389
235 46391 399286 174645 -470345 822584 -579140 -104896 -454970 45899 -160300 513628
224 -194840 408434 -28160 304269 -1137379 533421 75327 5329 52069 -58884 -391534 -88278
212 252354 -171427 287991 154004 194610 550097 -204942 270354 1198773 -137894 483838
201 198308 294732 537588 624286 -396982 737782 -94556 922962 826370 277171 1528677
191 1528677 -245734 -453425 -635 114747 -268 -190546 531048 -148699 471521 444063 -418464
179 -723423 -101661 505253 -496533 460079 493558 629950 -290936 813650 1109278 807914
169 807914 56504 459656 284760 -640725 207869 1167569 -703577 509565 88916 -261074
158 1542919 728547 988863 963997 1142908 637276 -651202 290080 14851 -743191 99790
147 -493385 190366 -910199 1177971 -1375648 24396 1100346 851242 -436708 596237 -266239
136 188149 1031658 154849 205273 -431917 -48178 64200 -361530 111811 626626 -434492
125 662980 78023 1554379 -101679 -267304 458974 767463 484081 -562691 -185079 142870
114 299300 -116683 166213 48727 591723 1327231 619925 -650579 -522811 260318 106488
103 -33515 311857 650063 663150 231311 59569 1039315 78071 -1036770 405827 1350251
93 1350251 546195 568509 129513 295701 332866 840561 1332385 20946 1277188 908856
83 908856 585580 501410 575449 404753 57930 738181 293569 51197 -305859 -113028 282555
71 746749 -152512 496515 -52023 258063 500566 212639 479209 992052 -123263 445901
60 1387804 142955 504252 33038 4193 -124489 812811 419938 439738 -688876 -10642 1390025
48 241957 1298563 262114 738114 1088675 1073158 773993 188110 1342004 52635 -102140
37 659565 524759 1424707 -777551 211998 464269 -184065 -296847 629730 479574 1268939
27 1268939 657986 580025 566066 1470123 929830 630690 506144 583326 1073694 75166 -690911
15 1443491 701992 1271213 721715 1295035 374852 922574 289625 280806 167539 840194
5 840194 -89197 490787 665781 -474039 197596
##END=
