##TITLE=1199
##JCAMPDX= 6.0         $$ Bruker NMR JCAMP-DX V2.0
##DATA TYPE= NMR SPECTRUM
##DATA CLASS= XYDATA
##ORIGIN= NUTS EXPORT
##OWNER= Administrator
$$ 1.72 TOPSPIN		Version 2.1
$$ 2016-02-23 12:17:17.558 -0800  Administrator@X
$$ Compression mode = diff/dup
##.OBSERVE FREQUENCY= 90.275459
##.ACQUISITION MODE= SIMULTANEOUS (DQD)
##.ACQUISITION SCHEME= undefined
##.AVERAGES= 16
##.DIGITISER RES= 22
##SPECTROMETER/DATA SYSTEM= 
##.PULSE SEQUENCE= zg30
##.SOLVENT NAME= None
##.SHIFT REFERENCE= INTERNAL, None, 1, 14.36242
##AUDIT TRAIL= $$ (NUMBER, WHEN, WHO, WHERE, PROCESS, VERSION, WHAT)
$$ ##TITLE= Audit trail, TOPSPIN		Version 2.1
$$ ##JCAMPDX= 5.01
$$ ##ORIGIN= Bruker BioSpin GmbH
$$ ##OWNER= Administrator
$$ $$ E:/data/jwist/nmr/1199/3/pdata/1/auditp.txt
$$ ##AUDIT TRAIL=  $$ (NUMBER, WHEN, WHO, WHERE, PROCESS, VERSION, WHAT)
(   1,<2016-02-23 07:54:39.433 -0800>,<Administrator>,<X>,<jcamp>,<TOPSPIN 2.1>,
      <fromjdx created from
       E:\data\jwist\nmr\uniandes\1199
       data hash MD5: 8K
       B8 AF 6C 73 D7 B0 0D 09 7E C8 C6 78 87 54 33 29>)
$$ ##END=
$$ 
$$ $$ hash MD5
$$ $$ B7 22 85 73 2C 0D A1 76 27 BB 3E 4D 77 42 12 EB
##$RELAX= 
$$ Bruker specific parameters
$$ --------------------------
##$DU= <E:>
##$EXPNO= 1
##$NAME= <1199>
##$PROCNO= 1
##$TYPE= <nmr>
##$USER= <jwist>
##$ACQT0= 0
##$AMP= (0..31)
100 100 100 100 100 100 100 100 100 100 100 100 100 100 100 100 100 100
100 100 100 100 100 100 100 100 100 100 100 100 100 100
##$ANAVPT= 1
##$AQSEQ= 0
##$AQ_mod= 3
##$AUNM= <au_zg>
##$AUTOPOS= <>
##$BF1= 90.275459
##$BF2= 400.02
##$BF3= 400.02
##$BF4= 400.02
##$BF5= 400.02
##$BF6= 400.02
##$BF7= 400.02
##$BF8= 400.02
##$BYTORDA= 0
##$CFDGTYP= 0
##$CFRGTYP= 0
##$CHEMSTR= <none>
##$CNST= (0..63)
1 1 145 1 1 1 1 1 1 1 1 1 1 1 1 1 1 1 1 1 1 1 1 1 1 1 1 1 1 1 1 1 1 1 1
1 1 1 1 1 1 1 1 1 1 1 1 1 1 1 1 1 1 1 1 1 1 1 1 1 1 1 1 1
##$CPDPRG= <>
##$CPDPRG1= <>
##$CPDPRG2= <>
##$CPDPRG3= <>
##$CPDPRG4= <mlev>
##$CPDPRG5= <mlev>
##$CPDPRG6= <mlev>
##$CPDPRG7= <mlev>
##$CPDPRG8= <mlev>
##$CPDPRGB= <>
##$CPDPRGT= <>
##$D= (0..63)
0 1 0 0 0 0 0 0 0 0 0 0 0 0 0 0 0 0 0 0 0 0 0 0 0 0 0 0 0 0 0 0 0 0 0 0
0 0 0 0 0 0 0 0 0 0 0 0 0 0 0 0 0 0 0 0 0 0 0 0 0 0 0 0
##$DATE= 0
##$DBL= (0..7)
120 120 120 120 120 120 120 120
##$DBP= (0..7)
150 150 150 150 150 150 150 150
##$DBP07= 0
##$DBPNAM0= <>
##$DBPNAM1= <>
##$DBPNAM2= <>
##$DBPNAM3= <>
##$DBPNAM4= <>
##$DBPNAM5= <>
##$DBPNAM6= <>
##$DBPNAM7= <>
##$DBPOAL= (0..7)
0.5 0.5 0.5 0.5 0.5 0.5 0.5 0.5
##$DBPOFFS= (0..7)
0 0 0 0 0 0 0 0
##$DE= 6.5
##$DECBNUC= <off>
##$DECIM= 2432
##$DECNUC= <off>
##$DECSTAT= 4
##$DIGMOD= 1
##$DIGTYP= 12
##$DL= (0..7)
0 120 120 120 120 120 120 120
##$DP= (0..7)
150 150 150 150 150 150 150 150
##$DP07= 0
##$DPNAME0= <>
##$DPNAME1= <>
##$DPNAME2= <>
##$DPNAME3= <>
##$DPNAME4= <>
##$DPNAME5= <>
##$DPNAME6= <>
##$DPNAME7= <>
##$DPOAL= (0..7)
0.5 0.5 0.5 0.5 0.5 0.5 0.5 0.5
##$DPOFFS= (0..7)
0 0 0 0 0 0 0 0
##$DQDMODE= 0
##$DR= 22
##$DS= 2
##$DSLIST= <SSSSSSSSSSSSSSS>
$$ [...]
##$SPOFFS= (0..31)
0 0 0 0 0 0 0 0 0 0 0 0 0 0 0 0 0 0 0 0 0 0 0 0 0 0 0 0 0 0 0 0
##$SUBNAM0= <"">
##$SUBNAM1= <"">
##$SUBNAM2= <"">
##$SUBNAM3= <"">
##$SUBNAM4= <"">
##$SUBNAM5= <"">
##$SUBNAM6= <"">
##$SUBNAM7= <"">
##$SUBNAM8= <"">
##$SUBNAM9= <"">
##$SW= 20.5580556627758
##$SWIBOX= (0..15)
0 0 3 4 0 0 0 0 0 0 0 0 0 0 0 0
##$SW_h= 8223.68421052631
##$SWfinal= 0
##$TD= 65536
##$TD0= 1
##$TE= 300
##$TE2= 300
##$TE3= 300
##$TEG= 300
##$TL= (0..7)
0 120 120 120 120 120 120 120
##$TP= (0..7)
150 150 150 150 150 150 150 150
##$TP07= 0
##$TPNAME0= <>
##$TPNAME1= <>
##$TPNAME2= <>
##$TPNAME3= <>
##$TPNAME4= <>
##$TPNAME5= <>
##$TPNAME6= <>
##$TPNAME7= <>
##$TPOAL= (0..7)
0.5 0.5 0.5 0.5 0.5 0.5 0.5 0.5
##$TPOFFS= (0..7)
0 0 0 0 0 0 0 0
##$TUNHIN= 0
##$TUNHOUT= 0
##$TUNXOUT= 0
##$USERA1= <user>
##$USERA2= <user>
##$USERA3= <user>
##$USERA4= <user>
##$USERA5= <user>
##$V9= 5
##$VALIST= <valist>
##$VCLIST= <CCCCCCCCCCCCCCC>
##$VD= 0
##$VDLIST= <DDDDDDDDDDDDDDD>
##$VPLIST= <PPPPPPPPPPPPPPP>
##$VTLIST= <TTTTTTTTTTTTTTT>
##$WBST= 1024
##$WBSW= 4
##$XGAIN= (0..3)
0 0 0 0
##$XL= 0
##$YL= 0
##$YMAX_a= 1371480448
##$YMIN_a= -1701698.56
##$ZGOPTNS= <>
##$ZL1= 120
##$ZL2= 120
##$ZL3= 120
##$ZL4= 120
##$ABSF1= 10
##$ABSF2= 0
##$ABSG= 5
##$ABSL= 3
##$ALPHA= 0
##$AQORDER= 0
##$ASSFAC= 0
##$ASSFACI= 0
##$ASSFACX= 0
##$ASSWID= 0
##$AUNMP= <proc_1d>
##$AXLEFT= 0
##$AXNAME= <>
##$AXNUC= <off>
##$AXRIGHT= 0
##$AXTYPE= 0
##$AXUNIT= <>
##$AZFE= 0.1
##$AZFW= 0.1
##$BCFW= 1
##$BC_mod= 2
##$BYTORDP= 0
##$COROFFS= 0
##$CY= 15
##$DATMOD= 1
##$DC= 2
##$DFILT= <>
##$DTYPP= 0
##$F1P= 0
##$F2P= 0
##$FCOR= 0.5
##$FTSIZE= 0
##$FT_mod= 4
##$GAMMA= 1
##$GB= 0
##$INTBC= 1
##$INTSCL= 1
##$ISEN= 128
##$LB= 0.3
##$LEV0= 0
##$LPBIN= 0
##$MAXI= 10000
##$MC2= 0
##$MEAN= 0
##$ME_mod= 0
##$MI= 0
##$NCOEF= 0
##$NC_proc= -9
##$NLEV= 6
##$NOISF1= 0
##$NOISF2= 0
##$NSP= 1
##$NTH_PI= 0
##$NZP= 0
##$OFFSET= 14.36242
##$PC= 1
##$PHC0= 0
##$PHC1= 0
##$PH_mod= 0
##$PKNL= yes
##$PPARMOD= 0
##$PPDIAG= 0
##$PPIPTYP= 0
##$PPMPNUM= 2147483647
##$PPRESOL= 1
##$PSCAL= 4
##$PSIGN= 0
##$PYNMP= <proc.py>
##$REVERSE= no
##$SF= 90.274162444212
##$SI= 8192
##$SIGF1= 0
##$SIGF2= 0
##$SINO= 400
##$SIOLD= 32768
##$SPECTYP= <>
##$SREGLST= <1H.CDCl3>
##$SSB= 0
##$STSI= 0
##$STSR= 0
##$SW_p= 1497.18866228788
##$SYMM= 0
##$S_DEV= 0
##$TDeff= 0
##$TDoff= 0
##$TI= <>
##$TILT= no
##$TM1= 0
##$TM2= 0
##$TOPLEV= 0
##$USERP1= <user>
##$USERP2= <user>
##$USERP3= <user>
##$USERP4= <user>
##$USERP5= <user>
##$WDW= 1
##$XDIM= 8192
##$YMAX_p= 1371480064
##$YMIN_p= -1701376
##$CURPLOT= <PDFCreator>
##$CURPRIN= <$PDFCreator>
##$DFORMAT= <normdp>
##$LAYOUT= <+/1D_H.xwp>
##$LFORMAT= <normlp>
##$PFORMAT= <normpl>
##$SURQMSG= 1
$$ End of Bruker specific parameters
$$ ---------------------------------
##XUNITS= HZ
##YUNITS= ARBITRARY UNITS
##XFACTOR= 0.182762287876938
##YFACTOR= 1
##DELTAX= -0.182762287876938
##NPOINTS= 8192
##FIRSTX= 1497.0059
##FIRSTY= -1049088
##LASTX= 0
##MAXY= 1371480064
##MINY= -1701376
##XYDATA= (X++(Y..Y))
8191a049088A152000B53440a66400E15072f41536a24928k86720I0624f2976k19136
$$ -1049088 1152000 253440 -166400 515072 -641536 -124928 -411648 90624 -62976 -282112
8181b82112F14912B64704N2736a41312j68448A536512H4992b28352k38592A413120
$$ -282112 614912 264704 317440 -141312 -309760 1536512 84992 -228352 -466944 1413120
8170C87584J25952c75808C03104A36192d32128D96128a465344C44064J94048B15040
$$ 387584 513536 -375808 303104 136192 -432128 496128 -1465344 344064 538112 215040
8159B53440d09600D82816k11456b23744B2528a09056j94560A109504k30400m01408
$$ 253440 -409600 482816 271360 -223744 22528 -109056 -303616 1109504 879104 477696
8149D77696J3824g40864a30560n85728c6352D73088a84320E77536g7312D33664
$$ 477696 491520 -740864 -130560 -716288 -36352 473088 -184320 577536 -77312 433664
8138G94624Q8576a65376D17280k05312J98144j77664K7136J30048a006592c58400
$$ 794624 883200 -165376 417280 211968 410112 232448 259584 389632 -1006592 -358400
8127H03840N2736C63520b62656F52800O06720i59488E28384j98144j05472q6016
$$ 803840 856576 363520 -262656 652800 1259520 -959488 528384 330240 224768 138752
8117A38752f73280D13184h4480A51040D7104j5872e51936I3184g48544j00864
$$ 138752 -673280 413184 -84480 151040 47104 31232 -551936 93184 -748544 -849408
8107h49408A63840l9424Q44800A89440M52608m8640A44896f87616B04800a21856
$$ -849408 163840 124416 969216 189440 642048 593408 144896 -687616 204800 -121856
8096C83488J81248g19872I51808B55488J536A22880J8944a07520m74112A370112
$$ 383488 564736 -719872 951808 255488 257024 122880 141824 -107520 -581632 1370112
8085B41664K21184O82496a77664m53632E02784M8640c10784p1680a30048o11840
$$ 241664 462848 1145344 -177664 -631296 502784 551424 -310784 -382464 -130048 -741888
8075g41888f2464D65920j26976a54112A10592M40320M8128B30400M98688k94400
$$ -741888 -62464 465920 338944 -154112 110592 550912 599040 230400 729088 434688
8065D34688M54144D40320d0448j14688B82112q0896L42528j97632A54112K49344
$$ 434688 888832 440320 -40448 -155136 282112 201216 543744 346112 154112 403456
8055D03456c66592K048E33504J41824l28192J52576l8400a82272G82336c62496
$$ 403456 -366592 -364544 533504 675328 347136 499712 461312 -182272 782336 -362496
8044A97632g36256E74464j84320d7104D6080K03264Q3456J185280e66784F70208
$$ 197632 -736256 574464 390144 -47104 46080 249344 332800 1518080 -566784 670208
8033B7136L85536K97472l48160O99392a508352a57184E76512G680g76192B54464
$$ 27136 412672 710144 361984 1061376 -1508352 -157184 576512 7680 -776192 254464
8022G36768h0384k3552n66784b92352A084928B12992L56864A3824a98144A2800
$$ 736768 -80384 -103936 -670720 -292352 1084928 212992 569856 13824 -198144 12800
8011e23264F13888a74592g3728C03104K75968A53088a45408k03776a43872D0960
$$ -523264 613888 -174592 -73728 303104 579072 153088 -145408 -349184 -143872 40960
8000d89472D28544k00192O71232g36768B07872o1952J56672K72896L87072b54976
$$ -489472 428544 228352 899584 -736768 207872 145920 302592 575488 962560 -254976
7989A287168h75008A111552j95072k60608d85888A78176M12160i216j88416D16768
$$ 1287168 -875008 1111552 916480 655872 -485888 178176 590336 -9216 -197632 416768
7978C85536g37280J90976e2736B48832L3280I1648R54880j66912C87584h8064
$$ 385536 -737280 -546304 -52736 248832 282112 91648 1046528 879616 387584 -88064
7967C55328p4240c02080D0448@B30912e76000A325568f1440l57888D28544a09568
$$ 355328 281088 -302080 40448 0 230912 -576000 1325568 -61440 -419328 428544 -109568
7955A61792b51904B02752O21568g8336B34496I3696J56160a11616F35392G1168
$$ 161792 -251904 202752 824320 -78336 234496 93696 249856 -111616 635392 71168
7944A0240L2256j0240P76192C1744q704d28032D87936b43200n00224h192F58432
$$ 10240 42496 32256 808448 31744 23040 -428032 487936 -243200 -743424 -8192 658432
7932b33984r8816D31104M9152c5328D90496c28192E98016B5088d76160I08800
$$ -233984 -332800 431104 480256 -35328 490496 -328192 598016 25088 -476160 908800
7921C47136c46624A46944b25280l61472F84032E5808f20032p5264i8304A024J7408
$$ 347136 -346624 146944 -225280 -586752 684032 55808 -620032 -695296 -98304 1024 18432
7910A8432K67264N3248L8400c90656J14176E32992b92864A228800e91360J95584
$$ 18432 285696 338944 377344 -390656 -276480 532992 -292864 1228800 -591360 -395776
7900c95776D39808a82784I33888l61984K08384i80480F83520h0896F9632c98848
$$ -395776 439808 -182784 933888 571904 780288 -980480 683520 -80896 69632 -398848
7889d83328A17248f51264I60000f28224L03104H91904B70848c85024a42336F4512
$$ -483328 117248 -651264 960000 -628224 -325120 891904 270848 -385024 -142336 64512
7878c68128B41664K09920H4992h66816A48480L29728j44896K04800H2944a40800
$$ -368128 241664 451584 84992 -866816 148480 478208 333312 538112 82944 -140800
7867D08576j92512j3312a84832H4992N19680G8336L67616O33344m21376R14944
$$ 408576 216064 202752 -184832 84992 604672 78336 445952 1079296 657920 1572864
7857A572864o93760A16224Q42752m01408k56000e0176C36384L7376J3824C9424
$$ 1572864 879104 116224 958976 557568 301568 -50176 336384 373760 387584 39424
7846i53344a26976E66272k4064j55648F4512L14880d74624E50400a184768B65728
$$ -953344 -126976 566272 542208 386560 64512 379392 -474624 550400 -1184768 265728
7835a0752I1648L584K95936k4576p7312c45088o40000A025024B89280b82112j5360
$$ -10752 91648 95232 391168 366592 289280 -345088 -985088 1025024 289280 -282112 -297472
7824b97472E53472a25440N4784A306624B73920L39968L80416I6768K4064K8160
$$ -297472 553472 -125440 -70656 1306624 273920 613888 994304 96768 120832 148992
7814A48992G3216J72032O40000g3728C64032J66912A66912g53152c09760L6864
$$ 148992 73216 245248 885248 -73728 364032 530944 166912 -753152 -309760 -272896
7804b72896H89344i7280j81248J31072G42400A2288a234432E52448L36384f1440
$$ -272896 889344 -97280 -278528 -147456 742400 12288 -1234432 552448 888832 -61440
7793G8336f70208b67264n9392F47680a61792I7280b59072E05344M7104M06016
$$ 78336 -670208 -267264 -326656 647680 -161792 97280 -259072 505344 552448 958464
7783I58464D32640J76128j99680A29536Q8064p9872J76128j26464K66240g9872
$$ 958464 432640 608768 409088 129536 217600 137728 313856 187392 453632 -79872
7772G92576p8848O1952B39104N72928B84160O47168m09088b83648g680l68640
$$ 792576 713728 775680 239104 812032 284160 931328 522240 -283648 -7680 -376320
7762c76320C51744f48192C75296Q56576k82112i728l2256G7824e52448K63168
$$ -376320 351744 -648192 375296 1231872 949760 -9728 -41984 77824 -552448 -289280
7752b89280B62144A24416d82304D11136o4000b35520D58752d22912f2976I15968
$$ -289280 262144 124416 -482304 411136 347136 -235520 458752 -422912 -62976 915968
7741A694208E92896h2432F45120M86912A68960f63552A657344l00032e0176I33376
$$ 1694208 592896 -82432 645120 1132032 168960 -663552 1657344 1357312 -50176 933376
7730I11872f91200C44064N632a81760B84672d17792D43904c80416B98496R44128
$$ 911872 -691200 344064 349696 -181760 284672 -417792 443904 -380416 298496 1242624
7720A242624J05472b36032H44288M41856a04448k83136C31264H4992Q59648B26304
$$ 1242624 1348096 -236032 844288 1286144 -104448 -387584 331264 84992 944640 226304
7709A15712J128960q0896D15744j29024L66080O03136n60640O26688D14208I1136
$$ 115712 1244672 1163776 415744 286720 652800 1255936 695296 1321984 414208 91136
7698G12192e12l0208F45632a83808A10592E2736f66624a00352j11104B93376K57024
$$ 712192 -512 -30720 645632 -183808 110592 52736 -666624 -100352 -211456 293376 550400
7687E50400j79712P680P24992d42368Q6016J40288F44096e84704O9632B84672
$$ 550400 370688 378368 1103360 -442368 -356352 -216064 644096 -584704 -515072 284672
7676I77408E2736R95328E03808h8576l22048A038336D4032N06880P48544d66944
$$ 977408 52736 1048064 503808 -88576 -410624 1038336 44032 550912 1299456 -466944
7665G41888A94048c41504l68128B35520L99360B54976a088512C39968i58464f7072
$$ 741888 194048 -341504 -709632 235520 634880 254976 -1088512 339968 -958464 -67072
7654E50912a79712I96352m26496M33152m94592L01568N71904K42688l55840m92032
$$ 550912 -179712 996352 569856 1003008 508416 809984 1381888 1624576 1268736 776704
7644G76704l88096J82784C2256K5600b88256L2256I62560C05152O24128e79072
$$ 776704 388608 571392 32256 57856 -288256 -256000 962560 305152 929280 -579072
7633a17760A9968b96960B46272j9456J17248M56704j41312a2800A021952d00896
$$ -117760 19968 -296960 246272 226816 344064 800768 659456 -12800 1021952 -400896
7622B27328f45120D81280L70688A93024L3280K96960k54464e9392A493504G9360
$$ 227328 -645120 481280 851968 193024 226304 523264 268800 -59392 1493504 79360
7611B19136J04960J024000A1264c52256j6384G22944C39968N23264R7792B36032
$$ 219136 324096 1348096 11264 -352256 -368640 722944 339968 863232 961024 236032
7600C58912J0752K79040B93376a89440E18656K63168a04960B326016G48032k74944
$$ 358912 369664 648704 293376 -189440 518656 781824 -104960 2326016 748032 473088
7590D73088Q66304C99360e12000E5808j9456K63168L7376P1680M97152k19648
$$ 473088 1339392 399360 -512000 55808 36352 299520 336896 408576 905728 686080
7580F86080K61632k15040l25120c34848G4240N22752f51264D07552P168N38624
$$ 686080 947712 732672 407552 -334848 74240 596992 -651264 407552 414720 953344
7570I53344C79392a76640B93888a11616A273856m24960C46112a54624D36736e64736
$$ 953344 379392 -176640 293888 -111616 1273856 848896 346112 -154624 436736 -564736
7559B87744N85728J7408D20864J54112k51392L20000b19648D17280J109504o84544
$$ 287744 873472 890880 420864 574976 323584 643584 -219648 417280 1526784 842240
7549H42240o4512B21184R39008d30592B08896R95840l88096C90656c83488B88768
$$ 842240 777728 221184 1160192 -430592 208896 1204736 816640 390656 -383488 288768
7538E03296b44224E21728K65216a23904D38272f37952A66400M47488h2944B61120
$$ 503296 -244224 521728 786944 -123904 438272 -637952 166400 613888 -82944 261120
7527F35392c87584B08896P168C7888J491968e11488F28224B43200b14528D84352
$$ 635392 -387584 208896 216064 37888 1529856 -511488 628224 243200 -214528 484352
7516f8608H34048n1712l41504m8640P49056k59584a55136l68640A092096C01056
$$ -68608 834048 782336 440832 392192 1141248 881664 -155136 -523776 1092096 301056
7505G49568G4240a22880A80736O70208j92000c51744F36928F1952a340928G36768
$$ 749568 74240 -122880 180736 850944 658944 -351744 636928 61952 -1340928 736768
7494C26144b08896H76544l7376J14688j76640A94048P6288a41824F25664a20832
$$ 326144 -208896 876544 839168 953856 777216 194048 270336 -141824 625664 -120832
7483B27328J65376l0208O65600C84000M30080l60448R7792b21696A11616d43904
$$ 227328 392704 362496 1028096 384000 814080 453632 551424 -221696 111616 -443904
7472E50400f4512E80096N2736J74080C31264J79200a35680d4544I38496D04992
$$ 550400 -64512 580096 632832 806912 331264 510464 -135680 -44544 938496 404992
7461C11808a21856j16736n16608F50240m608j87392K01216B64704M36224B40128
$$ 311808 -121856 -238592 -755200 650240 645632 458240 659456 264704 700928 240128
7450C53792B6624J479168B17600p4752J150464B6112b8160A069056m02944J688576
$$ 353792 26624 1505792 217600 142848 1293312 26112 -28160 1069056 666112 2354688
7440B354688B68800K46272R47712m02432F3488J3312K70848K57024J03424b87744
$$ 2354688 268800 515072 1462784 1060352 63488 76800 347648 604672 708096 -287744
7429C98336J56160q2944L11808L44576B03264N9904L09248B27328N5808G8336
$$ 398336 554496 471552 783360 1127936 203264 263168 572416 227328 283136 78336
7418B06336Q15104m6592C06176K63680B36032K04800K65216N01248a85856D64896
$$ 206336 1021440 974848 306176 569856 236032 440832 706048 1207296 -185856 464896
7407I4720Q2944P86944k85184b2016C94240j11104H1920L71712J99680b05824
$$ 94720 177664 964608 679424 -22016 394240 283136 81920 453632 653312 -205824
7396A93024o3488J71008K88768A82272Q46336n09952b86208I71776b72896G43424
$$ 193024 129536 300544 589312 182272 1028608 518656 -286208 971776 -272896 743424
7385G02976B63168b51904B25792J11616d96640A96096J87904Q60672C14368d03456
$$ 702976 263168 -251904 225792 337408 -496640 196096 384000 1244672 314368 -403456
7374i67168A345536m60288C02592M95616d01408B29888e16608A83808M63360A95584
$$ -967168 1345536 885248 302592 798208 -401408 229888 -516608 183808 647168 195584
7363a10080C20000f7584A368576l45088l55328P68512E02784L92704j00352H2944
$$ -110080 320000 -67584 1368576 1023488 668160 1436672 502784 895488 795136 82944
7352A565184m25984D63360K91328K42688m39296B23744r3696N19168Q39680c48672
$$ 1565184 1139200 463360 754688 997376 558080 223744 130048 649216 1488896 -348672
7341a71520N120P6800G29600M48000L33312e632G50080P54176j17760E63712a82272
$$ -171520 -166400 -89600 729600 1177600 1510912 -5632 750080 1504256 1386496 563712 -182272
7329a043968G66464p680i2160D45952R80480C7888R60512a37728j10592H82688
$$ -1043968 766464 758784 -92160 445952 1426432 37888 998400 -137728 -248320 882688
7318A46432M93568M75648m96128a4336m42880g1168E19680A72544a35168F13376
$$ 146432 640000 1115648 619520 -14336 -457216 -71168 519680 172544 -135168 613376
7307C57888A04960L46112d72576l5328B80576a07520C52768Q4480r2160O7072
$$ 357888 104960 451072 -472576 -507904 280576 -107520 352768 437248 345088 412160
7297D12160c24096A010176h13568H28928M46976c584E86240L97824a22368A117184
$$ 412160 -324096 1010176 -813568 828928 1275904 -3584 586240 984064 -122368 1117184
7286A358336G7312d34176J17760j07008A056256m97664R08288a0240D76160Q16128
$$ 1358336 77312 -434176 -316416 -423424 1056256 558592 1466880 -10240 476160 1292288
7276A292288D34688a03936A316864o12352c72224H4480R04704e02784C12320J10080
$$ 1292288 434688 -103936 1316864 704512 -372224 84480 989184 -502784 312320 422400
7266D22400j16736b23232F24640M57728O71744p12192B10432a54624r216A65376
$$ 422400 305664 -223232 624640 1082368 1754112 1041920 210432 -154624 -163840 165376
7255A229824D92032f144C53280M04480c53792B30400L62496O4000K44736k38592
$$ 1229824 492032 -6144 353280 757760 -353792 230400 592896 656896 901632 663040
7245F63040j61280o1952R7280j43872K30912p9872l9424L13856J85856k91328
$$ 663040 501760 439808 537088 393216 624128 544256 504832 818688 1004544 713216
7235G13216k02752N25824Q7040N2224d096A562112B20160N34016d9152A497600
$$ 713216 510464 1036288 1123328 1175552 -4096 1562112 220160 754176 -49152 1497600
7224E96992L89632c98848F31296a95072P5264B15040a88928E2736p168h6528F24128
$$ 596992 986624 -398848 631296 -195072 -119808 215040 -188928 52736 45568 -86528 624128
7212e20704F03136J111040q20736e61152n40672N2224F83520k57536N98528J47456
$$ -520704 603136 1714176 893440 -561152 -1101824 -1049600 683520 425984 1024512 1171968
7202A171968a21344H08960R9328D49024J6384I728L16928M39296m8640l48672
$$ 1171968 -121344 808960 908288 449024 465408 9728 326656 765952 717312 368640
7192C68640K54976B51392J74080A22368a99680C92704Q17152l02592k42688c90144
$$ 368640 623616 251392 425472 122368 -199680 392704 1209856 907264 664576 -390144
7181C50720L63008J48992A67424N38112A0240P99232B87232J28512j13664j29024
$$ 350720 713728 862720 167424 705536 10240 809472 287232 415744 302080 173056
7171A73056K15040K60096Q65280D80256f17984H79616B95936c28192D1472P35232
$$ 173056 388096 648192 1513472 480256 -617984 879616 295936 -328192 41472 776704
7161G76704P56224o46144f7072A081856D32128a8944G65952p0144r6768d3520
$$ 776704 1532928 886784 -67072 1081856 432128 -18944 765952 695808 599040 -43520
7150D71040h22272H49408I7280c31264G39840C14368R3184e4272A077248N18144
$$ 471040 -822272 849408 97280 -331264 739840 314368 407552 -54272 1077248 1595392
7140A595392e71904D32640L32288B02752Q43264h1408E31456Q9088j85856M4544
$$ 1595392 -571904 432640 764928 202752 1046016 -81408 531456 620544 434688 479232
7130D79232e14048C14368P49568e17632A76640Q78592B44224L07200J71008B26304
$$ 479232 -514048 314368 1063936 -517632 176640 1055232 244224 551424 722432 226304
7119e57568F33344j22880k49344L68128J34656g6288A37216J101312c16416E55008
$$ -557568 633344 510464 261120 629248 763904 -76288 137216 1238528 -316416 555008
7108E17632L52768F9632N05856K89792R43104c10272B74432P0144J47456J98144
$$ 517632 870400 69632 575488 865280 1808384 -310272 274432 344576 492032 690176
7098F90176B00192N38624Q62208A72032O30784k22720K73920K70848J92512l28704
$$ 690176 200192 738816 1601024 172032 802816 580096 854016 1124864 1317376 988672
7088I88672f17472D89472l7376A41312J338880c4816A529344C41504Q00768d80256
$$ 988672 -617472 489472 452096 141312 1480192 -34816 1529344 341504 1142272 -480256
7077A161728j24416E06880b03264D64384h0384A197568G5776J190400o656A38240
$$ 1161728 1037312 506880 -203264 464384 -80384 1197568 75776 1266176 1259520 138240
7066B99008J357824a40800C58400P39840l62496a87904k40128C00544C584g4752
$$ 299008 1656832 -140800 358400 1098240 735744 -187904 -428032 300544 3584 -74752
7055H49408a1264E92384O69696m02432R4720d76672C04640J31584N92384D27008
$$ 849408 -11264 592384 1262080 859648 954368 -476672 304640 436224 1028608 427008
7044A43872O14912j1264d9152q19712A180160H0384Q32000J71008C94752P71584
$$ 143872 758784 747520 -49152 -868864 1180160 80384 912384 1083392 394752 1166336
7034A166336n30944K39616K69824A60256M8128c1744F45120f51776F96320b63680
$$ 1166336 635392 875008 1144832 160256 208384 -31744 645120 -651776 696320 -263680
7023C15392O50240k30400B41152d86400D12672j86368M70528j6384l00032N50912
$$ 315392 965632 735232 241152 -486400 412672 226304 696832 680448 380416 931328
7013I31328o8608F3488J010176m4544A07008O73792o144l64032j03936n120a1776
$$ 931328 862720 63488 1073664 1029120 107008 780800 774656 410624 306688 301568 -11776
7001A500160r3184B09408R29792A20832R09824A43872K80064k560r0624K69312
$$ 1500160 1406976 209408 1139200 120832 1030656 143872 423936 421376 330752 600064
6991F00064e7856F16960B91328O25152n8880E120J278464B5600K72384L15904
$$ 600064 -57856 616960 291328 916480 857600 5120 1283584 25600 297984 613888
6981F13888B30912K61632j73056L73248b95936p2704B19648J681920B10944J99168
$$ 613888 230912 492544 319488 692736 -295936 -368640 219648 1901568 210944 410112
6971D10112m1984j71520N36576k82112K45760M64384K06336n60640H3456J341440
$$ 410112 368128 196608 733184 451072 696832 1161216 1367552 806912 83456 1424896
6961A424896C93728O24128b15040B48320K07360a43872B09920i7280C87072j00864
$$ 1424896 393728 1017856 -215040 248320 455680 -143872 209920 -97280 387072 286208
6951B86208a52064A30048L53280M17280J97632E30432A72032J362944I6768O79424
$$ 286208 -152064 130048 483328 900608 1098240 530432 172032 1534976 96768 776192
6941G76192A59232i4720D15232G5776L34336A93024P59808j38752J63840k68288
$$ 776192 159232 -94720 415232 75776 410112 193024 952832 814080 977920 709632
6931G09632J004544a1776C3280J39264J44384M19328k6112C03104d7104r5744
$$ 709632 1714176 -11776 33280 172544 316928 736256 710144 303104 -47104 -142848
6921a42848A025024l13856q6016p4240R1136N90336C55328K2016r6256O24128
$$ -142848 1025024 711168 625152 550912 642048 1232384 355328 377344 281088 905216
6911I05216j83296p2192c31776B15040o9120g6800E90336O42048n01248K15040
$$ 905216 721920 649728 -331776 215040 145920 -76800 590336 1232384 731136 946176
6901I46176a32096G89504q6016J0240l8912a99680K8160D97664N48352l26144
$$ 946176 -132096 789504 703488 713728 674816 -199680 -171520 497664 1046016 719872
6891G19872C21024M6080j13152J74592m9152q9600J095168k86720l64032j01888
$$ 719872 321024 367104 253952 428544 379392 289792 1384960 1098240 734208 632320
6881F32320M77696k04288j4336J34144m93568K22720P94112J34656i0112j13152
$$ 632320 1110016 905728 891392 1025536 531968 754688 1548800 1683456 -90112 -203264
6871b03264c3792B21184c86560a50016G14240k19136J735168A011200A69984d0960
$$ -203264 -33792 221184 -386560 -150016 714240 495104 2230272 1011200 169984 -40960
6860I04704j80224k06848Q62208C11296R40544n70368j86880k29888K85696I728
$$ 904704 724480 517632 1379840 311296 1251840 681472 494592 264704 550400 9728
6849H42752L01056j02912c81440C58400K75456C12320L03616B89280D0448g6288
$$ 842752 1143808 1040896 -381440 358400 633856 312320 615936 289280 40448 -76288
6838A69984N25312k49856o3488d50048C47136j16736b76480C25120J381376F15424
$$ 169984 695296 445440 381952 -450048 347136 230400 -276480 325120 1706496 615424
6827I06752L20512E67808M03456c17440J7920e0176I43104m29056J39776P49568
$$ 906752 1227264 567808 971264 -317440 -299520 -50176 943104 514048 653824 1403392
6817A403392F44608N66272E82144A80224Q19200P42912D98688j42848O71744m99200
$$ 1403392 644608 1210880 582144 180224 999424 1742336 498688 355840 1027584 528384
6807E28384K99520O38464D81792j58720L69664N8368r6256J18272k01216M096
$$ 528384 827904 1466368 481792 323072 692736 751104 654848 773120 571904 576000
6797E76000J013760n81120b51392I09824K21696L51232B99008K24768M16768C27680
$$ 576000 1589760 1008640 -251392 909824 1131520 1482752 299008 523776 940544 327680
6786I54880A37728M97152d9664I23136A85344N8368L9936L15904A31584C0720
$$ 954880 137728 634880 -49664 923136 185344 243712 283648 599552 131584 30720
6775A03424J162752n41184h6016E61152j46944a09568A191936l83488c8912j21856
$$ 103424 1266176 724992 -86016 561152 414208 -109568 1191936 808448 -38912 -160768
6765a60768E21216O17984n43232p168a6896G18848K16064o3488a89440F64064
$$ -160768 521216 1139200 595968 588800 -16896 718848 934912 871424 -189440 664064
6754G56736l9424k60096P03488l03104B67264O45120C00544A36192N37088a28000
$$ 756736 717312 457216 1160704 857600 267264 912384 300544 136192 673280 -128000
6743H37120o4000K7648A48480N72416P42400r6256C94240K3552L35360H8576N90336
$$ 837120 773120 800768 148480 720896 1463296 1367040 394240 417792 753152 88576 678912
6732F78912d02944A508352D31104Q23296m92032N38624E67808j4336L88608j30560
$$ 678912 -402944 1508352 431104 1254400 762368 1300992 567808 553472 942080 811520
6722H11520a08032C95264P72096c78368J23904A132544b92864G5776L68128R58464
$$ 811520 -108032 395264 1167360 -378368 -254464 1132544 -292864 75776 443904 1402368
6712A402368Q4992B37568L06688b51392B57024P00928G6800P41376K22720q2432
$$ 1402368 1487360 237568 544256 -251392 257024 957952 76800 818176 1040896 958464
6702I58464K16064k20160C70176a83808A252864j46944M37760m14720O30784E25824
$$ 958464 1174528 954368 370176 -183808 1252864 1105920 1543680 1128960 1759744 525824
6691E28896j77152L43040J16736a29536C37920L47136B62144P20384B88256a78176
$$ 528896 351744 694784 811520 -129536 337920 685056 262144 982528 288256 -178176
6680F81984j29024j77664R47712i1648E79072J38752k20160O47168l75296C54816
$$ 681984 552960 375296 1323008 -91648 579072 717824 497664 1144832 769536 354816
6669i1648G95136N1712C67104P66976m98688J013248A86880f656F53312B04800
$$ -91648 795136 846848 367104 1134080 635392 1648640 186880 -6656 653312 204800
6658C07200N4272A73568J328128D17792K0992J093120C16928O59456l28704E7344
$$ 307200 361472 173568 1501696 417792 438784 1531904 316928 976384 647680 57344
6647A7408J66912N96992C74784K31424M54144P36768H44800J10080J59744m64384
$$ 17408 184320 781312 374784 606208 1060352 1797120 844800 954880 1114624 650240
6637F50240J27488A05472L11296J342976b64192C65056Q70912A07008N27360j09056
$$ 650240 777728 105472 416768 1759744 -264192 365056 1235968 107008 634368 525312
6627E25312A04960J28000l072J016320j55648j60256m3520R80480p78240J35168
$$ 525312 104960 232960 229888 1246208 1090560 930304 886784 1867264 1089024 1224192
6617A224192E27872B38592J085440C18976i0112D50048r4208f04672A488384Q2432
$$ 1224192 527872 238592 1324032 318976 -90112 450048 355840 -604672 1488384 1570816
6607A570816D35712N44256I728J339392K09920F35392Q49920k58048L82464m95616
$$ 1570816 435712 979968 9728 1349120 1559040 635392 1485312 1227264 1609728 1114112
6597A114112D46464A06496L36384P12192l00032M19328o4512l12832r8304M10112
$$ 1114112 446464 106496 442880 1155072 855040 1274368 1209856 897024 798720 1208832
6587A208832B08896L75296L54304C84512P47520E07392K048l5328N55520k71360
$$ 1208832 208896 584192 938496 384512 1132032 507392 509440 474112 1029632 758272
6577G58272M29056B62656g1168A177600J16736M27520B89792M41344K07360M47488
$$ 758272 1187328 262656 -71168 1177600 1294336 1721856 289792 731136 938496 1385984
6567A385984F06720j62304J13664B00704Q0896N69856k87744J13664P94624o80448
$$ 1385984 606720 444416 558080 200704 281600 851456 563712 677376 1472000 791552
6557G91552A13664P31648K20160D66432N25312j81760J205760p90016c20512A029632
$$ 791552 113664 845312 1065472 466432 991744 809984 2015744 1225728 -320512 1029632
6546F61504a1264A473536m22400K7136M54656m12160J82784j45408D21888L86560
$$ 661504 -11264 1473536 1051136 1078272 1532928 1120768 1303552 1158144 421888 808448
6536H08448a56160A143296k26304D14208G7312Q54528k41152L31264m53120L56864
$$ 808448 -156160 1143296 916992 414208 77312 931840 690688 1021952 568832 925696
6526I25696D41344c19488A295360B97472N50400B10432J249792l36384A77152
$$ 925696 441344 -319488 1295360 297472 847872 210432 1460224 1123840 177152
6516H56576j86368K73920d8128B69312J015296J4848l55328B7648M19840L95776
$$ 856576 670208 944128 -48128 269312 1284608 1299456 944128 27648 447488 843264
6506H43264A76640a92512A78176J042944C21024Q27904C52768O23104M25472n27872
$$ 843264 176640 -192512 178176 1221120 321024 1148928 352768 975872 1401344 873472
6496H73472Q8064N1712O96832G40352c74784D47488P60832B37568J86368O35904
$$ 873472 961536 1013248 1710080 740352 -374784 447488 1208320 237568 423936 1059840
6486A059840Q4992A58720L57376P5776A58208M20864Q25344I3184J199616E42208
$$ 1059840 1144832 158720 516096 591872 158208 579072 1404416 93184 1292800 542208
6475A637888k31424F13888N53984D52608K19648k4576a94048E62176L89120l43552
$$ 1637888 1406464 613888 1167872 452608 672256 647680 -194048 562176 951296 607744
6465F07744O23616k80576n5296k0992R1136L51744p8848j81248C50208R83040
$$ 607744 1231360 950784 895488 874496 965632 1317376 1238528 1057280 350208 1333248
6455A333248K59072p06560n4272J11104l26144j65376b32960H34560j98144l2768
$$ 1333248 1592320 885760 831488 942592 616448 451072 -232960 834560 636416 603648
6445F03648b12480A57184J96608Q75520k41664j39776Q18176N61664H78592k44736
$$ 603648 -212480 157184 353792 1229312 987648 847872 1666048 2227712 878592 633856
6435F33856a41312H17664j00864R9840k03264Q82176I6768O91712k7136O72768
$$ 633856 -141312 817664 716800 816640 613376 1495552 96768 788480 761344 1434112
6425A434112p14240n7344P4240l29728J033216l49696k20672D22912J157632b71872
$$ 1434112 719872 662528 736768 407040 1440256 1090560 869888 422912 1580544 -271872
6414F40000k57024j28512M88960j52064j77664Q25344A82784a82784A545216j54112
$$ 640000 382976 254464 743424 591360 413696 1239040 182784 -182784 1545216 1391104
6404A391104B90816P34720m36736N1200e11488I91744m66944N32992j31072M49024
$$ 1391104 290816 1025536 588800 640000 -511488 991744 524800 1057792 926720 1375744
6394A375744M97152G92576P90016p61344C71200O45632B16064L82976Q98560E47328
$$ 1375744 1872896 792576 1582592 821248 371200 1016832 216064 599040 1497600 547328
6383A134080d8128G75168j42848O44096L1232J90976l45600K74432L3792o10304
$$ 1134080 -48128 775168 632320 1276416 1307648 1498624 1153024 1427456 1461248 850944
6373H50944R33888m34176j85856K46272o9120m14720O13888j00864l072k01728
$$ 850944 1784832 1350656 1164800 1411072 1341952 927232 1541120 1440256 1437184 1235456
6363A235456M99200o51776B49856m9664N18656I7792J090048l75808l11296M07552
$$ 1235456 1734656 1082880 249856 200192 718848 97792 1187840 812032 500736 908288
6353I08288J011200D97664L56864A24416O98368K22720n3760A57184K87232N45792
$$ 908288 1919488 497664 854528 124416 822784 1045504 991744 157184 444416 990208
6343I90208K84672E61664N00736B09408K99008J21344a13152I67680k78528K9696
$$ 990208 1274880 561664 1062400 209408 508416 629760 -113152 967680 689152 718848
6333G18848P95136o93248d4032A000448J93024l14880o2464K91840L77856j11616
$$ 718848 1513984 820736 -44032 1000448 1193472 878592 816128 1107968 1485824 1374208
6323A374208m84864m22912Q5504J73056J068544m97152B27328L16416J03936Q08960
$$ 1374208 889344 466432 551936 724992 1793536 1296384 227328 543744 647680 1456640
6313A456640o35904C94752A76640L89120J00352M37760k32448l76832J319424
$$ 1456640 820736 394752 176640 565760 666112 1103872 871424 494592 1814016
6304A814016o59968B53952O65088L73760n00224J320960E47328j50528N69344
$$ 1814016 1154048 253952 919040 1292800 792576 2113536 547328 396800 966144
6295I66144l16928B83136J29024A39264J300992C08224J095168F32832O35904
$$ 966144 649216 283136 412160 139264 1440256 308224 1403392 632832 1268736
6286A268736D66944K94912E12N20704M42368l33824Q0896L04640j45408B48320
$$ 1268736 466944 761856 512 521216 963584 629760 710656 1015296 869888 248320
6275A754112D66432J44896M6592Q46848l42016C56352O14400J128960C4304P58272
$$ 1754112 466432 611328 657920 1504768 1162752 356352 970752 2099712 34304 792576
6265G92576k29888J78688M10112R216Q704j42848L84512l64032a4336m89472A782784
$$ 792576 562688 741376 1151488 1160704 1169408 1026560 1411072 1047040 -14336 -503808 1782784
6253F60480N68320n81632p4240P2192a8944A111552E45280K29376M62336C94240
$$ 660480 1228800 647168 572928 645120 -18944 1111552 545280 774656 1236992 394240
6242B048O09792N8368q1408L74272O91200p08096M74112m04480D77696J49504
$$ 2048 611840 670208 588800 963072 1654272 946176 1420288 1015808 477696 627200
6232F27200M89472C09248Q23296K44736C73248O3488M0960M34176K73920D87424
$$ 627200 1116672 309248 1132544 1377280 373248 436736 477696 911872 1185792 487424
6221A116160m15232l40992N04320B91840P56736j03936m66944O55360B41664R57952
$$ 1116160 700928 359936 864256 291840 1048576 944640 477696 1133056 241664 1199616
6211A199616c89632B08896J038848D90496c03104A354240n25312q0896O32320
$$ 1199616 -389632 208896 1247744 490496 -303104 1354240 828928 748032 1380352
6202A380352F64064B7136J060864K84160b35520A601536n80096M99200F92736
$$ 1380352 664064 27136 1088000 1372160 -235520 1601536 1021440 1520640 692736
6192A279488o00064P4240J50016M79232E55008J81248O27200k67264N70368n82656
$$ 1279488 679424 753664 903680 1382912 555008 736256 1363456 1096192 1666560 1083904
6182A083904N03808p90016M02432l18464a81760A804288G41888J075200n63712
$$ 1083904 1587712 797696 1200128 881664 -181760 1804288 741888 1817088 1253376
6173A253376N84192n65248k35520m5056L77856o47680j94048K78528M51584E86752
$$ 1253376 1837568 1272320 1036800 991744 1369600 721920 527872 806400 1257984 586752
6162F48704J318400F00576J03424B66240N71904J017856l98848k22720D46976
$$ 648704 1967104 600576 704000 266240 838144 1856000 1457152 1234432 446976
6152A161728D27520L27680L17952B52928J238528n71904B04800J021440k77504
$$ 1161728 427520 755200 1073152 252928 1491456 919552 204800 1226240 948736
6143I48736L1744l34848J25952M5056J054208C93728P29088j38752M61824F44096
$$ 948736 980480 645632 771584 816640 1870848 393728 1122816 984064 1445888 644096
6132B162176E53984N88800k90816L59424n09952a81760A591808l61472D21376
$$ 2162176 553984 1142784 851968 1211392 701440 -181760 1591808 1230336 421376
6122D63872e8368I63072J48480l61984K55488N47328j67936E45792B08384M67456
$$ 463872 -58368 963072 1111552 749568 1005056 1552384 1384448 545792 208384 675840
6112F75840o2976Q79104e03296A584640C95264J205760p90016l01056l5328r7792
$$ 675840 612864 1491968 -503296 1584640 395264 1601024 811008 509952 474624 376832
6102C76832R4208P76192m3520E84192P59296E31456P63392E11488J678336A38240
$$ 376832 471040 1247232 1203712 584192 1343488 531456 1294848 511488 2189824 138240
6091D88960J061888M83328D25984A32608N34528P01440l77344L0208k77504P23968
$$ 488960 1550848 2034176 425984 132608 667136 1368576 991232 1021440 743936 1467904
6081A467904l4304M0448o16960O84032E06880a02912D40832J070080n07904D16768
$$ 1467904 1433600 1474048 857088 1541120 506880 -102912 440832 1510912 1003008 416768
6070f64064H70400j64864L27680n06368M2496P23968P34208m09088B12992J381376
$$ -664064 870400 705536 1033216 526848 569344 1293312 2027520 1618432 212992 1594368
6060A594368E30432L51744C77856K03776L26656B33472J380864G29600k8672L45088
$$ 1594368 530432 882176 377856 581632 908288 233472 1614336 729600 700928 1046016
6050A046016L08224k63680N632R85600n20704E53472Q30464k72896L60448n60640
$$ 1046016 1354240 1090560 1096192 2081792 1561088 553472 1383936 1111040 1471488 910848
6040I10848A5360K25280N73952K78016J19808n57056R88160D46464M51584E0688
$$ 910848 15360 240640 814592 1092608 1212416 655360 1643520 446464 898048 50688
6029A895424H04352P38304q6016B9184J469952n95456O09280n46304j90464J367552
$$ 1895424 804352 1542656 1456640 29184 1499136 903680 1512960 966656 776192 2143744
6019B143744p70048m34176R74848m46976D87424J78176j58208J086976G21408
$$ 2143744 1373696 939520 1914368 1467392 487424 665600 507392 1594368 721408
6009A74592K62656N64736J44896N5808C34848L89632L11808R49760n13024K65216
$$ 174592 437248 1001984 1146880 1202688 334848 724480 1036288 1986048 1473024 1738240
5999A738240J20320m50560B75456Q56064J62816k53440D78208J259008n48864
$$ 1738240 1858560 1408000 275456 1131520 1294336 1040896 478208 1737216 1188352
5990A188352m36224N70880o51264K66240G5776J841152E76000K78528j53600g5776
$$ 1188352 752128 1323008 671744 937984 75776 1916928 576000 854528 700928 -75776
5979A606656q00256g0656A166336k2528j10592O73280F87616m5056j75616Q11520
$$ 1606656 806400 -70656 1166336 1143808 1033216 1706496 687616 642560 466944 1278464
5969A278464l07712j96608N66272A07008J175552P4752j00352P2192K93376G47008
$$ 1278464 970752 774144 1340416 107008 1282560 1357312 1256960 1329152 1622528 747008
5958A592320M37760q87808M04992j76128m04992D71040M06528O23616k54976l08224
$$ 1592320 2030080 1142272 1547264 1371136 966144 471040 877568 1501184 1246208 937984
5948I37984P09120G46496j6896O37440D00384J056256C08736L61984k74432L19488
$$ 937984 1647104 746496 729600 1367040 400384 1456640 308736 670720 396288 715776
5938G15776Q1920M21888l93728N09440N49376o29248j97632o0928D03968J195520
$$ 715776 797696 1219584 825856 1335296 1884672 1255424 1057792 996864 403968 1599488
5928A599488o08768K97984o15424k91328J313792m21376Q15616q03328p3216m97664
$$ 1599488 990720 1288704 673280 381952 1695744 1274368 2089984 1286656 1213440 715776
5918G15776M11648k74944k96960Q68864m57728L96800A15200Q25344J83296L82976
$$ 715776 1127424 852480 555520 1424384 966656 1363456 115200 940544 1123840 1506816
5908A506816j97632K29376M89984q78592Q28928b0992H42752P76704F35392L27168
$$ 1506816 1309184 1538560 2028544 1149952 1978880 -20992 842752 1619456 635392 962560
5898I62560J211392p06048o58432n3760J673728G75168r4720r2672j2288Q4480
$$ 962560 2173952 1467904 809472 755712 2429440 775168 680448 587776 575488 659968
5888F59968J98144r8816J16736J123328p81312m71552C37408O90688m83840R12384
$$ 659968 858112 759296 876032 1999360 1218048 746496 337408 1028096 544256 1456640
5878A456640F67648R31328E30432p5776K51904L7376O87104K63680m84864Q22272
$$ 1456640 667648 1598976 530432 454656 706560 743936 1431040 1694720 1209856 2032128
5868B032128o01088l83488o8608o7072j37728J81248M24448D40320K87744L22048
$$ 2032128 1431040 1047552 978944 911872 774144 955392 1379840 440320 728064 1050112
5858A050112J48480m97664j76640J378304r0624l03104k40640N35040l07712Q8064
$$ 1050112 1198592 700928 524288 1902592 1811968 1508864 1268224 1803264 1495552 1583616
5848A583616F83520O35904C16928J503744O28224j107456M02432L71200I41056
$$ 1583616 683520 1319424 316928 1820672 2448896 1341440 1743872 2115072 941056
5838F51776M5568P2192J381376I98912J10080B68800M51584e12G58272C21536
$$ 651776 697344 769536 2150912 998912 1108992 268800 720384 -512 758272 321536
5827A278976F37440k24256J027584J75104n88800b3552F73280O19008j96608O50752
$$ 1278976 637440 413184 1440768 1615872 1027072 -23552 673280 1292288 1095680 1746432
5817A746432o79936K77504n43744P87456E90848N44768O77376E40672m3008M37760
$$ 1746432 1066496 1344000 800256 1587712 590848 1135616 1812992 540672 497664 935424
5807I35424j68960M42368l90144J757184A174528k37056J12640k08384M78720
$$ 935424 766464 1208832 818688 2575872 1174528 937472 1050112 841728 1320448
5798A320448Q07424E20192J082368m97664N54496p68512O6048J38752R85600q57600
$$ 1320448 2127872 520192 1602560 1104896 1659392 890880 956928 1095680 2081280 1223680
5788A223680K03776o44096O80448D76672K048J62304P99232K09408k75456F80960
$$ 1223680 1427456 783360 1463808 476672 478720 641024 1440256 1649664 1374208 680960
5777H00256P85408j05984A40800J014784q5504j82272Q04352G93088N74464L29216
$$ 800256 1585664 1479680 140800 1155584 1070080 887808 1692160 793088 1367552 1696768
5767A696768q43776C39456K36544O11840j69984J057792k63168l96800O656O2976
$$ 1696768 852992 339456 576000 1187840 1017856 2075648 1812480 1415680 1422336 1485312
5757A485312j78176L09760C63520J177088m49536j22880L3280m84352J518592
$$ 1485312 1307136 1616896 363520 1540608 1091072 968192 1001472 517120 2035712
5748B035712Q20224C7888O83008J222144l09248n73952P04000j00352n35040k62144
$$ 2035712 2855936 37888 720896 1943040 1633792 1059840 1763840 1663488 1128448 866304
5738H66304M11136l45600L94752B67264J124352C5840R02144O06208k39104O26688
$$ 866304 1277440 931840 1326592 267264 1391616 35840 937984 1544192 1305088 1931776
5728A931776H98048l31264n3760J569280j032704J34656L21536B26304J071104
$$ 1931776 898048 566784 513024 2082304 1049600 1184256 1505792 226304 1297408
5719A297408n38624L61984D38272J09056O87104K53952m9664k80064O59456p65440
$$ 1297408 758784 1120768 438272 547328 1234432 1488384 1438720 1158656 1818112 1052672
5709A052672N06368L76320j14176m11136E83680J857024I60512N31456p13728
$$ 1052672 1559040 1935360 1821184 1410048 583680 2440704 960512 1491968 778240
5700G78240R57952k82624l94752R5232j65888l99360J318912D92544R85600O93760
$$ 778240 1736192 1453568 1058816 1154048 988160 588800 1907712 492544 1478144 2171904
5690B171904M4544j009664M09600b16064G42400J06496Q20736l99872k12992N77024
$$ 2171904 2216448 1206784 1616384 -216064 742400 848896 1669632 1269760 1056768 1633792
5680A633792l38944L15904m32640R55392j047040j09568J705984F63552J421312
$$ 1633792 1294848 1610752 1178112 2133504 1086464 976896 2682880 663552 2084864
5671B084864p99232E36064R75360K47808j25440j57696L44576F10816J826816
$$ 2084864 1285632 536064 1511424 1759232 1633792 1476096 1820672 610816 2437632
5662B437632m34688o05696F44096M26496L6864m41344J157632N1200o15936J103872
$$ 2437632 2002944 1397248 644096 1070592 1107456 666112 1823744 1874944 1259008 2362880
5652B362880l23584D75136R92768J56160J044992A007104J140224p27040L32288
$$ 2362880 2039296 475136 1467904 1624064 2669056 1007104 2147328 1420288 1752576
5643A752576Q52480n59104n80608K8672j98144j49504J258496K22720l2768F42560
$$ 1752576 2605056 2045952 1465344 1494016 1295872 1146368 2404864 2627584 2594816 642560
5632B006528q03840P10144K41664p34208O03136p20896F19520M58752M78720n81632
$$ 2006528 1202688 1912832 2154496 1420288 2023424 1302528 619520 1078272 1556992 975360
5622I75360L6352L26144K31424C57376Q14080N89312l63520K16064l18976n61664
$$ 975360 1011712 1337856 1569280 357376 1171456 1760768 1397248 1613312 1294336 732672
5612G32672j62304M09088j30048R3184M24448M53632D06528P20384L81952G20896
$$ 732672 570368 979456 849408 942592 1367040 1820672 406528 1126912 1508864 720896
5601D28032J098240P37280A58208J868288m97664m56704m096L14368K2016l99360
$$ 428032 1526272 2263552 158208 2026496 1528832 1072128 1068032 1382400 1404416 1005056
5591A005056R89184D56192J212416F51264K9696J499136I61024J295360J87904
$$ 1005056 1994240 456192 1668608 651264 680960 2180096 961024 2256384 2444288
5582B444288I92768K37056k51904M70016n8368l81952Q35584N00224A053184l5840
$$ 2444288 992768 1229824 977920 1447936 1389568 1007616 1843200 2343424 1053184 1017344
5572A017344J52064M59264D01920J133056l3280k04800J362944j316352O94272
$$ 1017344 1169408 1628672 401920 1534976 1501696 1296896 2659840 1343488 2037760
5563B037760p27040l48672K36032P79264r40032M08576M52608p72608N40160K64704
$$ 2037760 1310720 962048 1198080 1977344 1037312 1445888 1898496 1125888 1666048 1930752
5553A930752r18528N66272j55136J94048n66784J264128j29536j016320C59936
$$ 1930752 1012224 1578496 1423360 1617408 1050624 2314752 2185216 1168896 359936
5543G15776J152512m77184K44224m52096P82848r24672M83328L25632p52640L81440
$$ 715776 1868288 1391104 1635328 1183232 1966080 1041408 1524736 1850368 1097728 1479168
5533A479168Q71424k89792o2464K39616F15936J12128J034240k80064L43552k560
$$ 1479168 2350592 2060800 1998336 2237952 615936 728064 1762304 1482240 1825792 1823232
5523A823232K75968H30976J054208O56896r27232J60256K33472N55520j126400
$$ 1823232 2099200 830976 1885184 2542080 1614848 1775104 2008576 2564096 1437696
5514A437696J98656L53280p34720J003008A122816O63040k93376m85376O15936
$$ 1437696 1636352 1989632 1254912 2257920 1122816 1785856 1492480 1007104 1623040
5505A623040Q48896k54464o40512o05696O4512N17632L34336L33824J19296p53152
$$ 1623040 2471936 2217472 1576960 971264 1035776 1553408 1887744 2221568 2340864 1587712
5495A587712O28736j24928j35168j48992l56864J442816A200128L59936L52256
$$ 1587712 2216448 2091520 1956352 1807360 1450496 2893312 1200128 1560064 1912320
5486A912320Q16640j2288M58752q42752k73920k03776J65376O44096k73920A185792
$$ 1912320 2728960 2716672 3175424 2332672 2058752 1854976 2020352 2664448 2390528 1185792
5475A943552N7344j0240K90816q32000J04448o1952q4480N15584k50368L64032
$$ 1943552 2000896 1990656 2281472 1449472 1553920 1491968 1407488 1923072 1672704 2036736
5465B036736J62816q91392J159168K95424j018368O8096l55840O64576j008128
$$ 2036736 2199552 1308160 2467328 2762752 1744384 1812480 1456640 2121216 1113088
5456A113088J381888m30080p67488l4304O63552j06496J9968o36928J39264M93568
$$ 1113088 2494976 2064896 1297408 1263104 1926656 1820160 1840128 1203200 1342464 1836032
5446A836032k54976k05312m60288M04992o5536K0480l26144l93216P28576M6592
$$ 1836032 1581056 1375744 915456 1320448 1254912 1275392 949248 556032 1284608 1331200
5436A331200P18848q77568N27872n87776r8304L91168m59264m48512J654272H48384
$$ 1331200 2050048 1172480 1700352 1112576 1014272 1405440 946176 497664 2151936 848384
5425A194496n41184P71584r2160F58432M39808k23744j29536J212928I24160Q09984
$$ 1194496 653312 1424896 1332736 658432 1098240 874496 744960 1957888 924160 1734144
5415A734144L45600k54464j17760m42368O25152k81088k15552N0688m10624J272320
$$ 1734144 2079744 1825280 1707520 1265152 1890304 1609216 1393664 1444352 1033728 2306048
5405B306048j090048N37600l77344P93600H70400K65728N82656K08384l20512
$$ 2306048 1216000 1753600 1376256 2169856 870400 1136128 1718784 1927168 1606656
5396A606656F09280P21920N38624o47168P63392l072q17152N94944G65952M88960
$$ 1606656 609280 1331200 1869824 1222656 1986048 1982976 1165824 1760768 765952 1254912
5386A254912P93600F66112J491456n26848l15392P70560p63904a3312A811968
$$ 1254912 2048512 666112 2157568 1630720 1315328 2085888 1321984 -13312 1811968
5376B424832r17504N57568D91008K264576j010688E95456J408000p05536M17280
$$ 2424832 1507328 2064896 491008 2755584 1744896 595456 2003456 1297920 1715200
5367A715200m27008k46272Q77568o7072L07712M60800j089024Q59136A046016
$$ 1715200 1288192 1041920 1919488 1852416 2160128 2620928 1531904 2391040 1046016
5357A403392K6624M25984P71584o29248J27488r46176K24768J89440N90848p52128
$$ 1403392 1430016 1856000 2627584 1998336 2125824 1179648 1404416 1593856 2184704 1432576
5347A432576P2192O11328m69504J049600r60000K98496K49344A141760Q96000
$$ 1432576 1504768 2116096 1646592 2696192 1736192 2034688 2284032 1141760 2037760
5338B037760K37056n34016H56064Q07424F42560N10976r3184O22080K048l92704
$$ 2037760 2274816 1740800 856064 1663488 642560 1153536 1060352 1682432 1684480 1291776
5328A291776p680K02752O01088P4240p91552m40832J605632A006592L55840R51808
$$ 1291776 1284096 1486848 2087936 2162176 1370624 929792 2535424 1006592 1362432 2314240
5318B314240A133056P4240Q91904p85408K33984L5840j62304j20320K39616K20672
$$ 2314240 1133056 1207296 2099200 1313792 1547776 1583616 1421312 1300992 1540608 1761280
5308A761280M00384q77568P23456p2192m48512Q58112p65440O5536F09792R03168
$$ 1761280 2161664 1284096 2007552 1935360 1486848 2344960 1579520 1645056 609792 1512960
5298A512960K69824n56544l95776J080320H15616k38080J70496O76864J036288
$$ 1512960 1782784 1226240 830464 1910784 815616 577536 748032 1424896 2461184
5289B461184J1264m28544j76128N16608A159168K47296L04640j38240M00896P6800
$$ 2461184 2472448 2043904 1867776 2384384 1159168 1406464 1711104 1572864 1973760 2050560
5279B050560j45920N08928j031168N85728m23424K73920k85184j83808Q09984
$$ 2050560 1904640 2413568 1382400 1968128 1544704 1818624 1533440 1349632 2159616
5270B159616I95328N27360n19680J490944R0624j016832m9152j26976N56032m5568
$$ 2159616 995328 1522688 1003008 2493952 2584576 1567744 1518592 1391616 1947648 1902080
5260A902080l09248J549824A523712K1504o05184J050112r08288J533440p60320
$$ 1902080 1592832 3142656 1523712 1545216 940032 1990144 1081856 2615296 1854976
5251A854976M85888j93024o81984L69152L6864J10592j44384O11840K70336A327104
$$ 1854976 2340864 2147840 1465856 1835008 1871872 1982464 1838080 2449920 2720256 1327104
5240A479680M7104R15968n8368q01280Q64256K89280K2528M56192n1712N82656
$$ 1479680 1526784 2442752 2384384 1583104 2447360 2736640 2759168 3215360 3163648 3746304
5230C746304L98336k78016N50912r34400m70016r85600L86560j153024P02464
$$ 3746304 4144640 3866624 4417536 3483136 3013120 2027520 2414080 1261056 1963520
5221A963520R06752A222656J75616J378816p97184K22208k90304m06016R22624
$$ 1963520 2870272 1222656 1398272 2777088 1979904 2202112 1911808 1505792 2428416
5212B428416n63200j99680k4064Q24832A143296O83520o94784Q74496r08288j95584
$$ 2428416 1865216 1665536 1641472 2466304 1143296 1826816 1132032 2006528 1098240 902656
5202I02656Q57088L09248B51392K349568J38240A076736L87584J29024F61504
$$ 902656 1759744 2068992 251392 2600960 2739200 1076736 1464320 1593344 661504
5192A230848O59456P37280q24320n36576K80064P88480O41536A157632Q35072
$$ 1230848 1890304 2627584 1803264 1266688 1546752 2335232 2976768 1157632 1992704
5183A992704n52960N58592j66400j60768P32160m5568j001984j25952L42016M5056
$$ 1992704 1439744 1998336 1831936 1671168 2403328 2357760 1355776 1229824 1571840 1616896
5173A616896K74432O66624o77888H76032K29888J188864n78048J297408A02400
$$ 1616896 1891328 2557952 1880064 876032 1105920 2294784 1716736 3014144 102400
5163A268736M22400L76320k85696N37600l00032A003520R10336p04512J196032
$$ 1268736 1691136 2067456 1781760 2319360 2019328 1003520 1913856 1209344 2405376
5154B405376q21248j99680j98656R0624K56000F34880J686016n35552l05152P57760
$$ 2405376 1584128 1384448 1185792 1276416 1532416 634880 2320896 1785344 1480192 2237952
5144B237952R93792A315328M32128O53824o99392k2528M20352j3824l72736M88960
$$ 2237952 3231744 1315328 1747456 2401280 1701888 1679360 2099712 2085888 1713152 2202112
5134B202112o8608P7824m60288Q16640N38624j521152N15072J037824r13408n01248
$$ 2202112 2133504 2211328 1751040 2567680 3106304 1585152 2100224 3138048 2224640 1723392
5124A723392M06016n62688R44640m14208k92864J025536A248768J001472o83008
$$ 1723392 2129408 1566720 2511360 2097152 1804288 2829824 1248768 2250240 1567232
5115A567232J74080K11456R3184m4032n08416N02784Q47360m92032m83840P70560
$$ 1567232 1741312 1952768 2045952 2001920 1493504 1996288 2843648 2351616 1867776 2638336
5105B638336A112064P34208j47456L48672r49248J40288R25184q03840J093632
$$ 2638336 1112064 1846272 1698816 2047488 1098240 1238528 2163712 1359872 2453504
5096B453504k21184o62016P86432n48864J080320m75648n7856O34880l32288m96128
$$ 2453504 2232320 1570304 2356736 1807872 2888192 2412544 2354688 2989568 2657280 2161152
5086B161152P93088A233920J569280N63200o86592o64064K89280k72896N88288
$$ 2161152 2954240 1233920 2803200 3366400 2679808 2015744 2305024 2032128 2620416
5077B620416k04800o66624J395712p51104P30112j350656J82784O42048o72256
$$ 2620416 2415616 1748992 3144704 2393600 3123712 1773056 1955840 2597888 1925632
5068A925632j6384R53344j00352A379328P74144o46144M80256m99712L41504k31936
$$ 1925632 1909248 2862592 2762240 1379328 2153472 1507328 1987584 1487872 1829376 1597440
5058A597440J153536p46496M21376P16288A262592J286656N3248J19808l75808
$$ 1597440 2750976 2004480 2425856 3142144 1262592 2549248 2602496 2722304 2346496
5049B346496l24096K85696J65888M71552r13408l79904O05184m00384L27168k69312
$$ 2346496 2022400 2308096 2473984 2945536 2032128 1652224 2257408 1857024 2184192 1914880
5039A914880R60512j137664J480192o28224K5088M5568l82464L36384m27008N72928
$$ 1914880 2875392 1737728 3217920 2589696 2614784 2660352 2277888 2614272 2187264 2760192
5029B760192m53632r86112O87616n76000J664512j124352J139712r01120O73280
$$ 2760192 2306560 1320448 2008064 1432064 3096576 1972224 3111936 2210816 2884096
5020B884096o90176j72544K24768J04448k17600J124352A177600J253888K22720
$$ 2884096 2193920 2021376 2246144 2350592 2132992 3257344 1177600 2431488 2654208
5011B654208l94240L64032p10144J73568J20832K30912j064960J513472p02976
$$ 2654208 2259968 2624000 1913856 2087424 2208256 2439168 1374208 2887680 2184704
5002B184704Q77568l22048j52064o11840R14432p28064N42208p47520J47456M10624
$$ 2184704 3062272 2740224 2588160 1976320 2890752 2162688 2704896 1957376 2104832 2515456
4992B515456j48992M60288O41024M37760l34336j08032O90176n70880J087488
$$ 2515456 2366464 2826752 3467776 3905536 3571200 3463168 4153344 3582464 4669952
4983D669952K02240q80128M31104J683456l07712K16064L42016k57536P6800j217536
$$ 4669952 4872192 3992064 4423168 6106624 5798912 6014976 6356992 6099456 6176256 4958720
4973D958720p95136j045504K43200p64416J6384M15744r13408P65952N23264j542656
$$ 4958720 4163584 3118080 3361280 2596864 2613248 3028992 2115584 2881536 3404800 1862144
4963A862144j81760N15072p07072j4336O19008J69984P4752k19136N54496M37760
$$ 1862144 1680384 2195456 1488384 1474048 2093056 2263040 2337792 2118656 2673152 3110912
4953C110912o27200N31456k46272J56160l1744l56352K01216j37216A267712J280000
$$ 3110912 2483712 3015168 2768896 2925056 2893312 2536960 2738176 2600960 1267712 2547712
4943B547712m13696m52608Q9088M53120o25152P99744N45792n78560K90816J74080
$$ 2547712 2134016 1681408 1770496 2223616 1598464 2398208 2944000 2365440 2656256 2830336
4933B830336p71584M24448J39264j156608J172480r34400O97344n75488O97344
$$ 2830336 2058752 2483200 2622464 1465856 2638336 1703936 2401280 1825792 2523136
4924B523136k13504P78752j395712N23264o67136R64608J72032p60832k12480
$$ 2523136 2309632 3088384 1692672 2215936 1548800 2513408 2685440 1924608 1712128
4915A712128J299968k42688l80928m97152L23584L96800r67168N75488K03264
$$ 1712128 3012096 2769408 2388480 1891328 2214912 2611712 1644544 2220032 2423296
4906B423296J85344m70016Q99584K77504j631232Q00256n89824j84832N82144
$$ 2423296 2608640 2138624 3038208 3315712 1684480 2484736 1894912 1710080 2292224
4897B292224R0112p65440R25184o49728N12000m99712Q85760K41664j079808O50752
$$ 2292224 2382336 1616896 2542080 1892352 2404352 1904640 2790400 3032064 1952256 2603008
4887B603008m00384l69152J232896r95840K21696K28864m73088j48992q55552
$$ 2603008 2202624 1833472 3066368 2070528 2292224 2521088 2048000 1899008 1043456
4878A043456K539008j176064r98912J851904n51424j041408O7584l072Q65280
$$ 1043456 3582464 2406400 1407488 3259392 2707968 1666560 1734144 1731072 2596352
4869B596352j231360Q99072o6048N98016L50720j328128P56736n05344K71872
$$ 2596352 1364992 2264064 2198016 2796032 3146752 1818624 2575360 2070016 2341888
4860B341888m29056N5808l29728R31840M11136j295360M80256Q4480J216000A517568
$$ 2341888 1912832 1968640 1638912 2570752 2981888 1686528 2166784 2251264 3467264 1517568
4849C023872K85184k48832N58080A084416J514496k18112n76512M73088O87104
$$ 3023872 3309056 3060224 3618304 1084416 2598912 2380800 1804288 2277376 2964480
4840B964480o49216M02944Q6016n32992L19488P3216l39968k70848O52288J262080
$$ 2964480 2315264 2718208 2804224 2271232 2590720 2663936 2323968 2053120 2705408 3967488
4830C967488j071104J2288o26176O47168m32128J68448Q20736j568768L24096
$$ 3967488 2896384 2908672 2282496 2929664 2497536 2665984 3486720 1917952 2242048
4821B242048O10816l27168J28000m40832l04640O27712R64096n62688j21856J135104
$$ 2242048 2852864 2525696 2653696 2212864 1908224 2535936 3500032 2937344 2815488 3950592
4811C950592o99392o11328m90496J665536l45600j356800J209856o7072k67776
$$ 3950592 3251200 2639872 2149376 3814912 3469312 2112512 3322368 3255296 2987520
4802B987520p18848R40544o26688K18624l92192J292288r44128k63168K78528
$$ 2987520 2268672 3209216 2582528 2801152 2408960 3701248 2757120 2493952 2772480
4793B772480L39456k05312J171456j251840r728J21856p9360L95264m72576j37216
$$ 2772480 3111936 2906624 4078080 2826240 2816512 2938368 2859008 3254272 2781696 2644480
4783B644480J195008r53344m34688P08608j093632K47808R20576r3184j69984
$$ 2644480 3839488 2886144 2451456 3160064 2066432 2314240 3234816 3141632 2971648
4774B971648N41696A396736J142784j34144K36544Q85760j178112N88288p09120
$$ 2971648 3513344 1396736 2539520 2405376 2641920 3527680 2349568 2937856 2228736
4765B228736J472512o92736q192l2256M17792A336320P06560M74624K60608N81632
$$ 2228736 3701248 3008512 3000320 2968064 3385856 1336320 2042880 2517504 2778112 3359744
4755C359744j201664o38976J122304o65600R03168J12640N39136j168896n3248
$$ 3359744 2158080 1519104 2641408 1975808 2878976 2991616 3530752 2361856 2308608
4746B308608M43392J7920k08896o38464Q18176m43904J460736n19680q60672K75968
$$ 2308608 2752000 2769920 2561024 1922560 2740736 2296832 3757568 3237888 2377216 2653184
4736B653184R51808m3520l74272r72288L71200M15744K99520r01120N4272P94112
$$ 2653184 3604992 3561472 3187200 2214912 2586112 3001856 3301376 2400256 2454528 3248640
4726C248640L6352m38784P69024k46784R58976m52608l6352o07744J615360j738752
$$ 3248640 3284992 2846208 3615232 3368448 4327424 3874816 3838464 3230720 4846080 3107328
4716C107328Q10496m0960r91232R45664K11456k20672R20576N76512k65728k06848
$$ 3107328 3917824 3876864 2885632 3831296 4042752 3822080 4742656 5319168 5053440 4846592
4706D846592j487872q11008R86624K2016J23904n27360M0960J093120j113600
$$ 4846592 3358720 2547712 3534336 3556352 3680256 3152896 3193856 4286976 3173376
4697C173376j74592k3040K06848l80928O15936L82976l82464O03648r01632J316352
$$ 3173376 2998784 2975744 3182592 2801664 3417600 3800576 3418112 4021760 3120128 4436480
4687D436480j111552O48192m61824J230336n87776L14368j11616p72096O56896
$$ 4436480 3324928 3973120 3511296 4741632 4153856 4468224 4356608 3584512 4241408
4678D241408r40544R71264J304576j770496J60768M77696q55040J052160o77376
$$ 4241408 3300864 4272128 5576704 3806208 3966976 4444672 3589632 4641792 3964416
4669C964416j38240L04128k11456M44416j44384j089536J069056j579520J820672
$$ 3964416 3826176 4130304 3918848 4363264 4218880 3129344 4198400 2618880 4439552
4660D439552n29920k96448K26304p90528N81632j676288J556992o54848k82112
$$ 4439552 3909632 3613184 3839488 3048960 3630592 1954304 3511296 2856448 2574336
4651B574336M09600n74976Q33024O45632q10496j6384p76192j5360J011712J419264
$$ 2574336 2983936 2408960 3241984 3887616 3077120 3060736 2284544 2269184 3280896 4700160
4641D700160k073600Q08448M9664p06048J662464j548288J203200r02144M24448
$$ 4700160 2626560 3435008 3484672 2778624 4441088 2892800 4096000 3193856 3618304
4632C618304j71008m84352N38624Q23808n53984P1680l90656M1472J33632j51040
$$ 3618304 3447296 2962944 3501568 4325376 3771392 3843072 3452416 3493888 3627520 3476480
4622C476480m31104k15552o75840Q9600O19520O86080P26528j437184o2464N33504
$$ 3476480 3045376 2829824 2153984 2243584 2863104 3549184 4275712 2838528 2776064 3309568
4612C309568l18464o77376J252352j51552L48672J09056j056768N58080l26144
$$ 3309568 2991104 2313728 3566080 3414528 3763200 3872256 2815488 3373568 3047424
4603C047424L92192m32640p70560J131520J98656K12480n63712o656K90816l3280
$$ 3047424 3439616 3006976 2236416 3367936 3566592 3779072 3215360 3208704 3499520 3466240
4593C466240l77344J042944o54848P2192J035264q89344N5808J09056N29920k86208
$$ 3466240 3088896 4131840 3476992 3549184 4584448 3695104 3750912 3859968 4389888 4103680
4583D103680k95424K560N81632M55168n50400r30816J05984r58464J843712l05664
$$ 4103680 3808256 3810816 4392448 4847616 4297216 3366400 3472384 2513920 4357632 4051968
4573D051968J064960j271808j093120J230848m2496k46784l05664J53088L16928
$$ 4051968 5116928 3845120 2752000 3982848 3940352 3693568 3387904 3540992 3857920
4564C857920j90976J076224p15776l58400r7280L70688j491456J303552j87392
$$ 3857920 3666944 4743168 4027392 3668992 3571712 3942400 2450944 3754496 3567104
4555C567104j008640L83488k86208L12320K94912M45952K62656k54976j828864
$$ 3567104 2558464 2941952 2655744 2968064 3262976 3708928 3971584 3716608 1887744
4546A887744J831936q6528m16768L49184p75168M2496L66080j222144M48512J274880
$$ 1887744 3719680 3633152 3216384 3565568 2790400 2832896 3198976 1976832 2425344 3700224
4536C700224k85696L50208r7792j66912p42400M34176l87072N02784m69504Q24832
$$ 3700224 3414528 3764736 3666944 3500032 2757632 3191808 2804736 3307520 2838016 3662848
4526C662848j47456J032704l87584J98144M02432j065984m18816%J038848p02976
$$ 3662848 3515392 4548096 4160512 4358656 4761088 3695104 3276288 3276288 4315136 3612160
4516C612160K32448m77696J007104n18144N03296j058816L52256N79584n97504
$$ 3612160 3844608 3366912 4374016 3855872 4359168 3300352 3652608 4232192 3634688
4507C634688P1168q22272Q12032j68960J2800Q704j65376O33856j204224K5600
$$ 3634688 3705856 2883584 3695616 3526656 3539456 3548160 3382784 4016640 2812416 2838016
4497B838016J2288M29056J024j30560L80928p99744Q87296L80416N55008j038336
$$ 2838016 2850304 3279360 3280384 3149824 3530752 2731008 3618304 3998720 4553728 3515392
4487C515392l55328m86912P77728m46464O25152M61824o38976M0448K76480L66080
$$ 3515392 3160064 2673152 3450880 3004416 3629568 4091392 3452416 3492864 3769344 4135424
4477D135424L584L26144o46144L90656r22624P36256o49216J183744j531392K422272
$$ 4135424 4139008 4465152 3819008 4209664 3287040 4023296 3374080 4557824 3026432 5448704
4467E448704p82848N5808q52480O2464Q24832l3280j92512q00256N98016n21728
$$ 5448704 4665856 4721664 3869184 3931648 4756480 4723200 4530688 3730432 4328448 3806720
4457C806720n9904O33344j434112P24480n22752J277440j112064j4336J011200
$$ 3806720 3746816 4380160 2946048 3670528 3147776 4425216 3313152 3298816 4310016
4448D310016j167360J5872J442304j231360n51936R728J572352j202688P13728
$$ 4310016 3142656 3158528 4600832 3369472 2817536 2827264 4399616 3196928 3910656
4439C910656p11680k0992q37120J467904j100800J094656o28736Q64256A983488
$$ 3910656 3198976 3177984 2340864 3808768 2707968 3802624 3173888 4038144 1983488
4429D056576m6080m16768O4512r05728K060800r08288P43424l07200n96480M85376
$$ 4056576 4010496 3593728 3658240 2752512 4813312 3905024 4648448 4341248 3744768 4230144
4419D230144o57920K71872J38752P84896N4784n26336N26848m28032o58432Q48384
$$ 4230144 3572224 3844096 3982848 4767744 4822528 4296192 4823040 4395008 3736576 4584960
4409D584960j16736Q12544j499648M20864M29056n77024Q76032r23136R45152
$$ 4584960 4468224 5280768 3781120 4201984 4631040 4054016 4930048 4006912 4952064
4400D952064j019904j93536Q18688k24256J107968j085440j92000N47328k51904
$$ 4952064 3932160 3738624 4557312 4333056 5441024 4355584 4163584 4710912 4459008
4391D459008j015296J960960m81280P01952j178624M16256q46848N86752k13504
$$ 4459008 3443712 5404672 4923392 5625344 4446720 4862976 4016128 4602880 4389376
4382D389376J86368p49568P50080J31072o22592L71712L99360Q14080r98400O50240
$$ 4389376 4575744 3826176 4576256 4707328 4084736 4456448 4855808 5669888 4671488 5321728
4372E321728O5536J99680J89440r46688M7616J927168j311744K78528J190912
$$ 5321728 5387264 5586944 5776384 4829696 4877312 6804480 5492736 5771264 6962176
4363F962176j86368j112064l14368M46464K47808O32832o87104k41664l52768
$$ 6962176 6775808 5663744 5349376 5795840 6043648 6676480 5989376 5747712 5394944
4354E394944k53952J087488k57024n53472k82624n78560N63200O1952o0416J03424
$$ 5394944 5140992 6228480 5971456 5417984 5135360 4556800 5120000 5181952 5121536 5224960
4344E224960L85536Q0896L70688n82656j15712o76864o59968Q50432J92000j226752
$$ 5224960 5610496 5691392 6062080 5479424 5363712 4686848 4026880 4877312 5069312 3842560
4334C842560m84352M78208m5568r05216Q89856J10592l74272Q73984j04960n01248
$$ 3842560 3358208 3836416 3790848 2885632 3775488 3886080 3511808 4385792 4280832 3779584
4324C779584M20864k06848l44576n84192R9840P24480k53952j51040k4064O00576
$$ 3779584 4200448 3993600 3649024 3064832 3164672 3889152 3635200 3484160 3460096 4060672
4314D060672r7280k2528M91520j217536J459200P9872n94944K01728j87392K80064
$$ 4060672 3963392 3940864 4432384 3214848 4674048 4753920 4158976 4360704 4173312 4453376
4304D453376k44736l33312m31104P32672m22400k34496J13664l01568M84352q56576
$$ 4453376 4208640 3875328 3444224 4176896 3754496 3520000 3633664 3332096 3816448 2959872
4294B959872J363968j46432k86208P38304N8368j080320Q69888l75808N9904m45952
$$ 2959872 4323840 4177408 3891200 4629504 4687872 3607552 4477440 4101632 4161536 3715584
4284C715584L91680M44928J77664k19136L10784p00928j20320K47808J85344l17440
$$ 3715584 4107264 4552192 4729856 4510720 4821504 4120576 4000256 4248064 4433408 4115968
4274D115968l10784k68288Q20224R2160P20896r44128q28416P89504j87904N2736
$$ 4115968 3805184 3536896 4357120 4449280 5170176 4226048 3397632 4187136 3999232 4051968
4264D051968o85568N08928K560J091584q7040q51456P28576M54656j100800P49568
$$ 4051968 3366400 3875328 3877888 4969472 4882432 4030976 4759552 5214208 4113408 4862976
4254D862976L71712j303040O15936N75488l88096m7616r7280l11296R6768j71520
$$ 4862976 5234688 3931648 4547584 5123072 4734976 4687360 4590080 4278784 4375552 4204032
4244D204032Q87808n6320M21376r99424Q33024L52768p29088j52064n7344M17792
$$ 4204032 5091840 5035520 5456896 4457472 5290496 5643264 4914176 4762112 4704768 5122560
4234E122560j50016Q18176j044992J189376n93920j129472J296896o89152M67968
$$ 5122560 4972544 5790720 4745728 5935104 5341184 4211712 5508608 4819456 5287424
4225E287424P11680q94464j67936o26688l04128K79552n85728n8368L69152k57536
$$ 5287424 5999104 5104640 4936704 4310016 4005888 4285440 3699712 3641344 4010496 3752960
4215C752960J393664n79584j376256J253888M07552O27200j357312M35712J12128
$$ 3752960 5146624 4567040 3190784 4444672 4852224 5479424 4122112 4557824 4669952
4206D669952j67424L72736l08224J44896m68480P62368k67776m43904P07072r96864
$$ 4669952 4502528 4875264 4567040 4711936 4243456 5005824 4738048 4294144 5001216 4004352
4196D004352j42336O77376o74304N90848N19168l15904M41856P23456r65632J19808
$$ 4004352 3862016 4539392 3865088 4455936 4975104 4659200 5101056 5824512 4858880 4978688
4186D978688L03616j606656J636352o03648L46624j94048r58464O19008R54880
$$ 4978688 5282304 3675648 5312000 4708352 5054976 4860928 3902464 4521472 5476352
4177E476352r95840J106432l49696l7376k0480O58432P1680l07200K57024q63232
$$ 5476352 4480512 5586944 5237248 5199872 5179392 5837824 5909504 5602304 5859328 4996096
4167D996096L40480j047552P87456J85856O67136L49696q75008J364480o03648
$$ 4996096 5336576 4289024 5076480 5262336 5929472 6279168 5404160 6768640 6164992
4158F164992J0752q65792O27712o04672p9360o3488O26688n88800n98016J046016
$$ 6164992 6175744 5309952 5937664 5332992 5253632 5190144 5816832 5228032 4630016 5676032
4148E676032m8128p88992J166336j77152p94624J308160r52832j070592R77920
$$ 5676032 5627904 4838912 6005248 5828096 5033472 6341632 5388800 4318208 5296128
4139E296128p87456o31808J026560l78368l8912L94240l33824K43200O88128l90144
$$ 5296128 4508672 3876864 4903424 4525056 4486144 4880384 4546560 4789760 5477888 5087744
4129E087744l67104J267200j097216p2704J417216o39488J13664K27328j80224
$$ 5087744 4720640 5987840 4890624 4817920 6235136 5595648 5709312 5936640 5756416
4120E756416J027072p88480K3552K49856J216512n30432o77376J098752j75104
$$ 5756416 6783488 5995008 6018560 6268416 7484928 6954496 6277120 7375872 7200768
4111G200768O09792l87072k31424m78208J298432R7280O6560l07200K47296k94400
$$ 7200768 7810560 7423488 7192064 6713856 8012288 8109568 8176128 7868928 8116224 7821824
4101G821824O38464n55008J124864J90464k87232N109248m754944p04512L76320
$$ 7821824 8460288 7905280 9030144 9220608 8933376 14042624 9287680 8583168 8959488
4092H959488J157120m69504P99744J71520r23136Q55040P20896p5776J75104M38784
$$ 8959488 10116608 9647104 10446848 10618368 9695232 10550272 11271168 11195392 11370496 11809280
4082A1809280L74784O26688K02240m74112J246208L83488Q63744n29920J511424
$$ 11809280 12184064 12810752 13012992 12538880 13785088 14168576 15032320 14502400 16013824
4073A6013824k30400j62304J77664r216L00544m4544J540608p15776Q91392N69344
$$ 16013824 15783424 15621120 15798784 15789568 16090112 16045568 17586176 16870400 17761792 18331136
4063A8331136j68960O08256N59616J268224J216512J090048J871872J150464P45472
$$ 18331136 18162176 18770432 19330048 20598272 21814784 22904832 24776704 25927168 26672640
4054B6672640p51104n68832l799040l061248k883072k933248k194432j399808
$$ 26672640 25921536 25352704 21553664 18492416 15609344 12676096 10481664 9081856
4046I081856n06368n48352n95456j037824o36928k19136R65120p60320J12640
$$ 9081856 8575488 8027136 7431680 6393856 5756928 5537792 6502912 5742592 5855232
4037E855232q3968L81952l89632p40864N68832O80960j36192k81088J68448o14912
$$ 5855232 5771264 6153216 5763584 5022720 5591552 6272512 6136320 5855232 6023680 5408768
4027E408768K8160n05856O60992L53280j6384P7824j031168P82848j82272M45440
$$ 5408768 5436928 4931072 5592064 5945344 5928960 6006784 4975616 5758464 5576192 6021632
4017F021632n78048J082880j604608Q87808j338880J378304J02912j012736L59424
$$ 6021632 5443584 6526464 4921856 5809664 4470784 5849088 5952000 4939264 5298688
4008E298688J44896J087488j013760P82848M63360j647104Q192Q28928l37408
$$ 5298688 5443584 6531072 5517312 6300160 6763520 5116416 5124608 5953536 5616128
3999E616128l84512J05984k57024J88928j93536J54624J06496K36032k36544m36736
$$ 5616128 5231616 5337600 5080576 5269504 5075968 5230592 5337088 5573120 5336576 4899840
3989D899840P81312m02432J66912q192p14752r54368P32160J324544j426944Q46336
$$ 4899840 5681152 5278720 5445632 5437440 4722688 3768320 4500480 5825024 4398080 5244416
3979E244416M44928q2432m18304N64224r52832L88608m30080K61120j97120N0688
$$ 5244416 5689344 5606912 5188608 5752832 4800000 5188608 4758528 5019648 4822528 4873216
3969D873216K73920L40480M5568K04288j220096R27232M19840j031168R80992
$$ 4873216 5147136 5487616 5533184 5737472 4517376 5444608 5864448 4833280 5814272
3960E814272k40128p91552O76352k48320l44576P30112p90016J15712N69856m06016
$$ 5814272 5574144 4782592 5458944 5210624 4866048 5596160 4806144 4921856 5491712 5085696
3950E085696L10272j382912N01760R53856j87904n61152M90496n18656N87264
$$ 5085696 5395968 4013056 4514816 5468672 5280768 4719616 5210112 4691456 5278720
3941E278720P50592l57376O28736j544704L2768J218048j154048L53280J78176
$$ 5278720 6029312 5671936 6300672 4755968 4788736 6006784 4852736 5206016 5384192
3932E384192m51072o03648J244160l35360M51072o62528L18464m62336O98880
$$ 5384192 4933120 4329472 5573632 5238272 5689344 5026816 5345280 4882944 5581824
3923E581824k84160n62176J034240q9600j72032l07712N73952P23456q22784J28000
$$ 5581824 5297664 4735488 5769728 5680128 5508096 5200384 5774336 6497792 5675008 5803008
3913E803008o73280l41504Q44288j194496J353728k82624M69504Q704n57056p20896
$$ 5803008 5129728 4788224 5632512 4438016 5791744 5509120 5978624 5987328 5430272 4709376
3903D709376J751552q80128l9424J217536j78176j8432o36416M4032M76160j40288
$$ 4709376 6460928 5580800 5541376 6758912 6580736 6562304 5925888 5969920 6446080 6305792
3893F305792j579008L89632J060864j030656J290240j107968k48320K62144M77696
$$ 6305792 4726784 5116416 6177280 5146624 6436864 5328896 5080576 5342720 5820416
3884E820416p2192L93728m04480m8640O42048J18272q66816p1168Q26368p78752
$$ 5820416 5748224 6141952 5737472 5688832 6330880 6449152 5582336 5511168 6337536 5558784
3874E558784J055744j103360P73120o74816P70560k58048N83168j072128l71200
$$ 5558784 6614528 5511168 6284288 5609472 6380032 6121984 6705152 5633024 5261824
3865E261824J323520m24448J69984q89344J314304r79456Q33024n93920j035776
$$ 5261824 6585344 6160896 6330880 5441536 6755840 5776384 6609408 6015488 4979712
3856D979712Q39168J646080j568768J92512P680O73792j375744R6768J033728
$$ 4979712 5818880 7464960 5896192 6088704 6096384 6770176 5394432 5491200 6524928
3847F524928o43584L59936L27168K06848k39616m13184J758720j531392Q45312
$$ 6524928 5881344 6241280 6568448 6775296 6535680 6122496 7881216 6349824 7195136
3838G195136p9872P30624j538048P23968P45472m79232J04960Q94976j121280
$$ 7195136 7115264 7845888 6307840 7031808 7777280 7298048 7403008 8297984 7176704
3829G176704N6832J812992r23136n5296P37280J50016j070080J82272R02144j29536
$$ 7176704 7233536 9046528 8123392 8068096 8805376 8955392 7885312 8067584 8969728 8840192
3819H840192n32992Q33536l61472P66464L00032K10944r14432J892352Q04864
$$ 8840192 8307200 9140736 8779264 9545728 9845760 10056704 9142272 11034624 11839488
3810A1839488m7616l83488l00544N72416n13024P31136n36064K008064j837568
$$ 11839488 11791872 11408384 11107840 11680256 11167232 11898368 11362304 13370368 11532800
3801A1532800N94432R18016r1648R48736J010176k54464J331712M69504J456640
$$ 11532800 12127232 13045248 12953600 13902336 14912512 14658048 15989760 16459264 17915904
3792A7915904P41376N39648R38496M76160K054656p59808J385984Q89856m78720
$$ 17915904 18657280 19196928 20135424 20611584 22666240 21906432 23292416 24182272 23703552
3783B3703552J312256P96672O81984R51808Q21248J284608m89472J753088J080832
$$ 23703552 25015808 25812480 26494464 27446272 28267520 29552128 29062656 30815744 31896576
3774C1896576J094144O65088K073600J419776J650688P89504O24640k654720k745344
$$ 31896576 32990720 33655808 35729408 37149184 38799872 39589376 40214016 37559296 34813952
3765C4813952l955712m767744m508160l544064j228288j883648r07776n04832
$$ 34813952 30858240 26090496 21582336 18038272 16809984 14926336 14018560 13513728
3757A3513728L02080j431552m12160J65376j87392n32480O38976q93952O68160
$$ 13513728 13815808 12384256 11972096 12137472 11950080 11417600 12056576 11162624 11830784
3748A1830784m97152o1952l05664K09408k8672P93600K48832q09984K151936K372608
$$ 11830784 11333632 11271680 10966016 11175424 11146752 11940352 12189184 11379200 13531136 15903744
3738A5903744L61984k35008j258496j65376k540544j200128J79200o63552n76000
$$ 15903744 16265728 16030720 14772224 14606848 12066304 10866176 11045376 10381824 9805824
3729I805824o54848L53280M96128l73760l53792R26720n95456J10592R26720J379328
$$ 9805824 9150976 9504256 10000384 9626624 9272832 10199552 9604096 9714688 10641408 12020736
3719A2020736j239552K10432N41696q96000n29920k560L01568r25184k42688J325568
$$ 12020736 10781184 10991616 11533312 10637312 10107392 10104832 10406400 9481216 9238528 10564096
3709A0564096J326592j485312J288192m45440o59456M68992j175552p13728L12320
$$ 10564096 11890688 10405376 11693568 11248128 10588672 11057664 9882112 9168384 9480704
3700I480704o1952p64928P5776J24416n70368Q89344m34176N82144l93216r2160
$$ 9480704 9418752 8653824 8729600 8854016 8283648 9172992 8738816 9320960 8927744 8835584
3690H835584p0656P75168p1168r92768L79904K15552K32960n47328o63040J810944
$$ 8835584 8764928 9540096 9468928 8476160 8856064 9071616 9304576 8757248 8094208 9905152
3680I905152k80064Q08960j703936J305088p14240m07040J138176n61664l3792
$$ 9905152 9625088 10434048 8730112 10035200 9320960 8913920 10052096 9490432 9456640
3671I456640R92256j418752N37600k88256K46784m38272J41312K80064O31808
$$ 9456640 10448896 9030144 9567744 9279488 9526272 9088000 9229312 9509376 10141184
3662A0141184j097728N67296J318400n06368J30048R4208j17760n45280l70176
$$ 10141184 9043456 9610752 10929152 10422784 10552832 10647040 10529280 9984000 9613824
3653I613824K424320j235968K44224m32128L67104j039872J77664J099776j441792
$$ 9613824 12038144 10802176 11046400 10614272 10981376 9941504 10119168 11218944 9777152
3644I777152P5776O51776l10272p3728P01952j515520J372672P62880l48160j71008
$$ 9777152 9852928 10504704 10194432 10120704 10822656 9307136 10679808 11442688 11094528 10923520
3634A0923520j26976N13536k22208n71904k21184J271808j061376R9840J88416
$$ 10923520 10796544 11310080 11087872 10515968 10294784 11566592 10505216 10605056 10793472
3625A0793472P60832k09920K86720q15104K3552R16992p79264J53600J012736
$$ 10793472 11554304 11344384 11631104 10816000 10839552 11756544 10977280 11130880 12143616
3616A2143616p20896J149440o65600k30400M01408Q33536l18976q43776R03168
$$ 12143616 11422720 12572160 11906560 11676160 12077568 12911104 12592128 11748352 12651520
3607A2651520l52256K24768n61664J061376j033216m10624Q35584Q36608m55168
$$ 12651520 12299264 12524032 11962368 13023744 11990528 11579904 12415488 13252096 12796928
3598A2796928L78880M00384j0240j17248K81088j99168N77536O01600l80928l59424
$$ 12796928 13175808 13576192 13565952 13448704 13729792 13530624 14108160 14709760 14328832 13969408
3588A3969408R43104p41376J152512j81248J182208j174528k87744P65440q66816
$$ 13969408 14912512 14171136 15323648 15142400 16324608 15150080 14862336 15627776 14760960
3579A4760960Q40192K2016R75872j15200J02400J313792n08928l87584J60256
$$ 14760960 15601152 15623168 16599040 16483840 16586240 17900032 17391104 17003520 17163776
3570A7163776J270272k86208K85184J345024j99680m36224M58240m25472P57760
$$ 17163776 18434048 18147840 18433024 19778048 19578368 19142144 19600384 19174912 19932672
3561A9932672O80448l77856l46624j075200m74624R08288P19872p12704J537024
$$ 19932672 20613120 20235264 19888640 18813440 18338816 19247104 19966976 19254272 20791296
3552B0791296J018368k33472J573376R66144k560r26720J65888N75488R7792J072128
$$ 20791296 21809664 21576192 23149568 24115712 24113152 23186432 23352320 23927808 24025600 25097728
3542B5097728O56384O37952j76128J466880M71552N35552J551360K67776Q87296
$$ 25097728 25754112 26392064 26215936 27682816 28154368 28689920 30241280 30509056 31396352
3533C1396352P4240N57056J559552R71776Q04352J402368P52128M62336K508288
$$ 31396352 31470592 32027648 33587200 34558976 35363328 36765696 37517824 37980160 40488448
3524D0488448P16288J848832J152512K640384K075648K520576J973760K041344
$$ 40488448 41204736 43053568 44206080 46846464 48922112 51442688 53416448 55457792
3516E5457792J752576K238976L559424L414528K701312M318208L788288O084096
$$ 55457792 57210368 59449344 63008768 66423296 69124608 73442816 77231104 83315200
3508H3315200N197312O336512O328832P913472Q758784P371776R519104Q222720
$$ 83315200 88512512 94849024 101177856 109091328 117850112 125221888 134740992 142963712
3500A42963712R057280J1615232J0265600J2920832J2691968J5951360J9008512
$$ 142963712 152020992 163636224 173901824 186822656 199514624 215465984 234474496
3493B34474496J9829760K5151488K9060608L7128704M5985280N8276352P8701056
$$ 234474496 254304256 279455744 308516352 345645056 391630336 449906688 528607744
3486E28607744J07859456J44627200J85866752K04531200J63321344L6666368
$$ 528607744 636467200 781094400 966961152 1171492352 1334813696 1371480064
3480A371480064j36311808k52531712k54913536k03354112j48289024j00953600
$$ 1371480064 1235168256 982636544 727723008 524368896 376079872 275126272
3474B75126272p0028288m7752704l3936896k3549440j7864192j1678208j0815488
$$ 275126272 205097984 157345280 123408384 99858944 81994752 70316544 59501056
3467E9501056q338944n509632n941760m447744l473408l433984j716736j860608
$$ 59501056 51162112 45652480 39710720 35262976 31789568 28355584 26638848 24778240
3459B4778240j158144k436608k473984L89632j437696r84064k30912j226240k90816
$$ 24778240 23620096 21183488 18709504 19099136 17661440 16677376 16446464 15220224 14929408
3450A4929408j500160M18304k551296l59936K28864r21600J76128r23648M41344
$$ 14929408 13429248 13847552 11296256 10936320 11165184 10243584 10419712 9496064 9937408
3441I937408k51392j58208m08576Q704m77696K52928j098240J03424m9664l66080
$$ 9937408 9686016 9527808 9119232 9127936 8650240 8903168 7804928 7908352 7858688 7492608
3431G492608J08032j161728M79232n56032L55840j869312J562112j449472L39968
$$ 7492608 7600640 6438912 6918144 6362112 6717952 4848640 6410752 4961280 5301248
3422E301248N42208L77856j057280O34368N8368L74272r30304r6256n92896m89984
$$ 5301248 5843456 6221312 5164032 5798400 5856768 6231040 5300736 5204480 4611584 4121600
3412D121600j353216J004032n39136L88608k9696N98528o29248M10112m82304
$$ 4121600 2768384 3772416 3233280 3621888 3592192 4190720 3561472 3971584 3489280
3403C489280A526784Q4992l58400J001984C96288M70016l45088B12480H9600J036288
$$ 3489280 1526784 1611776 1253376 2255360 396288 866304 521216 212480 89600 1125888
3393A125888Q07936Q24320A170432O60992l37920J3312K61632l26144k70336P22944
$$ 1125888 1933824 2758144 1170432 1831424 1493504 1506816 1768448 1442304 1171968 1894912
3383A894912o75840M22912K78528K32448O90688q0896p70048O7584n6832L32288
$$ 1894912 1219072 1641984 1920512 2152960 2843648 2762752 1992704 2060288 2003456 2335744
3373B335744n77536K93888M76160l23584o44608O64576j084928K31936J480192
$$ 2335744 1758208 2052096 2528256 2204672 1560064 2224640 1139712 1371648 2851840
3364B851840j118208k45760P01440J10080N32992j398784n1712k08896P87968
$$ 2851840 1733632 1487872 2189312 2299392 2832384 1433600 1381888 1172992 1960960
3355A960960J68448j07008G16800K044928j122304m18304J003008K128384A959424
$$ 1960960 2129408 2022400 716800 2761728 1639424 1221120 2224128 4352512 1959424
3345B791936m17792R46688A444864L37920O74816p50080O77888q20224J15200
$$ 2791936 2374144 3320832 1444864 1782784 2457600 1707520 2385408 1565184 1680384
3336A680384O29760r60000P26016J97120p55712n28384J254400R728r12896P29600
$$ 1680384 2310144 1350144 2076160 2273280 1517568 989184 2243584 2253312 1340416 2070016
3326B070016K69312J253888q3456l90656J576448j452544K21696n94432K58560
$$ 2070016 2339328 3593216 3509760 3119104 4695552 3243008 3464704 2870272 3128832
3317C128832l13856j157120P46496J36704N60640j48480j12128l18976J363456
$$ 3128832 2814976 1657856 2404352 2541056 3101696 2953216 2841088 2522112 3885568
3308C885568p44960n90336M28032M23936j663488J110528p84896J632256o46144
$$ 3885568 3140608 2550272 2978304 3402240 1738752 2849280 2064384 3696640 3050496
3299C050496P3728m65920j12128R01120P71072k30400R01632L50720N23264L51744
$$ 3050496 3124224 2658304 2546176 3447296 4218368 3987968 4889600 5240320 5763584 6115328
3289F115328L35360j29024l61472O98880p80800p01952r69216J1264m04992O656
$$ 6115328 6450688 6321664 5960192 6659072 5878272 5176320 4207104 4218368 3813376 3820032
3279C820032j150464J239552l00032k48320K18112n83168O77888J73056k10944
$$ 3820032 2669568 3909120 3609088 3360768 3578880 2995712 3673600 3846656 3635712
3270C635712O28224l78880k00704J474560K78528j83296m83328K82112L12832
$$ 3635712 4263936 3885056 3684352 5158912 5437440 5254144 4770816 5052928 5365760
3261E365760R72800Q68864m01920J73568m89472P06048R94816q64768O75328O76864
$$ 5365760 6338560 7207424 6805504 6979072 6489600 7195648 8190464 7325696 8001024 8677888
3251H677888M2496J692160j312768K5088J189888n12512J236480k04288M39808
$$ 8677888 8720384 10412544 9099776 9124864 10314752 9802240 11038720 10834432 11274240
3242A1274240k28352R09824Q40192K6624j152000J99680R42080n89824J569792
$$ 11274240 11045888 11955712 12795904 12822528 11670528 11870208 12812288 12222464 13792256
3233A3792256r26208j57184N02272J049600N23264m32640N42208O45632r67168
$$ 13792256 12866048 12708864 13211136 14260736 14784000 14351360 14893568 15539200 14572032
3224A4572032J683968N46304O91712r6768N74976N09440J480192n04320J481216
$$ 14572032 16256000 16802304 17494016 17397248 17972224 18481664 19961856 19457536 20938752
3215B0938752R91232N36576N76000j60256J627648J115648N23264Q52480O656
$$ 20938752 21929984 22466560 23042560 22882304 24509952 25625600 26148864 27001344 27008000
3206B7008000K19648m08064J438720M07040O21056J25440k70848J048064R82528
$$ 27008000 27227648 26819584 28258304 28665344 29286400 29411840 29140992 30189056 31171584
3197C1171584L21024N15584L88096q52480k998784l832832l878912m023296l248640
$$ 31171584 31492608 32008192 32396288 31543808 28545024 24712192 20833280 16809984 13561344
3188A3561344j751040j362944m39296j305088k62656p57248l03616j04960r20576
$$ 13561344 11810304 10447360 10008064 8702976 8440320 7683072 7379456 7274496 6353920
3179F353920L81952j025024P3216r1648J320448j748480l57376M55680Q80640
$$ 6353920 6735872 5710848 5784064 5692416 7012864 5264384 4907008 5362688 6243328
3170F243328n76000J14688q23296M92032m80256l13344N19168K43712n07904R74336
$$ 6243328 5667328 5782016 4958720 5450752 4970496 4657152 5176320 5420032 4912128 5886464
3160E886464k2528j568768P83872p79776l3792K32448K61120j890304J285120
$$ 5886464 5863936 4295168 5079040 4299264 4265472 4497920 4759040 2868736 4153856
3151D153856K59584K78528K28864j312256J256960L8400J61792j9968P16288j112064
$$ 4153856 4413440 4691968 4920832 3608576 4865536 4903936 5065728 5045760 5762048 4649984
3141D649984Q70912J159168j53600j887232J871872n48352j113088O37952R77408
$$ 4649984 5520896 6680064 6526464 4639232 6511104 5962752 4849664 5487616 6465024
3132F465024j435136o66624J493504j40800L76832K40128j162240J7408R4720
$$ 6465024 5029888 4363264 5856768 5715968 6092800 6332928 5170688 5188096 5282816
3123E282816K69824r9328J172992l37408k14016J32096J76128j889280J024P63392
$$ 5282816 5552640 5453312 6626304 6288896 6074880 6206976 6383104 4493824 4494848 5258240
3113E258240k04288k86720N1200J25440m19840P53664j338880k14016K28864M40832
$$ 5258240 5053952 4767232 4818432 4943872 4524032 5277696 3938816 3724800 3953664 4394496
3103D394496O9120K52928m82304j8944K52416Q81152k89280o63040m61824R04704
$$ 4394496 4463616 4716544 4234240 4215296 4467712 5348864 5059584 4396544 3934720 4839424
3093D839424L9936L07712o88640l37920K76992p9872L88096p3728k50880J334272
$$ 4839424 4879360 5187072 4498432 4160512 4437504 4357632 4745728 4672000 4421120 5755392
3083E755392o1440o37440p38816J115648l10784N14048l85536O63040p37280P62368
$$ 5755392 5693952 5056512 4317696 5433344 5122560 5636608 5251072 5914112 5176832 5939200
3073E939200r1136J357312n52960Q30464P0656R05216J80224J019904J309696
$$ 5939200 5848064 7205376 6652416 7482880 7553536 8458752 8638976 9658880 10968576
3064A0968576J018368L567616L102720L816448N45280r5232k192896j115136m361728
$$ 10968576 11986944 15554560 18657280 22473728 23019008 22923776 20730880 19615744 15254016
3055A5254016l984896k941952k760192L56352j661440J18272K77504p25504Q21248
$$ 15254016 11269120 8327168 5566976 5923328 4261888 4380160 4657664 3932160 4753408
3046D753408j065984M55680M83328L39968r48224J281536J33632k208256J949184
$$ 4753408 3687424 4143104 4626432 4966400 4018176 5299712 5433344 3225088 5174272
3037E174272j099776K50880r8304k18112k10432J37216M04992M07552R1648j087488
$$ 5174272 4074496 4325376 4227072 4008960 3798528 3935744 4340736 4748288 4839936 3752448
3027C752448J241600j46432l12320J469952j462272R35424n08416j026560R6768
$$ 3752448 4994048 4847616 4535296 6005248 4542976 5478400 4969984 3943424 4040192
3018D040192O18496m96128j013760J444864k46784K25792r47200J469952p46496
$$ 4040192 4658688 4162560 3148800 4593664 4346880 4572672 3625472 5095424 4348928
3009D348928J05472M28032q30464R6256K11968j0240m18304O27200m81792k35008
$$ 4348928 4454400 4882432 4051968 4148224 4360192 4349952 3931648 4558848 4077056 3842048
2999C842048J030656l04128K65216j492480j23392O39488J042432j458688J246720
$$ 3842048 4872704 4568576 4833792 3341312 3217920 3857408 4899840 3441152 4687872
2990D687872j399296J460736n62176k17088p35232J606144p37280N2736N28384
$$ 4687872 3288576 4749312 4187136 3970048 3234816 4840960 4103680 4156416 4684800
2981D684800k17600M54656q59136j64864N41696N02272m34176M81792r18528N74464
$$ 4684800 4467200 4921856 4062720 3897856 4439552 4941824 4507648 4989440 4070912 4645376
2971D645376m94592K19648k10432J102848k80064k98496j9968L01568O17472L40992
$$ 4645376 4150784 4370432 4160000 5262848 4982784 4684288 4664320 4965888 5583360 5924352
2961E924352j136640K01216K60096K59072L15392p69536m80256J575424r79456
$$ 5924352 4787712 4988928 5249024 5508096 5823488 5053952 4573696 6149120 5169664
2952E169664j09056J101824O11840j46944r88672Q27392K67264O29760j617920
$$ 5169664 5060608 6162432 6774272 6627328 5638656 6466048 6733312 7363072 5745152
2943E745152J527296o47680J332224p69024J550336Q2432n02784L81440J736704
$$ 5745152 7272448 6624768 7956992 7187968 8738304 8820736 8317952 8699392 10436096
2934A0436096J56160J319424K41664J814016J38752M70528L73248N49376Q46848
$$ 10436096 10592256 11911680 12153344 13967360 14106112 14576640 14949888 15499264 16346112
2925A6346112L76320m76672K69824Q36096N87776K62656K6624J180672j241088
$$ 16346112 16722432 16245760 16515584 17351680 17939456 18202112 18228736 19409408 18168320
2916A8168320J904640n95968O41024J567232M26496K990080J961472J153024K87232
$$ 18168320 20072960 19476992 20118016 21685248 22111744 25101824 27063296 28216320 28503552
2907B8503552L33824k093056k169856m922880k747392k402816k378240k219008
$$ 28503552 28837376 26744320 24574464 19651584 16904192 14501376 12123136 9904128
2899I904128j089536o80448o97344o94784m99200M5568N49888r65632N47840o11328
$$ 9904128 8814592 8134144 7436800 6742016 6242816 6288384 6838272 5872640 6420480 5809152
2889E809152Q52992m04480j329664P26528j25440M03456m37760j5360J92000l74272
$$ 5809152 6662144 6257664 4928000 5654528 5529088 5932544 5494784 5479424 5671424 5297152
2879E297152p19872K05312M98176o94272L20512N87264o18496J48480n9392Q57088
$$ 5297152 4577280 4782592 5280768 4586496 4907008 5494272 4875776 5024256 4964864 5821952
2869E821952j062400M8128N71904L76832j58720O41024l22048q9088j607680J591296
$$ 5821952 4759552 4807680 5379584 5756416 5597696 6238720 5916672 5827584 4219904 5811200
2859E811200j143808l03616N58080Q1920P31136J856512j905152J021952n94944
$$ 5811200 4667392 4363776 4921856 5003776 5734912 7591424 5686272 6708224 6113280
2850F113280L45600J758720q95488J275392K068480J361408N513728P024640L296768
$$ 6113280 6458880 8217600 7322112 8597504 10665984 12027392 17541120 24565760 27862528
2841B7862528K585600m798976j0402304n028864k678272j676800n71904r17504
$$ 27862528 30448128 25649152 15246848 10217984 7539712 5862912 5291008 4373504
2833D373504J31072m23424j49504N37600j175552L66080n67296J23904J729024
$$ 4373504 4504576 4081152 3931648 4469248 3293696 3659776 3092480 3216384 4945408
2824D945408q08448N24288j349120J180160p04512j15712o41024O36416q00256
$$ 4945408 4136960 4661248 3312128 4492288 3787776 3672064 3031040 3667456 2867200
2815B867200J863680j052672K92864j199616N8368R63584r10336L12832M84352
$$ 2867200 4730880 3678208 3971072 2771456 2829824 3793408 2883072 3195904 3680256
2806C680256p02464R57440l75296J072128m43904O11840j339904K31936n50400
$$ 3680256 2977792 3935232 3559936 4632064 4188160 4800000 3460096 3692032 3141632
2797C141632J58208P07072j93024j81248L45600j184768J244160p0656o11328
$$ 3141632 3299840 4006912 3813888 3632640 3978240 2793472 4037632 3966976 3355648
2788C355648m81792j01376M53120L23072Q28416j063424J203200K6624l51232
$$ 3355648 2873856 2772480 3225600 3548672 4377088 3313664 4516864 4543488 4192256
2779D192256J026560o70720m04992J96608J44384L97824K29888J08032J356288
$$ 4192256 5218816 4548096 4143104 4339712 4484096 4881920 5111808 5219840 6576128
2770F576128j04960M58752j141760N60640k44736n70368P88480J344512j37728
$$ 6576128 6471168 6929920 5788160 6348800 6104064 5533696 6322176 7666688 7528960
2761G528960M87936N03808l00544K200064J280000K316288M670464P017472Q628224
$$ 7528960 8016896 8520704 8220160 10420224 11700224 14016512 18686976 25704448 34332672
2752C4332672N740032K345472r335808j2665856n413376r87648j321984K580480
$$ 34332672 40072704 42418176 33082368 20416512 15003136 14015488 12693504 15273984
2744A5273984M646400K828800L129856p83360p172096l700224j736192R65120
$$ 15273984 19920384 22749184 25879040 25095680 17923584 14223360 12487168 13452288
2736A3452288M075520P026688M271104L921408j935872j0528768n698560l250688
$$ 13452288 17527808 24554496 28825600 32747008 30811136 20282368 14583808 11333120
2728A1333120q37120J763328M963840K670592J843712M02432p936000n178880
$$ 11333120 10496000 12259328 17223168 19893760 21737472 22139904 14203904 9025024
2720I025024j486848j081856J385472J362944J972224O40000l91168l824128k828800
$$ 9025024 7538176 6456320 7841792 9204736 11176960 11816960 11425792 7601664 4772864
2711D772864n01760j58720j085952r42080R77920n9904L56352M70016q8576n27360
$$ 4772864 4271104 4112384 3026432 2084352 3062272 3002368 3358720 3828736 3740160 3212800
2701C212800M77184l25632j24416n17632Q65792M75648k48832J746944M08576
$$ 3212800 3689984 3364352 3239936 2722304 3588096 4063744 3814912 5561856 5970432
2692E970432j005056R59488n32480K19648Q90368o72768j675264k18112L13856
$$ 5970432 4965376 5924864 5392384 5612032 6502400 5829632 4154368 3936256 4250112
2683D250112M92032q57088J021440j346048O51264n31456r54880J29536q30976
$$ 4250112 4742144 3885056 4906496 3560448 4211712 3680256 2725376 2854912 2023936
2674B023936J137152n68832M44416n17632J45408l66592l55328O89152j23904
$$ 2023936 3161088 2592256 3036672 2519040 2664448 2297856 1942528 2631680 2507776
2665B507776J028096j516032L0208J691136j223680k67264J415168r94304P42400
$$ 2507776 3535872 2019840 2050048 3741184 2517504 2250240 3665408 2671104 3413504
2656C413504o58432P56224j696768J401344j61280L07712j21856m25984J254912
$$ 3413504 2755072 3511296 1814528 3215872 3054592 3362304 3240448 2814464 4069376
2647D069376j382400J576448j504256l5840k33984K18112Q06400J062912m81280
$$ 4069376 2686976 4263424 2759168 2723328 2489344 2707456 3513856 4576768 4095488
2638D095488L01568j360384k42688Q29952o16960n75488R35424P92576l78368
$$ 4095488 4397056 3036672 2793984 3623936 3006976 2431488 3366912 4159488 3781120
2629C781120n58592R42592k18624M63872j239552K7648O11840k59584P91552l17440
$$ 3781120 3222528 4165120 3946496 4410368 3170816 3198464 3810304 3550720 4342272 4024832
2619D024832R8816j477632K68288l0208n79072K29888J99680m59264m03968p1680
$$ 4024832 4123648 2646016 2914304 2884096 2305024 2534912 2734592 2275328 1871360 1799680
2609A799680L20512m67456L22048M21376K41152M55680R216q25344j32608P02976
$$ 1799680 2120192 1652736 1974784 2396160 2637312 3092992 3102208 2276864 2144256 2847232
2599B847232m50048k70336j56160R12896m6080o18496j37728P0144l5840F94784
$$ 2847232 2397184 2126848 1970688 2883584 2837504 2219008 2081280 2151424 2115584 694784
2588B483200K99008o96320H31488R88672R82016j201664P42912K63168K49856
$$ 2483200 2782208 2085888 831488 1820160 2802176 1600512 2343424 2606592 2856448
2579B856448k08384k23232p38816Q31488m76672M58752L48672j015808J0752j0240
$$ 2856448 2648064 2424832 1686016 2517504 2040832 2499584 2848256 1832448 1843200 1832960
2569A832960J140736m56704l38432l98848J551360o25152J61792m64384Q8064
$$ 1832960 2973696 2516992 2178560 1779712 3331072 2705920 2867712 2403328 2491392
2560B491392L73248O04672l1232j551360N83168k97984Q91392J143296j623552
$$ 2491392 2864640 3469312 3438080 1886720 2469888 2171904 3063296 4206592 2583040
2551B583040J82784m08064J213952p38304q2432N05344n27360Q55040j063424
$$ 2583040 2765824 2357760 3571712 2833408 2750976 3256320 2728960 3584000 2520576
2542B520576J66400o49216P06560j079808J382400m20352n64736Q59136m98176
$$ 2520576 2686976 2037760 2744320 1664512 3046912 2626560 2061824 2920960 2422784
2533B422784N37600r34912P55712J86880l96800M00384k39104J79200K6624L03104
$$ 2422784 2960384 2025472 2781184 2968064 2571264 2971648 2732544 2911744 2938368 3241472
2523C241472k30912m86912L12320J42848k75456P39328m94592j12128O54848o656
$$ 3241472 3010560 2523648 2835968 2978816 2703360 3442688 2948096 2835968 3490816 3484160
2513C484160L98848p6288j71520M64896K32448j146880J21856m11648O5024Q94464
$$ 3484160 3883008 3806720 3635200 4100096 4332544 3185664 3307520 2895872 2960896 3855360
2503C855360M13696O95296m64896L13344l17440n02784l09760J025536j062400
$$ 3855360 4269056 4964352 4499456 4812800 4495360 3992576 3682816 4708352 3645952
2494C645952L51744J401856l98336n87776L75808p31648Q75008M6080K5600J00864
$$ 3645952 3997696 5399552 5001216 4413440 4789248 4057600 4932608 4978688 5004288 5105152
2484E105152N29920j391616J799680j790976R77408o74304q81152J809920j168384
$$ 5105152 5635072 4243456 6043136 4252160 5229568 4555264 3674112 5484032 4315648
2475D315648J046528j024l2256N45792o83520M73600K84160L93216n50912n91360
$$ 4315648 5362176 5361152 5328896 5874688 5191168 5664768 5948928 6342144 5791232 5199872
2465E199872N12512n78048j15712m53632N19168l10272J92512j56160L50208r06752
$$ 5199872 5712384 5134336 5018624 4564992 5084160 4773888 4966400 4810240 5160448 4253696
2455D253696N59104J6896j28512o6560O87104J8432q04864k84672j55136Q54528
$$ 4253696 4812800 4829696 4701184 4634624 5321728 5340160 4535296 4250624 4095488 4950016
2445D950016n46816k67776J963520j848832q3968M71040J17248J47456K45248
$$ 4950016 4403200 4135424 6098944 4250112 4166144 4637184 4754432 4901888 5147136
2436E147136j024512j148416O07744J112576j140224P12704p30112L35360K61632
$$ 5147136 4122624 2974208 3581952 4694528 3554304 4267008 3536896 3872256 4133888
2427D133888j219072N92384O61504L78880j65376j869824J121280M99712j94560
$$ 4133888 2914816 3507200 4168704 4547584 4382208 2512384 3633664 4133376 3938816
2418C938816o64064k94400P62368j289728R29280M13696k64192M32640l82976
$$ 3938816 3274752 2980352 3742720 2452992 3382272 3795968 3531776 3964416 3581440
2409C581440J763328p27552k27840n3760L61984n06880K18624o67648q5504L36384
$$ 3581440 5344768 4617216 4389376 4335616 4697600 4190720 4409344 3741696 3656192 3992576
2399C992576l07712R30304o59968q704P49056p57248q8064o9120p69536R32352
$$ 3992576 3684864 4615168 3955200 3946496 4695552 3938304 3850240 3781120 3011584 3943936
2389C943936k20672Q05888j86368l60448r216R86624j600512J275392K33984L42528
$$ 3943936 3723264 4529152 4342784 3982336 3973120 4959744 3359232 4634624 4868608 5211136
2379E211136j098752M70528p25504O71232m65408k2016k93888J460224k009088
$$ 5211136 4112384 4582912 3857408 4528640 4063232 4041216 3747328 5207552 3198464
2370C198464J439232l00032M52096j34144R41056m56704N19680k96960N8368p97184
$$ 3198464 4637696 4337664 4789760 4655616 5596672 5139968 5659648 5362688 5421056 4623872
2360D623872L05152R31840j056256N39648q78592K36032m25984R64096n80096
$$ 4623872 4929024 5860864 4804608 5344256 4465664 4701696 4275712 5239808 4659712
2351D659712Q4480M16768l7888n18656J025024L5328N8368j334784J4848J004544
$$ 4659712 4744192 5160960 5123072 4604416 5629440 5664768 5723136 4388352 4403200 5407744
2341E407744N86752j513984J193472M14208J34144r27744P67488j43360J2800
$$ 5407744 5994496 4480512 5673984 6088192 6222336 5294592 6062080 5918720 5931520
2332E931520j134080J287680j186816J207808n4784q64256M73600o66624J432064
$$ 5931520 4797440 6085120 4898304 6106112 6051328 5187072 5660672 4994048 6426112
2323F426112j586176M37248J397760p48032o1952L86048J562112j162240q09472
$$ 6426112 4839936 5277184 6674944 5926912 5864960 6251008 7813120 6650880 5841408
2314E841408N02272Q68864l1744r60000N63712J36704L17440p87968K18112N26848
$$ 5841408 6343680 7212544 7180800 6220800 6784512 6921216 7238656 6450688 6668800 7195648
2304G195648o13888k80064j14176P6800J21344q57088O44096J37216j193984J733120
$$ 7195648 6581760 6301696 6187520 6264320 6385664 5528576 6172672 6309888 5115904 6849024
2294F849024j161216j46432J174016o30272L40992p29088O7584k24256J745408
$$ 6849024 5687808 5541376 6715392 6085120 6426112 5697024 5764608 5540352 7285760
2285G285760j860608J403904P32160j321984P40864k9696m42880K246656q11008
$$ 7285760 5425152 6829056 7561216 6239232 6980096 6950400 6507520 8754176 7943168
2276G943168L43552p19360Q99072k93888j181184Q07936j68448n86240P93600
$$ 7943168 8286720 7567360 8466432 8172544 6991360 7799296 7630848 7044608 7838208
2267G838208q91392l57888j46944Q09984j18272l24608O51776K53440j74592k65216
$$ 7838208 6946816 6588928 6441984 7251968 7133696 6809088 7460864 7714304 7539712 7274496
2257G274496J7920l58912K09408J56160J71520N78048j47456q47360J100800j499136
$$ 7274496 7292416 6933504 7142912 7299072 7470592 8048640 7901184 7053824 8154624 6655488
2247F655488J333760r85088K48320K99008o85056N04832q50432J28000K39104
$$ 6655488 7989248 7004160 7252480 7551488 6866432 7371264 6520832 6648832 6887936
2238F887936M98176o0928l37920r216q11008N92384N95968m82304l52768j234432
$$ 6887936 7386112 7325184 6987264 6978048 6167040 6759424 7355392 6873088 6520320 5285888
2228E285888P00928N72416j148416K237440j121792M75136K04800M04480o50752
$$ 5285888 5986816 6559232 5410816 7648256 6526464 7001600 7206400 7610880 6960128
2219F960128J082368m77184n77536N15072j674240J462784m60288j15200r1648
$$ 6960128 8042496 7565312 6987776 7502848 5828608 7291392 6831104 6715904 6624256
2210F624256r4720k19136N22752j041920M14720J327616j782272L08736n5808
$$ 6624256 6529536 6310400 6833152 5791232 6205952 7533568 5751296 6060032 6004224
2201F004224q52992R77920L3792l84512Q44288k89792q41216M91520O11328j123328
$$ 6004224 5151232 6129152 6162944 5778432 6622720 6332928 5491712 5983232 6594560 5471232
2191E471232J580032k104320J715712K61632o32320k97984J089024k93376M30592
$$ 5471232 7051264 4946944 6662656 6924288 6291968 5993984 7083008 6789632 7220224
2182G220224P65952r11872Q57088j271808R49248n32992j08032m31616K98496
$$ 7220224 7986176 7074304 7931392 6659584 7608832 7075840 6967808 6536192 6834688
2173F834688R51296r90208N80096O30272q45824L94240N92896l9936O96832o87616
$$ 6834688 7785984 6795776 7375872 8006144 7160320 7554560 8147456 8107520 8804352 8116736
2163H116736K02240N03296j696256K58560K55488J97120J398272n83168l47648
$$ 8116736 8318976 8822272 7126016 7384576 7640064 7837184 9235456 8652288 8304640
2154H304640O25152j22880Q24320j051648j0240n9392J89952q9088m55680R4720
$$ 8304640 8929792 8806912 9631232 8579584 8569344 8509952 8699904 8610816 8155136 8249856
2144H249856J142272l87072P08608j54112M12160l04640n12512K63168L98848
$$ 8249856 9392128 9005056 9713664 9559552 9971712 9667072 9154560 9417728 9816576
2135I816576Q8576K53440j6896l33312M91008m07552Q8064l32288j71520K39616
$$ 9816576 9905152 10158592 10141696 9808384 10299392 9891840 9979904 9647616 9476096 9715712
2125I715712N0688n34016M43904R45664J1264n81632L73760j81760L48672j110528
$$ 9715712 9766400 9232384 9676288 10621952 10633216 10051584 10425344 10243584 10592256 9481728
2115I481728P35232o27712j02912j18272o5536J732608k29888j499648J306112
$$ 9481728 10216960 9589248 9486336 9368064 9302528 11035136 10805248 9305600 10611712
2106A0611712M23424l19488l28192K2016%q03328J385472K71360j040896J056768
$$ 10611712 11035136 10715648 10387456 10409472 10409472 9606144 10991616 11262976 10222080 11278848
2096A1278848o96320n83168N11488L5840p69536P94624l84000J59744l3792L7888
$$ 11278848 10582528 9999360 10510848 10546688 9777152 10571776 10187776 10347520 10313728 10351616
2086A0351616l46112N8880M7616J538560J281536R02656N492224K174976K544128
$$ 10351616 10005504 10064384 10112000 11650560 12932096 13834752 19326976 21501952 24046080
2077B4046080n8368p055872n456384q40192j781248n60128R08800j094144N40672
$$ 24046080 23987712 16931840 11475456 10635264 8854016 8293888 9202688 8108544 8649216
2068H649216K9184j365504O76352O21056j225728R77920r27232O56896k71872
$$ 8649216 8678400 7312896 7989248 8610304 7384576 8362496 7435264 8092160 7820288
2059G820288o84032O49216n11488l072q6528j57696K01216L97312o85568J838080
$$ 7820288 7136256 7785472 7273984 7270912 7184384 7026688 7227904 7625216 6939648 8777728
2049H777728o81472j084928P89504N38624p47008o36928O37440m20352O81984
$$ 8777728 8096256 7011328 7800832 8339456 7592448 6955520 7592960 7172608 7854592
2040G854592N25824M3520l59424j21344J069568j413632L49696P97696N29920
$$ 7854592 8380416 8423936 8064512 7943168 9012736 7599104 7948800 8746496 9276416
2031I276416q30976q96000O74304p02976Q63232k10944j158656J007616n65248
$$ 9276416 8445440 7549440 8223744 7520768 8384000 8173056 7014400 8022016 7456768
2022G456768R68704m94080j34656k10944j13152O07232Q3968k172416J501696
$$ 7456768 8425472 7931392 7796736 7585792 7472640 8079872 8163840 5991424 7493120
2013G493120r97376j50016j059328N94944p12192O02112N18144M27520j398272
$$ 7493120 6495744 6345728 5286400 5881344 5169152 5771264 6289408 6716928 5318656
2004E318656L48160J198080p15264n37600q05376P41376P83360m21376M47488
$$ 5318656 5666816 6864896 6149632 5612032 4806656 5548032 6331392 5910016 6357504
1995F357504J31072n56032n120J16736K30912q704m15232L9936N51424k02240
$$ 6357504 6488576 5932544 5927424 6044160 6275072 6266368 5851136 5891072 6442496 6240256
1985F240256K79040R7792k0992o60480K93376K56000K72896K86720j264128J079296
$$ 6240256 6519296 6617088 6596096 5935616 6228992 6484992 6757888 7044608 5780480 6859776
1975F859776J35680j86880m27520o4512O08256L73248n16096k03776L10272J049088
$$ 6859776 6995456 6808576 6381056 6316544 6924800 7298048 6781952 6578176 6888448 7937536
1965G937536k17600j536J00352j6896l22560J136128j94048N16096m3520J01888
$$ 7937536 7719936 7718400 7818752 7801856 7479296 8615424 8421376 8937472 8893952 8995840
1955H995840Q39680j957888K217984j543680L56352o68672R46176N12m34176J379328
$$ 8995840 9835520 7877632 10095616 8551936 8908288 8239616 9185792 9186304 8752128 10131456
1945A0131456p88480O07232K05824j318912J997824o63552J27488N1712l01056
$$ 10131456 9342976 9950208 10156032 8837120 10834944 10171392 10298880 10350592 10049536
1936A0049536J196544l35872M24448j185280J268224l07712K60096R55904n14560
$$ 10049536 11246080 10910208 11334656 10149376 11417600 11109888 11369984 12325888 11811328
1927A1811328l14368j82784J522176l38944J404928j311232J110528J14688j690624
$$ 11811328 11496960 11314176 12836352 12497408 13902336 12591104 13701632 13816320 12125696
1918A2125696M92032L53792q25344K78016J95072O1952O76352k445824J116672
$$ 12125696 12617728 12971520 12146176 12424192 12619264 12681216 13357568 10911744 12028416
1909A2028416r43616P36256M86912j099776p6800L00544m55680M16768K82112
$$ 12028416 11084800 11821056 12307968 11208192 11131392 11431936 10976256 11393024 11675136
1900A1675136l65056o20032j39776j97632J415680j072128J24928Q39680n04320
$$ 11675136 11310080 10690048 10550272 10352640 11768320 10696192 10821120 11660800 11156480
1891A1156480L79392l25120K08896r8816J76128K50368n23776k29888r07264M85376
$$ 11156480 11535872 11210752 11419648 11320832 11496960 11747328 11223552 10993664 10086400 10571776
1881A0571776J56160m84352l75296Q3968L09760p78240J655808r35936N25312
$$ 10571776 10727936 10243584 9868288 9952256 10262016 9483776 11139584 10203648 10728960
1872A0728960j417728P90528K31936o48192p0144p92576q11520R16480j348096
$$ 10728960 9311232 10101760 10333696 9685504 9615360 8822784 8011264 8927744 7579648
1863G579648J252352j02400k39104P56224j174016M18304q26880P36768p69536
$$ 7579648 8832000 8729600 8490496 9246720 8072704 8491008 7664128 8400896 7631360
1854G631360P65440p37280P07584j094656M19328J015808j397248M07040m59776
$$ 7631360 8396800 7659520 8367104 7272448 7691776 8707584 7310336 7717376 7257600
1845G257600M38272J25952r09312p680J428992p39328Q1920N120R7280n04832
$$ 7257600 7695872 7821824 6912512 6904832 8333824 7594496 7676416 7681536 7778816 7273984
1835G273984R76384j080832j56160N91872J032192p03488J13152N6320m51584
$$ 7273984 8250368 7169536 7013376 7605248 8637440 7933952 8047104 8103424 7651840
1826G651840N12000N52960p49056J196032p88992k12992O82496P65440J98656
$$ 7651840 8163840 8716800 7967744 9163776 8374784 8161792 8844288 9609728 9808384
1817I808384K86208O1440l84000p22944J34144L33312P60320j173504J187840
$$ 9808384 10094592 10156032 9772032 9049088 9183232 9516544 10276864 9103360 10291200
1808A0291200J55136J148416j775104J385984j475072J761792N84192j029120
$$ 10291200 10446336 11594752 9819648 11205632 9730560 11492352 12076544 11047424
1800A1047424Q28416K30912l14368p4240J433600o99392P23968m608P51616L41504
$$ 11047424 11875840 12106752 11792384 11718144 13151744 12452352 13176320 13171712 13923328 14264832
1790A4264832l93216k43200J789440k46784K35520j43360L89120P99232j027584
$$ 14264832 13871616 13628416 15417856 15171072 15406592 15263232 15652352 16451584 15424000
1781A5424000J750016j76640Q41728J301504J10080J237504M03456J602048N16608
$$ 15424000 17174016 16997376 17839104 19140608 19250688 20488192 20891648 22493696 23010304
1772B3010304L62496J080320K010624J503232k3552J830912J233920K061824J153024
$$ 23010304 23372800 24453120 26463744 27966976 27943424 29774336 31008256 33070080 34223104
1763C4223104J703936J288704R88672J323008j90976J083904J040896P680L64544
$$ 34223104 35927040 37215744 38204416 39527424 39336448 40420352 41461248 41468928 41833472
1754D1833472L43552J358848L89632K049536K176512J140736J427968K480640
$$ 41833472 42177024 43535872 43925504 45975040 48151552 49292288 50720256 53200896
1746E3200896K291712J617408L196928L371520M456448M360704N489152O465024
$$ 53200896 55492608 57110016 60306944 63678464 68134912 72495616 77984768 84449792
1738H4449792O668800Q104960O066176M510208K889728j865216o041600q385536
$$ 84449792 91118592 99223552 105289728 109799936 112689664 110824448 104782848 96397312
1730I6397312j0836992j0470400j2091904j0360320r777664q113152n330432n563392
$$ 96397312 85560320 75089920 62998016 52637696 42860032 34746880 29416448 23853056
1722B3853056j772544l063296j020416j926656k855424m09600Q39168k113024
$$ 23853056 22080512 19017216 17996800 16070144 13214720 12805120 13644288 11531264
1714A1531264m2496k11456r42592M68992j400832r09824M64896r2672J095168
$$ 11531264 11488768 11277312 10334720 10803712 9402880 8493056 8957952 8865280 9960448
1705I960448m84864j350656K29376j60768m17280K29376N96992j336832n05856
$$ 9960448 9475584 8124928 8354304 8193536 7776256 8005632 8602624 7265792 6759936
1696F759936K73920p62368M40320j46432J123840k024960J677824j293824j4336
$$ 6759936 7033856 6271488 6711808 6565376 7689216 5664256 7342080 6048256 6033920
1687F033920p11680M00384n10464O09280J22880p69536N72416l43040l35872O74816
$$ 6033920 5322240 5722624 5212160 5821440 5944320 5174784 5747200 5404160 5068288 5743104
1677E743104j145344J230336K38080j412608Q78080J54112O76864j001984m64384
$$ 5743104 4597760 5828096 6066176 4653568 5531648 5685760 6362624 5360640 4896256
1668D896256Q54016k762240n7344P24480O27712J89952l46624l66592j94048J5360
$$ 4896256 5750272 2988032 2930688 3655168 4282880 4472832 4126208 3759616 3565568 3580928
1658C580928k40640O0928M84864j191936P34208r23648N21216M80768j189376
$$ 3580928 3340288 3401216 3886080 2694144 3428352 2504704 3025920 3506688 2317312
1649B317312P94624J98656j177600J066496P9872m40832L67104n4272O86080l02592
$$ 2317312 3111936 3310592 2132992 3199488 3279360 2838528 3205632 3151360 3837440 3534848
1639C534848J08032L37920J58208j480704J177088o3488k08896j9968o4000K62144
$$ 3534848 3642880 3980800 4139008 2658304 3835392 3771904 3563008 3543040 3479040 3741184
1629C741184q47360n44256J221120O02624j152512J039872q25344m0448K97984
$$ 3741184 2893824 2349568 3570688 4173312 3020800 4060672 3235328 3194880 3492864
1620C492864N75488o13888n9904O00576O2464N52960l44576n20192k8672N2736
$$ 3492864 4068352 3454464 3394560 3995136 4057600 4610560 4265984 3745792 3717120 3769856
1610C769856J410560j149952M7616N56544K72384j48992O96320r05216P36768
$$ 3769856 5180416 4030464 4078080 4634624 4907008 4758016 5454336 4549120 5285888
1601E285888J040896L2256p91552K57536O6560L70688k3552O55872j263104O34368
$$ 5285888 6326784 6359040 5567488 5825024 5891584 6262272 6238720 6894592 5631488 6265856
1591F265856Q09472L40480J43360K26304K91840P24480J235456N78048J186816
$$ 6265856 7075328 7415808 7559168 7785472 8077312 8801792 10037248 10615296 11802112
1582A1802112j063424J254912n07392j524224m58240o46656N09952p09632j201152
$$ 11802112 10738688 11993600 11486208 9961984 9503744 8857088 9367040 8657408 7456256
1573G456256R55904J08032J63328L2256J79200j88416q43264K44224j24416j81248
$$ 7456256 8412160 8520192 8683520 8715776 8894976 8706560 7863296 8107520 7983104 7801856
1563G801856R36960n88800K14016l82976k59584N57568N78048l73248N12000q24832
$$ 7801856 8738816 8150016 8364032 7981056 7721472 8279040 8857088 8483840 8995840 8171008
1553H171008J143808j63328j127424J294848L00032J201152P42912R57440n120
$$ 8171008 9314816 9151488 8024064 9318912 9618944 10820096 11563008 12520448 12515328
1544A2515328P09632L72736P60320j885696j46944l45088j727488n96992q93952
$$ 12515328 13224960 13597696 14358016 12472320 12325376 11980288 10252800 9655808 8761856
1535H761856r95840K72384p35744J51552r45152M54144l38944Q20736o65600k55488
$$ 8761856 7766016 8038400 7302656 7454208 6509056 6963200 6624256 7444992 6779392 6523904
1525F523904M57216L32800k82624J154560j192960K52928J021952l93216J559552
$$ 6523904 6981120 7313920 7031296 8185856 6992896 7245824 8267776 7874560 9434112
1516I434112P7824Q75520n44256o03136r7280J349120j367040l65056j146880
$$ 9434112 9511936 10387456 9843200 9240064 9142784 10491904 9124864 8759808 7612928
1507G612928M76160j076224j150464R39520n34528j10592m97152q55040p98208
$$ 7612928 8089088 7012864 5862400 6801920 6267392 6156800 5659648 4804608 4006400
1498D006400R2160P04512M46464j445888N70368K00192J14688l33824L06688q44800
$$ 4006400 4098560 4803072 5249536 3803648 4374016 4574208 4688896 4355072 4661760 3816960
1488C816960K43712O87104l21536k24256p58784j9968j14688m3520r0624K90816
$$ 3816960 4060672 4747776 4426240 4201984 3443200 3423232 3308544 3265024 3174400 3465216
1478C465216M4032l15392L72224k07872P63904o30272O73280L7376q45824Q32512
$$ 3465216 3509248 3193856 3566080 3358208 4122112 3491840 4165120 4202496 3356672 4189184
1468D189184j387520J925632o48704p49568J48480K87744K53440k76992L08736
$$ 4189184 2801664 4727296 4078592 3329024 3477504 3765248 4018688 3741696 4050432
1459D050432K51392l10272r50784J197568q21760J665536o21056Q0896J348608
$$ 4050432 4301824 3991552 3040768 4238336 3416576 5082112 4461056 4541952 5890560
1450E890560k580992J670144j498624J163776j393664k59072o56384M22912l28192
$$ 5890560 3309568 4979712 3481088 4644864 3251200 2992128 2335744 2758656 2430464
1441B430464j65376J07008J75104n68832I65120P02464k63168o656B68288Q52480
$$ 2430464 2265088 2372096 2547200 1978368 965120 1667584 1404416 1397760 268288 1120768
1431A120768D68480L75296M57216j37216J406464q21760P30112o59456n7856q47872
$$ 1120768 468480 843776 1300992 1163776 2570240 1748480 2478592 1819136 1761280 913408
1421I13408J176064o75840k94400Q73984I26720Q51456H27392M86400n48864k43200
$$ 913408 2089472 1413632 1119232 1993216 926720 1778176 827392 1313792 764928 521728
1411E21728J87392P16800K49344Q97536p35744o656o32320m97664Q59648n86752
$$ 521728 709120 1425920 1675264 2572800 1837056 1830400 1198080 700416 1560064 973312
1401I73312Q67840O2464Q0896k30400q4992Q82176j164800J100800H93952O41024
$$ 973312 1841152 1903616 1984512 1754112 1669120 2551296 1386496 2487296 893952 1534976
1391A534976o26176R72800L04128n6832J211392j563648J034752A331712J130496
$$ 1534976 908800 1881600 2185728 2128896 3340288 1776640 2811392 1331712 2462208
1382B462208H90368L6864Q32000o8608l39456l24096L05664F7584P09120K4064
$$ 2462208 890368 927232 1759232 1690624 1351168 1027072 1332736 67584 776704 800768
1372H00768M33664k05312J78688l84000J40800P680P78240k99520F78400Q77568
$$ 800768 1234432 1029120 1207808 823808 964608 972288 1750528 1451008 678400 1555968
1362A555968o62528K10432r2160J285120m61824o75840R4208n33504J229824C03616
$$ 1555968 893440 1103872 1011712 2296832 1835008 1159168 1253376 719872 1949696 303616
1351E34528J250816k70336D90496R54880D23424o2464N67296D42880J049088B59072
$$ 534528 1785344 1515008 490496 1445376 423424 360960 928256 442880 1491968 259072
1340A082880o2976K49856o16960K36544B81600O29248K83136k52416M25984R71264
$$ 1082880 1019904 1269760 652800 889344 281600 910848 1193984 941568 1367552 2338816
1330B338816E82144j2800J085952D84864M74112n5296k93888J93024j51040c57888
$$ 2338816 582144 569344 1655296 484864 958976 903680 609792 802816 651776 -357888
1319B096128I90208m51584Q12544E21216K52416M67456o14912P94112m03968J307136
$$ 2096128 990208 538624 1351168 521216 773632 1241088 626176 1420288 1016320 2323456
1309B323456B49344R06752m98176N08416j52064A32096Q69888N9904R44640n44256
$$ 2323456 249344 1156096 657920 1166336 1014272 132096 1001984 1061888 2006528 1462272
1299A462272o97344Q50944G12704K92864J234432r08800F60992Q41216B64192
$$ 1462272 764928 1615872 712704 1005568 2240000 1331200 660992 1502208 264192
1289A268224m96128p1680L21536l43552e03296H02816N71392j99680E70368K14016
$$ 1268224 772096 700416 1021952 678400 -503296 802816 1374208 1174528 570368 784384
1279G84384Q55552q04864N28896B51904P42912M85376L25120o57408l69664N05856
$$ 784384 1639936 835072 1363968 251904 994816 1480192 1805312 1147904 778240 1284096
1269A284096k51904f3488r5232G26016k0480K26816r6256K2016O67648k45248
$$ 1284096 1032192 -63488 -158720 726016 705536 932352 836096 858112 1525760 1280512
1259A280512m56704P13728N8880D3008J195008c584A732096o21568M53632L03616
$$ 1280512 823808 1537536 1596416 43008 1238016 -3584 1732096 1110528 1564160 1867776
1249A867776m71040B02240Q44800L88096B82624Q01280j62816l7376k79040M7104
$$ 1867776 1396736 202240 1047040 1435136 282624 1083904 921088 883712 604672 651776
1239F51776K8672L03616l21536J10592B53952O11840j09568O90176A45408P57760
$$ 651776 680448 984064 662528 773120 253952 865792 756224 1446400 145408 903168
1229I03168F0928J553920A05472J270272n5296n18144O5536Q10496j65888R76384
$$ 903168 60928 1614848 105472 1375744 1320448 802304 867840 1678336 1512448 2488832
1219B488832C63008K49344B04288J473024E44768J58208J405440B5088R67168
$$ 2488832 363008 612352 204288 1677312 544768 702976 2108416 25088 992256
1210I92256R45664p28064E20192K56512J78688P54176F31296O71232J43360K71872
$$ 992256 1937920 1209856 520192 776704 955392 1709568 631296 1302528 1445888 1717760
1200A717760o10304E51936O05184N96480l22560m12160L49184J88416N32992l10784
$$ 1717760 1107456 551936 1157120 1753600 1431040 1018880 1368064 1556480 2089472 1778688
1190A778688J297408A283072P94624K49856L89632o80448J345024q69376j113088
$$ 1778688 3076096 1283072 2077696 2327552 2717184 2036736 3381760 2512384 1399296
1181A399296M13696N19680P4752n95968J44896M66944m23936O71232j42336J234432
$$ 1399296 1812992 2332672 2407424 1811456 1956352 2423296 1999360 2670592 2528256 3762688
1171C762688j069568M12160n8368P6288O1440L44064q44800P55200r01632M92032
$$ 3762688 2693120 3105280 3046912 3123200 3184640 3528704 2683904 3439104 2537472 3029504
1161C029504o43072J941504j778176o60480J926144r85600l45088A002496J050624
$$ 3029504 2386432 4327936 2549760 1889280 3815424 2829824 2484736 1002496 2053120
1152B053120A001472O03136p37280J53600l0720P71072j02912l04128K60096K19648
$$ 2053120 1001472 1604608 867328 1020928 990208 1761280 1658368 1354240 1614336 1833984
1142A833984n11488c10784B093568m34688n56544J033216p44960M83328q9088
$$ 1833984 1322496 -310784 2093568 1658880 1102336 2135552 1390592 1873920 1784832
1133A784832L08736o45632M03456o6560J790464A741312J072128m55168M23936
$$ 1784832 2093568 1447936 1851392 1784832 3575296 1741312 2813440 2358272 2782208
1124B782208L6864Q06912j38752L28704J434624Q91904o9120R3696m19840N95968
$$ 2782208 2819072 3625984 3487232 3815936 5250560 6142464 6073344 6167040 5747200 6343168
1114F343168n34016r3184Q40192j71008J327616R76384K7136K527744k29888K144768
$$ 6343168 5809152 5715968 6556160 6385152 7712768 8689152 8716288 11244032 11014144 13158912
1104A3158912K857472M706304J0761728K2539264J8868224J5620608P997440m1295872
$$ 13158912 16016384 20722688 31484416 54023680 72891904 88512512 96509952 55214080
1096E5214080k7201024j2323328o334464l165184k070528M83328k292736l34336
$$ 55214080 28013056 15689728 9355264 6190080 4119552 4602880 2310144 1975808
1088A975808k95936j62304j19808l7376J24928J133056l6352K60608K24256o43584
$$ 1975808 1679872 1517568 1397760 1360384 1485312 2618368 2582016 2842624 3066880 2423296
1078B423296B94912L11808N85216E92896o9632M97152C27680Q99584n87264e43232
$$ 2423296 294912 606720 1191936 592896 523264 1020416 327680 1227264 640000 -543232
1067G61344F9632J375744o74816B29888O79424D50560A62816Q32000B70336J10080
$$ 761344 69632 1445376 770560 229888 909312 450560 162816 994816 270336 380416
1057C80416e49888B93376M8128a05472E58592f93248C94240P66464A16736E5296
$$ 380416 -549888 293376 341504 -105472 558592 -693248 394240 1160704 116736 55296
1046d47488a2288C13344m8128P73120K94400h5504D6080M93056O68160f76352
$$ -447488 -12288 313344 265216 1038336 1332736 -85504 46080 539136 1207296 -676352
1035A86880K49856J63840k20672A2800R85600m51584g05024c02080r6256D36736
$$ 186880 436736 600576 379904 12800 998400 546816 -705024 -302080 -398336 436736
1024A26976k8160L95776R9840j58208k01216M70528A18784M83328L43040I6768
$$ 126976 98816 494592 594432 436224 235008 705536 118784 602112 945152 96768
1013C70176K67776B49344N86240I4720d52096A165824l56864b87744j46432B38592
$$ 370176 637952 249344 835584 94720 -452096 1165824 808960 -287744 -434176 238592
1002B49856j9968K72896j87904J24416A10592O45632j67936g8336G58272d47488
$$ 249856 229888 502784 314880 439296 110592 756224 588288 -78336 758272 -447488
991H12032c50720d4032D64384J024J37216a83296B84160L11296b49344F02112
$$ 812032 -350720 -44032 464384 465408 602624 -183296 284160 595456 -249344 602112
980c13856a21856b7136E30432E8880K10432N7344A25952L98848L26656e37088
$$ -313856 -121856 -27136 530432 58880 269312 326656 125952 524800 851456 -537088
969C89120n5296P22432C34848a34656B036224b27840E9392P3216N69344C2256
$$ 389120 333824 1056256 334848 -134656 2036224 -227840 59392 132608 701952 32256
958a76128H9088P96160C42016L86048C04128N20192M33152D34176d85888F30784
$$ -176128 89088 885248 342016 728064 304128 824320 1257472 434176 -485888 630784
947C5328L67104j90976Q43264b15040l06688E10464J83296a44896B56512J98656
$$ 35328 402432 211456 1054720 -215040 -521728 510464 693760 -144896 256512 455168
937D55168c81952a02400H85248l3792J41824m69504k55488G1680M00896e61664
$$ 455168 -381952 -102400 885248 851456 993280 523776 268288 71680 472576 -561664
926A95072N15584d8640m92544F24128d22912J42848k6112D22912J097216E01248
$$ 195072 710656 -48640 -541184 624128 -422912 -280064 -306176 422912 1520128 501248
915G36768B30400a57696F25664F4512a56160C04640m2496D8128d71552m74624
$$ 736768 230400 -157696 625664 64512 -156160 304640 262144 48128 -471552 -946176
905i46176a17760C94752j18784c09760j49504A37728i24672d04992J13664Q4992
$$ -946176 -117760 394752 275968 -309760 -459264 137728 -924672 -404992 -291328 -206336
895b06336G94624J91488k37568C72224J71008j77152a50016j00864h8576r34400
$$ -206336 794624 986112 748544 372224 543232 366080 -150016 -250880 -88576 -1022976
885a022976B99520a95584E48864a99168m46464H04864P76704d29568A80224M8128
$$ -1022976 299520 -195584 548864 -199168 -645632 804864 1581568 -429568 180224 228352
875B28352e4272A030144B20160K64704N9904j52576R66144a71520F26176g3216
$$ 228352 -54272 1030144 220160 484864 544768 392192 1358336 -171520 626176 -73216
864A015296J81248E87776A24928J086976d0448A63840J23392B4064J81248h89344
$$ 1015296 1196544 587776 124928 1211904 -40448 163840 287232 24064 205312 -889344
853E92384N06368r0112B62656M63360c80928F58944f57408A020416A25952a20320
$$ 592384 1098752 1008640 262656 726016 -380928 658944 -657408 1020416 125952 -120320
842A79200a31584F6048a19808I60512A65888Q39168D02432j79712I728K51904
$$ 179200 -131584 66048 -119808 960512 165888 1005056 402432 222720 9728 261632
832B61632a82784H67328L75808o01088j70496k05312Q30464i3696A720832B06848
$$ 261632 -182784 867328 1243136 642048 471552 266240 1096704 -93696 1720832 206848
821G04512N68832q6016j37728j21856j01888j61280C30752j03936J636864G58272
$$ 704512 1273344 1187328 1049600 927744 825856 664576 330752 226816 1863680 758272
810A960448q53504L31776j98144m95616a40800k31424l32800c13344A20832E5296
$$ 1960448 1106944 1438720 1240576 744960 -140800 -372224 -705024 -313344 120832 55296
799A75104J37216l0208a0240p18848H4992L67104a142784A063424A57184M75136
$$ 175104 312320 282112 -10240 -729088 84992 452096 -1142784 1063424 157184 632320
789F32320d32640A25952P47008d67968l69152B69312I0624O2976N94944l43552
$$ 632320 -432640 125952 872960 -467968 -837120 269312 90624 153600 748544 404992
779D04992K37056k81600F5024O63552L36384d05504p45472G51616b41152l41504
$$ 404992 642048 360448 65024 728576 1064960 -405504 -1150976 751616 -241152 -582656
769e82656F6560O42560c78880a45408f7584j00864A90464b75968k29376J94560
$$ -582656 66560 709120 -378880 -145408 -67584 -168448 190464 -275968 -505344 -310784
759c10784k89792B47808N56544c48672A56672K85184f30272J92000F9632c14368
$$ -310784 -600576 247808 804352 -348672 156672 441856 -630272 -438272 69632 -314368
748g10656H69888j30048b35008A65888a114624a83296A31072P70560g10144a67936
$$ -710656 869888 739840 -235008 165888 -1114624 -183296 131072 901632 -710144 -167936
737B49344L42016j03936R1648D5568c30752H02304d34688a02400j75616G20384
$$ 249344 591360 487424 579072 45568 -330752 802304 -434688 -102400 -278016 720384
726A56160O48704D3008L93728K05824I6256d30080J0752a55648j94048D68480
$$ 156160 804864 43008 436736 642560 96256 -430080 -419328 -155648 -349696 468480
715E62688e55520B80576A32608J81248f1952r34400J48992F62528k08384O9632
$$ 562688 -555520 280576 132608 313856 -61952 -996352 -847360 662528 454144 523776
705E23776h98048A34656L78368d39296D29056a09056r05216c13856k60608B8672
$$ 523776 -898048 134656 513024 -439296 429056 -109056 -1014272 -313856 -574464 28672
694c33312m9152C84512c08224p1168m04480a29536A55648h4992n28384C66080
$$ -333312 -382464 384512 -308224 -379392 -783872 -129536 155648 -84992 -613376 366080
683c30240j30560I73312e10976A12128B0480R6256O69696c20000C26144E9904
$$ -330240 -460800 973312 -510976 112128 20480 116736 786432 -320000 326144 59904
672c03104F29760f0928m02944j8432A98656a56160A47456L55328a9456C8912d11136
$$ -303104 629760 -60928 -463872 -482304 198656 -156160 147456 502784 -19456 38912 -411136
660B81088c26144A23904K30912o0928b88768a01376A04960g0656n08416I26208
$$ 281088 -326144 123904 354816 293888 -288768 -101376 104960 -70656 -579072 926208
649I8816J110016j38240f20032A17760J271808a16736r5232E95456f41024A02912
$$ 98816 1208832 1070592 -620032 117760 1389568 -116736 -211968 595456 -641024 102912
638d09600A56672G2704k048e78048C28192a22368o656m60800b78016m44928b32448
$$ -409600 156672 72704 70656 -578048 328192 -122368 -129024 -589824 -278016 -722944 -232448
626A84832J17760a181696d33664A092608A26464c16928e2224G99744B12992a92000
$$ 184832 302592 -1181696 -433664 1092608 126464 -316928 -52224 799744 212992 -192000
615h40704E12512a118208b43712G97696g73632l91168A62304a1776C24096M9664
$$ -840704 512512 -1118208 -243712 797696 -773632 -1164800 162304 -11776 324096 373760
605C73760e39648n03808k18624B25792L16416f86080a62304H0384K91840J57184
$$ 373760 -539648 -1043456 -1262080 225792 542208 -686080 -162304 80384 372224 529408
595E29408c63008C80928c8912H29952l79904d9664F15424g87456a08032a3312
$$ 529408 -363008 380928 -38912 829952 450048 -49664 615424 -787456 -108032 -13312
584g0656m23424a37728l39968E34528a57696n20192b80064q51968M86912a72544
$$ -70656 -494080 -137728 -477696 534528 -157696 -677888 -280064 -1132032 -645120 -172544
573B43200O9632b3552n06880B16064g55712A44384F3488K85184a99680E42720
$$ 243200 312832 -23552 -530432 216064 -755712 144384 63488 348672 -199680 542720
562c45600k7648J41312B87744F5024N0688J23392b14528B81088c00544D32640
$$ -345600 -373248 -231936 287744 65024 115712 239104 -214528 281088 -300544 432640
551B43712k5088a30560G12192k78016M60288D25984b81088I84576N632B27840
$$ 243712 218624 -130560 712192 434176 894464 425984 -281088 984576 990208 227840
540A116160E36064i6256G56736M04480r3696l61472Q704J7408b1504D0448J125888
$$ 1116160 536064 -96256 756736 1161216 1067520 706048 714752 732160 -21504 40448 1166336
529A166336A89952M77184M64384R16992p66976J013248j093120k55488l93216
$$ 1166336 189952 667136 1131520 2048512 1281536 2294784 1201664 946176 552960
520E52960G6800f53312H63744l31776j95072a13664A67424R0112f37952B54464
$$ 552960 76800 -653312 863744 531968 336896 -113664 167424 257536 -637952 254464
509a47968o6560O0416o50752A111552f4512m78720C38944a066496d49024j97632
$$ -147968 -214528 -154112 -804864 1111552 -64512 -543232 338944 -1066496 -449024 -646656
499f46656B66240c17440C44064O75328a25952l91168C27168a178624b61632C25632
$$ -646656 266240 -317440 344064 1019392 -125952 -517120 327168 -1178624 -261632 325632
488g41376P680h192A2800a71520k99520F55872b91328o2976e9392j536B78016
$$ -741376 -733696 -8192 12800 -171520 -471040 655872 -291328 -354304 -59392 -60928 278016
476f78400A2800c14880j5872k43712a41824F45632I5232b6112m86912C59936g05536
$$ -678400 12800 -314880 -330752 -574464 -141824 645632 95232 -26112 -513024 359936 -705536
464A104896C14880M74112c31776C32288d17792A38752d096p70048J83296G38816
$$ 1104896 314880 788992 -331776 332288 -417792 138752 -4096 -774144 -590848 738816
453b13504B83648q8576e42208K2528A42336K21696f51776A15200R99936D9664
$$ -213504 283648 195072 -542208 -519680 142336 364032 -651776 115200 1115136 49664
442a63328A47456h04352F29248L02592E1200a75104e632A02912b50368l10272
$$ -163328 147456 -804352 629248 931840 51200 -175104 -5632 102912 -250368 -560640
432e60640b36544E70368B84160r8816d43904G67488N18656F06720c42528G9360
$$ -560640 -236544 570368 284160 185344 -443904 767488 1286144 606720 -342528 79360
421c3792m41344j55136A052160D17792a65376o60480E14048k09920K88768a035264
$$ -33792 -475136 -630272 1052160 417792 -165376 -825856 514048 304128 592896 -1035264
410i85600a44384l46624a07520C95264a92512q2944F60480A43360J65888o4512
$$ -985600 -144384 -491008 -107520 395264 -192512 -275456 660480 143360 309248 244736
400B44736J39264a61792k560D19840d36736j00864A91488b33472A032192a40288
$$ 244736 384000 -161792 -164352 419840 -436736 -537600 191488 -233472 1032192 -140288
389g89504E34016n12a04960A09568J71008B6624d92544a56160l7376C69664j77664
$$ -789504 534016 533504 -104960 109568 280576 26624 -492544 -156160 -193536 369664 192000
378A92000L68640k50880L54816b70336C2256a79712D38784d76672m21888c9424
$$ 192000 560640 309760 664576 -270336 32256 -179712 438784 -476672 -898560 -39424
367G00928j50016a35680N6832G1168P03488c14368b0480I31840j42848b93888
$$ 700928 550912 -135680 -78848 71168 774656 -314368 -20480 931840 788992 -293888
356B60608O8096N32992i48736h704D70016g37280A37728e88288A140736a8432
$$ 260608 328704 861696 -948736 -8704 470016 -737280 137728 -588288 1140736 -18432
345C76832A07008L37920B0480b98496B16576i1648k85696n62688I37984B74944
$$ 376832 107008 444928 20480 -298496 216576 -91648 -377344 -940032 937984 274944
334A44896a56160j52576C58912e00224a30048q64256e6320l03104m40832A40288
$$ 144896 -156160 -308736 358912 -500224 -130048 -994304 -56320 -359424 -800256 140288
323A67424f06208D51072j57184q4480j9968a93536A029632K9696d83328A269760
$$ 167424 -606208 451072 293888 209408 189440 -193536 1029632 1059328 -483328 1269760
312b52928H33024i7792d7104A35168c29728H78592a255424C52256A64352c87072
$$ -252928 833024 -97792 -47104 135168 -329728 878592 -1255424 352256 164352 -387072
301b85696C95264O6560h4992p35232b19136p36256D51584r1648r8304c96288k7136
$$ -285696 395264 461824 -84992 -820224 -219136 -955392 451584 359936 261632 -396288 -423424
290d23424E41184F7072K44736A36192J60256A08544a51552B86720e41696a64352
$$ -423424 541184 67072 311808 136192 296448 108544 -151552 286720 -541696 -164352
279F7072a30048n62176b68800H85760A37216O8096L03616B5600J336320E99552
$$ 67072 -130048 -692224 -268800 885760 137216 205312 508928 25600 1361920 599552
268i65120c21024N0688D608e98528J30560h3456A23904e69344F40512a34144F83008
$$ -965120 -321024 -270336 4608 -598528 -467968 -83456 123904 -569344 640512 -134144 683008
256B61120J11104b68800F65088a701376G96672k67776B36032a022976A45920A4848
$$ 261120 372224 -268800 665088 -1701376 796672 528896 236032 -1022976 145920 14848
245d7104j33632A45920Q7552Q06400G7312P42912l47136b48832D77184Q45824
$$ -47104 -180736 145920 233472 1039872 77312 820224 473088 -248832 477184 1323008
235A323008G9872N93920C33312K32448N2736a230848F23616o2464d23936J24416
$$ 1323008 79872 673792 333312 565760 618496 -1230848 623616 561152 -423936 -299520
225b99520c072k37568A92000i7792B41152h23808G79776E6832O58944I0624g78240
$$ -299520 -3072 -240640 192000 -97792 241152 -823808 779776 56832 715776 90624 -778240
213C21024j29536J10080g00928D11136d4032A21856K2016c66592P7824j063424
$$ 321024 191488 301568 -700928 411136 -44032 121856 143872 -366592 -288768 -1352192
203a352192C68640f25664A92000b39616C27168A1264N4272g70048H62208A06496
$$ -1352192 368640 -625664 192000 -239616 327168 11264 65536 -770048 862208 106496
192D35712a60256F73280C02080c50208G21920A92000g22432J82784r19552e43232
$$ 435712 -160256 673280 302080 -350208 721920 192000 -722432 -539648 -1459200 -543232
181G20384p5264a91488a3312D16768i02144b25280o28224j6384B86720O85056
$$ 720384 645120 -191488 -13312 416768 -902144 -225280 -853504 -869888 286720 971776
171I71776e47328A096192n26848g37792A39264C3280J97632b07360A62304a89440
$$ 971776 -547328 1096192 569344 -737792 139264 33280 230912 -207360 162304 -189440
160B82112A16224b67264F40000g01440B03264Q01792C12832a68448D07552I9840
$$ 282112 116224 -267264 640000 -701440 203264 1005056 312832 -168448 407552 99840
149f35904F17472A55648c69152G3728d94080K25280l072G96672e1712G58272b6112
$$ -635904 617472 155648 -369152 73728 -494080 -268800 -271872 796672 -51712 758272 -26112
137C61472Q43264a40288f5536B9696N20704g53664k03264L45088E58080i4720
$$ 361472 1204736 -140288 -65536 29696 550400 -753664 -956928 -611840 558080 -94720
126a090560K95936A75104o9120P94112f33344F86592g0144B2016J623552D9152
$$ -1090560 -794624 175104 105984 900096 -633344 686592 -70144 22016 1645568 49152
115g48032E74464G3216K80576A01888M09600O02112a61280F26176b90816D95616
$$ -748032 574464 73216 353792 101888 511488 1113600 -161280 626176 -290816 495616
104H0896f24640k05312k37568D21376j33120H7040c75296e12m84864a43360A328640
$$ 80896 -624640 -829952 -1067520 421376 288256 87040 -375296 -512 -485376 -143360 1328640
92a12640F07232n632a92512D42368f63040H89344a96096E88800h4480K7648b3552
$$ -112640 607232 601600 -192512 442368 -663040 889344 -196096 588800 -84480 -56832 -23552
80A04960a69984E7344M57728J02912h55040L79392A0240M78208A76640b65216
$$ 104960 -169984 57344 515072 617984 -855040 -475648 10240 488448 176640 -265216
69B74944a019392b30912E43232j05984j5360c89632l22560D63360m4032f79936
$$ 274944 -1019392 -230912 543232 437248 421888 -389632 -712192 463360 419328 -679936
58c63008J35680D50560H192L49696j76128c60448G42400b48832J3824A184256
$$ -363008 -227328 450560 8192 357888 181760 -360448 742400 -248832 -235008 1184256
47d5056o05696A53088O42048L68640b20672p01952d21376A055744n08416j41312
$$ -45056 -650752 153088 795136 1163776 -220672 -922624 -421376 1055744 547328 406016
37D06016A23392h9600D04480Q43776E29408n5808B28352J82784L63520j37216
$$ 406016 123392 -89600 404480 1248256 529408 473600 228352 411136 774656 637440
27F37440k00704N12A18784g68000J88928b45760A63328J34144e13024G59296A31072
$$ 637440 436736 437248 118784 -768000 -579072 -245760 163328 297472 -513024 759296 131072
15H21248c32288C12832e50912E18144j33632a92512J536D40320B06848a23904
$$ 821248 -332288 312832 -550912 518144 384512 -192512 -190976 440320 206848 -123904
4a391104c40480E72928j63328e64224
$$ -1391104 -340480 572928 409600 -564224
##END=
