##TITLE=1201
##JCAMPDX= 6.0         $$ Bruker NMR JCAMP-DX V2.0
##DATA TYPE= NMR SPECTRUM
##DATA CLASS= XYDATA
##ORIGIN= NUTS EXPORT
##OWNER= Administrator
$$ 1.72 TOPSPIN		Version 2.1
$$ 2016-02-23 12:17:26.355 -0800  Administrator@X
$$ Compression mode = diff/dup
##.OBSERVE FREQUENCY= 90.275459
##.ACQUISITION MODE= SIMULTANEOUS (DQD)
##.ACQUISITION SCHEME= undefined
##.AVERAGES= 16
##.DIGITISER RES= 22
##SPECTROMETER/DATA SYSTEM= 
##.PULSE SEQUENCE= zg30
##.SOLVENT NAME= None
##.SHIFT REFERENCE= INTERNAL, None, 1, 14.36919
##AUDIT TRAIL= $$ (NUMBER, WHEN, WHO, WHERE, PROCESS, VERSION, WHAT)
$$ ##TITLE= Audit trail, TOPSPIN		Version 2.1
$$ ##JCAMPDX= 5.01
$$ ##ORIGIN= Bruker BioSpin GmbH
$$ ##OWNER= Administrator
$$ $$ E:/data/jwist/nmr/1201/1/pdata/1/auditp.txt
$$ ##AUDIT TRAIL=  $$ (NUMBER, WHEN, WHO, WHERE, PROCESS, VERSION, WHAT)
(   1,<2016-02-23 08:00:13.746 -0800>,<Administrator>,<X>,<jcamp>,<TOPSPIN 2.1>,
      <fromjdx created from
       E:\data\jwist\nmr\uniandes\1201
       data hash MD5: 8K
       F8 81 14 D1 03 40 04 38 6A DA 1C EF E4 A8 E6 02>)
$$ ##END=
$$ 
$$ $$ hash MD5
$$ $$ F4 39 E1 A3 22 C8 3F CA 12 64 F0 30 71 AD BF AE
##$RELAX= 
$$ Bruker specific parameters
$$ --------------------------
##$DU= <E:>
##$EXPNO= 1
##$NAME= <1201>
##$PROCNO= 1
##$TYPE= <nmr>
##$USER= <jwist>
##$ACQT0= 0
##$AMP= (0..31)
100 100 100 100 100 100 100 100 100 100 100 100 100 100 100 100 100 100
100 100 100 100 100 100 100 100 100 100 100 100 100 100
##$ANAVPT= 1
##$AQSEQ= 0
##$AQ_mod= 3
##$AUNM= <au_zg>
##$AUTOPOS= <>
##$BF1= 90.275459
##$BF2= 400.02
##$BF3= 400.02
##$BF4= 400.02
##$BF5= 400.02
##$BF6= 400.02
##$BF7= 400.02
##$BF8= 400.02
##$BYTORDA= 0
##$CFDGTYP= 0
##$CFRGTYP= 0
##$CHEMSTR= <none>
##$CNST= (0..63)
1 1 145 1 1 1 1 1 1 1 1 1 1 1 1 1 1 1 1 1 1 1 1 1 1 1 1 1 1 1 1 1 1 1 1
1 1 1 1 1 1 1 1 1 1 1 1 1 1 1 1 1 1 1 1 1 1 1 1 1 1 1 1 1
##$CPDPRG= <>
##$CPDPRG1= <>
##$CPDPRG2= <>
##$CPDPRG3= <>
##$CPDPRG4= <mlev>
##$CPDPRG5= <mlev>
##$CPDPRG6= <mlev>
##$CPDPRG7= <mlev>
##$CPDPRG8= <mlev>
##$CPDPRGB= <>
##$CPDPRGT= <>
##$D= (0..63)
0 1 0 0 0 0 0 0 0 0 0 0 0 0 0 0 0 0 0 0 0 0 0 0 0 0 0 0 0 0 0 0 0 0 0 0
0 0 0 0 0 0 0 0 0 0 0 0 0 0 0 0 0 0 0 0 0 0 0 0 0 0 0 0
##$DATE= 0
##$DBL= (0..7)
120 120 120 120 120 120 120 120
##$DBP= (0..7)
150 150 150 150 150 150 150 150
##$DBP07= 0
##$DBPNAM0= <>
##$DBPNAM1= <>
##$DBPNAM2= <>
##$DBPNAM3= <>
##$DBPNAM4= <>
##$DBPNAM5= <>
##$DBPNAM6= <>
##$DBPNAM7= <>
##$DBPOAL= (0..7)
0.5 0.5 0.5 0.5 0.5 0.5 0.5 0.5
##$DBPOFFS= (0..7)
0 0 0 0 0 0 0 0
##$DE= 6.5
##$DECBNUC= <off>
##$DECIM= 2432
##$DECNUC= <off>
##$DECSTAT= 4
##$DIGMOD= 1
##$DIGTYP= 12
##$DL= (0..7)
0 120 120 120 120 120 120 120
##$DP= (0..7)
150 150 150 150 150 150 150 150
##$DP07= 0
##$DPNAME0= <>
##$DPNAME1= <>
##$DPNAME2= <>
##$DPNAME3= <>
##$DPNAME4= <>
##$DPNAME5= <>
##$DPNAME6= <>
##$DPNAME7= <>
##$DPOAL= (0..7)
0.5 0.5 0.5 0.5 0.5 0.5 0.5 0.5
##$DPOFFS= (0..7)
0 0 0 0 0 0 0 0
##$DQDMODE= 0
##$DR= 22
##$DS= 2
##$DSLIST= <SSSSSSSSSSSSSSS>
$$ [...]
##$SPOFFS= (0..31)
0 0 0 0 0 0 0 0 0 0 0 0 0 0 0 0 0 0 0 0 0 0 0 0 0 0 0 0 0 0 0 0
##$SUBNAM0= <"">
##$SUBNAM1= <"">
##$SUBNAM2= <"">
##$SUBNAM3= <"">
##$SUBNAM4= <"">
##$SUBNAM5= <"">
##$SUBNAM6= <"">
##$SUBNAM7= <"">
##$SUBNAM8= <"">
##$SUBNAM9= <"">
##$SW= 20.5580556627758
##$SWIBOX= (0..15)
0 0 3 4 0 0 0 0 0 0 0 0 0 0 0 0
##$SW_h= 8223.68421052631
##$SWfinal= 0
##$TD= 65536
##$TD0= 1
##$TE= 300
##$TE2= 300
##$TE3= 300
##$TEG= 300
##$TL= (0..7)
0 120 120 120 120 120 120 120
##$TP= (0..7)
150 150 150 150 150 150 150 150
##$TP07= 0
##$TPNAME0= <>
##$TPNAME1= <>
##$TPNAME2= <>
##$TPNAME3= <>
##$TPNAME4= <>
##$TPNAME5= <>
##$TPNAME6= <>
##$TPNAME7= <>
##$TPOAL= (0..7)
0.5 0.5 0.5 0.5 0.5 0.5 0.5 0.5
##$TPOFFS= (0..7)
0 0 0 0 0 0 0 0
##$TUNHIN= 0
##$TUNHOUT= 0
##$TUNXOUT= 0
##$USERA1= <user>
##$USERA2= <user>
##$USERA3= <user>
##$USERA4= <user>
##$USERA5= <user>
##$V9= 5
##$VALIST= <valist>
##$VCLIST= <CCCCCCCCCCCCCCC>
##$VD= 0
##$VDLIST= <DDDDDDDDDDDDDDD>
##$VPLIST= <PPPPPPPPPPPPPPP>
##$VTLIST= <TTTTTTTTTTTTTTT>
##$WBST= 1024
##$WBSW= 4
##$XGAIN= (0..3)
0 0 0 0
##$XL= 0
##$YL= 0
##$YMAX_a= 1419338496
##$YMIN_a= -2179744.256
##$ZGOPTNS= <>
##$ZL1= 120
##$ZL2= 120
##$ZL3= 120
##$ZL4= 120
##$ABSF1= 10
##$ABSF2= 0
##$ABSG= 5
##$ABSL= 3
##$ALPHA= 0
##$AQORDER= 0
##$ASSFAC= 0
##$ASSFACI= 0
##$ASSFACX= 0
##$ASSWID= 0
##$AUNMP= <proc_1d>
##$AXLEFT= 0
##$AXNAME= <>
##$AXNUC= <off>
##$AXRIGHT= 0
##$AXTYPE= 0
##$AXUNIT= <>
##$AZFE= 0.1
##$AZFW= 0.1
##$BCFW= 1
##$BC_mod= 2
##$BYTORDP= 0
##$COROFFS= 0
##$CY= 15
##$DATMOD= 1
##$DC= 2
##$DFILT= <>
##$DTYPP= 0
##$F1P= 0
##$F2P= 0
##$FCOR= 0.5
##$FTSIZE= 0
##$FT_mod= 4
##$GAMMA= 1
##$GB= 0
##$INTBC= 1
##$INTSCL= 1
##$ISEN= 128
##$LB= 0.3
##$LEV0= 0
##$LPBIN= 0
##$MAXI= 10000
##$MC2= 0
##$MEAN= 0
##$ME_mod= 0
##$MI= 0
##$NCOEF= 0
##$NC_proc= -9
##$NLEV= 6
##$NOISF1= 0
##$NOISF2= 0
##$NSP= 1
##$NTH_PI= 0
##$NZP= 0
##$OFFSET= 14.36919
##$PC= 1
##$PHC0= 0
##$PHC1= 0
##$PH_mod= 0
##$PKNL= yes
##$PPARMOD= 0
##$PPDIAG= 0
##$PPIPTYP= 0
##$PPMPNUM= 2147483647
##$PPRESOL= 1
##$PSCAL= 4
##$PSIGN= 0
##$PYNMP= <proc.py>
##$REVERSE= no
##$SF= 90.2741618329666
##$SI= 8192
##$SIGF1= 0
##$SIGF2= 0
##$SINO= 400
##$SIOLD= 32768
##$SPECTYP= <>
##$SREGLST= <1H.CDCl3>
##$SSB= 0
##$STSI= 0
##$STSR= 0
##$SW_p= 1497.18866228788
##$SYMM= 0
##$S_DEV= 0
##$TDeff= 0
##$TDoff= 0
##$TI= <>
##$TILT= no
##$TM1= 0
##$TM2= 0
##$TOPLEV= 0
##$USERP1= <user>
##$USERP2= <user>
##$USERP3= <user>
##$USERP4= <user>
##$USERP5= <user>
##$WDW= 1
##$XDIM= 8192
##$YMAX_p= 1419338240
##$YMIN_p= -2179584
##$CURPLOT= <PDFCreator>
##$CURPRIN= <$PDFCreator>
##$DFORMAT= <normdp>
##$LAYOUT= <+/1D_H.xwp>
##$LFORMAT= <normlp>
##$PFORMAT= <normpl>
##$SURQMSG= 1
$$ End of Bruker specific parameters
$$ ---------------------------------
##XUNITS= HZ
##YUNITS= ARBITRARY UNITS
##XFACTOR= 0.182762287876938
##YFACTOR= 1
##DELTAX= -0.182762287876938
##NPOINTS= 8192
##FIRSTX= 1497.0059
##FIRSTY= -1044480
##LASTX= 0
##MAXY= 1419338240
##MINY= -2179584
##XYDATA= (X++(Y..Y))
8191 -1044480 1127936 -137216 1338880 -351744 -62976 -429056 -264704 179712 242176 654336
8181 654336 -828928 904192 -569344 102400 -850944 68096 -84992 23040 315904 -1189888
8170 -453632 1080832 575488 515584 53248 340480 -275968 96256 602624 660992 -1003520
8159 27648 -42496 391168 -227840 -159232 31744 -466432 -585216 -583680 -133120 228352 -53760
8147 309248 875520 579072 1358336 -602112 707072 579072 -834560 -462336 -509440 548864
8136 762880 -168448 -64000 -326656 -599040 105984 223232 480768 -486400 371200 -885760
8125 1278976 979968 1373184 -809472 276480 299008 -264704 213504 444416 -203776 648704
8114 83456 -646144 -403968 -487936 -680960 78848 -111104 124416 364032 -770048 -1652736
8104 -1652736 1041408 -192000 751616 -796672 -6656 -656384 891392 622080 115200 -176640
8093 104960 -1302528 156160 39424 -1226240 69632 610816 -543744 808448 -121856 1245184
8082 -1207808 633856 -380928 -436224 -737792 310784 -468992 -863232 1471488 406016 -1225728
8071 347136 -1068544 66048 1048576 55808 84992 867840 -1696768 293376 178176 556544
8061 556544 132096 -1106944 -47104 -984064 687104 413696 -544768 223232 302592 182272
8051 182272 -574464 37888 -1147904 -207872 275968 -444928 31744 496640 -626176 -126464
8040 -2179584 107008 -83968 -232960 -673280 -294912 -98816 610304 -1016832 -1402880 722944
8029 -549888 228864 -717312 -496640 406528 -378880 462848 -433152 435712 -109568 -222720
8019 -222720 11264 435200 -781824 -559616 506880 -748544 -242688 -1008640 462336 -678912
8008 79872 -65536 -527360 -525312 -779264 -8192 51200 -565248 1005056 -1306624 -1116160 230912
7996 32256 -81408 -186880 -453632 817664 -390144 -151040 -266240 281088 -771584 -1482752
7986 -1482752 -849408 66560 -268800 -373760 -305152 -743424 -499712 484864 5632 492544
7976 492544 -765440 -586240 -748032 571904 -355328 314880 -119296 -432128 345600 -312832
7965 -229376 -223744 -351744 -197120 -1110016 -158720 381952 -261120 746496 760832 460800
7955 460800 -141824 16896 200704 113152 529920 -1041408 -186368 -207872 291328 254976
7945 254976 -168960 -235520 -167936 -796160 -618496 2560 -352768 80384 994816 -643072 -20992
7933 161280 1303552 248832 -1130496 343552 -129024 107008 -839680 -156160 320512
7923 -382976 -162304 -950784 -504320 -366080 -78848 -137728 -247808 658944 -354816 -399360
7913 -399360 968192 658944 50688 827904 367616 -399872 -360448 105984 -1156096 -166400
7902 521216 186368 -435200 120832 928768 947200 -584192 648704 -1116160 584192 -230912
7891 72192 -80384 26112 -387584 -334848 294400 -301568 -1574912 98304 87040 22016 -735744
7879 -235520 -318976 414720 -258560 -463360 -4096 -31744 73216 110080 287744 0 -548352 -732672
7867 -732672 -601600 150016 296960 1000960 1207808 -43520 -476672 -482304 -777728 473600
7856 477184 -159232 799232 225280 -1290752 200192 23552 281088 -906240 652288 -148992
7845 -711168 788480 444416 438784 176640 222208 -419328 1056768 -570368 501248 -209408
7834 -522240 -26112 462336 -310784 238592 -10240 57856 -129536 -584192 -278528 375296
7823 25600 -267776 -193024 416256 -397824 -698368 -536064 -212480 440832 466432 -388096
7812 -283136 679936 -671232 -910848 -314880 -969728 -123392 -550400 -289280 -366592 -216576
7802 -216576 263680 -372736 -725504 -245760 221184 128512 336896 -983552 949760 -385536
7791 85504 -306688 -13824 634368 -428032 1016320 -1536 381440 217088 -90112 3072 -23040
7779 363520 -70144 28160 13824 454144 79872 -599552 -114176 -472576 -120320 698368
7768 -548864 -429568 216064 -515584 615424 -103424 402944 -349696 -5632 478208 212480
7757 -104448 -439296 -200192 -126464 -655360 402432 -423936 -871424 370688 722432 -920576
7746 -71168 141312 -308736 -1519616 -367104 593920 -39424 -384000 773120 -412160 -103424
7735 -762880 161792 181760 855040 -650752 200704 756224 -77312 -219648 418304 598528
7725 598528 400384 -494080 -230912 -228352 177664 502272 590336 -144896 -89088 125952
7714 -66048 -217088 262144 -409600 1571840 300032 26624 696320 -126464 -230400 175104
7703 -101376 358912 -822272 -907776 -206336 189440 1168896 -332800 -351744 132608 209920
7693 209920 -628736 -610816 880128 727040 3584 352768 242176 -105984 270336 184832
7683 184832 -475136 112640 -364032 -1027072 197120 -540672 513536 -65536 405504 -452608
7672 -1240064 -727552 -135680 1100800 -18944 -160256 -675840 -690176 -89600 127488 -723456
7661 131072 -568320 47616 23040 -623104 -126976 1010688 98816 256000 -1434624 -288768
7650 384512 -603648 316416 350720 -112128 604672 512000 -863744 -591872 -208384 -535040
7640 -535040 -612864 -517120 494080 -126464 300032 -916992 492032 1069568 344576 342528
7630 342528 -179200 432640 529920 274944 27136 -216064 788992 927744 -314368 -1253376
7620 -1253376 545280 247808 -158720 592384 1455616 67584 708608 186880 -302080 -190464
7610 -190464 -280576 -658944 342016 -240128 28160 -309760 34304 -542208 273408 -51712
7599 512000 664576 205312 115712 -927744 -482304 821248 8192 97792 99328 -130048 -542208
7588 -542208 461824 200704 -377856 467968 -1016320 -201728 -31744 5632 367616 285696
7578 285696 -106496 -433664 542720 -592896 405504 -481280 -301056 -128000 395264 -797696
7567 -194560 -290816 -150528 797184 1149440 -273920 211456 -1320448 571904 225280 998912
7557 998912 -541696 223744 -80384 607232 651776 605184 337408 170496 -651264 -691200
7547 -691200 -69632 -772608 -924160 -457728 1347072 -481792 -6656 371712 -1022464 -1191424
7537 -1191424 925696 599552 -829952 56832 -1040896 204800 276992 -168448 -161280 -349184
7527 -349184 -599552 390144 -294400 -1260544 -54272 131072 -659456 246784 -5120 -7680 426496
7515 -62976 18944 -470528 -142336 -571392 -144896 -316416 -359424 -290816 -173056 -152576 -533504
7504 -533504 157184 -503808 189440 -372224 1024 410112 -335360 -343040 -330240 -916992 487936
7492 -513536 -365056 -1005056 393216 698880 823296 415232 -514560 547328 -531968 305152
7481 689152 206336 312832 -124928 -402432 -716288 1179648 -247296 260608 -113664 -1413632
7471 -1413632 729600 922624 78336 454144 -571904 123904 -142848 -459264 297984 -357376
7460 -208896 556544 -121856 673280 220160 -565760 -271360 -232960 -269824 145408 -792576
7449 284160 -403456 287744 -723968 856064 -7680 -421888 103424 173056 1176064 -357888
7438 -1197056 -603136 -484352 591360 218624 -1730560 -278528 -342016 -120320 -1084928 -676864
7428 -676864 -932864 -493568 398336 -139264 -912384 -46080 -1317376 300032 -316416 -307712
7418 -307712 488960 452608 -418816 468480 -309760 -148992 -141824 285696 -147456 -441344
7408 -441344 158208 -507904 1137664 411136 396800 269312 536576 -294400 -1091072 -1007616
7398 -1007616 -334336 217600 -395264 -585216 306176 -118272 -81408 -17408 -408064 632320
7387 -841216 375808 620544 72704 497152 344576 -197632 406528 706560 -301568 730112
7376 -599040 101888 -246272 -194048 1116160 -364032 -420864 -60416 433664 -778752 -187392
7365 431616 -497152 -252928 -34304 38400 506880 967680 -347648 -477184 156160 -1021440
7354 626688 -210944 -380928 -133632 -1036800 -204288 220160 -66560 731648 -721920 -1122816
7344 -1122816 -287744 598528 -730112 -88576 345600 188928 29696 -41984 100352 1279488
7334 1279488 763904 -257024 -394752 -627200 187392 636416 447488 -1035264 258048
7324 -210944 332800 491520 258048 -535040 -188416 727040 665088 -381440 -585216 2048
7313 -716288 942080 -32768 -240128 352768 -43520 953856 -617472 619520 -564736 -780288
7303 -780288 1198080 406528 335872 -696320 202752 -540160 179712 83968 78848 -808448
7292 0 -176128 560128 55296 -604160 -153600 -368128 202240 271872 185344 -1080320 544768
7280 1225728 -406528 700928 160256 -520192 -386560 -170496 -247808 -543744 1516032 -395264
7269 1327104 682496 -195072 -443392 138240 -488448 -551936 45568 55808 1705472 -46080
7258 -574976 -444416 392704 -196608 -683008 959488 219136 -197632 -455168 -72192 -777216
7248 -777216 261632 -462336 -235008 -25600 -877056 -354816 284672 1015808 -1809920 -231424
7237 -221184 -312320 835584 -414208 1102336 549888 497152 -704000 487936 -350208 246272
7226 -146432 204800 -1531904 -556544 -834048 -706560 -809984 274432 532992 238080 -57344
7215 99840 560640 -207872 -995840 177152 1013248 208384 -885248 -392192 716800 -7680
7204 -345600 -169984 -195072 291328 271872 255488 -1115136 117248 -1517568 -295936 -178176
7194 -178176 493568 -637952 485888 32768 863232 -772096 -324096 97280 339456 -551424
7183 124928 -961024 -308736 601600 896512 -440320 440320 548352 -445440 1043968 -1209344
7172 -198656 -289792 478720 -134656 -229376 394240 893440 -1061376 -55296 -486400 -525312
7162 -525312 77312 389120 -297984 149504 -95744 -319488 -129536 123392 3584 1054720
7152 1054720 187904 -419328 -508416 650752 -584192 378880 27648 -570880 1111552 -1076224
7141 -93184 556032 458752 58880 -730112 438784 220160 -194048 -794112 162304 -312320
7130 541184 -803328 306176 -403456 174592 -399360 -145920 689152 -82944 -357376 -434176
7120 -434176 -233984 494080 -14848 212992 -125440 148992 667648 61952 457728 711680
7110 711680 868352 602624 1014784 50176 -60416 -839168 -1051136 105984 752128 -1216512
7099 104960 580096 284160 -295424 104448 -363520 150528 -278016 329728 -604160 -57856
7088 212992 -124928 -466432 161280 -415744 -567296 228864 -427520 218112 861184 160768
7077 490496 853504 388096 1102848 479744 176640 1461760 -176640 646656 343552 308224
7067 308224 164352 -421888 70656 -16384 428544 198144 483328 934912 -268800 -578560
7057 -578560 1286144 534528 1158144 -699904 -117760 -51712 -297472 -121344 194560 -744448
7046 -74752 -583168 -263680 -136192 -217088 -843264 -272896 629760 859136 628736 396288
7036 396288 525312 -324096 -513024 -63488 -591872 1158144 1237504 -495104 369152 347648
7026 347648 967168 -458752 -497152 -376832 308224 450560 161280 -246784 -604160 -331264
7016 -331264 -231936 308224 18432 527360 525312 390144 1142784 527872 -262656 -126976
7005 457728 -598016 -535040 -196608 -832000 -174080 -371200 -393728 542720 -94208 127488
6994 -307200 -167936 -369664 -512 192000 -26624 1021952 -489472 196608 209920 758784
6984 758784 -296448 2108416 -8704 -36352 129536 -190976 -14336 1024000 413696 -851456
6973 -16384 898560 750592 -859648 465408 -61952 -360960 -86528 47104 -492544 -32256 -441344
6962 -441344 302080 -293376 -228864 44032 384512 -595968 -790528 621568 -65536 -9216 882176
6950 -281088 -1177088 -370688 248320 750592 98816 702464 360448 396288 -394240 935424
6939 -782848 -991232 -359424 739328 -985088 -425472 601600 -427008 1042432 43520 -750592
6928 844288 169472 568320 -26112 -723456 205824 354816 1314304 -224256 -768000 -316416
6917 299520 -64000 328192 579072 -108032 -305664 -325632 51200 699392 -685056 -634368
6907 -634368 392704 205312 54784 -1231872 -281088 568320 -288256 217600 -135168 89088
6896 -287232 759808 -172032 -436224 -203264 -215040 -502272 -324096 492032 -580608 -357888
6886 -357888 755200 785408 269824 -475648 -463872 649216 -28672 1065472 946688 387584
6875 165376 -769024 446464 512512 165376 -90624 819712 0 89088 -450048 -368640 -134144
6863 146432 -570880 -563712 -776704 -78848 203264 -489984 740864 1000448 499712 15872
6852 -332288 -386048 -1085952 -412160 33280 613376 37888 27648 419328 834048 -951808
6841 121856 28672 24064 -826368 -470528 814592 44544 -230912 231424 897024 -136192
6830 110080 -273920 423936 -180736 262144 1220096 330752 446976 1203200 273408 -366592
6819 722944 175104 106496 -503296 -254976 -528896 447488 -139776 312320 -32768 -885760
6809 -885760 437248 298496 -205312 -502272 145408 -275968 152064 642560 -169984 385024
6798 -515072 153088 -475648 506880 -936448 -375808 199168 136704 2560 -67072 -230912
6788 -230912 147456 -26624 90112 12288 513536 -468992 -73728 727552 394752 769536
6778 769536 501760 -401408 612352 465920 883200 -125952 -359424 -271872 -75776 -884224
6768 -884224 560640 -185856 1333760 -33280 666624 475648 -254976 164864 375808 375808 -370688
6756 103424 -1025024 -696320 -474112 7168 116224 -303616 -252416 337408 708608 -282112
6745 93696 486912 1520128 294400 515584 -885760 -261120 269312 -98816 -465408 830464
6734 -71680 -799232 -18432 -122368 571904 368640 -130560 -571392 62976 73216 -71680 662528
6722 278528 -652800 713216 509952 -24064 712704 -792576 126464 829440 -38400 -299520
6712 -299520 687104 395264 -114688 -171008 348672 -559616 135680 879104 173056 -270848
6701 -193024 -7168 -746496 722432 -738304 -11264 290816 136704 672256 146432 -64512
6690 95744 762880 256000 242688 -495616 -272384 338944 -1385472 299008 262656 128000
6679 -298496 -107008 -295936 -576000 80896 16896 -346112 112640 881152 326656 -1384448
6668 308224 84992 -245760 300032 61952 1029632 12288 -1080320 328192 262656 251904
6658 251904 250368 115200 732160 -1019904 -626688 59904 -197120 -673792 405504 -4608
6647 503808 423424 -608768 335360 417280 215040 -673792 272384 -16384 806400 392704
6636 -400384 975872 -274432 292352 -37888 -154112 963072 -124416 454144 250368 755712
6626 755712 243200 -263168 46080 110080 -525824 -462848 358912 -1169408 510976 629248
6616 629248 -1058816 -254464 -491520 549376 258560 338432 -207360 -418816 14848 -1196032
6605 1178624 84992 -568320 6656 -162816 162304 661504 -404480 -253440 150016 266752
6595 266752 226304 793600 -841728 528384 376320 944640 -1485824 -118272 295936 68608
6584 -187904 334848 600064 486912 -187904 752128 479232 -112128 -425472 132096 68608
6574 68608 1077248 273408 224768 -425472 7680 -678400 -293888 -133632 828416 683008
6564 683008 -3584 130560 -162816 670208 -707072 241664 197120 -99840 -565760 793600
6553 596992 248832 -684032 1048576 86016 -26112 1012224 -434176 1322496 -1214464
6543 372224 205824 167936 -1009152 -309248 403456 819200 591872 -315904 -455168 190464
6532 576512 191488 78336 866816 64512 -136704 194560 504832 119296 -77824 322048
6521 612864 -97280 493568 77312 680448 1019392 593920 5632 -230400 465920 180224
6510 -672256 422912 109056 -415232 -1303040 -549888 -32256 567296 -60928 -184832 245248
6499 -160768 266752 -249856 1377280 199168 937984 -718336 -582144 -171520 -744448 -103936
6488 1085440 -284160 591360 862208 843264 30720 -196096 -225280 540672 363520 168960
6477 -726528 630784 11776 -312320 -64512 584704 631808 866816 167424 -156160 -216576
6467 -216576 -732672 -46592 717312 1252352 379392 719872 -331264 119808 274432 478720
6457 478720 -537088 -727552 1795584 663552 -13312 -54784 395264 190464 298496 73728
6446 437248 67072 -154624 212480 190976 276992 635904 414720 1086976 -851456 -265216
6435 -141824 545280 -421888 1616896 311296 754688 -693248 -654848 871936 -1021440 -260096
6424 664576 771072 333824 -997376 -669696 33280 472064 479744 498688 602112 537088 -20480
6412 82432 -379904 256512 481280 -192000 555520 821760 782336 931840 701440 -186880
6401 196608 289280 175104 375296 422912 -446976 1847296 807424 1236992 798720 294912
6390 372736 470528 685568 786944 100864 -626688 695808 -390144 194048 144384 507392
6380 507392 29184 -331264 -417792 -83456 1181696 448512 460800 100352 -55808 -698368
6370 -698368 220160 560640 395776 787968 613376 -716288 321536 24576 -271360 1048064
6359 264704 427008 -296960 245248 357376 492032 1125888 -364544 150528 255488 -974336
6348 1269248 237568 -79360 52736 -232960 836608 266240 364032 -257536 -921088 811008
6337 -145408 1022976 321536 245248 869888 -1112064 -589312 607232 677376 367616 309248
6327 309248 -581120 185856 649216 -368128 -694784 915456 -96256 1757696 -5120 -516096
6317 -516096 379392 601088 299520 138240 271872 -1385472 -438272 501248 -710656 179712
6306 371200 -173568 230912 -753664 749568 -825856 1106432 -118784 -81920 1121792 -51200
6295 559616 117248 647680 501760 1465344 111104 -42496 498688 -402944 1031680 242688
6284 259584 -702464 -326144 381952 -527360 -158720 82944 225280 554496 1001472 -843264
6273 -597504 564224 184832 896512 445952 143360 136192 -1047040 701440 -190976 495616
6262 -120832 -253440 -154112 -359424 481792 -671744 -714752 482816 60416 882176 1172480
6252 1172480 131072 1209344 78848 599040 -677376 90112 613376 576000 1043456 1085952
6242 1085952 321536 -108032 925696 680960 -4608 796672 65024 -12288 -278528 -943616
6232 -943616 -478208 -434688 640512 175616 -427520 985600 30720 82944 -45568 -206848
6222 -206848 -411136 -81408 -134656 -372736 665600 149504 738304 -865280 -282624 138240
6211 604672 -171008 628736 294912 338944 779264 -550400 332288 -391168 -637440 1389568
6200 -402432 1522688 -404480 -585216 787456 1393664 744448 -321024 -122880 899584 220160
6189 1108480 -810496 701440 95232 440832 -71168 852992 142848 245760 526848 153088
6178 115712 135680 -425984 -294400 704512 1008128 567296 351744 1442816 170496 -643072
6167 227328 300032 -151040 84480 208384 1090560 679424 576512 -487936 26112 12800
6156 18944 -113152 -257024 425472 59904 -33792 395264 -496640 -138240 -899072 -185344
6145 356864 -353792 806400 68608 328192 -259072 -357376 343552 -12800 -195584 825856
6134 19456 514048 -28672 517632 829952 -112640 -337408 764416 -407552 1104384 803328
6124 803328 -322048 146944 -181760 638464 729088 199680 -921088 -546304 787968 -83968
6113 417792 -38400 -415232 -185344 663552 1074176 628224 -1201664 321024 -603136 -631296
6103 -631296 242176 696320 796672 103936 -228352 10752 748032 1089536 543232 763392
6093 763392 124416 77312 -523264 865792 -960512 758784 1086464 -558080 298496 1277952
6083 1277952 695808 824320 179712 580096 236032 531456 -63488 662528 -763904 82944
6072 1130496 436736 393728 406528 -395264 -747008 -300544 72704 481792 -744448 -23040
6061 1035264 281600 107520 97280 130560 -829440 2073088 963584 -461824 -836096 -377344
6050 193024 89088 32256 160768 -274432 -190976 442368 169984 -58368 654848 1153536
6040 1153536 644096 750080 -755200 1295360 899584 906752 209408 127488 1265152 203776
6029 195584 358400 10752 769536 776704 157696 -420352 512000 14336 558080 -286208
6018 -92160 342528 -74240 -511488 1442304 880128 -279040 -440832 657408 1021952 -634368
6007 156672 -640512 51712 519680 606720 1721344 1474560 224768 -387072 707584 20480
5996 1608704 703488 275968 111616 25600 616960 6144 -644608 540672 -225792 836096
5985 496640 690176 274944 123392 396288 823808 914432 1022464 1055744 -83968 -486912
5975 -486912 -317952 568320 158720 31744 509952 -29184 160256 237056 -811520 31744
5964 823296 -268800 178688 419328 732160 1153024 896000 34816 1129472 361472 -54784
5953 655360 -1328640 -294912 -648704 580096 605696 -441856 262144 -348672 817664 391168
5942 672256 1218048 -282624 220160 425984 530944 -65024 476160 396288 -227840 157184
5931 612864 204288 990208 1848320 1319936 217600 906752 -228352 -397824 -437248 -384000
5921 -384000 57856 1483264 1852416 838144 35328 266240 410112 -403456 68096 936960
5911 936960 336384 764416 23552 165376 1684992 -19968 1020928 933888 118784 -302592
5900 -18944 363008 -272896 1052672 302080 933888 -1878528 -84992 1084416 912896 -4608
5889 184320 1079808 -1066496 560640 339456 160768 412672 -379392 -499712 17920 -392192
5878 302592 259584 747008 770048 -30720 285184 421376 613888 245760 287232 205312 -89088
5866 753152 1617920 1123328 1273856 380928 1043456 954368 496128 286720 -132608 914944
5855 429056 -246784 727040 953856 325632 167936 1394688 652288 671744 -179200 240640
5844 1162240 143360 -539136 -982528 772608 285184 153088 60416 3072 106496 537088
5834 537088 1392640 -699392 440320 115200 309760 -398336 192000 786944 689152 909824
5824 909824 167424 1077248 965120 103424 332800 438784 284160 398848 665600 481792
5814 481792 104448 144384 848384 653312 204800 431616 833536 -414720 649728 327680
5804 327680 1978880 559616 741376 -75776 899584 114176 -1083904 -423936 346112 -25088
5793 572416 116224 123904 1420800 -258048 140288 924160 438272 132096 436224 931840
5783 931840 482816 -417792 351232 432640 952832 111616 717312 -613888 1346560 -214528
5772 -98816 -272896 547328 299520 996864 676864 497664 81408 238592 -188416 1158144
5761 1367040 -266752 203264 994304 43520 567296 484352 96256 494592 -508928 1273344
5750 -40960 -234496 -541696 779776 1733632 123904 553984 452096 -90624 446976 799744
5740 799744 377344 -45056 1396736 555520 147968 1015808 -68096 607744 79360 297472
5730 297472 1444352 1286656 307712 446976 -1536 290304 928256 -100864 791552 925696
5720 925696 1273856 -44032 230912 1149440 470528 -419840 659968 367104 -254464 587264
5709 433664 489984 223744 596480 -129024 421376 240640 785408 620032 171008 584704
5699 584704 -485888 461312 -595456 270336 -272896 81920 1256448 92672 -407040 1658880
5688 850432 877056 946688 1454080 174592 2067968 -71680 1181696 -1323008 307712 487936
5678 487936 974336 438784 617984 519680 47104 122880 1020416 672256 618496 237056
5667 -843264 1407488 176640 1070080 645120 669184 1099776 265728 795648 -39936 1352192
5656 821760 975360 802304 1147392 -298496 1294336 768512 881664 2021376 643072
5646 581120 1184256 1176576 914432 1357312 2150400 1398272 389632 1624576 892416 1497600
5636 1497600 965120 1196032 1163264 1366016 1782272 1227776 1095680 1482240 659456 75264
5625 1131520 163840 663040 273408 1025536 867840 46080 -385024 1864704 1808896 -305664
5614 -354816 321024 -119296 -209408 831488 1536000 739840 -363520 400896 970240 1392640
5604 1392640 418816 1034752 164864 320512 103936 457216 392192 1235968 401408 436736
5594 436736 1363968 1161728 -1053696 961024 941056 208384 -98304 630784 -45568 340480
5583 354816 38912 1029120 93696 460288 606208 140288 899072 513536 336384 -529920
5572 247808 -352256 75264 279552 1635840 236544 -749056 160256 1536512 585216 440832
5562 440832 -54784 33280 1251840 -10752 943616 1312768 1601536 291328 1396736 457216
5551 602112 940032 707584 692736 144384 477696 421888 -139264 703488 1304576 -60928
5540 549376 -20992 584704 418304 1537536 1025024 -493568 248832 1501696 2249728 466432
5529 498688 813568 -201216 1037312 1293824 704000 1110528 954368 257024 974336 1393664
5519 1393664 826880 1270272 720384 1044992 120832 1679360 460800 872448 959488 660992
5509 660992 617984 631296 810496 394240 1521664 384000 1368576 1300480 1073664 1116672
5499 1116672 -435200 1162240 982528 1989120 1357824 1237504 1257984 1327104 1769984 1667072
5489 1667072 1707008 1620480 1440256 1605632 2075136 1655296 1678848 2438656 1240576 796672
5479 796672 1058304 1633792 1158656 1149952 1839104 988160 1463296 2294784 1162240 1623552
5469 1623552 1660416 724480 2518016 229376 -394752 1756160 643072 2014720 677376
5459 938496 1300992 1496064 913920 907776 843264 885248 854016 745984 692224 434176 1044480
5448 1044480 1058304 1893376 571904 -68608 262144 957440 -120320 -285184 189952 51712
5437 1618944 382976 445440 1723392 1014272 -96768 611840 1135616 542720 360960 1306624
5427 1306624 60928 687616 317440 -435200 1308160 258560 1135616 -131072 350208 1173504
5417 1173504 1002496 789504 409600 386560 306688 -626176 1197568 317952 -14336 270848
5406 1063424 467456 984064 365056 283136 687616 760832 652800 178176 802304 822784
5396 822784 1197568 321024 -166400 1473536 607744 156160 1641984 -407040 296960
5386 -636416 614912 1094656 268288 284672 526336 815616 356352 -350720 1796096 758784
5375 521728 977920 1136128 754688 617472 978944 -77824 765440 367616 1250816 880640
5365 880640 464896 970240 209408 814080 490496 53248 660480 714752 806912 378880
5354 1184256 995328 1446912 -28672 1161216 1555968 204800 621056 638976 -226304 36864
5343 737280 822784 927232 243200 551936 328704 -252416 1170944 536064 -30720 835072
5332 318976 548352 858624 1018880 1634816 545792 464896 -193536 201216 122880 139776
5322 139776 1041408 188928 262656 -579072 1313792 -400384 1351168 990720 1257472 1082368
5312 1082368 849920 1314816 142848 406016 810496 1161728 252928 1195008 -70656 562176
5301 779776 166912 1289216 960000 1024 336896 561664 1102336 179200 821760 1586688
5291 1586688 272384 818688 569344 916992 1402880 829440 9216 801792 752128 1217536
5281 1217536 1160192 1059840 728576 1456640 648192 1180672 474112 1529856 452608 1178624
5271 1178624 441344 655360 -160256 1062912 724992 1964032 1808896 137216 756224
5262 756224 805888 353792 -370176 -61952 504832 546304 870912 1782784 708608 722944
5252 722944 618496 1554432 -250368 1151488 973312 499200 686592 147456 1059840 1027072
5242 1027072 521216 -413696 683520 1798144 803840 166400 -348160 745472 1047552
5233 1047552 1517056 1093120 1713152 1408000 1306624 2260480 2152960 1397760 1833472 1988608
5223 1988608 2200064 2015232 1568768 1351168 1038848 886272 437248 952832 425472 1094656
5213 1094656 373760 1095680 727040 930816 -115712 1022976 257024 536576 -693248
5203 348672 1071104 908288 334336 -831488 680960 798208 1048064 1169408 796672 579072
5193 579072 -412160 974336 363008 744960 -349184 700416 329728 139264 1250304 1731584
5183 1731584 93184 1605120 72704 968704 -613376 -269824 163328 824832 755712 -570880
5172 621056 -121344 1205248 148480 190976 1296896 53248 282624 467968 461824 -324096
5161 815616 1476608 114688 944640 557056 213504 465920 901632 956928 1120256 278528
5150 -156672 404480 1253376 1300992 1041920 441344 924672 -168960 671232 917504 807424
5140 807424 274432 801280 212992 711680 880640 713728 1129984 1227776 187392 140288
5130 140288 1693184 505856 487424 1870336 278528 1181696 493056 1699328 2039296
5121 2039296 -108032 736768 301056 412160 1497600 687104 1093632 85504 1928704
5112 1928704 713216 1560064 596480 555008 1423872 1683968 1165824 870400 1288704 1396736
5102 1396736 655872 565248 -155648 1291264 1185792 1360896 1061376 922112 1637376 569856
5091 1401344 197632 766976 1476608 1186304 1177600 738304 907776 -285696 1265664 2269184
5081 2269184 1549824 1114624 886272 883712 1388544 1923584 1141248 399872 1925632 1419776
5071 1419776 1981440 1527808 1712128 1192960 1304576 1057280 1403904 86528 1320448 424960
5060 1632768 138240 1298944 1236992 587776 660992 1567744 -181760 1283072 1691136 -433152
5049 1653760 1115648 298496 936960 902656 1542144 1270784 1623040 1289728 1142784 1314304
5039 1314304 748544 1727488 1425920 1428992 812032 1391616 973824 2219008 261120 1434624
5029 1434624 1065472 1137152 1418752 174080 815616 535552 -189440 855552 246784 1717760
5019 1717760 1014272 406016 705536 782848 1337856 534016 -109568 1084928 1533440 1903616
5009 1903616 1455104 1788416 1035264 509952 1400320 1232384 342016 1615360 2362368
5000 2362368 1245184 590336 1734656 1627648 1351168 488960 1195008 1401344 1447424
4991 1447424 1384960 2797568 2080768 1765888 1469952 2014208 2105856 1487872 2100736 2768384
4981 2768384 2631168 2839040 3819520 2875904 4583936 5088256 4800512 5571584 4555264
4972 4555264 5467136 4614144 4386304 3984896 2547712 2568192 1844736 1454592 1194496 775680
4962 775680 1255936 1369600 1079296 1155584 781824 238080 1314304 958976 1290240 928768
4952 928768 1546752 1385472 753152 1224192 1402880 552448 1012224 775168 1637888 268800
4941 609280 750592 1397248 1559040 1781248 1579008 826368 -344576 1462272 1735168 1460224
4931 1460224 1641472 456704 351744 1348096 1377792 866304 -209408 542720 667648 422912
4921 422912 1418752 1495040 1619968 744960 826368 970240 2044416 1029632 1699328 1375744
4911 1375744 1330688 4608 1470464 1453568 2132480 809984 1549312 506880 540160 1730560
4901 1730560 602112 1224704 1496064 526848 572416 1217024 861696 1274880 690688 502784
4891 502784 1758208 310784 1410048 1049600 458240 1721344 1316352 791040 1184768
4882 1184768 998912 506368 1017856 1528832 581632 1364992 1084928 1489920 1251328 1096192
4872 1096192 599552 596480 958976 1604096 349696 291328 1020416 1653248 490496 1191936
4862 1191936 977408 1129472 1853952 1262080 1339904 1607680 1283584 1229824 488448 1529856
4852 1529856 834560 684544 1454592 718336 1684992 871936 700928 1263616 -274944 435712
4841 1653760 1162752 1164288 774656 423424 1523712 1236992 324096 748544 1299968 702464
4831 702464 630784 1977856 698880 1833472 1235968 725504 1853440 1431040 2067456
4822 2067456 987648 1148928 1670144 1538048 1265152 723456 1622016 896000 1631232 1442816
4812 1442816 861696 806912 1280512 1582592 1149952 969728 2220544 1548800 389632 1405440
4802 1405440 903168 1731072 2203648 482816 1260032 1584128 1447424 1639424 466944 1161216
4792 1161216 1447424 1071104 1432576 1939968 890368 2195456 1107456 1757184 1022976
4783 1022976 1735168 713728 606208 920576 2324480 1634816 1715712 792064 1679872 1134080
4773 1134080 812032 1942016 1563136 2495488 1662976 1143808 1515520 838144 948224
4764 948224 1207808 1915904 2153984 1595392 2142720 2403840 1935872 2195456 2044928 1579520
4754 1579520 827392 155648 762880 1972736 921600 386048 1828864 2176512 1279488
4745 1279488 2551296 1803776 1056256 1664512 714752 1415680 1887744 1783296 1643008
4736 1643008 1353728 1480192 2022912 1041408 1370624 2160640 1693184 1418240 1498112 3079168
4726 3079168 2494464 1402880 1276416 1219072 953344 2257920 1724416 2543104 2929152
4717 2929152 1707520 2655744 4179968 3750400 2019328 3412480 1996288 2002432 2989568
4708 2989568 1000448 2579456 2334208 2714112 2218496 2101248 2738688 1559552 2606592
4699 2606592 912896 2599424 1423360 1025536 1669120 1251328 1207808 1719808 1440768
4690 1440768 1025536 1637376 1699328 2080768 1856000 1843712 1750016 2546688 1620992 2190848
4680 2190848 1798656 2217984 2006016 3514880 1926144 2249216 2514432 2657792 1499648
4671 1499648 2484736 2333184 3003392 1369088 3369984 2734080 2779648 1475072 1460736
4662 1460736 2039296 2311680 2032128 1940480 2077696 1389056 843776 494080 1586688 2386944
4652 2386944 2440192 1807872 2324480 1577984 2409472 1577472 2062336 1467392 1349632 3428352
4642 3428352 1655296 1905664 1336320 1554432 1512448 1685504 1467392 1874944 1711616 2368000
4632 2368000 1829888 1583616 2678784 1671680 1402368 1278976 130048 1106432 754176
4623 754176 1257984 138240 1901056 998912 1437696 2081280 1704448 1613312 2008064 287232
4612 1436160 1017856 2028544 1677312 2029056 1556992 2112512 1010176 2649600 2144768
4603 2144768 1379840 1584128 2702848 1803264 2130432 2231808 1785856 1827840 1485312 1567232
4593 1567232 2060800 2668032 1698304 1773568 1915392 2708480 2895872 3932672 1739264
4583 1698816 2133504 3273216 2755584 3182080 2668544 2939904 995328 2622464 2841600
4574 2841600 2530304 2474496 1942528 3677184 2644480 2906112 3330048 2525184 2565632 3164672
4564 3164672 2313216 1394176 1918464 1988096 1693696 2863616 2918400 1655296 1418240 2452480
4554 2452480 1813504 2333696 1945600 2542080 1220096 2771456 1495552 2332672 1367040
4545 1367040 2530304 1401344 2344448 2560000 2105856 -99840 1218560 1551872 2283520
4536 2283520 2964992 1890304 1708544 2241536 2499072 2027520 2007552 1751552 2801152
4527 2801152 777728 2507264 1853952 2928128 1428992 2092544 2539520 1167872 3032064
4518 3032064 2376704 2816512 2378240 2738176 972800 2589696 2742272 2235392 2641920
4509 2641920 1973248 2942976 2228224 2957824 2839040 1918976 2144768 2582016 1732096 2039808
4499 2039808 1666048 2384896 2615808 645632 1848832 1753600 2278400 1472512 1537024 1988096
4489 1988096 2029056 2281472 2124288 1361920 1274368 1974272 2128384 2264576 1939456 1182720
4479 1182720 2322944 1589248 2521600 1228288 2074624 3197952 1264128 1330688 1436672
4470 1436672 2209280 3593216 1882112 2633728 3317248 2749952 2048512 2387968 3034624
4461 3034624 3322368 2550272 2165760 2956288 3121152 2979328 2536448 2276864 1563136 751616
4450 3167744 1819136 1438720 1885184 1451520 1159680 2504192 2091520 2615296 1412096
4441 1412096 1695744 1378816 2164224 1356800 2399744 2035712 2010112 1643520 1708544 1624064
4431 1624064 2452480 1178624 2196480 1460736 2533376 1949184 1688576 2444800 2427904
4422 2427904 2137088 2018816 2678784 1033728 2125312 2468864 1640960 3425792 2918912
4413 2918912 2216960 2044928 2845184 2852864 2293760 1963008 2060800 2266624 1883648 1053184
4403 1053184 1222144 1629696 1852928 1297920 1208832 1904128 2478080 1489408 2696192 2193920
4393 2193920 1653760 1287680 2465792 1893376 2337792 1010176 1567232 1916928 2464768
4384 2464768 1361408 965120 2147328 1957888 1688064 2089984 2043904 2261504 2696704
4375 2696704 1233920 2193920 2148864 790016 2009600 2871808 2501120 1906176 1781248
4366 1781248 2254848 2819584 2461184 1570816 1848832 2435584 1501184 1856512 827392 2385408
4356 2385408 2392064 1899008 976384 861696 1160704 2028032 1109504 1350656 1371648 2581504
4346 2581504 984576 1095168 2271744 830464 2296832 1910272 1399808 1504256 875008
4337 875008 2035712 2109440 543232 1426944 2037760 1287680 707072 2205696 2832896 2192896
4327 2192896 1978368 1062400 1720832 1132032 1705984 1359360 1984000 2222592 1565696 1565696
4317 1565696 1369600 2353664 1573376 1749504 2018304 1659392 2541056 2378752 2427392 3236352
4307 3236352 2023936 2986496 1219072 1210368 1817600 1335808 1313280 2243584 2377216 2052608
4297 2052608 3309056 1360384 2189312 1679872 2527744 2286592 2264064 1921024 2491392
4288 2491392 1544704 1768448 1304064 2022400 1719808 1463296 3310080 3318784 1899520 2408448
4278 2408448 3064832 2222592 2066432 2652672 2676736 2404864 2106880 1966592 2002944 1541120
4268 1541120 2067968 872448 2587648 2648576 3123712 1745920 3243520 2571264 2760192
4259 2760192 2301440 2164224 2644992 2498560 2917888 3192320 2787840 2352128 1987584 2899456
4249 2899456 3966976 2155520 2446336 2393088 2278912 3143168 2680832 2464768 2600448
4240 2600448 2649600 2387968 3879936 2798080 3673600 4668928 3772416 3547648 4781056
4231 4781056 3184640 4013056 3033088 3331072 3890688 3554304 3868160 3806720 3506176 2734592
4221 2734592 3959808 4069888 3186688 3378176 2456576 2597888 2820096 3202560 3512832
4212 3512832 2043904 3116544 1975808 2198528 3184640 2976768 2646016 2432512 2538496
4203 2538496 3423744 2506752 2548736 3063808 3378688 2912256 2491392 2485248 2627584 3138560
4193 3138560 2447360 2032640 3231744 4132864 2299392 2564096 1930752 2996736 3071488
4184 3071488 2449920 2634240 2424320 2708992 3773952 2561024 2042368 2067456 2442240
4175 2442240 1856000 3059712 3874816 2159616 2419200 4096000 3535360 3856896 4575232
4166 4575232 4002304 4084736 3332096 4059136 4186112 3728896 3031040 3403776 3072000 3337216
4156 3337216 3704832 4022272 3703296 3858944 4691968 2926592 3467264 3257856 4382720
4147 4382720 4606976 3779584 4260352 3438080 4084736 3399680 2694656 2719232 3310592 2199552
4137 2199552 2282496 2221568 1855488 2486272 2188288 1650176 1770496 1857024 2519552 1050624
4126 2041856 1956352 1794048 2329600 1485312 1364480 1890304 2006528 1991168 2606592 1420800
4116 1420800 1221120 2316288 1542144 2120192 1956352 1762816 2380800 2011648 2199552
4107 2199552 2247680 2845184 2385408 1999360 1625088 2302976 2230784 2025984 1624064 2958848
4097 2958848 1554944 9146880 1734144 3025408 1754624 2869248 2121216 3025920 2220032
4088 2220032 2461696 956416 2335232 2586112 2603520 2237952 1540096 2350080 2520064 2718208
4078 2718208 2215936 2706944 3226112 3151872 1836544 2554880 2856448 1976832 2571776 2364416
4068 2364416 2564608 3013632 3534336 2620928 3205632 2915840 3488256 3760128 4179968 3526144
4058 3526144 3846144 3932672 3567616 4246528 3438592 3960832 4000768 3991552 4299776 4026880
4048 4026880 4541952 3603456 3438592 3748352 3258880 3675648 2963968 4532736 4246016
4039 4246016 3621376 4481536 4691968 3539968 3308032 2935808 3982848 2524672 3548160
4030 3548160 3851776 4468224 4159488 4316160 3955200 4227072 4588544 3876864 4579328 4243968
4020 4243968 4422656 4588544 3856896 3486720 4870144 5274112 5032448 5569536 4340224
4011 4340224 4041728 4982272 5206528 5177856 4686336 5605376 4701184 5467136 4861440 5753856
4001 5753856 5582848 6275072 6162432 6031360 6317056 5431808 6569984 5252608 5908992
3992 5908992 4532224 4343296 4904448 3692544 3783680 3855360 3002880 3313664 3614720 4211712
3982 4211712 5078528 2657280 2880512 2897408 3988992 3942912 2031104 3100672 3808256
3973 3808256 3148288 3224576 2783744 2726912 3515904 3012608 3033088 4452352 4535296 4258304
3963 4258304 3835904 3669504 3079168 3160576 2916352 2796544 4156416 3981312 2997248 1930752
3953 1930752 2746368 4025344 3932160 3526144 3166720 3979776 2906112 3424768 2934784
3944 2934784 3388928 2905088 3548672 3213824 3466240 4366336 2907648 3656704 2911232
3935 2911232 3029504 3979776 3398656 4024320 3509248 4080640 3094528 5127680 4412928
3926 4412928 3702784 2876416 4478976 4231680 4155392 3276800 3567616 3825664 3377152 3238400
3916 3238400 3024896 4205568 3789312 3001856 3530752 3621376 3800576 4225024 3312640 4355072
3906 4355072 3853824 3932672 4519936 2886656 3381760 3544576 3910144 3955712 4388352 4585984
3896 4585984 4269056 3566080 4839424 3333632 3007488 3289088 4137472 4283904 2495488
3887 2495488 2674688 3725312 2988544 3690496 3533824 3605504 3354624 3658752 3597824 3610624
3877 3610624 3066880 2912256 3367936 3405824 3344896 4002304 3723264 2787328 3348480 4274176
3867 4274176 3357184 3082240 4416000 4096000 3594240 3463680 3104256 3357184 3330560 2784256
3857 2784256 3570176 4097536 4386304 3480576 4096512 3448320 4880896 3442688 3596800
3848 3596800 3909120 3998720 2314240 4771840 4278784 4428288 4478464 3507200 3330560 3765760
3838 3765760 3726848 4713472 4169216 3488256 4289536 4253696 4152320 4059648 3673600 3002368
3828 3002368 4254208 4968960 4123648 3864064 4531200 4608512 4426240 4274176 4606976 5291520
3818 5291520 4185600 4513792 4904960 4933632 4239872 4331008 4827136 4719616 5220864 4584448
3808 4584448 5469696 6486528 6254080 5515264 5348864 6232576 5426176 4879872 5531136
3799 5531136 6469120 7030784 5998080 6923776 7697408 7744000 8964096 6905856 8436736
3790 8436736 8081920 8607232 8040960 8381440 8422912 8954368 10314752 9308672 10214912
3781 10214912 10123264 10544128 10223616 11015168 11105280 11532288 11224576 11632128 11966464 11811328
3771 11811328 13263360 13352960 15267840 13694976 15096832 15022080 16380416 15093760 16457728
3762 16457728 15566848 16420864 16242176 15337984 16678912 17424896 18781696 18962432 18612224
3753 18612224 19427840 19461632 19874816 19106816 20152320 20124672 20180480 22189568 21055488
3744 21055488 22117376 22341632 21973504 23298048 24624128 25576448 26616320 27358720 28574720
3735 28574720 29095936 28026880 26129408 21937664 18981888 15660032 14321664 12938752
3727 12938752 11702272 11470336 10393088 10953728 10228224 9874944 10151424 8379904 9621504
3718 9621504 9316352 9847296 9347584 9533440 10582528 9200128 9531392 9639936 9659904
3709 9659904 8418304 7562240 8510464 8389120 9792000 9624576 9159680 9993216 9801216
3700 9801216 7824896 8560640 8457728 8047616 6843904 6268416 6925824 7108096 7148032
3691 7148032 6248960 7377408 6663168 6213120 7191040 6838784 4937728 6376448 6660608
3682 6660608 6823424 6853632 6542848 7704064 6514176 6790656 6816256 6181376 8088064
3673 8088064 5754880 6275584 7462400 7223808 6839296 7174656 7051264 7335424 7945728
3664 7945728 6427136 6298624 6502912 6884352 6534144 7185920 6644224 7447040 7388672 7185408
3654 7185408 7202304 7239168 7127040 7042560 8068608 5879296 7483392 7498752 7218688 7139840
3644 7139840 7131648 7462912 7287808 7672832 8634368 8040448 7832064 8264192 7513088 7786496
3634 7786496 7712768 7469568 6760960 6787584 8035328 6287360 6880768 7389696 7414784 7320576
3624 7320576 7464960 6423040 7057920 8341504 7222784 7310848 6585344 7717376 7341056
3615 7341056 7347200 7736832 8257536 8227840 7577088 7693312 8592896 8570368 8301056 8274944
3605 8274944 8490496 8386048 8652800 6922752 7503360 9491968 8832512 8503808 9992192
3596 9992192 8525824 9372672 8754688 9203200 8473600 8613376 8809984 9074688 9150464 9247744
3586 9247744 8408576 7502848 8724480 9983488 9122816 10118656 9556992 10421760 11313664
3577 11313664 11629056 10597888 10690048 11197440 10391040 9923584 10533376 10925568 9525248
3568 9525248 9137152 9458176 11002368 10577408 9404416 9906688 10646528 10248704 9746432
3559 9746432 8585216 9818624 9148416 9724416 9277952 8599040 9436160 8479232 8296448
3550 8296448 8400896 10082816 12873216 13138944 14720000 15694848 16182272 17152512 18072576
3541 18072576 18680832 18586112 19034112 19273728 20090368 21152256 21905408 22996480 24162304
3532 24162304 25088000 25461760 26957824 25236480 26493952 26847232 29182976 29075456 30964736
3523 30964736 31602176 32482816 33155072 34375680 36820992 37377024 39517184 41765888 44206080
3514 44206080 45427712 47836160 49439232 52732928 55816704 58532352 64727040 67830784
3506 67830784 73766400 78504448 83509248 87512064 94944256 100411392 108235776 116260864
3498 116260864 125491200 134344192 140858880 150776320 160366080 170151936 181710848 195025408
3490 195025408 207972864 226049024 243120128 265496064 289901568 319526400 353157632
3483 353157632 392851968 445677568 511230976 597757952 709592576 848428544 1002787840
3476 1002787840 1170731520 1330494464 1419338240 1376905728 1188634112 936454144
3470 936454144 706297344 528099840 399392256 307528192 241740800 193234432 159936512
3463 159936512 135514624 116021248 101940224 90046976 83568640 75554816 70288896
3456 70288896 65645056 60879872 56771072 53479424 49439744 46237696 43818496 40237056
3448 40237056 39662592 38472704 36275712 33805824 32445440 30635520 30318080 28483072
3440 28483072 27495424 27523072 25737216 26112000 25770496 23760896 22492672 21925888 21117952
3431 21117952 20239360 19993600 18004992 17881600 17750528 18558976 18104832 16307200 16471040
3422 16471040 15494656 15460864 15415296 14732800 14346752 13940736 13740544 13209600 12405248 12817920
3412 12817920 12887040 13504512 12985344 12968960 12653056 12271104 11786240 12528640 12880896 12133888
3402 12133888 12652032 12782080 12345344 12573696 13533696 14217216 16339968 16052736 16047104 13982720
3392 13982720 13831168 12104704 11665408 10690560 10403328 10037248 9585664 9581568 10178560 9138688
3382 9138688 9192960 7700992 7585280 8520704 8156160 7800320 7252992 7884288 8838656 8011264
3372 8011264 6703104 7113216 7091712 6443520 6184448 6803968 5824000 4602880 5878784
3363 5878784 6033920 5969920 5865984 5196288 6695936 5694464 6377472 5092864 5651456
3354 5651456 5872640 5718016 5496320 4975616 5000704 5718528 5761024 6455808 5956096 5776896
3344 5776896 4809728 4698624 4330496 6293504 5495808 5701632 5540864 6015488 5031424
3335 5031424 4936704 5300736 5608960 5090816 3965440 5120000 3980288 4125184 4247552
3326 4247552 5194752 4421632 4538880 5254656 4241920 5574656 4560384 4934144 4856832
3317 4856832 5733888 4772864 5605888 5149184 4658688 4289536 3859968 4033536 4825600 4707328
3307 4707328 5292032 4516352 4090880 3809280 5591040 4702208 4730368 5284352 4240384
3298 4240384 4900864 5094400 5549056 4614144 4259840 5623808 5658624 5552128 6071808 8055808
3288 8055808 8045568 9075712 8539136 9145856 10083328 9385984 9820672 9379328 9519616 9413632
3278 9413632 7492096 6904320 8179712 8168448 8709632 8272896 7902208 8270848 8130560
3269 8130560 8291328 7162368 8061440 9131008 9399296 9447936 8578560 8437248 8918528
3260 8918528 9098752 8400384 7877632 9170432 8771584 10062336 9807872 9385472 10013696
3251 10013696 9637888 10047488 9854464 9808896 10570240 11105280 12046848 11994624 12211200 13562368
3241 13562368 13288960 13091328 13634560 13945344 13919232 15198720 14427136 15314432 15157760
3232 15157760 14946816 14923264 15930880 14722560 15677440 16510464 16548864 16822272 17360896
3223 17360896 17193984 17850880 18320384 19006464 19942912 19295744 20591104 21604352 22745088
3214 22745088 22482432 23464960 21683712 20582400 18359808 17310208 15546880 14332928
3206 14332928 13324800 12476928 13003264 12389888 11783168 11048448 10585600 9904128 11169280
3197 11169280 9564160 10158592 8882176 8256000 8548352 8240128 9576960 8169472 6539264
3188 6539264 7773696 7643648 6082048 6909952 5569536 5775360 5276672 6003712 5854720
3179 5854720 5279232 6269952 5760000 5677568 4854272 4701696 4016128 4988928 4908032 4274176
3169 4274176 5473280 4544512 6006272 5749248 5818880 4452352 5022720 5031424 6665216
3160 6665216 5408256 4410880 6566400 5707264 4538368 4261888 5751296 5873664 5911040
3151 5911040 6444032 5775872 5287936 5938688 5962752 5857280 6905344 5404160 4918784
3142 4918784 6005248 5093888 5364224 5929984 6173184 5032960 4720640 5936128 5708800
3133 5708800 5820928 5281792 4631552 5726720 5121536 5335552 4645888 5321728 6195200
3124 6195200 5038080 6252032 6024704 5747200 4858368 6328832 5845504 6584832 5452288
3115 5452288 5245952 5556224 5315584 4993024 5767168 5219840 4126720 5397504 4478464
3106 4478464 5171200 3950080 5646336 4951552 4451328 4439040 5238272 5858816 5435904
3097 5435904 5968384 4979200 4444160 3808768 4792320 5220352 5007360 5438976 5130752 3841024
3087 3841024 4931584 5010944 4186624 4460032 4224512 4399104 5134336 3285504 5374464
3078 5374464 5486592 6313984 6237184 5707776 5421568 5402112 6474240 6588416 7080960 6539264
3068 6539264 7080448 7739392 7308288 7591424 8322560 7690752 10248704 11615744 14733824
3059 14733824 16330240 19736064 22385664 21907968 19444736 20050432 18544128 13806080
3051 13806080 10052608 5382656 5894656 5108736 5468672 4160000 4616192 4170240 4321792
3042 4321792 3510784 4866560 3847168 4418560 4200448 5171712 4491776 4300288 4395008
3033 4395008 3917312 4019712 4030464 4688896 4755968 5352960 3923456 3664384 4372480 4674560
3023 4674560 4644864 5566976 5441024 5883904 4106240 5839360 5457408 4894208 4784640
3014 4784640 4579840 5595136 4769792 4526080 5601792 5946880 4838400 4623360 5090304
3005 5090304 4996608 4460544 5571072 4848128 4387328 6538752 5511680 4925440 5614080
2996 5614080 4481536 3750400 5459968 4454400 5281280 5244928 4537344 5740544 5270016
2987 5270016 5320192 5020672 5303296 6612992 5298688 6077440 6024192 5768704 5822464 6571008
2977 6571008 5594624 5528576 5245440 6170624 5314560 4717056 5812736 4469760 5026816
2968 5026816 6116352 5995520 6065664 5915648 6253568 6794752 6389760 5350912 6144512
2959 6144512 6253056 6232576 6034944 7828480 6415872 7635456 7780352 8205824 7494144
2950 7494144 6612480 5944832 5146112 5828096 5511680 5146112 5448704 5234176 5222912 6166016
2940 6166016 5601792 4380672 4899840 5688320 3894784 4582400 4552704 5462528 4939264
2931 4939264 6085632 4045312 5634560 5837824 5657600 4893184 4766720 5205504 4748800
2922 4748800 4700672 4082688 5703680 4691456 5163520 4606464 4648960 4329472 4189184 3654144
2912 3654144 5009408 3580416 3831808 4407808 4811776 4550656 5330944 3808256 4033024
2903 4033024 5038592 5545472 4998144 3829248 3306496 4126720 4019200 4413440 4283904
2894 4283904 4437504 4558336 3387904 4467200 4137984 4696064 5548032 5314560 5812224
2885 5812224 4455424 5894144 5053440 4063232 3800064 3705344 3990528 2678784 4619264
2876 4619264 4286976 4292096 4402176 4509696 4334080 4990464 4355584 5211136 4097024 4275712
2866 4275712 4973056 5035008 5102592 4453376 4423680 5797376 5332480 3986944 4283904 4506624
2856 4506624 4234240 4678656 5326848 5313024 5710336 5797888 5907968 6124032 6350848 6909440
2846 6909440 7282688 7575552 7879168 9046528 11483136 16202752 17927680 25275904 28020736
2837 28020736 30005248 19824128 11518464 10074624 7528960 5748736 5726208 5647872 4225536
2828 4225536 4901376 3962368 4776960 3755520 3120128 4600320 4171776 3612672 3697664
2819 3697664 3149312 3752448 4097536 3313152 3861504 3443712 3698688 3105280 4332544
2810 4332544 4061184 4172288 3679744 3820032 3283968 3060736 3122688 2736128 3555328 3074560
2800 3074560 3458560 3793408 3202560 4119040 4231680 3939840 3951104 3868160 3150336 4233216
2790 4233216 3787264 3610624 4579840 3798528 3110400 2305536 3804672 3780096 4585472 3539456
2780 3539456 3717120 3146240 3932672 4580352 2411008 3600896 3481088 5539840 4214272
2771 4214272 5266432 5388288 4839424 5587456 5340672 5527040 7263744 6482432 5721088
2762 5721088 6809088 7361536 8078336 7785472 9481728 10575872 10619904 11219456 13060608
2753 13060608 16271872 19373056 22444032 28827136 37179392 45292544 41730048 31177216
2745 31177216 22594560 17957376 18189312 18718208 20494336 24408064 28226560 33824256
2737 33824256 31571456 21865984 19692544 19393024 22218752 23972864 29736448 38309888
2729 38309888 43508224 39197696 25188864 19296768 17309696 17900544 18272256 20671488
2721 20671488 27025408 29813248 27409408 17942016 13483520 11592192 10195456 10926080
2713 10926080 12357120 15099904 16799744 14447616 9994752 6895616 5340672 4913152
2705 4913152 4321792 4587520 4065280 4086784 4574208 3917824 4488192 3702784 5474304 3642368
2695 3642368 4417024 4916736 5744640 5634560 6178816 7104512 5657088 7137280 7876608
2686 7876608 6148096 5864960 5225472 5803008 5684224 5132800 4545536 4953600 4077056
2677 4077056 3201536 3990528 3569664 2745344 3756032 1931776 2049024 3440640 3330560
2668 3330560 3706368 1574400 2278400 3223040 2079232 2234880 2732544 1772544 2284544
2659 2284544 2535424 2392576 2435072 1439232 2194944 1915392 1687552 2659840 1467392 2761216
2649 2761216 2238976 2174464 2207744 1985536 2311168 2498560 1464320 1849856 2537984 1993216
2639 1993216 1070592 1859584 2050048 1994240 1513472 1883648 1783808 1414144 1550336 3155968
2629 3155968 2681856 2235904 2314752 2126848 1694720 1290752 1587200 1542144 151552 1494016
2619 1494016 1904640 1926656 1191424 2135040 2127872 2390016 1959936 1695232 3039232 1695232
2609 1695232 2335232 2295808 1868288 2195968 1608704 1431040 2341888 1768960 998912 1796608
2599 1796608 2368512 2129408 1941504 1698304 1442816 2174976 866816 2102784 2667520
2590 2667520 2355712 1607680 1945088 1504768 1830912 2174464 1723904 1628672 3115520 1424896
2579 1897984 1950208 2093568 2425344 2200064 1935872 2689536 1857536 2182656 2377728 3133952
2569 3133952 2114560 1094144 2448384 1712640 2036736 2540544 1544704 2051584 2747392
2560 2747392 1223168 2104832 2223104 2229760 2047488 1254912 2136064 2285056 2525184 2053120
2550 2053120 2733568 2568192 1179648 1955840 2588672 2016256 2381824 1764352 2805248
2541 2805248 2362368 1792000 3535360 2874880 1669632 1870336 2396672 2575360 2084352
2532 2084352 2318336 3108864 1288704 2465280 1817088 1673728 2855936 2933760 2611712
2523 2611712 3162624 2288128 1948160 1982976 2618368 3330048 2899968 3151872 3430400 2328064
2513 2328064 2151424 2787840 2620928 3782656 2741760 3316224 2499584 3010048 2846720
2504 2846720 2951168 2767360 3691520 3416576 2879488 4361216 3213824 3516928 4159488
2495 4159488 4183552 3954688 4602880 4713984 4144128 3549184 4569088 4220928 3095552
2486 3095552 3894272 3595264 3673600 3749376 4425216 3527680 4532736 3613184 4435968 5495296
2476 5495296 5022208 4720640 4856320 5565440 4966400 4615680 4434432 5279744 5074432 6277632
2466 6277632 4820480 4446720 4612608 5871616 4357120 4554752 4855808 3881472 4121600
2457 4121600 3524608 3928576 2953728 3406336 4203008 3460096 3347456 3478016 3613696 4259840
2447 4259840 4217344 3448832 2556416 4347392 3663360 3253248 3604992 3615232 2894848 3555840
2437 3555840 4200960 4107776 3640832 3063808 3501568 4208640 4434432 4178432 3163648 3307008
2427 3307008 3346944 3307008 3587584 2639872 3614720 3048960 2919936 2840064 3488768 2909184
2417 2909184 3039232 3984896 2857472 2628096 3373568 2891776 4067840 3521024 2685440
2408 2685440 4036608 3127296 4239872 4368384 3894272 2278400 3496448 1929216 3347456
2399 3347456 3054592 3380736 3449856 3307520 4554752 4019200 3992064 3104768 3487232 3160064
2389 3160064 2936832 3599872 3906560 2787840 3065344 2877952 2945536 4184576 2365952
2380 2365952 3085824 3673088 3995136 2884608 1875968 2038784 2456064 3268096 3759616
2371 3759616 3170304 3466752 3694080 2460160 3507200 4372480 3850752 3712512 4498944
2362 4498944 3997696 3362816 4162560 3280384 3535360 4461056 3237888 3691008 4908032
2353 4908032 4527104 4316160 3241472 3777024 4766720 3013632 4344832 4045824 3167744
2344 3167744 3617280 4493312 3560448 3593728 2972672 3567616 3529728 3452416 4587520 4027904
2334 4027904 3834880 2738688 2793472 3264512 3620864 2883072 4435968 3458048 4210176
2325 4210176 3549696 3706880 4323840 3224576 3715584 4408320 4007936 3393536 3674112
2316 3674112 3333120 4216832 3590656 4227584 3747840 4846080 4764160 3428352 5148672
2307 5148672 4810752 3934720 4954624 4964352 4970496 4736000 4998656 5372928 3947008 5491200
2297 5491200 4272640 5468160 4800512 5031424 5286400 5857280 4744704 6394368 5057024
2288 5057024 5067776 5708288 5617664 6167040 5337088 6750208 6363136 5408256 7164416 5805568
2278 5805568 6344192 6501376 8347136 7743488 7010816 6484992 7492608 7342592 8290816
2269 8290816 7920128 8476672 8567808 7192576 7512576 7287296 7014400 7539712 7298048 7868416
2259 7868416 7245824 7291904 7296000 6589952 6734336 6699520 7154176 7657984 7455232 7424512
2249 7424512 7429632 9031168 7043584 7398912 7156736 7700992 8153088 7843328 7577088 7490048
2239 7490048 7542784 7484928 7702016 6949888 7389696 7368704 7475200 6712832 7762432 7162368
2229 7162368 6891520 6553088 6713344 7426560 6317056 6947840 7640064 6981120 6745088
2220 6745088 6631936 5690368 6531072 6555648 7190016 6776832 5699584 6733824 6314496
2211 6314496 8285696 6268928 7344640 6744576 6893568 5934592 6726656 5309952 5720064
2202 5720064 5466112 6048768 5718016 6043648 6077440 6049280 5174784 6030336 4767744 4944384
2192 4944384 5449216 4883456 6039552 5203456 6538240 5313536 6219264 4888576 5223424
2183 5223424 5214720 6555136 5974528 5869568 6431232 6318080 6803456 6444032 6699008 6934528
2173 6934528 6035456 6160384 7022080 7634944 6712320 7316480 5953536 6505984 6576640 7055872
2163 7055872 6866432 7127040 7117824 7056384 7498752 6953472 7414272 8875008 7836672 7111680
2153 7111680 7103488 8068608 8732672 9016320 8542720 7837696 9451520 8833536 8018432 9221632
2143 9221632 9269248 9266176 8877056 8936448 8852992 9887232 9766400 9633792 10526720 11216384
2133 11216384 9076736 9631232 10632704 9949696 10365440 10424320 10008064 9757696 9744896
2124 9744896 9695744 10475008 9913856 11064832 10653184 9867264 10748416 10285568 10443264 10708480
2114 10708480 10970112 9618432 10314240 10026496 10785280 10300416 10864128 10508288 10909696
2105 10909696 10025984 10728960 10380800 11539456 11219968 10987520 11573760 10179072 11587584
2096 11587584 10041344 10913280 10520576 11194368 10615808 10629120 10400768 9700864 10338304
2087 10338304 10184192 10139136 9850368 10845696 10648064 10779136 10248192 10861056 11546624 12104192
2077 12104192 14281216 14853120 19678720 22011904 20644352 15089152 12017664 10574336
2069 10574336 9080832 9603584 7818752 8028160 7640576 8457728 7907328 8443904 7656448
2060 7656448 6479360 8174080 8050176 7503360 7212544 7398400 8247296 7975424 7640064
2051 7640064 7034368 7709696 7971328 6465024 6533120 7446016 6873600 8123392 6958592
2042 6958592 7433216 7355904 6448640 7977984 8186880 6023680 7661568 7339008 8092672
2033 8092672 6776320 8350208 7775232 7296512 7244288 7362048 6572544 7099904 7531520
2024 7531520 6547968 7539200 7503872 6622720 6542336 7072256 6821888 7452160 7508992 7213056
2014 7213056 7249408 7302144 8206848 7473152 7864320 8283136 8070144 6433280 7456768 8704512
2004 8704512 8053248 8674816 6726656 7383040 8903168 8711680 7555072 7558656 8492544
1995 8492544 7560192 7766016 7491072 7755776 7484928 8398848 6703104 7266816 7968768
1986 7968768 7224832 7944704 8096256 7561728 6398976 6066688 8672256 7389184 7338496
1977 7338496 7142400 7476736 6972416 7239168 7708160 7002112 8026624 8165888 6966272
1968 6966272 7041536 7041536 7211008 6780928 8935936 9107456 8078848 7967232 9623040 7896576
1958 7896576 9278464 8970752 8873984 9923584 9160192 9365504 9711104 9029632 10087424
1949 10087424 10506240 10134528 9565696 9912320 10234880 10365440 11322880 9039872 10044928
1940 10044928 10756096 10553344 10940928 11420672 12094464 11410432 11949568 12168192 11274240
1931 11274240 12365312 12197376 12237312 12794368 12497920 12731904 13422592 13660160 12639744
1922 12639744 13264384 14557184 14810112 14948352 14471168 13650432 15090176 14471168 13590016
1913 13590016 15033344 13336576 14398464 14040576 13272576 13891072 14025728 12286976 14031360
1904 14031360 13550080 14334464 13635072 13108224 13233664 13250048 12264960 12143616 12393984 12886016
1894 12886016 13039616 13807616 12014080 13737984 12205056 12724736 12978688 12196352 13128192
1885 13128192 12659200 12931584 12904960 12481536 12473344 13388288 12056064 12189184 12355584 12703232
1875 12703232 10904576 11377664 11397120 10268160 11112448 11026944 10693632 10454528 10084352
1866 10084352 11166720 10030592 9946624 9998336 9452544 9377280 9891328 9647104 8984064 8630272
1856 8630272 9591296 9369600 8646656 8244736 9963520 8108544 8354304 7915008 8810496
1847 8810496 8029696 8361984 9228288 6431232 8080384 7475200 8260608 7638528 7769088
1838 7769088 7846400 8237056 7307776 8258560 8223744 7311360 7683072 7521280 7057920 7588352
1828 7588352 7017472 8069632 7587840 8677376 8873984 8047616 7717888 8822784 8204288
1819 8204288 8136192 8766464 8979968 9038848 8470528 7802880 8750592 8980992 9392128 10561536
1809 10561536 8777216 9711104 9672704 10723840 9736192 9531904 10430464 11892224 11076096
1800 11076096 10947072 12160512 11648512 11280384 12351488 13084672 13660160 13021696 14320640
1791 14320640 15100416 13911552 14479872 15376896 14880768 14736896 15674880 15851520 16983040
1782 16983040 15941120 17669632 17181184 18307072 18380800 19138048 19743744 20804608 22305280
1773 22305280 21821952 24120832 23685120 25680384 26216960 27655680 29878784 30905856 32697344
1764 32697344 32633856 35022336 36106240 38285312 40677376 41445888 42477056 44043264 45907456
1755 45907456 45841920 48071680 48044544 49116672 49435648 50720768 51130880 53611520 54185472
1746 54185472 55805440 59121152 59979264 63952896 65282560 69494784 73873408 78397440
1738 78397440 82976768 88208384 93559808 100595200 108175360 114679808 122796544 126485504
1730 126485504 126403584 122597888 114838016 103785984 94937088 82287616 69925888 57536512
1722 57536512 48205312 41670144 34585600 31044096 27696128 24482816 23466496 22362112
1714 22362112 20910592 19019264 18289664 16532480 15977472 16590336 15149568 14055936 14006272
1705 14006272 13563904 13063168 13177344 12192768 11033600 12152320 11273728 11117568 11108864
1696 11108864 10748928 10940928 10216960 10183168 10748416 9560576 9377280 9713152 8064000
1687 8064000 9220608 8288768 8236544 9160704 7984128 8115712 9072128 7475712 7906816
1678 7906816 7782400 6759424 7947264 6419456 7735296 6976000 6860288 7012864 6661632
1669 6661632 6982144 6725632 7045632 6818304 6270976 5215744 5297664 5856768 6727680 6500352
1659 6500352 5745152 6740992 6662144 5852160 5189120 4792832 7104512 5547520 5182464
1650 5182464 6774272 5111808 4309504 5122048 4728832 5169664 4177920 4559360 4636672
1641 4636672 4472832 3913216 4746752 4755456 4438528 5589504 4991488 4492288 5328896 4129792
1631 4129792 3558912 3573248 5504000 5762048 4593152 4015616 4024832 4190720 5010944 4048896
1621 4048896 5341184 3897856 4996096 4488192 4271616 4827136 4571136 5140992 5810176
1612 5810176 4893696 3967488 5852672 5616640 5707776 6167552 5680640 5083136 5117440 5594112
1602 5594112 5716480 6984704 6367744 7421952 5856256 7219200 7250432 6717952 6805504
1593 6805504 7549952 8845824 8560128 7558656 7521792 8346624 8606720 9358848 9329664 9916928
1583 9916928 10600448 11867648 12297728 12661760 13485056 15081472 14686208 13850624 13239296
1574 13239296 11432448 10298368 10981376 10827264 9577472 10265088 10181632 10924032 11087360
1565 11087360 11317760 11454976 11376640 11011072 11342336 10076160 10182144 9467392 10920448
1556 10920448 10393600 10555904 9027584 10993152 10789376 10304000 10472448 9525760 11423232
1547 11423232 10903552 11201536 13151232 14514176 14577664 14307328 14985728 14196736 15882752
1538 15882752 16061952 17368576 14963712 14032384 12554240 12151808 11684352 9836032 9165824
1529 9165824 10559488 9585152 9070592 10065920 8749056 8899584 9423872 9439744 8672256
1520 8672256 7805952 9300480 9382400 9740800 9166848 9516544 10385408 10312704 11794944 11063808
1510 11063808 11255808 11400192 10067968 11481600 9717760 9955840 9202176 8424448 8504832
1501 8504832 7660544 8046592 8023040 8017408 6203392 6523392 6131200 6382592 5296640 5974016
1491 5974016 5779968 5424128 5618688 6867456 5780992 5320704 4980224 5570560 5091328
1482 5091328 5030912 4791808 4584448 5057024 4858368 3809280 5108736 3735552 4421120
1473 4421120 4225536 4895744 4028416 4473856 2443264 4403200 3123200 4257280 3244544
1464 3244544 3936256 2600960 3665920 3953664 2315776 2076672 2567168 2279424 2897920
1455 2897920 2100224 2954240 2511360 2966528 3207680 3444224 2813952 2131968 2701824 1925632
1445 1925632 3340288 1611776 2476544 1999872 1712128 2176512 1805824 1475584 1316864
1436 1316864 2625536 1530880 1949184 2418688 1846784 1415680 1534976 870912 1828864
1427 1828864 1274880 1896960 1735680 1196032 3191808 2048512 2242560 2312704 1960960
1418 1960960 1274368 2412032 3006464 2819584 1139200 3227648 637952 2786304 1402880
1409 1402880 553472 2350592 1283584 886272 1111552 1763328 972800 1733120 2310656
1400 2310656 1279488 1696768 1950720 1025536 2500608 1555456 1039872 2230272 1363968
1391 1363968 623616 603136 1756672 910848 2264064 2427904 1464832 2048512 1564160
1382 1564160 1292288 2106368 1567744 2512896 1330688 512000 2182144 972288 2660864
1373 2660864 1360384 1524736 2032640 1320960 1068544 1887744 1709568 1686528 2605568 1842688
1363 1842688 898048 1851904 2140672 1094144 2658816 1801728 1551872 1682432 1589760
1354 1589760 743936 2260480 2271744 1262592 1674752 758272 1928704 2146816 1586688
1345 1586688 1633280 595456 994816 1139712 2255872 1589760 1853952 2320384 1238528
1336 1238528 656896 2061824 1164288 1830400 1271808 -99840 2208256 848384 1414656
1327 1414656 1550336 177664 615424 262656 1169408 2186752 804864 1857024 763392
1317 1145344 1350144 655872 703488 689664 1434624 655360 452608 1677312 849920 756736
1307 756736 2124288 1604608 1668608 2044416 367616 768512 1129984 2192384 777728 386560
1296 806400 803840 1125888 451584 1201152 943616 1064448 1449984 1344512 1257984 1584128
1286 1584128 329728 -65536 112640 1033216 1114624 1299456 -80896 1558016 1814016 876544
1275 1112576 227840 1129472 1837568 126464 1436672 840192 1626112 728064 1161728
1266 1161728 926208 1536000 1982464 540160 1338368 335360 197632 750592 1085952 1431552
1256 1431552 1860608 1366528 1399296 12288 1002496 1422848 998912 1702400 1408000 724992
1246 724992 230400 861184 830464 1238016 1086976 2049536 696832 709120 1057280 978944
1236 978944 431616 399872 1286144 370176 1371648 916992 823808 1414656 821760 488960
1226 488960 556544 47616 999936 1371648 1208832 1461248 1523712 1438720 1557504 1494016 1140736
1215 1140736 196608 702464 826880 524288 944640 656896 1038848 1361408 285184 27136
1204 564224 890368 1891840 705536 1000960 1395712 778240 1134592 762880 239616 893952
1194 893952 145920 862208 -650752 707584 1669632 369664 989696 510976 1133056 1198592
1184 1198592 708096 591360 345600 605696 989696 418816 645632 1893376 808448
1174 683008 882688 565248 -83456 -28672 174592 577024 1265664 1280000 335360 985088
1164 985088 531968 883200 1062912 582144 353280 669696 722944 991744 -233472 539648
1153 1234944 674304 1074688 116736 -312832 938496 72704 578560 1395712 -272896 1013248
1142 1119744 807936 137216 1051136 701952 678400 902144 827904 1586176 907776 1205760
1132 1205760 1721344 1129984 1894912 2084864 1618944 1447936 1728512 2333696 1853440 2155008
1122 2155008 2185728 3107840 2358272 3852288 3152384 3073024 4028928 3454976 5415424 5988352
1112 5988352 5153280 5211136 4662272 5450240 5417984 6316544 7125504 8306688 8157184 10137600
1102 10137600 10872832 13838848 18212864 23626752 29136896 37389312 59305984 71818240
1094 71818240 72441344 41244672 19959296 15028224 9745920 7133184 4962304 4182528
1086 4182528 2633216 3040256 3798016 3192320 2280448 2869760 2868736 3767808 2880000 3657728
1076 3657728 2933248 2081792 1665536 1900032 1750528 1608192 1201664 1961984 2630656 970240
1065 1466880 2020352 2155520 1404416 124928 -116224 726016 985088 680960 896000 1876992
1055 1876992 279040 1107456 508416 1029120 -36864 1761792 978944 1309184 642048 -30720
1044 1056256 440320 992256 -339968 348672 1375744 733184 69120 -151040 1159168
1034 -401408 777216 635904 709120 169984 707584 593920 466944 190976 192000 556032
1024 556032 265216 1721344 1043456 737280 -225792 488960 1500672 142336 1778688
1015 1778688 903168 -396288 1268224 -263680 -133632 581632 -19456 -129024 1091072
1005 1974784 186880 1388032 447488 1641472 893952 954368 1110016 438784 -385536
995 419840 99328 85504 1040896 1034752 535040 1147392 116736 9216 -172544 -481280 1099264
983 -379904 576512 55296 128512 807424 -97280 180736 -219136 140288 -254464 1110016
972 532480 155648 -1058816 -88064 -724992 1161216 445952 290816 751104 160256 64512
961 -90624 551936 -938496 1824768 71168 175616 99328 65536 932352 441344 749056
951 749056 -740864 230400 554496 -506368 322560 -58368 -543232 1025536 378368 445952
941 445952 873472 220160 1676800 907264 470016 552448 -20992 402432 346112 -110592
930 400896 400896 -41472 891904 752640 279552 734720 434688 1458688 -305664 69120 -68608
918 88576 -504832 -316928 472064 -1089024 701440 335360 758272 86528 381440 236032
908 236032 1096192 -211456 3072 1147904 329728 114176 30208 78336 174592 517632 214016
896 -12800 214528 776192 179712 -608256 1738240 -42496 -422400 -70656 133632 -290816
885 1376256 935936 858624 596480 -49152 -326656 131072 286208 685568 570880 1122816
875 1122816 140288 558080 81920 102912 239104 1179648 688640 -451072 440320 -385536
864 683520 1155072 786432 -532480 -44032 1425920 797184 -33280 783872 1277440 476672
853 304640 -783872 613376 1579008 260096 12800 626688 132096 799744 858112 771072
843 771072 993280 174592 3072 790016 1403392 711168 667648 711680 1401856 1183232 1740288
832 1740288 -18944 60416 -637440 -13824 868352 -196096 623616 -32768 184320 -892416
821 -299520 671744 357888 -45056 1329664 -210432 -178176 160768 606720 309760 -920576
810 -91648 451072 328704 602112 -408576 210432 535040 -320512 126976 816640 418816
800 418816 1035264 -296960 -535552 431616 483328 48640 363520 891904 -547328 706048
789 1011712 -314368 834560 -727040 -1040896 32256 311808 -249344 -79360 -333824 660480
778 -740352 395776 583168 -186880 121344 582656 483328 836608 390144 180736 846848
768 846848 222208 322048 -151040 -339456 614400 549376 -484352 132096 88576 463360
758 463360 -305664 -305664 780288 147968 -380928 -607232 709120 -573440 -207360 783872 367616
746 814080 1132032 -736768 -171008 270848 -1026048 -343040 152064 1078272 -281088 -102912
735 -1111552 423936 987648 288256 453632 -1092608 -71168 -506368 318464 1022976 -893440
724 -470016 855040 222208 637952 160768 -415232 1123840 535552 -481792 363520 98816
713 514048 195584 355328 217600 -487424 -232960 1407488 874496 534016 -718336 98816
702 -514560 -166912 -100352 -93184 -32768 448000 758784 -454144 -17920 -526336 107520 723456
691 723456 90624 690176 -62976 270336 1703424 -460800 952320 74240 792576 438272
681 438272 119808 199680 -81408 246272 587264 589312 -446976 -396288 -156160 651264 596992
670 596992 505856 -185344 -256512 148480 600576 961024 573952 -514048 -55808 -373760
660 -373760 610304 -134144 -284160 -409600 -717312 -207360 250368 -72192 241152 -508416
649 195072 587264 30208 1112576 -1010176 -348160 269312 -478720 144384 372224 600064
639 600064 165888 125952 -401408 571392 -239104 -86016 -514048 -742400 -299008 803328
628 -1152512 702464 -431616 -435200 599040 217088 681984 976896 770048 943104 187392
617 936960 260096 -315392 167936 -202752 571904 -649216 -808448 -314880 -250880 -182272
607 -182272 215040 -253440 581632 144384 417280 6144 241664 72192 -340992 552960
596 93696 222720 -671232 310272 -119808 1285120 -13312 247296 823808 -148992 566272
585 195584 423424 -776192 92672 -368640 -919040 281088 414720 -618496 -375296 -78848
574 -64512 370688 44032 -64512 -342016 261120 -1432576 -374784 645632 -376832 -629248
564 -629248 -559104 290304 506880 -41472 -980992 43520 -74240 30208 4096 -137216 -84480
553 -84480 163840 -700928 -473088 -428032 980480 -317440 -912896 -148992 -294400 464384
542 -573952 -165888 -1211392 52736 -1029120 -101376 -239616 -291328 -827904 474624 -30208
531 447488 -643072 625664 326656 498176 44032 -372736 -27648 24576 515072 -279552
520 455168 -694784 -410624 658944 -339968 -448512 -700416 865792 61440 484864 -442368
509 -152576 -182784 123392 -3072 -884736 -301056 -90112 153600 535552 70656 -145408 283136
497 13312 -308736 438784 324096 -264704 -406528 163840 -50688 94720 -339456 -281088 -98304
485 487424 211456 -433152 129536 674304 -104960 -1502720 -155648 626688 -67584 23040
474 -39424 -479744 -50176 595456 -589312 -550912 456704 505344 585216 -289280 37376 -177152
462 -523264 404992 -934912 -395776 834560 366592 327168 -814080 828416 -690688 268288
451 368128 -28160 -74752 -128512 293888 155648 747008 -1220608 -326144 -176640 -633856
441 -633856 -543744 103424 -215552 204288 1313792 129536 262656 -141824 -520192 356352
430 39424 721408 233984 -262144 -217600 39424 -594432 -785408 -303616 -938496 -779776
420 -779776 -605184 -180736 -79360 -64512 461312 -315904 -90112 -254976 201216 -486912
409 539136 167936 1182720 -390144 -155136 308736 596992 166912 698368 -189440 72192
398 -577536 142336 -218112 141824 -123392 357376 -562176 -496128 -2072576 -55296 198656
387 -172544 50176 419840 -352256 -525824 318464 -524800 854528 -530432 -394752 -612864
377 -612864 595456 -241664 -829440 -404480 40960 104960 105472 -1793536 245760 138752 -225792
365 -444928 60928 233472 -43520 -610816 692736 381952 -1038848 676864 548864 957440
355 957440 382464 286208 -337408 -1543680 -653312 -327680 -82432 -795648 -370688 -496128
345 -496128 -698880 692736 441856 -1061376 -241152 -367104 457216 -885248 -101888 -382976
335 -382976 19968 787968 150016 -477184 443392 400384 -412672 -40448 763904 96256 -833536
323 -626688 205824 -341504 -275968 503808 -148480 -837120 -610816 -606720 -126976 -168448 -417792
312 -417792 550912 334848 324096 -949248 -412160 -13824 522752 603136 655872 -1174016
301 253952 -400896 -407040 -86528 -80896 -1600512 213504 -273408 -443392 -176128 -607232 -132608
289 -395264 216576 672256 -163840 110592 1115648 73216 37376 237056 252416 -104960
278 -140288 305664 -8192 739328 -138240 -1124352 -747008 1023488 -393728 171008 54272
267 836608 287232 -301056 -771072 -208384 347648 404992 -299520 -1395200 162816 -23040
256 -713728 806912 -311808 -467968 -389120 -549376 -613376 -835584 505344 723968 406528
246 406528 -56320 29184 -200192 -257024 707584 -752128 408064 -428544 -431104 -182272 102912
234 -137216 57344 -827392 -734208 235008 -828928 -1303040 403456 -652288 -293376 -315904
224 -315904 -1135616 -522240 708608 862720 -214016 525824 778752 -201728 407040 -890880
213 -72192 351744 -430592 898560 600576 139776 -274944 -562176 -153600 -1058304 -401408
202 -1233920 754688 430080 -1537536 -122880 -381440 -134656 -223744 -959488 528384 -358400
191 31744 -86528 -444928 -791552 695296 -461312 512 442368 -1765888 -940032 88576 -702976
179 266240 -125440 214528 -515584 658432 -443392 -1252352 -1283072 -121344 -132096 -230400
169 -230400 265728 -399360 -1059840 598528 19456 -310784 166912 -625664 258560 76288
158 -610304 -239104 -154112 -729600 -284160 -652800 -234496 162816 -265728 440320 -283136
147 329216 316928 840192 -230912 -203264 540672 780288 -546304 -662016 -764416 -32256
136 -393216 -279040 -977920 -479232 346624 137728 -920064 1682432 -158720 597504 -486912
125 246784 -313856 -1406464 713216 -175104 -121344 -222720 -184832 505344 32768 -736256
114 -1089536 812544 266752 -192512 448512 -157184 244224 451584 288256 -556032 -701952
104 -701952 -197632 560640 70144 301056 -641024 -412160 308224 -726016 309760 -101888
93 335360 532480 -301056 -870912 -189440 -560128 245760 -115712 477184 76800 -356864
82 -230400 -1070592 -360960 109056 412672 -371712 103936 1110016 -549376 -841216 45056
71 -354816 259584 827904 441856 -160768 311808 -409600 851456 384000 -476672 -114176
60 665600 -421376 1142784 -250368 -1386496 408064 -379392 446464 70656 -345600 384000
49 -1505792 145408 1370112 -312832 -114176 -725504 -1586176 -637440 293888 616960 -65536
38 376832 -467968 -1065472 -542208 162816 -886784 -637440 -663552 192512 -271872 862720
27 -575488 -60928 -404992 -124928 679936 -46592 -1198592 431616 61440 -456704 -233984
17 -233984 418816 50176 568320 -210432 -31744 -699392 338432 -351232 470528 241152
7 241152 -78336 -151040 -174080 517632 -379392 -544256 423424
##END=
