##TITLE=1204
##JCAMPDX= 6.0         $$ Bruker NMR JCAMP-DX V2.0
##DATA TYPE= NMR SPECTRUM
##DATA CLASS= XYDATA
##ORIGIN= NUTS EXPORT
##OWNER= Administrator
$$ 1.72 TOPSPIN		Version 2.1
$$ 2016-02-23 12:17:33.652 -0800  Administrator@X
$$ Compression mode = diff/dup
##.OBSERVE FREQUENCY= 90.275459
##.ACQUISITION MODE= SIMULTANEOUS (DQD)
##.ACQUISITION SCHEME= undefined
##.AVERAGES= 16
##.DIGITISER RES= 22
##SPECTROMETER/DATA SYSTEM= 
##.PULSE SEQUENCE= zg30
##.SOLVENT NAME= None
##.SHIFT REFERENCE= INTERNAL, None, 1, 14.58013
##AUDIT TRAIL= $$ (NUMBER, WHEN, WHO, WHERE, PROCESS, VERSION, WHAT)
$$ ##TITLE= Audit trail, TOPSPIN		Version 2.1
$$ ##JCAMPDX= 5.01
$$ ##ORIGIN= Bruker BioSpin GmbH
$$ ##OWNER= Administrator
$$ $$ E:/data/jwist/nmr/1204/1/pdata/1/auditp.txt
$$ ##AUDIT TRAIL=  $$ (NUMBER, WHEN, WHO, WHERE, PROCESS, VERSION, WHAT)
(   1,<2016-02-23 08:03:34.308 -0800>,<Administrator>,<X>,<jcamp>,<TOPSPIN 2.1>,
      <fromjdx created from
       E:\data\jwist\nmr\uniandes\1204
       data hash MD5: 8K
       FE 01 AD B3 44 29 CE 93 79 72 AF E5 32 5C FB 31>)
$$ ##END=
$$ 
$$ $$ hash MD5
$$ $$ CA C4 9A 9D 45 61 CC F3 27 30 11 B8 36 4E 5A 55
##$RELAX= 
$$ Bruker specific parameters
$$ --------------------------
##$DU= <E:>
##$EXPNO= 1
##$NAME= <1204>
##$PROCNO= 1
##$TYPE= <nmr>
##$USER= <jwist>
##$ACQT0= 0
##$AMP= (0..31)
100 100 100 100 100 100 100 100 100 100 100 100 100 100 100 100 100 100
100 100 100 100 100 100 100 100 100 100 100 100 100 100
##$ANAVPT= 1
##$AQSEQ= 0
##$AQ_mod= 3
##$AUNM= <au_zg>
##$AUTOPOS= <>
##$BF1= 90.275459
##$BF2= 400.02
##$BF3= 400.02
##$BF4= 400.02
##$BF5= 400.02
##$BF6= 400.02
##$BF7= 400.02
##$BF8= 400.02
##$BYTORDA= 0
##$CFDGTYP= 0
##$CFRGTYP= 0
##$CHEMSTR= <none>
##$CNST= (0..63)
1 1 145 1 1 1 1 1 1 1 1 1 1 1 1 1 1 1 1 1 1 1 1 1 1 1 1 1 1 1 1 1 1 1 1
1 1 1 1 1 1 1 1 1 1 1 1 1 1 1 1 1 1 1 1 1 1 1 1 1 1 1 1 1
##$CPDPRG= <>
##$CPDPRG1= <>
##$CPDPRG2= <>
##$CPDPRG3= <>
##$CPDPRG4= <mlev>
##$CPDPRG5= <mlev>
##$CPDPRG6= <mlev>
##$CPDPRG7= <mlev>
##$CPDPRG8= <mlev>
##$CPDPRGB= <>
##$CPDPRGT= <>
##$D= (0..63)
0 1 0 0 0 0 0 0 0 0 0 0 0 0 0 0 0 0 0 0 0 0 0 0 0 0 0 0 0 0 0 0 0 0 0 0
0 0 0 0 0 0 0 0 0 0 0 0 0 0 0 0 0 0 0 0 0 0 0 0 0 0 0 0
##$DATE= 0
##$DBL= (0..7)
120 120 120 120 120 120 120 120
##$DBP= (0..7)
150 150 150 150 150 150 150 150
##$DBP07= 0
##$DBPNAM0= <>
##$DBPNAM1= <>
##$DBPNAM2= <>
##$DBPNAM3= <>
##$DBPNAM4= <>
##$DBPNAM5= <>
##$DBPNAM6= <>
##$DBPNAM7= <>
##$DBPOAL= (0..7)
0.5 0.5 0.5 0.5 0.5 0.5 0.5 0.5
##$DBPOFFS= (0..7)
0 0 0 0 0 0 0 0
##$DE= 6.5
##$DECBNUC= <off>
##$DECIM= 2432
##$DECNUC= <off>
##$DECSTAT= 4
##$DIGMOD= 1
##$DIGTYP= 12
##$DL= (0..7)
0 120 120 120 120 120 120 120
##$DP= (0..7)
150 150 150 150 150 150 150 150
##$DP07= 0
##$DPNAME0= <>
##$DPNAME1= <>
##$DPNAME2= <>
##$DPNAME3= <>
##$DPNAME4= <>
##$DPNAME5= <>
##$DPNAME6= <>
##$DPNAME7= <>
##$DPOAL= (0..7)
0.5 0.5 0.5 0.5 0.5 0.5 0.5 0.5
##$DPOFFS= (0..7)
0 0 0 0 0 0 0 0
##$DQDMODE= 0
##$DR= 22
##$DS= 2
##$DSLIST= <SSSSSSSSSSSSSSS>
$$ [...]
##$SPOFFS= (0..31)
0 0 0 0 0 0 0 0 0 0 0 0 0 0 0 0 0 0 0 0 0 0 0 0 0 0 0 0 0 0 0 0
##$SUBNAM0= <"">
##$SUBNAM1= <"">
##$SUBNAM2= <"">
##$SUBNAM3= <"">
##$SUBNAM4= <"">
##$SUBNAM5= <"">
##$SUBNAM6= <"">
##$SUBNAM7= <"">
##$SUBNAM8= <"">
##$SUBNAM9= <"">
##$SW= 20.5580556627758
##$SWIBOX= (0..15)
0 0 3 4 0 0 0 0 0 0 0 0 0 0 0 0
##$SW_h= 8223.68421052631
##$SWfinal= 0
##$TD= 65536
##$TD0= 1
##$TE= 300
##$TE2= 300
##$TE3= 300
##$TEG= 300
##$TL= (0..7)
0 120 120 120 120 120 120 120
##$TP= (0..7)
150 150 150 150 150 150 150 150
##$TP07= 0
##$TPNAME0= <>
##$TPNAME1= <>
##$TPNAME2= <>
##$TPNAME3= <>
##$TPNAME4= <>
##$TPNAME5= <>
##$TPNAME6= <>
##$TPNAME7= <>
##$TPOAL= (0..7)
0.5 0.5 0.5 0.5 0.5 0.5 0.5 0.5
##$TPOFFS= (0..7)
0 0 0 0 0 0 0 0
##$TUNHIN= 0
##$TUNHOUT= 0
##$TUNXOUT= 0
##$USERA1= <user>
##$USERA2= <user>
##$USERA3= <user>
##$USERA4= <user>
##$USERA5= <user>
##$V9= 5
##$VALIST= <valist>
##$VCLIST= <CCCCCCCCCCCCCCC>
##$VD= 0
##$VDLIST= <DDDDDDDDDDDDDDD>
##$VPLIST= <PPPPPPPPPPPPPPP>
##$VTLIST= <TTTTTTTTTTTTTTT>
##$WBST= 1024
##$WBSW= 4
##$XGAIN= (0..3)
0 0 0 0
##$XL= 0
##$YL= 0
##$YMAX_a= 1796851968
##$YMIN_a= -2176773.12
##$ZGOPTNS= <>
##$ZL1= 120
##$ZL2= 120
##$ZL3= 120
##$ZL4= 120
##$ABSF1= 10
##$ABSF2= 0
##$ABSG= 5
##$ABSL= 3
##$ALPHA= 0
##$AQORDER= 0
##$ASSFAC= 0
##$ASSFACI= 0
##$ASSFACX= 0
##$ASSWID= 0
##$AUNMP= <proc_1d>
##$AXLEFT= 0
##$AXNAME= <>
##$AXNUC= <off>
##$AXRIGHT= 0
##$AXTYPE= 0
##$AXUNIT= <>
##$AZFE= 0.1
##$AZFW= 0.1
##$BCFW= 1
##$BC_mod= 2
##$BYTORDP= 0
##$COROFFS= 0
##$CY= 15
##$DATMOD= 1
##$DC= 2
##$DFILT= <>
##$DTYPP= 0
##$F1P= 0
##$F2P= 0
##$FCOR= 0.5
##$FTSIZE= 0
##$FT_mod= 4
##$GAMMA= 1
##$GB= 0
##$INTBC= 1
##$INTSCL= 1
##$ISEN= 128
##$LB= 0.3
##$LEV0= 0
##$LPBIN= 0
##$MAXI= 10000
##$MC2= 0
##$MEAN= 0
##$ME_mod= 0
##$MI= 0
##$NCOEF= 0
##$NC_proc= -10
##$NLEV= 6
##$NOISF1= 0
##$NOISF2= 0
##$NSP= 1
##$NTH_PI= 0
##$NZP= 0
##$OFFSET= 14.58013
##$PC= 1
##$PHC0= 0
##$PHC1= 0
##$PH_mod= 0
##$PKNL= yes
##$PPARMOD= 0
##$PPDIAG= 0
##$PPIPTYP= 0
##$PPMPNUM= 2147483647
##$PPRESOL= 1
##$PSCAL= 4
##$PSIGN= 0
##$PYNMP= <proc.py>
##$REVERSE= no
##$SF= 90.2741427912104
##$SI= 8192
##$SIGF1= 0
##$SIGF2= 0
##$SINO= 400
##$SIOLD= 32768
##$SPECTYP= <>
##$SREGLST= <1H.CDCl3>
##$SSB= 0
##$STSI= 0
##$STSR= 0
##$SW_p= 1497.18866228788
##$SYMM= 0
##$S_DEV= 0
##$TDeff= 0
##$TDoff= 0
##$TI= <>
##$TILT= no
##$TM1= 0
##$TM2= 0
##$TOPLEV= 0
##$USERP1= <user>
##$USERP2= <user>
##$USERP3= <user>
##$USERP4= <user>
##$USERP5= <user>
##$WDW= 1
##$XDIM= 8192
##$YMAX_p= 1796851881
##$YMIN_p= -2176772
##$CURPLOT= <PDFCreator>
##$CURPRIN= <$PDFCreator>
##$DFORMAT= <normdp>
##$LAYOUT= <+/1D_H.xwp>
##$LFORMAT= <normlp>
##$PFORMAT= <normpl>
##$SURQMSG= 1
$$ End of Bruker specific parameters
$$ ---------------------------------
##XUNITS= HZ
##YUNITS= ARBITRARY UNITS
##XFACTOR= 0.182762287876938
##YFACTOR= 1
##DELTAX= -0.182762287876938
##NPOINTS= 8192
##FIRSTX= 1497.0059
##FIRSTY= -599737
##LASTX= 0
##MAXY= 1796851881
##MINY= -2176772
##XYDATA= (X++(Y..Y))
$$ plain form
8191 -599737 178854 86582 -258895 566883 -185313 814015 -75832 167399 -616728 -397660
8181 -397660 252243 -548763 1516305 -306691 -577081 -222387 682723 246794 -147063 -321252
8171 -321252 -512403 460575 -146922 1039207 -768380 -551355 537814 -499994 1613898
8161 230608 733251 203212 -1829 -810723 712690 -443082 -981477 385121 -285011 367267
8150 764520 496923 868080 195193 1449319 504530 685913 180503 109426 -375804 1033826
8139 1007038 410924 646937 -163577 639262 -323544 683909 854550 1036052 826877 270741
8128 457242 88361 -590738 -174725 -568355 -85909 477782 -696439 -672528 193555 -56557
8117 820645 384268 -16538 346055 -369745 148390 -1062077 -1077306 -617678 1001769 -457021
$$ packed form
8191e99737A78854H6582b58895E66883a85313H14015g5832A67399f16728K19068
8181c97660B52243e48763A516305c06691k70390b22387F82723B46794a47063j74189
8171c21252j91151D60575a46922A039207g68380K17025E37814d99994A613898
8161B30608N02643B03212a829q08894G12690d43082n38395C85121b85011C67267
8150G64520k67597L71157A95193J254126E04530J81383A80503p1077c75804A033826
8139A007038D10924K36013a63577F39262c23544F83909J70641J81502k09175B70741
8128D57242H8361e90738a74725l93630h5909D77782f96439K3911A93555e6557
8117H20645C84268a6538C46055c69745A48390a062077j5229M59628A001769d57021
$$ plain form
8106 -19 130837 674265 -569088 -1031936 -918885 592686 -560176 -735553 -406312 892774
8095 267962 -1354880 -340704 795801 47002 739070 -477148 -832453 253905 667162 -258702
8084 1666552 336661 -413485 259800 -848745 148321 -522406 345872 -856384 473176 143548
8073 264124 -638886 -865782 435705 -125679 251810 -210325 476588 -954848 195842 119690
8063 119690 -83428 -917345 -275345 414672 -536913 -75372 402950 600095 -351911 -889915
8053 -889915 737762 1007821 -58412 -228275 -1249333 368722 -127651 -449268 1269364 -660100
8042 327857 -658046 184547 -347046 193886 -70136 -1429551 -1804897 25247 -251583 -850432
8032 -850432 -68489 -296389 1260110 106336 -988482 -643450 138271 356699 -377698 1330520
$$ packed form
8106a9A30837N43428e69088m62848J13051E92686e60176j75377L29241H92774
8095B67962a354880c40704G95801D7002O92068d77148l55305B53905M13257b58702
8084A666552C36661d13485B59800h48745A48321e22406C45872h56384D73176A43548
8073B64124f38886k26896D35705a25679B51810b10325D76588i54848A95842p6152
8063A19690h3428q33917b75345D14672e36913g5372D02950J97145c51911n38004
8053h89915G37762K70059e8412j69863j021058C68722a27651l21617A269364f60100
8042C27857f58046A84547c47046A93886g0136j359415l75346B5247b51583n98849
8032h50432f8489k27900A260110A06336i88482L45032A38271K18428c77698A330520
$$ plain form
8021 -152655 267282 -157963 -824121 9989 597451 -297381 44147 -727799 -832504 1522169
8010 403259 -507247 477503 -800684 164122 -480091 854769 435382 122828 -28228 -1304514
8000 -1304514 910469 324067 23986 -582666 -353853 384733 276358 -281273 -150224 -979310
7990 -979310 605569 171167 1529720 778211 -4672 -23103 -472100 817380 -573949 -757647
7980 -757647 -683535 454681 -829410 889964 -1228370 -613575 -955579 -486170 -88010 514071
7969 628194 213279 -281304 -20109 306830 1525714 385182 -1923396 -122125 -1217398
7960 -1217398 14927 529221 1213364 -611753 -858062 326931 431211 -58476 -1305379 344595
7949 285423 -363685 1131028 -832360 -105840 1057818 409506 -1195001 -230842 -155592
$$ packed form
8021a52655B67282a57963o66158I989N87462b97381D4147g27799j04705A522169
8010D03259e07247D77503h00684A64122d80091H54769m19387A22828b8228j276286
8000a304514I10469C24067B3986e82666K28813C84733j08375b81273J31049q29086
7990i79310F05569A71167J358553p51509d672j8431m48997H17380e73949j83698
7980g57647P4112D54681h29410H89964a228370f13575l42004M69409h8010E14071
7969F28194B13279b81304b0109C06830J218884C85182a923396a22125j095273
7960a217398A4927N14294O84143f11753k46309C26931J04280e8476j246903C44595
7949B85423c63685A131028h32360a05840A057818D09506a195001b30842P5250
$$ plain form
7940 -155592 -998995 -1183328 -66892 481689 -308997 -39171 654986 -447065 -905176 1047522
7929 -136691 -584093 -253938 -314533 -358259 115988 -413421 330769 -1222953 268196 -126718
7918 -53815 902846 -175044 708759 -479105 254786 -74139 -120873 -133279 626856 229186
7907 -177810 413105 282573 40246 372617 -112829 -824546 1768433 697433 -600689 291321
7896 904665 1361780 -572806 507813 1275691 106670 -243106 -756292 457165 204844 -78668
7885 767804 -670804 -469601 -93242 215064 1089363 -700368 -1052745 -192413 -316948 -230287
7875 -230287 178462 801304 -282545 -750351 -825554 -119739 495783 830877 271798 343879
7865 343879 371020 -118391 457924 -698455 -252148 -14458 316360 -1235191 -523534 129546
$$ packed form
7940a55592q43403j84333f6892D81689c08997c9171F54986d47065m58111A047522
7929a36691m47402b53938o0595m3726A15988d13421C30769a222953B68196a26718
7918e3815I02846a75044G08759d79105B54786g4139m6734j2406F26856B29186
7907a77810D13105j30532D0246L32371a12829p11717A768433F97433f00689B91321
7896I04665M57115e72806E07813P67878A06670b43106n13186D57165B04844g8668
7885G67804f70804K01203i3242B15064Q74299g00368l52377a92413j24535Q6661
7875b30287A78462O22842b82545m67806p5203a19739D95783L35094B71798P2081
7865C43879K7141a18391D57924f98455b52148a4458C16360a235191e23534A29546
$$ plain form
7854 -592973 -420364 -96986 -57179 -1240852 339086 384410 80877 1029556 -335519 61861
7843 96311 1787433 -12588 -119672 -798551 1007166 565767 -68988 10315 -210207 300540
7832 -967737 -773204 -366478 -233655 -431428 -317794 -462792 -757752 674845 1093956 -513887
7821 -1200434 844282 192171 41848 876965 147033 805533 569494 -1016509 337915 572167
7811 572167 -775799 402516 940565 -1109963 1114634 189034 461716 -115759 101159
7801 113983 643351 -1098694 295882 373001 930075 -414133 -1402380 -981144 247284 -429434
7790 450934 18015 350552 127526 1519874 37292 671092 -115611 -160312 -29142 805873
7779 615841 -794850 -1166239 633831 216341 -156196 -58311 -21298 -172828 461993 1275314
$$ packed form
7854e92973J72609i6986L9807j183673C39086M5324H0877R48679c35519F1861
7843I6311J691122a2588j07084o78879A007166m41399f8988A0315b10207C00540
7832i67737J94533c66478J32823j97773J13634j44998k94960F74845M19111e13887
7821a200434H44282A92171D1848Q35117A47033O58500k36039a016509C37915K34252
7811E72167g75799D02516N38049a109963A114634A89034K72682a15759A01159
7801A13983N29368a098694B95882P7119N57074d14133r88247M21236B47284d29434
7790D50934A8015L32537A27526J392348C7292O33800a15611m4701b9142H05873
7779F15841g94850l71389F33831B16341a56196e8311b1298j51530D61993Q13321
$$ plain form
7769 1275314 611664 -1123174 -2176772 184517 145908 1326156 600641 820966 561088
7760 561088 -32548 40809 685960 123532 17741 628822 563246 -396494 -243922 -833696
7750 -833696 158053 -286093 -83020 1056899 728901 137192 98299 -333075 -516474 -587340
7740 -587340 1025172 -108027 -384135 599654 641006 28770 501489 770954 137921 451049
7730 451049 41765 -179168 962482 543152 504202 471022 796506 255156 22327 -67079 116750
7718 458105 487000 -319069 -131519 -366156 925638 517695 -323096 258085 148967 1170035
7708 1170035 127104 -626688 467349 921178 -398053 -66150 -620207 851639 266256 646559
7698 646559 502546 -115045 -1146096 937223 -433294 -215157 -860328 491473 -502841 579204
$$ packed form
7769A275314F11664a123174j053598A84517l8609J180248F00641K20325k59878
7760E61088c2548D0809O45151A23532A7741O11081o5576c96494J52572n89774
7750h33696A58053b86093h3020A056899l27998A37192l8893c33075j83399p0866
7740e87340A025172a08027k76108E99654M1352B8770M72719K69465A37921L13128
7730D51049D1765a79168I62482m19330l8950l3180L25484B55156B2327f7079A16750
7718D58105K8895c19069a31519k34637I25638m07943c23096B58085j09118J021068
7708A170035A27104f26688D67349M53829c98053f6150n54057H51639B66256L80303
7698F46559j44013a15045j031051I37223d33294b15157o45171D91473e02841E79204
$$ plain form
7687 -413359 -501424 19987 293202 -449498 -84398 -1542951 -962564 -306652 892958 -1421958
7676 -463940 799164 3462 702830 799591 667343 925001 1023908 651958 97203 450097 544887
7665 544887 399399 -519283 621815 -428637 719088 -112087 958069 232542 129773 -495548
7654 579287 21342 590415 227111 -396053 260590 -161058 1256036 -218718 -892036 -19707
7643 269177 24781 -1305172 -103195 1199618 100038 -55408 783399 -7164 -327440 -505930
7633 -505930 -764009 53656 -391571 -224743 516464 -302678 1379489 816324 -1149638 391734
7622 125318 460265 125264 653339 1484335 -873955 464192 355567 -880136 -190362 -536871
7612 -536871 -647123 123401 -845170 23442 -130544 -664539 357893 1161742 36052 -299768
$$ packed form
7687d13359q8065A9987K73215d49498h4398j458553N80387c06652H92958a421958
7676d63940G99164C462O99368R6761j32248K57658R8907l71950I7203L52894R4790
7665E44887j45488e19283F21815d28637G19088a12087I58069B32542j02769d95548
7654E79287B1342N69073B27111c96053B60590a61058A256036b18718o73318a9707
7643B69177B4781a305172a03195A199618A00038e5408G83399g164l20276j78490
7633e05930k58079E3656c91571J66828E16464c02678A379489n63165a149638C91734
7622A25318L34947A25264N28075Q30996h73955D64192j08625h80136a90362l46509
7612e36871j10252A23401h45170B3442a30544n33995C57893Q03849C6052b99768
$$ plain form
7601 -67161 -732790 800772 564237 415315 486545 -228531 -447581 -630126 360573 260822
7591 260822 318829 1185700 -47549 695665 -58055 -1120648 -626650 37192 -214110 -329682
7581 -329682 102602 106166 -1184451 -24251 415686 506963 -337413 -84446 -573262 -323139
7571 -323139 -976865 -315892 1479098 -100016 -276448 324925 44962 499745 625504 323751
7561 323751 -311827 94669 -5455 728258 345001 92668 440817 -387724 -185040 -168561 197826
7549 289172 214501 -343740 -119593 60275 90330 376189 421880 -83901 531847 95513 -164935
7537 847437 835094 -407479 -718777 310001 672249 -648448 379227 1160774 233769 -276306
7526 1528250 748052 -396784 -305786 -151224 -241850 -435574 733967 -473009 -553879 -129848
$$ packed form
7601f7161o65629H00772k36535j48922P1230b28531k19050j82545C60573r9751
7591B60822N8007Q66871d7549F95665e8055j062593M93998C7192b14110j15572
7581c29682A02602L564a184451b4251D15686R1277c37413h4446m88816K50123
7571c23139o53726c15892A479098a00016j76432C24925D4962M54783J25759l01753
7561C23751c11827I4669e455G28258C45001I2668L48149c87724a85040J6479A97826
7549B89172p4671c43740a19593F0275L0055K85859M5691h3901E31847I5513a64935
7537H47437j2343d07479l11298C10001L62248f48448C79227P81547B33769b76306
7526A528250G48052c96784R0998a51224r0626j93724G33967d73009q0870a29848
$$ plain form
7515 176036 627371 206813 182381 62261 -617591 212289 1222589 605064 -170493 -403334
7505 -403334 -607406 401293 -260036 624247 494924 247668 967274 1056073 -285265 -186049
7495 -186049 -625843 511135 -766809 505893 783643 -989261 -550248 1165406 -315365 -997029
7485 -997029 247891 102359 46711 -417973 405061 406825 270503 434938 742205 829731
7475 829731 -12979 -214553 235909 -402739 -277776 -584811 1560522 564500 -184121 608272
7464 401627 1006382 585733 -710907 104679 -512367 219949 -336392 132399 -758793 156430
7453 -305085 543196 -161368 202352 490491 1256491 147279 624778 -421731 743382 172360
7442 -64808 1255864 -902854 -500599 1110533 1330659 -552059 539632 229106 -592780 -1059414
$$ packed form
7515A76036M51335B06813k4432F2261f17591B12289J010300F05064a70493k32841
7505d03334k04072D01293b60036F24247j29323k47256P19606Q8799b85265R9216
7495a86049m39794E11135g66809E05893K77750i89261M39013A165406c15365o81664
7485i97029B47891A02359D6711d17973D05061J764j36322J64435L07267Q7526
7475H29731a2979k01574B35909d02739J24963l07035A560522E64500a84121F08272
7464D01627O04755m20649g10907A04679e12367B19949c36392A32399g58793A56430
7453c05085E43196a61368B02352K88139P66000A47279M77499d21731G43382A72360
7442f4808A255864i02854M02255A110533K20126e52059E39632B29106e92780m66634
$$ plain form
7432 -1059414 673722 500957 664303 -53602 -899017 18750 551884 -129433 -59667 705076
7421 1241748 428704 922327 -686507 -828211 573736 197413 148350 343651 -737504 180093
7410 -83723 649358 -609520 1201444 845033 -19832 -161789 -1152030 435518 291352 -332573
7399 364888 -15419 235504 446054 168759 832678 -377226 161150 -580430 19647 195179
7389 195179 87119 1387624 -758827 -614717 139517 324113 201682 1284857 35615 390105
7379 390105 -101572 -384709 332348 -698683 -12801 773318 391714 -253166 -725721 625553
7368 644337 659450 227084 583244 193125 608211 85805 198389 -1641828 -251285 528015
7357 553846 -38178 -465011 852099 840298 512312 -19968 -453808 957572 471393 -107133
$$ packed form
7432a059414F73722j72765J63346e3602q45415A8750N33134a29433e9667G05076
7421A241748D28704M93623f86507j41704E73736A97413m9063J95301g37504A80093
7410h3723F49358f09520A201444l56411a9832j41957r90241D35518j44166c32573
7399C64888a5419B35504K10550A68759O63919c77226A61150e80430A9647J75532
7389A95179H7119J300505g58827J44110A39517J84596j22431J083175C5615L54490
7379C90105a01572k83137C32348f98683a2801G73318l81604b53166m72555F25553
7368F44337J5113B27084L56160A93125M15086H5805J12584a641828b51285E28015
7357E53846c8178m26833H52099j1801l27986a9968m33840I57572D71393a07133
$$ plain form
7346 -1542656 -217430 -134174 362947 -228878 789851 539585 -87123 -657794 580324 290139
7335 469464 1438116 -769285 169918 -339148 386912 -510999 -578754 -435126 -15597 651633
7324 130546 -674001 -1282196 -270609 413225 -249714 184729 516891 64699 18459 180204
7314 180204 -387372 -32808 566469 -850436 -120699 60851 -1182426 -75165 532376 29724
7303 170189 97246 830619 358517 -120669 761617 -944174 684935 343502 10570 110060
7293 110060 -1016250 -299079 -953936 -301615 1665543 -495311 721814 246447 538280
7284 538280 -553032 271290 554932 -492334 -722178 -129673 -105769 -184099 931124 -341336
7273 -1056484 -144414 -298789 -324252 -68451 -439846 -327230 1005365 -52136 381640 495899
$$ packed form
7346a542656b17430Q3256C62947b28878G89851k50266h7123n70671E80324B90139
7335D69464R68652g69285A69918c39148C86912e10999o7755J43628a5597F51633
7324A30546f74001o08195b70609D13225b49714A84729L32162F4699A8459J61745
7314A80204c87372c2808E66469h50436a20699F0851a182426g5165E32376B9724
7303A70189p2943P33373C58517a20669G61617i44174F84935l41433A0570R9490
7293A10060a016250b99079o54857c01615A665543d95311G21814B46447K91833
7284E38280e53032B71290K83642d92334k29844a29673K3904p8330I31124c41336
7273a056484a44414j54375k5463f8451l71395J12616A005365e2136C81640J14259
$$ plain form
7263 495899 1912066 -1114389 413409 20068 525666 -1103792 -402557 -141297 158177
7253 189127 610119 -304689 1648 312089 44556 -98617 -510788 1247860 126097 355247
7243 355247 578809 39404 157467 1535500 494093 887587 642233 996360 500739 168896
7232 730841 1062942 478327 -93968 -526640 105458 246930 351775 640925 154364 50415
7221 1412877 -1323654 298673 1070102 174099 -58660 113264 1161400 621982 -914981
7211 -814862 -473872 671145 -628871 63005 587233 992013 273605 232546 -180093 329564
7200 534072 410803 -523517 75364 247545 1438639 454495 -440923 -694903 687528 1072965
7190 1072965 578779 896692 622968 -433969 -595784 517561 -451014 122769 1132987
$$ packed form
7263D95899J416167a114389D13409B0068N05598a103792d02557a41297A58177
7253A89127M20992c04689A648L10441D4556i8617m12171A247860A26097K29150
7243C55247K23562C9404J18063J378033D94093L93494k45354L54127m95621A68896
7232G30841L32101D78327i3968m32672A05458J41472J04845K89150A54364E0415
7221A412877a323654B98673P71429A74099e8660A13264J048136n39418i14981
7211h14862L40990F71145f28871F3005N24228M04780B73605m1059a80093C29564
7200E34072j23269e23517G5364J72181J191094D54495d40923k53980F87528L85437
7190A072965m94186L17913k73724d33969j61815E17561d51014A22769J010218
$$ plain form
7181 1132987 327504 653510 -546640 -901209 498078 826110 931429 34108 25474 303792
7171 303792 1709157 41818 1527545 550031 704865 1813955 443308 245500 -7941 48111
7160 625889 573140 57840 294473 -488623 -173578 -342448 1059243 251082 928421 -649405
7149 542899 -864964 1000679 372375 1391827 644068 1372820 520299 54813 -578000 -324120
7139 -324120 68755 5360 959369 321526 -1359831 344976 -636210 216340 291408 269504
7129 269504 648266 8332 -238920 -216335 25134 -162227 345315 -21971 823579 -793914 568131
7117 -246784 102488 486153 162844 742170 49854 260595 -265926 1038228 712374 1197505
7107 1197505 -758208 789558 608821 -1207063 501644 -264324 -591001 403464 -555219
$$ packed form
7181A132987C27504L26006e46640l54569D98078L28032J05319C4108q634K78318
7171C03792J405365D1818J485727E50031J54834J109090D43308j97808g941D8111
7160F25889n2749E7840K36633d88623a73578j68870A059243B51082O77339f49405
7149E42899h64964A000679C72375J019452F44068P28752E20299E4813e78000K53880
7139c24120F8755E360R54009C21526a359831C44976f36210B16340P5068k1904
7129B69504L78762H332b38920K2585B5134a62227C45315b1971H23579g93914E68131
7117b46784A02488L83665A62844N79326D9854K10741b65926A038228l25854M85131
7107A197505g58208G89558j80737a207063E01644b64324l26677D03464e55219
$$ plain form
7097 -1031154 266218 -123153 -201459 584096 598341 601967 17685 -873 616943 -421492 1618276
7085 429034 -150436 1136067 102735 42865 925430 1249018 -135316 -145652 1083045 762801
7075 762801 285245 1340413 735636 1998476 182127 208071 447827 1436897 930400 -351540
7064 839147 -320326 1184034 24022 84360 803291 288021 986758 -593752 -72215 -127758
7054 -127758 -405365 -458764 51315 183941 -394829 653241 -81688 -658525 989374 -197478
7043 1102731 695131 754584 610017 665394 -339383 -161657 754295 -385017 502580 -262593
7032 -582354 310091 642438 136467 1811 654305 694122 1502028 280721 -304206 147317
7021 761051 400567 597419 421104 609509 425241 1189020 9430 -529408 599595 -228477
$$ packed form
7097a031154B66218a23153p8306E84096J4245L626A7685h73F16943d21492A618276
7085D29034a50436A136067A02735D2865Q82565L23588a35316j0336A083045l20244
7075G62801B85245J055168o04777J262840A82127K5944K39756R89070n06497c51540
7064H39147c20326A184034B4022O0338P18931B88021O98737e93752g2215n5543
7054a27758k77607n3399E1315J32626c94829F53241h1688n76837I89374a97478
7043A102731m07600N9453j44567N5377c39383a61657G54295c85017E02580b62593
7032e82354C10091L32347A36467A811O52494L9817Q07906B80721c04206A47317
7021G61051l60484J96852j76315J88405j84268P63779I430e29408E99595b28477
$$ plain form
7010 277424 493245 473158 825114 191748 1030513 789239 884465 -164524 138665 573756
7000 573756 366092 -474731 652874 89149 630656 -461768 1022471 826550 1163635 721540
6990 721540 -432449 259904 -844007 -591085 684165 322523 378816 -697809 427819 761649
6980 761649 839187 929940 218977 -597664 306321 865506 202359 1061596 717615 -284372
6969 -202216 277846 -176874 18127 219908 1508055 -286487 -165243 -548712 -36353 229794
6958 471916 -327282 357068 857745 323848 -925980 -1084517 -124381 -394648 983910 259756
6947 -278135 346625 -334868 190241 189708 -1168491 994544 -670568 -103499 397113 -259702
6936 -401868 -425505 575294 691548 -129748 -214499 568857 -161670 181173 65951 536213
$$ packed form
7010B77424K15821k0087L51956A91748Q38765k41274R5226a64524A38665M35091
7000E73756k07664d74731F52874H9149N41507d61768A022471j95921L37085m42095
6990G21540d32449B59904h44007K52922F84165C22523N6293f97809D27819L33830
6980G61649P7538R0753B18977e97664C06321N59185B02359Q59237l43981b84372
6969b02216B77846a76874A8127K01781J288147b86487J21244l83469c6353B29794
6958D71916c27282C57068N00677C23848i25980j58537a24381k70267I83910B59756
6947b78135C46625c34868A90241n33a168491I94544f70568a03499C97113b59702
6936d01868k3637E75294J16254a29748q4751E68857a61670A81173F5951M70262
$$ plain form
6926 536213 895534 1625489 133207 -583798 -59567 700760 -549321 278574 521164 -695520
6915 642174 32376 1240667 325070 208376 -14256 57601 900239 -98505 684325 48171
6904 1111006 497713 839853 525599 -113688 310054 123483 499347 22667 1229507 623423
6894 623423 -53805 588774 -69220 258728 -5033 -309670 94083 822588 1206556 165826 198548
6883 198548 376854 811617 -521263 -699235 1493898 -464830 848960 957142 460687 -909359
6872 -116415 -939709 329476 79196 248033 -305398 -61331 610803 -497485 110953 -223717
6861 132153 519473 1059417 151083 122878 519333 1331147 1428030 363840 526193 382294
6851 382294 1086423 442483 24237 351761 331829 650610 441519 817685 201600 511778
$$ packed form
6926E36213L59321P29955A33207e83798e9567G00760e49321B78574K42590f95520
6915F42174C2376J208291C25070j16694a4256E7601Q42638i8505F84325D8171
6904A111006D97713L42140l14254a13688C10054A23483L75864B2667J206840o06084
6894F23423e3805E88774f9220B58728e033l04637I4083P28505L83968A65826L2722
6883A98548J78306M34763e21263j77972A493898d64830H48960J08182D60687i09359
6872a16415q23294C29476G9196J68837c05398f1331F10803d97485A10953b23717
6861A32153L87320N39944A51083k8205L96455Q11814R6883C63840J62353j43899
6851C82294P04129D42483B4237L27524j9932L18781k09091L76166B01600L10178
$$ plain form
6841 511778 288545 528636 929389 622967 811405 1272275 -353716 -311126 -684189 310767
6830 261537 1739856 -778248 25357 1855884 817812 124121 -346293 1634306 878619
6821 878619 1443317 -225617 514394 408383 184732 95918 -368028 -624882 962425 1059381
6811 1059381 153403 661942 -307007 1164246 1788233 1409468 -522002 124248 504383
6802 504383 -107756 -203638 171381 -539645 141785 1289267 354539 1904215 -716455 -437255
6792 -437255 -190871 186613 634645 668717 777135 -389446 1058087 -498118 979126 639144
6782 639144 573191 137646 402854 -458491 318504 862410 1591694 819642 636585 1091618
6772 1091618 387080 1079872 788946 389424 -502943 30314 -545476 36462 1492972 1470767
$$ packed form
6841E11778k23233K40091M00753l06422J88438M60870c53716M2590l73063C10767
6830B61537J478319g78248B5357J830527H17812A24121c46293A634306p55687
6821H78619N64698b25617E14394j06011A84732q8814c68028k56854I62425R6956
6811A059381A53403N08539c07007A164246O23987l78765e22002A24248L80135
6802E04383a07756r5882A71381e39645A41785J147482C54539J549676g16455K79200
6792d37255a90871A86613M48032L4072J08418c89446A058087d98118I79126l39982
6782F39144o5953A37646K65208d58491C18504N43906P29284p72052j83057M55033
6772A091618C87080O92792k90926C89424e02943C0314e45476C6462J456510k2205
$$ plain form
6762 1470767 120357 1182015 -233371 -1083868 643870 918150 -578272 1212958 434601
6752 697856 547119 113228 -136974 574024 820505 -83368 287560 685220 757909 947390
6742 947390 414662 -235003 214590 -9156 654372 -21837 151166 1838850 -276647 -329668
6732 -329668 -90811 15442 -587499 -494813 -359384 410459 627177 57596 -98384 211064 348584
6721 348584 517462 1378028 925236 1090530 151317 615888 754586 -34224 -585890 152545
6710 95604 1030599 1165367 1214700 -133423 219822 1362366 367550 -346537 630987 -626021
6699 426481 -67645 -534893 -169292 260490 422269 214341 -718896 -32864 357677 711898
6689 711898 -684148 -918419 1138653 -389249 460638 38625 409096 576604 471729 449009
$$ packed form
6762A470767A20357J061658b33371q50497F43870K74280e78272A212958D34601
6752F97856j50737A13228a36974E74024K46481h3368B87560L97660P2689J89481
6742I47390D14662b35003B14590i156F54372b1837A51166J687684b76647n3021
6732c29668i0811A5442e87499R2686J35429D10459K16718E7596i8384B11064J37520
6721C48584J68878Q60566m52792J65294A51317M64571J38698c4224n51666A52545
6710I5604R34995J34768M9333a33423B19822J142544C67550c46537F30987f26021
6699D26481f7645m67248a69292B60490J61779k07928g18896c2864C57677L54221
6689G11898f84148k34271A138653c89249D60638C8625L70471J67508j04875k2720
$$ plain form
6679 449009 -83953 1011430 -680538 -535170 1636093 1685354 846373 775272 405881 1263708
6669 1263708 345022 -98073 237615 342439 333447 571380 -250196 1617219 615672 -25352
6658 688863 846318 -313602 1196858 726861 584899 605640 -637209 333121 -466755 -516180
6648 -516180 634893 1169720 -594550 540158 431255 1351985 275511 169196 1935950 37646
6637 -22087 685679 684984 1557686 -524165 337559 69427 75167 720060 1614782 -508386 172324
6625 675681 961387 324855 827609 1014095 -407585 178330 189606 903346 -191318 -74103
6614 -298810 110919 -107111 -437829 239953 218799 -1108228 893539 57580 437458 -81136
6603 130554 665144 210086 347113 -67548 462702 -304 678366 725745 335891 -689812 145218
$$ packed form
6679D49009h3953A011430f80538J45368A636093M9261q38981p1101l69391Q57827
6669A263708C45022i8073B37615J04824q992K37933b50196A617219F15672b5352
6658F88863J57455c13602A196858m69997j41962K0741f37209C33121d66755m9425
6648e16180F34893N34827e94550E40158j08903R20730B75511j06315J766754C7646
6637b2087F85679o95Q72702e24165C37559F9427N740O44893Q94722e08386A72324
6625F75681K85706C24855N02754J86486d07585A78330J1276P13740a91318g4103
6614b98810A10919a07111l30718B39953k1154a108228H93539E7580L79878h1136
6603A30554N34590B10086J37027f7548D62702c04F78366M7379C35891f89812A45218
$$ plain form
6591 881662 673638 1285174 407617 991765 221621 203001 501958 668114 -75949 1519661
6580 1217939 565493 -48459 744029 -272347 974617 18765 683205 -328278 1913048 -1332438
6569 183342 -868432 986742 -1139681 1222250 9934 -760359 644069 787646 1351101 527889
6558 286979 972765 810140 424118 322849 -8654 -584797 891433 -656415 641373 543739
6548 543739 -162499 -291597 -239338 520555 -170949 586667 -589474 1225204 -1056517 -695175
6538 -695175 1289129 -477016 168486 -430138 355274 -142876 -954801 663820 601786 1184568
6528 1184568 793184 -65773 -1104280 755620 35485 43184 -26216 648765 68295 -91126 845902
6516 765946 -414100 195683 203220 -953036 -219209 191301 849415 701062 -80783 306653
$$ packed form
6591H81662k08024O11536D07617N84148B21621j8620K98957J66156g5949A519661
6580A217939E65493d8459G44029b72347I74617A8765O64440c28278A913048a332438
6569A83342h68432I86742a139681A222250I934g60359F44069J43577N63455E27889
6558B86979O85786j62625l86022j01269h654n76143H91433f56415F41373r7634
6548E43739a62499j29098N2259E20555a70949E86667e89474A225204a056517L61342
6538f95175A289129d77016A68486d30138C55274a42876q11925F63820o2034N82782
6528A184568l91384f5773j038507G55620C5485P699b6216F48765F8295i1126H45902
6516G65946d14100A95683P537i53036b19209A91301O58114j48353h0783C06653
$$ plain form
6505 782537 -1311332 262313 738386 326622 494565 644334 136822 1311882 -792507
6495 299760 2026723 -344731 -9445 -313226 679054 -241559 -727438 144365 365713 1071137
6485 1071137 794722 1061239 660354 -891327 780923 771432 491822 63978 490300 1328106
6475 1328106 1290175 151920 1813681 524201 224087 261937 816664 24919 119387 234919
6465 234919 85409 149196 58287 259923 1695568 287595 410937 516679 1000903 107523
6454 485922 297803 938163 788725 -1007896 -66698 418092 1372994 1443661 1274074 1596041
6444 1596041 162576 631437 643396 569694 542119 867781 589837 1378840 -449864 407451
6433 739326 42000 1291392 -271887 -218791 209748 -295239 -449067 395947 62435 -1252157
$$ packed form
6505G82537a311332B62313M76073C26622J67943J49769A36822J175060g92507
6495B99760J726963c44731i445l03781F79054b41559m85879A44365K21348P05424
6485A071137k76415K66517m00885h91327G80923r491k79610F3978M26322Q37806
6475A328106l7931A51920J661761E24201B24087L7850N54727B4919R4468J15532
6465B34919H5409O3787E8287K01636J435645B87595J23342J05742M84224A07523
6454D85922j88119O40360j49438a007896f6698D18092R54902P0667j69587L21967
6444A596041A62576M68861J1959p3702k7575L25662k77944P89003d49864D07451
6433G39326D2000J249392b71887N3096B09748b95239j53828C95947F2435a252157
$$ plain form
6422 538905 1007630 -24299 1007675 1111355 615386 587027 -245608 801308 -865996 -6427
6411 256732 898573 -671062 472176 776020 19782 546394 -1175958 -503279 1156478 589428
6401 589428 1004139 221094 -762324 -159849 843034 1166313 -83818 -602653 -259238 319177
6390 -806067 481627 -271355 76256 9561 1258849 -185649 688789 126982 467915 -101433
6379 19479 1158709 1229702 834272 875728 -258046 559510 1398395 750267 -471422 310005
6368 868882 1620149 -332909 -1104171 1038435 1578037 78334 152136 621434 1414946 1176519
6358 1176519 1282583 1862004 218633 255394 689177 630721 773161 112626 1126787 -718777
6347 1247792 -700713 -73882 1412747 285187 412331 -82445 1084796 439276 1256487 597657
$$ packed form
6422E38905M68725b4299A007675J03680m95969k8359b45608H01308h65996f427
6411B56732O41841f71062D72176L03844A9782N26612a175958e03279A156478n67050
6401E89428M14711B21094g62324a59849H43034L23279h3818n18835b59238C19177
6390h06067D81627b71355G6256I561J249288a85649F88789A26982L40933a01433
6379A9479J139230P0993l95430M1456b58046E59510Q38885o48128d71422C10005
6368H68882P51267c32909p71262A038435N39602G8334P3802M69298P93512k38427
6358A176519J06064N79421B18633L6761M33783n8456J42440A12626J014161g18777
6347A247792g00713g3882A412747B85187J27144h2445A084796D39276Q17211E97657
$$ plain form
6336 -242373 524868 96626 -90041 173673 22508 -428349 -136605 322672 -200806 -365440
6326 -365440 392630 360684 -216628 1027946 -257833 -240924 685615 159554 1812164 827761
6315 550546 357352 363229 1033691 490695 1276041 754016 512355 -367451 1212008 299515
6304 554480 666549 326416 997711 174646 519537 512887 180376 999017 276163 315686
6294 315686 702430 851992 423873 -1170426 1106020 252665 969104 963657 587730 -175671
6283 39434 942099 -502850 -980911 604290 115059 1650494 2340220 319635 29539 529876
6273 529876 262562 878775 266520 360759 265803 1146882 -612848 1040500 125959 401186
6263 401186 1322842 615495 168730 -55948 -838654 701641 768294 628314 86983 -138437
$$ packed form
6336b42373E24868I6626i0041A73673B2508d28349a36605C22672b00806j64634
6326c65440C92630l1946b16628A027946b57833J6909F85615A59554J652610H27761
6315E50546j93194N877O70462D90695P85346n22025k41661c67451A212008B99515
6304E54480J12069C26416O71295A74646L44891o650A80376Q18641B76163L9523
6294C15686L86744J49562D23873a170426A106020B52665P16439n447l75927a75671
6283C9434R02665e02850m78061F04290A15059J535435O89726C19635B9539N00337
6273E29876B62562O16213B66520R4239r4956Q81079f12848A040500A25959K75227
6263D01186R21656F15495A68730e5948p82706G01641O6653j39980H6983a38437
$$ plain form
6252 -452190 184298 -142430 1134076 -447617 161968 1566460 643081 473144 346087
6243 346087 606622 940238 1224711 1064104 758804 773976 1347024 899255 34307 827851
6233 827851 1270341 96299 711521 500674 385641 -126160 391631 -466455 161803 740864
6223 740864 1067980 797712 925571 1648078 -139695 613707 923944 -289845 850964 -546561
6212 1397265 295989 2005218 939674 -148882 464585 -823311 2482573 576727 1122038
6203 1122038 69230 1669760 728520 -118722 111847 776713 471383 -764895 513805 -182708
6192 -6659 81684 716640 1195889 106214 383666 243067 -548820 1247791 166034 775710
6182 775710 287235 -49997 389495 -34961 828762 1682907 -192859 1745326 -69170 328435
$$ packed form
6252d52190A84298a42430A134076d47617A61968J404492F43081j69937j27057
6243C46087K60535L33616K84473j60607l05300J5172N73048m47769C4307P93544
6233H27851M42490I6299O15222k10847j15033a26160C91631d66455A61803N79061
6223G40864L27116k70268J27859P22507a39695F13707L10237b89845H50964e46561
6212A397265B95989J709229I39674a48882D64585h23311B482573E76727N45311
6203A122038F9230J600530G28520a18722A11847O64866l05330g64895E13805a82708
6192f659H1684O34956M79249A06214K77452j40599e48820A247791A66034O09676
6182G75710B87235d9997C89495c4961H28762Q54145a92859A745326f9170C28435
$$ plain form
6171 31446 783947 -420345 253069 1025582 1470237 512013 988517 -196505 788406 835681
6161 835681 1130456 1771141 586951 10831 583289 236642 659196 -37388 1025643 739064
6151 739064 2029190 36365 1329253 255574 153497 1943541 143432 890522 -1121195
6141 1393058 528434 1630475 471611 1025310 1139464 -70766 663427 800840 -627598 -128492
6130 647208 313827 934486 9031 591938 98036 -1006730 -139461 329394 1693585 -227689
6119 783076 917992 -467593 465263 1124919 427770 254692 -41719 725894 -376204 -863384
6109 -863384 48755 360167 371118 337774 256145 -27101 1016080 609022 43036 986803 -37320
6097 257270 568354 273720 798319 995304 -36246 -647897 1211669 959449 304621 -111769
$$ packed form
6171C1446P52501d20345B53069P72513M44655E12013M76504a96505G88406M7275
6161H35681K94775O40685E86951A0831N72458B36642M22554c7388A025643k86579
6151G39064J290126C6365J292888B55574j02077J790044A43432P47090a121195
6141A393058E28434J102041D71611N53699J14154g0766F63427J37413f27598a28492
6130F47208C13827O20659I031N82907I8036a006730a39461C29394J364191b27689
6119G83076J34916d67593D65263O59656D27770j73078d1719G25894c76204m87180
6109h63384D8755L11412J0951l3344q1629b7101A016080m07058D3036R43767c7320
6097B57270L11084B73720N24599J96985c6246o11651A211669k52220C04621a11769
$$ plain form
6086 -278618 347985 2040190 1206017 -47796 111292 -563 -474339 1419758 -304865 226731
6075 1374000 1982637 26740 1199034 126496 202635 1611305 1596528 -238215 1423281 76624
6064 -727668 -924634 365621 942425 671001 59988 -527718 1801601 -92622 1500565 234585
6053 373941 770415 -69722 1040899 452379 1115633 424935 1320372 860050 922248 771467
6043 771467 787939 1236222 1238925 71457 1195886 581115 -206798 1007380 -292812 855008
6032 1030170 1582795 1328232 375197 183037 646601 194271 417430 859869 609850 307543
6022 307543 612482 988561 -494902 -830582 492253 586492 918705 1458610 1097748 251172
6011 584451 1148395 806288 1249129 -48155 1370770 1472689 1006598 1043235 383570 1111416
$$ packed form
6086b78618C47985J692205q34173d7796A11292e63m73776A419758c04865B26731
6075A374000O08637B6740J172294A26496P6139J408670j4777b38215A423281G6624
6064g27668j96966C65621N76804k71424E9988e27718A801601i2622A500565B34585
6053C73941L96474f9722A040899D52379O63254D24935Q95437m60322O2198j50781
6043G71467J6472M48283K703G1457J124429E81115b06798A007380b92812H55008
6032A030170N52625k54563C75197A83037M63564A94271K23159M42439k50019l02307
6022C07543L04939L76079d94902l35680D92253R4239L32213N39905l60862B51172
6011E84451N63944l42107M42841d8155A370770J01919m66091L6637C83570P27846
$$ plain form
6001 1111416 419657 -95698 1361528 1410036 718589 1015836 1258146 1316724 329116 337854
5991 337854 454896 251266 138082 497785 361622 1170373 -118279 1142621 547769 -12737
5980 865082 2054699 828636 -912391 -684155 1272031 505999 573959 55926 544078 779708
5970 779708 1414035 -147134 1093234 13252 -1092657 -257078 -178915 691915 -53764 1260364
5959 -428867 953165 2357430 1079684 266352 1022754 428630 369986 602146 1101283 767446
5949 767446 -79566 313475 718886 -310377 -631949 -91028 -481364 -373430 1092043 -861182
5938 816336 1777026 139297 497848 85073 102594 1898553 1503722 990386 1592627 -335483
5927 1118028 937809 1012574 987001 884861 -347426 1184866 1471069 516085 -185380 506423
$$ packed form
6001A111416D19657i5698A361528M8508o91447K97247K42310N8578C29116Q738
5991C37854J17042k03630j13184L59703j36163Q08751a18279A142621E47769a2737
5980H65082J189617H28636i12391K28236A272031E05999O7960E5926M88152K35630
5970G79708O34327a47134A093234A3252a092657b57078P8163F91915e3764A260364
5959d28867I53165J404265A079684B66352P56402D28630n8644K32160M99137l33837
5949G67446g9566C13475M05411c10377l21572i1028l90336J07934A092043h61182
5938H16336R60690A39297L58551H5073J7521J795959l94831n13336O02241c35483
5927A118028j80219P4765k5573j02140c47426A184866K86203E16085a85380E06423
$$ plain form
5916 -76845 1422189 -832525 1178400 508662 65250 -1208450 -183974 694100 1609654 -599864
5905 1142087 394503 1212258 216168 786323 -480455 1470491 1267147 1105886 1028995 1229083
5895 1229083 479280 1115956 90753 342205 873083 298078 779753 509076 1310346 203484
5884 -334974 1017134 176818 2210821 808984 502499 833686 -289965 726641 197482
5874 1344863 85454 862112 1592673 -303436 538220 1407583 1187621 1204601 337854 457010
5864 457010 -164241 1684792 598940 1735205 1566989 1525191 727945 1020712 689737 -200388
5853 363180 -363894 640699 339595 154169 746025 439775 29978 2054187 687327 -71450
5842 1480599 9453 1253630 1011825 446782 1171178 1431276 223993 1315341 956891 2114259
$$ packed form
5916g6845A422189h32525A178400E08662F5250a208450a83974F94100R15554e99864
5905A142087C94503Q17755B16168N70155d80455A470491k03344j61261p6891K00088
5895A229083D79280O36676I0753K51452N30878B98078M81675k70677Q01270B03484
5884c34974A017134A76818K034003H08984l06485L31187b89965G26641A97482
5874A344863H5454P76658P30561c03436E38220Q69363k19962J6980C37854J19156
5864D57010a64241A684792E98940J136265j68216m1798G27945K92767l30975b00388
5853C63180c63894F40699l01104A54169N91856l06250B9978K024209F87327g1450
5842A480599I453J244177k41805D46782P24396K60098B23993J091348l58450J157368
$$ plain form
5832 2114259 612069 345238 1172469 392363 1879384 1364986 454621 290903 1634621
5823 1634621 496756 1091556 584133 1029019 320589 622875 504201 15508 -203812 1110238
5812 874954 1729205 1133770 599987 528251 1087167 711316 756050 1115018 314612 559841
5802 559841 -79532 276040 -60326 -1074766 -569544 531772 339287 317438 402724 387561
5792 387561 -301124 15834 206487 555987 1060559 497994 984597 2400701 1757465 1552314
5782 1552314 1421368 923960 1019000 -49240 1252232 -415978 508088 -232092 1017612 930089
5772 930089 533031 95172 -456185 -210275 282682 744441 468655 682352 1248423 281460
5761 963752 466009 1468366 929354 90058 235457 329241 1303152 1602818 3221848 819605
$$ packed form
5832B114259F12069k66831Q27231C92363J487021n14398D54621j63718J343718
5823A634621D96756N94800n07423M44886C20589L02286j18674A5508b03812A110238
5812H74954Q54251n95435n33783p1736N58916l75851M4734L58968C14612K45229
5802E59841g9532B76040f0326j014440N05222E31772j92485k1849Q5286j5163
5792C87561c01124A5834J90653L49500N04572D97994M86603J416104o43236k05151
5782A552314j30946m97408R5040d9240A252232d15978E08088b32092A017612q7523
5772I30089l97058I5172d56185b10275B82682M61759k75786K13697N66071B81460
5761I63752D66009J002357n39012I0058J45399R3784R73911K99666J619030H19605
$$ plain form
5750 301038 547280 328666 1073136 -1097852 -190823 1323814 1600713 1168719 558179
5740 1158548 600574 1428831 149639 828000 557917 997404 1475689 840127 740376 555114
5730 555114 554687 1100319 1267660 -970728 1022343 1860487 915315 446546 -33813 907498
5719 569344 -113447 414146 1524564 1821932 862198 152030 1378012 1191697 1384186
5710 1384186 1181338 355673 1084263 815792 877432 -35423 914631 1515255 782471 1543712
5700 1543712 1102019 1388493 439916 1184329 510441 1216605 1225401 1296608 855183 1427376
5690 1427376 927548 1181229 417165 702002 1401434 686047 1228439 957342 1207589 239811
5679 205216 603514 831858 -223801 906148 1553729 1163311 362823 1400818 255560 1364441
$$ packed form
5750C01038K46242k18614P44470a097852a90823A323814K76899m31994E58179
5740A158548n57974Q28257A49639O78361k70083M39487M78285o35562r9751j85262
5730E55114m27N45632J67341i70728A022343Q38144I15315D46546c3813I07498
5719E69344a13447D14146J110418K97368H62198A52030J225982j86315J92489
5710A384186k02848C55673P28590k68471O1640c5423I14631O00624p32784P61241
5700A543712m41693K86474D39916P44413E10441P06164Q796P1207m41425N72193
5690A427376m99828K53681D17165K84837O99432F86047N42392k71097K50247B39811
5679B05216L98298K28344b23801I06148O47581l90418C62823J037995B55560J108881
$$ plain form
5669 1364441 265577 2090188 1027728 -16544 897579 488553 545294 1131617 304402 -12110
5658 691780 1194060 25238 -11125 699787 296683 209144 900633 33427 896029 1340746
5648 1340746 42400 1444871 1151847 376806 -22619 135436 1018032 704787 550492 1138564
5638 1138564 919597 1071546 807413 292357 85003 1239158 556411 352733 1183053 517860
5627 2101164 -272922 -1040496 613453 544609 663755 1147309 591341 756165 628582 1372657
5617 1372657 896490 -408339 446680 2108310 -304017 1573581 884657 440566 81098
5607 174482 1167675 65268 1132904 1232718 356564 2042216 649060 759849 406798 1931531
5597 1931531 -541313 121368 973864 1596181 -406110 1070271 1148863 1132892 624535 1249519
$$ packed form
5669A364441B65577J824611A027728a6544H97579m09026N6741N86323C04402a2110
5658F91780N02280B5238a1125F99787B96683q7539O91489C3427Q62602M44717
5648A340746D2400J402471k93024C76806b2619A35436Q82596l13245j54295N88072
5638A138564k18967J51949k64133B92357H5003J154155E56411k03678Q30320E17860
5627B101164b72922p67574F13453o8844J19146M83554n55968J64824j27583P44075
5617A372657m76167d08339D46680J661630c04017A573581o88924D40566H1098
5607A74482R93193F5268J067636R9814C56564J685652F49060J10789l53051J524733
5597A931531e41313A21368Q52496O22317d06110A070271P8592j5971n08357O24984
$$ plain form
5587 1249519 1135691 843362 1057679 986045 1073875 629618 996236 509863 350405 1386054
5577 1386054 1632099 1340931 450013 -317357 1125983 1052387 1304432 1092690 2370272
5568 2370272 2014307 1324228 -660188 977883 1174124 470661 1055661 887844 -70382 2692377
5557 1253549 1317454 2000656 1273299 1753436 674226 986589 1496434 2609773 1375198
5548 1375198 2265317 2616165 2615492 2198809 2790827 1554002 3031000 2390466 2767891 1335976
5537 1796126 2422940 1987149 1954804 3102019 1086893 974480 2843696 1422031 2395670
5528 2395670 1881584 306936 908607 1108046 896628 1377373 -373582 1656446 1572756 2325128
5518 2325128 414276 837001 -59392 932834 451127 410986 337398 145117 -37702 -33825 1246648
$$ packed form
5587A249519j13828k92329K14317p1634Q7830m44257L66618m86373j59458J035649
5577A386054K46045k91168D50013c17357A125983p3596K52045k11742J277582
5568B370272l55965o90079f60188I77883J96241D70661N85000j67817g0382B692377
5557A253549O3905O83202p27357M80137F74226L12363N09845J113339j234575
5548A375198Q90119L50848o73m16683N92018j236825J476998o40534L77425A335976
5537A796126O26814m35791l2345J147215A086893j12413J869216j421665R73639
5528B395670n14086C06936O01671J99439k11418M80745c73582A656446q3690P52372
5518B325128D14276M22725e9392I32834D51127m0141p3588A45117c7702L877A246648
$$ plain form
5506 1667118 1637939 -492235 1385778 1365859 1588823 1716157 1496815 1674856 1099830 516221
5495 1524648 970302 464903 1088026 639846 977489 410616 1044305 2075459 325545
5485 877807 1453393 804934 46249 486300 662759 273173 1152880 -89995 1006053 -178769
5474 32066 2433781 1424274 800201 -351952 1016335 864147 601319 108280 2170179
5465 2170179 323951 1333060 1512473 179725 1083026 1667921 -138075 1500622 1112188
5456 1112188 1106654 -1255010 365634 503348 1654925 1315514 375441 367716 927858 2266689
5446 2266689 1251310 266039 864239 1565784 911836 1103248 1978727 662896 1808215
5437 1808215 1084469 -52681 1510188 1006038 253766 1219691 -20131 1525466 1705893 1074173
$$ packed form
5506A667118k9179d92235A385778j9919K22964J27334k19342J78041n75026E16221
5495A524648n54346D64903O23123m48180L37643D10616O33689J031154C25545
5485H77807N75586o48459D6249M40051J76459B73173Q79707h9995A006053a78769
5474C2066K401715j009507o24073c51952A016335j52188k62828A08280K061899
5465B170179C23951J009109J79413A79725R03301N84895a38075A500622l88434
5456A112188n534a255010C65634J37714J151577l39411C75441p725N60142J338831
5446B266689j015379B66039N98200P01545o53948J91412Q75479F62896J145319
5437A808215p23746e2681A510188n04150B53766R65925b0131A525466J80427o31720
$$ plain form
5427 1074173 1149749 1491800 1231504 897292 1731086 755975 1682555 902719 1875894 897595
5416 2106539 1303189 1282146 1487621 848133 1576370 1294190 2393383 2071813 2294763 1569259
5406 1569259 2680509 1060168 1811168 1426642 1329510 945732 2181255 1864088 1028727
5397 1028727 1001953 1134917 1094356 2293719 1549939 1308337 798714 17114 858206 1605977
5387 1605977 1736724 1960432 535666 1838957 2324570 946566 3489641 1373825 2399833
5378 2399833 1716879 2327648 1959971 1974063 2327870 2123402 1427235 1678296 2198082 1797846
5368 1797846 1978311 2129208 1913876 1203937 1880803 1882661 -106451 1238045 3553868 1936130
5358 1936130 1760453 1365711 676372 1333100 1297140 1929511 1766207 970118 1542965 824471
$$ packed form
5427A074173P5576L42051k60296l34212Q33794G55975R26580p79836R73175H97595
5416B106539q03350k1043K05475o39488P28237k82180J099193l21570K22950p25504
5406A569259J111250A060168P51000l84526r7132l83778J235523l17167q35361
5397A028727k6774J32964m0561J199363p43780k41602n09623A7114Q41092P47771
5387A605977J30747K23708E35666J303291M85613I46566K543075A373825J026008
5378B399833o82954O10769l67677J4092L53807k04468o96167K51061N19786m00236
5368A797846J80465J50897k15332p09939O76866J858a06451A238045K315823j617738
5358A936130j75677l94742F76372O56728l5960O32371j63304p96089N72847p18494
$$ plain form
5348 824471 2581872 1337979 963018 1618168 437982 2324512 1781043 1490737 1327153
5339 1327153 686774 151298 968101 1518553 794258 525699 1115896 797266 813818 2460808
5329 2460808 1409975 935981 411078 1214044 840037 924182 731197 383045 473332 2109919
5319 2109919 430257 829393 933753 1512528 1281488 1695028 1248845 1469123 90313 381778
5309 381778 -244959 902564 428563 826505 1255836 157795 166479 940976 1009960 988518
5299 988518 1918482 642945 1263446 -49168 -572912 206749 184261 3127411 1469880 -42999
5288 2213650 2023445 862678 561618 -164184 997394 1155095 1094515 4791 242599 1964084
5278 1964084 1536817 -199060 -673589 1464632 718313 1478031 1169589 321708 762436
$$ packed form
5348H24471J757401j243893l74961O55150D37982J886530n43469k90306j63584
5339A327153o40379A51298Q16803N50452p24295k68559N90197l18630J6552J646990
5329B460808j050833m73994D11078Q02966l74007Q4145j92985l48152R0287J636587
5319B109919D30257L99136J04360N78775k31040M13540m46183K20278I0313K91465
5309C81778b44959I02564D28563L97942M29331A57795Q684P74497O8984k1442
5299I88518R29964F42945O20501d9168n23744B06749k2488K943150A469880d2999
5288B213650j90205H62678l01060a64184I97394J57701o0580D791K37808J721485
5278A964084m27267a99060m74529A464632G18313P59718l08442C21708M40728
$$ plain form
5269 762436 468302 1334375 838943 631483 -543508 2094574 930486 843083 639276 928059
5259 928059 723758 959930 2238376 877186 1486971 124393 601888 1521615 331842 2098055
5249 2098055 905242 2442696 896527 83076 457216 1230460 1084427 1892675 793193 1538977
5239 1538977 436705 449486 542023 1300418 1703668 487040 1068695 1313811 1060406 1767815
5229 1767815 811123 245663 1412664 1504564 -309055 1846978 2196222 1025136 1202926
5220 1202926 984760 764552 1412481 792397 1597096 812614 148983 1281897 364327
5210 1240140 1399809 547709 844101 835237 234531 965010 359525 236688 1280061 1450523
5200 1450523 1093881 280685 1098894 1928038 2377085 1173747 1826334 1513253 1229884
$$ packed form
5269G62436k94134Q66073m95432k07460e43508B094574I30486q7403k03807K88783
5259I28059k04301K36172J278446H77186O09785A24393M77495R19727C31842J766213
5249B098055I05242J537454H96527H3076L74140P73244j46033Q08248G93193P45784
5239A538977D36705J2781R2537P58395M03250D87040N81655K45116k53405P07409
5229A767815H11123B45663J167001R1900c09055A846978L49244A025136J77790
5220A202926k18166k20208O47929o20084Q04699p84482A48983J132914C64327
5210A240140J59669E47709K96392q864B34531P30479C59525j22837J043373J70462
5200A450523l56642B80685Q18209Q29144M49047A173747O52587l13081k83369
$$ plain form
5191 1229884 494703 1889867 484702 700821 1248666 1089025 1126222 1194571 723829 2281723
5181 2281723 2144673 1269935 1358735 2002506 662001 -416776 1416008 811288 211078 637047
5171 637047 2176446 1086324 2023313 1343232 363292 1497925 -269635 1086266 1127028
5162 1127028 298745 1552873 1425975 1248506 461171 918761 2626863 -186140 2740897
5152 1990388 1651281 946466 1919726 -288150 1444563 1480623 623553 1811116 853183
5142 1158820 1318108 -268132 897253 606498 1388680 774340 1953893 2961802 1904541
5133 1904541 1872772 943181 1856805 1440465 2417702 1323183 1822997 1858808 1279867 426374
5122 1202875 1902796 2924121 2347909 2654351 2481057 3298306 4294212 3494835 3810221
$$ packed form
5191A229884D94703J395164D84702K16119N47845j59641L7197O8349m70742J557894
5181B281723j37050q74738Q8800O43771F62001d16776A416008o04720B11078M25969
5171F37047J539399A086324R36989o80081C63292J134633b69635A086266M0762
5162A127028B98745J254128j26898j77469D61171M57590J708102a86140B740897
5152A990388l39107p04815R73260b88150A444563L6060F23553J187563H53183
5142A158820J59288b68132H97253k90755P82182o14340J179553J007909j057261
5133A904541l1769r29591R13624m16340R77237j094519M99814L5811n78941D26374
5122A202875O99921J021325n76212L06442j73294Q17249R95906p99377L15386
$$ plain form
5113 3810221 2600432 2699179 1699567 874076 745125 1410017 697553 1830610 1622294
5104 1622294 985506 1723527 1135625 754257 2791590 401278 1671337 777809 864883
5095 864883 1270707 785321 861007 1764756 1223309 640154 1621073 1112121 1243526 944045
5085 944045 862442 2015411 1774453 1391143 1397218 1817691 1203653 1216995 178013 2830696
5075 2830696 1447820 1350202 1269628 1081820 2199092 132023 918978 1276250 203992 1230557
5065 1230557 1631816 590127 981215 1327264 496870 2423023 55057 2856397 1410420
5055 2146319 2425869 1577376 1541202 1159239 867346 985149 1006420 947363 1636729 1804436
5045 1804436 1761064 1109496 785395 1405265 1048140 887501 1178575 2158142 1358236 166621
$$ packed form
5113C810221j209789R8747r99612q25491j28951O64892F97553J133057k08316
5104A622294o36788P38021n87902l81368K037333D01278J270059G77809Q7074
5095H64883M05824m85386P5686R03749n41447n83155R80919n08952J31405k99481
5085I44045q1603J152969k40958l83310O075M20473o14038J3342A78013K652683
5075B830696j382876r7618q0574j87808J117272A32023P86955L57272B03992J026565
5065A230557M01259E90127L91088L46049D96870J926153E5057K801340A410420
5055B146319K79550q48493l6174l81963k91893J17803K1271n9057O89366J67707
5045A804436m3372o51568l24101O19870l57125j60639K91074R79567p99906A66621
$$ plain form
5034 1011499 -163694 1297997 823576 2206134 58343 1314478 1308371 1887384 1349618 1817456
5024 1817456 2118140 1730772 1825308 432500 907363 2226985 956648 2152555 2623500
5015 2623500 1834454 1947677 1395100 1787786 788744 2459456 2122690 1922956 3034676
5006 3034676 996157 260110 1202749 1772363 1574276 1540703 1983551 1415494 2091772 1592522
4996 1592522 1622840 2167732 1781833 2120434 733180 458518 1944081 1402593 1235811 2706552
4986 2706552 445532 2416398 1192524 3079529 2307848 1150666 209391 2766219 2458963
4977 2458963 1735676 2662106 2138204 1462258 2487463 1761757 2480958 2335336 1915677
4968 1915677 2451784 1552259 954576 1766966 1919033 1984740 2672873 2175254 2371685 1227692
$$ packed form
5034A011499a63694A297997m74421J382558E8343J256135o107N79013n37766M67838
5024A817456L00684l87368R4536D32500M74863J319622I56648J195907M70945
5015B623500p89046J13223n52577L92686G88744J670712l36766j99734J111720
5006C034676I96157B60110R42639N69614j98087l3573M42848n68057O76278m99250
4996A592522L0318N44892l85899L38601G33180k74662J485563n41488j66782J470741
4986B706552D45532J970866A192524J887005p71681A150666B09391K556828l07256
4977B458963p23287R26430n23902o75946J025205p25706P19201j45622m19659
4968A915677N36107q99525n97683Q12390J52067O5707O88133m97619J96431j143993
$$ plain form
4958 1227692 1431337 1949665 1687996 2379211 1500834 2358114 1679390 2159293 647282 1096967
4948 1096967 2544821 2359395 1493432 1026328 2293967 766640 1168314 2655604 1824059
4939 1824059 888455 2302863 1613789 1044027 2076641 995621 669696 897204 1370085
4930 1370085 2578394 2057434 1714868 1187926 2551544 1765830 1631856 1917719 1823582
4921 1823582 955669 1686776 2238980 1730599 980306 1385028 483421 743321 1383936 1532998
4911 1532998 1454517 1435344 1244272 907488 1771957 2122685 2775264 1115643 1692166 374112
4900 2204921 1521908 1463590 1100167 1859815 2124442 2749005 2480755 2063775 1819660 1390283
4890 1390283 2122447 2341526 1318897 1434777 2163494 809067 1354176 2068162 2824976
$$ packed form
4958A227692K03645N18328k61669O91215q78377Q57280o78724M79903F47282M49685
4948A096967J447854j85426q65963m67104J267639G66640M01674J487290q31545
4939A824059H88455J414408o89074n69762J032614I95621l25925K27508M72881
4930A370085J208309n20960l42566n26942J363618p85714j33974K85863r4137
4921A823582q67913P31107N52204n08381p50293M04722D83421K59900O40615J49062
4911A532998p8481j9173j91072l36784Q64469L50728O52579A115643N76523C74112
4900B204921o83013n8318l63423P59648K64627O24563k68250m16980k44115m29377
4890A390283P32164K19079j022629J15880P28717H09067N45109P13986P56814
$$ plain form
4881 2824976 2777113 2334023 3137242 4238493 1721162 3745779 4491668 4388411 5993169
4872 5993169 5317914 6530296 6532353 7125159 6812316 4114242 6232689 5039276 4451140
4863 4451140 2525814 3830126 2554822 1615153 430271 2666330 1732602 1168527 2580521
4854 2580521 1126339 1617290 1661463 1816377 1924798 1722801 1248706 1381384 1815279 1834315
4844 1834315 1532809 3121832 825218 2094371 2682301 1256323 2296738 1519986 2352309
4835 2352309 612751 3223586 2620833 2177021 1702511 2141536 1424281 1771396 1466244
4826 1466244 1156420 1176658 979672 373642 2158239 1377190 3040615 2409560 3035751
4817 3035751 2150583 1692087 2841632 1970674 1588788 1045222 2246266 2318273 2298012 1965315
$$ packed form
4881B824976m7863m43090Q03219J101251A721162K024617P45889j03257J604758
4872E993169o75255J212382K057N92806l12843k698074K118447j193413n88136
4863D451140j925326J304312j275304r39669D30271K236059r33728n64075J411994
4854B580521A126339M90951M4173J54914J08421k01997m74095J32678M33895J9036
4844A834315l01506J589023H25218J269153N87930A256323J040415p76752Q32323
4835B352309F12751K610835o02753m43812m74510M39025p17255L47115l05152
4826A466244l09824K0238j96986C73642J784597p81049J663425o31055O26191
4817C035751q85168m58496J149545q70958l81886n43566J201044P2007k0261l32697
$$ plain form
4807 1965315 1828605 2443256 1907628 2082975 1690757 3101624 1769348 2194519 2560811
4798 2560811 2183788 1831472 2560292 1157620 1615192 1936893 1111115 2251726 751192
4788 1359108 1997718 2224343 1720304 1259266 2394033 2848910 1821344 1649635 1368720
4779 1368720 2829558 2677603 1673637 1926244 2072792 891130 2079097 2622571 2133566
4770 2133566 3653925 873171 2948323 2125134 1073974 1610162 2496404 1160048 2472552
4761 2472552 1840310 837881 1171598 1277054 1846297 1695354 1998559 2397974 1624571 1281730
4751 1281730 1694748 2131589 1225497 2262650 1762092 1742865 2699962 2032927 1957455 2224890
4741 2224890 2412655 2235863 2340861 1502340 2000882 2603867 2820199 2734155 1435022 2412356
$$ packed form
4807A965315j36710O14651n35628J75347l92218J410867j332276M25171L66292
4798B560811l77023l52316P28820A157620M57572L21701q25778J140611G51192
4788A359108O38610K26625n04039m61038J134767M54877j027566j71709k80915
4779A368720J460838j51955j003966K52607J46548H91130J187967N43474m89005
4770B133566J520359H73171K075152q23189j051160N36188Q86242A160048J312504
4761B472552o32242H37881L33717J05456N69243j50943L03205L99415p73403l42841
4751A281730M13018M36841r06092J037153n00558j9227R57097o67035p5472K67435
4741B224890J87765j76792J04998q38521M98542O02985K16332q6044j299133R77334
$$ plain form
4731 2412356 2335714 2090973 1925011 1702890 2165695 2825145 1192186 3488364 2061159
4722 2061159 1128050 2105381 1848357 2076372 2493679 2953612 3204773 1788991 3720710
4713 3720710 3131016 2328221 2178060 2703552 3082569 2386736 1970724 2129448 2460432 2452588
4703 2452588 2298202 2083110 2744592 1458891 2314795 3088996 1149667 3304264 1969539
4694 1969539 1654193 1986176 2726389 1879539 2579549 1864847 2380382 3055096 2781077 2304692
4684 2304692 1707618 1426307 3048496 2561248 2323283 2162494 3050426 1939378 2694777
4675 2694777 1547734 2381339 1542753 1545875 2656921 2733805 3351310 1755160 2336696 2162345
4665 2162345 2005324 2545241 1127478 1486585 892768 1956079 1181455 2787779 2137193
$$ packed form
4731B412356p6642k44741j65962k22121M62805O59450A192186K296178j427205
4722B061159r33109R77331k57024K28015M17307M59933K51161j415782J931719
4713C720710n89694q02795j50161N25492L79017o95833m16012J58724L30984p844
4703B452588j54386k15092O61482j285701Q55904P74201A149667K154597j334725
4694A969539l15346L31983P40213q46850P00010p14702N15535O74714k74019m76385
4684B304692n97074k81311J622189m87248k37965j60789Q87932j111048P55399
4675B694777j147043Q33605q38586L122J111046P6884O17505j596150N81536j74351
4665B162345j57021N39917A127478L59107n93817J063311p74624J606324o50586
$$ plain form
4656 2137193 1874708 1064416 2260772 2210487 2860426 2523743 2777336 2678744 1738927 2128475
4646 2128475 2536170 1909345 1792870 2545820 2140878 3063046 1425736 1657147 2606466
4637 2606466 791516 1998206 1303050 2234651 2279326 879853 2470327 1614532 2254498
4628 2254498 2062465 2535519 1294402 1661576 1044750 2832217 1281536 1579812 2333766
4619 2333766 940538 1608966 1864767 2245859 2726689 3198522 2660775 1933864 3588513
4610 3588513 3733846 2868291 2403930 2150038 2250605 2144764 3336395 2019856 3708466
4601 3708466 3553819 2294509 3188484 3687334 2218646 2371743 2157138 2318087 1368521
4592 1368521 1412194 1402377 1920028 2523593 2266748 3038968 2702041 2803076 2721065 3250396
$$ packed form
4656B137193k62485q10292J196356n0285O49939l36683K53593r8592r39817L89548
4646B128475M07695o26825j16475P52950m04942R22168A425736K31411R49319
4637B606466G91516J206690o95156R31601M4675H79853J590474q55795O39966
4628B254498j92033M73054j241117L67174o16826J787467A281536K98276P53954
4619B333766I40538O68428K55801L81092M80830M71833n37747p26911J654649
4610C588513J45333q65555m64361k53892J00567j05841J191631j316539J688610
4601C708466j54647j259310Q93975M98850j468688J53097k14605J60949r49566
4592A368521M3673r817N17651O03565k56845P72220l36927J01035q2011N29331
$$ plain form
4582 3250396 1971597 3135798 2657233 2045558 2527101 2442691 3740289 3163968 2268476
4573 2268476 2596153 3528028 3164046 3074030 1912851 3819164 3528451 3120034 3288361
4564 3288361 3582083 2422436 3412685 1974286 3353421 2608276 2225160 3280514 2275405
4555 2275405 2284895 2082174 1971897 2340373 572852 2695440 2935853 2660779 2278548 3811129
4545 3811129 3488758 2766545 2903353 1176888 1449533 1040741 1881319 1556513 1059497
4536 1059497 3134722 2531595 1818734 2149894 2482843 2263815 2526359 2293712 1394153
4527 1394153 1785281 3287539 2738818 2155740 2604710 753977 1931648 2221864 2083800
4518 2083800 2138491 1887648 1971417 2611675 2765177 3385666 1766440 2426211 2480338 3156135
$$ packed form
4582C250396j278799J164201m78565o11675M81543q4410J297598n76321q95492
4573B268476L27677R31875l63982r0016j161179J906313k90713m08417J68327
4564C288361K93722j159647R90249j438399J379135p45145l83116J055354j005109
4555B275405R490k02721j10277L68476E72852K122588K40413k75074l82231J532581
4545C811129l22371p22213J36808A176888K72645m08792Q40578l24806m97016
4536A059497K075225o03127p12861L31160L32949k19028K62544k32647q99559
4527A394153L91128J502258n48721n83078M48970G53977J177671K90216j38064
4518B083800N4691k50843Q3769O40258J53502O20489j619226O59771N4127O75797
$$ plain form
4508 3156135 2203768 2414680 3324026 2511048 3371171 2659338 1861466 2473117 1784498 2418672
4498 2418672 1718705 1810506 2720946 3619539 2354907 1241863 3316828 2365142 2588207
4489 2588207 2366801 2474487 3541396 2516905 2375611 2932232 2406264 3441165 3110397
4480 3110397 4209944 3567788 3901396 3807140 3018507 3985708 4054263 3985291 3709755 4332251
4470 4332251 3950768 3798053 2857263 4727948 4329506 3682361 4720438 4007365 4112658
4461 4112658 2566835 3776509 4107979 2636136 3692676 2292132 2856320 3404264 2557896
4452 2557896 3109051 2641106 3182234 3846797 2634592 2370244 2249012 2785004 2675878
4443 2675878 1052261 2875060 2117995 2744392 3101220 2733271 2355917 3131556 1962304
$$ packed form
4508C156135r52367K10912R09346q12978Q60123p11833p97872O11651o88619O34174
4498B418672o99967R1801R10440Q98593j264632j113044K074965r51686K23065
4489B588207k21406J07686J066909j024491j41294N56621n25968J034901l30768
4480C110397J099547o42156L33608r4256p88633R67201O8555o8972k75536O22496
4470D332251l81483j52715r40790J870685l98442o47145J038077p13073J05293
4461D112658j545823J209674L31470j471843J056540j400544N64188N47944q46368
4452B557896N51155m67945N41128O64563j212205k64348j21232N35992j09126
4443B675878A052261J822799p57065O26397L56828l67949l77354P75639j169252
$$ plain form
4434 1962304 2128587 2450623 2935859 3463818 2285732 1746588 3239854 1921008 3161361
4425 3161361 3072947 3791422 2638178 1995318 2084070 3485117 2896497 2191985 2778439 3944764
4415 3944764 4645647 3066984 3549326 2543660 2739638 3462517 3163078 3318742 2818715
4406 2818715 3019461 3761245 3062723 2632057 3900620 2495187 3005270 2432051 2584408
4397 2584408 1989033 2689819 2836993 2340252 2039585 2478215 2494625 2922829 2333371 2841616
4387 2841616 2202710 2269934 2094327 3592946 4091039 2757790 2384631 1997511 2052620 3328962
4377 3328962 2948998 3283245 3176250 2903302 3148424 2286423 3740818 2679912 2174086
4368 2174086 2544510 3051013 2548286 3445088 2242939 1498568 2736577 3535469 2336321
$$ packed form
4434A962304J66283L22036M85236N27959j178086n39144J493266j318846J240353
4425C161361q8414P18475j153244o42860Q8752J401047n88620p04512N86454J166325
4415C944764P00883j578663M82342j005666J95978P22879k99439J55664n00027
4406B818715K00746P41784o98522m30666J268563j405433N10083n73219J52357
4397B584408n95375P00786J47174m96741l00667M38630J6410M28204n89458N08245
4387B841616o38906O7224j75607J498619M98093j333249l73159l87120N5109J276342
4377C328962l79964L34247j06995k72948K45122q62001J454395j060906n05826
4368B174086L70424N06503n02727Q96802j202149p44371J238009P98892j199148
$$ plain form
4359 2336321 4954150 3730396 3620990 3703035 4795821 4708210 5417681 3116811 3861703
4350 3861703 3069985 3107990 3587194 3386336 2622324 3404215 2723401 3620424 2885947 2164191
4340 2164191 3514149 3982474 3001245 4026414 3940194 1793401 2106958 2556114 3288207
4331 3288207 3391930 2736593 2567367 2618595 3289411 3522078 3082894 3383503 3110192 2854665
4321 2854665 1472977 2082668 2132725 2305330 3419026 2116810 2265651 2998973 3543278
4312 3543278 3981659 3973890 4266387 3928025 3167620 3933938 4189478 3702104 3346402 3714552
4302 3714552 2999139 3086884 2470534 2654718 2327720 2945905 4097340 3042053 2493869
4293 2493869 2594395 3690279 3525960 2966709 2363360 3091128 1717529 3563282 3208249
$$ packed form
4359B336321K617829j223754j09406Q2045J092786q7611P09471k300870P44892
4350C861703p91718L8005M79204k00858p64012P81891o80814Q97023p34477p21756
4340B164191J349958M68325r81229J025169q6220A793401L13557M49156P32093
4331C288207J03723o55337j69226N1228O70816K32667m39184L00609k73311k55527
4321B854665j381688O09691N0057J72605J113696j302216J48841P33322N44305
4312C543278M38381p769K92497l38362p60405P66318K55540m87374l55702L68150
4302C714552p15413Q7745o16350J84184l26998O18185J151435j055287n48184
4293B493869J00526J095884j64319n59251o03349P27768j373599J845753l55033
$$ plain form
4284 3208249 3639430 3036906 2726915 2988659 2723963 2214217 2321187 2441918 2409350 3433174
4274 3433174 2981956 1931910 3904600 2521143 1755587 2829899 2236645 2228443 3189491
4265 3189491 3894335 1185186 2128816 3510687 3364234 3456053 3648712 3311273 2119806
4256 2119806 2613811 2081720 1771728 2072952 3486034 1552771 1599918 3237274 2448533
4247 2448533 3201069 3095056 2077341 3327647 2819761 2577434 3320498 2872946 2582560
4238 2582560 2997866 2795852 2702932 2805449 2961512 3077481 2492366 2774393 2577507 3177267
4228 3177267 2896765 2529652 1891237 3359706 2848146 2802265 3501632 3476442 3382694 2203635
4218 2203635 4054930 3382184 1890378 2790599 2507945 3118680 3375393 2301007 2668782
$$ packed form
4284C208249M31181o02524l09991K61744k64696n09746J06970J20731l2568J023824
4274C433174m51218j050046J972690j383457p65556J074312n93254q202R61048
4265C189491P04844A185186R43630J381871j46453R1819J92659l37439j191467
4256B119806M94005n32091l09992L01224J413082A552771M7147J637356p88741
4247B448533P52536j06013j017715J250306n07886k42327P43064m47552k90386
4238B582560M15306k02014r2920J02517J56063J15969n85115K82027j96886N99760
4228C177267k80502l67113o38415J468469n11560m5881O99367k5190r3748j179059
4218B203635J851295o72746j491806R00221k82654O10735K56713j074386L67775
$$ plain form
4209 2668782 3768967 2645964 2585358 1429269 1950587 2154102 3302160 2250613 3148148
4200 3148148 1907928 3148642 3186741 2484865 2389061 2829547 2629163 2573490 3688463 2297011
4190 2297011 3355582 3082582 3983024 3513763 2193441 3179385 3129838 3138572 1757721 2807503
4180 2807503 3027095 2585328 3628637 2946657 2747308 4034545 4003209 3699215 4063897
4171 4063897 2561612 3310043 4951719 2337224 2924268 1543244 3101998 3863959 3572240
4162 3572240 3305929 2636701 3509084 3102047 3350974 2003129 1275027 2310714 2519610
4153 2519610 2822082 2832021 2179145 3240182 3563618 3765490 3912572 3431989 3825992 4664980
4143 4664980 2677144 4642813 4059008 2679340 3929869 2356697 4485320 4104950 4015258
$$ packed form
4209B668782J100185j123003o0606j156089N21318K03515J148058j051547Q97535
4200C148148j240220J240714L8099p01876r5804M40486k00384n5673J114973j391452
4190B297011J058571k73000R00442m69261j320322R85944m9547Q734j380851J049782
4180B807503K19592m41767J043309o81980j99349J287237l1336l03994L64682
4171D063897j502285P48431J641676B337224N87044j381024J558754P61961k91719
4162C572240k66311o69228Q72383m07037K48927j347845p28102J035687K08896
4153B519610L02472R939o52876J061037L23436K01872J47082m80583L94003Q38988
4143D664980j987836J965669n83805j379668J250529j573172K128623l80370q9692
$$ plain form
4134 4015258 3184989 4941031 4763516 3746925 5381836 3540331 3936620 4680492 5424462
4125 5424462 4777189 4435531 2935193 4242129 4267978 5747202 5202794 4516270 5027581
4116 5027581 3979699 4366712 4220613 4564689 3718681 4237072 3064692 3443639 3517399
4107 3517399 3753597 3410626 3106919 4335060 3852164 4401196 3949988 2910263 3294837
4098 3294837 2842673 4993832 11285156 4664676 3518319 4556948 3108141 4054182 2785916
4089 2785916 3624017 3252047 4048001 4182007 4204262 4300535 4061221 3316365 3389530 3893282
4079 3893282 3809219 4185806 3444481 4009903 4619404 3789445 2713064 3082654 3205371 4502906
4069 4502906 4345068 4737789 3401702 4355662 4799280 4662225 4936174 4575429 4370661
$$ packed form
4134D015258q30269J756042j77515j016591J634911j841505L96289P43872P43970
4125E424462o47273l41658j500338J306936K5849J479224n44408o86524N11311
4116E027581j047882L87013j46099L44076q46008N18391j172380L78947P3760
4107C517399K36198l42971l03707J228141m82896N49032m51208j039725L84574
4098C294837m52164K151159O291324D664676j146357J038629j448807R46041j268266
4089B785916Q38101l71970P95954J34006K2255R6273k39314p44856P3165N03752
4079C893282q4063L76587p41325N65422O09501q29959j076381L69590J22717J297535
4069D502906j57838L92721j336087R53960M43618j37055K73949l60745k04768
$$ plain form
4060 4370661 4826664 4064533 5134979 5002620 4631777 4911287 5094252 4053015 5424996
4051 5424996 4641607 3789572 5112163 3612557 4977989 4222970 5833316 3945666 3722207
4042 3722207 4089372 4250345 4700205 5006962 4263690 3244062 4286760 3194679 3801634
4033 3801634 3717847 4082675 4011098 4829518 3280474 3751137 3683385 2826286 4650973 3684281
4023 3684281 4585960 2384989 3332102 3528294 3925870 3444779 2705679 2783401 2023535 4318960
4013 4318960 2830832 3196379 4192148 3543956 3015184 3515447 4354678 3296257 3111842
4004 3111842 4146618 3448442 3298365 5342580 2753057 3934894 2570454 3300950 4689256
3995 4689256 3689303 4753191 4762866 3223976 3846726 4825729 3903180 4265352 4087683 4263137
$$ packed form
4060D370661M56003p62131J070446j32359l70843K79510J82965j041237J371981
4051E424996p83389q52035J322591j499606J365432p55019J610346j887650k23459
4042C722207L67165J60973M49860L06757p43272j019628J042698j092081O06955
4033C801634q3787L64828p1577Q18420j549044M70663o7752q57099J824687r66692
4023C684281R01679k200971R47113J96192L97576m81091p39100P7722p59866K295425
4013D318960j488128L65547R95769o48192n28772N00263Q39231j058421j84415
4004C111842J034776o98176j50077K044215k589523J181837j364440P30496J388306
3995D689256r99953J063888R675j538890O22750R79003r22549L62172j77669J75454
$$ plain form
3985 4263137 3065256 4247848 3515006 4475947 4353692 4656998 3460011 4606873 3971175
3976 3971175 2526520 3182235 4021944 4421771 4394244 4550396 5191718 3968694 3444712
3967 3444712 4324907 4252643 4512896 4121198 3501640 4009207 4076670 5196108 5077121 5191286
3957 5191286 5399592 5200524 5127947 4608983 4570622 4942220 4891286 3909725 5399764 4349217
3947 4349217 4981964 5563486 4560467 4540560 4622308 3812294 4799689 4600929 3771145 2790162
3937 2790162 3665124 6458548 3960720 4883521 4046071 5311536 4129893 4918188 3937380
3928 3937380 3182674 4629440 4716192 5236853 4263074 5078528 3936296 5746106 4977368
3919 4977368 3492012 4381755 3615190 4557366 3959089 4360942 4064584 5836077 4202812
$$ packed form
3985D263137j197881J182592p32842R60941j22255L03306j196987J146862o35698
3976C971175j444655O55715Q39709L99827k7527J56152O41322j223024n23982
3967C444712Q80195p2264K60253l91698o19558N07567O7463J119438j18987J14165
3957E191286K08306j99068p2577n18964l8361L71598n0934r81561J490039j050547
3947D349217O32747N81522j003019j9907Q1748q10014R87395j98760q29784r80983
3937B790162Q74962K793424k497828R22801q37450J265465j181643P88295r80808
3928C937380p54706J446766Q6752N20661r73779Q15454j142232J809810p68738
3919D977368j485356Q89743p66565R42176n98277M01853k96358J771493j633265
$$ plain form
3910 4202812 3642040 3175963 4410764 4788326 5028634 4897682 4608401 4238075 4775976
3901 4775976 4741732 4561773 4025346 5551136 5307392 4737385 4401289 6010153 5227471
3892 5227471 4993291 4975712 5670942 5350941 5416950 4568138 5606840 3708418 5677035
3883 5677035 4251367 3244512 4845521 5149884 4782272 4399226 4043548 4231121 4809372
3874 4809372 4389701 4685206 4705477 4881537 5709555 4091109 4770951 5080949 5652755 5047676
3864 5047676 5680493 6277940 4667584 4841742 5168947 5628301 5336450 4601031 4189094
3855 4189094 5868746 5550901 5431489 4983923 6225360 5758735 5833695 5351670 5238589
3846 5238589 6074206 6183188 7040708 6085648 5654800 5147210 5479539 6656300 6651047 6078886
$$ packed form
3910D202812n60772m66077J234801L77562K40308j30952k89281l70326N37901
3901D775976l4244j79959n36427J525790k43744n70007l36096J608864p82682
3892E227471k34180j7579O95230l20001O6009q48812J038702j898422J968617
3883E677035j425668j006855J601009L04363l67612l83046l55678J87573N78251
3874D809372m19671K95505K0271J76060Q28018j618446O79842L09998N71806o05079
3864E047676O32817N97447j610356J74158L27205M59354k91851p35419m11937
3855D189094J679652l17845j19412m47566J241437m66625P4960m82025j13081
3846E238589Q35617J08982Q57520r55060m30848n07590L32329J176761n253n72161
$$ plain form
3836 6078886 5127901 6155215 5211106 5966770 7304460 5836274 6395364 5508111 5677538
3827 5677538 7092052 6266141 6833583 6009875 6997800 6003948 6713477 7504164 6668999
3818 6668999 6430292 6221815 6550179 5645817 7284463 8030464 7257839 6444569 6495160 5997034
3808 5997034 6863639 6671224 6093876 6170344 5877386 6294280 5702309 5971668 6333276 6259131
3798 6259131 6887671 6331616 5706137 5544482 6247306 5639735 7126806 6810380 5546456
3789 5546456 6285123 5869599 5558391 6408411 5760879 8089171 5822574 5816622 5907145 5119264
3779 5119264 6054423 4420921 6591135 4611085 6891984 5692125 4462193 5497571
3771 5497571 5842025 6449820 5075949 5835288 5840940 5685261 6446200 5620485 5945654 6163699
$$ packed form
3836F078886r50985J027314r44109P55664J337690j468186N59090q87253J69427
3827E677538J414514q25911N67442q23708R87925r93852P09529P90687q35165
3818F668999k38707k08477L28364r04362J638646P46001p72625q13270N0591m98126
3808E997034Q66605j92415n77348P6468k92958M16894n91971K69359L61608p4145
3798F259131O28540n56055o25479j61655P02824o07571J487071l16426j263924
3789E546456P38667m15524l11208Q50020o47532K328292k266597n952R0523p87881
3779E119264R35159j633502K170214j980050K280899j199859j229932J035378
3771E497571L44454O07795j373871P59339N652j55679P60939q25715L25169K18045
$$ plain form
3761 6163699 5431595 5357827 6542799 5372079 5963327 5464182 6589038 6720113 6224966
3752 6224966 6504278 5100591 7165581 6105443 6066745 6115129 6257716 6810706 6840690 6515713
3742 6515713 7970879 6975715 5754926 5427392 5918144 6524657 6937427 6099695 7660973
3733 7660973 6468629 6291714 6466873 6651771 6318821 7518785 7611471 6925708 8166998
3724 8166998 8126103 7714509 7249531 7872912 8718375 8384955 8484592 8578587 9801236 9815713
3714 9815713 8341326 9660704 10097699 9519736 9212106 9372040 11290578 10368193 10382885
3705 10382885 11594119 10600659 10870686 11607289 11689953 11323389 10287988 10672178 10440825
3696 10440825 9153770 10015696 10528915 9683607 10633582 11567010 10566120 13074077 11590651
$$ packed form
3761F163699p32104p3768J184972j170720N91248m99145J124856J31075m95147
3752F224966K79312j403687K064990j060138l8698M8384J42587N52990K9984l24977
3742F515713J455166r95164j220789l27534M90752O06513M12770q37732J561278
3733G660973j192344j76915J75159J84898l32950J199964R2686o85763J241290
3724H166998m0895m11594m64978O23381Q45463l33420R9637R3995J222649J4477
3714I815713j474387J319378M36995n77963l07630J59934J918538r22385J4692
3705A0382885J211234r93460K70027P36603Q2664l66564j035401L84190k31353
3696A0440825j287055Q61926N13219q45308R49975R33428j000890K507957j483426
$$ plain form
3687 11590651 12821009 12625691 13391448 13020436 13830432 13572228 13244609 12687323 14046347
3678 14046347 14371260 12957034 14239802 14474288 14087834 15539162 14725357 15485014 14777614
3669 14777614 14631023 17203238 17988779 18603550 19629338 18938596 18113416 17212167 17148104
3660 17148104 15611317 13894682 13210590 13725719 13632783 12787105 12960773 12856510 14654550
3651 14654550 12738491 12275015 14114682 13410053 12135763 11968860 11383029 12363068 13042764
3642 13042764 12369148 13538457 12571293 12209760 12767986 13496030 13419423 14291251 14660428
3633 14660428 16021343 16572966 18808626 18985156 18360242 18907530 16620340 14814042 13237657
3624 13237657 13676391 12015884 11757611 11199044 11810862 11241654 11440840 11315002 13188226
$$ packed form
3687A1590651J230358j95318P65757l71012Q09996k58204l27619n57286J359024
3678A4046347L24913j414226J282768K34486l86454J451328q13805P59657p07400
3669A4777614j46591K572215P85541O14771J025788o90742q25180r01249o4063
3660A7148104j536787j716635o84092N15129r2936q45678J73668j04263J798040
3651A4654550j916059m63476J839667p04629j274290j66903n85831R80039O79696
3642A3042764o73616J169309r67164l61533N58226P28044p6607Q71828L69177
3633A4660428J360915N51623K235660J76530o24914N47288k287190j806298j576385
3624A3237657M38734j660507k58273n58567O11818n69208J99186j25838J873224
$$ plain form
3615 13188226 10676041 10761294 11429342 12455941 12161904 11982215 12939518 12007286 12436739
3606 12436739 12230832 11116677 12056952 12692352 11709568 12647007 12923216 13668507 12354278
3597 12354278 12717851 10766320 12673201 12317628 11434431 10768800 9999723 10188557 11084374
3588 11084374 10202652 11289221 10547991 10433311 11513523 11030420 10746419 9953930 10730441
3579 10730441 10883009 11489445 11899755 11797442 11764678 12051980 13385296 13174150 13710223
3570 13710223 13012335 13889141 13807309 14547072 14015961 14197050 14738690 14151063 16361950
3561 16361950 16815312 16520771 16223343 16886372 17219384 17388882 18244282 19399853 18508364
3552 18508364 21982356 22198674 21860924 23641176 23049746 24780197 25340018 27308008 26967912
$$ packed form
3615A3188226k512185Q5253O68048J026599k94037j79689R57303r32232M29453
3606A2436739k05907j114155R40275O35400r82784R37439K76209P45291j314229
3597A2354278L63573j951531J906881l55573q83197o65631p69077J88834Q95817
3588A1084374q81722J086569p41230j14680J080212m83103k84001p92489P76511
3579A0730441J52568O06436M10310j02313l2764K87302J333316k11146N36073
3570A3710223o97888Q76806q1832P39763n31111J81089N41640n87627K210887
3561A6361950M53362k94541k97428O63029L33012J69498Q55400J155571q91489
3552A8508364L473992K16318l37750J780252n91430J730451N59821J967990l40096
$$ plain form
3543 26967912 27865876 29612952 29664354 30866950 31176519 33314035 33363219 33707417 36124145
3534 36124145 35876685 35097977 37837190 38550881 39534761 41501481 40937757 42610513 44288025
3525 44288025 45297125 46881872 48811057 50272097 51949036 54301544 55687908 56074792
3517 56074792 52218169 46811092 39384765 33514983 28886311 24968078 20200654 19384780
3509 19384780 18358222 17952650 17462686 16442311 15599675 17282254 16751012 15871027 15955853
3500 15955853 14438571 16418112 15089013 14489443 14888126 15669382 15672420 15039128 15431048
3491 15431048 15190544 16016817 16393342 15349908 15216818 16131325 16272233 15826139 13923644
3482 13923644 15424697 16214653 16635711 14965540 15692469 16554081 16526794 15865968 15456754
$$ packed form
3543B6967912Q97964J747076N1402J202596L09569K137516M9184L44198K416728
3534C6124145k47460p78708K739213P13691R83880J966720n63724J672756J677512
3525D4288025J009100J584747J929185J461040J676939K352508J386364L86884
3517E6074792l856623n407077p426327n869782m628672l918233m767424q15874
3509A9384780j026558m05572m89964j020375q42636J682579n31242q79985Q4826
3500A5955853j517282J979541j329099n99570L98683P81256L038o33292L91920
3491A5431048k40504Q26273L76525j043434j33090R14507J40908m46094j902495
3482A3923644J501053P89956M21058j670171P26929Q61612k7287o60826m09214
$$ plain form
3473 15456754 16572098 16731114 16374595 17283172 15812404 17085022 15991150 17346786 16552563
3464 16552563 18159862 17697438 17550566 18731000 17980720 18096092 18012442 18120577 18755358
3455 18755358 18347994 18769768 18829392 19182182 20302546 19075186 20169866 20419062 21987495
3446 21987495 21322186 22525308 20821932 21478355 21850044 22137760 22420578 21685364 23330058
3437 23330058 23218988 24363954 22877132 23274866 24989126 24779639 24964517 24802030 26253647
3428 26253647 26910654 27771534 26779548 29028572 28345020 30530876 29995016 30550872 32224805
3419 32224805 33353497 33378685 34735242 36457129 37996901 39749085 41381021 44329905
3411 44329905 48154996 49235393 53429345 57853308 61278600 67797772 72464740 79205075
$$ packed form
3473A5456754J115344J59016l56519R08577j470768J272618j093872J355636p94223
3464A6552563J607299m62424j46872J180434p50280J15372q3650J08135O34781
3455A8755358m07364M21774N9624L52790J120364j227360J094680K49196J568433
3446B1987495o65309J203122j703376O56423L71689K87716K82818p35214J644694
3437B3330058j11070J144966j486822L97734J714260k09487J84878j62487J451617
3428B6253647O57007Q60880r91986K249024o83552K185856n35860N55856J673933
3419C2224805J128692K5188J356557J721887J539772J752184J631936K948884
3411D4329905L825091J080397M193952M423963L425292O519172M666968O740335
$$ plain form
3403 79205075 84886963 90798714 96577058 101292090 108442690 114876441 120994617 127680705
3395 127680705 135818392 143170824 152976712 161873288 171558566 182586342 193026566 206166742
3387 206166742 223388996 241523300 263029379 287385041 316623600 350436174 391791149
3380 391791149 443368745 504114343 584075235 691854750 837286104 1035919437 1292500802
3373 1292500802 1575165236 1782421803 1796851881 1602316467 1295880257 990161744
3367 990161744 738979228 550751973 414294668 318340656 251741507 205667926 172568839
3360 172568839 147939096 131335672 116823713 105167210 95126715 86978907 78034659
3353 78034659 71058604 65315623 60712964 56394492 54056736 49328557 47057973 43721797
$$ packed form
3403G9205075N681888N911751N778344M715032P150600O433751O118176O686088
3395A27680705Q137687P352432R805888Q896576R685278J1027776J0440224J3140176
3387B06166742J7222254J8134304K1506079K4355662K9238559L3812574M1354975
3380C91791149N1577596O0745598P9960892J07779515J45431354J98633333K56581365
3373A292500802K82664434K07256567J4430078j94535414l06436210l05718513
3367I90161744k51182516j88227255j36457305r5954012o6599149m6073581l3099087
3360A72568839k4629743j6603424j4511959j1656503j0040495q147808q944248
3353G8034659o976055n742981m602659m318472k337756m728179k270584l336176
$$ plain form
3345 43721797 40352549 39007821 36898537 36074481 33875846 32079901 33003945 30403200
3337 30403200 30539601 29367153 26951650 26739220 25754908 24930370 24551500 22994192 22160358
3328 22160358 20114135 20530000 19499074 18190110 17489029 15877854 16036715 14763078 15155211
3319 15155211 14732272 14804645 13031229 13102287 11235941 13615760 11968947 11334066 10135642
3310 10135642 11429526 10863419 10231571 9944571 8505937 9238218 10703574 9310779 9386012
3301 9386012 7630750 7165549 5390406 5448453 4648487 6241311 6133401 8665358 6485969
3292 6485969 8945015 7681854 8153850 8942023 8594180 8809583 9194516 8525615 8403936
3283 8403936 8558390 10061883 9254733 8794051 10485140 9326131 10738630 10273108 10866999
$$ packed form
3345D3721797l369248j344728k109284q24056k198635j795945R24044k600745
3337C0403200J36401j172448k415503k12430r84312q24538l78870j557308q33834
3328B2160358k046223M15865j030926j308964p01081j611175J58861j273637L92133
3319A5155211m22939P2373j773416P1058j866346K379819j646813o34881j198424
3310A0135642J293884n66107o31848k87000j438634P32281J465356j392795P5233
3301I386012j755262m65201j775143N8047p99966J592824j07910K531957k179389
3292F485969K459046j263161M71996P88173l47843K15403L84933o68901j21679
3283H403936J54454J503493q07150m60682J691089j159009J412499m65522N93891
$$ plain form
3274 10866999 12529378 11944699 12055492 14369639 11764201 13351391 13428878 13295783 13107408
3265 13107408 13443189 13157165 14679314 14528693 15246101 17426372 17791828 17727798 17318296
3256 17318296 18371120 20058327 19785208 21964838 22258404 24432234 24762928 25447000 26576088
3247 26576088 27189757 27325166 28699822 29351969 29270473 31570362 32052595 32674115 33420040
3238 33420040 33010237 35333598 35774145 37695401 38129849 39127633 38781885 42219869 42407561
3229 42407561 45520061 48051505 49857385 51258860 49188929 45129789 41375817 34928925
3221 34928925 30706324 24697476 22135770 17793278 17089594 14408298 14671195 14416906 14600705
3212 14600705 13357408 12637982 11342317 10925351 10993998 8654870 10374533 9034364 9223999
$$ packed form
3274A0866999J662379n84679J10793K314147k605438J587190P7487j33095j88375
3265A3107408L35781k86024J522149j50621P17408K180271L65456o4030m09502
3256A7318296J052824J687207k73119K179630K93566K173830L30694O84072J129088
3247B6576088O13669J35409J374656O52147q1496K299889M82233O21520P45925
3238C3420040m09803K323361M40547J921256M34448R97784l45748L437984J87692
3229D2407561L112500K531444J805880J401475k069931m059140l753972o446892
3221C4928925m222601o008848k561706m342492p03684k681296K62897k54289J83799
3212A4600705j243297p19426j295665m16966O8647k339128J719663j340169J89635
$$ plain form
3203 9223999 10193038 9965662 8684184 8582370 7819956 9196423 8943037 10208778 9306149
3194 9306149 7942378 8794192 7702586 8706240 9327275 8215813 8171038 8249621 9851759
3185 9851759 8372807 11539046 10866053 12364982 13421762 14078391 13387560 13193876 11649222
3176 11649222 11328261 12189590 8157422 9727000 7633704 7358021 6904722 7644587 6836817
3167 6836817 7156445 6815805 5856286 6181508 6340119 6674289 7469953 7046906 7287315 5893444
3157 5893444 5932308 6768996 4168472 4989282 5726829 6174915 6292527 6113326 6193465 4740829
3147 4740829 6000943 7133333 6226841 6926405 6049712 8031363 6702948 7310102 7119853
3138 7119853 5981253 6036401 6891531 6988221 7345197 8029411 7678644 7950616 8350505 7850870
$$ packed form
3203I223999R69039k27376j281478j01814p62414J376467k53386J265741r02629
3194I306149j363771Q51814j091606J003654O21035j111462m4775P8583J602138
3185I851759j478952L166239o72993J498929J056780O56629o90831j93684j544654
3176A1649222l20961Q61329m032168J569578k093296k75683m53299P39865q07770
3167F836817L19628l40640r59519L25222J58611L34170P95664m23047K40409j393871
3157E893444L8864Q36688k600524Q20810P37547M48086J17612j79201Q0139j452636
3147D740829J260114J132390r06492O99564q76693J981651j328415O07154j90249
3138G119853j138600N5148Q55130R6690L56976O84214l50767K71972L99889m99635
$$ plain form
3128 7850870 9182972 7871319 8219424 7652971 8234429 7636758 7464795 9086022 8860220
3119 8860220 9080620 9432954 9332059 9965966 9078134 11146523 10310144 11210889 12455840
3110 12455840 12377635 12827890 13427520 13419025 14216174 14100182 13657712 14791086 16478661 14929246
3100 14929246 16328885 15006881 16835377 16814306 15488080 15701330 15103285 16512394 15632937
3091 15632937 16118525 15728266 17755100 15709107 15953127 16282040 15919890 16192602 17484694
3082 17484694 16354548 17446342 18607154 18061376 18280582 15784564 13842114 13653769 11537765
3073 11537765 10592329 9215430 9442639 8338457 7768494 7239727 7570731 7723778 6854324
3064 6854324 7252815 8111507 6828662 7146441 7383132 7369505 6489075 6474790 6362193 7106220
$$ packed form
3128G850870J332102j311653L48105n66453N81458n97671j71963J621227k25802
3119H860220K20400L52334j00895O33907q87832K068389q36379R00745J244951
3110A2455840p8205M50255N99630q495P97149j15992m42470J133374J687575j549415
3100A4929246J399639j322004J828496k1071j326226K13250n98045J409109q79457
3091A5632937M85588l90259K026834k045993K44020L28913l62150K72712J292092
3082A7484694j130146J091794J160812n45778K19206k496018j942450j88345k116004
3073A1537765r45436j376899K27209j104182n69963n28767L31004J53047q69454
3064F854324L98491Q58692j282845L17779K36691j3627q80430j4285j12597P44027
$$ plain form
3054 7106220 7197233 7838791 7987359 9096899 7802982 7260590 6886477 6769300 7219877
3045 7219877 6822480 4704268 5816409 4462306 4894579 4146356 3704010 5750285 5015032
3036 5015032 4690520 4808680 5494985 5514131 5754824 5497788 5562320 6779789 5814932 5780926
3026 5780926 5976591 3985697 6241317 6143667 4067733 5868156 5833330 5522494 5937973
3017 5937973 5535114 5240636 5983893 5872196 6351958 6608798 6742999 7454927 8105644 6168750
3007 6168750 5147621 6474041 5486467 4166313 3662412 4991406 5927449 6030550 5579120
2998 5579120 4268483 5898565 5733982 4568422 5256449 3762556 5502214 5732889 5742965
2989 5742965 6682103 5599082 5786635 5635022 6540758 5223414 5775663 5578817 6593795
$$ packed form
3054G106220R1013O41558J48568J109540j293917n42392l74113j17177M50577
3045G219877l97397k118212J112141j354103M32273p48223m42346K046275p35253
3036E015032l24512J18160O86305J9146K40693k57036O4532J217469r64857l4006
3026E780926J95665j990894K255620r7650k075934J800423l4826l10836M15479
3017E937973m02859k94478P43257j11697M79762K56840J34201P11928O50717j936894
3007F168750j021129J326420r87574j320154n03901J328994R36043J03101m51430
2998E579120j310637J630082j64583j165560O88027j493893J739658K30675J0076
2989E742965R39138j083021J87553j51613R05736j317344N52249j96846J014978
$$ plain form
2980 6593795 5511538 6025374 5474841 6435154 6157362 8257659 6335428 6631644 7031233
2971 7031233 6432155 6672030 6703883 7928373 7617384 7708847 8123030 7844698 8557338 9826869
2961 9826869 10143004 9462245 11807413 10620741 13019066 15376724 17532680 24223024 27254886
2952 27254886 28064488 27799770 28565155 23776134 20890404 13560680 10956551 9230848 7527644
2943 7527644 7880171 6587790 7092934 6007384 5885458 7006394 6528544 6981653 6450910
2934 6450910 6630077 6731396 6038272 6163119 7171877 7678856 6704646 7100932 7240175
2925 7240175 5354668 5731862 5098844 5577409 5695552 6466768 5035223 6107696 5060462
2916 5060462 5760812 6488224 5605815 7288512 5136555 5190882 4933284 5468352 5223332
$$ packed form
2980F593795j082257N13836n50533R60313k77792K100297j922231K96216L99589
2971G031233n99078K39875L1853J224490l10989R1463M14183k78332P12640J269531
2961I826869L16135o80759K345168j186672K398325K357658K155956O690344L031862
2952B7254886Q09602k64718P65385m789021k885730p329724k604129j725703j703204
2943G527644L52527j292381N05144j085550j21926J120936m77850M53109n30743
2934F450910J79167J01319o93124J24847J008758N06979r74210L96286J39243
2925G240175j885507L77194o33018M78565J18143P71216j431545J072473j047234
2916E060462P00350P27412q82409J682697k151957N4327k57598N35068k45020
$$ plain form
2907 5223332 5369057 5261478 4886222 5649723 3888522 5587904 6180244 5957607 5572594
2898 5572594 5885493 4715525 5681028 5711652 4762143 4818856 5872518 4789316 4902722
2889 4902722 5618026 5139371 4271215 5202311 5413678 6137523 5091453 5492263 5948863
2880 5948863 4705257 5625953 4812804 7011649 5395168 4728807 4582898 6514498 5273804
2871 5273804 4598995 5508089 4448795 4800240 4596144 4675163 3312459 5026528 5016025
2862 5016025 4188119 5771063 4984315 4282151 5327936 6175738 5505434 5452999 5215350
2853 5215350 4656374 5824314 6226539 5620226 4639602 5557874 5047010 4927290 5927992
2844 5927992 4413872 5330023 5071808 4539410 5479296 5576199 5923853 5378929 5325580 5979611
$$ packed form
2907E223332J45725j07579l75256P63501j761201J699382N92340k22637l85013
2898E572594L12899j169968R65503L0624r49509N6713J053662j083202J13406
2889D902722P15304m78655q68156R31096K11367P23845j046070M00810M56600
2880E948863j243606R20696q13149K198845j616481o66361j45909J931600j240694
2871E273804o74809R09094j059294L51445k04096P9019j362704J714069j0503
2862E016025q27906J582944p86748p02164J045785Q47802o70304n2435k37649
2853E215350n58976J167940M02225o06313r80624R18272n10864j19720J000702
2844E927992j514120R16151k58215n32398R39886R6903L47654n44924n3349O54031
$$ plain form
2834 5979611 5209604 6020460 3824524 5425275 4594031 4370144 4712371 4782046 5227938
2825 5227938 5534981 5552731 5956814 5086889 5277353 5164892 5522753 5523597 6187292 5101728
2815 5101728 5632678 6863364 5189511 6541151 5089287 6894441 6741823 4588603 7061814
2806 7061814 5928147 6138091 4656196 5991852 7392712 7361419 6897912 6526600 6703318
2797 6703318 5640806 5365112 6211724 5475191 7024592 6591029 6939521 7751885 7184354
2788 7184354 7093238 6778213 7021765 6354462 7084748 7057815 7133295 7278835 8065690 6785817
2778 6785817 5974648 6205753 6862688 5690522 5703865 6659807 6960690 5369091 5976592
2769 5976592 6432640 6052883 5536130 6270868 6760090 6416186 5930723 6228083 5649351 5197132
$$ packed form
2834E979611p70007Q10856k195936J600751q31244k23887L42227O9675M45892
2825E227938L07043J7750M04083q69925J90464j12461L57861Q44O63695j085564
2815E101728N30950J230686j673853J351640j451864J805154j52618k153220K473211
2806G061814j133667K09944j481895J335656J400860l1293m63507l71312J76718
2797F703318j062512k75694Q46612p36533J549401m33563L48492Q12364n67531
2788G184354r1116l15025K43552o67303P30286k6933P5480J45540P86855j279873
2778F785817q11169K31105O56935j172166J3343R55942L00883j591599O07501
2769E976592M56048l79757n16753P34738M89222l43904m85463K97360n78732m52219
$$ plain form
2759 5197132 7025069 6092868 5631971 6961009 5885822 5877155 5516514 5731663 5580917
2750 5580917 5836220 6728287 4232232 6001712 6283952 6733308 6568040 7157114 7495200
2741 7495200 7588025 8173386 10567735 10824202 13176691 17329380 26532822 39062389 36740921
2732 36740921 29331294 18711316 12108975 9019877 7460910 6612465 5773882 5096996
2724 5096996 4759798 3959118 4953290 4219283 4610980 3927577 3891286 3917654 3667364 4297436
2714 4297436 3396007 3355462 4051307 4374623 4116513 3480157 4590373 4011584 4717646 4952622
2704 4952622 4491421 4312675 4839017 4074551 3287402 5641335 4098519 4599644 4665656
2695 4665656 4280716 4594528 4464367 4605594 5045638 2590853 4880494 4202582 3011907
$$ packed form
2759E197132J827937r32201m60897J329038j075187q667l60641K15149j50746
2750E580917K55303Q92067k496055J769480K82240M49356j65268N89074L38086
2741G495200R2825N85361K394349K56467K352489M152689R203442J2529567k321468
2732C6740921p409627j0619978o602341l089098j558967q48445q38583o76886
2724E096996l37198q00680R94172p34007L91697o83403l6291K6368k50290O30072
2714D297436r01429m0545O95845L23316k58110o36356J110216n78789P06062K34976
2704D952622m61201j78746N26342p64466p87149K353933j542816N01125O6012
2695D665656l84940L13812j30161J41227M40044k454785K289641o77912j190675
$$ plain form
2686 3011907 2688510 4220530 4265470 3924366 4165679 4425003 4122631 3736872 3663157 3839561
2676 3839561 4606567 4478735 5790868 3683004 5104062 3850971 5574757 4428011 5789751
2667 5789751 6734664 5991513 4410388 6588191 7033702 6479501 5919586 6068238 6679890
2658 6679890 7342860 8886449 8791495 8656114 9575062 9859659 10378750 12451398 13469040
2649 13469040 14456325 16437912 20629554 28621706 44366089 58057265 57552868 44756553
2641 44756553 31007460 23183686 18464700 18343343 19858930 25799763 37933173 45219573
2633 45219573 39357405 29731684 22414422 19348924 20256206 23007320 31747900 48669229
2625 48669229 59908364 53249153 36061761 24732718 18692724 17435668 18453668 23116948
$$ packed form
2686C011907l23397J532020M4940l41104K41313K59324l02372l85759p3715J76404
2676C839561P67006j27832J312133k107864J421058j253091J723786j146746J361740
2667E789751R44913p43151j581125K177803M45511n54201n59915J48652O11652
2658F679890O62970J543589r4954j35381R18948K84597N19091K072648J017642
2649A3469040R87285J981587M191642P992152J5744383J3691176n04397j2796315
2641D4756553j3749093p823774m718986j21357J515587N940833J2133410P286400
2633D5219573n862168r625721p317262l065498R07282K751114Q740580J6921329
2625D8669229J1239135o659211j7187392j1329043o039994j257056J018000M663280
$$ plain form
2617 23116948 34843025 40262405 35090837 24195248 16568847 13175728 11320596 12101751
2609 12101751 14157836 18462050 21833334 19390748 13840367 10805120 9081535 6395458
2601 6395458 5391528 4538744 5058669 4170883 4625679 2080136 3505466 4178989 5113247
2592 5113247 4243390 5263571 6061211 5932563 6114094 7593008 6873314 8271717 8917081
2583 8917081 8102070 7872120 7184288 6994314 6550554 5830208 5427270 5494978 5634240 5843877
2573 5843877 5511626 3409665 4623603 3026063 3382529 3897080 3323063 3624165 1135003
2563 1918512 2975070 3259213 1890231 3113433 1574010 1458380 2529217 2751303 2776360
2554 2776360 2466307 1880016 2730718 1136493 2155296 1839945 2432220 2594137 3262342
$$ packed form
2617B3116948J1726077N419380n171568j0895589p626401l393119j855132P81155
2609A2101751K056085M304214L371284k442586n550381l035247j723585k686077
2601F395458j003930q52784N19925q87786M54796B080136J425330O73523R34258
2592E113247q69857J020181P97640j28648J81531J478914p19694J398403O45364
2583H917081q15011k29950o87832j89974m43760p20346m02938O7708J39262K09637
2573E843877l32251k101961J213938j597540L56466N14551n74017L01102A135003
2563A918512J056558K84143j368982J223202j539423j15630J070837K22086K5057
2554B776360l10053n86291Q50702A136493J018803l15351N92275J61917O68205
$$ plain form
2545 3262342 2335699 3443704 2575049 2620066 2840621 1602198 2141142 3243270 2823306
2536 2823306 2742874 3172936 2323804 4291601 1578326 2744200 2836259 2029578 3176202
2527 3176202 2123060 2228154 2545220 2853468 1957310 1704080 1984026 2335069 3107177
2518 3107177 1894069 3143631 3306321 3803729 2454316 3498576 2679023 3679052 3739788
2509 3739788 1701722 2391801 3791493 3304432 3182714 3424610 3582583 3439798 3522714
2500 3522714 3357113 3124703 4024326 3000260 3332025 3835934 3910363 3178482 3526834 3484928
2490 3484928 2641428 3805608 3913420 4044303 4095991 3429933 3147063 3314004 4544444
2481 4544444 3887556 3176764 3332704 3646804 3657292 3208416 3712880 2165018 2604590 3379115
$$ packed form
2545C262342r26643J108005q68655M5017K20555j238423N38944J102128m19964
2536B823306q0432M30062q49132J967797A578326J165874R2059q06681J146624
2527C176202j053142J05094L17066L08248q96158k53230K79946L51043P72108
2518C107177j213108J249562J62690M97408j349413J044260q19553J000029O0736
2509C739788A701722O90079J399692m87061j21718K41896J57973j42785Q2916
2500C522714j65601k32410Q99623j024066L31765N03909P4429p31881L48352m1906
2490C484928q43500J164180J07812J30883N1688o66058k82870J66941J230440
2481D544444o56888p10792J55940L14100J0488m48876N04464j547862M39572P74525
$$ plain form
2471 3379115 3994824 2850099 3021053 3310884 4126839 2126619 3757540 2268798 3302594
2462 3302594 2994138 3090388 2592786 2952334 2036374 2672489 1310681 2773447 1998842
2453 1998842 3576163 3381057 2666595 3460043 2618545 3151418 2543173 2931033 3236314
2444 3236314 4021454 2045887 3473979 2503187 3265665 1846664 2221228 4057932 2839311
2435 2839311 2679619 2584415 2579394 2071867 3709772 2876235 1510983 2257630 1835008 3719562
2425 3719562 3085955 3101687 2792083 2011222 2672538 3429252 3504671 2140880 3107201 2826670
2415 2826670 3483305 3571109 3118013 4090889 2661394 3534695 2396378 3361510 3921790
2406 3921790 3631383 3620998 3265169 2542723 3479147 4384199 3351746 4226403 4652774 4218104
$$ packed form
2471C379115O15709j144725J70954K89831Q15955k000220J630921j488742J033796
2462C302594l08456R6250m97602L59548r15960O36115A310681J462766p74605
2453A998842J577321j95106p14462P93448q41498N32873o08245L87860L05281
2444C236314P85140j975567J428092r70792P62478j419001L74564J836704j218621
2435B839311j59692r5204n021n07527J637905q33537j365252P46647m22622J884554
2425C719562o33607J5732l09604p80861O61316P56714P5419j363791R66321k80531
2415B826670O56635Q7804m53096R72876j429495Q73301j138317R65132N60280
2406C921790k90407j0385l55829p22446R36424R05052j032453Q74657M26371m34670
$$ plain form
2396 4218104 4050343 2938757 4908688 3592911 4324663 2748160 3917701 4846502 3595161
2387 3595161 3916200 3813192 3951824 2893518 4820099 3489718 3597863 4597615 3354627
2378 3354627 3732993 4466912 3921040 4001732 4819179 3684432 4176910 5081841 4327569 4713669
2368 4713669 5349052 5759770 5014323 4677211 5374642 5916845 5699871 6386868 5342152
2359 5342152 5256347 5261937 6217041 4151366 5385116 5219595 5812195 4969321 4508107 3482608
2349 3482608 4007034 5733090 3518114 4396825 4169791 4840144 4402333 4656454 5001795
2340 5001795 3759593 4800901 4399865 3835679 4285747 5149613 4330422 5027254 4283112
2331 4283112 5381651 4368332 4508426 4112153 2846473 4475935 3818711 4420141 4146060
$$ packed form
2396D218104j67761j111586J969931j315777P31752j576503J169541R28801j251341
2387C595161L21039j03008J38632j058306J926581j330381J08145R99752j242988
2378C354627L78366P33919n45872Q0692Q17447j134747M92478R04931p54272L86100
2368D713669O35383M10718p45447l37112O97431N42203k16974O86997j044716
2359E342152q5805N590R55104k065675J233750j65521N92600q42874m61214j025499
2349C482608N24426J726056k214976Q78711k27034O70353m37811K54121L45341
2340E001795j242202J041308m01036n64186M50068Q63866q19191O96832p44142
2331D283112J098539j013319J40094l96273j265680J629462o57224O01430k74081
$$ plain form
2322 4146060 4303242 3010661 3033032 3877917 4135484 4110849 4277646 4678424 4086685 4350174
2312 4350174 4582230 3963158 4055351 4686086 2888322 4769095 4149601 3118810 3545804
2303 3545804 4703588 3264259 3806918 4436508 4029419 3109827 4306860 3466190 3395388
2294 3395388 4110504 3256088 3115134 3762491 4656129 4992750 4120232 5197504 3635716
2285 3635716 3110892 4167542 3963406 4030917 3577706 4395294 3662622 2681763 4918004
2276 4918004 4209258 3802352 3292627 4287413 3702140 3258213 3926125 3700291 3866750 3741233
2266 3741233 3676534 3908161 3790061 4337178 4552531 3651535 4675726 5473358 3986277
2257 3986277 4753656 5365715 4920890 4879209 3898378 4145754 4718989 4556518 5000201 3869912
$$ packed form
2322D146060J57182j292581K2371Q44885K57567k4635J66797M00778n91739K63489
2312D350174K32056o19072R2193O30735j797764J880773o19494j030791M26994
2303C545804J157784j439329N42659O29590m07089r19592J197033q40670p0802
2294C395388P15116q54416j40954O47357Q93638L36621q72518J077272j561788
2285C635716n24824J056650k04136O7511m53211Q17588p32672r80859K236241
2276D918004p08746m06906n09725R94786n85273m43927O67912k25834J66459j25517
2266C741233o4699K31627j18100N47117K15353r00996J024191P97632j487081
2257C986277P67379O12059m44825m1681r80831K47376N73235j62471M43683j130289
$$ plain form
2247 3869912 3879067 4775323 4063177 4139236 4832417 3705180 5029031 2417131 3923369
2238 3923369 4116692 3009709 4257444 4870201 4713033 4235047 4715261 4724705 4087891 4870623
2228 4870623 5554071 4895952 5369054 3589070 4633922 4435435 5264111 4218486 4209147
2219 4209147 4374421 4730170 5498454 4037788 5252146 3372216 4038903 4060363 4812816
2210 4812816 4825804 5276814 4887934 6271857 5319530 5363418 5075557 5328599 6157044 5506288
2200 5506288 6088200 5358604 4524355 4647105 6123506 6228045 5533986 5784280 5819191 7070065
2190 7070065 6886947 6470831 7188909 5779771 6752667 6261812 5747358 6640967 6614204 6219217
2180 6219217 6839845 6317848 7477441 7267694 7641730 7729416 7227373 7815859 8333603 9351276
$$ packed form
2247C869912R155Q96256p12146P6059O93181j127237J323851B417131J506238
2238C923369J93323j106983J247735O12757j57168m77986M80214R444o36814P82732
2228D870623O83448o58119M73102j779984J044852j98487Q28676j045625r339
2219D209147J65274L55749P68284j460666J214358j879930O66687K1460P52453
2210D812816J2988M51010l88880J383923r52327M3888k87861K53042Q28445o50756
2200E506288N81912p29596q34249J22750J476401J04539o94059K50294L4911J250874
2190G070065j83118m16116P18078j409138R72896m90855n14454Q93609k6763l94987
2180F219217O20628n21997J159593k09747L74036Q7686n02043N88486N17744J017673
$$ plain form
2170 9351276 7708867 8788369 8767576 8256711 8561370 8220640 9031471 10726270 8728664
2161 8728664 9437907 8097259 8939490 8605304 8240253 8569072 8145682 8604831 8638863 8045700
2151 8045700 8653219 9385038 7868542 8540662 8597348 7450971 7932356 8856894 9214787
2142 9214787 10126821 9425598 8739450 9553544 8608572 8073136 8176708 7294845 8286094 9272946
2132 9272946 9242556 7860547 8539513 8678922 8956105 8479843 8684904 8762945 8648921 8992177
2122 8992177 8251428 8613602 9421603 8234928 9079362 8278004 8584827 7978765 10161247
2113 10161247 8356006 8819969 8467005 7492824 6985519 7476099 8375293 8613062 7939881
2104 7939881 7711377 7034964 8808656 8292884 6568585 7376343 7999509 6779459 7709772
$$ packed form
2170I351276j642409J079502k0793n10865L04659l40730Q10831J694799j997606
2161H728664P09243j340648Q42231l34186l65051L28819m23390M59149L4032n93163
2151H045700O07519P31819j516496O72120N6686j146377M81385R24538L57893
2142I214787R12034p01223o86148Q14094r44972n35436J03572q81863R91249R86852
2132I272946l0390j382009O78966J39409K77183m76262K05061P8041j14024L43256
2122H992177p40749L62174Q08001j186675Q44434q01358L06823o06062K182482
2113A0161247j805241M63963l52964r74181n07305M90580Q99194K37769o73181
2104G939881k28504o76413J773692n15772j724299Q07758O23166j220050R30313
$$ plain form
2095 7709772 6649671 5755324 6730737 7623706 6786182 6955412 6279626 8235585 6295608
2086 6295608 7471626 6910583 6694592 5538064 6987845 7979105 6434955 6116985 8185028
2077 8185028 7381958 6583391 7250721 7562015 8430608 8693414 8301449 7184497 7329996
2068 7329996 7790802 7499244 7472675 8386494 8549883 8753873 8890674 8329475 8911823 8350152
2058 8350152 9322628 8104904 8874979 9450701 7573358 9168694 9030556 8916029 8749092
2049 8749092 9118661 9046530 9194973 9455396 8695413 9356396 10038714 8696347 9661310 10920364
2039 10920364 11148974 11279323 10897656 10751105 10701398 12404337 11224053 11871792 11068233
2030 11068233 12277880 13058575 11481124 12477115 13293187 12194564 12987012 12410554 13597584
$$ packed form
2095G709772j060101q94347R75413Q92969q37524J69230o75786J955959j939977
2086F295608J176018n61043k15991j156528J449781R91260j544150l17970K068043
2077H185028q03070p98567O67330L11294Q68593K62806l91965j116952J45499
2068G329996M60806k91558k6569R13819J63389K03990J36801n61199N82348n61671
2058H350152R72476j217724P70075N75722j877343J595336j38138j14527j66937
2049H749092L69569p2131J48443K60423p59983O60983O82318j342367R64963J259054
2039A0920364K28610J30349l81667j46551m9707J702939j180284O47739q03559
2030A1068233J209647P80695j577451R95991Q16072j098623P92448n76458J187030
$$ plain form
2021 13597584 12242136 11634417 12600792 12989686 12563879 12963828 11836421 12963561 12620559
2012 12620559 13756455 12690146 12344457 12642960 12948203 11663120 13086126 12171331 12137663
2003 12137663 13712305 12859985 13300792 12981998 13074568 12706828 13763063 13016488 13176089
1994 13176089 13462214 13765979 13416311 11554501 13255103 13823679 13888950 12453608 13617864
1985 13617864 12207745 12070771 13178682 12583301 12028107 12406185 12767664 13801535 14540319
1976 14540319 12206711 14131649 15383650 16697330 20602442 29187550 30145044 26318969
1968 26318969 20420228 14920564 12996716 11279322 10670130 10686923 10517029 10781546 9938537
1959 9938537 10603487 9851599 9553811 10003777 10542482 9714119 10494910 8999968 8479234
$$ packed form
2021A3597584j355448o07719R66375L88894m25807L99949j127407J127140l43002
2012A2620559J135896j066309l45689K98503L05243j285083J423006r14795l3668
2003A2137663J574642q52320M40807l18794R2570l67740J056235p46575J59601
1994A3176089K86125L03765l49668j861810J700602N68576O5271j435342J164256
1985A3617864j410119j36974J107911n95381n55194L78078L61479J033871P38784
1976A4540319k333608J924938J252001J313680L905112Q585108R57494l826075
1968B6318969n898741n499664j923848j717394o09192J6793j69894K64517q43009
1959I938537O64950p51888k97788M49966N38705q28363P80791j494942n20734
$$ plain form
1950 8479234 9475023 9040131 9634295 8700272 8970135 8535824 8499749 8386335 8058564 9111612
1940 9111612 8095288 8966900 9029951 9353191 9042393 7971132 7707649 9146232 7259613
1931 7259613 8222436 8878193 9304821 9615723 8694080 7041432 7794527 7811792 7112720 8139213
1921 8139213 9009076 7985632 8492292 7992727 8161200 6511117 7862628 9183858 7224665
1912 7224665 7088366 7810442 7520001 8246690 7703973 8168687 8246242 6385734 7432732
1903 7432732 7253971 8354982 7211934 7494513 8022772 7362843 4883954 7352205 8133602
1894 8133602 7129689 8421720 8412995 7963073 8385186 8268002 8693468 8531684 8389184 7777689
1884 7777689 8246633 8099778 8128774 9487422 8066244 8784043 8642718 7890417 8120381
$$ packed form
1950H479234R95789m34892N94164r34023K69863m34311l6075j13414l27771J053048
1940I111612j016324Q71612O3051L23240l10798j071261k63483J438583j886619
1931G259613R62823O55757M26628L10902r21643j652648P53095J7265o99072J026493
1921H139213Q69863j023444N06660m99565J68473j650083J351511J321230j959193
1912G224665j36299P22076k90441P26689n42717M64714P7555j860508J046998
1903G432732j78761J101011j143048K82579N28259o59929k478889K468251P81397
1894H133602j003913J292031q725m49922M22113j17184M25466j61784j42500o11495
1884G777689M68944j46855K8996J358648j421178P17799j41325p52301K29964
$$ plain form
1875 8120381 8741742 8478514 9057812 8565797 7766024 8800451 8169244 9561982 8729724
1866 8729724 8308377 8185556 8760058 8304507 8597346 9608265 9522585 9734678 9886119 9755791
1856 9755791 9842408 10071394 9842366 10440713 11058707 10720565 11436999 11332938 10542274 9948379
1846 9948379 11547363 11344982 11907899 10669376 12320780 12499457 12574735 12513781 12562291 12184103
1836 12184103 13078486 14975682 14429666 14105131 14159529 13252285 15449551 14961640 14443704
1827 14443704 14755548 15702343 15321323 16360698 15283672 15655347 15200888 16252506 16953570
1818 16953570 17152652 17708022 16726159 17995836 17451586 18349276 18382328 19147258 18142572
1809 18142572 18170420 19689496 19242574 19235770 18474574 18648600 19205934 18173344 18576498 19482772
$$ packed form
1875H120381O21361k63228N79298m92015p99773J034427o31207J392738q32258
1866H729724m21347j22821N74502m55551K92839J010919q5680K12093J51441j30328
1856I755791Q6617K28986k29028N98347O17994l38142P16434j04061p90664n93895
1846I948379J598984k02381N62917j238523J651404J78677P5278o0954M8510l78188
1836A2184103Q94383J897196n46016l24535N4398r07244K197266m87911n17936
1827A4443704L11844R46795l81020J039375j077026L71675m54459J051618P01064
1818A6953570J99082N55370r81863J269677n44250Q97690L3052P64930j004686
1809A8142572K7848J519076m46922o804p61196J74026N57334j032590M03154R06274
$$ plain form
1799 19482772 19324738 18811744 18863364 19669020 19377768 18979164 18810241 18510954 18414810 19675022
1789 19675022 18672576 20127272 18356374 18095942 18900746 18333743 18690838 19816621 18573770
1780 18573770 19128954 19015208 19959127 19730128 19544970 18442952 18658498 18651702 19573100 18544444
1770 18544444 18545030 16679991 16755393 15718876 14312680 15507110 13667901 13838584 12839619
1761 12839619 13159048 12249733 12533953 11511009 12092368 13116228 12367705 10983866 11751940
1752 11751940 11774352 11149085 10781472 10341709 10276940 11499514 11253579 10185676 9705698
1743 9705698 10483762 11287373 10798205 10097460 10162660 10288119 10489564 9515337 10248662 9857922
1733 9857922 10012140 7675576 9587500 10708049 9924814 10134447 8918209 10272592 9589743
$$ packed form
1799A9482772j58034n12994N1620Q05656k91252l98604j68923k99287r6144J260212
1789A9675022j002446J454696j770898k60432Q04804n67003L57095J125783j242851
1780A8573770N55184j13746R43919k28999j85158j102018K15546o796R21398j028656
1770A8544444N86j865039P5402j036517j406196J194430j839209J70683r98965
1761A2839619L19429r09315K84220j022944N81359J023860p48523j383839P68074
1752A1751940K2412o25267l67613m39763o4769J222574k45935j067903m79978
1743I705698P78064Q03611m89168p00745O5200J25459K01445r74227P33325l90740
1733I857922J54218k336564J911924J120549p83235K09633j216238J354383o82849
$$ plain form
1724 9589743 9411859 9214769 10068130 8644907 9081463 10630376 9935126 9550976 10367669
1715 10367669 10033909 10157675 10395976 10354427 10055979 11396242 11697498 10924136 9666115
1706 9666115 10737464 11639146 10742750 11133914 12601936 12015282 12997147 10975387 12002838
1697 12002838 12412126 12149430 12999643 13391244 13357816 13975448 13919006 14289263 14309783 14826446
1687 14826446 15365471 15044493 15331696 16034877 16628192 16584457 16835148 17060926 17487550 19218150
1677 19218150 17964736 19508686 18881296 19574306 20223096 21100824 21916176 22657138 24633138
1668 24633138 23897767 25721723 26605693 28653786 29079889 29411997 31597809 33757685 34468897
1659 34468897 35525309 38891541 40167137 42987361 43906933 45797833 47056365 48329157
$$ packed form
1724I589743j77884j97090Q53361j423223M36556J548913o95250l84150Q16693
1715A0367669l33760J23766K38301m1549k98448J340263L01256p73362j258021
1706I666115J071349R01682q96396L91164J468022n86654R81865k021760J027451
1697A2002838M09288k62696Q50213L91601l3428O17632n6442L70257K0520N16663
1687A4826446N39025l20978K87203P03181N93315m3735K50691K25778M26624J730600
1677A9218150j253414J543950o27390O93010O48790Q77728Q15352P40962J976000
1668B4633138p35371J823956Q83970K048093M26103L32108K185812K159876P11212
1659C4468897J056412L366232J275596K820224R19572J890900J258532J272792
$$ plain form
1651 48329157 49766881 49078688 51584888 51353657 52686956 54756873 55507033 56338697 56475949
1642 56475949 58723924 60465900 63445604 65611943 69298035 73075187 77944051 79966212
1634 79966212 84205523 92350387 99092395 106772689 117475097 128618745 138853337 149602824
1626 149602824 152794264 150731192 142522216 129156961 114500746 98791106 83332667
1619 83332667 70255884 59656060 48734977 41120681 36541905 31750731 29147698 27163933
1611 27163933 23934688 23295340 22663058 19909428 19016992 17957692 18038862 18736299 16625463
1602 16625463 16174303 15298138 14994776 15267172 14138080 13308012 13817176 11867346 14207868
1593 14207868 12820496 12613920 12812595 13121577 12180516 12403875 10303646 11198701 11248814
$$ packed form
1651D8329157J437724o88193K506200k31231J333299K069917P50160Q31664J37252
1642E6475949K247975J741976K979704K166339L686092L777152M868864K022161
1634G9966212M239311Q144864O742008P680294J0702408J1143648J0234592J0749487
1626A49602824L191440k063072q208976j3365255j4656215j5709640j5458439
1619H3332667j3076783j0599824j0921083p614296m578776m791174k603033j983765
1611B7163933l229245o39348o32282k753630q92436j059300Q1170O97437k110836
1602A6625463m51160q76165l03362K72396j129092q30068N09164j949830K340522
1593A4207868j387372k06576J98675L08982r41061K23359k100229Q95055N0113
$$ plain form
1584 11248814 9860350 10282905 10468666 10592378 9319938 10519285 9382243 9036124 9391870
1575 9391870 7976361 8774781 9123395 9221480 7343096 8444931 9312484 7842371 7611329
1566 7611329 7548859 7462175 7982100 8747944 6692666 7601809 8471413 4925085 8293895
1557 8293895 6173123 6319958 6414841 6747148 6742585 6404008 6386887 6483963 7016591 5990157
1547 5990157 5435408 5306577 6535446 5499749 4732033 6023041 4774407 5474896 5151616
1538 5151616 5852868 6735579 6809834 5199406 5620148 7214984 6598721 7470123 6023074
1529 6023074 6822050 6896935 6795594 6068126 5895685 7242114 5928217 6965311 7858077
1520 7858077 5985242 7482468 7362160 7227054 7961144 6450603 7578442 7329508 8718166
$$ packed form
1584A1248814j388464M22555J85761J23712j272440J199347j137042l46119L55746
1575I391870j415509P98420L48614R8085j878384J101835Q67553j470113k31042
1566G611329o2470q6684N19925P65844k055278R09143Q69604l546328L368810
1557H293895k120772J46835R4883L32307m563l38577j7121R7076N32628j026434
1547E990157n54749j28831J228869j035697p67716J291008j248634P00489l23280
1538E151616P01252Q82711P4255j610428M20742J594836o16263Q71402j447049
1529F023074P98976P4885j01341p27468j72441J346429j313897J037094Q92766
1520G858077j872835J497226j20308j35106P34090j510541J127839k48934J388658
$$ plain form
1511 8718166 7529815 7509512 8148640 8590036 8882831 8410216 8608133 8778125 8685351 8235108
1501 8235108 8924969 9753955 9991242 10581870 11132498 10808800 11463784 11154830 12156784
1492 12156784 10421136 11424419 12245445 13432462 12988821 12831440 12219217 13450681 13484017
1483 13484017 14112173 13877789 14950569 14325122 14736620 14451083 15967027 16547384 16633026
1474 16633026 16633200 17468006 16366479 15127548 13862614 14128327 13221443 12080615 14233767
1465 14233767 12194406 13841587 10490096 12914054 13168126 11977928 13240242 12762213
1457 12762213 11366168 12443908 12163264 12771292 12345353 11549717 11323163 11109154 11973304
1448 11973304 11395745 11164077 10854223 10597309 12750498 11334855 11823512 13454318 14477054
$$ packed form
1511H718166j188351k0303O39128M41396K92795m72615J97917J69992r2774m50243
1501H235108O89861Q28986K37287N90628N50628l23698O54984l08954J001954
1492A2156784j735648J003283Q21026J187017m43641j57381o12223J231464L3336
1483A3484017O28156k34384J072780o25447M11498k85537J515944N80357Q5642
1474A6633026J74Q34806j101527j238931j264934K65713r06884j140828K153152
1465A4233767k039361J647181l351491K423958K54072j190198J262314m78029
1457A2762213j396045J077740k80644O08028m25939p95636k26554k14009Q64150
1448A1973304n77559k31668l09854k56914K153189j415643M88657J630806J022736
$$ plain form
1439 14477054 15741722 16847762 17792520 19357302 18813068 17778886 18250967 17949000 16793217
1430 16793217 15433139 13980003 12813090 11254196 10443035 10120364 8562282 9727431
1422 9727431 10224968 9105522 9711937 9651460 8573934 8629281 9900800 8391269 9340336
1413 9340336 9667505 8415343 10096391 9205950 11913660 10837842 12264845 11138759 11313108
1404 11313108 11323936 12009761 10609398 11151642 9491620 8931368 7950443 8234295 7457710
1395 7457710 7056299 6831492 6389068 5975351 5977604 4677896 4970950 4853151 5008038 4164156
1385 4164156 4767551 4387850 4670934 2912526 4963799 4822134 3675574 5416752 4366865
1376 4366865 3545270 5642561 4064114 3877554 3629391 2976053 2910089 3093256 3355370
$$ packed form
1439A4477054J264668J106040R44758J564782n44234j034182M72081l01967j155783
1430A6793217j360078j453136j166913j558894q11161l22671j558082J165149
1422I727431M97537j119446O06415o0477j077526N5347J271519j509531R49067
1413I340336L27169j252162J681048q90441K707710j075818J427003j126086J74349
1404A1313108J0828O85825j400363N42244j660022n60252r80925K83852p76585
1395G457710m01411k24807m42424m13717K253j299708K93054j17799J54887q43882
1385D164156O03395l79701K83084j758408K051273j41665j146560J741178j049887
1376D366865q21595K097291j578447j86560k48163o53338o5964J83167K62114
$$ plain form
1367 3355370 3856184 3195736 2973473 3100376 3786710 3771820 3573818 3151438 3619402 4457985
1357 4457985 3640498 3924788 3030484 3673584 4747105 3196960 1855879 4379956 4545119
1348 4545119 3646182 2786278 3299719 4403762 3215655 2405848 2989907 4436628 3635856
1339 3635856 3358032 2530714 3500947 3847186 4010082 3584359 3702799 3358004 2588498 2936486
1329 2936486 2931481 3814583 3619628 2781313 2655571 2808515 2852655 2551903 2513065 2839288
1319 2839288 3108409 2982266 2330451 3454855 2571531 4071035 3067510 3507177 3837785
1310 3837785 2133878 2143673 1536870 3273617 2037045 2724957 2847919 1781029 2570029
1301 2570029 2603189 2613932 2663892 2055537 2701094 2009592 2138341 2055532 2391811 2048791
$$ packed form
1367C355370N00814o60448k22263J26903O86334j4890j98002m22380M67964Q38583
1357D457985q17487K84290q94304O43100J073521j550145j341081K524077J65163
1348D545119q98937q59904N13441J104043j188107q09807N84059J446721q00772
1339C635856k77824q27318R70233L46239J62896m25723J18440l44795p69506L47988
1329B936486n005Q83102j94955q38315j25742J52944M4140l00752l8838L26223
1319B839288K69121j26143o51815J124404q83324J499504j003525M39667L30608
1310C837785j703907R795o06803J736747j236572O87912J22962j066890P89000
1301B570029L3160J0743M9960o08355O45557o91502J28749q2809L36279l43020
$$ plain form
1291 2048791 2803101 2147817 2429547 2989018 1784372 1447312 2081032 3443111 2216366
1282 2216366 2453941 1888445 1513946 884546 2320862 1252894 2217672 438888 2097894
1273 2097894 1906913 2042758 552613 1537762 2968695 1189541 895398 1704139 1029786
1264 1029786 1100323 1524259 2216518 772129 1706297 1773655 1226236 1408712 1015616 1529755
1254 1529755 1116129 1363382 1894424 1535968 1441467 1666611 631196 893730 1622312 544310
1243 1711729 1642060 2199154 2413533 1530425 1561408 2423959 2216237 1418243 1244783 689416
1233 689416 2121283 1301793 1016282 1723372 2058605 799185 347641 872636 657828 1899780
1223 1899780 1461059 1298805 998681 1613549 771426 1013399 1120847 1218350 1245782 2242507
$$ packed form
1291B048791P54310o55284K81730N59471j204646l37060O33720J362079j226745
1282B216366K37575n65496l74499o29400J436316j067968R64778D38888J659006
1273B097894j90981J35845E52613R85149J430933A189541k94143Q08741o74353
1264A029786P0537M23936O92259G72129R34168O7358n47419J82476l93096N14139
1254A529755m13626K47253N31042l58456r4501K25144F31196K62534P28582E44310
1243A711729o9669N57094K14379q83108L0983Q62551k07722p97994j73460n55367
1233F89416J431867q19490k85511P07090L35233G99185C47641N24995k14808J241952
1223A899780m38721j62254l00124O14868G71426K41973J07448R7503K7432R96725
$$ plain form
1213 2242507 1815252 1391745 216167 2156845 1249431 2099809 359606 1319213 1632670
1204 1632670 1262883 835956 1715899 -218002 2078523 923200 1292657 1309952 119136 949617
1194 949617 716399 1481337 -116793 781438 2437710 2350078 3047456 2412386 620318 1547951
1184 1547951 2185735 2153393 1375459 1422673 1721773 2100314 1878508 1802866 1681362 1687207
1174 1687207 2409783 1077182 1657986 1508786 1609134 2122991 1511252 1318600 1580960
1165 1580960 1272371 915651 2738457 1747302 1250703 1733563 1415985 2480793 2275026
1156 2275026 1300355 2267356 2029018 2538243 2292957 2763488 1975709 2002470 1305453 2254286
1146 2254286 2512067 2402093 1846242 2949985 2371273 3585547 3128258 3507650 4461447
$$ packed form
1213B242507m27255m23507B16167J940678r07414Q50378C59606R59607L13457
1204A632670l69787m26927Q79943b18002B078523I23200L69457J7295A19136Q30481
1194I49617k33218P64938a16793G81438J656272q7632O97378o35070F20318R27633
1184A547951O37784l2342p77934M7214K99100L78541k21806p5642j21504N845
1174A687207P22576A077182N80804j49200J00348N13857o11739j92652K62360
1165A580960l08589l56720J822806r91155m96599M82860l17578J064808k05767
1156B275026r74671R67001k38338N09225k45286M70531p87779K6761o97017R48833
1146B254286K57781j09974n55851J103743n78712J214274m57289L79392R53797
$$ plain form
1137 4461447 4631952 5158882 2627662 2184030 1274030 823858 2018764 1129510 1189537
1128 1189537 1618255 726746 251303 1347478 1485540 554292 -284688 979575 1544452
1119 1544452 1546718 739416 1200881 1315463 163296 1031746 1059299 103888 1095579 117725
1108 745611 724512 868639 -112291 339861 730017 1054306 592388 1285839 473334 1949171
1098 1949171 1214304 559819 699783 1825881 1478417 881873 1008012 -169290 210288
1088 1855637 642282 -29178 1386567 -550505 423060 843284 557247 39961 499977 817145
1078 817145 777880 1885570 -220672 601978 1301212 553768 576917 -469394 728118 -112233
1067 650952 1421438 858509 1641957 1109156 520279 666360 87072 773724 802354 2643005
$$ packed form
1137D461447J70505N26930k531220m43632r10000m50172J194906q89254O0027
1128A189537M28718G26746B51303J096175J38062E54292b84688I79575N64877
1119A544452K266G39416M61465J14582A63296Q68450K7553A03888R91691A17725
1108G45611k1099J44127a12291C39861L90156L24289m61918O93451D73334J475837
1098A949171p34867E59819J39964J126098l47464n96544J26139a69290B10288
1088A855637F42282b9178A386567e50505D23060M20224k86037C9961M60016L17168
1078H17145l9265J107690b20672F01978O99234E53768K3149d69394G28118a12233
1067F50952P70486n62929P83448n32801E20279J46081H7072O86652K8630J840651
$$ plain form
1057 2643005 1996430 1384759 2104079 1008755 95292 677395 1031872 1642857 1284767 -99166
1046 1325088 675484 1194829 907136 1162815 782725 1315454 2093378 1518730 490877 903367
1036 903367 1107592 80901 616640 632502 746027 748300 809080 1101884 1116044 2006095 1809236
1025 1809236 1422024 2884646 2784881 3679292 3118716 4439131 3964054 4029010 3983996 5084993
1015 5084993 4801483 5635622 5744114 6202435 7875143 9358633 9692161 9713855 9259036
1006 9259036 9203597 7107700 8600921 9166716 10154428 11974564 13992587 13624947 17629088
997 17629088 20405898 21857826 28448218 40035493 61888600 117646178 182664166 160030088
989 160030088 109782034 60041996 34432065 21552354 15259112 10814576 6517500 6648945
$$ packed form
1057B643005o46575o11671P19320A008755I5292N82103L54477O10985l58090i9166
1046A325088o49604N19345k87693K55679l80090N32729P77924n74648D90877M12490
1036I03367K04225H0901N35739J5862J13525K273O0780K92804J4160Q90051j96859
1025A809236l87212J462622r9765Q94411n60576J320415m75077O4956m5014J100997
1015E084993k83510Q34139J08492M58321J672708J483490L33528K1694m54819
1006I259036n5439k095897J493221N65795R87712J820136K018023l67640M004141
997A7629088K776810J451928O590392J1587275K1853107N5757578O5017988k2634078
989A60030088n0248054m9740038k5609931j2879711o293242m444536m297076J31445
$$ plain form
981 6648945 5189112 3982953 2633150 4365597 4617622 4739098 4211194 5439247 7540217
972 7540217 5855171 5560685 4407499 3191449 2335824 2655469 2424680 856237 2155214
963 2155214 2333453 2628674 2014534 1356514 977404 1641990 2483190 865708 600663 1203416
953 1203416 1649681 1165056 1844484 964491 1172162 937950 701356 658255 1621989 1748232
943 1748232 798059 915975 1341207 1779227 1575631 582188 1691964 67533 1190883 -203315
932 1276551 557332 786441 458145 -887804 1435052 1915475 927286 707573 968370 1117051
922 1117051 762304 1211055 1165124 98829 213444 442599 223825 -194836 1643457 819212
911 70646 327294 -274302 472602 22566 1114528 1464560 331317 1041128 2046257 1109685
$$ packed form
981F648945j459833j206159j349803J732447K52025J21476n27904J228053K100970
972G540217j685046k94486j153186j216050q55625L19645k30789H56237J298977
963B155214J78239K95221o14140o58020l79110O64586Q41200H65708k65045O02753
953A203416M46265m84625O79428q79993K07671k34212k36594m3101R63734J26243
943A748232G98059J17916M25232M38020k03596E82188J109776F7533J123350b03315
932A276551E57332K29109l28296h87804A435052M80423I27286k19713K60797J48681
922A117051l54747M48751m5931I8829J14615K29155k18774a94836A643457H19212
911G0646K56648b74302D72602B2566J091962L50032C31317P09811J005129r36572
$$ plain form
901 1109685 153217 1004154 27492 1543512 651327 621455 592610 1015136 1616836 222523
890 134983 1183820 505197 2798414 1239821 877213 1676192 1584407 862114 711643 1861859
880 1861859 55217 1062847 1315589 609609 1838796 2022779 2443823 1793641 1814619 1144836
870 1144836 1324880 1571007 2316125 1046359 550947 2182273 2243344 1492563 1111212 2489534
860 2489534 1821345 1283810 1412999 2477417 2896881 2600108 2072680 2890713 3113493 856655
849 2495197 2728253 1781300 2129786 3672693 3370867 2707736 3988601 2401711 1498375
840 1498375 935359 1039529 576733 642883 1114058 260325 966506 1019284 1342796 558186
829 -144069 1444815 384191 1355536 776922 1175158 -258529 2511803 793288 833075 182726
$$ packed form
901A109685A53217Q50937B7492J516020F51327k9872k8845M22526O01700B22523
890A34983J048837E05197K293217A239821l62608P98979r1785p22293j50471J150216
880A861859E5217J007630K52742F09609J229187J83983M21044o50182K0978o69783
870A144836J80044K46127P45118A046359m95412J631326O1071p50781l81351J378322
860B489534o68189n37535J29189J064418M19464k96773n27428Q18033K22780H56655
849B495197K33056r46953L48486J542907l01826o63131J280865j586890r03336
840A498375n63016J04170m62796O6150M71175B60325P06181N2778L23512E58186
829a44069A444815C84191R71345n78614L98236b58529B511803G93288L9787A82726
$$ plain form
818 153810 549847 -13844 587602 768277 321393 803366 -1444896 645397 381772 32157
807 852359 -1199020 816564 -357208 728687 -61161 -206661 948612 1164561 -350474 418472
796 112686 670744 521308 173689 183718 203121 626369 570371 1715026 804172 1289745
786 1289745 -1514345 -189733 513437 1024600 1399056 -390402 -14588 -161541 487730 236998
775 1060401 996667 935050 1435205 -198165 -32603 42927 416490 454976 928558 -436209 995002
763 1256922 2651027 989213 -84108 795405 1543092 1258017 535514 141759 847380 292810
752 695256 1306818 -167281 -844240 321277 151988 908632 -293033 646241 452570 -509402
741 409131 -1070910 32980 -817369 908038 -443506 1828303 -296387 1117138 136299 1904629
$$ packed form
818A53810L96037a3844E87602J80675C21393M81973a444896F45397k63625C2157
807H52359a199020H16564c57208G28687f1161j45500I48612K15949c50474D18472
796A12686N58058j49436A73689J0029J9403M23248n5998J144655H04172M85573
786A289745a514345a89733E13437N11163L74456c90402a4588j46953D87730B36998
775A060401o3734o1617N00155a98165c2603D2927L73563L8486M73582d36209I95002
763A256922J394105I89213h4108G95405P47687k85075E35514A41759P05621B92810
752F95256O11562a67281o76959C21277A51988P56644b93033F46241j93671e09402
741D09131a070910C2980h17369I08038d43506A828303b96387A117138A36299J768330
$$ plain form
731 1904629 1225243 601612 -219302 784295 1040659 67491 673770 707833 -283031 960889
720 1885542 1904018 619449 57881 703234 1329580 722097 1728343 850885 985542 683603
710 683603 109953 1224841 1472795 1228365 356840 813412 646855 830429 1082905 723873
700 723873 710955 1276634 1000840 1375593 763213 408369 1214400 431277 223406 1282526
690 1282526 864504 546339 552817 1357387 1437149 622303 56174 -182614 428541 2291473
680 2291473 1652510 838417 483576 1519756 1018787 1058849 657989 -301899 -50009 934832
669 -557070 1377577 1058414 830248 407728 1299526 32338 1461482 176828 1194338 598047
659 598047 1249306 915301 681661 488426 -559951 250839 235009 -49157 366040 -490418
$$ packed form
731A904629o79386F01612b19302G84295K56364F7491O06279L4063b83031I60889
720A885542J8476F19449E7881O45353O26346o07483J006246H50885J34657l01939
710F83603A09953J114888K47954k44430C56840M56572j66557J83574K52476l59032
700G23873j2918N65679k75794L74753o12380l54844Q06031D31277k07871J059120
690A282526m18022l18165O478Q04570P9762F22303E6174a82614D28541J862932
680B291473o38963q14093l54841J036180n00969M0062m00860c01899e0009I34832
669e57070A377577l19163k28166D07728Q91798C2338J429144A76828J017510n96291
659E98047O51259l34005k33640j93235e59951B50839j5830d9157C66040d90418
$$ plain form
648 1374395 -75475 771646 463541 392847 -2187 -783781 -272003 -501906 -700200 -351733
638 -351733 -1102815 -127607 114633 509428 515150 -333102 -85697 1120547 925220 179238
627 770456 -264152 823648 284059 -519033 432252 -15387 -998068 886295 243087 261182
617 261182 101094 70028 1153632 90766 62980 452978 383441 703605 579491 935287
607 935287 1209986 -434727 1600232 790124 -760126 -384206 1369335 -694751 846017 470269
597 470269 14482 802291 341679 -280897 756005 434362 -87179 455364 712706 30434
586 296137 -268791 310572 -329026 -322312 478909 -412447 324310 507214 454269 1058486
576 1058486 28761 1965796 1301039 1065328 92085 253886 724542 1102064 162089 1026520
$$ packed form
648A374395g5475G71646l08105p0694b187p81594b72003k29903j98294L48467
638c51733p51082a27607A14633L94795N722c33102h5697A120547j95327A79238
627G70456b64152H23648B84059e19033D32252a5387r82681H86295B43087J8095
617B61182A01094l1066J083604I0766k7786L89998o9537L20164j24114L55796
607I35287K74699d34727A600232G90124g60126L75920A369335f94751H46017l75748
597D70269A4482P87809C41679b80897G56005l21643h7179D55364K57342C0434
586B96137b68791C10572c29026O714D78909d12447C24310J82904n2945O04217
576A058486B8761J937035o64757k35711I2085J61801M70656L77522A62089Q64431
$$ plain form
566 1026520 1109227 -6189 -676268 227247 -405390 17692 -379803 -423059 52842 93650 145465
555 145465 -474491 53043 -101803 52704 -349810 1025458 531916 1288375 486349 -385616
544 317419 -462504 -1361822 -275735 -197991 601448 370325 1205159 -218753 -190464 475718
533 -262204 -639804 167580 348608 -572980 -1080421 58146 446608 136902 187397 175152
523 175152 -166988 -644814 -135613 -524803 -514416 600035 163664 -495373 33630 55611
513 55611 -65208 -332360 788670 314179 398439 550557 180834 1124158 704459 -129883
502 168208 63181 1138611 779501 -566126 263650 423006 -1266401 -132058 542148 582204
492 582204 -138590 -749740 1067511 98970 -25773 -715846 -192105 -668377 -113324 -320099
$$ packed form
566A026520Q2707f189o70079B27247d05390A7692c79803m3256E2842M0808N1815
555A45465d74491E3043a01803E2704c49810A025458m93542P56459D86349c85616
544C17419d62504q99318b75735P7744F01448k31123Q34834b18753K8289D75718
533b62204l77600A67580J81028e72980n07441E8146L88462A36902N0495j2245
523A75152a66988m77826a35613l89190J0387F00035A63664d95373C3630K1981
513E5611f5208k67152G88670C14179Q4260J52118A80834R43324m19699a29883
502A68208F3181J075430l59110e66126B63650J59356a266401a32058E42148M0056
492E82204a38590o11150A067511I8970b5773o90073a92105m76272a13324k06775
$$ plain form
482 -320099 333762 -1091208 397305 -213886 310136 -812636 300449 563733 842448 -200369
471 -545115 313669 55754 -464968 428523 477832 339013 -275969 770156 -40996 510963
460 329156 265164 287121 -145079 -734319 645320 219880 -853771 -529757 1603547 170939
449 -613037 131386 394907 825807 -1190319 147391 -42874 112999 -486195 -993623 446135
438 -28810 86067 42448 -389552 338500 688606 -1786873 217311 -840776 104781 280384
428 280384 -696546 553567 333003 234486 -655179 -618640 -588985 439910 -340731 204092
417 147518 -22525 652522 486919 -376876 -386465 -1136796 783353 448777 228655 -705108
406 -1080510 260320 1006892 536394 -296122 -284229 26737 -101274 -625544 950026 629289
$$ packed form
482c20099C33762a091208C97305b13886C10136h12636C00449K63284K78715b00369
471e45115C13669E5754d64968D28523M9309j38819b75969G70156d0996E10963
460C29156o3992K1957a45079n89240F45320B19880h53771L24014A603547A70939
449f13037A31386K63521M30900a190319A47391d2874A12999d86195n07428D46135
438b8810H6067D2448c89552C38500L50106a786873B17311h40776A04781J75603
428B80384f96546E53567k20564r8517f55179L6539K9655D39910c40731B04092
417A47518b2525F52522j65603c76876r589p50331G83353l34576k20122g05108
406a080510B60320P46572m70498b96122J1893B6737a01274n24270I50026l20737
$$ plain form
396 629289 578891 235008 -267582 -232855 321394 810383 -14162 -274638 351690 -1279345
385 168878 192081 309559 -347497 -890990 -749067 385695 -734401 75258 310337 -510217
374 102615 93793 -181699 58522 -63376 281096 1112147 250663 -151833 196975 -1734247
363 -216914 827331 349315 1265564 -514927 -1139656 -57091 -409496 670173 -292264 282142
352 208646 401364 -571028 105711 585706 216974 419877 88909 405159 -41768 636902
341 -495009 -706407 -319563 14072 900568 -247995 -607872 1172530 -242506 492678 -843359
330 -739378 -189700 321235 -1307636 439849 -346598 276054 -707516 -301718 960445 -84564
319 20485 571547 -449932 -201559 -1046646 -788080 -733676 477625 -364789 274293 226279
$$ packed form
396F29289n0398B35008b67582L4727C21394M88989a4162k60476C51690a279345
385A68878K3203J17478c47497n43493J41923C85695g34401G5258K35079e10217
374A02615q822a81699E8522f3376B81096Q31051B50663a51833A96975a734247
363b16914H27331C49315R16249e14927o24729e7091l52405F70173b92264B82142
352B08646J92718e71028A05711M79995B16974K02903H8909L16250d1768F36902
341d95009k11398c19563A4072Q86496b47995l59877A172530b42506D92678h43359
330g39378a89700C21235a307636D39849c46598B76054g07516c01718I60445h4564
319B0485N51062d49932b01559q45087K58566N4404D77625c64789B74293m8014
$$ plain form
309 226279 334364 618133 659847 -433189 265234 -358565 -50963 1080200 710705 -68423
298 -938320 -581996 -302084 53889 -684999 203272 1415708 -501920 653323 -1115982 -47110
287 -108912 -119819 1278879 972516 -353418 -665852 -541791 -18159 -525250 333053 309874
277 309874 273566 1184505 508589 1079417 -289865 -77665 -433964 503366 210890 -74893
266 -370665 718249 -1412424 170625 -223947 693943 716359 617807 512804 191672 63563
255 -792787 -120207 -327747 -82080 -344333 1379483 -611640 -279961 -1170262 -344866 418402
244 -700076 -909224 671165 622188 -798420 -425501 -58192 397538 -414287 -399561 171370
233 270899 -258445 381070 -956996 -386193 -740103 -408510 1027513 476165 -115001 -480934
$$ packed form
309B26279J08085K83769M1714d33189B65234c58565e0963A080200l69495f8423
298i38320L56324K79912E3889f84999B03272J212436e01920F53323a115982d7110
287a08912j0907A278879l06363c53418l12434J24061a8159n07091C33053k3179
277C09874l6308R10939E08589N70828b89865g7665l56299E03366B10890g4893
266c70665G18249a412424A70625b23947F93943K2416r8552j05003A91672F3563
255g92787a20207k07540h2080k62253A379483f11640b79961q90301c44866D18402
244g00076k09148F71165m8977g98420L72919e8192C97538d14287J4726A71370
233B70899b58445C81070i56996c86193l53910L31593A027513D76165a15001l65933
$$ plain form
223 -480934 423379 -90878 -700497 -1539676 -245797 -66868 156504 174257 441691 665671
213 665671 -1086526 -446183 773052 162567 607367 -201093 489166 1207623 71051 141972
203 141972 -239479 907351 801948 373506 8429 54671 -314754 -392451 83418 1141519 1057331
192 1057331 154058 612112 -26136 -99874 143323 -314784 -364218 853908 -678795 -897338
182 -897338 717224 -146832 129827 -568338 -231623 1018182 -210682 401689 733103 626950
172 626950 458492 99896 -56915 516451 356963 242428 736591 -632359 -810781 -414767
162 -414767 530970 -306919 -1012068 85868 -471802 -242642 -349221 -199249 208049 -675258
151 -210679 -491694 -101470 257099 15679 688494 1181000 -836795 -605779 889931 106767
$$ packed form
223d80934D23379i0878o09619q39179b45797f6868A56504J7753K67434K23980
213F65671a086526d46183G73052A62567M44800b01093D89166P18457G1051P0921
203A41972b39479I07351j05403C73506H429M6242c14754p7697H3418J058101q4188
192A057331A54058M58054b6136p3738A43323c14784m9434H53908f78795k18543
182h97338G17224a46832A29827e68338b31623A018182b10682D01689L31414j06153
172F26950j68458I9896e6915E16451j59488j14535M94163f32359j78422L96014
162d14767E30970c06919p05149H5868d71802K29160j06579J49972B08049f75258
151b10679k81015a01470B57099A5679O72815M92506h36795K31016H89931A06767
$$ plain form
140 -474941 -442321 473433 51817 935991 -455985 -483651 280736 862373 -1045246 -302123
129 -1062959 -681703 -493508 135231 -432706 250224 -1388400 1079986 405255 471826 1297269
119 1297269 754207 -389581 389861 -376821 -183065 -768179 176747 -627233 416547 -1368028
108 26586 -47425 -383864 1634013 474441 -184321 -718440 122766 -74319 724703 1239424
98 1239424 759985 438544 -692688 111094 464746 -580156 -490565 -567042 512655 204310
87 616673 543763 -321938 -1606681 -55097 1018673 802144 -432841 -213680 -857535 1104194
76 888314 -643560 -747006 608101 -342938 -775356 293714 1344478 938250 34857 444752
66 444752 387147 -633415 -624497 -1349431 -168202 381136 -987267 -353082 -652742 582169 544266
$$ packed form
140d74941L2620D73433E1817Q84174d55985k7666B80736N81637a045246c02123
129a062959L81256J88195A35231d32706B50224a388400A079986D05255O6571Q25443
119A297269n43062c89581C89861c76821a83065n85114A76747f27233D16547a368028
108B6586d7425l36439A634013D74441a84321n34119A22766g4319G24703N14721
98A239424m79439l21441f92688A11094L53652e80156Q9591p6477E12655B04310
87F16673p2910c21938j284743e5097A018673k16529d32841b13680o43855A104194
76H88314f43560j03446F08101c42938m32418B93714J050764m06228C4857M09895
66D44752n7605f33415Q918p24934a68202C81136i87267c53082k99660E82169l7903
$$ plain form
55 544266 1708749 -340062 877511 -294495 -943587 170966 -224058 -711305 -1464412 -586835
44 -49661 -226300 -741360 370455 -535145 61955 -313903 -4542 -191150 -908626 -654614 -192627
32 -1160736 14885 304746 -613379 -272685 -1062656 225320 -353487 722919 144982 -107031
21 -675994 81273 88906 235130 198946 -304361 565562 -216343 -1221469 609683 177163 374402
10 374402 -1243152 112756 -241011 835320 -319403 -927668 -690784 776752 323596 1066932
0 1066932
$$ packed form
55E44266J164483c40062H77511b94495o49092A70966b24058m87247p53107e86835
44d9661j76639n15060C70455e35145F1955c13903d542j86608p17476K54012a92627
32a160736A4885K89861f13379b72685p89971B25320c53487G22919A44982a07031
21f75994H1273P633J46224l6184c04361E65562b16343j005126F09683A77163J97239
10C74402a243152A12756b41011H35320c19403o08265K36884G76752C23596P43336
0A066932
##END=
