##TITLE=1207
##JCAMPDX= 6.0         $$ Bruker NMR JCAMP-DX V2.0
##DATA TYPE= NMR SPECTRUM
##DATA CLASS= XYDATA
##ORIGIN= NUTS EXPORT
##OWNER= Administrator
$$ 1.72 TOPSPIN		Version 2.1
$$ 2016-02-23 12:17:43.199 -0800  Administrator@X
$$ Compression mode = diff/dup
##.OBSERVE FREQUENCY= 90.275459
##.ACQUISITION MODE= SIMULTANEOUS (DQD)
##.ACQUISITION SCHEME= undefined
##.AVERAGES= 16
##.DIGITISER RES= 22
##SPECTROMETER/DATA SYSTEM= 
##.PULSE SEQUENCE= zg30
##.SOLVENT NAME= None
##.SHIFT REFERENCE= INTERNAL, None, 1, 14.46942
##AUDIT TRAIL= $$ (NUMBER, WHEN, WHO, WHERE, PROCESS, VERSION, WHAT)
$$ ##TITLE= Audit trail, TOPSPIN		Version 2.1
$$ ##JCAMPDX= 5.01
$$ ##ORIGIN= Bruker BioSpin GmbH
$$ ##OWNER= Administrator
$$ $$ E:/data/jwist/nmr/1207/1/pdata/1/auditp.txt
$$ ##AUDIT TRAIL=  $$ (NUMBER, WHEN, WHO, WHERE, PROCESS, VERSION, WHAT)
(   1,<2016-02-23 08:11:33.105 -0800>,<Administrator>,<X>,<jcamp>,<TOPSPIN 2.1>,
      <fromjdx created from
       E:\data\jwist\nmr\uniandes\1207
       data hash MD5: 8K
       47 6B 57 B7 58 C4 DB CE 4F 9F E3 5F 53 F5 6F 64>)
$$ ##END=
$$ 
$$ $$ hash MD5
$$ $$ 4C 09 F5 E2 3D 17 EA E0 B5 E0 DA 75 E4 6A B3 A3
##$RELAX= 
$$ Bruker specific parameters
$$ --------------------------
##$DU= <E:>
##$EXPNO= 1
##$NAME= <1207>
##$PROCNO= 1
##$TYPE= <nmr>
##$USER= <jwist>
##$ACQT0= 0
##$AMP= (0..31)
100 100 100 100 100 100 100 100 100 100 100 100 100 100 100 100 100 100
100 100 100 100 100 100 100 100 100 100 100 100 100 100
##$ANAVPT= 1
##$AQSEQ= 0
##$AQ_mod= 3
##$AUNM= <au_zg>
##$AUTOPOS= <>
##$BF1= 90.275459
##$BF2= 400.02
##$BF3= 400.02
##$BF4= 400.02
##$BF5= 400.02
##$BF6= 400.02
##$BF7= 400.02
##$BF8= 400.02
##$BYTORDA= 0
##$CFDGTYP= 0
##$CFRGTYP= 0
##$CHEMSTR= <none>
##$CNST= (0..63)
1 1 145 1 1 1 1 1 1 1 1 1 1 1 1 1 1 1 1 1 1 1 1 1 1 1 1 1 1 1 1 1 1 1 1
1 1 1 1 1 1 1 1 1 1 1 1 1 1 1 1 1 1 1 1 1 1 1 1 1 1 1 1 1
##$CPDPRG= <>
##$CPDPRG1= <>
##$CPDPRG2= <>
##$CPDPRG3= <>
##$CPDPRG4= <mlev>
##$CPDPRG5= <mlev>
##$CPDPRG6= <mlev>
##$CPDPRG7= <mlev>
##$CPDPRG8= <mlev>
##$CPDPRGB= <>
##$CPDPRGT= <>
##$D= (0..63)
0 1 0 0 0 0 0 0 0 0 0 0 0 0 0 0 0 0 0 0 0 0 0 0 0 0 0 0 0 0 0 0 0 0 0 0
0 0 0 0 0 0 0 0 0 0 0 0 0 0 0 0 0 0 0 0 0 0 0 0 0 0 0 0
##$DATE= 0
##$DBL= (0..7)
120 120 120 120 120 120 120 120
##$DBP= (0..7)
150 150 150 150 150 150 150 150
##$DBP07= 0
##$DBPNAM0= <>
##$DBPNAM1= <>
##$DBPNAM2= <>
##$DBPNAM3= <>
##$DBPNAM4= <>
##$DBPNAM5= <>
##$DBPNAM6= <>
##$DBPNAM7= <>
##$DBPOAL= (0..7)
0.5 0.5 0.5 0.5 0.5 0.5 0.5 0.5
##$DBPOFFS= (0..7)
0 0 0 0 0 0 0 0
##$DE= 6.5
##$DECBNUC= <off>
##$DECIM= 2432
##$DECNUC= <off>
##$DECSTAT= 4
##$DIGMOD= 1
##$DIGTYP= 12
##$DL= (0..7)
0 120 120 120 120 120 120 120
##$DP= (0..7)
150 150 150 150 150 150 150 150
##$DP07= 0
##$DPNAME0= <>
##$DPNAME1= <>
##$DPNAME2= <>
##$DPNAME3= <>
##$DPNAME4= <>
##$DPNAME5= <>
##$DPNAME6= <>
##$DPNAME7= <>
##$DPOAL= (0..7)
0.5 0.5 0.5 0.5 0.5 0.5 0.5 0.5
##$DPOFFS= (0..7)
0 0 0 0 0 0 0 0
##$DQDMODE= 0
##$DR= 22
##$DS= 2
##$DSLIST= <SSSSSSSSSSSSSSS>
$$ [...]
##$SPOFFS= (0..31)
0 0 0 0 0 0 0 0 0 0 0 0 0 0 0 0 0 0 0 0 0 0 0 0 0 0 0 0 0 0 0 0
##$SUBNAM0= <"">
##$SUBNAM1= <"">
##$SUBNAM2= <"">
##$SUBNAM3= <"">
##$SUBNAM4= <"">
##$SUBNAM5= <"">
##$SUBNAM6= <"">
##$SUBNAM7= <"">
##$SUBNAM8= <"">
##$SUBNAM9= <"">
##$SW= 20.5580556627758
##$SWIBOX= (0..15)
0 0 3 4 0 0 0 0 0 0 0 0 0 0 0 0
##$SW_h= 8223.68421052631
##$SWfinal= 0
##$TD= 65536
##$TD0= 1
##$TE= 300
##$TE2= 300
##$TE3= 300
##$TEG= 300
##$TL= (0..7)
0 120 120 120 120 120 120 120
##$TP= (0..7)
150 150 150 150 150 150 150 150
##$TP07= 0
##$TPNAME0= <>
##$TPNAME1= <>
##$TPNAME2= <>
##$TPNAME3= <>
##$TPNAME4= <>
##$TPNAME5= <>
##$TPNAME6= <>
##$TPNAME7= <>
##$TPOAL= (0..7)
0.5 0.5 0.5 0.5 0.5 0.5 0.5 0.5
##$TPOFFS= (0..7)
0 0 0 0 0 0 0 0
##$TUNHIN= 0
##$TUNHOUT= 0
##$TUNXOUT= 0
##$USERA1= <user>
##$USERA2= <user>
##$USERA3= <user>
##$USERA4= <user>
##$USERA5= <user>
##$V9= 5
##$VALIST= <valist>
##$VCLIST= <CCCCCCCCCCCCCCC>
##$VD= 0
##$VDLIST= <DDDDDDDDDDDDDDD>
##$VPLIST= <PPPPPPPPPPPPPPP>
##$VTLIST= <TTTTTTTTTTTTTTT>
##$WBST= 1024
##$WBSW= 4
##$XGAIN= (0..3)
0 0 0 0
##$XL= 0
##$YL= 0
##$YMAX_a= 2047443456
##$YMIN_a= -3924434.944
##$ZGOPTNS= <>
##$ZL1= 120
##$ZL2= 120
##$ZL3= 120
##$ZL4= 120
##$ABSF1= 10
##$ABSF2= 0
##$ABSG= 5
##$ABSL= 3
##$ALPHA= 0
##$AQORDER= 0
##$ASSFAC= 0
##$ASSFACI= 0
##$ASSFACX= 0
##$ASSWID= 0
##$AUNMP= <proc_1d>
##$AXLEFT= 0
##$AXNAME= <>
##$AXNUC= <off>
##$AXRIGHT= 0
##$AXTYPE= 0
##$AXUNIT= <>
##$AZFE= 0.1
##$AZFW= 0.1
##$BCFW= 1
##$BC_mod= 2
##$BYTORDP= 0
##$COROFFS= 0
##$CY= 15
##$DATMOD= 1
##$DC= 2
##$DFILT= <>
##$DTYPP= 0
##$F1P= 0
##$F2P= 0
##$FCOR= 0.5
##$FTSIZE= 0
##$FT_mod= 4
##$GAMMA= 1
##$GB= 0
##$INTBC= 1
##$INTSCL= 1
##$ISEN= 128
##$LB= 0.3
##$LEV0= 0
##$LPBIN= 0
##$MAXI= 10000
##$MC2= 0
##$MEAN= 0
##$ME_mod= 0
##$MI= 0
##$NCOEF= 0
##$NC_proc= -10
##$NLEV= 6
##$NOISF1= 0
##$NOISF2= 0
##$NSP= 1
##$NTH_PI= 0
##$NZP= 0
##$OFFSET= 14.46942
##$PC= 1
##$PHC0= 0
##$PHC1= 0
##$PH_mod= 0
##$PKNL= yes
##$PPARMOD= 0
##$PPDIAG= 0
##$PPIPTYP= 0
##$PPMPNUM= 2147483647
##$PPRESOL= 1
##$PSCAL= 4
##$PSIGN= 0
##$PYNMP= <proc.py>
##$REVERSE= no
##$SF= 90.2741527855874
##$SI= 8192
##$SIGF1= 0
##$SIGF2= 0
##$SINO= 400
##$SIOLD= 32768
##$SPECTYP= <>
##$SREGLST= <1H.CDCl3>
##$SSB= 0
##$STSI= 0
##$STSR= 0
##$SW_p= 1497.18866228788
##$SYMM= 0
##$S_DEV= 0
##$TDeff= 0
##$TDoff= 0
##$TI= <>
##$TILT= no
##$TM1= 0
##$TM2= 0
##$TOPLEV= 0
##$USERP1= <user>
##$USERP2= <user>
##$USERP3= <user>
##$USERP4= <user>
##$USERP5= <user>
##$WDW= 1
##$XDIM= 8192
##$YMAX_p= 2047443358
##$YMIN_p= -3924433
##$CURPLOT= <PDFCreator>
##$CURPRIN= <$PDFCreator>
##$DFORMAT= <normdp>
##$LAYOUT= <+/1D_H.xwp>
##$LFORMAT= <normlp>
##$PFORMAT= <normpl>
##$SURQMSG= 1
$$ End of Bruker specific parameters
$$ ---------------------------------
##XUNITS= HZ
##YUNITS= ARBITRARY UNITS
##XFACTOR= 0.182762287876938
##YFACTOR= 1
##DELTAX= -0.182762287876938
##NPOINTS= 8192
##FIRSTX= 1497.0059
##FIRSTY= -1271019
##LASTX= 0
##MAXY= 2047443358
##MINY= -3924433
##XYDATA= (X++(Y..Y))
8191a271019G54112d65531A300872d50105A328595m40038b08031I91814h04063
8181a261977G1777g70574b04674j87297E23329d45593H5223N92209J30919J155585
8171A963936a327526F33054c64819k39942K04801j479458D9974a33479l54264
8162d87743n03279j45508d08377M420F66226a070461b35350A1111d15313k87801
8152g03114I02549a308809e53764k255147J214911b66380j118250G55984A87388
8142A84536a525636E54334j67361h26680D8704c45566A913061b270849A185131
8132A990376D61471c49227F05529h2894j639520c41288A270389B82173J43383
8123D25556c72939B16384k9881a032968A014829l76822a48008A30195K275413
$$ y = [-1271019, 754112, -465531, 1300872, -450105, 1328595, 888557, -208031, 991814, -804063, -1261977, 71777, -770574, -204674, -391971, 523329, -445593, 85223, 677432, 808351, 1963936, -1327526, 633054, -364819, -604761, -399960, -1879418, 49974, -133479, -487743, -991022, -1136530, -408377, -403957, 666226, -1070461, -235350, 11111, -415313, -703114, 902549, -1308809, -553764, -2808911, -1594000, -266380, -1384630, 755984, 187388, 184536, -1525636, 554334, 386973, -826680, 48704, -345566, 1913061, -2270849, 1185131, 1990376, 461471, -349227, 605529, -82894, -1722414, -341288, 1270389, 282173, 425556, -372939, 216384, 186503, -1032968, 1014829, 638007, -148008, 130195, 2405608]
8114B405608A35137P87340b14837j743055A722535e72467K10789H34082A71870
8104A075094m43003c01139A555819g04384k171368a078918A326146h66593C57587
8094a270501c28927n02828A15023L53789e85243I59426l17884a234380j79259
8085a413639e48572J64457A346830n85399d63116B238078F28987J66722l89561
8076D06148g46542m60109i7111j261197F49535k34335a971540O74115A391088
8066C43252H6464e97778A50884K17827i51822B361706a840708h38542A717799
8056e27919A766263p74928K20021b97953A05106R06217e55241A364186g42532
8046d36318j951066R67572B22206A650c04744C37599j26694a043675A57052J435931
$$ y = [2405608, 135137, 922477, -214837, -1957892, 1722535, -572467, -361678, 834082, 171870, 1075094, 632091, -301139, 1555819, -704384, -2875752, -1078918, 1326146, -866593, 357587, -1270501, -328927, -831755, 115023, 468812, -585243, 959426, 641542, -1234380, -1413639, -548572, -384115, 1346830, 761431, -463116, 2238078, 628987, 795709, 406148, -746542, -1206651, -97111, -1358308, 649535, 415200, -1971540, -1297425, 1391088, 343252, 86464, -597778, 150884, 368711, -951822, 2361706, -1840708, -838542, 1717799, -527919, 1766263, 991335, 1211356, -297953, 105106, 1011323, -555241, 1364186, -742532, -436318, -2387384, -1419812, 222206, 1650, -304744, 337599, 210905, -1043675, 157052, 1592983]
8036A592983B88306k8670a315616D91725O19938B95168P87722a429289H85792
8026g58035C58462J026856B56716K10950a009286a72479A610400N63436E28247
8016d93561A654223a003661a3667A043147m02988A07318f09918r44500C11207
8006H03061O83603a191673j74097d7056C43793i60310c9398p24132A710674B53981
7995a36323k37787j636726G69785a053995b19239A140386n29289m3906B70905
7985d7197q49562D98248d1136A328901D31930J739785h67846B362454c716A45556
7974f15716j837258F60982K16091C92605N5559l9705h17671B41611Q1164J282480
7964A605255b463343c21087n77127E12001b54661H95575a77100G01461L64268
$$ y = [1592983, 288306, 259636, -1315616, 491725, 1111663, 295168, 1082890, -1429289, 885792, -758035, 358462, 1385318, 256716, 467666, -1009286, -172479, 1610400, 2173836, 528247, -493561, 1654223, -1003661, -13667, 1043147, 640159, 107318, -609918, -1554418, 311207, 803061, 1486664, -1191673, -1365770, -47056, 343793, -960310, -39398, -763530, 1710674, 253981, -136323, -374110, -2010836, 769785, -1053995, -219239, 1140386, 611097, 567191, 270905, -47197, -896759, 498248, -41136, 1328901, 431930, 2171715, -867846, 2362454, -3716, 145556, -615716, -2452974, 660982, 877073, 392605, 448164, 408459, -817671, 241611, 322775, 1605255, -2463343, -321087, -898214, 512001, -254661, 895575, -177100, 701461, 1065729]
7955A065729R37367I91096f25968l28763B52398a497373A134275b486929i70509
7945a664898M60228E06868N93354a256387A10247a60523C39986e4736o84412k82691
7935a021839b46325B25015R14707d45124k03645K71606j081374e79246A587567
7925d84228E90625g0680n72747q0500E90271d31416j288513M05305D31925e66620
7914b315208A867525D13981h08094G23818j28005H1825O89789b44090j570823
7905a814913F21387J136450D39323a1885j6589A145235a590757A376276B58536
7895I08269M40514b71885m35806p43044A35830i02927H65162J0045m05623J66083
7885F35667A99595b42328A73934K65675f36533E64254P21182a74617j99240J5753
$$ y = [1065729, 2003096, 991096, -625968, -954731, 252398, -1497373, 1134275, -2486929, -970509, -1664898, -1204670, 506868, 1100222, -1256387, 110247, -160523, 339986, -54736, -739148, -1021839, -246325, 225015, 1139722, -445124, -648769, -377163, -1458537, -579246, 1587567, -484228, 590625, -70680, -643427, -723927, 590271, -431416, -1719929, -1314624, 431925, -566620, -2315208, 1867525, 413981, -808094, 723818, 595813, 81825, 771614, -244090, -1814913, 621387, 1757837, 439323, -11885, -28474, 1145235, -1590757, 1376276, 258536, 908269, 1348783, -271885, -707691, -1450735, 135830, -902927, 865162, 875207, 469584, 635667, 199595, -242328, 173934, 439609, -636533, 564254, 1285436, -174617, -373857, -358104]
7875c58104B420505A98862K49549a01317B1827L29267a08052k06934D1191K79644
7865C20835D1290O95970l20498K32762k05267b60779O9226A607749f12267G09739
7854g41669o22583J75073b52675n61462A958248A29547a094685m71114G39482
7844c28013A226394E77276M74648l41708a649476j31176L13183j48088B685178
7834B309185p52233b210955i2754m35235E72447c39458l40953A777530c34751
7824A165435c20837B23113J270133c02889C5200O69883J285807b480593a070837
7814G70705A82008M08763J20742a154273d4357q67001b05843D31400a369849F86991
7803C21961L55105E2790a286722b82352H72188h06375m10220n45270G71153a037017
$$ y = [-358104, 2420505, 198862, 448411, -101317, 21827, 351094, -108052, -314986, 41191, 320835, 41290, 737260, 416762, 649524, 444257, -260779, -191553, 1607749, -612267, 709739, -741669, -1364252, -1189179, -252675, -814137, 1958248, 129547, -1094685, -1565799, 739482, -328013, 1226394, 577276, 1051924, 710216, -1649476, -1780652, -1467469, -1615557, 2685178, 2309185, 1556952, -2210955, -92754, -527989, 572447, -339458, -680411, 1777530, -334751, 1165435, -320837, 223113, 1493246, -302889, 35200, 705083, 1990890, -2480593, -1070837, 770705, 182008, 590771, 711513, -1154273, -44357, -911358, -205843, 431400, -1369849, 686991, 321961, 677066, 52790, -1286722, -282352, 872188, -806375, -1216595, -1761865, 771153, -1037017]
7792b123640F99752L02306A81027J612376B02255J369345G45571g10800G92425
7782h94434J47956o19503N87053r69317e07828C80611A26999K90581a869687H55203
7771g98329A540493N76959a109439E5015b0888D5867a959326I83421C32881J574871
7761A907752q19882L30713Q8138C45358A72327L2651N83356a6737H08195i34446
7750C44489b71912A151101f1993j462533C17872K372402g31611j177747D69386
7740g10362m99611C20253R82186L69423M49002a571070A515281o29199J359680
7731B245762a147237K76800H38252a734757f50310E51386g26462o521I64278a195439
7720A908326o8020H04496K31265o3810e40857m46311A673929a191486c17831A05
$$ y = [-2123640, 699752, 1002058, 181027, 1793403, 202255, 1571600, 745571, -710800, 792425, -894434, -746478, -1365981, -778928, -1748245, -507828, 380611, 126999, 417580, -1869687, 855203, -798329, 1540493, 2117452, -1109439, 55015, -20888, 45867, -1959326, 983421, 332881, 1907752, 1087870, 1418583, 1506721, 345358, 172327, 204978, 788334, -16737, 808195, -934446, 344489, -271912, 1151101, -61993, -1524526, 317872, 2690274, -731611, -1909358, 469386, -710362, -1209973, 320253, 1302439, 1671862, 2120864, -1571070, 1515281, 886082, 2245762, -1147237, -870437, 838252, -1734757, -650310, 551386, -726462, -732983, 964278, -1195439, 1908326, 1840306, 804496, 1035761, 971951, -540857, -987168, 1673929, -1191486, -317831, 105]
7709A92955a315570A647971G27777A43733f32044e8029j55480B783741j380113
7700A403628n49036e61415o51398H834K346060B22658p449g02534j905180J302142
7690a305572b134o22425G42386d40142B36958A17310J728672b02998l89535C51648
7679B81337J807318A40123K433791f0510q43565H8878k7895b70363A692207A03094
7668e96911A824887f68340A105908b67334o97899A246523E26785A37451i89645
7658I21272j72313a045195F03110L1936C16139N47899R4270C42018g4226B46852
7647B720260e20576B692188b70340j60838H10947b94884H48611a345199c14206
7637A545282d21433A192893a074054F98816C12526J960922G33565l46405H1348
$$ y = [192955, -1315570, 1647971, 727777, 143733, -632044, -58029, -213509, 2783741, 1403628, 854592, -561415, -1212813, 8834, 2354894, 222658, 215209, -702534, -2607714, -1305572, -2134, -624559, 742386, -440142, 236958, 117310, 1845982, -202998, -592533, 351648, 281337, 2088655, 140123, 2573914, -60510, -904075, 88878, 60983, -270363, 1692207, 103094, -596911, 1824887, -668340, 1105908, -267334, -965233, 1246523, 526785, 137451, -989645, 921272, 748959, -1045195, 603110, 635046, 316139, 864038, 958308, 342018, -74226, 246852, 2720260, -520576, 2692188, -270340, -431178, 810947, -294884, 848611, -1345199, -314206, 1545282, -421433, 1192893, -1074054, 698816, 312526, 2273448, 733565, 387160, 81348]
7627A289869l97765f41961C89844a21432F27856i53827K1375c94221a13496A3242
7616i11925E08148f09041K80203l24976a17016C29158J515119C8707J518288E8855
7605A316969a801012d13513A082077b95191l629242A785356A32779M07012J353976
7596A893767i13953A517638c65375A168583L15667a447901d23639A937647n28293
7587A409354d78472H17103E2255J07150R02485A75400p6623a365226N09491I42983
7576E40807g46949B020640e74790K01631A047498a156202A643154b14542A335583
7566F70907c051041I89940R23857f8644j772775A104751J76815m11150D04152
7556C68013h6564A418395A85502d9230F86861c05840I35773D55240a558810f93404
$$ y = [1289869, 892104, -641961, 389844, -121432, 627856, -953827, -932452, -394221, -113496, 13242, -911925, 508148, -609041, -328838, -653814, -117016, 329158, 1844277, 38707, 1556995, 58855, 1316969, -1801012, -413513, 1082077, -295191, -3924433, 1785356, 132779, 539791, 1893767, -913953, 1517638, -365375, 1168583, 1484250, -1447901, -423639, 1937647, 1409354, -478472, 817103, 52255, 159405, 1061890, 175400, 98777, -1365226, -855735, 942983, 540807, -746949, 2020640, -574790, -373159, 1047498, -1156202, 1643154, -214542, 1335583, 670907, -3051041, 989940, 1913797, -68644, -1841419, 1104751, 1281566, 870416, 404152, 368013, -86564, 1418395, 185502, -49230, 686861, -305840, 935773, 455240, -1558810, -693404]
7545A932004J62094g55013d3669G80870e96820K83552E90075J391162a604978
7535F27892C637J452217D81445c45588j016567b09409A444212m47341a900769
7525I28621j61064l3823a25815A181488m38417a96335F1155P9101J199464F35648
7514A640738n96018g2075C28176J024972F55978a48901H98207A9814N56011D119
7503g73944C403750a043941a0219A250457d88581C321400B75807g29027j82447
7494i11474E87672J056073d48246q3719A529224a018690N02642D0211c13740E93523
7483B098998g8817A991453A20820J85615e92969O6888A828507B44574J637910
7474A882484b10890D98691a293271C286451A43834M53320d83126l06557A851315
$$ y = [1932004, 2094098, -755013, -43669, 780870, -596820, -313268, 590075, 1981237, -1604978, 627892, 3637, 1455854, 481445, -345588, -1362155, -209409, 1444212, 996871, -1900769, 928621, 767557, 733734, -125815, 1181488, 743071, -196335, 61155, 140256, 1339720, 635648, 1640738, 1044720, -72075, 328176, 1353148, 655978, -148901, 898207, 19814, 575825, 4119, -773944, 3403750, -1043941, -10219, 1250457, -488581, 3321400, 275807, -729027, -911474, 587672, 1643745, -448246, -531965, 1529224, -1018690, -516048, 40211, -313740, 593523, 2098998, -78817, 1991453, 120820, 306435, -592969, -526081, 1828507, 244574, 1882484, -210890, 498691, -1293271, 3286451, 143834, 597154, -483126, -789683, 1851315]
7464a070477A225721C32085J081090l54245a53371j760433P21045A82290O13490
7455G95780K13589a02571k52360I28989e73700J44798j011423H47878R14011E47329
7444e9086D76599a093019b2949B428060A14930K65899o1389J980252A029532m15920
7434F13612A47814a103096A359467L12087J60500N42992g48727A252471n29275
7425G23196M47977Q38479j90323m88351J53210k86597b20919A26523d2188A364353
7414A01609a068898A035661m64132B41887a672434b39133A506848a39316E42131
7404a075472M42238E97826a86790E95746i25589C14071L71981C04192d934A400684
7393A19052J031180a89430B116780N5814g18701D87078K16613h05199B769391
$$ y = [-1070477, 1225721, 332085, 1413175, 1058930, -153371, -1913804, -1192759, 182290, 795780, 1009369, -102571, -354931, 928989, -573700, -428902, -1440325, 847878, 1761889, 547329, -59086, 476599, -1093019, -22949, 2428060, 114930, 380829, 319440, 2299692, 1029532, 613612, 147814, -1103096, 1359467, 1671554, 1832054, 2375046, -748727, 1252471, 723196, 1171173, 2009652, 1819329, 1330978, 1484188, 1197591, -220919, 126523, -42188, 1364353, 101609, -1068898, 1035661, 571529, 241887, -1672434, -239133, 1506848, -139316, 542131, -1075472, -633234, 597826, -186790, 595746, -925589, 314071, 686052, 304192, -4934, 1400684, 119052, 1150232, -189430, 2116780, 2172594, -718701, 487078, 703691, -805199, 2769391]
7383e60236a43706q98378A09225J687790F91403J771599k88742a231002B596037
7373G75672A89850J049331B41074J53696a209217H56481J862667c26801E00605
7363G7979a63585I13732A86536b620437b19731G64416j83202P94378C35803a26352
7352C06731J109896o02230G6607J816441A21329i12986E20412J015461c84074
7342B233416g02349j498164B550647m42259e9973A52804O11268N57823C80037
7332E94553b27607I62054G2637c004647B34328a476236a71123A169426e89101
7322H09551g7464C95228a66611B257899m77365n35968a301874N97331H0674M48839
7312E29513A39671K70505J484887I22645a259915B72967M12453a22958m5567A429696
$$ y = [-560236, -143706, -1042084, 109225, 1797015, 691403, 2463002, 2174260, -1231002, 2596037, 775672, 189850, 1239181, 241074, 394770, -1209217, 856481, 2719148, -326801, 500605, 77979, -163585, 913732, 186536, -2620437, -219731, 764416, 581214, 1375592, 335803, -126352, 306731, 1416627, 814397, 76607, 1893048, 121329, -912986, 520412, 1535873, -384074, 2233416, -702349, -2200513, 2550647, 2108388, -59973, 152804, 764072, 1321895, 380037, 594553, -227607, 962054, 72637, -3004647, 234328, -1476236, -171123, 1169426, -589101, 809551, -77464, 395228, -166611, 2257899, 1780534, 1244566, -1301874, -704543, 80674, 529513, 139671, 410176, 1895063, 922645, -1259915, 272967, 685420, -122958, -168525, 1429696]
7301A060422l61396k85352a107545A018925i78201B104990G13649k53792k17231
7292B42626k1913P95836d5106I9466a094130M72073q17639I03855i08172D09733
7281A888410F00776f59118B003158e53829j76762a55849n50974A511549K005645
7272C517194A391070R21259a220504A208756a62617A859359a90589B250846D55391
7262a356731D84807l639A82575R46257a421886c48105B48457J96780J813006a189086
7251b021613B38094N89941k21103k67321A13533K36481L58094K280545j461006
7242A527647h12837c41636B378903a35056A174094A99036J41880J514536C971
7232E31939m6931K037972B21260K54215K65996a69865C37315d83930A659653J446719
$$ y = [1060422, 699026, 413674, -1107545, 1018925, -978201, 2104990, 713649, 459857, 242626, 220713, 1016549, -45106, 99466, -1094130, -622057, -1439696, 903855, -908172, 409733, 1888410, 600776, -659118, 2003158, -553829, -730591, -155849, -706823, 1511549, 3517194, 1391070, 2312329, -1220504, 1208756, -162617, 1859359, -190589, 2250846, 455391, -1356731, 484807, 481168, 182575, 1128832, -1421886, -348105, 248457, 445237, 2258243, -1189086, -2021613, 238094, 828035, 606932, 339611, 113533, 350014, 708108, 2988653, 1527647, -812837, -341636, 2378903, -135056, 1174094, 199036, 340916, 1855452, 3971, 531939, 485008, 2522980, 221260, 475475, 741471, -169865, 337315, -483930, 1659653, 3106372]
7222C106372B76184J035504O60579D49016J052099E20218J329929o30023N20027
7213A740151k57871b34536A058226g47149B310680e25885A58705a118599f6992
7203B44397P94338k14297h06394d9662r88263i8989F7496n47R71391g4907l54900
7192d29807A529058C0175J360874a562001B111889D37599N99171a105345A577517
7182B487918G69554a9943A356509n50605C18319a95577n24392A090615f96302
7172A539531o18816O38122C19855j44272J023068R35387G57080M91963L9415k78312
7162A010146J64787N0747C7818R20244K055560e86818A622751d36540A028925
7152a018652A331791n25874c98991m26683A313156n97015N34372l4962Q2086m31003
$$ y = [3106372, 276184, 1311688, 1972267, 449016, 1501115, 520218, 1850147, 1220124, 1740151, 1482280, -234536, 1058226, -747149, 2310680, -525885, 158705, -1118599, -66992, 244397, 1038735, 824438, -806394, -49662, -1037925, -98989, 67496, 66949, 1038340, -74907, -429807, 1529058, 30175, 1391049, -1562001, 2111889, 437599, 1036770, -1105345, 1577517, 2487918, 769554, -19943, 1356509, 805904, 318319, -195577, -719969, 1090615, -696302, 1539531, 920715, 1558837, 319855, 175583, 1198651, 2134038, 757080, 1249043, 1288458, 1010146, 1174933, 1225680, 37818, 958062, 3013622, -586818, 1622751, -436540, 1028925, -1018652, 1331791, 805917, -398991, -825674, 1313156, 716141, 1250513, 1215551, 1297637, 866634]
7142H66634C65381Q32450A42046J078838A38450e5105D50275A36612c44565A542038
7131e37499B103321a016443p98354c94779o81544A528210l76407k69508j02202
7122G80093l54331o2278a688036B181616b88128A687225A19340R33387R8533J115775
7112B267035A008745J71072l34261b68228p00075A16547P90898K06404O3549i44803
7101A558726e8334B350829g60137A81437i55834F21003k8993J82586J299992g35085
7090B169622C91364K98068c39535A081578P69786F30326B64431J56654b34205
7080A734224k66312m48520D80534M83293R56501m9243a333239E62328R55400a570924
7069G41267J933851d66208D36975j65621P42103e45098I47179J054687g03384
$$ y = [866634, 365381, 1197831, 142046, 1220884, 138450, -55105, 450275, 136612, -344565, 1542038, -537499, 2103321, -1016443, -1814797, -394779, -1076323, 1528210, 1151803, 882295, 780093, 425762, 363484, -1688036, 2181616, -288128, 1687225, 119340, 1052727, 1151260, 2267035, 1008745, 1179817, 845556, -268228, -968303, 116547, 907445, 1113849, 1177398, -944803, 1558726, -58334, 2350829, -760137, 181437, -955834, 621003, 592010, 774596, 2074588, -735085, 2169622, 391364, 689432, -339535, 1081578, 1851364, 630326, 264431, 421085, -234205, 1734224, 1467912, 1019392, 480534, 963827, 1920328, 1871085, -1333239, 562328, 1517728, -1570924, 741267, 2675118, -466208, 436975, 271354, 1013457, -545098, 947179, 2001866, -703384]
7059e24225I79959b191428G7422O64929Q62373a6225G18630K230529j210820a075150
7048b7822A177335o5940Q29887r00991j00019a93138G60604L98249E56184A08707
7037C10618a539589G02156O38977b550013d08195A062722a137805G21476Q54462
7028A575938b27710A61757K30206j2074a103732A996705j68070F19957P19551
7019A339508B64431b66561A40061N60232P54079D01902J093797P44171n32444
7010A707426m39078A77678J534632l09851g94204F06605j24561J540651k55937
7001A766758g61136p17316B31983c35007D069484a506582e28412B80302J872772
6992B153074j72534H48640B70368J326376g05978m30622B919055A84748Q1980
$$ y = [-524225, 979959, -2191428, 77422, 742351, 1604724, -16225, 718630, 2949159, 1738339, -1075150, -27822, 1177335, 1111395, 1941282, 1040291, 940272, -193138, 760604, 1158853, 556184, 108707, 310618, -1539589, 702156, 1341133, -2550013, -408195, 1062722, -1137805, 721476, 1575938, -227710, 161757, 391963, 379889, -1103732, 1996705, 1828635, 619957, 1339508, 264431, -266561, 140061, 700293, 1454372, 401902, 1495699, 2239870, 1707426, 1268348, 177678, 1712310, 1402459, -794204, 606605, 482044, 2022695, 1766758, -761136, -1478452, 231983, -335007, 4069484, -1506582, -528412, 280302, 2153074, 1980540, 848640, 270368, 1596744, -705978, -1136600, 2919055, 184748, 266728]
6983B66728E3505g82793A827618h67631B128286j056626j22991a146313c46635
6973c14976A061092J157737G56358L42994e12881E12334K85803R27762J82584
6964A908483Q8779q65394K49217D71114h03470a2486n62139F99099K004194A071747
6953F13566a14665F89214f49857B35415b80778A168246k58493N8527R00813E87871
6942D50078B06242J195130b25512A577154Q22831A008541q6187d16702A631679
6932A490236G16486Q51673p50741A31245K515021b34638B149137F86576J971345
6923B657921i42174A096799j15066K42020R66573B10545K028966e79765A39400
6913G18436A29807K035540h86684A12804J193555n16951h7260A217759K66077
$$ y = [266728, 53505, -782793, 1827618, -867631, 2128286, 1071660, 948669, -1146313, -346635, -314976, 1061092, 2218829, 756358, 1099352, -512881, 512334, 798137, 1725899, 1908483, 1997262, 1131868, 1381085, 471114, -803470, -12486, -574625, 699099, 2703293, 1071747, 613566, -114665, 689214, -649857, 235415, -280778, 1168246, 909753, 968280, 1869093, 587871, 450078, 206242, 1401372, -225512, 1577154, 2399985, 1008541, 922354, -416702, 1631679, 1490236, 716486, 1568159, 817418, 131245, 2646266, -234638, 2149137, 686576, 2657921, -942174, 1096799, 981733, 1223753, 2190326, 210545, 2239511, -579765, 139400, 718436, 129807, 2165347, -886684, 112804, 1306359, 789408, -87260, 1217759, 1483836]
6904A483836A57319J296459G07183b89980A93005L07065g59671A089250Q48409
6895A937659A71853J431228g99874A721026E35973J185000g10649A484654k38509
6886A246145j87175J58253J306697I9394M16238J288976g83473n33744A069497
6876I57529k73219O12822O33090m30671J01618e28130I04705C47350K29273K18572
6866G95195J221923J8702k09135k14564m4219M94966a067817a69833C298852h5811
6855A752110A08512R86324L47767p04676J955871b16915A741537h22319G18317
6845B394097H94535J321876m34292G17367j39333A30339J520227H765a714800
6835A766308E08867Q70805k84573M8306b67954A059946J03600g7783B687238p07220
$$ y = [1483836, 157319, 1453778, 707183, -289980, 193005, 500070, -759671, 1089250, 1937659, 171853, 1603081, -799874, 1721026, 535973, 1720973, -710649, 1484654, 1246145, 1058970, 1217223, 2523920, 99394, 515632, 1804608, -783473, -1317217, 1069497, 957529, 684310, 1297132, 1930222, 1499551, 1601169, -528130, 904705, 347350, 576623, 795195, 2017118, 2035820, 1826685, 1612121, 1567902, 2062868, -1067817, -169833, 3298852, -85811, 1752110, 108512, 1094836, 1442603, 737927, 2693798, -216915, 1741537, -822319, 718317, 2394097, 894535, 2216411, 1782119, 717367, 578034, 130339, 1650566, 8765, -1714800, 1766308, 508867, 1379672, 1095099, 1143405, -267954, 1059946, 1163546, -77783, 2687238, 1980018]
6825A980018r50769M18757O86483A38880a13799A823336m88415r1650J025369
6816B268640I06957J167371K128061G59068M04231J338047B476a79457B037359
6806B61644K781371e94995q37308A531791e70475B99821A33620c47214n2355k334788
6796b734357I20166R02578p30273O37345p14962e25044F38227M58082R93240K34536
6786B324085h5179D32438A13918O56784L93414J388779A040946K82470D29664
6776I86918N20124a140288B72691J51290K606340o76243A137716l93349O52092
6767A396459R61752I22732O85728A34290J298683l33964j81528J124162r99008
6758A042635K442234a0246A319818f83698A138872G0507g58312B084096n18252
$$ y = [1980018, 1029249, 1448006, 2134489, 138880, -113799, 1823336, 1334921, 1243271, 2268640, 906957, 2074328, 4202389, 759068, 1163299, 2501346, 2476, -179457, 2037359, 261644, 3043015, -594995, -1432303, 1531791, -570475, 299821, 133620, -347214, -399569, -2734357, 920166, 1822744, 1092471, 1729816, 1014854, -525044, 638227, 1096309, 2089549, 2324085, -85179, 432438, 113918, 770702, 1164116, 2552895, 1040946, 1323416, 429664, 986918, 1507042, -1140288, 272691, 423981, 3030321, 2354078, 1137716, 744367, 1396459, 2358211, 922732, 1608460, 134290, 1432973, 1099009, 917481, 2041643, 1042635, 3484869, -10246, 1319818, -683698, 1138872, 70507, -758312, 2084096, 1565844]
6749A565844n37950k69037Q02547p55949C13162Q9026L09785D0762a69340m25502
6739e94842D81433P91184l65478K370397D68606a133651I84689N47105M94394
6730B026188D69371J217829b38483C96011O03029Q54253B61114K79244J646086
6721B186444n74261K67090e4255o25651A939101o75706O81086D71021M80974N5605
6711A007600e42348j221732F79914b51568b4123A648185l3732F42736R02616F35400
6700E55977J158991b36879A849838G63732J481920E62608J94546P4494J873234
6691B704882q86405C09324p0385O75182J319354H49624J732035C73382O676c06300
6680A196421k55841a048096K03125A736606a124404A695447a035187A002756M68303
$$ y = [1565844, 1027894, 758857, 1561404, 805455, 313162, 402188, 711973, 40762, -169340, -594842, 481433, 1272617, 907139, 3277536, 468606, -1133651, 984689, 1531794, 2026188, 469371, 1687200, -238483, 396011, 999040, 1853293, 261114, 540358, 2186444, 1612183, 1879273, -54255, -679906, 1939101, 1263395, 1944481, 471021, 951995, 1007600, -542348, -1764080, 679914, -251568, -24123, 1648185, 1614453, 642736, 1545352, 635400, 555977, 1714968, -236879, 1849838, 763732, 2245652, 562608, 757154, 831648, 2704882, 1818477, 309324, 238939, 914121, 2233475, 849624, 2581659, 373382, 380058, -306300, 1196421, 940580, -1048096, -844971, 1736606, -1124404, 1695447, -1035187, 1002756, 1471059]
6671A471059c05485p88259B982727j375026J90994j31206J099047D84228J402849
6662A887077H35941K261351I12960K88516b677643A131741m4526g55616C65084
6652B20855J976802c3024A486458m40734l49948J38012a658570A434840E01120
6642h83426q6583F92809O06336E94226L19885B64097Q62489J528637q20914A9247
6631e41339A130865J099649a70271e9268k1041A515789K655447j790680j185282
6622A195274a43270A815813q88617e41473a44067m30210G86040L29665a414967
6612A069296n34337R1323G0994P92668C6978K302273F05093e40063A287763E48509
6601A463226K771831I09785l67648a360533A236277Q5005a971131J4875D64971
$$ y = [1471059, -305485, -1093744, 2982727, 1607701, 1798695, 1667489, 2766536, 484228, 1887077, 835941, 3097292, 912960, 1201476, -2677643, 1131741, 1087215, -755616, 365084, 220855, 2197657, -33024, 1486458, 1045724, 695776, 833788, -1658570, 1434840, 501120, -883426, -970009, 692809, 1299145, 594226, 914111, 264097, 1126586, 2655223, 1834309, 19247, -541339, 1130865, 2230514, -170271, -59268, -80309, 1515789, 4171236, 2380556, 1195274, -143270, 1815813, 927196, -541473, -144067, -574277, 786040, 1115705, -1414967, 1069296, 534959, 626282, 70994, 863662, 36978, 2339251, 605093, -540063, 1287763, 548509, 1463226, 4235057, 909785, 542137, -1360533, 1236277, 1321282, -1971131, -1956256, 464971]
6591A360485m97861C97945A59477P75294l63285J166556p95136L13129P4163P05577
6581B035775G36373l44230Q71529B67403Q24868E05560M45904L92458C33190i26021
6570a50291C00224O28093K171747n02284F59332K86844J30952j09691g79134C351960
6559A184483D36338M76016P18851B26686f7030H96460q880l35252J020724r8280
6549A474772O95227f27166A916133q17944j97522m36026J271536i9836k48888
6540c48724k25300F58515J189925o23175J351921k72530c31695f2483B034100
6530C422771D54390R54114J22737M28768o71271J501357o29860r70100L80827
6521A570962j27625c43570g5198k01849A342731m61956c78744A358703D79831
$$ y = [1360485, 862624, 397945, 159477, 934771, 571486, 1738042, 942906, 1256035, 1330198, 2035775, 736373, 392143, 1263672, 267403, 1092271, 505560, 951464, 1343922, 333190, -926021, -150291, 300224, 928317, 3100064, 2597780, 659332, 946176, 1077128, 967437, -779134, 3351960, 1184483, 436338, 912354, 1631205, 226686, -67030, 896460, 887580, 552328, 1573052, 1474772, 2169999, -627166, 1916133, 1098189, 900667, 464641, 1736177, -99836, -348724, -574024, 658515, 1848440, 1225265, 2577186, 2304656, -331695, -62483, 2034100, 3422771, 454390, 1408504, 1531241, 1960009, 1288738, 2790095, 2160235, 1190135, 1570962, 1443337, -343570, -75198, -277047, 1342731, 880775, -378744, 1358703, 479831]
6511A826780o65424k84336J215945n45199A02711J97805c20112E48953K333701
6502B882654A116743j85308l46861J038068F35580J247558p77076A80005J910943
6493B090948l30229G09473L97310Q68519A15395J264290n22752O47267F87156
6483C62680K026919A047826J384513l56569J545125A457444L86610p01962D7517
6473c66225a51542A391171c98968D85958K95702f89813A448615N66106l02885
6464A711836F01871k03052K386172H38638F1345Q40123K87882C45965K037252
6455B383217D84768J057133E48347K220426j237130A32967K294404D4270C562
6445A619096K259264A244195b09771p4880A325353o27243J145894p39886J606726
$$ y = [1826780, 1161356, 877020, 2092965, 1547766, 102711, 300516, -320112, 548953, 2882654, 1116743, 931435, 584574, 1622642, 635580, 1883138, 1106062, 180005, 2090948, 1760719, 709473, 1106783, 1975302, 115395, 1379685, 856933, 1504200, 687156, 362680, 2389599, 1047826, 2432339, 2075770, 3620895, 1457444, 1844054, 1142092, 47517, -366225, -151542, 1391171, -398968, 485958, 781660, -689813, 1448615, 2014721, 1711836, 601871, 398819, 2784991, 838638, 61345, 901468, 1189350, 345965, 2383217, 484768, 1541901, 548347, 2768773, 1531643, 132967, 2427371, 44270, 3562, 1619096, 3878360, 1244195, -209771, -284651, 1325353, 698110, 1844004, 1104118, 2710844]
6436B710844L97499a606716D057623B42949M99478B11119I1768J165483m88323
6427G68928B09337O98363j17893M89962O86759B0731J193030J101004b10435A929611
6416D76049A09092P32371i17015H25159K29538J029880Q33929J63457p68095A154050
6405A381203P7035b05117M5H97127J466935A039629K402013H89554B52343R98295
6395A250638N36698l77325Q95340B86985K093494k76817q66410R33737k20750
6386A950239k05551K30058J73205E68012c73372A858831d78845I77368B23309
6376D63042Q71393R08209e22900A30037d42374B340253D35896J347292o06160
6367A177028J198203m63024o3347n3246L23207K7923D47767d05202A205253J773725
$$ y = [2710844, 3108343, -1606716, 4057623, 242949, 742427, 211119, 91768, 1257251, 768928, 209337, 907700, 789807, 1279769, 1966528, 20731, 1213761, 2314765, -210435, 1929611, 476049, 109092, 841463, -917015, 825159, 1054697, 2084577, 2918506, 3081963, 2313868, 1154050, 1381203, 1458238, -205117, -205072, 897127, 2364062, 1039629, 3441642, 889554, 252343, 1250638, 1787336, 1410011, 2305351, 286985, 2380479, 2103662, 1237252, 2170989, 1950239, 1744688, 1974746, 2147951, 568012, -373372, 1858831, -478845, 977368, 223309, 463042, 1334435, 2242644, -522900, 130037, -442374, 2340253, 435896, 1783188, 1177028, 2375231, 1912207, 1848860, 1795614, 2118821, 2146744, 447767, -405202, 1205253, 2978978]
6357B978978B21449J548377M82191n59923l45951J898463a865467d4193A345005
6347A166512J34593l06774P11034P59767r72115a892337I33249J354437e88949
6337a189223A744558l81581N93784G2976J514773M51693o82190B01021J374721
6328A575742o34254B15050K500186n65044J342510B80501J628024i19003j74442
6319a093445h2209B09781J638802J459516e68033B361109b79165I48422M79300
6310A427722n66466O74558m14361J233556I30821j62874K90715E08863J95584
6301G04447K02793J361082C87566e84926D99079k7165L67953J059292q67443B58601
6290B016585c11194C145326A229414m38773k77326K46693J47394l07937K205396
$$ y = [2978978, 221449, 1769826, 2252017, 1692094, 1346143, 3244606, -1865467, -44193, 1345005, 1166512, 1301105, 994331, 1705365, 2465132, 1493017, -1892337, 933249, 2287686, -588949, -1189223, 1744558, 1362977, 1956761, 72976, 1587749, 2039442, 1357252, 201021, 1575742, 941488, 215050, 2715236, 2150192, 3492702, 280501, 1908525, -919003, -1093445, -82209, 209781, 1848583, 3308099, -568033, 2361109, -279165, 948422, 1427722, 861256, 1535814, 1121453, 2355009, 930821, 767947, 1058662, 508863, 704447, 907240, 2268322, 387566, -584926, 499079, 471914, 839867, 1899159, 1031716, 258601, 2016585, -311194, 3145326, 1229414, 790641, 513315, 760008, 907402, 599465, 2804861]
6281B804861r16212L35121D29746K051671p18155p19021J14803D39185J194674
6272A633859J29283D19720R39930k35686O892J417906o44633k47469F32643L352137
6262C984780j914707m26171M02824J841658B06798Q80134Q29836n70901A56093
6252B47476A0807K851019a474361K92408H4873K15696R95287C86733J554204E8800
6241f07255B233773A013948l5525D22821M0737O54349D0509K444131e05598A99074
6230H69854R04465H50962P68518C86316K307037H27721P71944h9766A036770C17412
6219A403685Q37657r61539n44526B06643R85012R39712r20326P65957J093672
6210C070670E20122N61333o360j44475K88587j43732F2359b59470f3842D03355
$$ y = [2804861, 1888649, 2223770, 429746, 2481417, 1763262, 1044241, 1159044, 439185, 1633859, 1763142, 419720, 1359650, 1123964, 1130856, 2548762, 1904129, 1656660, 632643, 3984780, 2070073, 1643902, 2046726, 3888384, 206798, 1086932, 1916768, 1345867, 156093, 247476, 10807, 2861826, -1474361, -1181953, 84873, 300569, 1295856, 386733, 1940937, 58800, -607255, 2233773, 1013948, 978423, 422821, 463558, 1117907, 40509, 2484640, -505598, 199074, 869854, 1774319, 850962, 1619480, 386316, 2693353, 827721, 1599665, -89766, 1036770, 317412, 1403685, 2241342, 1279803, 735277, 206643, 1191655, 2131367, 1211041, 1976998, 3070670, 520122, 1081455, 1075095, 930620, 1219207, 1075475, 62359, -259470, -63842, 403355]
6199A349246J643857A091853M67882J745614A213937n476K457528H72984k75782
6190E97202j86396h4165G96882J793762H80181L93040J189378C458J340156C41304
6179G063K13162L32352J113407b20687B767252C79326J830108D40775J758472
6170B199247n95934p4462n68814J399672k95420j016810J42628l39487g01580
6160C397880D96584J424698o01719j97694J072525p52461m57568J061775J10254
6151B156394I64973N56933j44695Q5158l9384C78894J217487J12737c88836H45072
6140A903096I22391K767715C06340h52078B842916l70013d13325A807028B84453
6130A057089J883792g23514B281935E46359J329255G27685J698306j68025E12368
$$ y = [1349246, 2993103, 1091853, 1559735, 3305349, 1213937, 1208461, 3665989, 872984, 597202, 410806, -84165, 796882, 2590644, 880181, 1273221, 2462599, 3458, 1343614, 341304, 7063, 220225, 552577, 1665984, -220687, 2767252, 379326, 2209434, 440775, 2199247, 1603313, 1528851, 960037, 2359709, 2064289, 1047479, 1190107, 850620, -701580, 3397880, 496584, 1921282, 1319563, 1121869, 2194394, 1441933, 984365, 2046140, 2156394, 964973, 1521906, 1377211, 1462369, 1422985, 378894, 1596381, 1709118, -388836, 845072, 1903096, 922391, 3690106, 306340, -852078, 2842916, 2472903, -413325, 1807028, 284453, 1057089, 2940881, -723514, 2281935, 546359, 1875614, 727685, 2425991, 2257966, 512368]
6120B731770A209918O97426N45254j166101J86823O68862b18884A547567g49828
6110C79584J948604A042159P94926J001018A379174j04049N35727J359069D53952
6100B868345q40071o63619F00601J16747J724862n10568l55218D20294q3562K528456
6090B865188j01890n11438C87954K389268I73293Q76138q01680c71920I82958
6080A120876j26300M27092j0730l789l33601M04824k74568a149921A246782J02689
6070A349471l32412J609245A012172b3856B304431R38032D2478K109099n42255
6061A609322o97271b9532A242097N01213P55997n29485J284191G12049J973342
6052B685391B39056Q03025J956845N32633G96043J982560A087923g28481B711712
$$ y = [2731770, 1209918, 1907344, 2452598, 1286497, 1473320, 2142182, -218884, 1547567, -749828, 379584, 2328188, 1042159, 1837085, 2838103, 1379174, 1275125, 1810852, 3169921, 453952, 2868345, 2028274, 1364655, 600601, 717348, 2442210, 1931642, 1576424, 420294, 336732, 2865188, 2763298, 2251860, 387954, 2777222, 973293, 1849431, 1047751, -371920, 982958, 1120876, 994576, 1421668, 1410938, 1407149, 1073548, 1478372, 1203804, -1149921, 1246782, 1349471, 1017059, 2626304, 1012172, -23856, 2304431, 3242463, 42478, 2151577, 1609322, 912051, -29532, 1242097, 1743310, 2499307, 1969822, 3254013, 712049, 2685391, 239056, 1042081, 2998926, 3531559, 796043, 2778603, 1087923, -728481, 2711712]
6042a23379A543653F70651M91113J734454A093728l00161J118471q54404N74259
6033A631893O36515c88893B849683p32625r53530k80043J373849q73929k80658
6024A102747J325230B96903L492853j730927p99549N13183P15690G23557L93527
6015A117084n53802N82917Q16761o37986f16398B983818j242928C02797M58577
6006G61374K730090m93428A112328J380591J550029A064965J210278A46277J148612
5997A294889J10432k42820J676537f37087b8086B484842A61186K970982m54165
5988B678003A071403l37638N50959m18115K02267K198322A416172J240477G76208
5978A165458K03006J06474r1422L049525B75945J194532L25172m41505l62930
$$ y = [-123379, 1543653, 670651, 1161764, 2896218, 1093728, 793567, 1912038, 1057634, 1631893, 2268408, -388893, 2849683, 2117058, 1163528, 883485, 2257334, 1383405, 1102747, 2427977, 296903, 3789756, 2058829, 1259280, 1772463, 2488153, 723557, 1117084, 563282, 1146199, 1962960, 1324974, -616398, 2983818, 1740890, 302797, 761374, 3491464, 2998036, 1112328, 2492919, 4042948, 1064965, 2275243, 146277, 1294889, 1405321, 1162501, 2839038, -637087, -28086, 2484842, 161186, 3132168, 2678003, 1071403, 733765, 1284724, 866609, 1068876, 3267198, 1416172, 2656649, 776208, 1165458, 1368464, 1474938, 1383516, 4433041, 275945, 1470477, 1795649, 1354144, 991214]
5969I91214K107211r53618N77775I16992K66656K13633J149836q34173G07800
5959B424197A098132J526104r71826O42322j139267O62773g63097A952169E83078
5949A858993J446723j434537F17646L120343r11905I43971K75488q2439M11902
5940A548922l0044J296153I90938P09290q3175N2085J01588D03944J892526d4286
5929a51669D10238K430581J9595F66048a37603B50642j4409h76413E42902c94050
5918A404609o86345J702918D79816O89813O93727H44878R1797j92886L51569I3661
5907b11087A394077R09388F68545J636923o11981J79832K15562j67264H35194
5897A028260D83452J159284G39784K154290I46515J301307q70205l0740J12052
$$ y = [991214, 3098425, 2144807, 2722582, 916992, 1183648, 1397281, 2547117, 1712944, 707800, 2424197, 1098132, 2624236, 1652410, 2294732, 1155465, 1818238, -763097, 1952169, 583078, 1858993, 3305716, 1871179, 617646, 3737989, 2826084, 943971, 1219459, 1137020, 1548922, 1518878, 2815031, 990938, 1700228, 1617053, 1669138, 1770726, 403944, 2296470, -44286, -151669, 410238, 2840819, 2860414, 666048, -137603, 250642, 236233, -876413, 542902, -394050, 1404609, 718264, 2421182, 479816, 1169629, 1863356, 844878, 936675, 743789, 1095358, 93661, -211087, 1394077, 2303465, 668545, 2305468, 1693487, 1873319, 2088881, 1921617, 835194, 1028260, 483452, 1642736, 739784, 2894074, 946515, 2247822, 1377617, 1346877, 1458929]
5888A458929J07999l84799Q75372j66598m57847J88753n83490J576658F2553K207276
5878B269829F74353K020953F77460O31337L090965j696525B97551J410727Q74457
5869B582735N60931j283065o59785k90487O36510f33516B245938L52618A153786
5859A336243j05489b18693A174179R73774H99892J783996A247855J350443D91763
5849H13571O15153R17274n61489G28706B5542K376592r20172R51024j9619J2871
5839B426238M84142a55536B424688m02130N92416H58196J99685J160904k47941
5830A970844q69467R59326n64460B07857J079564e91198B173377O72936A109547
5820a741279B529565o82035n74427m04708J763544j111059K93779k77440J07523
$$ y = [1458929, 1566928, 1182129, 2057501, 1890903, 1433056, 1621809, 1038319, 2614977, 62553, 2269829, 674353, 2695306, 677460, 1308797, 4399762, 2703237, 297551, 1708278, 2582735, 3143666, 1860601, 1200816, 910329, 1546839, -633516, 2245938, 2598556, 1153786, 1336243, 1230754, -218693, 1174179, 2147953, 899892, 2683888, 1247855, 2598298, 491763, 813571, 1428724, 2345998, 1784509, 728706, 25542, 2402134, 1481962, 2432986, 2413367, 2426238, 2910380, -155536, 2424688, 2022558, 2614974, 858196, 1057881, 2218785, 1970844, 1101377, 2060703, 1496243, 207857, 1287421, -591198, 2173377, 2846313, 1109547, -1741279, 2529565, 1847530, 1273103, 868395, 2631939, 1520880, 1814659, 1537219, 1644742]
5811A644742d90444G74651K042400A100008O78104J02535A34879a2939A564079
5801B884162j013011J547145j699843o99402D69975L2199J320301B56267K214894
5792B471161G06821J595233j066397O91025P82386J084345A272775J14329J833715
5783C220819k28519k19728G26454Q00943o58999N53014J350662A377683J109521
5774B487204N44053j340620J565568N85468f18725B798552a71444C368199O74374
5765D042573A912843J06441L87897b40914C173071M95904j421085a53221A271695
5755A442201J721281e28075A530163j83238C55314n8842J03455G545K547118A207156
5744b40471B003488I70551J493334F4166L85545K219160A268685J517840H48015
$$ y = [1644742, -490444, 774651, 2817051, 1100008, 1778112, 1880647, 134879, -12939, 1564079, 2884162, 1871151, 3418296, 1718453, 1019051, 469975, 502174, 1822475, 256267, 2471161, 706821, 2302054, 1235657, 1926682, 2709068, 3793413, 1272775, 1387104, 3220819, 2992300, 2772572, 726454, 1527397, 868398, 1421412, 2772074, 1377683, 2487204, 3031257, 1690637, 3256205, 3841673, -618725, 2798552, -171444, 3368199, 4042573, 1912843, 2019284, 2407181, -240914, 3173071, 3668975, 2247890, -153221, 1271695, 1442201, 3163482, -528075, 1530163, 1346925, 355314, 296472, 399927, 7545, 2554663, 1207156, -240471, 2003488, 970551, 2463885, 64166, 449711, 2668871, 1268685, 2786525, 848015]
5734G60920Q74126J091622L55171q48997n40582M18690F10906K168819j258888
5725A520837J154584A152665J455383l08941o16779L457863A917899o28183J415014
5716B704730j28067M71671H57760J570328J54179h34991B008041o50994E27394
5706B247228p28554E14103J056206K567988A281360J222291A241289J92432E23590
5696B192340I68960B86555L155116M68950H12072J259156G46226J467288M34239
5687B647753J062619A32738J280022R9604L3996r3858R14386J725468j287625
5678B804731A109257Q51857j68782M50262J161797A557159A986M577933q12989
5669C766930A584028A85746J66144J069978o6556M63603M01068N99844E15665
$$ y = [760920, 1635046, 2726668, 3081839, 2232842, 1692260, 2110950, 610906, 2779725, 1520837, 2675421, 1152665, 2608048, 2299107, 1682328, 5140191, 1917899, 1289716, 2704730, 2576663, 3048334, 857760, 2428088, 2582267, -834991, 2008041, 1357047, 527394, 2247228, 1518674, 514103, 1570309, 4138297, 1281360, 2503651, 1241289, 1433721, 523590, 2192340, 968960, 286555, 3441671, 3910621, 812072, 2071228, 746226, 2213514, 2647753, 3710372, 132738, 1412760, 1512364, 1546360, 1452502, 2366888, 4092356, 2804731, 1109257, 1961114, 1792332, 2242594, 3404391, 1557159, 1986, 4579919, 3766930, 1584028, 185746, 351890, 1421868, 1355312, 1818915, 2219983, 2819827, 515665]
5659A521858J151657j015960P11245N61643o26511C93640K32429J117491k87936
5650A455624n26583J313374J162990O1597F55754N24715k75940J441052P11644
5641C057225G38270M63586E91310K200657J434033A976932a66369B740035a43412
5631B484357R88520A519715E84750K279930E96061Q57175J370150I93330R24822
5622A918152J754585L4288G30513L326752j640598F91680l9671k23161K685217
5613C114065A082998J452647m32397b75586A500293K85408L48921Q69065G24448
5603C234531E25778M125199J32293A894260K255360A769784J199663k08564j80590
5594B580293p68022K377714H61381M215563j414643Q41497j616806J661319j233097
$$ y = [1521858, 2673515, 1657555, 2368800, 2930443, 2303932, 393640, 626069, 1743560, 1455624, 929041, 2242415, 3405405, 3467002, 655754, 1180469, 904529, 2345581, 3057225, 738270, 1201856, 591310, 2791967, 4226000, 1976932, -166369, 2740035, -143412, 2484357, 3472877, 1519715, 584750, 2864680, 596061, 1453236, 2823386, 993330, 1918152, 3672737, 3707025, 730513, 4057265, 2416667, 691680, 652009, 428848, 3114065, 1082998, 2535645, 2103248, -275586, 1500293, 1785701, 2134622, 3003687, 724448, 3234531, 525778, 4650977, 4783270, 1894260, 4149620, 1769784, 2969447, 2760883, 2580293, 1812271, 4189985, 861381, 5076944, 3662301, 4503798, 2886992, 4548311, 3315214]
5585C315214r31030C95596L244026J51876M04320o81526j323376L28071Q6493
5576B605480j110224J89212J09709L00517P9449p51771m3510r1553J442019H56028
5565B920520q07317j19927m92742l44382K849100j146670A231457K100024k73831
5556C057650R815q93231p53880L177386j615067I47842J168403R05196K37991
5547C259432I52136j74723O76518i57830C794587H74275Q09477O27790j097286
5538A214256Q76160F88987J283499n01250R62506J014242p96224m57291A081697
5528D837607j835606j199140l02960l26865D62570K496844g01907C857191j271447
5519B585744O89179J582260A350707L154430j231130A049158J301664J608801
$$ y = [3315214, 2384184, 395596, 3639622, 3791498, 4195818, 3514292, 2190916, 2518987, 2605480, 1495256, 1684468, 1794177, 2094694, 2174143, 1422372, 1378862, 1287309, 2729328, 856028, 2920520, 2113203, 1993276, 1500534, 1156152, 4005252, 2858582, 1231457, 3331481, 3057650, 3067465, 2174234, 1420354, 4597740, 2982673, 947842, 2116245, 3021441, 3259432, 952136, 777413, 1453931, -957830, 3794587, 874275, 1683752, 2311542, 1214256, 2090416, 688987, 1972486, 1471236, 2433742, 3447984, 2651760, 2194469, 1081697, 4837607, 3002001, 1802861, 1499901, 1173036, 462570, 2959414, -701907, 3857191, 2585744, 3274923, 4857183, 1350707, 4505137, 3274007, 1049158, 2350822, 3959623]
5511C959623A760979n52152l91126J827898G58039J38497K324584G51985J135714
5502A887699J29158J01239K450525a40005B460101E83415J436690M68576j90763
5493B297918o0747m52771J78428Q53883H21599A52588L640440I88990J216788
5484B205778R83706A538969O49857m73042J782243j84098J070746r04858j089459
5475B390358r43811J499787Q27587j712879R81904n3490k20708r57148K732120
5466D543720j433986O46070L55106j069677j299102P55867J661911r27831m42964
5457B789114n74635J846620j510959M9769k5565L43511m54978Q9923l20633L69383
5447B601550A217860K495113j664371r56340K012455j009189N21817J023794q31934
$$ y = [3959623, 1760979, 1208827, 817701, 2645599, 758039, 896536, 3221120, 751985, 1887699, 2016857, 2118096, 4568621, -140005, 2460101, 583415, 2020105, 2488681, 2297918, 2237171, 1784400, 1962828, 2816711, 821599, 152588, 3793028, 988990, 2205778, 3189484, 1538969, 2188826, 1715784, 3498027, 3313929, 4384675, 3479817, 2390358, 1446547, 2946334, 3773921, 2061042, 3042946, 2989456, 2768748, 1811600, 4543720, 3109734, 3755804, 4110910, 3041233, 1742131, 2497998, 4159909, 3232078, 2789114, 2214479, 4061099, 2550140, 2599909, 2574344, 2917855, 2462877, 2552800, 2232167, 2601550, 1217860, 3712973, 2048602, 1092262, 3104717, 2095528, 2617345, 3641139, 2809205]
5438B809205A184798K789574l068n43228J097951j869819k90668K140698j893676
5429B612562L3223J185234n83111j144310K50388R8793J634769j311853r70293
5420A805402J834670m48724o5646q78207p67791J135315J041102j190212n3809
5411B412100Q19542m08873L9078j87045J232030p48376o96039q43022R84081J415613
5401D019089j530114K245441B060521q32032K688426k71919j072386n10871p72266
5392A289473J499196J780175A154848E26636J828875J989308n49317j552180q66513
5383A376809J956659j601126D31595L22527J292548J401826j22938k9032j391182
5374A905344H76092O93764J36150J30615J992438A518382K407625m54155L43703
$$ y = [2809205, 1184798, 3974372, 3971304, 3428076, 4526027, 2656208, 2365540, 4506238, 2612562, 2645785, 3831019, 3247908, 2103598, 2353986, 2452779, 4087548, 2775695, 1805402, 3640072, 3191348, 3125702, 2247495, 1479704, 2615019, 3656121, 2465909, 2412100, 3231642, 2822769, 2861847, 2674802, 3906832, 3158456, 2462417, 1619395, 2603476, 4019089, 2488975, 4734416, 2060521, 1228489, 3916915, 3644996, 2572610, 2061739, 1289473, 2788669, 4568844, 1154848, 526636, 2355511, 4344819, 3795502, 2243322, 1376809, 3333468, 1732342, 431595, 754122, 2046670, 3448496, 3325558, 3296526, 1905344, 876092, 1569856, 1706006, 1836621, 3829059, 1518382, 3926007, 3471852, 3815555]
5365C815555j045826n58697J105499K02614j303204m87066k22111L57399Q05850
5356B670013k56179p1272A116284J312422J296837A254947h5697E470881j842934
5347C627947n54368n87246P56927m73190r29226k96084m12987N28343Q56647k36117
5337B280646O60384o90600p43278Q25131l675K98141P79960n50585o69518O20478
5327B807084j281653J108464H67139D33309J444340d46997D209896j638414o16711
5318A954771Q6787l3860P46891A237740J322749N56068K28435j024763M33597
5309B753826o4235D09695K649282q02245Q57532J249833H38802N69386J467730
5300B875918q82811J592015A145200K07201o18439K247810r71679K11689J896070
$$ y = [3815555, 2769729, 2211032, 3316531, 3519145, 2215941, 1728875, 1506764, 1864163, 2670013, 2413834, 2342562, 1116284, 2428706, 3725543, 1254947, -85697, 5470881, 3627947, 3073579, 2486333, 3243260, 2770070, 1840844, 1544760, 1131773, 1660116, 2516763, 2280646, 2941030, 2250430, 1507152, 2332283, 2328608, 2626749, 3406709, 2856124, 2186606, 2807084, 1525431, 2633895, 867139, 433309, 1877649, -446997, 4209896, 2571482, 1954771, 2041558, 2007698, 2754589, 1237740, 2560489, 3116557, 3344992, 2320229, 2753826, 2689591, 409695, 3058977, 2256732, 3114264, 4364097, 838802, 1408188, 2875918, 1993107, 3585122, 1145200, 1352401, 733962, 2981772, 2010093, 2221782, 4117852]
5291D117852A128602J120394K78362B71814L535944N43102p62623j756047m5893
5282A786297P23793p59739N05996q7489O52142j079762J729412j450193q54094
5273A166363J574157l6824r43339O00357N67051J109875r06630m71259J024086
5264C683837j381538a86528B730868B26368R78183J99155P39247p18265J512534
5255B937222H41626K141118I86670Q38904J140255J257624J8820p31819G49192
5245A452441l42699J662049O74959p11416Q61010A713475R70099r41241o21685
5236A120648J562085j288256l86276J483515m35100J886055j251733O93844m8894
5227C335888A471772N95290O41045o98105p23755J976328a61993B478059K2968
$$ y = [4117852, 1128602, 2248996, 2527358, 271814, 3807758, 4350860, 3588237, 1832190, 1786297, 2510090, 1750351, 2256347, 2168858, 2821000, 1741238, 3470650, 2020457, 1166363, 2740520, 2703696, 1760357, 2360714, 2927765, 4037640, 3131010, 2659751, 3683837, 2302299, -186528, 2730868, 226368, 1204551, 1403706, 2142953, 1424688, 2937222, 841626, 2982744, 986670, 1825574, 2965829, 4223453, 4242273, 3510454, 749192, 1452441, 1109742, 2771791, 3446750, 2735334, 3596344, 1713475, 2683574, 1742333, 1120648, 2682733, 1394477, 1008201, 2491716, 2056616, 3942671, 2690938, 3384782, 3335888, 1471772, 2067062, 2708107, 2010002, 1286247, 3262575, -161993, 2478059, 2501027]
5218B501027J017597q95261m7957K115859B198491P72836J08559M11598p39021
5209B752463l76013A54677J631731K408093j70989j18010j46553j543104N6718
5200B272563N56000J483002j817840e445C333791O38351j257533j11402K33356
5191B836563J500902l93138K28139L98926k009984K979633O2219k480952M431203
5182G553511j328631k005010o75729j32915l94744p02565J769985j415642K444393
5173E112653j037033j557100J391348m70257L52234n28743j622777J500511M43670
5164C584506K57486J605373k221065o16296l45499n22592M52333J083840A086507
5154A212334J564827j26174k49483Q31754k89417l7633j192484K090955j299114
$$ y = [2501027, 3518624, 2623363, 2575406, 4691265, 2198491, 2971327, 3079886, 3491484, 2752463, 2376450, 154677, 1786408, 4194501, 4023512, 3905502, 3758949, 2215845, 2272563, 2828563, 4311565, 2493725, -5445, 3333791, 3972142, 2714609, 2603207, 2836563, 4337465, 3944327, 4172466, 4571392, 2561408, 5541041, 5603260, 3122308, 7553511, 6224880, 4219870, 3544141, 3411226, 3016482, 2313917, 4083902, 2668260, 5112653, 4075620, 2518520, 3909868, 3439611, 3791845, 3263102, 1640325, 3140836, 3584506, 3841992, 5447365, 3226300, 2610004, 2264505, 1741913, 2194246, 3278086, 1086507, 1212334, 2777161, 2650987, 2401504, 3233258, 2943841, 2906208, 1713724, 3804679, 2505565]
5145B505565o54365K433133j817059D92323J28619K963744j630847K651479A787097
5135C862248j435522A155847Q50540b57814C915454l48082O10562j344386l11037
5126B522511n112J781574q5310j546007J239770N54871A306873J611096j88608
5117B729361N96497Q84727C61298J501916n40029K797665q43010n19085o99904
5108B058851P89941r79205n37455K348246j48939J425410j688209L41906L39804
5099C950350j105540N51102R44123j141099J49850j72554j287852R47032N25945
5090C361357j525505J113824K558725k721757J438103j504682K020188B353180
5081C277384l0042K426341k682785p56632O16011L73832J699485k343960M04035
$$ y = [2505565, 1851200, 4284333, 2467274, 492323, 620942, 3584686, 1953839, 4605318, 1787097, 3862248, 2426726, 1155847, 2006387, -257814, 3915454, 3567372, 4177934, 2833548, 2522511, 2517399, 4298973, 4213663, 2667656, 3907426, 4462297, 1306873, 2917969, 2729361, 3325858, 4210585, 361298, 1863214, 1323185, 4120850, 3277840, 2758755, 2058851, 2848792, 1869587, 1332132, 3680378, 3531439, 4956849, 3268640, 3610546, 3950350, 2844810, 3395912, 4340035, 3198936, 3348786, 3176232, 1888380, 2835412, 3361357, 1835852, 2949676, 5508401, 2786644, 4224747, 2720065, 4740253, 2353180, 3277384, 3247342, 5673683, 2990898, 2234266, 2850277, 3224109, 4923594, 2579634, 2983669]
5072B983669o0362L006673A825242K084273n69031N89877J360946r47649J374216
5063E717874k722890J586851J248671k294353L63991j21821j452109O57522Q8578
5054C072314j65140j09776K422028j679588m47367A504086K775891J73196A731097
5044C747698n51441Q72091j634274J608859Q57466j566036l60519J165431P10014
5035D849289j525884P91N68356K328837m72712r59520j565322O90721R24693J117487
5025E956736k789570O83646p43565J87063J098543A895728J487075j80522o66617
5016B535664O47467j528989L342142k13299J78474j670559m93128K119163j236182
5007C680753K65436j540057J926563Q9016j543970j292970L316713B392471M898696
$$ y = [2983669, 2923307, 5929980, 1825242, 3909515, 3340484, 3930361, 5291307, 4343658, 5717874, 2994984, 4581835, 5830506, 3536153, 3900144, 3778323, 2326214, 2983736, 3072314, 2907174, 2797398, 5219426, 3539838, 3092471, 1504086, 4279977, 4453173, 1731097, 3747698, 3196257, 4068348, 2434074, 4042933, 4900399, 3334363, 2973844, 4139275, 4849289, 3323405, 3324196, 3892552, 6221389, 5748677, 4789157, 3223835, 3914556, 4839249, 5956736, 3167166, 3850812, 3107247, 3294310, 4392853, 1895728, 3382803, 3202281, 2535664, 3183131, 1654142, 4996284, 4782985, 4961459, 3290900, 2797772, 4916935, 3680753, 3946189, 2406132, 4332695, 4421711, 2877741, 1584771, 4901484, 2392471, 7291167]
4998G291167B840727m90865N73229J332111j045126q89657K203837Q68913A878074
4988B271878K442668M73611k267720K31864m82121n0080J339275n47631R66643
4979D378387p78100n44114l92028O47096J3865P91662M56110B168461O83456r87981
4969A863936o48964K919209B048417J485558p68626J336739Q12606p12718P40310
4960D942286B228934P90582l89833J187100r98669o32104J915482M21525j015040
4951C507977j92028J278253j670915P53163j47858L32634j204834K077831j251829
4942C482394R24150k81680j248725J031777l19029J197572L26869J596123q32019
4933E877432r06545J53609L73432Q6003J664127J191343J87437J87064K966866
$$ y = [7291167, 2840727, 2349862, 2923091, 4255202, 3210076, 2320419, 4524256, 5393169, 1878074, 2271878, 4714546, 5188157, 2920437, 3152301, 2670180, 2620100, 3959375, 3411744, 4378387, 3600287, 3056173, 2664145, 3311241, 3325106, 4116768, 4572878, 2168461, 2851917, 1863936, 1214972, 4134181, 2048417, 3533975, 2765349, 4102088, 4914694, 4201976, 4942286, 2228934, 3019516, 2629683, 3816783, 2818114, 2186010, 4101492, 4523017, 3507977, 3315949, 4594202, 2923287, 3676450, 3528592, 3861226, 2656392, 4734223, 3482394, 4406544, 4124864, 2876139, 3907916, 3588887, 4786459, 5113328, 6709451, 5877432, 4970887, 5124496, 5497928, 5583931, 7248058, 8439401, 8626838, 8813902, 11780768]
4924A1780768j321095k61404R58212k336559k424733K75952L64687j130647j592098
4915D313083m16194K464129B741120J776888A654392Q53366R33119Q61316J59818
4906D462011j788502K452400B336012J678736p92841J41656J473795o14119j121682
4897C101557K04559O6127j488166K622431m02600q4352J05645j108551J455643
4888D472293j22727j771909O41461L314869k558609p08708J806J035081j786347
4879B517210l3088K438386k408852p44740J852761j757360J415197L69150J50692
4870C799356r93923J885373B344504J323304M9716L25730m3834A882569J555272
4861C437841j083391J375141r89059K641630A795234J297593O04835L014236l162063
$$ y = [11780768, 10459673, 10198269, 11156481, 8819922, 6395189, 6671141, 7035828, 5905181, 4313083, 3896889, 6361018, 2741120, 4518008, 1654392, 2507758, 3440877, 4302193, 4462011, 2673509, 5125909, 2336012, 4014748, 3221907, 3363563, 4837358, 4223239, 3101557, 3306116, 3372243, 1884077, 4506508, 4103908, 4019556, 4125201, 3016650, 4472293, 4349566, 2577657, 3219118, 6533987, 3975378, 3266670, 3268476, 4303557, 2517210, 2484122, 4922508, 2513656, 1768916, 3621677, 1864317, 3279514, 3648664, 3799356, 2805433, 4690806, 2344504, 3667808, 3717524, 4043254, 3999420, 1882569, 3437841, 2354450, 3729591, 2740532, 5382162, 1795234, 3092827, 3697662, 6711898, 3549835]
4852C549835J665301q46950j29728o65451n22381J887384r17194K10301K88944
4843D520061j63325P77057j694340N30403j045793q52706K742989q81078R99818
4834D933086j83236k22140j145953n22419J287893j305143M94730J14824k5244
4825C426398K805354k914029K09225M78322J486703k598816R24541N49074p27010
4816C639762l70310J62160O09137J638979q54848L46882p891j086266A845567
4806E568572k72449P28785B126861J257112l25876M85330j402121K163617j182491
4797C122432N12659L57434M70701j495187J178899J127988j209354P63377j065916
4788C763033K243070k352822A489960J564297Q19763L96999p2024j196517K056157
$$ y = [3549835, 5215136, 4368186, 4238458, 3573007, 3050626, 4938010, 4020816, 4231117, 4520061, 4356736, 5133793, 3439453, 3969856, 2924063, 2071357, 4814346, 3933268, 4933086, 4749850, 4527710, 3381757, 2859338, 4147231, 2842088, 3336818, 3451642, 3426398, 6231752, 3317723, 3526948, 4005270, 5491973, 2893157, 3817698, 4366772, 3639762, 3269452, 3431612, 4040749, 5679728, 4824880, 5171762, 5163871, 4077605, 1845567, 5568572, 5296123, 6024908, 2126861, 3383973, 3058097, 3543427, 2141306, 4304923, 3122432, 3635091, 3992525, 4463226, 2968039, 4146938, 5274926, 4065572, 4828949, 3763033, 6006103, 3653281, 1489960, 3054257, 3874020, 4271019, 4198995, 3002478, 5058635]
4779E058635l42001j005539P75328r22653j673276K058082J038874B136072J558024
4770C694096K120351l11561k7899j800208O74829j0168K304874k937365J11602
4761C818551K2624K2668Q77866L27126j458870M36076P26845R42961k237759K27259
4751C705347J628065k40328k52738o9346K157504q97983n06404j304856M97606
4742D716867M11198j777469K013185k484014L393449k26463p41706n28155Q54863
4733E631755k029968J03533J593575j7609p74681j20266R14228q65670L93055
4724D827952j069613J868077j60905j936626P05372q81817K193256K74282k707339
4715C112639J358104j36329l07441L203590l385047N46067M45523q2217k325697
$$ y = [5058635, 4716634, 3711095, 4486423, 3563770, 1890494, 3948576, 4987450, 2136072, 3694096, 5814447, 5502886, 5474987, 3674779, 4349608, 4339440, 6644314, 3706949, 3818551, 3841175, 3863843, 4741709, 5068835, 3609965, 4046041, 4772886, 5715847, 3478088, 3705347, 5333412, 5093084, 4840346, 4771000, 6928504, 6030521, 5524117, 4219261, 4716867, 5128065, 3350596, 5363781, 2879767, 6273216, 6046753, 5305047, 4776892, 5631755, 3601787, 3705320, 5298895, 5281286, 4506605, 4386339, 5300567, 4434897, 4827952, 3758339, 5626416, 5465511, 3528885, 4234257, 3352440, 5545696, 5819978, 3112639, 4470743, 4334414, 4026973, 7230563, 3845516, 4391583, 4837106, 4754889, 2429192]
4706B429192J160865K167427k255572A738441L89600L187676N34827B067504K026259
4697D093763Q51983j783734K966854n42555j123188p53616J477706l88656J19908
4688D918465J254260k475120L16414J319070r23092j067794J591383P43718j028611
4679D648693K309871q06881j141363l20605K713725l040242p94458K038500k001441
4670C605799J902504j122997N67111J728221q57897n6665q93279n6585J170429
4661E986641j194889J659112r08030n37161J192519N14926j422368m30373J023234
4652E883611k00235q43148r714J23482P68460m01182k498935P15957K94950K777201
4642F610447B092171J971946o43973J235449J257651k81819m62652j656886M014689
$$ y = [2429192, 3590057, 5757484, 3501912, 1738441, 2128041, 5315717, 5850544, 2067504, 4093763, 4945746, 3162012, 6128866, 5586311, 4463123, 3709507, 5187213, 4798557, 4918465, 6172725, 3697605, 4014019, 5333089, 4409997, 3342203, 4933586, 5677304, 4648693, 6958564, 6151683, 5010320, 4689715, 7403440, 4363198, 3568740, 5607240, 3605799, 5508303, 4385306, 4952417, 6680638, 5822741, 5766076, 4872797, 4816212, 5986641, 4791752, 6450864, 5542834, 5005673, 6198192, 6713118, 5290750, 4860377, 5883611, 5683376, 4840228, 4830514, 4953996, 5722456, 5321274, 2822339, 3538296, 3833246, 6610447, 2092171, 4064117, 3420144, 4655593, 5913244, 5631425, 5168773, 3511887, 7526576]
4633G526576j978919N90186j93635J255181q37950P37964m36397n19958j81916
4624E961132M68926j237688J546681J960721l312435J791765K312761l583024
4616E908839K480875l109553P41716l69280L67040k604761K806455m12175K69692
4607F078848r69549k193968L468308n64810n905B100110K835724P30564p42645
4598D923753p66345k99972J002473n85013L94544J72011R79995J625717j669508
4589E777655p94063R67701j164523l82047r31923j57909K053111n9395j38236
4580E170371J63467J32809o66117j99422L8497j639964L471609j732055l16111
4571D423084K158886L76099k262884n72715J059360j255894R82777L01417q35154
$$ y = [7526576, 5547657, 6137843, 5944208, 7199389, 6361439, 7099403, 6663006, 6143048, 5961132, 6430058, 5192370, 6739051, 8699772, 5387337, 7179102, 9491863, 5908839, 8389714, 5280161, 6021877, 5652597, 6019637, 3414876, 6221331, 5809156, 6078848, 5109299, 2915331, 6383639, 5818829, 5812924, 2100110, 4935834, 5666398, 4923753, 4157408, 3857436, 4859909, 4274896, 4669440, 4841451, 5821446, 7447163, 5777655, 4983592, 5951293, 4786770, 4404723, 3472800, 3314891, 5368002, 5308607, 5170371, 5333838, 5466647, 4800530, 4601108, 4639605, 2999641, 6471250, 4739195, 4423084, 6581970, 6958069, 4695185, 4122470, 5181830, 3925936, 4908713, 5210130, 4374976]
4562D374976K67202m09443J539635p78125K119797j000895Q15656M71957k838913
4553D561847K879373j490982M2541R42580k924391Q01556J212461P17384k159335
4544D583034p27359K640544j810176J033952J353383k791185O80235J066815m65159
4535E564084K91451J177998j402451K03476O22630m51884M92574j454089J626794
4526F670583j986759K399296M52658k723594J987620J056588j660j107275O22893
4517G370350j827921j017028J560811j502425K996167j204579j300651R36547
4509F011271P5326k269273L366483k197642J074409J142268j005117J89489j659499
4500D727715K597885j648777p90405K299224j188847j236818R72766J143253j001557
$$ y = [4374976, 4642178, 4232735, 5772370, 4994245, 7114042, 6113147, 6928803, 7400760, 4561847, 7441220, 5950238, 5992779, 6935359, 4010968, 4812524, 6024985, 6742369, 4583034, 3855675, 6496219, 4686043, 5719995, 7073378, 4282193, 4962428, 6029243, 5564084, 5855535, 7033533, 5631082, 5834558, 6457188, 6005304, 6497878, 5043789, 6670583, 4683824, 7083120, 7535778, 4812184, 6799804, 7856392, 7854732, 6747457, 7370350, 5542429, 4525401, 6086212, 4583787, 7579954, 6375375, 5074724, 6011271, 6086597, 3817324, 7183807, 4986165, 6060574, 7202842, 6197725, 6387214, 4727715, 7325600, 5676823, 4886418, 7185642, 5996795, 4759977, 5732743, 6875996, 5874439]
4491E874439n21128O85359j123291J167311j802044r19482K584999j819406j086127
4482C040630J325158J324418j493443J080803P65380Q7892Q2792k163146J421579
4473E472063J563339K05624j733597O20155k095706K622693q15623O26106Q74484
4464G339538r54789J675839n53278n44022J754540l278382n45425K72164O92569
4455E858754L801o04571O89029r49372R26955j601214J458561J35259j764248
4446D152954J729998j678029J875921j826964Q69244j110184K369591P04617M65828
4437G552976k895059R21178k30607J41847n34213P70713Q4669j505104J007329
4428E313729j120372L644597j603721k83003J80546k459083J920487m60175j91293
$$ y = [5874439, 5353311, 6038670, 4915379, 6082690, 4280646, 3361164, 5946163, 4126757, 3040630, 4365788, 5690206, 4196763, 5277566, 6042946, 6130838, 6213630, 4050484, 5472063, 7035402, 7241026, 5507429, 6127584, 4031878, 6654571, 5838948, 6465054, 7339538, 6384749, 8060588, 7507310, 6963288, 8717828, 5439446, 4894021, 5166185, 5858754, 5862555, 5257984, 5947013, 4997641, 5924596, 4323382, 5781943, 5917202, 4152954, 5882952, 4204923, 6080844, 4253880, 5123124, 4012940, 6382531, 7087148, 7552976, 4657917, 5579095, 5348488, 5490335, 4956122, 5726835, 5811504, 4306400, 5313729, 4193357, 7837954, 6234233, 5951230, 6131776, 3672693, 5593180, 5133005, 4941712]
4419D941712Q61691J6387p30407L675409l300626K86364N44904N8700J738055
4410H092189N2118l79548N811k34465L87269p3168j091506R58882l855604K172232
4400F034210J459078K82046j182419O05209k669629J972614L36762p46361j10047
4391E981463J419655j775140j651410K912550J85416j540930K187764q17515l83680
4382F518173P62622J083378j734671p77383J6920N43280R22573o41502k03021
4373F490369K43100j131381J970701j91688o96153N85646O97444j605748P12597
4364G074887P17338J64918Q90783j099838j189465j200634M36504K006200j506255
4355F294438Q9837n63088m94762K78600K271220m8666k187791J250350M87563
$$ y = [4941712, 5803403, 5819790, 5089383, 8764792, 5464166, 5750530, 6295434, 6354134, 8092189, 8144307, 7764759, 7770570, 7536105, 7923374, 7850206, 6758700, 7717582, 3861978, 6034210, 7493288, 7775334, 6592915, 7198124, 4528495, 6501109, 6837871, 6091510, 5981463, 7401118, 5625978, 3974568, 6887118, 7072534, 5531604, 7719368, 6901853, 6518173, 7280795, 8364173, 6629502, 5852119, 5869039, 6412319, 7334892, 6693390, 6490369, 6733469, 5602088, 7572789, 7381101, 6684948, 7270594, 7968038, 6362290, 7074887, 7792225, 7957143, 8847926, 7748088, 6558623, 5357989, 5794493, 7800693, 6294438, 6384275, 5821187, 5326425, 5605025, 7876245, 7827579, 5639788, 6890138, 7377701]
4346G377701K113412m518247k22687K66585Q19466J12241L40885n85285Q13907
4337F517978k67901q94626j94486J814485k508242J490325j593190L151193j001729
4328F513807P71935n4598k165232k7318K961741j894665M22515j611424J113932
4319F030693j41742j73239N79408N62200j329797L07377J966712j218124M18063
4310G001551l96131j241665P83385J97517j426241k24706J966621j412430K74103
4301E522004J530812m47531K61498R91263j975625M67290j290297K183291j253456
4292E989249j96724R16579J020101r2261j226628j271062j259529K223340k69915
4283E833150J107553o69804C079873J132700L414098q34287o82309R01620j054228
$$ y = [7377701, 9491113, 4972866, 4750179, 5016764, 5836230, 5948471, 6289356, 5704071, 6517978, 6250077, 5355451, 5160965, 6975450, 4467208, 5957533, 4364343, 7515536, 6513807, 7285742, 7231144, 5065912, 5038594, 8000335, 6105670, 6528185, 4916761, 6030693, 5888951, 5715712, 6295120, 6857320, 5527523, 5834900, 7801612, 6583488, 7001551, 6605420, 5363755, 6147140, 6344657, 4918416, 4693710, 6660331, 5247901, 5522004, 7052816, 6605285, 6866783, 7858046, 5882421, 6349711, 5059414, 7242705, 5989249, 5792525, 6709104, 7729205, 7636944, 6410316, 5139254, 3879725, 6103065, 5833150, 6940703, 6270899, 3079873, 4212573, 7626671, 6792384, 6110075, 7011695, 5957467]
4274E957467n16430M1024j247624R19228j94122J974873q71119J882002l101617
4265D843682M49861q97545K623108j140228j354421K189187m01189N41240j099993
4256E753702N14275J43559O82507l66701m41870P34362L13389k402380J781246
4247F712089M98214q95837M58138L39797k30737p42089o60570n64900J107913
4238F022018J922142j717661J306467J897907l135806N41976j47517K87148j587
4229F975087r07108J984868M34994j562272q44390K584202k67340J802333Q80661
4220A1081035l521552j432364J079035M9301k14535m33366J755544N99020p00369
4211H261749K26627r17574J426576K62223p09156K099020m075357K235756J760125
$$ y = [5957467, 5441037, 5482061, 4234437, 5153665, 4959543, 6934416, 6063297, 7945299, 4843682, 5293543, 4395998, 7019106, 5878878, 4524457, 6713644, 6312455, 6853695, 5753702, 6267977, 6411536, 7094043, 6727342, 6285472, 7019834, 7333223, 4930843, 6712089, 7210303, 6314466, 6772604, 7112401, 6881664, 6139575, 5479005, 4914105, 6022018, 7944160, 6226499, 7532966, 9430873, 6295067, 6837043, 6689526, 6976674, 6975087, 6067979, 8052847, 8487841, 6925569, 6081179, 8665381, 8398041, 10200374, 11081035, 7559483, 6127119, 7206154, 7255455, 7040920, 6607554, 8363098, 8962118, 8261749, 8488376, 7570802, 8997378, 9259601, 8550445, 10649465, 6574108, 8809864, 10569989]
4202A0569989k374224J889598q19054Q0078j601718J266340J79521J15680j14938
4193I191272k98396K13233N93657p2025P58701J607959o66111j802314J756016
4184A1281992l91786J114939k737990J536974l07208P22867m00568P76457L43701
4175A1939378n01968k9955P05341k778097J164376o87601R71527n94684M35489
4166A0623806k813166j57957J494036j980485K06404P7969J103598j233206k112244
4157E208755K242302J60479N42705j361514M39593J679272j667556K830411l139640
4148F934807L128327j127350j926256R87158j10047J79318l20770o86834p950
4139G050403O35895m11927P20740k53832J381060j984651r38008K678459r45195
$$ y = [10569989, 8195765, 10085363, 9266309, 9346387, 7744669, 9011009, 9190530, 9306210, 9191272, 8892876, 9106109, 9699766, 9627741, 10386442, 11994401, 11328290, 9525976, 11281992, 10890206, 12005145, 9267155, 10804129, 10496921, 11219788, 10819220, 11595677, 11939378, 11437410, 11407455, 12112796, 9334699, 10499075, 9811474, 10783001, 10188317, 10623806, 7810640, 7652683, 9146719, 7166234, 7372638, 7450607, 8554205, 7320999, 5208755, 7451057, 7611536, 8154241, 6792727, 7232320, 8911592, 7244036, 10074447, 6934807, 10063134, 8935784, 7009528, 7996686, 7886639, 8065957, 7745187, 7058353, 7050403, 7686298, 7274371, 7995111, 7741279, 9122339, 7137688, 6199680, 8878139, 7932944]
4130G932944j016733J023400M1194j756444K242719j457782J357733k493901J616504
4121G489634K022930J165591J50269K48872k160753R18951J348190k702756J23818
4112H604746J104398J290629o81763J53498n61837m57089K775939j082711j235902
4103I909908n77626M26899k25887l40824k325610K653591j574818J1473843I524751
4093H816235O55238J03155q56660K333998r79387j636909J96856l00075j259187
4084G073264O1264M92700j6468j379365K610079L46627k658671K449968k58209
4075H721189o44457l72243K376889j449242l181474K745932j28529j744187J580279
4066G904157j513693p0577O55109Q99658K682023l146362j606011J366913o80639
$$ y = [7932944, 6916211, 7939611, 7980805, 6224361, 8467080, 7009298, 8367031, 5873130, 7489634, 9512564, 10678155, 10828424, 11077296, 8916543, 9835494, 11183684, 8480928, 8604746, 9709144, 10999773, 10318010, 10471508, 9909671, 9452582, 12228521, 11145810, 9909908, 9332282, 9759181, 9533294, 9192470, 6866860, 9520451, 7945633, 19419476, 9524751, 8816235, 9471473, 9574628, 8717968, 11051966, 10072579, 8435670, 8632526, 8332451, 7073264, 7134528, 7627228, 7610760, 6231395, 8841474, 9188101, 6529430, 8979398, 8721189, 8076732, 7704489, 10081378, 8632136, 5450662, 8196594, 8068065, 6323878, 7904157, 6390464, 6319887, 6974996, 7874654, 10556677, 7410315, 5804304, 7171217, 6490578]
4057F490578N42611J144051k93489j489718L313919j59349k380320N13590o39162
4048G042711O41233K290874k157108O2011J603322j159373K61884O46923K516205
4039A1748682j788505l66550m16854r79872J960457K96240J57441n22670j55491
4030I932878J175467L34197m43808O75830J385618k858733J226551L31129K304464
4021A4063593j472639o73070J882912j700585J653769J049281J023225k083112
4013A3743374K561654q69104J812544J56079j580931K697391k892790M807507
4005B0435724l76278j826676r5566J007680J854808K225676m308488L04404O4526
3996A9285810j1734j877586K846490j410314L07406q44358J76876n61726p0654
$$ y = [6490578, 7033189, 8177240, 7883751, 6394033, 9707952, 9548603, 7168283, 7681873, 7042711, 7683944, 9974818, 7817710, 7879721, 9483043, 8323670, 8585554, 9232477, 11748682, 9960177, 9593627, 9176773, 8196901, 10157358, 10453598, 10611039, 10088369, 9932878, 11108345, 11442542, 10998734, 11674564, 13060182, 10201449, 11428000, 11759129, 14063593, 12590954, 11917884, 13800796, 12100211, 13753980, 14803261, 15826486, 13743374, 16305028, 15435924, 17248468, 17404547, 15823616, 18521007, 15628217, 20435724, 20059446, 18232770, 18137204, 19144884, 20999692, 23225368, 18916880, 19221284, 19285810, 19274076, 17396490, 20242980, 18832666, 19140072, 18295714, 18472590, 17910864, 17840210]
3987A7840210o21762l3780k025205l080868J352267k695823J23575N32529m08587
3978A0982556k293760O02983P62600k255399j256689M394751j298709j93377j649515
3969G795441k477585M979365p15678L76803q72072J417377j089758J89106j031261
3960H571738N35605n86983J761366Q90062k093371r5737k244011L168093L41976
3951A0248738P35053k431995K012566J120432k642279j828930K817692q97417
3943I133860p75852K029072q8764j122624K6505j770393K725494j002325q81852
3934H273121P31537J533869j652676o41836Q64099L90108j618965J524624j646718
3925G757163P20433K70166R55861j539607Q74092j18410q17170k16128J097875
$$ y = [17840210, 17218448, 17184668, 15159463, 12078595, 13430862, 10735039, 10858614, 11391143, 10982556, 8688796, 9291779, 10054379, 7798980, 6542291, 10937042, 9638333, 9444956, 7795441, 5317856, 10297221, 9581543, 9958346, 9086274, 10503651, 9413893, 9602999, 8571738, 9107343, 8520360, 10281726, 11171788, 9078417, 8982680, 6738669, 9906762, 10248738, 10983791, 8551796, 10564362, 11684794, 9042515, 7213585, 10031277, 9133860, 8358008, 10387080, 10298316, 9175692, 9202197, 7431804, 10157298, 9154973, 8273121, 9004658, 10538527, 8885851, 8244015, 9108114, 9498222, 7879257, 9403881, 7757163, 8477596, 8747762, 9703623, 8164016, 9038108, 8919698, 8102528, 7886400, 8984275]
3916H984275j386211Q06873M9415Q39326n81585K589861l719546P33768P47914
3907I064090Q92584q64872j37478L102745m607434O21088K294404j218541O41653
3898I788239J976423j290728J25068K42431k67420r01415j482875p51720M046874
3889A1484877j818235K63964l13521j010310Q3590J488530P58446k834534L540231
3880A1643038j150672p04623M37797L94737J203688l525376J478631J672274J672144
3871A3121638l421885Q04753K054572j916997K1405o86605k28063J248377R90504
3862A1987699Q2950M24115n27859J843215m6917o35308J518565j403939q6623
3853A3155898l60115N94593J718889l24737J192484k8891O34078j225895Q70052
$$ y = [8984275, 7598064, 8404937, 8454352, 9293678, 8712093, 11301954, 7582408, 8316176, 9064090, 9956674, 9091802, 8954324, 12057069, 7449635, 8070723, 10365127, 9146586, 9788239, 11764662, 10473934, 10599002, 10841433, 10574013, 9672598, 8189723, 7438003, 11484877, 9666642, 9930606, 9617085, 8606775, 8690365, 10178895, 10937341, 8102807, 11643038, 10492366, 9787743, 10225540, 10620277, 11823965, 8298589, 9777220, 11449494, 13121638, 9699753, 10504506, 12559078, 10642081, 10663486, 9976881, 9748818, 10997195, 11987699, 12070649, 12494764, 11966905, 13810120, 13763203, 13127895, 14646460, 13242521, 13155898, 12795783, 13390376, 15109265, 14784528, 15977012, 15948121, 16582199, 15356304, 16226356]
3844A6226356K16358J295869J22999O94570J594946N48502j235646n52676J667404
3835B0578682O08602R97380j587168K169456N07522L46078K131226j675858L633908
3826B7709828k794926L723062l29172K15480L662213j637699J875083L362268
3818C5786137j049279N58128N08439K111033K64207J259252K499716J240051Q58105
3809D4035789K668452K427172K245475J788072K327181N642819K709536N566739
3801F9411235Q16705m75281o738227q744295r471020n749124n938246m054690
3793B9057057k507115o776554o1282k418812N72930l649383Q08709j572647Q6942
3784A3539845J199328j520453o74810K292727q62813L76783o27314O71853k891894
$$ y = [16226356, 16442714, 17738583, 17861582, 18556152, 20151098, 20699600, 19463954, 18911278, 20578682, 21187284, 22184664, 20597496, 22766952, 23274474, 23620552, 25751778, 24075920, 27709828, 24914902, 28637964, 28308792, 28524272, 32186485, 30548786, 32423869, 35786137, 34736858, 35294986, 35803425, 37914458, 38178665, 39437917, 41937633, 43177684, 44035789, 46704241, 49131413, 51376888, 53164960, 55492141, 61134960, 63844496, 69411235, 70227940, 69752659, 63014432, 54270137, 44799117, 39049993, 33111747, 29057057, 26549942, 19773388, 19712106, 17293294, 17866224, 14216841, 15025550, 13452903, 13539845, 14739173, 13218720, 12543910, 14836637, 13973824, 14350607, 13723293, 14395146, 11503252]
3775A1503252K354280j713122K285747p39985O21467P75299j695196p39227r8284
3766A2554231J463001N9309j997424K172532j756768j71576R17045p81754p53026
3757A1705570q66675K059169j335873J55365K35849j766832P48305Q01134J101806
3748A2837818m63422j520539K912714j256500J481060N7743m105065J063087K401857
3739A3408753j950943K473878j116034k30160K045596j920139o81672Q58515R38976
3730A3826770m54527M16967r18800R95536J097515m19518k243140J475720P62519
3721A4539042j177880J550516K033416P69024M38664M464j177628J498570J05178
3712A8583366j880986l83008r67760o58085J643421l78857K58413n27960K249750
$$ y = [11503252, 13857532, 12144410, 14430157, 13690172, 14311639, 15086938, 13391742, 12652515, 12554231, 14017232, 14076541, 12079117, 14251649, 12494881, 12323305, 13240350, 12458596, 11705570, 10838895, 12898064, 11562191, 11717556, 11953405, 10186573, 10934878, 11736012, 12837818, 12374396, 10853857, 13766571, 12510071, 13991131, 14048874, 9943809, 11006896, 13408753, 11457810, 13931688, 12815654, 12585494, 14631090, 12710951, 12029279, 12887794, 13826770, 13372243, 13789210, 12870410, 13865946, 14963461, 14543943, 12300803, 13776523, 14539042, 13361162, 14911678, 16945094, 17714118, 18152782, 18157246, 16979618, 18478188, 18583366, 16702380, 16319372, 15351612, 14693527, 16336948, 15958091, 16216504, 15688544, 17938294]
3703A7938294Q52692k801912R42784r30092L216468j972140J310810J031328l253416
3694A6334816K929355n92128j407181N14981J713359o40958J608942L447556K311155
3685B6219897K003427L867p87185k867734j780434k870090O42298j573132j152156
3676A7838758J345918j12850j159884Q21248P82400l01542j084420n26253R08515
3667A8511890j84106M561070l296608Q06800k045428J586646l156544K117480
3659A8901200j328338L014312m41540K053022j092396k08654J584552J643191
3651B4125349k31033Q03928k399304J572600j206190N60664l11499J465881J072650
3642B5453046M8645K547273K367174J854758J943929J313333L216579K926044
$$ y = [17938294, 18790986, 15989074, 16931858, 16001766, 19218234, 17246094, 18556904, 19588232, 16334816, 19264171, 18672043, 17264862, 17779843, 19493202, 18852244, 20461186, 23908742, 26219897, 28223324, 28227191, 27440006, 24572272, 22791838, 19921748, 20564046, 18990914, 17838758, 19184676, 19071826, 17911942, 18733190, 19515590, 19214048, 18129628, 17603375, 18511890, 18327784, 22888854, 19592246, 20399046, 18353618, 19940264, 16783720, 18901200, 17572862, 20587174, 20145634, 22198656, 21106260, 20897606, 22482158, 24125349, 23894316, 24698244, 22298940, 23871540, 22665350, 23226014, 22914515, 24380396, 25453046, 25501691, 28048964, 30416138, 32270896, 34214825, 35528158, 38744737, 41670781]
3634D1670781K736032J167780K143967L999056M008496R99672K051240N517924
3626F4294948L804744Q88152M001967L014505J551280N656279L669743M007040
3618I0888658M221296M874696N457728P04472p67456r130224j3226039j7448883
3610F5574248j2823739q790080p618359m357831m412366j684012j397831N46846
3602B5036876j573162j940044O46656k027724j286904J613904j441174p65255
3594A8263173k00903J173232j037766K14612k150862J253443M85231O44422p01764
3585A7942818J992394j572760n01296k092854K780802k284976L39955N05957R39881
3576A8049921k30551J154210j071113N73937k162189N30611R49958j24866N43260
$$ y = [41670781, 44406813, 45574593, 47718560, 51717616, 55726112, 56725784, 58777024, 64294948, 68099692, 68987844, 72989811, 76004316, 77555596, 83211875, 86881618, 90888658, 95109954, 99984650, 105442378, 106146850, 105379394, 96249170, 83023131, 65574248, 52750509, 43960429, 36342070, 31984239, 27571873, 25887861, 24490030, 25036876, 23463714, 21523670, 22170326, 20142602, 18855698, 20469602, 19028428, 18263173, 18062270, 19235502, 18197736, 18412348, 16261486, 17514929, 18000160, 18644582, 17942818, 19935212, 18362452, 17861156, 15768302, 18549104, 16264128, 16604083, 17110040, 18049921, 17819370, 18973580, 17902467, 18476404, 16314215, 16844826, 17794784, 17669918, 18213178]
3567A8213178j936304L65973P03475J710340j804812J236606J139970k665502
3559A6962924K438596p91272L27227j14571n26722n46176K181780j700924J098868
3550A9329730L04074K83388j034415J719599k599082M084712j76306k491232n02740
3541A8917728M333958k630664R09904p08430r0030L028564k984948K605602r87107
3532B2394577P9559j098566J829218J627432Q5998k236830R11838J425276k202188
3523B2816314M88774J182918k629706M195674k366410n84891K668813j909616
3515B3861870J185333K20439k99846J914633L71580Q88832j899738L09869K958642
3506B9511614k505392J221106J767703l55989L12859j025885k22174K164556j745998
$$ y = [18213178, 16276874, 16642847, 17346322, 19056662, 17251850, 18488456, 19628426, 16962924, 19401520, 18610248, 18937475, 18822904, 18296182, 17750006, 19931786, 18230862, 19329730, 19633804, 19917192, 18882777, 20602376, 18003294, 22088006, 21911700, 19420468, 18917728, 23251686, 20621022, 21530926, 20822496, 20732466, 23761030, 20776082, 23381684, 22394577, 22474136, 21375570, 23204788, 24832220, 24918218, 22681388, 23593226, 25018502, 22816314, 23305088, 24488006, 21858300, 26053974, 23687564, 23102673, 25771486, 23861870, 25047203, 25267642, 24967796, 26882429, 27254009, 28142841, 26243103, 26552972, 29511614, 27006222, 28227328, 29995031, 29639042, 29951901, 28926016, 28703842, 30868398, 29122400]
3497B9122400M83710J118434J251398k90730J161967j105788K40449K163461l44952
3488C3800349K962060m72684R9064K290824j012032J614148K003788o95808M178243
3479D4767952q19055J274156K750864L82859n95875K570808K075147n48919K545555
3470E4403492J935684L194676q35176K898300K383660K977724J890187J902968
3462G0751515K249552K412233M226647K469232P065264K956248N631880N764839
3454A03527410R396464P589551P139088R919495P949361J2229742J0393152J5934143
3446A84078406J2850640J5178302K1012816K2585774K4052768K8650526L4438271
3439C42847503M3042621M4667646O2535517P5358845R7791483J33423482J81565879
$$ y = [29122400, 29606110, 30724544, 31975942, 31685212, 32847179, 31741391, 31981840, 34145301, 33800349, 36762409, 36289725, 36388789, 38679613, 37667581, 39281729, 41285517, 40589709, 44767952, 43948897, 45223053, 47973917, 48356776, 47760901, 50331709, 52406856, 51857937, 54403492, 56339176, 59533852, 58698676, 61596976, 63980636, 66958360, 68848547, 70751515, 73001067, 75413300, 79639947, 82109179, 89174443, 92130691, 97762571, 103527410, 112923874, 120513425, 127652513, 137572008, 145521369, 157751111, 168144263, 184078406, 196929046, 212107348, 233120164, 255705938, 279758706, 308409232, 342847503, 385890124, 430557770, 493093287, 568452132, 666243615, 799667097, 981232976]
3432I81232976K48804724L17345138L18898544J81161976o7615869k99869681
3426A679957808l89624302l53779056k69526898j89029176j28508953q7983372
3420B61506051n9774237m1195343l0367958k0268335j5944560j4129927q706743
3413G1118948n475356r340748o208495m675864j893025o313659j778896n193248
3405C0239657Q07210o9227m424857q59025j929036J634286k929935o06449j905962
3396A9956662L25326k756386M92810o31046m87454j921024N42383K41856m6256
3387A5716871k011691j092104J649515k154513k183566J918128M09887m80688
3379A1771839j581709J523646o28052K05175K320656k843993k31602q51878q43069
$$ y = [981232976, 1230037700, 1547382838, 1866281382, 2047443358, 1979827489, 1679957808, 1290333506, 936554450, 667027552, 477998376, 349489423, 261506051, 201731814, 160536471, 130168513, 109900178, 93955618, 79825691, 71118948, 65643592, 56302844, 50094349, 45418485, 43525460, 37211801, 35432905, 30239657, 31046867, 30977640, 26552783, 25693758, 23764722, 25399008, 22469073, 21862624, 19956662, 20281988, 17525602, 18018412, 17387366, 16899912, 14978888, 15521271, 15763127, 15716871, 13705180, 12613076, 14262591, 12108078, 9924512, 11842640, 12252527, 11771839, 10190130, 11713776, 11085724, 11290899, 13611555, 10767562, 10535960, 9684082, 8841013]
3370H841013N52065n5100R69787l75957o57908l0810j35017M02875j216935J152843
3360I446856N27703k392595q29635R79175P47220q18371k121604N04972j335234
3351D708487J111817P67118j234144J330409M93893j628674J21929J748220k561350
3342D857705L500774l983388J372225k43113k127851K443188j148865J038649
3334E709324o22358Q83725j347133n68426J185114J237018j382440l96160O94793
3325E393457n55360j169540J605860p73892j209084M024906k905327J623883J050289
3316G085192j205687Q39220j282313M02394K004312j931410R96694K864530k829911
3307F943021J77764L93096P95761P04301K52540R05404M63456Q47906p92961J824242
$$ y = [8841013, 9393078, 9337978, 10307765, 9931808, 9273900, 9243090, 9108073, 9510948, 8294013, 9446856, 9974559, 7581964, 6752329, 7731504, 8478724, 7660353, 5538749, 6043721, 4708487, 5820304, 6587422, 5353278, 6683687, 7177580, 5548906, 5670835, 7419055, 4857705, 8358479, 4375091, 5747316, 5504203, 3376352, 5819540, 4670675, 5709324, 5086966, 5970691, 4623558, 4055132, 5240246, 6477264, 5094824, 4698664, 5393457, 4838097, 3668557, 5274417, 4500525, 3291441, 7316347, 4411020, 6034903, 7085192, 5879505, 6718725, 5436412, 5838806, 7843118, 5911708, 6908402, 9772932, 6943021, 7120785, 7513881, 8309642, 9013943, 9266483, 10171887, 10635343, 11483249, 10690288, 12514530]
3297A2514530p73934J094227Q11298J51128k5045J577989J610282M27159J77902
3288A7565536K785766P66702L19570n74966K355178M06489K167407j493568J798202
3279B6096316Q86031j200596L578393Q12477M36986k85931L3974J126524K226539
3270C3710713M075968n90568J855824P3928n18799L626987R20828j500716J220284
3261D2874449L023995n49699J741008J70392M597339M26213P68799J047236L475520
3252E7575252P59420M133425O33247L851991K867485O43679L359129J803247J648496
3243G7275371J452344j920799o320192j0692616q232791o224220p262592j948496
3235C6126009o340804j434433l803239j471784j635317l816892o51364k567883
$$ y = [12514530, 11740596, 12834823, 13646121, 13797249, 13772204, 15350193, 16960475, 17387634, 17565536, 20351302, 21118004, 21437574, 20862608, 23217786, 23624275, 25791682, 24298114, 26096316, 26982347, 25781751, 29360144, 30172621, 30609607, 30323676, 30357650, 31484174, 33710713, 37786681, 37196113, 39051937, 39125865, 38607066, 42234053, 43154881, 41654165, 42874449, 45898444, 45348745, 47089753, 47260145, 51857484, 52283697, 53052496, 54099732, 57575252, 58334672, 62468097, 63101344, 66953335, 69820820, 70464499, 73823628, 75626875, 77275371, 78727715, 76806916, 70486724, 59794108, 51561317, 45337097, 38074505, 36126009, 29785205, 28350772, 24547533, 23075749, 21440432, 17623540, 16972176, 14404293]
3227A4404293q9597m584583M131084k478596J242082k90007j48814j328407J447620
3218A2305075j284149j268627m84854R13633P75630k651804K280271k146019Q72097
3209I311253J518188j443277j177555K085217m8571o53812O38441j425204R57509
3200I762189R47963j455220M16551n87451Q4316Q18863n09275O62714Q33403r33559
3190A0040494J254198l55902J606293j710817o37052J715498k228041N42076j806375
3181H420372n45100k62390K479267J45055j149192O08659j594349K012003j443589
3172H670736M80216M64008O5193m53937J553212J271213p46858J932073n32088
3163A2703768j557883M12001K560005j374176K181856R1547p67852N4923J376777
$$ y = [14404293, 14314696, 9730113, 13861197, 11382601, 12624683, 12334676, 12185862, 10857455, 12305075, 11020926, 9752299, 9267445, 10181078, 10956708, 8304904, 10585175, 8439156, 9311253, 10829441, 9386164, 8208609, 10293826, 10245255, 9591443, 10229884, 8804680, 9762189, 10710152, 9254932, 9671483, 9084032, 9168348, 9987211, 9477936, 10140650, 10974053, 10040494, 11294692, 10938790, 12545083, 10834266, 10197214, 11912712, 9684671, 10226747, 8420372, 7875272, 7612882, 10092149, 10237204, 9088012, 9696671, 8102322, 10114325, 8670736, 9150952, 9614960, 9680153, 9226216, 10779428, 12050641, 11303783, 13235856, 12703768, 11145885, 11557886, 14117891, 12743715, 14925571, 15017118, 14249266, 14304189, 15680966]
3154A5680966J387665j189656k237180J490142M64593j136400M98614j345657
3146A3613087k80329k74994K72809o85010l54504q08643J281268j336892P74344
3137A2201136l457935M56505n32611J920134m31782j503690K00167j145798L76414
3128H082540J846036j166269J6866P39740R3563j110179q48364J960316k100660
3119G513589J795133J090269j82643J660041n74481J534844m521720J161540N245551
3110A4722123j906141j55655P59127J934111j493138k231478K275485r81324M054402
3101A6977512j677981j676031K642343j879531K810630l062977J026135j90402
3093A4969698L311258m545569K613508j922631J422791J63526K851427J978184
$$ y = [15680966, 17068631, 15878975, 13641795, 15131937, 15596530, 14460130, 14958744, 13613087, 13332758, 13057764, 13330573, 12645563, 12291059, 11482416, 12763684, 11426792, 12201136, 8743201, 9199706, 8667095, 10587229, 10155447, 8651757, 8851924, 7706126, 8082540, 9928576, 8762307, 8779173, 9518913, 9612476, 8502297, 7653933, 9614249, 7513589, 9308722, 10398991, 10216348, 11876389, 11301908, 12836752, 8315032, 9476572, 14722123, 12815982, 12660327, 13419454, 15353565, 13860427, 11628949, 13904434, 12923110, 16977512, 15299531, 13623500, 16265843, 14386312, 17196942, 14133965, 15160100, 14969698, 18280956, 13735387, 16348895, 14426264, 15849055, 16012581, 18864008, 20842192]
3085B0842192o65750J651258R20692j567136J302894M276726l10806M121945O69020
3076C1241035N93735K794868J972048J128095L684544N237279q34992K111612
3068D7928224J221089J664612M013031M97860M374980o77908J995176M074303
3060F5091367N597533L942712L601568R91455k47192m081712p066455o831892
3052F0997384q597035n884809q573123m711458n782247l148692l030942l239644
3044A8029434L47624l043647l99559q30116j108856j605222O55300K494461l233543
3035A1305876m70228P35770o42629j770356J547660J025821r87970M20169j055124
3026A0108989o88914K016999r14740J41751k14919J116477O55657m00901j305808
$$ y = [20842192, 20176442, 21827700, 22748392, 21181256, 22484150, 26760876, 26450070, 30572015, 31241035, 31834770, 34629638, 36601686, 37729781, 41414325, 46651604, 45816612, 47928224, 49149313, 50813925, 54826956, 55324816, 59699796, 59021888, 61017064, 65091367, 70688900, 74631612, 78233180, 79224635, 78977443, 74895731, 67829276, 60997384, 52400349, 46515540, 37942417, 33230959, 27448712, 24300020, 21269078, 18029434, 18377058, 15333411, 14933852, 14103736, 12994880, 11389658, 12044958, 14539419, 11305876, 10835648, 11571418, 10928789, 9158433, 10706093, 11731914, 10743944, 11164113, 10108989, 9420075, 11437074, 10522334, 10664085, 10449166, 11565643, 12221300, 11820399, 10514591]
3017A0514591J753232K06888m45346K446748j09123K560073L300511L5576J0780016
3008C1043166J3140267N82308q556971J871635J378245q447031j1473740q074900
3000A1462979l621794J767277j928056n53553j178291J116039j625108J589083
2992G028576j27388O1273j9851Q91228L73630j727283J830288n98095k382340
2983E330038N39337L99653j044868P78043J952820r30786K04677k440004K729601
2974G518511O73375o99123O78679j383780k47298q7775O49352j029702O25070
2965F697309k012554P95225K10828j348733J79039J540735l69550J316145k182373
2956D826071J367105J57340j282967R67338J971302k873307J378981j015940j677178
$$ y = [10514591, 12267823, 12474711, 12029365, 14476113, 14366990, 16927063, 20227574, 20263150, 31043166, 44183433, 44765741, 36208770, 38080405, 39458650, 31011619, 19537879, 11462979, 7841185, 9608462, 7680406, 7126853, 5948562, 7064601, 5439493, 7028576, 6901188, 6962461, 6942610, 7833838, 8207468, 6480185, 8310473, 7712378, 5330038, 5869375, 6269028, 5224160, 6002203, 7955023, 7024237, 7228914, 4788910, 7518511, 8191886, 7492763, 8171442, 6787662, 6540364, 6452589, 7101941, 6072239, 6697309, 4684755, 5479980, 5690808, 4342075, 4521114, 6061849, 5692299, 7008444, 4826071, 6193176, 6350516, 5067549, 6034887, 8006189, 5132882, 6511863, 5495923, 3818745]
2947C818745J280582O60249j556895k75197L54693O53451J01896J599382O66634
2938G303540j217574R3113j57912p21310M16374m57119r97128L442997k348101
2929E356880J18052K310975j759489l5245K770076k452604j374809K731522J055605
2920H720963j334452r02578l85171K096454K12389l15281K036989l468983K518795
2911I179125j283138m21200J435181j660762K781768j507835K474585q73941J180684
2902A1304467j353637J713981j162090K013712j784951J778709J39997M53993
2894A3104181K17453L78493k375007Q22146P90530J700779n40095K103707q24680
2885A5377507k22349L60558N11373L45191K30785j315041K363206k404846o68971
$$ y = [3818745, 5099327, 5759576, 4202681, 3927484, 4282177, 4935628, 5037524, 6636906, 7303540, 6085966, 6179079, 6021167, 5299857, 5716231, 5259112, 4261984, 7704981, 5356880, 5474932, 7785907, 6026418, 5991173, 8761249, 6308645, 4933836, 7665358, 8720963, 7386511, 6483933, 6098762, 8195216, 8407605, 8092324, 10129313, 6660330, 9179125, 7895987, 7474787, 8909968, 7249206, 10030974, 8523139, 10997724, 10123783, 11304467, 9950830, 11664811, 10502721, 12516433, 10731482, 12510191, 12650188, 13104181, 13321634, 13700127, 11325120, 12147266, 12937796, 14638575, 14098480, 16202187, 15377507, 15155158, 15515716, 16027089, 16372280, 16603065, 15288024, 17651230, 15246384, 14577413]
2876A4577413K979500j919749L359462p89446j167196j584035P2605R22294j681112
2867A4769736P13096l045316M173223l231543k256530K007784l493711N05508
2859A0142247r52762J134274P1728j545242J506024k861231l21891j05132J875383
2850H943398j326506J377826k968959L14259K588477j429071J838671j589322
2842G748773r03683K966591n67920k242809J771538K50808o6223k261808L10971
2833G006238O59145j69121P79277o14924r46563K578568l3280n01400m09916l0118
2823H317906p05373J000585J874428j109809k488996J229699L84955m41683j563186
2814F498526J549851L560k49741J158435P65830o79988j914563j98346J218347
$$ y = [14577413, 17556913, 15637164, 18996626, 18207180, 17039984, 15455949, 15528554, 16450848, 14769736, 15482832, 12437516, 16610739, 13379196, 11122666, 13130450, 9636739, 10142247, 9189485, 10323759, 10395487, 8850245, 10356269, 7495038, 7173147, 7068015, 8943398, 7616892, 8994718, 6025759, 6340018, 8928495, 7499424, 9338095, 7748773, 6845090, 9811681, 9243761, 7000952, 8772490, 9023298, 8957075, 6695267, 7006238, 7665383, 7496262, 8275539, 7660615, 6714052, 9292620, 9259340, 8757940, 8348024, 8317906, 7612533, 8613118, 10487546, 9377737, 6888741, 8118440, 8503395, 8061712, 6498526, 8048377, 8051937, 7802196, 8960631, 9726461, 9046473, 7131910, 6933564, 8151911]
2805H151911J826226r89730J39574Q83159J52039j176733q18865K092607M00542
2796A0660730J025780N0177K340194J32513K891286K611322J1126779K1263007
2788E2101788J6306672j9578539j9978867j0616066o061044j702239j950925L15257
2780H836037l426614J698127r50926Q5291Q69792j56424l153754J661511J72691
2771E635731K23355J769601j388183j222681L757822l301419m81953N97517l01677
2762E288113J566888j175808J918260j441607J531806n28222L73640m58808j182840
2753E891422j31175J163537J409384j695468n36575J023514J692460k856998J025821
2744F985922j047389P55660k132494J071273J404823j953835Q70778Q16886p53052
$$ y = [8151911, 9978137, 8988407, 9127981, 10011140, 10163179, 8986446, 8167581, 10260188, 10660730, 11686510, 11736687, 14076881, 14209394, 17100680, 19712002, 30838781, 52101788, 68408460, 48829921, 28851054, 18234988, 12173944, 10471705, 8520780, 8836037, 5409423, 7107550, 6156624, 6241915, 7111707, 6955283, 3801529, 5463040, 5635731, 5859086, 7628687, 6240504, 5017823, 8775645, 5474226, 4992273, 5589790, 5288113, 6855001, 5679193, 7597453, 6155846, 7687652, 7159430, 7533070, 7074262, 5891422, 5760247, 6923784, 8333168, 6637700, 6101125, 7124639, 8817099, 5960101, 6985922, 5938533, 6694193, 4561699, 5632972, 7037795, 5083960, 5954738, 6771624, 6018572]
2735F018572k76406k37750J964398o96019p9364j330357J063739K61735J379317
2726H067865j574316l9858J702149O3196K27145J23881k77602O64918P57223k49978
2716I464623j200542J773310j412298J793553J77671j314489J251333L541773
2708A4074934j471607K898306m40145K083682J112558J383200M083766P807316
2700C1532010J4741943K8145578J5014888k0169983k7368347j4495897o282920
2693B1117272J463470j007462N913120R211425K1370243j370616j7683159j3583535
2685B5430758l720528r36700K265955P355353J7757679K4906846K617120k4923318
2677E0753165k1592887o435547m334093J505590K511040J0147106J9483670J536877
$$ y = [6018572, 5742166, 5504416, 7468814, 6772795, 6693431, 5363074, 6426813, 6688548, 8067865, 6493549, 6453691, 8155840, 8219036, 8446181, 8570062, 8292460, 8957378, 9714601, 9464623, 8264081, 10037391, 8625093, 10418646, 10596317, 9281828, 10533161, 14074934, 12603327, 15501633, 15061488, 17145170, 18257728, 19640928, 23724694, 31532010, 46273953, 74419531, 89434419, 69264436, 41896089, 27400192, 21117272, 22580742, 21573280, 27486400, 36697825, 58068068, 56697452, 39014293, 25430758, 21710230, 20773530, 23039485, 30394838, 48152517, 73059363, 75676483, 50753165, 29160278, 22724731, 18390638, 19896228, 22407268, 32554374, 52038044, 53574921]
2669E3574921j8060371j5467990o892380k026781J290840O37229N602965O796207
2661B5454640L504680r528330r455902m85854D567196R23055K68399J189021k064240
2652D883431J641260k156943J347701L18072N39674r03285n02570M62627J926764
2643G556731j262219O72185L133725K85637j44505L392443k591768j614486l32107
2634I095636l3014k432159J546823j38203l44055j551265J204637l471014M006084
2625G883470l154930l59154r86826O71897l00037J249578j295603K977170k725313
2616C960252M63751N73307j289237q01745J329361Q55590p11931J967859j291469
2607E055738J663208j145680J739158j879837O03109K00809j483225J07893r71504
$$ y = [53574921, 35514550, 20046560, 13154180, 11127399, 12418239, 13055468, 18658433, 25454640, 28959320, 19430990, 9975088, 9489234, 4567196, 5490251, 5758650, 6947671, 4883431, 6524691, 4367748, 5715449, 6033521, 6573195, 5669910, 5167340, 5629967, 7556731, 6294512, 6966697, 10100422, 10386059, 10241554, 13633997, 11042229, 9427743, 9095636, 9062622, 6630463, 8177286, 8039083, 7695028, 6143763, 7348400, 3877386, 7883470, 4728540, 4369386, 3382560, 4054457, 3754420, 5003998, 3708395, 6685565, 3960252, 4424003, 4997310, 3708073, 2906328, 4235689, 5091279, 4379348, 6347207, 5055738, 6718946, 5573266, 7312424, 5432587, 6035696, 6236505, 4753280, 4861173, 3889669]
2598C889669m04537J160892j575187m19244p01346L705613o99177B100205J423548
2589C523753m59815J284327p14792o9829r57817J033687j36170Q21212j986772
2580B337784p72996M160069p43700Q70280B737656K367369j032198R14391j056683
2571C930535K498417B830535K97525J105465J61109j184858J337538j515050L59700
2562C391964R9092P41206j126206K498289B574005J910365J63000n07678r91952
2553C147740J772270m70086K90906j033505N20799o17007J073422K130099j749382
2544E065256m36068p93113K294632j11863j659071J008489L26779j520872O86597
2535D860766R85707j726786J606997p37981K053330k981947J278572L60163j034045
$$ y = [3889669, 3485132, 4646024, 3070837, 2651593, 1950247, 5655860, 4956683, 2100205, 3523753, 3063938, 4348265, 3633473, 3563644, 2605827, 3639514, 3503344, 4324556, 2337784, 1564788, 5724857, 4981157, 5851437, 2737656, 5105025, 4072827, 4987218, 3930535, 6428952, 2830535, 3128060, 4233525, 4394634, 3209776, 4547314, 3032264, 3391964, 3491056, 4232262, 3106056, 5604345, 2574005, 4484370, 4647370, 4139692, 3147740, 4920010, 4449924, 4740830, 3707325, 4228124, 3611117, 4684539, 6814638, 5065256, 4629188, 3836075, 6130707, 6018844, 4359773, 5368262, 5695041, 4174169, 4860766, 5846473, 4119687, 5726684, 4988703, 7042033, 4060086, 5338658, 5698821, 4664776]
2526D664776M22007J240357j26134q60474P63583K687558l621149L671729k400615
2517F441638J082431m09923k60981M89660j96461l67789K131814M53299j965759
2508G397929q32719k76783N3875J880151l152365K189304Q4459R82219P6648O77901
2498I080619k880817J445709k53780k058821J245679m60545K864992m45248l385840
2489E151948K855459k280646j106363K464059P1888K47214l52503k766745J798553
2480F082864j343939N36830J021747j123123M35368J018311j477974k95422M14261
2471E268923O56766j796323L182922j341074J84960J013089j128282P02755p60910
2462E982826O7150R01359P98524j446731m22023J982309p93035J42237j367399
$$ y = [4664776, 5086783, 6327140, 6201006, 5340532, 6104115, 8791673, 5170524, 8842253, 6441638, 7524069, 7114146, 6853165, 7342825, 7146364, 6778575, 8910389, 9363688, 7397929, 6565210, 6288427, 6342302, 8222453, 5070088, 7259392, 7343851, 8326070, 8402718, 9080619, 6199802, 7645511, 7391731, 5332910, 6578589, 6118044, 8983036, 8537788, 5151948, 8007407, 5726761, 4620398, 7084457, 7156345, 7403559, 7051056, 4284311, 6082864, 4738925, 5275755, 6297502, 5174379, 5609747, 6628058, 5150084, 4854662, 5268923, 5925689, 4129366, 7312288, 5971214, 6156174, 7169263, 6040981, 6743736, 5982826, 6049976, 6951335, 7749859, 6303128, 5881105, 7863414, 7070379, 7212616, 5845217]
2453E845217K005384o20259M94361r00729O39330j101542J905729j836892O59247
2444G089846R38988O52431k226478J679060j512714k1918J079607j097476J436364
2435H017710o88613J921500p04849m81509Q73632K22207M4101k584610K427614
2426I047183j352811R86486j230631M99453J471551m25192R8295J205215k155656
2417H143893M237739j25785p93962q90489j012021J039813l37819l791115K13941
2408F684195J044070Q97209j291430M56491p34308r75197J803203J02337r83774
2399G002796J110467j686435Q18091P74245O97087Q71430k265967j21450J002246
2390H202510J092105l449828o04412N78287J258742n06520j232894J300975J488911
$$ y = [5845217, 7850601, 7230342, 7724703, 6823974, 7463304, 6361762, 8267491, 6430599, 7089846, 8028834, 8681265, 6454787, 8133847, 6621133, 6599215, 7678822, 6581346, 8017710, 7329097, 9250597, 8545748, 8064239, 8937871, 9160078, 9204179, 6619569, 9047183, 7694372, 8680858, 7450227, 7949680, 9421231, 8996039, 9094334, 10299549, 8143893, 12381632, 12255847, 11461885, 10571396, 9559375, 10599188, 10261369, 6470254, 6684195, 7728265, 8625474, 7334044, 7790535, 7056227, 6081030, 7884233, 7986570, 7002796, 8113263, 6426828, 7244919, 8019164, 8716251, 9587681, 7321714, 7200264, 8202510, 9294615, 5844787, 5240375, 5818662, 7077404, 6570884, 5337990, 6638965, 8127876]
2381H127876j544573L03815j295518J410276K59505n62863l147721L234257q14212
2372E970842O45433j497374J907925r41959q33822J602374j235340j879691O01953
2363D340341O76278K536590j34474j401748J271505j526364K58486J664168N07642
2354H192424k707592K428338J5006J11879l069496M66512J147468Q06537P0810
2345G461886O17619r28752l2924J171100n23160j383157J859145M94391k146543
2336F589605J794915N43681p57854j943885R40022J25457J49871J238969p80278
2327G900503k11896J04832K053645j369131r44570M61298J704668r04306k874783
2318E920260L864779P26173j710989p77143J327006j514708J641381j033808L14466
$$ y = [8127876, 6583303, 6887118, 5591600, 7001876, 7261381, 6698518, 3550797, 6785054, 5970842, 6616275, 5118901, 7026826, 6084867, 5251045, 6853419, 5618079, 3738388, 4340341, 5016619, 7553209, 7418735, 6016987, 7288492, 5762128, 6020614, 7684782, 8192424, 5484832, 7913170, 7928176, 8040055, 4970559, 5437071, 6584539, 7391076, 7461886, 8079505, 7150753, 7117829, 8288929, 7765769, 6382612, 8241757, 8736148, 6589605, 8384520, 8928201, 8170347, 6226462, 7166484, 7291941, 7441812, 8680781, 7900503, 7688607, 7793439, 9847084, 8477953, 7533383, 7994681, 9699349, 8795043, 5920260, 9785039, 10511212, 8800223, 8023080, 9350086, 7835378, 9476759, 8442951, 8757417]
2309H757417J127001p13835K495239j950710M76558k79063Q82463j529761j133888
2300H131421K310925j892053J289432J46839L41859k502464J508275K047685k540344
2291H841575o21173J997421L86322p70923q7338p6771k566281J074668m21357
2282G756143Q60231J202321p31014J16673k281264J650967Q08491L75344k456763
2273G301129J340266J121707q44553N84739n02375K486290j775384r93358L407208
2264A2125669j609579J28728J035520n3420k077152p96538L345972J302522k767595
2255A0634127j7344K245253l620078P9561M217406j318863k47444k408879O49697
2246A0213436Q46806J843639j931459N61902O87113J349423j996347K359211j318757
$$ y = [8757417, 9884418, 9170583, 11665822, 9715112, 10191670, 9912607, 10795070, 9265309, 8131421, 10442346, 8550293, 9839725, 9986564, 10328423, 7825959, 9334234, 11381919, 8841575, 8220402, 10217823, 10604145, 9833222, 9745884, 9669113, 7102832, 8177500, 7756143, 8616374, 9818695, 9087681, 9204354, 6923090, 8574057, 9382548, 9757892, 7301129, 8641395, 9763102, 8918549, 9503288, 9000913, 11487203, 9711819, 8718461, 12125669, 10516090, 10644818, 11680338, 11626918, 9549766, 8753228, 12099200, 13401722, 10634127, 10616783, 12862036, 9241958, 9321519, 13538925, 12220062, 11972618, 9563739, 10213436, 11060242, 12903881, 10972422, 11534324, 12221437, 13570860, 11574513, 13933724, 12614967]
2237A2614967j88168J891411k332559M00276R86415j425238Q15515j031985J341375
2228A3072009K14851j034894Q42279O9043k19868O03848P2261k68510P22728r16151
2218A3157596R89249J702828j031546j254683L64923r75133p43625J221467N71320
2209A4002396j429272J691311r76963j614719J861712J293437j713708K090316
2201A5204510j628755N92360Q13948j095123k64336o38690J544936k068026K264994
2192A4725818k075681l81003r37598J76159P68873j33044k48520q46915k29742
2183A0818347M92915J039109j634729K180707m48802M24016k491126R78678j940422
2174I418693Q26645K221135p70151j159245J262365k25099j244346J241314K01200
$$ y = [12614967, 12426799, 14318210, 11985651, 12385927, 13372342, 11947104, 12762619, 11730634, 13072009, 13286860, 12251966, 13094245, 13163288, 12943420, 13547268, 13619529, 13351019, 14073747, 13157596, 14146845, 15849673, 14818127, 13563444, 13928367, 12953234, 12209609, 13431076, 14002396, 12573124, 14264435, 13287472, 11672753, 13534465, 14827902, 13114194, 15204510, 13575755, 14168115, 14982063, 13886940, 13622604, 12983914, 14528850, 12460824, 14725818, 12650137, 12269134, 11331536, 11507695, 12276568, 12143524, 11895004, 11048089, 10818347, 11311262, 12350371, 10715642, 12896349, 12447547, 12871563, 10380437, 11359115, 9418693, 10245338, 12466473, 11696322, 10537077, 11799442, 11574343, 10329997, 11571311, 11772511]
2165A1772511L35248m28427j852637K440972k356518O57353K670997j865328J806749
2156A3180920n72605j289038o30861j7230j249338N3749L275230l304145J133059
2147A0579741K41254m40315L16046j407257J715214K0327j140882n97534o07540
2138H679054P75130P92894J134048k142217J733329J047415K99598J06699l59228
2129A2066722L54888j564809K454884j255753j766652J303858J216577k248925
2121A0560790R40725J715804n55390n12922J312268j414842p65451J487360j795659
2112A0972683K062397K47495P88093k727457J308581j34117K585028l467179J154994
2103A2790518J556484R54487j742949K382332Q67642r61843l37711J339855L69985
$$ y = [11772511, 12107759, 11679332, 9826695, 12267667, 9911149, 10568502, 13239499, 11374171, 13180920, 12608315, 11319277, 10688416, 10671186, 9421848, 9475597, 12750827, 9446682, 10579741, 10820995, 10380680, 10696726, 9289469, 11004683, 11025010, 9884128, 9286594, 8679054, 9454184, 10247078, 11381126, 9238909, 10972238, 12019653, 12319251, 12425950, 12066722, 12421610, 10856801, 13311685, 12055932, 10289280, 11593138, 12809715, 10560790, 11501515, 13217319, 12661929, 12149007, 13461275, 12046433, 11280982, 12768342, 10972683, 13035080, 13282575, 14070668, 11343211, 12651792, 12517675, 15102703, 11635524, 12790518, 14347002, 15301489, 13558540, 15940872, 16808514, 15846671, 15508960, 16848815, 17218800]
2094A7218800P49708j288589J390060l54617J625804p37504J401906j513268J778328
2085B0270628O63602j523842J893164J97316m18544J684654k900364J466690J622372
2076B2955676j538096n42P7036J600464j599624P01479J260028j803633k99820
2067B1352968J279204N03338j559644J61336P07106j21256J33462k4976K830142
2058B5261680l590014J270044N90558R50594j075410P90880J90380n20734n9316
2049B3808662L072989m320633j301108O56508M03182R26022k166752j124014m57916
2040A9496940m51832k19719K473017l116494J855500j265088J186296j291250
2032A8667370J06132k309334K144300J584426j817930K059916N865403J0617143
$$ y = [17218800, 17968508, 16679919, 18069979, 17715362, 19341166, 18603662, 20005568, 18492300, 20270628, 20934230, 19410388, 21303552, 21500868, 21082324, 22766978, 19866614, 21333304, 22955676, 21417580, 21417038, 21494074, 23094538, 21494914, 22196393, 23456421, 21652788, 21352968, 22632172, 23135510, 21575866, 21737202, 22444308, 22323052, 22456514, 22431538, 25261680, 21671666, 22941710, 23532268, 24482862, 23407452, 24198332, 24388712, 23867978, 23808662, 26881651, 22561018, 21259910, 21916418, 22319600, 23245622, 21078870, 19954856, 19496940, 19045108, 18825389, 21298406, 18181912, 20037412, 18772324, 19958620, 18667370, 18773502, 16464168, 18608468, 20192894, 18374964, 20434880, 26300283, 36917426]
2024C6917426J5712190j2103923j2453175p106940m386443n16532j122323j174217
2016A3766063K99339j066520r86678J486160j985567K62303N37330J00722k0246
2007A2392906P70113q70646q30117m6400j221502O04453L99882J268546j344454
1998A1122781j252480K008206o79643p68123k88398K622796j621092j500281K628856
1989A2272622k036229r93716p5982J851575p74370l00196R67558L36797j266212
1980I981847r07140J640220j752551J536793n44531K066257j031519q26844q43323
1971I319209M88196n7367m08037k22611J717703j549821K461J892934j274482
1962I908185j46235m37263J110890m83029m67835J801691k124300J435142o32102
$$ y = [36917426, 52629616, 40525693, 28072518, 20965578, 16579135, 16062603, 14940280, 13766063, 14065402, 12998882, 12012204, 13498364, 11512797, 11775100, 12312430, 12413152, 12392906, 13163019, 12292373, 11462256, 11415856, 10194354, 10798807, 11198689, 12467235, 11122781, 9870301, 11878507, 11198864, 10430741, 10142343, 12765139, 11144047, 9643766, 12272622, 10236393, 9242677, 9166695, 11018270, 10243900, 9943704, 10911262, 11248059, 9981847, 9074707, 10714927, 8962376, 10499169, 9954638, 12020895, 10989376, 10162532, 9319209, 9807405, 9750038, 9342001, 9119390, 10837093, 9287272, 9289733, 11182667, 9908185, 9761950, 9324687, 10435577, 9952548, 9484713, 11286404, 9162104, 10597246, 9965144]
1953I965144k192517K302895j573147J475587J658496k617353O10362J973954
1945A1603421j914908K556119J500628P7810k781128J23101k20017M05648N30132
1936A1880806j780677K629585j599720K369080j445707j064767L27531K47083
1928A1563214K541628k303306K988838j907860o61852P94169J671627J167571
1920A5854029k115230q20341K100917q21155M50966J870614n22175k027256L268076
1911A7238445N23451O82340k575039K743028j859480J348381K248542n47308k81690
1902A9520670J738680j994242K508702j265716r45756K886194k001216L67266
1894B0814582K11640K270944j501988J180786j708684M254286J34910m18256J005538
$$ y = [9965144, 7772627, 10075522, 8502375, 9977962, 11636458, 9019105, 9629467, 11603421, 9688513, 12244632, 13745260, 13823070, 11041942, 11165043, 10945026, 11350674, 11880806, 10100129, 12729714, 11129994, 13499074, 12053367, 10988600, 11316131, 11563214, 14104842, 11801536, 14790374, 12882514, 12220662, 13014831, 14686458, 15854029, 13738799, 12918458, 15019375, 14198220, 14649186, 16519800, 15997625, 13970369, 17238445, 17761896, 18444236, 15869197, 18612225, 16752745, 18101126, 20349668, 19802360, 19520670, 21259350, 19265108, 21773810, 20508094, 19562338, 22448532, 20447316, 20814582, 21026222, 23297166, 21795178, 22975964, 21267280, 25521566, 25656476, 25238220, 26243758]
1885B6243758k72712P6177J032211O80649l43609N49851J582466m7585q31897
1876B8669309L882853j381315n47206R67264J218407L061926k536343K758222
1868C6093117m85383j31689o22800P36093l284340m69323r47328l66676j050146
1859B9471525l763513J400291k359093j77400j216126P69980k127190k0760n8666
1850B1919048j977204J992346M42326J298312l200296M67516m73594Q76448k38928
1841B1105974j92664J715202k423728P63606M31978O95270j367702m09120q11970
1832A9506846K66472J436260k65620k581212M090828n296600K194618j28592n47862
1823A8675138j463606M73330R87690k138508r89415K572465j052934J888790k584094
$$ y = [26243758, 25971046, 26047223, 27079434, 27760083, 27416474, 27966325, 29548791, 29501206, 28669309, 32552162, 31170847, 30623641, 31590905, 32809312, 35871238, 33334895, 36093117, 35607734, 35476045, 34853245, 35589338, 32304998, 31835675, 30888347, 30521671, 29471525, 25708012, 27108303, 24749210, 24571810, 23355684, 24125664, 21998474, 21977714, 21919048, 19941844, 21934190, 22376516, 23674828, 20474532, 20942048, 20468454, 21344902, 21105974, 20913310, 22628512, 20204784, 20968390, 21400368, 22095638, 20727936, 20318816, 19506846, 19773318, 21209578, 20943958, 18362746, 22453574, 17156974, 19351592, 19223000, 18675138, 17211532, 17684862, 18672552, 16534044, 15544629, 18117094, 17064160, 18952950, 16368856]
1814A6368856m254958M650971m3058j241868r76564O90711l27511l58355O89697
1805A5197921L3905k366021J284075j06966N75585J7125p02721J421009k023005
1796A3330907J30492j81391M44081n16654q29356L67467K28062J772488m152865
1787A0593231K014473j425527o34079K035083O23453O74490j157172K52000J242326
1778A4218278j366411Q98104p72670K108849l598628P22735n3647K062549Q70494
1769A5089653j690002N06701r29594J000040K105340j701175N60503k57892j205806
1760A3477768K97158K347853J609702J484717k227130J055932p59524j062969
1752A6223507J807023j448602Q26761J786777J218602k042397J748480n42925
$$ y = [16368856, 12113898, 16764869, 16721811, 15479943, 14503379, 15194090, 14866579, 14508224, 15197921, 15231826, 12865805, 14149880, 14042914, 14618499, 14635624, 13932903, 15353912, 13330907, 13461399, 13280008, 13724089, 13207435, 12378079, 12745546, 12973608, 14746096, 10593231, 12607704, 11182177, 10548098, 12583181, 13206634, 13881124, 12723952, 12975952, 14218278, 12851867, 13749971, 12977301, 15086150, 11487522, 12210257, 12156610, 14219159, 15089653, 13399651, 13906352, 12976758, 13976798, 16082138, 14380963, 14941466, 14683574, 13477768, 13774926, 16122779, 17732481, 19217198, 16990068, 18046000, 17286476, 16223507, 18030530, 16581928, 17408689, 19195466, 20414068, 18371671, 20120151, 19577226]
1744A9577226l41058K188870l97564R68808Q38136l20726J274302K16774m99806
1735B3504962L318462l247886J238088p12434L722616r81210J537381J130653
1727B9510632j165324R03054L281952j191995L209594n56787K963991j528016
1719C5427101M208920O52264K095592K324312M003124J931128K582623J273344
1711E4498408R23341K608420O97031J956660J685808K799951K05485J625719Q96684
1702F7897507J354049r44000J004216K068703L348216J680640L285696M123256
1694H3818283K169320N851048L340288O129631M292495Q204729P785504R563967
1686A31155265Q919127J2063759J4691072J8613791J1651488P365343j566991
$$ y = [19577226, 19236168, 21425038, 21027474, 21996282, 22834418, 22513692, 23787994, 24004768, 23504962, 26823424, 23575538, 24813626, 24101192, 27823808, 26842598, 28379979, 29510632, 28345308, 29248362, 32530314, 31338319, 34547913, 33991126, 36955117, 35427101, 39636021, 40288285, 42383877, 44708189, 48711313, 50642441, 53225064, 54498408, 55421749, 58030169, 58727200, 60683860, 62369668, 65169619, 65375104, 67000823, 67897507, 69251556, 68307556, 69311772, 71380475, 74728691, 76409331, 79695027, 83818283, 85987603, 91838651, 95178939, 101308570, 105601065, 113805794, 121591298, 131155265, 140074392, 152138151, 166829223, 185443014, 197094502, 204459845, 202892854]
1679B02892854j1109152j4781151j8112895j6972656k5750047j9034711j8769903
1672G8362339j3068807j3010288q132643n224528l526376k672913l194381m370291
1664B5162112Q51921j659547k600538J99757j442344l06641m5562j323192q73251
1655A7962715k354518K26905j79131J209083K648608j021732k155518j08944j847861
1646A4379607K184473k324027P85406p26784p07312K53657P69451k740081o27246
1637A1247144j27921k03383O86878j342286j440794K787294j808051r54131J091778
1628I936528q4136J11443P74070j696291o16542j031083K111264l05436j178421
1619H021396M8691J51312p41282R88174o40685o01809O69398j695093J342760
$$ y = [202892854, 191783702, 177002551, 158889656, 141917000, 116166953, 97132242, 78362339, 65293532, 52283244, 44150601, 38926073, 35399697, 32726784, 29532403, 25162112, 26014033, 24354486, 21753948, 21953705, 20511361, 20204720, 20159158, 18835966, 17962715, 15608197, 15835102, 15655971, 16865054, 19513662, 18491930, 16336412, 16227468, 14379607, 16564080, 14240053, 15025459, 14298675, 13591363, 13845020, 14614471, 11874390, 11247144, 11119223, 10915840, 11602718, 10260432, 8819638, 11606932, 9798881, 8844750, 9936528, 9852392, 9963835, 10737905, 9041614, 8425072, 7393989, 9505253, 9199817, 8021396, 8070087, 8221399, 7480117, 8468291, 7827606, 7225797, 7895195, 6200102, 7542862]
1610G542862j491116L725062l496335m85360R10436P651j235595Q72902J22010
1601F472517r42391r79722K144175N94967k434932M49332j835183J801832l0849
1592E239746j003167K548478k490123Q81802o80138M185444k626964o57944J61491
1583E558625p99852J317042j40562r16015N13390o93256K346916j581606K921220
1574H525902j633682Q54275l169571J566075J884364j709002o18961J991898j168310
1565F522988n58366L204860j543447L12633m37177j5602j031153K484161k213478
1556F725419J133176N04907K374661j406093m44043K879408r69305K015960P3704
1547A2887794N86322l609397K185596J742945r00644n56650J503047j204452N52970
$$ y = [7542862, 6051746, 9776808, 6280473, 5795113, 6705549, 6713200, 5477605, 6350507, 6472517, 5530126, 4550404, 6694579, 7289546, 4854614, 5303946, 3468763, 5270595, 5239746, 4236579, 6785057, 4294934, 5176736, 4496598, 8682042, 6055078, 5397134, 5558625, 4758773, 6075815, 5935253, 5019238, 5532628, 4839372, 7186288, 5604682, 8525902, 6892220, 7746495, 4576924, 6142999, 8027363, 6318361, 5699400, 7691298, 6522988, 5964622, 9169482, 7626035, 7938668, 7501491, 7485889, 6454736, 8938897, 6725419, 7858595, 8363502, 10738163, 9332070, 8888027, 11767435, 10798130, 12814090, 12887794, 13474116, 9864719, 12050315, 13793260, 12892616, 12335966, 13839013, 12634561, 13187531]
1538A3187531M022545o02683J003971J68928r98814K379518J042134J064914K254850
1529B3522894L639092j63920l3408m073266j300028k15848L88226P13058j203245
1520B1273555M4345J73336o3096N7806J95726j36666J339234k09022k625644M77690
1510B0527264j263046K673738K75240j91960r46606J279344M204J604422j840040
1501B2122560j56858N82691L21217K022075j888351O96432K860454K479553K24759
1492B9264532J715052r03171k358259K374646j420142j078507j959061k615220
1484B3019870j936310J87905n873317J363382j778339j186519J075725k372127
1476A2500270R1265M38117l45309Q09552l040400J759779J642336k234493K190428
$$ y = [13187531, 17210076, 16607393, 17611364, 17780292, 16781478, 19160996, 20203130, 21268044, 23522894, 27161986, 26998066, 26964658, 22891392, 21591364, 21375516, 21763742, 22476800, 21273555, 21317900, 21491236, 21428140, 21485946, 21681672, 21545006, 22884240, 22675218, 20049574, 20527264, 19264218, 21937956, 22213196, 22021236, 21074630, 22353974, 22358178, 23962600, 22122560, 21965702, 22548393, 22869610, 24891685, 23003334, 23699766, 26560220, 29039773, 29264532, 30979584, 30076413, 27718154, 30092800, 28672658, 27594151, 25635090, 23019870, 21083560, 21271465, 15398148, 16761530, 14983191, 13796672, 14872397, 12500270, 12591535, 13029652, 12684343, 13493895, 10453495, 12213274, 13855610, 11621117, 13811545]
1467A3811545r74944o56885M254564r85371K249383Q94146L06549Q85401k081990
1458A7702398L34622O36254k222761k533285O35697j040111k730317N62442j696152
1449I648787m63024p29492p6501N32425m90233j527961k56511n35252P09502Q00281
1439G612021L36668l79153j936217q0816j411093K857864M04201j423415k055783
1430C924277J178172K588120j725946k40444o87405J23386N42248p05294J007289
1421F004403K959984m063793K644952K143449j992689l1990j920676J19204k832126
1412C030718J469542n85895J786180k102753l1510D39601K404993o29269R07973
1403C123298P91103r63824o4621K93246l93547Q40148j723931J566118j034759
$$ y = [13811545, 12836601, 12179716, 16434280, 15448909, 17698292, 18592438, 18898987, 19784388, 17702398, 18037020, 18673274, 16450513, 13917228, 14552925, 13512814, 10782497, 11344939, 9648787, 9185763, 8456271, 8379770, 8912195, 8421962, 6894001, 6637490, 6102238, 6811740, 7612021, 7948689, 7569536, 5633319, 5552503, 4141410, 6999274, 7403475, 5980060, 3924277, 5102449, 7690569, 5964623, 5724179, 5036774, 5160160, 5702408, 4997114, 6004403, 8964387, 4900594, 7545546, 9688995, 7696306, 7664316, 5743640, 5862844, 3030718, 4500260, 3914365, 5700545, 3597792, 3566282, 439601, 2844594, 2215325, 3123298, 3914401, 2950577, 2885956, 3179202, 2785655, 3625803, 1901872, 3467990, 2433231]
1394B433231K944572k425943K38831m45061N8692m23967I57536K755116j177888
1385B534764J99092J624965r26155r07960n49250J61527K74242J17324J152760
1376C681309R89983j256503A499682P67825N35738J532244o52027J81044P33054
1367D597560N95406j180204j063873n6538o76758Q46046J166775M20987M48375
1358E097776j906882J683000P7454k57009k235474K321293Q59872k88181k326264
1349C025585J706429L6457J422007o94916J427010j208264L340843k075116k51232
1340F728803K007686k688944J85081J27381J131578J30272P39164j564401L5558
1331F832178M05731q23977J144719k27237n60900J268833J04469J531483j133171
$$ y = [2433231, 5377803, 2951860, 3190691, 2745630, 2804322, 2380355, 957536, 3712652, 2534764, 2733856, 4358821, 3432666, 2524706, 1975456, 2136983, 2411225, 2528549, 3681309, 4671292, 3414789, 1499682, 2267507, 2803245, 4335489, 3683462, 3864506, 4597560, 5192966, 4012762, 2948889, 2892351, 2215593, 3061639, 4228414, 4649401, 5097776, 3190894, 4873894, 4951348, 4694339, 2458865, 4780158, 5640030, 5351849, 3025585, 4732014, 4768471, 6190478, 5495562, 6922572, 5714308, 9055151, 6980035, 6728803, 8736489, 6047545, 6232626, 6360007, 7491585, 7621857, 8361021, 6796620, 6832178, 7237909, 6413932, 7558651, 7331414, 6770514, 8039347, 8143816, 9675299, 8542128]
1322H542128K66320J962624P6808k142556J561161r41202M05839P56687J270732
1313A1758541m023515Q98042J563033O63549k73413O05004j008798P6304l126322
1304G132425J603123K41848r21186k931275J21554J181468j972598K97839J469716
1295F222914k258144p55670K409391j740929J733607B48352N246536q61353j666001
1286B967534n59802p3199L38262J048195o1425n59494K76112j538084P91867m29440
1276B200526M2433L26402k80948K142675j075274J273774m04877G26294M45931
1267A172225J635891n33143J323952K44314j134083j281030K077323I49528J768554
1258B718082A086000J943619q29582J309930j733550O18909J168958r84910R45402
$$ y = [8542128, 8808448, 10771072, 10847880, 8705324, 10266485, 9325283, 9731122, 10487809, 11758541, 7735026, 8633068, 10196101, 10859650, 10586237, 11191241, 10182443, 10258747, 7132425, 8735548, 8977396, 8056210, 5124935, 5246489, 6427957, 4455359, 4753198, 6222914, 3964770, 3209100, 5618491, 3877562, 5611169, 248352, 5494888, 4633535, 2967534, 2407732, 2334533, 2672795, 3720990, 3659565, 3100071, 3376183, 1838099, 2629966, 2200526, 2242959, 2569361, 2288413, 4431088, 3355814, 4629588, 4224711, 726294, 1172225, 2808116, 2274973, 3598925, 3843239, 2709156, 1428126, 3505449, 949528, 2718082, 1086000, 3029619, 2200037, 3509967, 1776417, 2395326, 3564284, 2579374, 3524776]
1249C524776J3483l1081j407970J482562J511790k477489K152433j687608J502701
1240D583597O24903n81705O32630M22718k346772J762290o85897K955372n38455
1231F828681J323838O14230k064208B685983C94257J443752K66455M07956q08320
1222A704100K64440L71409A090271Q86383k1737R72212k4603q60697K69608g195
1211B155199j057603J315304c71162H06183L02268B99034e56401E26193M65681
1202I91874P17735G86003K081381k69178D35616K98707J225967Q85667A367472
1192A579303p76474g42514A003104m86221k51166j02209J174317R23587A127867
1182A147131K71770A2768J987259m206b75479D516K94701K233933n89525j22821
$$ y = [3524776, 3538259, 3507178, 2099208, 3581770, 5093560, 2616071, 4768504, 3080896, 4583597, 5208500, 4626795, 5259425, 5682143, 3335371, 5097661, 4411764, 7367136, 6828681, 8152519, 8766749, 6702541, 2685983, 394257, 1838009, 2104464, 2512420, 1704100, 1968540, 2339949, 1090271, 1976654, 1954917, 2927129, 2902526, 2041829, 2311437, -7195, 2155199, 1097596, 2412900, -371162, 806183, 1108451, 299034, -556401, 526193, 991874, 1709609, 786003, 2867384, 2598206, 435616, 734323, 1960290, 2845957, 1367472, 1579303, 802829, -742514, 1003104, 516883, 265717, 163508, 1337825, 2261412, 1127867, 1147131, 1418901, 12768, 2000027, 1995821, -275479, 4516, 299217, 2533150, 1943625, 1820804]
1172A820804K15094L08290k56086L64746O64164n23298J675010A820012o00305
1163A219707P04760J401921j097441R40039j016456j37933H65201J235097H29116
1153A908876K369312j737930p21864M98505Q84678j023979o76896J209309R5713
1144B805724r36318L45836J401814j677496P71404J881994A356267M96488J415652
1135C268407e0164C934047J19034A688088J213486N36338K376556B795216j024870
1126A770346J925913j181783R85961N8022M97554j597679J552359A165735L190916
1117D356651K7056j065466j010451R40283j336240M01204j47388L135937B098996
1107A786407m27759J76465N42329K15707R64J159013F16348K212851I23527J161551
$$ y = [1820804, 2035898, 2344188, 2088102, 2452848, 3117012, 2593714, 4268724, 1820012, 1219707, 1924467, 3326388, 2228947, 3168986, 2152530, 2014597, 865201, 2100298, 829116, 1908876, 4278188, 2540258, 1818394, 2316899, 3201577, 2177598, 1500702, 2710011, 2805724, 1869406, 2215242, 3617056, 1939560, 2710964, 4592958, 1356267, 1852755, 3268407, -50164, 3934047, 4053081, 1688088, 2901574, 3437912, 5814468, 2795216, 1770346, 3696259, 2514476, 3500437, 3558459, 4056013, 2458334, 4010693, 1165735, 4356651, 4383707, 3318241, 2307790, 3248073, 1911833, 2313037, 2165649, 5301586, 2098996, 1786407, 1358648, 1535113, 2077442, 2293149, 2294113, 3453126, 616348, 2829199, 923527, 2085078]
1097B085078l12873Q77405D52103J459042O62218Q08843A208479J023625L12203
1088B544307j006027J967685p88776j151273Q43080R41080j248567m27535O11026
1079B285000I08339K523158n42511m54591k32992K447756B014854K062140M53214
1070D530208N94353j228581Q6413K332257J602427R20644N535624r77217m006957
1061I389171o45630R84548k4555L5521J432597L465857Q29228J377481L526790
1052B0371008L857746M311578M790349N012296K2774547N6466125J27733122K4929295
1044B70246066j13823851F3953036C1425219j2849927o251512k801008k503957
1037G018815k206712A380627m10326J520464r74689E85901K274708k7726O96805
$$ y = [2085078, 1772205, 2649610, 452103, 1911145, 2573363, 3382206, 1208479, 2232104, 2544307, 1538280, 3505965, 2717189, 1565916, 2408996, 3350076, 2101509, 1673974, 2285000, 908339, 3431497, 2888986, 2434395, 2201403, 4649159, 2014854, 4076994, 4530208, 5124561, 3895980, 3982393, 6314650, 7917077, 8837721, 14373345, 13396128, 9389171, 8743541, 9728089, 9703534, 9739055, 11171652, 14637509, 15466737, 16844218, 20371008, 24228754, 28540332, 33330681, 38342977, 61117524, 117583649, 245316771, 270246066, 156422215, 63953036, 31425219, 18575292, 12323780, 9522772, 7018815, 4812103, 1380627, 970301, 2490765, 1516076, 585901, 2860609, 2832883, 3529688]
1028C529688M755969O85124C648983j131142G80654O73542K09816i7497r5705
1019a93202A307033a34462A501255R45535a379409D36489J429776a239198B269492
1009C39451B9800K927901A055410J743182A217223J153499p42964B09337J284830
1000A494167b17046r07209B11560h8140A54848h68601E71423b22873C47825L97427
990G45252Q21471h4224k9263B169672h35234A295129J517220f69982D81691O40123
980A121814J923390l20544g49A418664a168519B79340J313374b76245C41379H7428
969B03067b43360B86599J7661J52937J0795J289880b940398A331911F54673Q96361
959A551034k28881a757433P38950A632949b82141n62101k2964A48240g58598D18520
$$ y = [3529688, 8285657, 8970781, 3648983, 2517841, 780654, 1454196, 1664012, -97497, -193202, 1307033, -134462, 1501255, 2446790, -1379409, 436489, 1866265, -1239198, 2269492, 339451, 29800, 2957701, 1055410, 2798592, 1217223, 2370722, 1627758, 209337, 1494167, -217046, -1124255, 211560, -88140, 154848, -868601, 571423, -222873, 347825, 745252, 1566723, -84224, -113487, 2169672, -835234, 1295129, 2812349, -669982, 481691, 1121814, 3045204, 2724660, -749, 1418664, -1168519, 279340, 1592714, -276245, 341379, 87428, 203067, -243360, 286599, 304260, 457197, 467992, 1757872, -2940398, 1331911, 654673, 1551034, 1322153, -1757433, -1018483, 1632949, -282141, -844242, -867206, 148240, -758598, 418520]
948b61615A29636Q81516a321265c27634j024660k10693d68507F90142C44121J582558
938A926679a229366a43232C55091f076k38908G87436J41531H2021M572K134798
928B221391b60839A106506E2199a014648q02355B453490a029434K04430H05061
918A637693q4386B5859N78806g53612q74906A140606k12716J569446B98031K84919
908E82950g68530a39286G54814L51593R5170J928867D93913e21019B158251A10833
897G1699L91547Q31527C4196L40781L29388K81685a963821B23649a476404A773419
886A163838l13571K5284N95791O41391q96281K22070K87615J48136J893338j599985
876B167626P48744l06639e17048F85381N7504L605743Q7800j260350N50362L30962
$$ y = [-261615, 129636, 1011152, -1321265, -327634, -1352294, -1562987, -468507, 690142, 344121, 1926679, -1229366, -143232, 355091, -6076, -244984, 787436, 928967, 82021, 86593, 2221391, -260839, 1106506, 52199, -1014648, -1817003, 2453490, -1029434, -825004, 805061, 1637693, 1553307, 25859, 604665, -753612, -1628518, 1140606, 927890, 2497336, 298031, 582950, -768530, -139286, 754814, 1106407, 1201577, 3130444, 493913, -521019, 2158251, 110833, 71699, 463246, 1294773, 34196, 374977, 704365, 986050, -1963821, 223649, -1476404, 1773419, 1163838, 850267, 875551, 1471342, 2112733, 1216452, 1438522, 1726137, 1874273, 3767611, 2167626, 2916370, 2609731, -517048, 685381, 742885, 4348628, 4436428, 3176078, 3726440, 4057402]
866D057402q98210L43706K131331k032893k23220K251007n7413O05830j413228
857D764312A988099R01331A317541j49979L44300A56278R0200g67552n07973I2456
846B78280L34731i24726q6545A763921o70462H7033b76576G6512J065177a388860
835B035400E26130b319810R55619A254262a024565n52568C09968K190194G6452
825a284599A270462a13788q72308A353180i1653m1167A303418d40393G39478M19547
815A159025g73485l51710A015117A96944P12496b21172B50754d63211o21292m28645
805a513148c08384a38257k90887A542030E2014R79385O95052C28128f42967E00209
794a238171A601439e15271B219700C9043K93315e97915k16381a62819A481069
$$ y = [4057402, 3159192, 3502898, 5634229, 3601336, 3378116, 5629123, 5571710, 6177540, 4764312, 1988099, 2889430, 1317541, 1167562, 1511862, 156278, 246478, -767552, -1275525, 92456, 278280, 613011, -924726, -1011271, 1763921, 1093459, 87033, -276576, 76512, 1141689, -1388860, 2035400, 526130, -2319810, -1364191, 1254262, -1024565, -1577133, 309968, 2500162, 76452, -1284599, 1270462, -113788, -986096, 1353180, -91653, -132820, 1303418, -440393, 739478, 1159025, -773485, -1125195, 1015117, 196944, 909440, -221172, 250754, -463211, -1084503, -1513148, -308384, -138257, -429144, 1542030, 52014, 1031399, 1726451, 328128, -642967, 500209, -1238171, 1601439, -515271, 2219700, 39043, 332358, -597915, -814296, -162819, 1481069]
784B164786e06268m01139G58572N0853l30021a073307a19862C31223c50190K2725
774c27465A281600m92626i43907I35685C5842J782394H07747i83414c74149N016
764c69133j397825m60727a50371j452277d78987A361917l38407J98997d34284
754e28604k515694A023796k03744a473994A479495d59960B07950O90067A22195
744A3335b255006A312876m46304K31188r5254l37083r9461i510B090074F08720
733d82484A463290a241448D86965M97549a077026d99598A136065j24096a97277
723E89703a063479H0716J945476J165611A511016J20212B16883h76328H29867
713a022601b28367G04807P91591h8365F47397e42812p72702A09370J944379a128017
$$ y = [2164786, -506268, -907407, 758572, 809425, 479404, -1073307, -119862, 331223, -350190, -327465, 1281600, 788974, -943907, 935685, 35842, 1818236, 807747, -983414, -374149, -369133, -1766958, -2227685, -150371, -1602648, -478987, 1361917, 1023510, 1222507, -434284, -528604, -3044298, 1023796, 820052, -1473994, 1479495, -459960, 207950, 898017, 122195, 13335, -2255006, 1312876, 866572, 1097760, 1002506, 665423, 565962, -9510, 2090074, 608720, -482484, 1463290, -1241448, 486965, 984514, -1077026, -499598, 1136065, 1011969, -197277, 589703, -1063479, 80716, 2026192, 3191803, 1511016, 1631228, 216883, -876328, 829867, -1022601, -228367, 704807, 1496398, -88365, 647397, -542812, -1315514, 109370, 2053749, -1128017]
702A056544a630063A353059C90209J910834a172022C26103f52844G75218J212364
693A987582D12666J153629o4716K56428l35754j38182f30352A979387J622978
684C602365A067260q3101J274768J140218K82949n33024j029323L132695k318604
675B933838K451949n40929J224172j162463M02286A877211m50263O88444r90671
666A124721D91084a281160I79011r5380C56824i13708n90700A217298C07866L77816
656F85682d18759B522170E22727e06019k053589G33568a581140H2647a239715
646a6039j344007G24448J03484h66621O8033I3578f27251F4342J634007m34463
636A263886J10558d91269r791C3000O94287l51890k7079a002194I35158i5916
$$ y = [1056544, -1630063, 1353059, 390209, 2301043, -1172022, 326103, -652844, 775218, 1987582, 412666, 1566295, 1501579, 1758007, 1422253, 1284071, -630352, 1979387, 3602365, 1067260, 984159, 2258927, 3399145, 3682094, 3149070, 2119747, 5252442, 2933838, 5385787, 4844858, 6069030, 4906567, 5308853, 1877211, 1426948, 2115392, 1124721, 491084, -1281160, 979011, 883631, 356824, -913708, -1504408, 1217298, 307866, 685682, -418759, 2522170, 522727, -506019, -2559608, 733568, -1581140, 82647, -1239715, -16039, -1360046, 724448, 827932, -866621, -798588, 93578, -627251, 64342, 1698349, 1263886, 1374444, -491269, -501060, 33000, 727287, 375397, 348318, -1002194, 935158, -95916]
625b670632f40659k61817K37968r67160b94677A174564c62760E33867b258527
615F5212P79858N20421N48061E9338K30228g49707q21065H60576r06C76414b05508
603H11976i31985A311885A5567J956732n23092r0259i74148L95207j5164q35040
593a429145A636419k8205c84783C65658a616002d48574r21658P1247A139746b630886
582I79981k93795l01375i72139J76554E74275b065053G49917a49966A936252d3590
571B487024H0418a291192C66306L02122a023401e04694r94745C89485g98893m1221
561h40114B717390A046073e39847k111707J48467i87878B07468a548670I67856
551H44326h7280A83093K40073f01673a29933A502911r2546B9388i83888c86529
$$ y = [-2670632, -640659, -902476, -664508, -1631668, -294677, 1174564, -362760, 533867, -2258527, 65212, 845070, 1365491, 1913552, 59338, 289566, -749707, -1570772, 860576, 859670, 376414, -205508, 811976, -931985, 1311885, 15567, 1972299, 1449207, 1358948, -974148, -578941, -594105, -1429145, 1636419, 1608214, -384783, 365658, -1616002, -448574, -1370232, -1298985, 1139746, -2630886, 979981, 686186, 384811, -972139, -795585, 574275, -2065053, 749917, -149966, 1936252, -43590, 2487024, 80418, -1291192, 366306, 668428, -1023401, -504694, -1499439, 389485, -798893, -840114, 2717390, 1046073, -539847, -2651554, -2503087, -987878, 207468, -1548670, 967856, 844326, -87280, 183093, 423166, -601673, -129933, 1502911, 1410365, 29388, -983888, -386529]
540a399536H24070j43505k87963a576018A58235e207o79892b36423F97710a227048
529b37117B841J0889R99981m23657j91655J964861a60152j345034A868636p09557
519A159079l91733J99871d2990j919395D61884h96276b56838A748969k12040c7812
508A62792J0143Q21071B53713Q7750a877303b56993A154099c36590D74851R11590
498A386441D16141K360055d5652A519454J70425E3964j7617d14865G63063h7018
487A677019a198121A734883e63571b35008k38116A345431a920599n6226c99278
477A505349D6889a37772F30430A41020f09090Q7388G83020d90386b09827D57073
466A589789d68731p05225G5978J172572k41638a489587b63348O5946j051367o56053
$$ y = [-1399536, 824070, 680565, 392602, -1576018, 158235, -5207, -685099, -236423, 697710, -1227048, -237117, 2841, 13730, 1013711, 590054, 398399, 2363260, -160152, -1505186, 1868636, 1159079, 767346, 967217, -42990, -1962385, 461884, -896276, -256838, 1748969, 1536929, -37812, 162792, 172935, 994006, 253713, 341463, -1877303, -256993, 1154099, -336590, 474851, 1386441, 416141, 2776196, -45652, 1519454, 1689879, 53964, 36347, -414865, 763063, -87018, 1677019, -1198121, 1734883, -563571, -235008, -473124, 1345431, -1920599, -1976825, -399278, 1505349, 46889, -137772, 630430, 141020, -609090, -521702, 783020, -490386, -209827, 457073, 1589789, -468731, -1173956, 75978, 1248550, 1006912, -1489587, -263348, -197402, -1248769, -1904822]
456a904822g39748E78382O20671a047589B05036h163q5626k48692l71458A504521
445a459140H96163f35134r31286A82686J596797b078665g03659B47882a107565
435i87452M15859H39304l70073a954975g48301i7544A036494C25505a893165G24614
424A237950a127054c83732A131190D28802a505734e47197J65903Q2042j428076
415a727328a27300A073813D6891J87336b026416c98580L1586o26656A12571b584054
404a138896N04977l26574q18650H02221b45618m57745F26162J14276N0453a19592
393a112786A07424O68077l67904A27734a11130j197118N61822K67273A45200h07927
382f47785A879272e04624k05289A033817a511905I13252b11926j06787F82082
$$ y = [-1904822, -739748, 578382, 1199053, -1047589, 205036, -8163, -93789, -342481, -713939, 1504521, -1459140, 896163, -635134, -1566420, 182686, 1779483, -2078665, -703659, 247882, -1107565, -987452, -571593, 839304, 469231, -1954975, -748301, -97544, 1036494, 325505, -1893165, 724614, 1237950, -1127054, -383732, 1131190, 428802, -1505734, -547197, -381294, -299252, -1727328, -127300, 1073813, 46891, 234227, -2026416, -398580, -366994, -993650, 112571, -2584054, -1138896, -633919, -960493, -1779143, 802221, -245618, -703363, 626162, 740438, 790891, -119592, -1112786, 107424, 775501, 407597, 127734, -111130, -1308248, -746426, -479153, 145200, -807927, -647785, 1879272, -504624, -709913, 1033817, -1511905, 913252, -211926, -318713, 682082]
372a968010f27822c10593A712822C5730f71848c21943j391927Q09517J16254I42791
361b71205k16656A506944A58691h6630A39924i99734G44863i64225A045163b88039
350a104555d82627j258421C64155b066875A36349J8228J268204B12068a157278
340C58719L08401J237460f08967j665201B28759g73560a96892A033302K59456
331A292758E18124d87369R0572j263743a41679A430824b50298A566253c34292
321e25874I40137d32703H41942l42931a793205L83753A735168j2544F7305a723110
310a485727M8954H32915a197342b19224A199772N04693e94466g7616n58644A02786
299A909362d58091k16061a86896l06297l22179k04402H31358a594871J47631e30839
$$ y = [-1968010, -627822, -310593, 1712822, 35730, -671848, -321943, -1713870, -904353, -788099, 942791, -271205, -487861, 1506944, 158691, -86630, 139924, -999734, 744863, -964225, 1045163, -288039, -1104555, -482627, -1741048, 364155, -2066875, 136349, 154577, 1422781, 212068, -1157278, 358719, 667120, 1904580, -608967, -2274168, 228759, -773560, -196892, 1033302, 1292758, 518124, -487369, -396797, -1660540, -141679, 1430824, -250298, 1566253, -334292, -525874, 940137, -432703, 841942, 499011, -1793205, -1409452, 1735168, 1722624, 67305, -1723110, -1485727, -1436773, 832915, -1197342, -219224, 1199772, 1704465, -594466, -77616, -636260, 102786, 1909362, -458091, -674152, -186896, -493193, -815372, -1019774, 831358, -1594871, -1447240, -530839]
288E24272d8011C35144a485913A860178o79597A92903A2685d66305l99709A26440
277g66740A8570a39955B581709E24826a915475G46414a662487f82260B89652L46973
267F36625e49007q61477D29347b145708A20875K168871m18757a91480r04855I91824
256A8134b006678C4287N70004k16361J127127C59058L1711J91771P20252f27097
245H84466f88382A135240m77671k88830j68236N3844b036156a97939j75752I32316
234B97810h60955K24245l53062r4081c50379C50729i56678b90447D02272a119789
223E27722I1659h70346A419758a41621l78000l7420A237618N9288l42461J96389
213A150834D52122d61272r83175J88843J57479A55196M6290a248536J41395J72829
$$ y = [524272, -48011, 335144, -1485913, 1860178, 1180581, 192903, 12685, -466305, -866014, 126440, -766740, 18570, -139955, 2581709, 524826, -1915475, 746414, -1662487, -682260, 289652, 636625, -549007, -1410484, 429347, -2145708, 120875, 2289746, 1870989, -191480, -1096335, 991824, 18134, -2006678, 34287, 604291, 387930, 1515057, 359058, 390769, 582540, 1302792, -627097, 884466, -688382, 1135240, 657569, 368739, 200503, 254347, -2036156, -197939, -373691, 932316, 297810, -860955, -636710, -989772, -1083853, -350379, 350729, -956678, -290447, 402272, -1119789, 527722, 91659, -870346, 1419758, -141621, -519621, -557041, 1237618, 1296906, 954445, 1150834, 452122, -461272, -1444447, -1255604, -1098125, 155196, 201486, -1248536, -1107141, -934312]
203i34312D77227P73224a316403A039638k20115Q72245B93719i65427b71271O9321
193b01950G9437N4775a985300A06544J97465N46122K42465i29250H05453i90423
182a53075j413945H50315J001109F87360B58316n1190J729460H73809l01523r4904
172D77382F486M47676O90979A12866f18793J16646B08870a46982j250634K77115
162a120501a49211k32355I5997J085638H0317R94080f54118D90865N01487L53623
152A345975F02746e76150B79151b821591D03846K105654a67896B96576O16778
143I13354I33M55777a027203d96018H90189H4944J526568D49701p5251i15983
132E48083a257005r19758b8284j822914O34221l3013J10180A8242N12823J45110
$$ y = [-934312, 477227, 1250451, -1316403, 1039638, 819523, 1691768, 293719, -965427, -271271, -201950, 79437, 134212, -1985300, 106544, 304009, 850131, 1092596, -929250, 805453, -990423, -153075, -1567020, 850315, 1851424, 687360, 258316, 207126, 1936586, 873809, 572286, 477382, 6486, 454162, 1145141, 112866, -618793, -502147, 208870, -146982, -1397616, -1120501, -149211, -381566, 95997, 1181635, 80317, 1074397, -654118, 490865, 992352, 1345975, 602746, -576150, 279151, -2821591, 403846, 2509500, -167896, 296576, 913354, 933, 456710, -1027203, -496018, 890189, 84944, 1611512, 449701, 374450, -915983, 548083, -1257005, -2176763, -28284, -1851198, -1216977, -1249990, -1139810, 18242, 531065, 676175]
122F76175K87396a373412c43140j30748A221030e09748A145874D87747f99020
112c60431j533195A540802g05304G91364b073360B73754b75243J08025A410714
102a574388M45277A47859g56023B2305L40001N76975m14188c50237l7772j831482
92b219491a063315A96588K454830e59905B088078E8025J314898b661172D18088
82A378745C59462a35219k550996B477931B5523J369529a24447F00824B24994e44905
71a28265E71799P79156K37472a127540B6974J225427d42508g5673B17812a164263
60A43713P42001g28473A64237i17442l15580E5713e5764j066188F46127k97046
50C49081J217014a396488o32627b97451m08358Q9704q92970H37251j90987A40014
$$ y = [676175, 963571, -1373412, -343140, -473888, 1221030, -509748, 1145874, 487747, -699020, -360431, -1893626, 1540802, -705304, 791364, -2073360, 273754, -275243, -167218, 1410714, -1574388, -1129111, 147859, -756023, 22305, 362306, 939281, 525093, -350237, -388009, -2219491, -1063315, 196588, 2651418, -559905, 2088078, 58025, 1372923, -2661172, 418088, 1378745, 359462, -135219, -2686215, 2477931, 25523, 1395052, -124447, 600824, 224994, -544905, -128265, 571799, 1350955, 1588427, -1127540, 26974, 1252401, -442508, -75673, 217812, -1164263, 143713, 885714, -728473, 164237, -917442, -1233022, 55713, -55764, -1121952, 646127, 349081, 1566095, -1396488, -2029115, -297451, -705809, -616105, -1509075, 837251, 646264, 140014]
39I04438g38269H13784L80731a146993G69983J27160j87671J46159d65863E41632
28C04032M18011B80798a950113d71238J82301l02140H95385N91530F9170h01814
17d73546A42306J170497K85034m46123a877630a71445j470875I34304D58557n0876
7D07681j69127f33006B098971b025265D17249d17902j467458
0a885360
$$ y = [904438, -738269, 813784, 1194515, -1146993, 769983, 897143, 709472, 855631, -465863, 541632, 304032, 722043, 280798, -1950113, -471238, -288937, -591077, 895385, 1486915, 69170, -801814, -473546, 142306, 1312803, 1597837, 1151714, -1877630, -171445, -1642320, 934304, 458557, 407681, 238554, -633006, 2098971, -2025265, 417249, -417902, -1885360]
##END=
