##TITLE=1208
##JCAMPDX= 6.0         $$ Bruker NMR JCAMP-DX V2.0
##DATA TYPE= NMR SPECTRUM
##DATA CLASS= XYDATA
##ORIGIN= NUTS EXPORT
##OWNER= Administrator
$$ 1.72 TOPSPIN		Version 2.1
$$ 2016-02-23 12:17:51.152 -0800  Administrator@X
$$ Compression mode = diff/dup
##.OBSERVE FREQUENCY= 90.275459
##.ACQUISITION MODE= SIMULTANEOUS (DQD)
##.ACQUISITION SCHEME= undefined
##.AVERAGES= 16
##.DIGITISER RES= 22
##SPECTROMETER/DATA SYSTEM= 
##.PULSE SEQUENCE= zg30
##.SOLVENT NAME= None
##.SHIFT REFERENCE= INTERNAL, None, 1, 14.46502
##AUDIT TRAIL= $$ (NUMBER, WHEN, WHO, WHERE, PROCESS, VERSION, WHAT)
$$ ##TITLE= Audit trail, TOPSPIN		Version 2.1
$$ ##JCAMPDX= 5.01
$$ ##ORIGIN= Bruker BioSpin GmbH
$$ ##OWNER= Administrator
$$ $$ E:/data/jwist/nmr/1208/1/pdata/1/auditp.txt
$$ ##AUDIT TRAIL=  $$ (NUMBER, WHEN, WHO, WHERE, PROCESS, VERSION, WHAT)
(   1,<2016-02-23 08:14:01.793 -0800>,<Administrator>,<X>,<jcamp>,<TOPSPIN 2.1>,
      <fromjdx created from
       E:\data\jwist\nmr\uniandes\1208
       data hash MD5: 8K
       84 26 68 58 03 84 20 D2 3B 07 CF CF 08 90 2A F1>)
$$ ##END=
$$ 
$$ $$ hash MD5
$$ $$ 42 9D 4B 95 E6 EC 62 12 F7 87 D6 73 5B 4F 11 07
##$RELAX= 
$$ Bruker specific parameters
$$ --------------------------
##$DU= <E:>
##$EXPNO= 1
##$NAME= <1208>
##$PROCNO= 1
##$TYPE= <nmr>
##$USER= <jwist>
##$ACQT0= 0
##$AMP= (0..31)
100 100 100 100 100 100 100 100 100 100 100 100 100 100 100 100 100 100
100 100 100 100 100 100 100 100 100 100 100 100 100 100
##$ANAVPT= 1
##$AQSEQ= 0
##$AQ_mod= 3
##$AUNM= <au_zg>
##$AUTOPOS= <>
##$BF1= 90.275459
##$BF2= 400.02
##$BF3= 400.02
##$BF4= 400.02
##$BF5= 400.02
##$BF6= 400.02
##$BF7= 400.02
##$BF8= 400.02
##$BYTORDA= 0
##$CFDGTYP= 0
##$CFRGTYP= 0
##$CHEMSTR= <none>
##$CNST= (0..63)
1 1 145 1 1 1 1 1 1 1 1 1 1 1 1 1 1 1 1 1 1 1 1 1 1 1 1 1 1 1 1 1 1 1 1
1 1 1 1 1 1 1 1 1 1 1 1 1 1 1 1 1 1 1 1 1 1 1 1 1 1 1 1 1
##$CPDPRG= <>
##$CPDPRG1= <>
##$CPDPRG2= <>
##$CPDPRG3= <>
##$CPDPRG4= <mlev>
##$CPDPRG5= <mlev>
##$CPDPRG6= <mlev>
##$CPDPRG7= <mlev>
##$CPDPRG8= <mlev>
##$CPDPRGB= <>
##$CPDPRGT= <>
##$D= (0..63)
0 1 0 0 0 0 0 0 0 0 0 0 0 0 0 0 0 0 0 0 0 0 0 0 0 0 0 0 0 0 0 0 0 0 0 0
0 0 0 0 0 0 0 0 0 0 0 0 0 0 0 0 0 0 0 0 0 0 0 0 0 0 0 0
##$DATE= 0
##$DBL= (0..7)
120 120 120 120 120 120 120 120
##$DBP= (0..7)
150 150 150 150 150 150 150 150
##$DBP07= 0
##$DBPNAM0= <>
##$DBPNAM1= <>
##$DBPNAM2= <>
##$DBPNAM3= <>
##$DBPNAM4= <>
##$DBPNAM5= <>
##$DBPNAM6= <>
##$DBPNAM7= <>
##$DBPOAL= (0..7)
0.5 0.5 0.5 0.5 0.5 0.5 0.5 0.5
##$DBPOFFS= (0..7)
0 0 0 0 0 0 0 0
##$DE= 6.5
##$DECBNUC= <off>
##$DECIM= 2432
##$DECNUC= <off>
##$DECSTAT= 4
##$DIGMOD= 1
##$DIGTYP= 12
##$DL= (0..7)
0 120 120 120 120 120 120 120
##$DP= (0..7)
150 150 150 150 150 150 150 150
##$DP07= 0
##$DPNAME0= <>
##$DPNAME1= <>
##$DPNAME2= <>
##$DPNAME3= <>
##$DPNAME4= <>
##$DPNAME5= <>
##$DPNAME6= <>
##$DPNAME7= <>
##$DPOAL= (0..7)
0.5 0.5 0.5 0.5 0.5 0.5 0.5 0.5
##$DPOFFS= (0..7)
0 0 0 0 0 0 0 0
##$DQDMODE= 0
##$DR= 22
##$DS= 2
##$DSLIST= <SSSSSSSSSSSSSSS>
$$ [...]
##$SPOFFS= (0..31)
0 0 0 0 0 0 0 0 0 0 0 0 0 0 0 0 0 0 0 0 0 0 0 0 0 0 0 0 0 0 0 0
##$SUBNAM0= <"">
##$SUBNAM1= <"">
##$SUBNAM2= <"">
##$SUBNAM3= <"">
##$SUBNAM4= <"">
##$SUBNAM5= <"">
##$SUBNAM6= <"">
##$SUBNAM7= <"">
##$SUBNAM8= <"">
##$SUBNAM9= <"">
##$SW= 20.5580556627758
##$SWIBOX= (0..15)
0 0 3 4 0 0 0 0 0 0 0 0 0 0 0 0
##$SW_h= 8223.68421052631
##$SWfinal= 0
##$TD= 65536
##$TD0= 1
##$TE= 300
##$TE2= 300
##$TE3= 300
##$TEG= 300
##$TL= (0..7)
0 120 120 120 120 120 120 120
##$TP= (0..7)
150 150 150 150 150 150 150 150
##$TP07= 0
##$TPNAME0= <>
##$TPNAME1= <>
##$TPNAME2= <>
##$TPNAME3= <>
##$TPNAME4= <>
##$TPNAME5= <>
##$TPNAME6= <>
##$TPNAME7= <>
##$TPOAL= (0..7)
0.5 0.5 0.5 0.5 0.5 0.5 0.5 0.5
##$TPOFFS= (0..7)
0 0 0 0 0 0 0 0
##$TUNHIN= 0
##$TUNHOUT= 0
##$TUNXOUT= 0
##$USERA1= <user>
##$USERA2= <user>
##$USERA3= <user>
##$USERA4= <user>
##$USERA5= <user>
##$V9= 5
##$VALIST= <valist>
##$VCLIST= <CCCCCCCCCCCCCCC>
##$VD= 0
##$VDLIST= <DDDDDDDDDDDDDDD>
##$VPLIST= <PPPPPPPPPPPPPPP>
##$VTLIST= <TTTTTTTTTTTTTTT>
##$WBST= 1024
##$WBSW= 4
##$XGAIN= (0..3)
0 0 0 0
##$XL= 0
##$YL= 0
##$YMAX_a= 1519005952
##$YMIN_a= -2145314.816
##$ZGOPTNS= <>
##$ZL1= 120
##$ZL2= 120
##$ZL3= 120
##$ZL4= 120
##$ABSF1= 10
##$ABSF2= 0
##$ABSG= 5
##$ABSL= 3
##$ALPHA= 0
##$AQORDER= 0
##$ASSFAC= 0
##$ASSFACI= 0
##$ASSFACX= 0
##$ASSWID= 0
##$AUNMP= <proc_1d>
##$AXLEFT= 0
##$AXNAME= <>
##$AXNUC= <off>
##$AXRIGHT= 0
##$AXTYPE= 0
##$AXUNIT= <>
##$AZFE= 0.1
##$AZFW= 0.1
##$BCFW= 1
##$BC_mod= 2
##$BYTORDP= 0
##$COROFFS= 0
##$CY= 15
##$DATMOD= 1
##$DC= 2
##$DFILT= <>
##$DTYPP= 0
##$F1P= 0
##$F2P= 0
##$FCOR= 0.5
##$FTSIZE= 0
##$FT_mod= 4
##$GAMMA= 1
##$GB= 0
##$INTBC= 1
##$INTSCL= 1
##$ISEN= 128
##$LB= 0.3
##$LEV0= 0
##$LPBIN= 0
##$MAXI= 10000
##$MC2= 0
##$MEAN= 0
##$ME_mod= 0
##$MI= 0
##$NCOEF= 0
##$NC_proc= -9
##$NLEV= 6
##$NOISF1= 0
##$NOISF2= 0
##$NSP= 1
##$NTH_PI= 0
##$NZP= 0
##$OFFSET= 14.46502
##$PC= 1
##$PHC0= 0
##$PHC1= 0
##$PH_mod= 0
##$PKNL= yes
##$PPARMOD= 0
##$PPDIAG= 0
##$PPIPTYP= 0
##$PPMPNUM= 2147483647
##$PPRESOL= 1
##$PSCAL= 4
##$PSIGN= 0
##$PYNMP= <proc.py>
##$REVERSE= no
##$SF= 90.2741531826386
##$SI= 8192
##$SIGF1= 0
##$SIGF2= 0
##$SINO= 400
##$SIOLD= 32768
##$SPECTYP= <>
##$SREGLST= <1H.CDCl3>
##$SSB= 0
##$STSI= 0
##$STSR= 0
##$SW_p= 1497.18866228788
##$SYMM= 0
##$S_DEV= 0
##$TDeff= 0
##$TDoff= 0
##$TI= <>
##$TILT= no
##$TM1= 0
##$TM2= 0
##$TOPLEV= 0
##$USERP1= <user>
##$USERP2= <user>
##$USERP3= <user>
##$USERP4= <user>
##$USERP5= <user>
##$WDW= 1
##$XDIM= 8192
##$YMAX_p= 1519005696
##$YMIN_p= -2145280
##$CURPLOT= <PDFCreator>
##$CURPRIN= <$PDFCreator>
##$DFORMAT= <normdp>
##$LAYOUT= <+/1D_H.xwp>
##$LFORMAT= <normlp>
##$PFORMAT= <normpl>
##$SURQMSG= 1
$$ End of Bruker specific parameters
$$ ---------------------------------
##XUNITS= HZ
##YUNITS= ARBITRARY UNITS
##XFACTOR= 0.182762287876938
##YFACTOR= 1
##DELTAX= -0.182762287876938
##NPOINTS= 8192
##FIRSTX= 1497.0059
##FIRSTY= -560128
##LASTX= 0
##MAXY= 1519005696
##MINY= -2145280
##XYDATA= (X++(Y..Y))
8191e60128b5600E73952c2768A79200N55520b91840E9392L584f65600F22592b6624
$$ -560128 -25600 573952 -32768 179200 734720 -291840 59392 62976 -665600 622592 -26624
8179b01728j500672E17632K61120a53600D4544Q47360c04128A17248M11136A38240
$$ -201728 -1702400 517632 778752 -153600 44544 891904 -304128 117248 528384 138240
8168A09056M52096g51104b21184A550848g27040C18464A53600Q66816e11488E74464
$$ 109056 561152 -751104 -221184 1550848 -727040 318464 153600 1020416 -511488 574464
8157c30240e9904K9696A50016P3216J90464f05184A48480M11136g64416B02752
$$ -330240 -59904 -30208 150016 223232 413696 -605184 148480 559616 -764416 202752
8146c52768B85184c99872I0112b74944A574400E87776B07872f8096o76352A59232
$$ -352768 285184 -399872 90112 -274944 1574400 587776 207872 -68096 -744448 159232
8135b54976m7616H32512l07712f2976A15712Q83200m37760b9696H49408a10080
$$ -254976 -302592 832512 524800 -62976 115712 998912 561152 -29696 849408 -110080
8124b29888L7888A332736E92896k03776J6384g82848c35872g6288A044480k69312
$$ -229888 -192000 1332736 592896 389120 405504 -782848 -335872 -76288 1044480 775168
8114G75168j61792B87744O80448C32288E2736i9328l7888j35680a35680G33184
$$ 775168 613376 287744 968192 332288 52736 -99328 -137216 -272896 -135680 733184
8103E32992i78432C37920c71200L3280A256448a201152B26304a20320m51072D67456
$$ 532992 -978432 337920 -371200 -337920 1256448 -1201152 226304 -120320 -571392 467456
8092A07520N120K71360L8912c60960J33632m50560D31104I9328d65920a63328
$$ 107520 112640 384000 422912 -360960 -227328 -677888 431104 99328 -465920 -163328
8081h6528k32960k6624C95776b55488h0384D96640d88448e9904F72256j52576
$$ -86528 -319488 -346112 395776 -255488 -80384 496640 -488448 -59904 672256 519680
8071E19680k04288J02400j40800b01216j56160I9840g8336C1232f59456E63200
$$ 519680 315392 417792 276992 -201216 -357376 99840 -78336 31232 -659456 563200
8060H67328b29888F65088K2528j79712k03264h31488b2016p6800n0688r84064
$$ 867328 -229888 665088 687616 507904 304640 -831488 -22016 -98816 -149504 -1133568
8050a133568F65600M34176d43392l46112B02752J47968K13504c32800G9872b56000
$$ -1133568 665600 1099776 -443392 -789504 202752 350720 564224 -332800 79872 -256000
8039D94080A83808K45248A9456e21216b11456m24960L4816C67616d4544C11808
$$ 494080 183808 429056 19456 -521216 -211456 -636416 -601600 367616 -44544 311808
8028a6896A88416L16928j77152E5808b30400l54816B60608Q52480c39456G2192
$$ -16896 188416 505344 328192 55808 -230400 -585216 260608 1113088 -339456 72192
8017B57536d43904H16640C40992h07936b08384f3488J0240A320960l06176d39808
$$ 257536 -443904 816640 340992 -807936 -208384 -63488 -53248 1320960 1014784 -439808
8006b72384q7040A145344E12J01888K03776M82304d3520p680q4992A098752a00864
$$ -272384 -359424 1145344 512 102400 306176 788480 -43520 -51200 -136192 1098752 -100864
7994A08032L29216e11488e1712q0384B31936r7792Q51968d20352K6624a42848
$$ 108032 437248 -511488 -51712 -132096 231936 134144 986112 -420352 -393728 -142848
7983h37120A34144N59616A1264L27680M01408k78528a222144d03968a51040l4816
$$ -837120 134144 693760 11264 338944 740352 461824 -1222144 -403968 -151040 -185856
7973a85856C80416R4720d096n73952H0896M64384H7552O7072L68128j63840d88448
$$ -185856 380416 475136 -4096 -578048 80896 545280 87552 154624 522752 358912 -488448
7961A89952J24416O49216C55840g07584b04800C36896o2976J087488e9392D42880
$$ 189952 314368 963584 355840 -707584 -204800 336896 273920 1361408 -59392 442880
7950B40128a63840m40832B58048J14176M13184i3184E84192G0656K49856M61312
$$ 240128 -163840 -604672 258048 372224 785408 -93184 584192 70656 320512 781824
7940G81824o9632B4064K83136O82496a6384C67616d54656G70560d94592F4000
$$ 781824 712192 24064 307200 989696 -16384 367616 -454656 770560 -494592 64000
7929D8128J76128N22752k93888Q8064e16096j5360A63328b9184A29024e3248G8848
$$ 48128 224256 747008 453120 541184 -516096 -531456 163328 -29184 129024 -53248 78848
7917H16640O6048m23936d46464a07008D39808g96672E76000f7072r7280A39776
$$ 816640 882688 458752 -446464 -107008 439808 -796672 576000 -67072 -164352 139776
7906A99168c88096l99360E78560K01216L9936b08896D58752A55648M37248d61312
$$ 199168 -388096 -787456 578560 779776 819712 -208896 458752 155648 592896 -461312
7895I14432a562112F33344j99680J01888G168O17472A48480N38624L2256k26816
$$ 914432 -1562112 633344 433664 535552 7168 624640 148480 687104 719360 492544
7885D92544B31936M0960j8944c75296G62880n4272M24960C25632J38752A68448
$$ 492544 231936 272896 253952 -375296 762880 708608 1133568 325632 464384 168448
7874e18656B38592n632i39008A52576C0720b27840j80736F3488Q72448B03264
$$ -518656 238592 232960 -939008 152576 30720 -227840 -408576 63488 935936 203264
7863a81248D01920e30432l17952A03424%a97120D65920b35520C44576j00352a93024
$$ -181248 401920 -530432 -848384 103424 103424 -197120 465920 -235520 344576 244224 -193024
7851E47840k52928g76704K09408I76384K048j76128k47808M65920d45440E23264
$$ 547840 294912 -776704 -567296 976384 978432 802304 554496 1020416 -445440 523264
7840A52064b36544B49856J037824B21696c30752e6320A96608l3792L31264R6768
$$ 152064 -236544 249856 1287680 221696 -330752 -56320 196608 162816 494080 590848
7830E90848O05184d18304D92544k23232n8368R4208n4272b29888B70336M7616
$$ 590848 1196032 -418304 492544 269312 210944 305152 250880 -229888 270336 317952
7820C17952M96128l16928h77568c59424A97120F7584j8944J98656O18496l13856
$$ 317952 814080 497152 -877568 -359424 197120 67584 48640 247296 865792 551936
7810E51936J238016p59296g98208b75968C03616a3824A93024p1168m4544O17984
$$ 551936 1789952 1030656 -798208 -275968 303616 -13824 193024 121856 77312 695296
7800F95296B24768C4816J39776K76992E6320b34496J15200I50784a55136C1232
$$ 695296 224768 34816 174592 451584 56320 -234496 -119296 950784 -155136 31232
7789B10944O7072i1136q49408H26880f5536I33888C2256J02912c15392q35072
$$ 210944 278016 -91136 -940544 826880 -65536 933888 32256 135168 -315392 -1150464
7779a150464c9936A07008a50016D92544d9152H32512B55488r728f79936C17440
$$ -1150464 -39936 107008 -150016 492544 -49152 832512 255488 245760 -679936 317440
7768d95616G18848F2464K16576h40704j94048a66400e0688B56512m4544J41312
$$ -495616 718848 62464 279040 -840704 -1034752 -166400 -50688 256512 211968 353280
7758C53280Q26368K65728F77888M16256h704C57376J8432J35168d92544A85344
$$ 353280 1179648 1445376 677888 1094144 -8704 357376 375808 510976 -492544 185344
7747a02912j36704I94304a6384C91168e4272F77888a049600K7648G22944k57024
$$ -102912 -239616 994304 -16384 391168 -54272 677888 -1049600 -1021952 722944 465920
7737D65920h15616A98144k3040P58272p4240b81088D8128O89664B27328J14688
$$ 465920 -815616 198144 175104 933376 859136 -281088 48128 737792 227328 342016
7727C42016J389056e31456F95808J75104i46688E72416p2192A33120R6256c43552
$$ 342016 1731072 -531456 695808 870912 -946688 572416 500224 133120 229376 -343552
7716D29056A1264J68960c95776m24448L95264D70528e2224C23584M24448J68448
$$ 429056 11264 180224 -395776 -820224 -424960 470528 -52224 323584 748032 916480
7706I16480e39136A7920K75456I728O81472L55328m18816C08224j50016b26816
$$ 916480 -539136 17920 293376 9728 691200 1046528 627712 308224 158208 -226816
7695e01248A420800h29440G02464a28512G67488Q7040C24608H9088e74976H93440
$$ -501248 1420800 -829440 702464 -128512 767488 854528 324608 89088 -574976 893440
7684C47136L17952H5504O53312d40320C68128k048b6112B28864f6560j42336N3248
$$ 347136 665088 85504 738816 -440320 368128 366080 -26112 228864 -66560 -208896 -155648
7673a55648b2016D38272C9424a317376G4752J31584O1952Q37632C08224M44416
$$ -155648 -22016 438272 39424 -1317376 74752 206336 268288 1105920 308224 752640
7663G52640e01248h8576A057792N12a081344e7344H6016f12864k30912d7616C0720
$$ 752640 -501248 -88576 1057792 1058304 -1081344 -57344 86016 -612864 -843776 -47616 30720
7651G43936j19808N45792m65920a11616F06208b3552I56416c65568G8336d23424
$$ 743936 624128 1169920 704000 -111616 606208 -23552 956416 -365568 78336 -423424
7640h0896I50784m71552h89856G48544b23232F6048Q94976K44224k22720R4720
$$ -80896 950784 479232 -889856 748544 -223232 66048 961024 1205248 982528 1077248
7630A077248b73920k62144a0240I4208N17632o9632b59072A209344D67968O21056
$$ 1077248 -273920 -536064 -10240 94208 611840 542208 -259072 1209344 467968 1089024
7620A089024m4032a446912c6864G78752a8944D77696E1712N75488E0176c18976
$$ 1089024 1044992 -1446912 -36864 778752 -18944 477696 51712 627200 50176 -318976
7609C85536a28512A131008C9424a32608H39168C2256h18176b06848l99872H45824
$$ 385536 -128512 1131008 39424 -132608 839168 32256 -818176 -206848 -606720 845824
7598c81440A41824a37728k31424Q8064j60256J01888n7344j04960q56064E78560
$$ -381440 141824 -137728 -369152 -281088 -441344 -339456 -396800 -501760 -1357824 578560
7587B16576c0720j095168E40672k10944M78720C47648b4064I95840L01056A024
$$ 216576 -30720 -1125888 540672 329728 808448 347648 -24064 995840 1296896 1024
7576D42368M17792O49728C25120j59744O53312A23904g2192D87936B25280Q8064
$$ 442368 860160 1509888 325120 165376 818688 123904 -72192 487936 225280 313344
7566C13344O47168a66912D50048B17600J59232K9184A90464n0176J98656L0208
$$ 313344 960512 -166912 450048 217600 376832 406016 190464 140288 338944 369152
7556C69152J69472j21344J10080a30048N5296G09632K00192k72384K70336b71360
$$ 369152 538624 417280 527360 -130048 -74752 709632 909824 637440 907776 -271360
7545I73824J11104B14528c06176j22880p5264B00704J403392F69696P0656C11296
$$ 973824 1084928 214528 -306176 -429056 -504320 200704 1604096 669696 740352 311296
7534B94912a4336A076224B01216K48832e40672b15552c4304A46944J119744B57536
$$ 294912 -14336 1076224 201216 450048 -540672 -215552 -34304 146944 1266688 257536
7523E5296J85344M6080P680h7040j238528G82848k06336a9968A556480A0752P41376
$$ 55296 240640 286720 294400 -87040 -1325568 782848 576512 -19968 1556480 10752 752128
7512G52128C42528q2432J73056j31072n9904J243136b71360a28000A439744o79936
$$ 752128 342528 260096 433152 302080 242176 1485312 -271360 -128000 1439744 759808
7502G59808L42016E50912g38816B88256j8432o5024O98368C6352O51264J37216
$$ 759808 1101824 550912 -738816 288256 269824 204800 903168 36352 687616 824832
7492H24832A02912J189888d16768A50016K4576g48544b048C32800o0928c73248
$$ 824832 102912 1292800 -416768 150016 174592 -748544 -2048 332800 271872 -373248
7481a63328B28352J268736c38944m0448j93536A196544m68480A9456R04192d3520
$$ -163328 228352 1497088 -338944 -379392 -572928 1196544 728064 19456 923648 -43520
7470d79232j74080A131008c13856j117696p13728G28576b59072Q3968M6080L0720
$$ -479232 -653312 1131008 -313856 -1431552 -2145280 728576 -259072 -175104 -129024 -98304
7460i8304D99712A84832A5360P13216B42688L30240a34144G6288c072E57568K69824
$$ -98304 499712 184832 15360 728576 242688 572928 -134144 76288 -3072 557568 827392
7449H27392n4784i216G62880c89632h3456D66432j16224N08416o6560L66080l1744
$$ 827392 772608 -9216 762880 -389632 -83456 466432 350208 858624 792064 1158144 1126400
7438A126400a65888l04128D68480m3008A34656L84512a73056H43264B6624g37280
$$ 1126400 -165888 -470016 468480 425472 134656 519168 -173056 843264 26624 -737280
7427D63872N17632k25792e81632B93376j24416J097728m57216C18976b57536E68832
$$ 463872 981504 755712 -581632 293376 168960 1266688 809472 318976 -257536 568832
7416E08928c61984E60128A34656Q94976m56192k56000G5776J85856i728G59808
$$ 508928 -361984 560128 134656 1029632 573440 317440 75776 261632 -9728 759808
7405A244160O26688F40000P81824E86752b63680I30304I7280b80576A5360N05856
$$ 1244160 1870848 640000 1421824 586752 -263680 930304 97280 -280576 15360 521216
7395E21216M93056D10112P04000A8432Q47360f5536M608D07552J527808G6800
$$ 521216 1014272 410112 1114112 18432 865792 -65536 -60928 407552 1935360 76800
7384B15552J9968e19680D9152J145344N00224C08224b82112G22432L96288c25632
$$ 215552 235520 -519680 49152 1194496 1694720 308224 -282112 722432 1118720 -325632
7373f53312H66304b29376C67104b5600B8672J052160D93568r7792O9632P8336
$$ -653312 866304 -229376 367104 -25600 28672 1080832 493568 395776 465408 543744
7363E43744K79040a6896A54112J551360d1472D6592O5024g76704A058816A02400
$$ 543744 822784 -16896 154112 1705472 -41472 46592 111616 -776704 1058816 102400
7352E02784A36192N13536I3696J90976Q07936D91008b99520C25120e57568A114624
$$ 502784 136192 649728 93696 284672 1092608 491008 -299520 325120 -557568 1114624
7341e52448f9120o50752A120256E18144J13152B8672a68960H01792c09760I83040
$$ -552448 -69120 -719872 1120256 518144 631296 28672 -168960 801792 -309760 983040
7330D08064A0240J157632f67648e3760E02784g02464c23072G33696Q89344I7792
$$ 408064 10240 1167872 -667648 -53760 502784 -702464 -323072 733696 1623040 97792
7319A162240b33472I25184a49504D99712h57600B95424A33632J230848a91488
$$ 1162240 -233472 925184 -149504 499712 -857600 295424 133632 1364480 -191488
7309c96288A085440I728R46688j71008g62368D31104K56000B50880g31136A06496
$$ -396288 1085440 9728 956416 785408 -762368 431104 687104 250880 -731136 106496
7298A008128B26816k9184g7824L7888A659392p54688B87744n7856D3520R53344
$$ 1008128 226816 197632 -77824 -39936 1659392 904704 287744 229888 43520 996864
7288I96864o2464b89280I35424M13184d11136A032192J79712E64736j67424O21568
$$ 996864 934400 -289280 935424 1348608 -411136 1032192 1211904 564736 397312 1018880
7278A018880a58720A42336b05824E31456J0240g41376g7824C36896n3248Q81664
$$ 1018880 -158720 142336 -205824 531456 541696 -741376 -77824 336896 283648 1165312
7268A165312J51040m39296e2224k68800G98720j65376d14208F74816J64352l56352
$$ 1165312 1316352 877056 -52224 -321024 798720 633344 -414208 674816 839168 482816
7258D82816J049088G3728J50016D5056N03808c99872D3008M61824J30560k78528
$$ 482816 1531904 73728 223744 45056 548864 -399872 43008 504832 635392 356864
7248C56864Q31488G680L66592O62528C0208Q63232B75968e7344I2672e43232C28192
$$ 356864 1188352 7680 374272 1036800 30208 893440 275968 -57344 92672 -543232 328192
7236G95136J50528j44896j52576L81952c53280j35168D55680l8400e3248G02976
$$ 795136 945664 800768 648192 1030144 -353280 -488448 455680 417280 -53248 702976
7225I97376f29248B0992M52608J14176K0992r3696E2224L94240J99680d25472
$$ 997376 -629248 20992 473600 587776 608768 515072 52224 446464 646144 -425472
7214A292288D64896L41504k73408J26464d94080D75648K17600M73600c55840A83296
$$ 1292288 464896 806400 532992 659456 -494080 475648 693248 1166848 -355840 183296
7203A160704l98336P50080C43552D2496i3184A328128E56544Q06912a059328G20896
$$ 1160704 762368 1512448 343552 42496 -93184 1328128 556544 1363456 -1059328 720896
7192G32672C64544j70496m1984O40000b22208G07072D2496O07232Q19200n71392
$$ 732672 364544 194048 152064 792064 -222208 707072 42496 649728 1468928 897536
7182H97536A54624K70848K17600q3968a65376f9632A36704M93568n1200j34656
$$ 897536 154624 425472 643072 559104 -165376 -69632 136704 630272 579072 444416
7172D44416a33632G9360R20576d84864A01376K82624P11168m67968P22432m40320
$$ 444416 -133632 79360 999936 -484864 101376 384000 1095168 627200 1349632 909312
7162I09312J195008e56544H03328c55840D70528%h30976I63072M09088m23936
$$ 909312 2104320 -556544 803328 -355840 470528 470528 -830976 963072 1372160 948224
7152I48224K30400E14560N62176j39776c79392A411584b43712E22240J95584O13888
$$ 948224 1178624 514560 1076736 936960 -379392 1411584 -243712 522240 717824 1331712
7142A331712m63872l58912F656J68448K73920a16736F4512a12640B27328Q30976
$$ 1331712 867840 508928 6656 175104 449024 -116736 64512 -112640 227328 1058304
7132A058304A94560h3968J536E84704N77024G1168J48992R08288B55488J174016
$$ 1058304 194560 -83968 -82432 584704 1161728 71168 220160 1128448 255488 1429504
7122A429504F90176a0752C47136Q04864e30432o42048G06048B01216G3728a14176
$$ 1429504 690176 -10752 347136 1152000 -530432 -1172480 706048 201216 73728 -114176
7111I1648b35520F24128d83840C22560R216J437696C90144a46432D34176J209856
$$ 91648 -235520 624128 -483840 322560 331776 1769472 390144 -146432 434176 1644032
7101A644032n89824m84864A08544K21696L50720B76992H1408M25984K71872A40288
$$ 1644032 1054208 569344 108544 330240 680960 276992 81408 507392 779264 140288
7090A457664l03104j97120G7824i4720B238464c072H30976j42848E7856N36576
$$ 1457664 1154560 957440 77824 -94720 2238464 -3072 830976 688128 57856 594432
7080E94432G7824L28192H4480K31936J510400A49504N51424N02784i728E12000
$$ 594432 77824 406016 84480 316416 1826816 149504 700928 1203712 -9728 512000
7069b10944I2672Q06912D04480O17984d34176A588224c48672H704K49344L91680
$$ -210944 92672 899584 404480 1022464 -434176 1588224 -348672 8704 258048 649728
7059F49728b75456A929216q15104C55840A44384J06496c69152A992704C58912
$$ 649728 -275456 1929216 1114112 355840 144384 250880 -369152 1992704 358912
7049A060352e52960A447936C43040N04832M87424F48192P83360a62816o78400
$$ 1060352 -552960 1447936 343040 847872 1335296 648192 1431552 -162816 -841216
7040h41216d03968E50912K56000b97984H38656e5296D92032a71520C40480N5296
$$ -841216 -403968 550912 806912 -297984 838656 -55296 492032 -171520 340480 395776
7030C95776L83488A77152O13376d46464b16064C70688j54624J7920b21184n48864
$$ 395776 779264 177152 790528 -446464 -216064 370688 216064 233984 -221184 -770048
7020g70048H08960A24416J001472J03936B50368P19872L50208j71520k31936B26304
$$ -770048 808960 124416 1125888 1229824 250368 970240 1320448 1148928 916992 226304
7009G26016M01408e54496i0112A048064B06848K94400j20832a9968k80064j69984
$$ 726016 1127424 -554496 -90112 1048064 206848 501248 380416 -19968 -300032 -470016
6999d70016F6048L89120L08224j79712A58720M25984H6528J37216K08384c62496
$$ -470016 66048 455168 763392 583680 158720 584704 86528 223744 432128 -362496
6988F87616Q24320p01440K21184J38240B01728M05504L94752D28544R60512p1680
$$ 687616 1511936 810496 1031680 1169920 201728 607232 1001984 428544 1389056 1317376
6978A317376J39264C00032j02912K27840e71904A30560f656B97984O52800k01216
$$ 1317376 1456640 300032 197120 424960 -571904 130560 -6656 297984 950784 749568
6968G49568c3280A552896B39616O44608M10112B73920J062400K20672A536Q75008
$$ 749568 -33280 1552896 239616 884224 1294336 273920 1336320 1556992 1536 876544
6958H76544K2016j25952B19136H2944M96128Q07936A37216M94080M2496A02912
$$ 876544 898560 772608 219136 82944 579072 1387008 137216 631296 673792 102912
6947E44256Q09984D9664R95328C99360J361920o00064d04480G83360N92384D97664
$$ 544256 1354240 49664 1044992 399360 1761280 1161216 -404480 783360 1375744 497664
6936F7072J327616F54848k82112N9392I5744O34368a73056F29760k36032J7408
$$ 67072 1394688 654848 372736 432128 95744 730112 -173056 629760 393728 411136
6926D11136e92896h3456l6352A700864E16096J09568L16416c81952A044480c35872
$$ 411136 -592896 -83456 -119808 1700864 516096 625664 942080 -381952 1044480 -335872
6915g51104I55904j75616B49856R25696B39616Q87296B41152R08288E31968J58208
$$ -751104 955904 780288 249856 1175552 239616 1126912 241152 1149440 531968 690176
6905F90176K85696l62496b38080D65920L91168e11488A46944L42528K62656N45280
$$ 690176 975872 613376 -238080 465920 857088 -511488 146944 489472 752128 1297408
6895A297408m41344L29216c85536I78944E0688Q61184A01376Q57088C9424P52128
$$ 1297408 856064 1185280 -385536 978944 50688 911872 101376 958464 39424 791552
6885G91552k32960Q22272c04128A265152B15040i1648A262592k56000C29216R16992
$$ 791552 558592 1380864 -304128 1265152 215040 -91648 1262592 1006592 329216 1246208
6875A246208a35168A030144j72032P51104d60288F91200k20672P97184C57888
$$ 1246208 -135168 1030144 858112 1609216 -460288 691200 470528 1267712 357888
6865E92384J212416E05344F2464J035776M27520o81472J70496D70528k04800D6592
$$ 592384 1804800 505344 62464 1098240 1525760 844288 1014784 470528 265728 46592
6854D42368e12I11360A73568Q9600J21856A42848M63360A0240K97984J241600
$$ 442368 -512 911360 173568 263168 385024 142848 606208 10240 308224 1549824
6844A549824H0384N92896B26304P82336l77344B27328J549824B2528J187328c11296
$$ 1549824 80384 673280 226304 1008640 631296 227328 1777152 22528 1209856 -311296
6833F57920k61632P48544b47808c4304H16128A52576b19136A505280j48480K93888
$$ 657920 396288 1144832 -247808 -34304 816128 152576 -219136 1505280 1356800 1650688
6823A650688A7920b64192B27840O54336B50368d5568F96832A12640Q10496J263616
$$ 1650688 17920 -264192 227840 882176 250368 -45568 696832 112640 923136 2186752
6813B186752E53984J12640A98144L77856Q17152n27872B91328N3760c54304j73568
$$ 2186752 553984 666624 198144 576000 1393152 865280 291328 345088 -354304 -527872
6803e27872q4480A602048G40352N9392B86208c08224a4336j37728H1408M05504
$$ -527872 -612352 1602048 740352 799744 286208 -308224 -14336 -152064 81408 486912
6793D86912P11680r8304N20192H08448g86432A31584L99360K86720A45920O07744
$$ 486912 1198592 1100288 1620480 808448 -786432 131584 530944 817664 145920 753664
6783G53664F0416R76384d6080A145344A63328R50272N16608B5088Q92416N10464
$$ 753664 60416 1036800 -46080 1145344 163328 1113600 1630208 25088 917504 1427968
6773A427968K97472A06496M16768Q82688o32832D608M45952K80576L6352C38432
$$ 1427968 1725440 106496 523264 1405952 773120 4608 450560 731136 767488 338432
6762G76192M7616J90976B02752N49376j04960c26144D13184O05184j85856l14368
$$ 776192 823808 1014784 202752 752128 647168 -326144 413184 1018368 832512 518144
6752E18144J040896D87936j97120o5024k0992L99360M73600A93536e3248H81664
$$ 518144 1559040 487936 290816 225792 204800 604160 1077760 193536 -53248 881664
6741A264640m83328l37408j3824r728J276928p98208l06176k17088O09280N23264
$$ 1264640 781312 443904 430080 420352 1697280 899072 592896 375808 985088 1508352
6731A508352j01888a41824j73568A896448A73568J077248F3488E632L6352J40288
$$ 1508352 1406464 -141824 -315392 1896448 173568 1250816 63488 5632 41984 182272
6721A82272N78560J38240L13344b74432F68160j64864a66400D50560J063424p09120
$$ 182272 760832 899072 1212416 -274432 668160 503296 -166400 450560 1513984 804864
6711H04864Q02816B95936M61312a22880A149440P09632B87232K20672M83328j32608
$$ 804864 1607680 295936 757248 -122880 1149440 1859072 287232 507904 991232 858624
6701H58624l26144B42176l8400J86368N53984M08064E16608J473536r41568O1440
$$ 858624 532480 242176 203776 390144 944128 1352192 516608 1990144 1048576 1110016
6691A110016E02272M85888q2944A52576M53632j21344B05312J745920D10112K20160
$$ 1110016 502272 988160 905216 152576 606208 484864 205312 1951232 410112 630272
6681F30272B00192o7584P31136j82784N09440n52448J59232B42176L70176C3792
$$ 630272 200192 132608 863744 680960 1190400 637952 797184 242176 612352 33792
6670A481728n84704Q2432B76480J057280L46112n69344G8848J581568E04832J071616
$$ 1481728 897024 979456 276480 1333760 1679872 1110528 78848 1660416 504832 1576448
6660A576448B99520a063936A605120D72576c05664B29376r5232P02464J035776
$$ 1576448 299520 -1063936 1605120 472576 -305664 229376 134144 836608 1872384
6651A872384E81632L584A1776J088512B56512O85056m9152K20160D9152N01248
$$ 1872384 581632 585216 11776 1100288 256512 941568 892416 1112576 49152 550400
6641E50400L48672a1264H64768C15904f42048I53856k36544J04960C82464R53856
$$ 550400 899072 -11264 864768 315904 -642048 953856 717312 822272 382464 1336320
6631A336320n03296J081344j0752H72960A28512J063936A18272a74080H33536
$$ 1336320 833024 1914368 1903616 872960 128512 1192448 118272 -174080 833536
6621d0448B73920a42336F68160a16224B56512M77184J07520Q34560G07584H9088
$$ -40448 273920 -142336 668160 -116224 256512 733696 841216 1675776 707584 89088
6610A340416D85888J38240L39456h9088A146368k87744c44576C12832g0144H68352
$$ 1340416 485888 624128 963584 -89088 1146368 858624 -344576 312832 -70144 868352
6599F22592j16736M58240C14880J417728E87264L54304L6864j89440M97664F41024
$$ 622592 505856 964096 314880 1732608 587264 941568 978432 788992 1286656 641024
6588A42848R26208k90816N18144N82144o73792M43392l51744m10112N22240E80096
$$ 142848 1069056 778240 1296384 1878528 1204736 1648128 1296384 886272 1408512 580096
6577H56064B65728K58560o7584k06848M80768C32800R80992a68960A082880C48672
$$ 856064 265728 524288 456704 249856 730624 332800 1313792 -168960 1082880 348672
6566B32960Q60160C04640j31584J885184a46432I35936m49536N21728C88608n9904
$$ 232960 1093120 304640 173056 2058240 -146432 935936 486400 1008128 388608 328704
6556C28704P00416c07200A334784n53984l36896R7792m9152J88416B10432Q22784
$$ 328704 1029120 -307200 1334784 780800 443904 541696 492544 680960 210432 1033216
6546A033216a95584E33504P07584E62176K92352R88160G90528c79392f8608G21408
$$ 1033216 -195584 533504 1241088 562176 854528 1842688 790528 -379392 -68608 721408
6535D56704R46688A0240O33344j88928O6048M64896j50016b7648H37632k77504
$$ 456704 1403392 10240 643584 454656 520704 985600 835584 -27648 837632 560128
6525E60128L5328B22208J127936C46112O72256b36544E06880J199104C56864n0176
$$ 560128 595456 222208 1350144 346112 1018368 -236544 506880 1705984 356864 306688
6515C06688R64608A07520L34336J015296F13888j57696J375232o53824M36736
$$ 306688 1271296 107520 441856 1457152 613888 456192 1831424 1177600 1614336
6506A614336p44448J56672m37760K90304J217536C46624d09600A039872k69312
$$ 1614336 869888 1026560 588800 879104 2096640 346624 -409600 1039872 770560
6497G70560l0208a61792D12160G4240J064448l97312k71872O89152d36224A360384
$$ 770560 740352 -161792 412160 74240 1138688 741376 469504 1158656 -436224 1360384
6486A461760q4480k00192B30912N49376j31072M50048O70208n26336n56544O36928
$$ 1461760 1377280 1177088 230912 780288 649216 1099264 1769472 1243136 686592 1323520
6476A323520J22368n71392j85344r7280L89120C78880L34336A88928J247744I7280
$$ 1323520 1445888 874496 689152 591872 980992 378880 713216 188928 1436672 97280
6465A06496Q01280O79936A74592P81824l77344j38752N35040j73568H7040K97984
$$ 106496 907776 1587712 174592 956416 579072 440320 975360 801792 87040 385024
6455C85024R65632J34656n55520k50880A85344O16960J1264M47488m71552O91712
$$ 385024 1350656 1485312 929792 678912 185344 802304 813568 1261056 789504 1481216
6445A481216C96288a32096A849344B40640N70368k00192J155584F56896J534976
$$ 1481216 396288 -132096 1849344 240640 811008 610816 1766400 656896 2191872
6436B191872A33632O17472N0176A73568Q03328m02944N34016j65376O22592P5264
$$ 2191872 133632 751104 801280 173568 976896 573952 1107968 942592 1565184 1640448
6426A640448n37600j18784l20000j96096K48320e5808H33024k73920L81440M17792
$$ 1640448 1102848 984064 664064 467968 716288 -55808 833024 559104 940544 1358336
6416A358336F71232n8368C02592O81984B52928J470464G66464N6320P28576k49856
$$ 1358336 671232 612864 302592 984576 252928 1723392 766464 822784 1551360 1301504
6406A301504C43040A1264L60960M43392L03104l07200k64704N10976K01728e9904
$$ 1301504 343040 11264 372224 815616 1118720 811520 546816 1057792 1259520 -59904
6395A281024m4544N57568m85888D97664B31936O00576r1136l29216M31616O81472
$$ 1281024 1236480 1794048 1308160 497664 231936 832512 741376 412160 843776 1525248
6385A525248l30752C18464K29376O21568M92032j08544A47968J18784N35040l50208
$$ 1525248 1194496 318464 547840 1169408 1661440 1552896 147968 266752 801792 451584
6375D51584n1200r9328r2160J88928G0656J11104M15232q0384J28000k68288J127936
$$ 451584 400384 301056 208896 397824 70656 181760 596992 516608 644608 376320 1504256
6364A504256E74464B12992K28864M00896K70336B5088J854464E94432O87616p7312
$$ 1504256 574464 212992 441856 842752 1113088 25088 1879552 594432 1282048 1204736
6354A204736k25280R3184l32288N60640E67296Q90880l02080D56704d73600A340416
$$ 1204736 979456 1072640 740352 1300992 567296 1458176 1156096 456704 -473600 1340416
6343D35200K06848N78048l38432L15392k66752D61312M8128N86752n29408R6768
$$ 435200 642048 1220096 881664 1197056 930304 461312 509440 1096192 566784 663552
6333F63552J39776j68448o656e26848E54496N84192m54144O58944m47488b048
$$ 663552 803328 634880 628224 -526848 554496 1138688 684544 1343488 896000 -2048
6322E48864O42560N4784C56864q9088K99008m8128j5872L02080N52960D26496
$$ 548864 1191424 1246208 356864 267776 566784 518656 502784 804864 1357824 426496
6311A338880B70336H1408J692672k0992A22880P98208K87232K26304a34656A686528
$$ 1338880 270336 81408 1774080 1753088 122880 921088 1208320 1434624 -134656 1686528
6300A036288Q73472r21600K80576A24416O91200O67648K35008l03616J21344g50592
$$ 1036288 1909760 988160 1268736 124416 815616 1483264 1718272 1414656 1536000 -750592
6289A047040J39776k75456l28704J45408M38272h3968D19840M36736K20672K56512
$$ 1047040 1186816 911360 582656 728064 1166336 -83968 419840 856576 1077248 1333760
6279A333760k4064J94560F23104k51392L90656j78176R88672C52256N93408N01248
$$ 1333760 1309696 1504256 623104 371712 762368 584192 1572864 352256 945664 1446912
6269A446912A56672R08288n23776O01088m36224L21024M94592j024n41696l95264
$$ 1446912 156672 1064960 541184 1142272 706048 1027072 1521664 1520640 978944 583680
6259E83680J67936N38624n67296K61120D29056L05152K70336k43712A49504J305088
$$ 583680 751616 1290240 722944 984064 429056 734208 1004544 760832 149504 1454592
6249A454592k08896B048P17312K80064L9936b9184G56736K11968Q10496F01088
$$ 1454592 1245696 2048 719360 999424 1039360 -29184 756736 968704 1779200 601088
6238A378304q1920n15072N32992j70496E26336M07040m53632j94560O23104k26816
$$ 1378304 1296384 781312 1314304 1143808 526336 933376 479744 285184 908288 681472
6228F81472C27168P45472r6768K76992C37920K56512J71008Q52992G33184l66080
$$ 681472 327168 1072640 975872 1252864 337920 594432 765440 1618432 733184 367104
6218C67104K17600L32288P56736p38816N72928B56000b66240A411584m80256O90176
$$ 367104 584704 916992 1673728 934912 1507840 256000 -266240 1411584 931328 1621504
6208A621504m86400L47648F69184P28064M64384p83360l14880N12512r3696J62816
$$ 1621504 1135104 1482752 669184 1397248 1861632 1078272 763392 1275904 1182208 1345024
6198A345024m82304P42912c2768I56416j82784k80064M7616A024J247232O3488
$$ 1345024 862720 1605632 -32768 956416 773632 493568 541184 1024 1248256 1311744
6188A311744D62336A20832L69152J349120E49888P09632l99360M21888M33664
$$ 1311744 462336 120832 489984 1839104 549888 1259520 860160 1282048 1715712
6179A715712G79776L5840p1680d23424A046016m44416A57184J068544q704R4720
$$ 1715712 779776 815616 743936 -423424 1046016 601600 157184 1225728 1217024 1311744
6169A311744n5808b3552H28928L76320Q71424A23392N61664M28544M07040D44928
$$ 1311744 1255936 -23552 828928 1205248 2076672 123392 685056 1113600 1520640 444928
6158A633280B97472L89632R06240C55840C6864J493504F25152K12480l19488R18528
$$ 1633280 297472 687104 1593344 355840 36864 1530368 625152 837632 518144 1436672
6148A436672m64384K88768n87264K18624k05824f31296B29888O72256K50880d8128
$$ 1436672 972288 1261056 673792 892416 686592 -631296 229888 902144 1153024 -48128
6137A72032J146368B68800J326592B57536J011200H4992J416704k96960J96096
$$ 172032 1318400 268800 1595392 257536 1268736 84992 1501696 1204736 1400832
6128A400832C01056P81312J52576k28864K90304l00544l40480Q89856H704e61664
$$ 1400832 301056 1082368 1234944 1006080 1296384 995840 655360 1545216 8704 -561664
6117B409472a22368I09824L45600O45632d2496G77728K09920L61472o1440g3216
$$ 2409472 -122368 909824 1255424 1901056 -42496 777728 987648 1349120 1287680 -73216
6106A527808n68832J78688M18816j72032k18112L85024k95424A0240Q76544P40352
$$ 1527808 958976 1137664 1556480 1384448 1166336 1551360 1255936 10240 886784 1627136
6096A627136o50752C90144M27008J028096H69376k24256A29024Q09472k28864
$$ 1627136 976384 390144 817152 1845248 869376 645120 129024 938496 709632
6087G09632K17600R728O18496k85696K17088k49856J17760M14720o93760D70528
$$ 709632 927232 936960 1555456 1269760 1486848 1236992 1354752 1769472 1075712 470528
6076H30464m2496J47456C33312J612800E79584K76480l02080K97984K36544L1232
$$ 830464 787968 935424 333312 1946112 579584 856064 553984 851968 1088512 1119744
6066A119744j63840K91328l1232M3520n02784l49184J265152m20864C63520O01600
$$ 1119744 955904 1247232 1216000 1259520 756736 407552 1672704 1251840 363520 965120
6056I65120j32096l69664J178112J30048D75136N52448D28032O52288M41344o69184
$$ 965120 833024 463360 1641472 1771520 475136 1027584 428032 1080320 1521664 852480
6046H52480L62496B24256J135104K7648J66912O94784c17952l41504I34400P78240
$$ 852480 1214976 224256 1359360 1387008 1553920 2248704 -317952 -659456 934400 1712640
6036A712640E27360J326080l88608F79424K78528l94752O28224A66400O16960
$$ 1712640 527360 1853440 1464832 679424 957952 563200 1191424 166400 783360
6027G83360J9456B61632P35744l8912L60448o08768P66464n04832M89472n43232
$$ 783360 802816 261632 997376 958464 1318912 710144 1476608 971776 1461248 918016
6017I18016A76640R29280M54656K6624p07072Q64768b02240A863168J34144p73120
$$ 918016 176640 1105920 1560576 1587200 880128 1744896 -202240 1863168 1997312 1224192
6007A224192n68320P08096N10976p27040o4512O60992k11456E58592O09792E73440
$$ 1224192 655872 1363968 1874944 1147904 1083392 1744384 1532928 558592 1168384 573440
5996A156096K68288o38464k27328c62496B970624I73824N22240J99168R8304C36384
$$ 1156096 1424384 785920 558592 -362496 2970624 973824 1496064 1695232 1793536 336384
5985I02656I8304M88448J371136q96512O83520o48192J022464F88640O14400N64736
$$ 902656 98304 586752 1957888 1061376 1744896 1096704 2119168 688640 1303040 1867776
5975A867776I18528K75968L71712f8096I5744J020416k5088n03808M56704P01952
$$ 1867776 918528 1194496 1566208 -68096 95744 1116160 1091072 587264 1043968 1745920
5965A745920q43264J47456R97376r34912l61984B10944J008128D5568J288704
$$ 1745920 902656 1050112 2047488 1112576 750592 210944 1219072 45568 1334272
5956A334272J065472o25152q37120J87904m09088J114112p53152A36704L55328
$$ 1334272 2399744 1774592 937472 1125376 716288 1830400 1077248 136704 492032
5947D92032J093120m42880L82464M64384I33888M65920o57920r5744K29376L9424
$$ 492032 1585152 1142272 1524736 1989120 933888 1399808 741888 646144 875520 914944
5937I14944j10080H1920J722880o21568k00704l84000J061376n32992a50016D55680
$$ 914944 804864 81920 1804800 1183232 982528 598528 1659904 1126912 -150016 455680
5926D45440J397760q35584j4848L06688J44384J32096D56192K84160c05664A559552
$$ 445440 1843200 1007616 992768 1299456 1443840 1575936 456192 740352 -305664 1559552
5915A273856K19648k87232K44736l58912J40288K33984F29760n0176a13664B079232
$$ 1273856 1493504 1206272 1451008 1092096 1232384 1466368 629760 579584 -113664 2079232
5904A401344E52448K58048K12480m78208B68800O77376m08064R35936M25472G06048
$$ 1401344 552448 810496 1022976 544768 268800 946176 538112 1474048 1899520 706048
5893A606144n98016C08736J80736N08416K01728R39008q59136N50912o83520j55136
$$ 1606144 1008128 308736 489472 997888 1199616 2138624 1279488 1830400 1146880 991744
5883I91744l98848Q93440l64032j53088m4032J49504k16064K54464K70848N9904
$$ 991744 592896 1486336 1122304 969216 925184 1074688 858624 1113088 1383936 1443840
5873A443840B80576K24768n3248j72032a00352F50752A24416J583104L51232E87776
$$ 1443840 280576 505344 452096 280064 -100352 650752 124416 1707520 2058752 587776
5862A737728K36032r00096L5328l46624l53792A40800J072640k78016C88096Q4992
$$ 1737728 1973760 1073664 1108992 762368 408576 140800 1213440 935424 388096 473088
5852D73088k22208O32832k50880L25120P02464L072p18848P44448H1408d36736
$$ 473088 250880 883712 632832 957952 1660416 1663488 944640 1689088 81408 -436736
5841I76896k96448J04960A75104N15584J055744p75680N52448l23072J426432
$$ 976896 680448 785408 175104 690688 1746432 970752 1523200 1200128 2626560
5832B626560G49056M16768J08544N32480N4272q42752k49344B21184J133056K72896
$$ 2626560 749056 1165824 1274368 1806848 1861120 1018368 769024 221184 1354240 1627136
5822A627136A13664J265664B66240O95808l26656Q37120D09600R99936n62688
$$ 1627136 113664 1379328 266240 962048 635392 1472512 409600 1409536 846848
5813H46848p5264J000448q12032C51232J345536G19360Q47360D52608L51744L63008
$$ 846848 771584 1772032 960000 351232 1696768 719360 1566720 452608 804352 1167360
5803A167360L46112n55520A28000O92224O83008N9904m12160R03680o83520D7104
$$ 1167360 1513472 957952 128000 820224 1503232 1563136 1150976 2054656 1371136 47104
5792G06048R87648l59936j00352m04480R67680R3184o75840M29568j83808p21408
$$ 706048 1693696 1333760 1233408 828928 1796608 1889792 1213952 1643520 1459712 738304
5782G38304O81472K75968l81440M75648F38976J453056n60640D73088J110528
$$ 738304 1419776 1695744 1314304 1789952 638976 2092032 1531392 473088 1583616
5773A583616G22432n5808M73088M77184N53984A019392j48992h0384A909248m74624
$$ 1583616 722432 666624 1139712 1616896 2170880 1019392 870400 -80384 1909248 1434624
5763A434624M8128m14208C73760J39776J515520o73792D13696J490944E93920
$$ 1434624 1482752 1068544 373760 513536 2029056 1355264 413696 1904640 593920
5753A055744K30400E31968J867264G05024M40832K57536M65920m54144l68128
$$ 1055744 1286144 531968 2399232 705024 1145856 1403392 1869312 1415168 1047040
5744A047040Q8064m46976P06048n42208R56928o52288l31776J05984R9840k56512
$$ 1047040 1135104 688128 1394176 851968 1808896 1156608 824832 930816 1030656 774144
5734G74144J297920H99584L56352O8608k12992E43744K2016N77024D99712J520128
$$ 774144 2072064 899584 1255936 1324544 1111552 543744 565760 1142784 499712 2019840
5724B019840k60096j24928l15392k50368P99744I07776K05824L35360J05984l42016
$$ 2019840 1759744 1634816 1319424 1069056 1868800 907776 1113600 1448960 1554944 1212928
5714A212928L45600C63520J054208P82848E07392j55648M26496N31456M85888
$$ 1212928 1558528 363520 1417728 2200576 507392 351744 778240 1309696 1795584
5705A795584H60672M25472r5232M13696m80256m06528J235968G71072K03776D61312
$$ 1795584 860672 1286144 1190912 1604608 1124352 717824 1953792 771072 974848 461312
5694A657344n80608L62496r6256J67424P1680j87392k02240P83360k09920j74080
$$ 1657344 1076736 1439232 1342976 1510400 1582080 1394688 1192448 1975808 1765888 1591808
5684A591808G43936L25632K99520k06848J59232L1232N39136F91712P59808E16096
$$ 1591808 743936 1069568 1369088 1162240 1321472 1352704 1891840 691712 1451520 516096
5673F72768M01408p4240N08928D15744J203712n13536c4304A218560j2288m72576
$$ 672768 1074176 999936 1508864 415744 1619456 1105920 -34304 1218560 1206272 733696
5663G33696M83840Q17664L16928F56896M32640M93056l0720j50016D55168J101312
$$ 733696 1217536 2035200 2352128 656896 1089536 1582592 1551872 1401856 455168 1556480
5653A556480j24416J058816H48896J168896p69536K44736o94784L76832R58464
$$ 1556480 1432064 2490880 848896 2017792 1248256 1492992 798208 1175040 2133504
5644B133504n60128m75136Q72448p00928J536O4512O28736N2224B53952J424896
$$ 2133504 1573376 1098240 1970688 1269760 1271296 1335808 1964544 2016768 253952 1678848
5634A678848l78368O58432G55712J065472N2224G04000J775616j154048Q6016
$$ 1678848 1300480 1958912 755712 1821184 1873408 704000 2479616 1325568 1411584
5625A411584C95264j86880J442816l56864r9328L08736E46816M73600J028096
$$ 1411584 395264 208384 1651200 1294336 1195008 1503744 546816 1020416 2048512
5616B048512F70208L23584O91712l62496O8608M40320J51552o30784n2224P48544
$$ 2048512 670208 993792 1685504 1323008 1391616 1831936 1983488 1352704 1300480 2049024
5606B049024q08960J373184A280512K43712j4336R75872G71584J129472j32096
$$ 2049024 1240064 2613248 1280512 1524224 1509888 2485760 771584 1901056 1768960
5597A768960P0144P60832m65408l22560P40864j61280q45824k78016N66784O66112
$$ 1768960 1839104 2599936 2134528 1811968 2552832 2391552 1545728 1267712 1834496 2500608
5587B500608j189376O23616p07072J572352j312256L15904n63712J149952m65408
$$ 2500608 1311232 1934848 1227776 2800128 1487872 1803776 1240064 2390016 1924608
5578A924608A71008J501184m36224D65408J417216H89344R03680k39616O45632
$$ 1924608 171008 1672192 1235968 465408 1882624 889344 1793024 1553408 2199040
5569B199040q5504A91488P02464l63008M34688P16288m54144l27680l70176J354240
$$ 2199040 2113536 191488 893952 530944 965632 1681920 1227776 900096 529920 1884160
5559A884160l20512J04448p42912j14688R85600F94272J244672G83360L49184
$$ 1884160 1563648 1668096 925184 810496 1796096 694272 1938944 783360 1132544
5550A132544k66752O27200N8368K00704j14176M06528o91200j65888J271808n35552
$$ 1132544 865792 1492992 1551360 1752064 1637888 2044416 1353216 1187328 2459136 1923584
5540A923584k42688o01088N99552q19200L25120m53632J758208r69728M24960
$$ 1923584 1680896 1079808 1679360 860160 1185280 731648 2489856 1520128 1945088
5531A945088k89792l57888M59776G01440l18464R46176j62304L80416j16736N60128
$$ 1945088 1655296 1297408 1757184 701440 382976 1329152 1166848 1547264 1430528 1990656
5521A990656n0688C90656J773568E38624P55200K18112m68992n09440M03968k71872
$$ 1990656 1939968 390656 2164224 538624 1293824 1511936 1042944 533504 937472 665600
5511F65600O76864J288704o47168m43392Q43776j52576n83168L8912K51392G19360
$$ 665600 1342464 2631168 1984000 1540608 2384384 2231808 1648640 1687552 1938944 719360
5500A910272H82688P90016q13568P67488n77536K45760K95936n64224O21056m08576
$$ 1910272 882688 1672704 859136 1626624 1049088 1294848 1590784 1026560 1647616 1239040
5490A239040P6288O79936l11808N48352l97824L65568n51936P53152m74624n02272
$$ 1239040 1315328 1995264 1683456 2231808 1833984 2199552 1647616 2400768 1926144 1423872
5480A423872O07744J14688K81600J95072m82816k76992o36928O01088O64064I24160
$$ 1423872 2031616 2146304 2427904 2622976 2140160 1863168 1226240 1827328 2491392 924160
5469B343936O6048r4208j21344o50240L63008Q49920A376768J63328M09600n22240
$$ 2343936 2409984 2315776 2194432 1544192 1907200 2757120 1376768 1540096 1949696 1427456
5459A427456q9088L08224l43040L64032G49056Q73984j54112j66912J168896m40320
$$ 1427456 1338368 1646592 1303552 1667584 749056 1623040 1468928 1302016 2470912 2030592
5449B030592l1232p86432J229312q02304J022464j127936Q02816n12000j91488
$$ 2030592 1999360 1212928 2442240 1639936 2662400 1534464 2337280 1825280 1633792
5440A633792M96640n23264L10272k28864Q44288k6624K03776O4000m13184n22752
$$ 1633792 2130432 1607168 1917440 1688576 2532864 2506240 2710016 2774016 2360832 1838080
5430A838080M84864m8128j62304J25440j0752L21024A138688P02976j024j35680
$$ 1838080 2322944 2274816 2112512 2237952 2227200 2548224 1138688 1841664 1840640 1704960
5420A704960J760768j718784n12000N13024J260544A392128l34848L23584M20864
$$ 1704960 3465728 1746944 1234944 1747968 3008512 1392128 1057280 1380864 1801728
5411A801728k93888O62016o78912N11488n4784J4848q54528J177600J1264A077760
$$ 1801728 1507840 2169856 1490944 2002432 1947648 1962496 1107968 2285568 2296832 1077760
5400A071616J50528J864192A423360n64736R66656n91872J135616M69504E57056
$$ 1071616 1222144 3086336 1423360 858624 1825280 1233408 2369024 2838528 557056
5390H38144K46272J426432l19488n24800L57888p17824K72384m4032J57696n80096
$$ 838144 1084416 2510848 2191360 1666560 2024448 1306624 1579008 1534976 1692672 1112576
5380A112576R09824q97024P55712m63360L2256j88928L78880l48160N60640L18976
$$ 1112576 2022400 1125376 1881088 1417728 1449984 1261056 1639936 1291776 1852416 2171392
5370B171392n59104l95776P23456F76352J41312l80928N72928L43040M04992n28384
$$ 2171392 1612288 1216512 1939968 676352 817664 436736 1009664 1352704 1757696 1229312
5360A229312m55168J016320q27392Q22272q08960J24928j27488J262080Q0896
$$ 1229312 774144 1790464 963072 1785344 976384 1101312 973824 2235904 2316800
5351B316800K8160p75680J053696q81152j04448j56160N89824m52608k56512K86208
$$ 2316800 2344960 1569280 2622976 1741824 1637376 1481216 2071040 1618432 1361920 1648128
5341A648128N41184A077760P7824N45280R01120H54528J370624D47488O59456
$$ 1648128 2189312 1077760 1155584 1700864 2601984 854528 2225152 447488 1106944
5332A106944C00544J116672N80608k61120m43392P81312o23104j5360F53824M17280
$$ 1106944 300544 1417216 1997824 1736704 1293312 2074624 1451520 1436160 653824 1071104
5322A071104K54976M4544j39776J115648q95488l32800J55648n120j43872O97344
$$ 1071104 1326080 1370624 1230848 2346496 1451008 1118208 1273856 1268736 1124864 1822208
5312A822208P34720o31296k76480n76512Q35584p80288J86368n9392M31616k68288
$$ 1822208 2556928 1925632 1649152 1072640 1908224 1127936 1314304 1254912 1686528 1418240
5302A418240L89120G98208M26496K10432k18624l32288N99040L90144A98144J567232
$$ 1418240 1807360 798208 1224704 1435136 1216512 884224 1483264 1873408 198144 1765376
5292A765376k79040J31584K33984l74272l50720J124352n26848J528320A448960
$$ 1765376 1486336 1617920 1851904 1477632 1126912 2251264 1724416 3252736 1448960
5282A199616K28352J62816R13920r70240j77664N41696K27328j34656N41184o27200
$$ 1199616 1427968 1590784 2504704 1534464 1356800 1898496 2125824 1991168 2532352 1905152
5272A905152p0656m03968R63072j027584K66752M72064I05728k5600P47520N37600
$$ 1905152 1834496 1430528 2393600 1366016 1632768 2104832 905728 880128 1627648 2165248
5262B165248l85024O31808l48672q73984L71200F34880R99424r3184o25664Q48384
$$ 2165248 1780224 2412032 2063360 1189376 1560576 634880 1634304 1541120 915456 1763840
5252A763840K5600p8336m81280p1680O62016k24256Q08448l13856p07584J25952
$$ 1763840 1789440 1711104 1229824 1158144 1820160 1595904 2404352 2090496 1382912 1508864
5242A508864J294848I73824L82976J118720o54848L54816j059840O11840L49696
$$ 1508864 2803712 973824 1356800 2475520 1820672 2175488 1115648 1727488 2077184
5233B077184I82528J085440k31424o38976O72256m80256j77152J049088A060352
$$ 2077184 982528 2067968 1836544 1197568 1869824 1389568 1212416 2261504 1060352
5223A288704l92704j55648J171456K45760k47296n69856D94592J620992L37920
$$ 1288704 896000 740352 1911808 2157568 1910272 1340416 494592 2115584 2453504
5214B453504j024000J182720A105408N9904q3968l70688K275328A013760K03264
$$ 2453504 1429504 2612224 1105408 1165312 1081344 710656 2985984 1013760 1217024
5205A217024J038848m41856o86080J787392n98528p66464K41664P18336p35232
$$ 1217024 2255872 1814016 1127936 2915328 2316800 1550336 1792000 2510336 1775104
5196A775104q6016N70368K06848n75488K67776O11840K46272r84064J330176m9152
$$ 1775104 1689088 2259456 2466304 1890816 2158592 2770432 3016704 2032640 3362816 3313664
5186C313664j050112M40320O96832M4544j25440l39968O81984l67104m01408j10080
$$ 3313664 2263552 2703872 3400704 3445248 3319808 2979840 3661824 3294720 2893312 2783232
5176B783232j330688l06688J00864l6352J120256J41824I98912Q32000M51584
$$ 2783232 1452544 1145856 1246720 1210368 2330624 2472448 998912 1830912 2282496
5167B282496R4208j050112l62496K199552j250304r7280q99584J199104M096o78912
$$ 2282496 2376704 1326592 964096 3163648 1913344 1816064 916480 2115584 2119680 1440768
5157A440768j71008K107392j307648O7072k24256j26464n88288J55648P9872j50016
$$ 1440768 1269760 3377152 2069504 2136576 1912320 1785856 1197568 1353216 1433088 1283072
5147A283072R46688O9120A118208J330176j025536m53120J323008j05984F66112
$$ 1283072 2229760 2298880 1118208 2448384 1422848 969728 2292736 2186752 666112
5137B678272n28384j041408P03488o20032R98400j73568q78080J290240A124352
$$ 2678272 2149888 1108480 1811968 1191936 2190336 2016768 1138688 2428928 1124352
5127A817088p49568P31648n88288J905152A532416l88096J097216k56000K00192
$$ 1817088 1067520 1799168 1210880 3116032 1532416 1144320 2241536 1985536 2185728
5118B185728q82176L97312m14208N98528k51904L8400L13344q16128J041920o57408
$$ 2185728 1303552 1700864 1286656 1885184 1633280 1671680 1985024 1168896 2210816 1553408
5108A553408K76480Q12032m49024r57952K3552M40320q0384O39488l73760j15712
$$ 1553408 1829888 2641920 2192896 1234944 1258496 1698816 1618432 2257920 1884160 1768448
5098A768448p00928Q24832Q28416l10784H28928J375744r26208J150976j027584
$$ 1768448 1067520 1892352 2720768 2409984 828928 2204672 1278464 2429440 1401856
5089A401856L96288l84512K52416O78400Q704N67808A313280L08224O37440N21216
$$ 1401856 1798144 1413632 1666048 2344448 2353152 2920960 1313280 1621504 2258944 2780160
5079B780160o53824R22624j342976Q19200m30592m53120O92736m89472O65600
$$ 2780160 2126336 3048960 1705984 2525184 2094592 1641472 2334208 1844736 2510336
5070B510336j041920j42848Q29952j036288Q61184m55168J555968k72896j097216
$$ 2510336 1468416 1325568 2155520 1119232 1980416 1525248 3081216 2808320 1711104
5061A711104Q00768Q98560j099776l70176l24608R1136P09632o38464O74304J29024
$$ 1711104 2511872 3410432 2310656 1940480 1615872 1707008 2416640 1778176 2452480 2581504
5051B581504n34016l41504K24768K10944J26464j68960J62304I30304J697280
$$ 2581504 2047488 1705984 1930752 2141696 2268160 2099200 2261504 930304 2627584
5042B627584L1744n69344o54336J656320j124352P88992j156608K043904A820160
$$ 2627584 2659328 2089984 1435648 3091968 1967616 2756608 1600000 3643904 1820160
5032B575872L96800j87392p19872q0384R8816N81632j1264j227776J79712K011136
$$ 2575872 2972672 2785280 2065408 1985024 2083840 2665472 2654208 1426432 1606144 3617280
5022C617280j427968J456128A475072O59968l87584J005568o22080Q27392L584
$$ 3617280 2189312 3645440 1475072 2135040 1747456 2753024 2130944 2958336 2961920
5013B961920A373696E49376K109952m29056k19648j33632Q48384l52768l89632
$$ 2961920 1373696 549376 2659328 2230272 2010624 1876992 2725376 2372608 1982976
5004A982976K77504Q24320j9968j175040n83680J245696M03456j190912J607168
$$ 1982976 2260480 3084800 3064832 1889792 1306112 2551808 2955264 1764352 3371520
4995C371520r26208M03456j317376J052672J064448j246208L04128n00736K81600
$$ 3371520 2445312 2848768 1531392 2584064 3648512 2402304 2706432 2205696 2487296
4986B487296o59968q16128N22752J199616n04320l30240m66432L08224J335296
$$ 2487296 1827328 1011200 1533952 2733568 2229248 1899008 1432576 1740800 3076096
4977C076096q78592m9152K11456l13344m06528L55840P4752J6384R37472j244672
$$ 3076096 2197504 2148352 2359808 2046464 1639936 1995776 2070528 2086912 3024384 1779712
4967A779712M37248l11808k06848N74464k60096M06016J22368n6320r7792j02400
$$ 1779712 2216960 1905152 1698304 2272768 2012672 2418688 2541056 2484736 2386944 2284544
4957B284544q7552L0208J76640m07552O83520o04160l61472J020928R6768p58784
$$ 2284544 2196992 2227200 2403840 1996288 2679808 2075648 1714176 2735104 2831872 2073088
4947B073088M608O65600r35424O63552P55712r216J112064j282048q04864J353216
$$ 2073088 2077696 2743296 1807872 2471424 3227136 3217920 4329984 3047936 2243072 3596288
4937C596288j613824J951232n4784J75104j75616P75680n46816N16608J067520
$$ 3596288 1982464 3933696 3878912 4054016 3878400 4654080 4107264 4623872 5691392
4928E691392m53632n15584J611264l1232j09056n89824Q1408j449984m16768K2528
$$ 5691392 5237760 4722176 6333440 6302208 6193152 5603328 5684736 4234752 3817984 3840512
4918C840512k95424A737728N90848K84160o73280q5504l27168m10112J576960
$$ 3840512 3545088 1737728 2328576 2612736 1939456 1853952 1526784 1116672 2693632
4909B693632m48000K54976r51808J097216n78048I97376N27872J080320m18816
$$ 2693632 2245632 2500608 1548800 2646016 2067968 997376 1525248 2605568 2186752
4900B186752m12672M86912N77024A098240J18784R81504J65376k80064G90528
$$ 2186752 1774080 2260992 2838016 1098240 1217024 2198528 2363904 2083840 790528
4890A741824J43360l47648J745408j103360j9456J94560O48704r90208J278464
$$ 1741824 1885184 1537536 3282944 2179584 2160128 2354688 3003392 2013184 3291648
4881C291648A221632J037824K12480o15424J84832N35040L18464j006080K87744
$$ 3291648 1221632 2259456 2471936 1856512 2041344 2576384 2894848 1888768 2176512
4872B176512N02272m15232B67264J684480G51616J317888Q14592A268736J246720
$$ 2176512 2678784 2263552 267264 1951744 751616 2069504 2884096 1268736 2515456
4863B515456j43360p7824J328640j095168l9936p69024J10592K20160L96288J22880
$$ 2515456 2372096 2294272 3622912 2527744 2487808 1718784 1829376 2049536 2445824 2568704
4853B568704p7312q64256J080832m9664j226752N07904P76192J55136E56544R58464
$$ 2568704 2491392 1627136 2707968 2658304 1431552 1939456 2715648 2870784 556544 1515008
4843A515008L69664o27200J494528m1984o49216P77728M27008j567744P34208
$$ 1515008 1884672 1257472 2752000 2710016 2060800 2838528 3265536 1697792 2432000
4834B432000L85024j046016R3184J155072j110528O5536J026560j024000%n46304
$$ 2432000 2817024 1771008 1864192 3019264 1908736 1974272 3000832 1976832 1976832 1430528
4824A430528M74112M7104P0656j20832N44256j88928R82528o74816m52608P60832
$$ 1430528 1904640 1951744 2022400 1901568 2445824 2256896 3239424 2564608 2112000 2872832
4814B872832q50944J80736k13504P81824j090048P91040J554432j831424K72896
$$ 2872832 2021888 2202624 1989120 2770944 1680896 2471936 4026368 2194944 2467840
4805B467840l59936L7376M15744O05696p21408l43040M09600n74976J731072j165824
$$ 2467840 2107904 2145280 2561024 3166720 2445312 2102272 2511872 1936896 3667968 2502144
4795B502144M70016j93536q05888j44896m48000R46688J0240p46496J210880K09408
$$ 2502144 2972160 2778624 1972736 1827840 1379840 2326528 2336768 1590272 2801152 3010560
4785C010560j249792J096192m04480j39776L4816L86048P3728m88960Q82176l80928
$$ 3010560 1760768 2856960 2452480 2312704 2347520 2733568 2807296 2318336 3200512 2819584
4775B819584k0480J583616j715200N88288r216l99872Q17664j485312O52800l40480
$$ 2819584 2799104 4382720 2667520 3255808 3246592 2846720 3664384 2179072 2831872 2491392
4765B491392p37280K5088O75328j43872R77920n26336O16960o88128k63680j132032
$$ 2491392 1754112 1779200 2454528 2310656 3288576 2762240 3379200 2691072 2427392 1295360
4755A295360O12864J627136M96128q81664O11840o78912N72928j042944k25280
$$ 1295360 1908224 3535360 4031488 3149824 3761664 3082752 3655680 2612736 2387456
4746B387456o7584J35168j38240K81600k82112Q86784r37984O47680K15552o56384
$$ 2387456 2319872 2455040 2316800 2598400 2316288 3203072 2265088 2912768 3128320 2471936
4736B471936K03264R55904n42720m64896r15456O65088Q50432q61696R24160p49056
$$ 2471936 2675200 3631104 3088384 2623488 1708032 2373120 3223552 2361856 3286016 2536960
4726B536960N79072L46112l40992J76128j561088K276864j293824J159680o64576
$$ 2536960 3116032 3462144 3121152 3297280 1736192 4013056 2719232 3878912 3214336
4717C214336n6832j73568m69504j45920K78528k80064L49184r78432J083392m44928
$$ 3214336 3157504 2983936 2514432 2368512 2647040 2366976 2716160 1737728 2821120 2376192
4707B376192Q24320j94560j469440P06560k32960m7104J103360q6016n39648K5088
$$ 2376192 3200512 3005952 1536512 2243072 2010112 1963008 3066368 2980352 2440704 2465792
4697B465792J723904A927168J134592j304576K36032R46176n49376j61792m79744
$$ 2465792 4189696 1927168 3061760 1757184 1993216 2939392 2390016 2228224 1748480
4688A748480L85536M68480J45408j0240Q32512L35360j470464K41152n94432R95840
$$ 1748480 2134016 2602496 2747904 2737664 3570176 3905536 2435072 2676224 2081792 3077632
4678C077632q37632j46432J235456r3696j221632Q45824L60960p43936J114112
$$ 3077632 2240000 2093568 3329024 3235328 2013696 2859520 3220480 2476544 3590656
4669C590656k76992R43104j277952Q76032l89632K66240L69152k50368o93760
$$ 3590656 3313664 4256768 2978816 3854848 3465216 3731456 4100608 3850240 3156480
4660C156480P07072M4544l26656M44416j34656l4816j083904k33472n19680P46496
$$ 3156480 3863552 3908096 3581440 4025856 3891200 3856384 2772480 2539008 2019328 2765824
4650B765824L07200j257984N27360O80960J41824j84832k74432R37984j562624
$$ 2765824 3073024 1815040 2342400 3023360 3165184 2980352 2705920 3643904 2081280
4641B081280J069056j44384O55360o79424K33984Q50944o48192K95936l97824
$$ 2081280 3150336 3005952 3661312 2981888 3215872 4066816 3418624 3714560 3316736
4632C316736M12160r32864O77376J61280J206272p80288o1952J8944L46624j218048
$$ 3316736 3728896 2796032 3473408 3634688 4840960 4060672 3998720 4017664 4364288 3146240
4622C146240M92032j75104j3312j024Q2944l06176O22080A719808R94816K37568
$$ 3146240 3638272 3463168 3449856 3448832 3531776 3225600 3847680 1719808 2714624 2952192
4612B952192j141760P45472Q60672j280512R60000L33824q18176L85536m9152
$$ 2952192 1810432 2555904 3416576 2136064 3096064 3429888 2611712 2997248 2948096
4603B948096M40832j247744N32992O55872R37984k031616L28192L47136m33664
$$ 2948096 3388928 2141184 2674176 3330048 4268032 2236416 2564608 2911744 2478080
4594B478080J85856L2768J4848O84544J87904q12544P52128l00032p20896M24960
$$ 2478080 2663936 2696704 2711552 3396096 3584000 2771456 3523584 3223552 2502656 2927616
4584B927616q06912Q06400r06240Q704J432064j293312m8128R00096j31072K95424
$$ 2927616 2120704 2927104 2020864 2029568 3461632 2168320 2120192 3020288 2889216 3184640
4574C184640n78048L18976j34656J70496O144N95456j171968K34496M63360j085952
$$ 3184640 2606592 2925568 2790912 2961408 2967552 3563008 2391040 2625536 3088896 2002944
4564B002944J453056r44640l6352L18976k55488j26976Q07424n60128Q52992l92192
$$ 2002944 3456000 2511360 2475008 2793984 2538496 2411520 3218944 2658816 3511808 3119616
4554C119616O76352p23456M35200N45280l75296p31136J00864k12480J33120J568768
$$ 3119616 3795968 3072512 3507712 4052992 3677696 2946560 3047424 2834944 2968064 4536832
4544D536832B260480J035776m71040O86080l25120n55520Q52480l20512M25984
$$ 4536832 2260480 3296256 2825216 3511296 3186176 2630656 3483136 3162624 3588608
4535C588608O82496j010176L49184q4992J460224j519616L07200j81248P81312
$$ 3588608 4271104 3260928 3610112 3525120 4985344 3465728 3772928 3591680 4372992
4526D372992P9360o34880J37216l75808k56512K46272N07904o69184O24128m34688
$$ 4372992 4452352 3817472 3954688 3578880 3322368 3568640 4076544 3407360 4031488 3596800
4516C596800n21728R29792q19712O35392n18144P48544p23456l34336j80224j8944
$$ 3596800 3075072 4004864 3185152 3820544 3302400 4050944 3327488 2993152 2812928 2793984
4506B793984j17248J444352j305088M36736Q67328q12032k3040j16224R07776
$$ 2793984 2676736 4121088 2816000 3252736 4120064 3308032 3284992 3168768 4076544
4497D076544m55680l50208M07040J602048k090496J12640r64608J081344q192
$$ 4076544 3620864 3270656 3677696 5279744 3189248 3301888 2337280 3418624 3410432
4488C410432n99552R87648q75008K14016N09440o1952M4544k40640k29376N12
$$ 3410432 2810880 3798528 2923520 3137536 3646976 3585024 3629568 3388928 3159552 3160064
4478C160064N13536o38976L62496L38432k2016J15200k41664r51808J208320n80096
$$ 3160064 3673600 3034624 3397120 3735552 3713536 3828736 3587072 2635264 3843584 3263488
4468C263488N10464J21856j151488J466880m13184J534464k383872R86112k57024
$$ 3263488 3773952 3895808 2744320 4211200 3798016 5332480 2948608 3934720 3677696
4459C677696m13696P82336n92384m58240M26496m1472q26368Q63744R21088j03936
$$ 3677696 3264000 4046336 3453952 2995712 3422208 3380736 2554368 3418112 4339200 4235264
4449D235264j208832k75456j35680N85728J55648k39104M56192l44064M44928
$$ 4235264 3026432 2750976 2615296 3201024 3356672 3117568 3573760 3229696 3674624
4440C674624k00192j83808j53600q8576L15392N6832l90656N78560Q6016K25792
$$ 3674624 3474432 3290624 3137024 3048448 3363840 3420672 3030016 3608576 3694592 3920384
4430C920384L26144p40864K54464K0480l9936j025536P39328p06048K79040Q28928
$$ 3920384 4246528 3505664 3760128 3780608 3740672 2715136 3454464 2748416 3027456 3856384
4420C856384N75488l59424l18976J283072p69536L49696J24416o34368J60256
$$ 3856384 4431872 4072448 3753472 5036544 4267008 4616704 4741120 4106752 4267008
4411D267008M88960j44384o16448r9328j167872P08096M4032Q90368j746944m12672
$$ 4267008 4755968 4611584 3995136 3895808 2727936 3436032 3480064 4370432 2623488 2210816
4401B210816J699840m85888l52768Q35584J14688n17632n07904k36032N75488
$$ 2210816 3910656 3424768 3072000 3907584 4022272 3504640 2996736 2760704 3336192
4392C336192k33472L84512K57536l59424Q36096j10592o00064m89984L20000l16416
$$ 3336192 3102720 3487232 3744768 3385344 4221440 4110848 3510784 3020800 3340800 3024384
4382C024384J010176n70880J381888j143808l35360j84832Q14080P91040k309120
$$ 3024384 4034560 3463680 4845568 3701760 3366400 3181568 3995648 4786688 2477568
4373B477568P31136k40128R14432N74976m46976M91008m25984J23392k88768N96480
$$ 2477568 3208704 2968576 3883008 4457984 4011008 4502016 4076032 4199424 3910656 4507136
4363D507136r73312K66752n68832J248256j257472R98912n81632J141248o05696
$$ 4507136 3533824 3800576 3231744 4480000 3222528 4221440 3639808 4781056 4175360
4354D175360j71520j203712J147904l83488q18688J156096L2256m01408O62528
$$ 4175360 4003840 2800128 3948032 3564544 2745856 3901952 3934208 3532800 4195328
4345D195328r19040R09824q64256o20544R17504o8608p48032P168J052160l15392
$$ 4195328 3276288 4186112 3321856 2701312 3618816 3550208 2802176 2809344 3861504 3546112
4335C546112j55136M38272n00736l00544O56896o55360K63168j76640P4240L90144
$$ 3546112 3390976 3829248 3328512 3027968 3684864 3029504 3292672 3116032 3190272 3580416
4325C580416j32608Q69376n43744l75296K58560K88256m39808l23072N07392l3792
$$ 3580416 3447808 4317184 3773440 3398144 3656704 3944960 3505152 3182080 3689472 3655680
4315C655680k48832J115648j392128J201664p40352k2016j555456J165824o76352
$$ 3655680 3406848 4522496 3130368 4332032 3591680 3569664 2014208 3180032 2503680
4306B503680L57376R86624O656j19296p88992l90656O5536J172992l04640N15584
$$ 2503680 2861056 3847680 3854336 3735040 2946048 2555392 2620928 3793920 3489280 4004864
4296D004864L9936j586688O86080M09600l09760l68640O50240N17632j555456
$$ 4004864 4044800 2458112 3144192 3553792 3244032 2875392 3525632 4043264 2487808
4287B487808J604096j64864K96448k65216Q70912o99904j385984J004032p29088
$$ 2487808 4091904 3927040 4223488 3958272 4829184 4129280 2743296 3747328 3018240
4278C018240M00384J98656n15584N40160Q09984j809920J171456q87296Q30976
$$ 3018240 3418624 3617280 3101696 3641856 4451840 2641920 3813376 2926080 3757056
4269C757056Q87808j534976L89632m80768J993728k478592p9360J173504N95456
$$ 3757056 4644864 3109888 3499520 3018752 5012480 2533888 2454528 3628032 4223488
4260D223488n37088r02656P61344N36576k11456p11168Q60160J22880P09120n52960
$$ 4223488 3686400 2783744 3545088 4081664 3870208 3159040 4019200 4142080 4851200 4298240
4250D298240j372160J595392o86592o90688J324032r43104k46272R78432N19680
$$ 4298240 2926080 4521472 3834880 3144192 4468224 3525120 3278848 4257280 4776960
4241D776960o91200l95776l68640J410560n41184Q07936j545728K049536r12896
$$ 4776960 4085760 3689984 3321344 4731904 4190720 4998656 3452928 5502464 4589568
4232D589568o83520J231360j61280o77888K39616R84576J136128j101312o9632
$$ 4589568 3906048 5137408 4976128 4298240 4537856 5522432 6658560 5557248 5487616
4223E487616j127424Q92928l31776l47648N90848j909248O10304K96960j488384
$$ 5487616 4360192 5253120 4921344 4573696 5164544 3255296 3865600 4162560 2674176
4214B674176K811392j03936o40000l06688p36768R6768Q74496K25792r37472j552384
$$ 2674176 5485568 5381632 4741632 4434944 3698176 3794944 4669440 4895232 3957760 2405376
4204B405376J897984p82848J788928K80064o42048n14560j389056K045440M22400
$$ 2405376 4303360 3520512 5309440 5589504 4947456 4432896 3043840 5089280 5511680
4195E511680q1408j472000o77376J583616N55520o11840l21536l61472K56000
$$ 5511680 5430272 3958272 3280896 4864512 5420032 4808192 4486656 4125184 4381184
4186D381184O07744q4480k05312J847808j610240J302016j236480p61856N86752
$$ 4381184 4988928 4904448 4699136 6546944 4936704 6238720 5002240 4240384 4827136
4177D827136M59776k61120p17824o40000J359872n72416l05664K18624R1648O13888
$$ 4827136 5286912 5025792 4307968 3667968 5027840 4455424 4149760 4368384 4460032 5073920
4167E073920n71904K97472L74784j024512k43712N39648j274368K045440n26848
$$ 5073920 4502016 4799488 5174272 4149760 3906048 4445696 3171328 5216768 4689920
4158D689920L77856k01728L00032L4816n23264K89280k72896J29024n89824J081344
$$ 4689920 5067776 4866048 5166080 5200896 4677632 4966912 4694016 4823040 4233216 5314560
4148E314560l77856R69728j572864N00736n48864N46816M25472n91360j376256
$$ 5314560 4936704 5906432 4333568 4834304 4285440 4832256 5257728 4666368 3290112
4139C290112J159680N22240p40864l88608J39776M34688n88800J554432j074688
$$ 3290112 4449792 4972032 4231168 3842560 3982336 4417024 3828224 5382656 4307968
4130D307968J07008J640448o01088j071616j150976J438720j454592J418240r4208
$$ 4307968 4414976 6055424 5454336 4382720 3231744 4670464 3215872 4634112 4539904
4121D539904k14016J440768j609216J947136J05984j554944J276928L04128o60480
$$ 4539904 4325888 5766656 4157440 6104576 6210560 4655616 5932544 6236672 5576192
4112E576192m75136P37280r64096j37216M13696n30432j81248l3792Q62720j076224
$$ 5576192 5101056 5838336 4874240 4737024 5150720 4620288 4439040 4405248 5267968 4191744
4102D191744J221120J05984L4816j65888o33856N14560P717888D824064o88640
$$ 4191744 5412864 5518848 5553664 5387776 4753920 5268480 12986368 4824064 4135424
4093D135424J234944p08608K80064p50592P35232m64896m17792L63520m3008L072
$$ 4135424 5370368 4661760 4941824 4191232 4926464 4461568 4043776 4407296 4364288 4367360
4083D367360n86752R15968q16640K11456J82272N63200k127872N25824J378816
$$ 4367360 3780608 4696576 3879936 4091392 4273664 4836864 2708992 3234816 4613632
4074D613632l08736p04512L23072J36704N3248j60768J66912o25664N49888J1264
$$ 4613632 4304896 3600384 3923456 4060160 4113408 3952640 4119552 3493888 4043776 4055040
4064D055040o91712J532416j494528K01728R91744j076224P76192l17440n01248
$$ 4055040 3363328 4895744 3401216 3602944 4594688 3518464 4294656 3977216 3475968
4055C475968Q80128L11296o40512R49248l38432j73056K57536q93952J13152K17600
$$ 3475968 4356096 4667392 4026880 4976128 4637696 4464640 4722176 3828224 3941376 4158976
4045D158976j298944K391040p96672P34208o12864K30400j009664Q33024K35520
$$ 4158976 2860032 5251072 4454400 5188608 4575744 4806144 3796480 4629504 4865024
4036D865024m63360K95936P22432j615872J671680j457664M88960l86560P99232
$$ 4865024 4401664 4697600 5420032 3804160 5475840 4018176 4507136 4120576 4919808
4027D919808l44064m87936P37792K00704j199104P18336O8096K45760O02624K86720
$$ 4919808 4575744 4087808 4825600 5026304 3827200 4545536 4613632 4859392 5462016 5748736
4017E748736m24960N03296r67168J58720M73600P4240M06016l72224o28224J021440
$$ 5748736 5323776 5827072 4859904 5018624 5492224 5566464 5972480 5600256 4972032 5993472
4007E993472J041408m34176j108992P53664n0688K59072n85728K63168N16096
$$ 5993472 7034880 6600704 5491712 6245376 6194688 6453760 5868032 6131200 6647296
3998F647296l72224m5568N51424p63904M54656j492480J641984j086464J448960
$$ 6647296 6275072 6229504 6780928 6017024 6471680 4979200 6621184 5534720 6983680
3989F983680j116672L95264k28352K00704R48224o33344o68672J494528j231360
$$ 6983680 5867008 6262272 6033920 6234624 7182848 6549504 5880832 7375360 6144000
3980F144000J95072J484288q84224P71072j159680J81760L12320n48864J005568
$$ 6144000 6339072 7823360 6939136 7710208 6550528 6732288 7044608 6495744 7501312
3971G501312j014784J064448J088000o95808q49920K003456j089536k74432J422848
$$ 7501312 6486528 7550976 8638976 7943168 7093248 9096704 8007168 7732736 9155584
3962I155584J500672K02752L81440J148416M36224o80448K10944j671680q91392
$$ 9155584 10656256 10859008 11240448 12388864 12825088 12144640 12355584 10683904 9792512
3953I792512r7280j149952j368576M33664O9120j338880N92896o03136n83168
$$ 9792512 9695232 8545280 7176704 7610368 7679488 6340608 6933504 6330368 5747200
3944E747200M53632J2800j24928n05344q7040L98848J62816M86912q0384q18176
$$ 5747200 6200832 6213632 6088704 5583360 5496320 5895168 6057984 6544896 6464512 5646336
3934E646336m73088P78240k14016M76160o1440j399808J058816N7344M94080j569792
$$ 5646336 5173248 5951488 5737472 6213632 6152192 4752384 5811200 5868544 6362624 4792832
3924D792832O77376Q44288q14080M67968j242112M44416l5840O34368K50880l70688
$$ 4792832 5470208 6314496 5500416 5968384 4726272 5170688 5134848 5769216 6020096 5649408
3914E649408K30400k04800l94752J203712p90528L44064n34528P11680j070080
$$ 5649408 5879808 5675008 5280256 6483968 5693440 6037504 5502976 6214656 5144576
3905E144576l11808J500672p97184R36960m12672j73568o35392k9184J218560
$$ 5144576 4832768 6333440 5536256 6473216 6060544 5886976 5251584 5222400 6440960
3896F440960p81824J64864J94048m22400K19136j18784P36768k12480j96608j433600
$$ 6440960 5659136 5824000 6018048 5595648 5814784 5696000 6432768 6220288 6023680 4590080
3886D590080J853440k34496n80096M18816J271808j630208m89472J287680O72256
$$ 4590080 6443520 6209024 5628928 6047744 7319552 5689344 5199872 6487552 7159808
3877G159808j339392P4752j906176J475072O79424K89792j48992q5504j22880
$$ 7159808 5820416 5895168 3988992 5464064 6143488 6433280 6284288 6198784 6075904
3868F075904P66464q48896J213952q41216M84864J00864n40160M35712j047040
$$ 6075904 6842368 5993472 7207424 6366208 6851072 6951936 6411776 6847488 5800448
3859E800448Q16640r21088O77376o09280l5328Q73984k86720m45952R71264R3184
$$ 5800448 6617088 5696000 6373376 5764096 5728768 6602752 6316032 5870080 6841344 6934528
3849F934528M7616Q56576j977344j3824J73568J070592j026560N25312r2160j325568
$$ 6934528 6982144 7838720 5861376 5847552 6021120 7091712 6065152 6590464 6498304 5172736
3839E172736J428992l18976Q90880k02752l36384n09440O85056m27008P29088
$$ 5172736 6601728 6282752 7173632 6970880 6634496 6125056 6810112 6383104 7112192
3830G112192O8096p51104J36192J2800m98176m76160O95808M62336l60960M96640
$$ 7112192 7180288 6429184 6565376 6578176 6080000 5603840 6299648 6761984 6401024 6897664
3820F897664q90880J098752K01216k2528r18016Q04864m30080n8880m1984L69664
$$ 6897664 6006784 7105536 7306752 7284224 6366208 7171072 6740992 6682112 6640128 7009792
3810G009792l87072R00096j00352o07232L74784q89856J604096m62848m99712
$$ 7009792 6622720 7522816 7422464 6815232 7190016 6300160 7904256 7441408 6941696
3801F941696j71008P00416o07744N87264P01952j376256Q62720M608J49504K72384
$$ 6941696 6770688 7471104 6863360 7450624 8152576 6776320 7639040 7643648 7793152 8065536
3791H065536L40480o90688K02240p47520k85696L07712L07712R98400J52576j693184
$$ 8065536 8406016 7715328 7917568 7170048 6884352 7192064 7499776 8498176 8650752 6957568
3781F957568R10848J230848j230848P76704P11680q81152J94560l81952Q14592
$$ 6957568 7868416 9099264 7868416 8645120 9356800 8475648 8670208 8288256 9102848
3772I102848r8816O0928p34208J089536o78912p680L34336p0144J90976J160704
$$ 9102848 9004032 9064960 8330752 9420288 8741376 8733696 9068032 8997888 9188864 10349568
3762A0349568j402368O98368L21536p14240J675776j478656J025024j131520n15584
$$ 10349568 8947200 9645568 9967104 9252864 10928640 9449984 10475008 9343488 8827904
3753H827904N71904L28704P28576J09568J23904J653248k316800K111488M33152
$$ 8827904 9399808 9728512 10457088 10566656 10690560 12343808 10027008 12138496 12571648
3744A2571648m85376L84000K22208P0144L82976N07392l16928L29728q1920J258496
$$ 12571648 12086272 12470272 12692480 12762624 13145600 13652992 13336064 13665792 13583872 14842368
3734A4842368q81664L84512R80992K01216J567744q41216Q6016K07360L67616
$$ 14842368 13960704 14345216 15326208 15527424 17095168 16253952 16339968 16547328 16914944
3725A6914944P86944J035776j71520O37440J445888P52128R26208R01632J287168
$$ 16914944 17701888 18737664 18566144 19203584 20649472 21401600 22327808 23229440 24516608
3716B4516608O20032l34848J591296J181696K78528J013248J024000J478656N29408
$$ 24516608 25136640 24801792 26393088 27574784 27853312 28866560 29890560 31369216 31898624
3707C1898624j028608J475072J209856J133568m88448o63552J087488J013760
$$ 31898624 30870016 32345088 33554944 34688512 34200064 33536512 34624000 35637760
3699C5637760K336768L92192l15392J798656L344896J015296k560j179136j261056
$$ 35637760 37974528 38366720 38051328 39849984 43194880 44210176 44207616 43028480 41767424
3690D1767424k999296m004352k095104k167808l680768k963456j776128l048448
$$ 41767424 38768128 34763776 32668672 30500864 26820096 23856640 22080512 19032064
3682A9032064j987584K03776k656768m70016J253888n32480o18496j36704M77184
$$ 19032064 17044480 17248256 14591488 14121472 15375360 14842880 14224384 14087680 14564864
3673A4564864j603072J702400l18976J31584j198592J43360N7344P73120j32096
$$ 14564864 12961792 14664192 14345216 14476800 13278208 13421568 13478912 14252032 14119936
3664A4119936N20704j394688J02912n05344L48160p93088J694720O62528n00736
$$ 14119936 14640640 13245952 13348864 12843520 13191680 12398592 14093312 14755840 14255104
3655A4255104n02784J7920J11104n54496n50912k111488J052160n79584J60256
$$ 14255104 13752320 13770240 13881344 13326848 12775936 10664448 11716608 11137024 11297280
3646A1297280j04960o24128J508352j208320K1504J295872K2528p37280m608k33472
$$ 11297280 11192320 10568192 12076544 10868224 10889728 12185600 12208128 11470848 11466240 11232768
3636A1232768q05888L11296o52288J150976j57696L42016L78880M86912j201152
$$ 11232768 10426880 10738176 10085888 11236864 11079168 11421184 11800064 12286976 11085824
3627A1085824l58912L85024J243648n23776r73824J396224m43392m02432L58400
$$ 11085824 10726912 11111936 12355584 11831808 10857984 12254208 11810816 11408384 11766784
3618A1766784k048o49728O78400n88800L89120N04832q94976l77344J482240n60640
$$ 11766784 11764736 11115008 11793408 11204608 11593728 12098560 11203584 10826240 12308480 11747840
3608A1747840J67424o73280L12320q51456J510400p24992J190912l62496N61664
$$ 11747840 11915264 11241984 11554304 10702848 12213248 11488256 12679168 12316672 12878336
3599A2878336o34880K50880J383424j036800m30080j68960m1472l45600J184256
$$ 12878336 12243456 12494336 13877760 12840960 12410880 12241920 12200448 11854848 13039104
3590A3039104M21888k75456j492992K848256k122752m42368k97472J435648j46944
$$ 13039104 13460992 13185536 11692544 14540800 12418048 11975680 11678208 13113856 12966912
3581A2966912n2736N29920p6288m04992P2704N64224k59072m79744K3040N7856
$$ 12966912 12914176 13444096 13367808 12962816 13035520 13599744 13340672 12860928 12883968 12941824
3571A2941824J23392J046016j034752K21184Q58624L36896k21696P8848k16576
$$ 12941824 13065216 14111232 13076480 13297664 14156288 14493184 14271488 14350336 14133760
3562A4133760j96608O92736m88448j68448R728P05024j71008J0752j0240l60448
$$ 14133760 13937152 14629888 14141440 13972992 13982720 14687744 14516736 14527488 14517248 14156800
3552A4156800J001984l49696O19008q70912J88416N79584J95584K83648L78880
$$ 14156800 15158784 14809088 15428096 14557184 14745600 15325184 15520768 15804416 16183296
3543A6183296n35552N16608M35712m0448p8336K31424l1232L15392O2976o92736
$$ 16183296 15647744 16164352 16600064 16559616 16481280 16712704 16681472 16996864 17059840 16367104
3533A6367104N07392P62368k25792L8400M81792l9936O84032r95328K86208J672192
$$ 16367104 16874496 17636864 17411072 17449472 17931264 17891328 18575360 17580032 17866240 19538432
3523A9538432o53312j76640M29568J742336r80992Q55040J095168n56544K74432
$$ 19538432 18885120 18708480 19138048 20880384 19899392 20754432 21849600 21293056 21567488
3514B1567488P53152J224704n65248K84672J285120m37760L52256J587200j77664
$$ 21567488 22320640 23545344 22980096 23264768 24549888 24112128 24464384 26051584 25873920
3505B5873920P90528K428416J07008R87648n8880J330176k15040r99936Q56576
$$ 25873920 26664448 29092864 29199872 30187520 30128640 31458816 31243776 30243840 31100416
3496C1100416Q73472j929216l89632q38144Q00256M20864K72384L69152J453568
$$ 31100416 31973888 30044672 29655040 28816896 29617152 30038016 30310400 30679552 32133120
3487C2133120K089472n44256J955840J94048K592256p84384Q98560K351616L2768
$$ 32133120 34222592 33678336 35634176 35828224 38420480 37636096 38534656 40886272 40919040
3478D0919040J040896J147904J694720P64416O30272K500608l44576K694144O69696
$$ 40919040 41959936 43107840 44802560 45566976 46197248 48697856 48353280 51047424 51717120
3469E1717120J460736K092544J425920K744320J980416J334784M569088K509824
$$ 51717120 53177856 55270400 56696320 59440640 61421056 62755840 67324928 69834752
3461F9834752J200640N670400J026560M830720M909568M071424L970048O740992
$$ 69834752 71035392 76705792 77732352 82563072 87472640 91544064 95514112 102255104
3453A02255104Q269824P101440R322496J0824704J1196928J1884032J0712576
$$ 102255104 110524928 117626368 126948864 137773568 148970496 160854528 171567104
3446A71567104J3036544J2743168J4455808J6401920J6079872J8436096K2225920
$$ 171567104 184603648 197346816 211802624 228204544 244284416 262720512 284946432
3439B84946432K4640000K6800640L2086016L9699968M9458688O1373440Q0382464
$$ 284946432 309586432 336387072 368473088 408173056 457631744 519005184 599387648
3432E99387648J07415552J43528960J84336896K16279552J90815232P7241856
$$ 599387648 706803200 850332160 1034669056 1250948608 1441763840 1519005696
3426A519005696q9214976k23553024k80612864k52760576j88500992j30682368
$$ 1519005696 1429790720 1206237696 925624832 672864256 484363264 353680896
3420C53680896q7361024n9689472m1622528l0553088k0784640j7476608j2224512
$$ 353680896 266319872 206630400 165007872 134454784 113670144 96193536 83969024
3413H3969024q301056q552960n510656p676928m307968m241920l151360k116096
$$ 83969024 75667968 67115008 61604352 53927424 49619456 45377536 42226176 40110080
3405D0110080k619392l228672n83168j057280k258432j259520k210816j887232
$$ 40110080 37490688 34262016 33678848 32621568 30363136 29103616 26892800 25005568
3397B5005568j671680q03840j880064j432064o26176j031680J60256j412096k048
$$ 25005568 23333888 22530048 20649984 19217920 18591744 17560064 17720320 16308224 16306176
3388A6306176j645056J069568Q1408k622464j230336p82336j394688j93536j022976
$$ 16306176 14661120 15730688 15812096 13189632 11959296 11176960 9782272 9588736 8565760
3379H565760Q13056l25632j44384Q92928j304576m30592j435136L2768l5328r02144
$$ 8565760 9378816 9053184 8908800 9801728 8497152 8066560 6631424 6664192 6628864 5726720
3369E726720o11840J061888M94080q96000O18496l96288l66592l42528K95424
$$ 5726720 5114880 6176768 6670848 5774848 6393344 5997056 5630464 5287936 5583360
3360E583360r11872j5360q32512K27328j606656I23136a5360A488384d51584A1776
$$ 5583360 4671488 4656128 3823616 4050944 2444288 923136 -15360 1488384 -451584 11776
3349A56160M52096J558016O26688k99520J025024M30080M89472j207296Q44288
$$ 156160 608256 2166272 2792960 2493440 3518464 3948544 4438016 3230720 4075008
3340D075008O22592n49888j412096J668096p62368P03488l34336n58592K0480
$$ 4075008 4697600 4147712 2735616 4403712 3641344 4344832 4010496 3451904 3472384
3331C472384R45664j23904M52608l68640r06752O42048j11104L74784o00576R02144
$$ 3472384 4418048 4294144 4746752 4378112 3471360 4113408 4002304 4377088 3776512 4678656
3321D678656j006080n17120P82336j568768O57920l59424j58720J076736j589248
$$ 4678656 3672576 3155456 3937792 2369024 3026944 2667520 2508800 3585536 1996288
3312A996288Q02816J17248L34848n32992o64064J108480O93248n68832M45440
$$ 1996288 2799104 2916352 3251200 2718208 2054144 3162624 3855872 3287040 3732480
3303C732480m87424r66144P58784k89280l18464O48192J94560R7792M66432j320448
$$ 3732480 3245056 2278912 3037696 2748416 2429952 3078144 3272704 3370496 3836928 2516480
3293B516480O08256m10624M75648l96288m90496Q17664J39776m12672j88928k00192
$$ 2516480 3124736 2714112 3189760 2793472 2302976 3120640 3260416 2847744 2658816 2458624
3283B458624m27520Q98048l50720N83680o10304K8160J88416l58912K52928O48704
$$ 2458624 2031104 2929152 2578432 3162112 2551808 2579968 2768384 2409472 2662400 3311104
3273C311104K89280k42688N36064n57568n4272j41312J57696j288192R25184j072640
$$ 3311104 3600384 3357696 3893760 3336192 3281920 3140608 3298304 2010112 2935296 1862656
3263A862656J61792P3728J029120j46432m42368O63040o56384k14016O22080J04960
$$ 1862656 2024448 2098176 3127296 2980864 2538496 3201536 2545152 2331136 2953216 3058176
3253C058176N85728n58080O98368n55008k34496R3696o88640J020928O09280J72032
$$ 3058176 3643904 3085824 3784192 3229184 2994688 3088384 2399744 3420672 4029952 4201984
3243D201984J945088r75360p33184J899520M36736O88128L22560J48992j588224
$$ 4201984 6147072 5171712 4438528 6338048 6774784 7462912 7785472 7934464 6346240
3234F346240r23648R79456o24128j024000p70048L96800j18784K51904j004032
$$ 6346240 5422592 6402048 5777920 4753920 3983872 4380672 4261888 4513792 3509760
3225C509760k68800O47168J11104M48512N36064j850880K034176m60800N25312
$$ 3509760 3240960 3888128 3999232 4447744 4983808 3132928 5167104 4706304 5231616
3216E231616K2528N14048r4208K3552P12192k43712k69312J83296K49344J50528
$$ 5231616 5254144 5768192 5673984 5697536 6409728 6166016 5896704 6080000 6329344 6479872
3206F479872R98912N45280q95488J98144J147392j91488M29568o9632L46112o53312
$$ 6479872 7478784 8024064 7128576 7326720 8474112 8282624 8712192 8642560 8988672 8335360
3196H335360J011200l584P7824M99200K73408N92384K69312K80576j29536P31648
$$ 8335360 9346560 9342976 9420800 9920000 10193408 10785792 11055104 11335680 11206144 11937792
3186A1937792J454080k02752L96800J322496Q52480J47456n2224P99744J410560
$$ 11937792 13391872 13189120 13585920 14908416 15760896 15908352 15856128 16655872 18066432
3177A8066432m36736J383936O7584N69856J061888M29056L45088K88256J162240
$$ 18066432 17629696 19013632 19081216 19651072 20712960 21142016 21487104 21775360 22937600
3168B2937600K007552Q2944K476032J482752J433088J183744N81632j494528m085248
$$ 22937600 24945152 25028096 27504128 28986880 30419968 31603712 32185344 30690816 26605568
3159B6605568l133952l137536l250176k191872j417216m08064n13536n18144k462208
$$ 26605568 23471616 20334080 17083904 14892032 13474816 13066752 12553216 12035072 9572864
3150I572864O62528n41696n57056k35520J12640j47456m99712j151488N63200
$$ 9572864 10235392 9693696 9136640 8901120 9013760 8866304 8366592 7215104 7778304
3141G778304K15040j416192m5568j40288Q98560j131520j071104K15552l1744
$$ 7778304 7993344 6577152 6531584 6391296 7289856 6158336 5087232 5302784 5271040
3132E271040M88960p06560n16608J02912J842176j564160o7072o19008N62176
$$ 5271040 5760000 5053440 4536832 4639744 6481920 4917760 4850688 4231680 4793856
3123D793856P17312n77536l01056R9840P38304j374208J390592p70560Q44800
$$ 4793856 5511168 4933632 4632576 4732416 5470720 4096512 5487104 4716544 5561344
3114E561344j423872J14688O15424O85568m83840l8912l49184k94400q08960L65568
$$ 5561344 4137472 4252160 4867584 5553152 5069312 5030400 4681216 4386816 3577856 3943424
3104C943424M80768K59584p03488j570816K631168k272768J267200J767424k200576
$$ 3943424 4424192 4683776 3980288 2409472 5040640 2767872 4035072 5802496 3601920
3095C601920j6384M21376N15072k33472k48320O43072Q8064J300480k149888N47840
$$ 3601920 3585536 4006912 4521984 4288512 4040192 4683264 4771328 6071808 3921920 4469760
3085D469760R5232K78016l58400P42912j242112J863168p34720o80960K28352
$$ 4469760 4564992 4843008 4484608 5227520 3985408 5848576 5113856 4432896 4661248
3076D661248J592320l44064o06720N92384j109504J059840l54304J782272j767424
$$ 4661248 6253568 5909504 5302784 5895168 4785664 5845504 5491200 7273472 5506048
3067E506048n56544l47136N05856r3184J7408n25824j46432K5600M47488k63168
$$ 5506048 4949504 4602368 5108224 5015040 5032448 4506624 4360192 4385792 4833280 4570112
3057D570112p71584J808384p01440j20832j084928Q42752P5264j761792J222656
$$ 4570112 3798528 5606912 4905472 4784640 3699712 4542464 4617728 2855936 4078592
3048D078592j63840O24640k79040P47008r71776J187328j234944p5264m43904
$$ 4078592 3914752 4539392 4260352 5007360 4035584 5222912 3987968 3912704 3468800
3039C468800J074176p0144j033216J78688Q00256l77344m06528P60832j674240
$$ 3468800 4542976 4472832 3439616 3618304 4418560 4041216 3634688 4395520 2721280
3030B721280J536000L01056L1232J35680l9424R56928n9392Q59136K560n0688
$$ 2721280 4257280 4558336 4589568 4725248 4685824 5642752 5583360 6442496 6445056 6394368
3020F394368l29728N73952M12160J51040J380352k23232J546752J648128L537920
$$ 6394368 6064640 6638592 7050752 7201792 8582144 8358912 9905664 11553792 15091712
3011A5091712M837888J552896P7824j64864l94752k454016n027328l761664l478528
$$ 15091712 19929600 21482496 21560320 21395456 21000704 18546688 13519360 9757696 6279168
3002F279168j911296r4720N35552j83808r00096n60640j41312L56352l60448M50560
$$ 6279168 4367872 4273152 4808704 4624896 3724800 3164160 3022848 3379200 3018752 3469312
2992C469312L38432L42528n632J75104r88672j3824J508352j961472P10656N88288
$$ 3469312 3807744 4150272 4144640 4319744 3331072 3317248 4825600 2864128 3574784 4163072
2982D163072k3040N33504p59296K64192J005568j349120M8128J330176j219072
$$ 4163072 4140032 4673536 3914240 4178432 5184000 3834880 3883008 5213184 3994112
2973C994112N35040j90464J391616l97312j50016P30112m26496q86784p48032
$$ 3994112 4529152 4338688 5730304 5332992 5182976 5913088 5486592 4599808 3851776
2964C851776Q24320n40160J45408J68960O50240r42080Q55552j726976J024000
$$ 3851776 4676096 4135936 4281344 4450304 5100544 4158464 5014016 3287040 4311040
2955D311040J012736j329664J338368o04672P1168P34208l18976m97152j3312
$$ 4311040 5323776 3994112 5332480 4727808 4798976 5533184 5214208 4717056 4703744
2946D703744J461248q45824l71712J126912j883136J492992M77184j482752R216
$$ 4703744 6164992 5319168 4947456 6074368 4191232 5684224 6161408 4678656 4687872
2937D687872J183232n88288P36768r00096O93760k15040K81600p55200Q85248
$$ 4687872 5871104 5282816 6019584 5119488 5813248 5598208 5879808 5124608 6009856
2928F009856o15936k3552P01440k47296o08768J806848q67840O07744L78368J003008
$$ 6009856 5393920 5370368 6071808 5824512 5215744 7022592 6154752 6762496 7140864 8143872
2918H143872L38432L33824O54848j105408K04288j61280J43360Q49920m35200
$$ 8143872 8482304 8816128 9470976 8365568 8569856 8408576 8551936 9401856 8966656
2909H966656K35008L02080P38304N57568K43712j291776J402368J453056p59808
$$ 8966656 9201664 9503744 10242048 10799616 11043328 9751552 11153920 12606976 11847168
2900A1847168J361408K237952k52928L77344j467392k435072j690624j900544
$$ 11847168 13208576 15446528 15193600 15570944 14103552 11668480 9977856 8077312
2892H077312j312768l45600k89280j26464P01440j392128l02080Q31488L68128
$$ 8077312 6764544 6418944 6129664 6003200 6704640 5312512 5010432 5841920 6210048
2883F210048m04992j118720o37952Q71936n5296L7888m23424q0384j12640J489408
$$ 6210048 5805056 4686336 4048384 4920320 4865024 4902912 4479488 4399104 4286464 5775872
2873E775872j234432M81792j74080m50048L63008P16288j624576Q9088P44448
$$ 5775872 4541440 5023232 4849152 4399104 4762112 5478400 3853824 3942912 4687360
2864D687360o54336n91872R59488k57536m45440J050624m30592o10304j43872
$$ 4687360 4033024 3441152 4400640 4143104 3697664 4748288 4317696 3707392 3563520
2855C563520O10304l03616L62496m70528K05824J092608p42912j075712J928192
$$ 3563520 4173824 3870208 4232704 3762176 3968000 5060608 4317696 3241984 5170176
2846E170176q83712M72064N1712m60288L58912Q57600J77664R9840j079808m21376
$$ 5170176 4286464 4758528 4810240 4349952 4708864 5566464 5744128 5843968 4764160 4342784
2836D342784j22880K60096p9872J49504k58560q88832J065472n42720L53280N84704
$$ 4342784 4219904 4480000 4400128 4549632 4291072 3402240 4467712 3924992 4278272 4862976
2826D862976N12Q36096j345024L64032k36544j45408k62656m02432R94816J536
$$ 4862976 4863488 5699584 4354560 4718592 4482048 4336640 4073984 3671552 4666368 4667904
2816D667904m30592n0688O74816L8400O08256k01728o34880o15424L35360P30624
$$ 4667904 4237312 4186624 4861440 4899840 5508096 5306368 4671488 4056064 4391424 5122048
2806E122048j22880R15456m25472P8848n55520N23264N17632Q42752M11648J394176
$$ 5122048 4999168 5914624 5489152 5568000 5012480 5535744 6053376 6896128 7307776 8701952
2796H701952k38592J043456K278912M849152Q784896P610880m751360l648000
$$ 8701952 8463360 9506816 11785728 16634880 25419776 33030656 28279296 24631296
2788B4631296A2277760m348416k526720K87232j143296p26016K9184M28544J77152
$$ 24631296 12277760 7929344 5402624 5689856 4546560 3820544 3849728 4278272 4455424
2779D455424j498624L23072j58208J472512q50432k42176O24128n77024N49376
$$ 4455424 2956800 3279872 3121664 4594176 3743744 3501568 4125696 3548672 4098048
2770D098048N66784m64896j67424o24640N18656r29280J07520J202176n66784
$$ 4098048 4664832 4199936 4032512 3407872 3926528 2997248 3104768 4306944 3740160
2761C740160j63328l8912P5264J60768J32096O46656j12640L4304j349120J372160
$$ 3740160 3576832 3537920 3613184 3773952 3906048 4552704 4440064 4474368 3125248 4497408
2751D497408n0688J6896K28352j576960L77856j24416N39136Q35584L7376l52768
$$ 4497408 4446720 4463616 4691968 3115008 3492864 3368448 3907584 4743168 4780544 4427776
2741D427776j026048O49728m72064K43200q40192O11328P56736K81600j641472
$$ 4427776 3401728 4051456 3579392 3822592 2982400 3593728 4350464 4632064 2990592
2732B990592J164288j29024J06496r1648J061376B219008L060224q08960J090560
$$ 2990592 4154880 4025856 4132352 4040704 5102080 2219008 5279232 4470272 5560832
2723E560832m49024L46624l49184N42208R78432j189376p4240J384448O76352
$$ 5560832 5111808 5458432 5109248 5651456 6629888 5440512 5366272 6750720 7427072
2714G427072O52288j610752J061888M40832O05184J120768O69696r5232K166272
$$ 7427072 8079360 6468608 7530496 7971328 8576512 9697280 10366976 10271744 12438016
2705A2438016K707456K938368O988288J4030336Q239104n282304r032192j1032576
$$ 12438016 15145472 18083840 25072128 39102464 47341568 42059264 33027072 21994496
2697B1994496o869504j721344M69504R42080O808064J0193408K486272m736512
$$ 21994496 15124992 13403648 13873152 14815232 21623296 31816704 34302976 29566464
2689B9566464o101504o642688l252736K341888K514432P226880J4529536L222528
$$ 29566464 23464960 16822272 13569536 15911424 18425856 25652736 40182272 43404800
2681D3404800n651968r406976j2524544l909120k78528J363456N042176R957888
$$ 43404800 37752832 28345856 15821312 11912192 11633664 12997120 18039296 27997184
2673B7997184K216448m673024o197248r153536k468352n84192Q86784J388544
$$ 27997184 30213632 25540608 19343360 10189824 7721472 7137280 8024064 9412608
2665I412608M897792J568768k222080l910144m338688j907712M93568j43872m27520
$$ 9412608 14310400 15879168 13657088 9746944 5408256 3500544 3994112 3850240 3422720
2656C422720L13856j132032J174016J16224Q8064m11136n82656L20512J083392
$$ 3422720 3736576 2604544 3778560 3894784 3982848 3571712 2989056 3309568 4392960
2647D392960K01216o9632j65376l46624O87104K048512r05728p64416J895424
$$ 4392960 4594176 4524544 4359168 4012544 4699648 6748160 5842432 5078016 6973440
2638F973440j243136r69728l43552R68192k61632J112576j208832j256960Q93440
$$ 6973440 5730304 4760576 4417024 5385216 5123584 6236160 5027328 3770368 4663808
2629D663808o55872j662464J175552A547264k73920O91712P56224r51296K12480
$$ 4663808 4007936 2345472 3521024 1547264 1273344 1965056 2721280 1769984 1982464
2620A982464j17248O71744r71776J456128F33344J86880O59456O19520L584P1168
$$ 1982464 1865216 2536960 1565184 3021312 633344 820224 1479680 2099200 2102784 2173952
2610B173952j8432o40512K86720m4032H75520J012736l64032j24416Q85760N7344
$$ 2173952 2155520 1515008 1801728 1757696 875520 1888256 1524224 1399808 2285568 2342912
2600B342912n69856j19296L70176q76032O87616Q03328l53792%J95584j101312
$$ 2342912 1773056 1653760 2023936 1147904 1835520 2638848 2285056 2285056 2480640 1379328
2590A379328M01408N5296H91904K89792L23584R85600q45312l50720l82976J444352
$$ 1379328 1780736 1836032 891904 1181696 1505280 2490880 1645568 1294848 911872 2356224
2580B356224r31840o64064J566720M4032m53632q11520J445888I85088J202176
$$ 2356224 1424384 760320 2327040 2371072 1917440 1105920 2551808 985088 2187264
2571B187264p66464j90464N54496J45408l36896K88256L30240j94560k71872J81248
$$ 2187264 1420800 1230336 1784832 1930240 1593344 1881600 2211840 2017280 1745408 1926656
2561A926656I29792Q13056p9360n02784K14016O08768Q76544p95648N10976L55840
$$ 1926656 929792 1742848 1663488 1160704 1374720 1983488 2860032 2064384 2575360 2931200
2551B931200j93536k95424N6832I08288M94080M99712j1264p00928Q87808j58720
$$ 2931200 2737664 2442240 2499072 908288 1402368 1902080 1890816 1189888 2077696 1918976
2541A918976j80224j96096O85056L89120P7824m72576p38816Q86272n54496D49536
$$ 1918976 1738752 1542656 2227712 2616832 2694656 2222080 1483264 2369536 1815040 449536
2530A299456M87936m67968N34528k80576J012736m87936L49184k5600o71744N120
$$ 1299456 1787392 1319424 1853952 1573376 2586112 2098176 2447360 2421760 1750016 1755136
2520A755136L05152q34560J59232k65728J070592n0176J024m33664Q23808m48512
$$ 1755136 2060288 1225728 1384960 1119232 2189824 2139648 2140672 1707008 2530816 2082304
2510B082304l63520R21088k09408p53664J009152q70912p70560L62496K75456
$$ 2082304 1718784 2639872 2430464 1676800 2685952 1815040 1044480 1406976 1682432
2501A682432M34176j9968N9392P4752K42176n01760J2800J152512m73600l10272
$$ 1682432 2116608 2096640 2156032 2230784 2472960 1971200 1984000 3136512 2662912 2352640
2491B352640n89312M46464l21024M10624L36384n60128L79392R20576j270272
$$ 2352640 1763328 2209792 1888768 2299392 2635776 2075648 2455040 3375616 2105344
2482B105344j00352J300480A614336Q30976J27488N00224n02784K43712j202688
$$ 2105344 2004992 3305472 1614336 2445312 2572800 3073024 2570240 2813952 1611264
2473A611264N13024l00032R13920J005056j572352l90656o25664J917952K98496
$$ 1611264 2124288 1824256 2738176 3743232 2170880 1780224 1154560 3072512 3371008
2464C371008p10144P13728k40640L48672o64576J64864M10624J228288p28576
$$ 3371008 2660864 3374592 3133952 3482624 2818048 2982912 3393536 4621824 3893248
2455C893248q01792O88640q02304O56896N3248K46272M37760q18688J646592j519104
$$ 3893248 3091456 3780096 2977792 3634688 3687936 3934208 4371968 3553280 5199872 3680768
2445C680768P58784j045504J062400p09120J91488P54688j328128O53312K6624
$$ 3680768 4439552 3394048 4456448 3747328 3938816 4693504 3365376 4018688 4045312
2436D045312L60448R35424l61472r19552P80288m55680o6560O93760k15040r83552
$$ 4045312 4405760 5341184 4979712 4060160 4840448 4384768 4318208 5011968 4796928 3813376
2426C813376J486848o69184R216M06016K69312j389056L25120J273344n55520
$$ 3813376 5300224 4631040 4640256 5046272 5315584 3926528 4251648 5524992 4969472
2417D969472K80576n64736R32864l584j118720N96992L31776j082368j054720
$$ 4969472 5250048 4685312 5618176 5614592 4495872 5092864 5424640 4342272 3287552
2408C287552p4752O71744K86720Q4480J105920j634816Q43776r50272P15776j024
$$ 3287552 3212800 3884544 4171264 4255744 5361664 3726848 4570624 3620352 4336128 4335104
2398D335104p93088m18816Q73984m25984M19840j213952J162240j024000L58912
$$ 4335104 3542016 3123200 3997184 3571200 3991040 2777088 3939328 2915328 3274240
2389C274240R47712L84000J50016q82688J494016k063872J136128p08096o6048
$$ 3274240 4221952 4605952 4755968 3873280 5367296 3303424 4439552 3731456 3665408
2380C665408m12160N6832n71392J032192K45760m81280M91008l78368k7648k40640
$$ 3665408 3253248 3310080 2738688 3770880 4016640 3535360 4026368 3648000 3620352 3379712
2370C379712L2768L59424K3552j30560L48672K05312l93728o75840m68480K251776
$$ 3379712 3412480 3771904 3795456 3664896 4013568 4218880 3825152 3149312 2680832 4932608
2360D932608j214464k67264J77664M00384r53344M09600O68672M59776k04800
$$ 4932608 3718144 3450880 3628544 4028928 3075584 3485184 4153856 4613632 4408832
2351D408832j165824K48832L85536K92864n46304M56704r2672L01056l13856k88256
$$ 4408832 3243008 3491840 3877376 4170240 3623936 4080640 3987968 4289024 3975168 3686912
2341C686912R08288J76640j204224J621504n61664j566208J531904j337856N12512
$$ 3686912 4595200 4771840 3567616 5189120 4627456 3061248 4593152 3255296 3767808
2332C767808k53440k25792J47456k42688L6864J50528P7824K25280o85056J75104
$$ 3767808 3514368 3288576 3436032 3193344 3230208 3380736 3458560 3683840 2998784 3173888
2322C173888j94560J310720p48032l33312L65568l09248O52800R30304j069056
$$ 3173888 2979328 4290048 3542016 3208704 3574272 3265024 3917824 4848128 3779072
2313C779072J240576p23968P03488m14208M18816P6800j96608m44416P43936j050624
$$ 3779072 5019648 4295680 4999168 4584960 5003776 5080576 4883968 4439552 5183488 4132864
2303D132864M52096l38432j84320M87424o98880N46304k5600O1440R4720J72032
$$ 4132864 4584960 4246528 4062208 4549632 3850752 4397056 4371456 4432896 4527616 4699648
2293D699648q29440k20672P18336n66784Q98048k56512j73056M35200m6592j584640
$$ 4699648 3870208 3649536 4367872 3801088 4699136 4442624 4269568 4704768 4658176 3073536
2283C073536J213440Q7552L56352l42016J01376j032192Q28416j29024j256448
$$ 3073536 4286976 4374528 4730880 4388864 4490240 3458048 4286464 4157440 2900992
2274B900992k74944K409472j346048P86944k87744j117696P82848O99904O24128
$$ 2900992 2626048 5035520 3689472 4476416 4188672 3070976 3853824 4553728 5177856
2265E177856M24448j112576L43040k45248l88096O44608K40128P77216j371648
$$ 5177856 5602304 4489728 4832768 4587520 4199424 4844032 5084160 5861376 4489728
2256D489728M01408j84320N89824M3520j404928J294848K04288N22240r15968
$$ 4489728 4891136 4706816 5296640 5340160 3935232 5230080 5434368 5956608 5040640
2247E040640M12160n17632l09760k62656J600000Q60672p76192O90176o27712
$$ 5040640 5452800 4935168 4625408 4362752 5962752 6823424 6047232 6737408 6109696
2238F109696k45760J084928K560j445376J105920P66976j480704L5328J226240
$$ 6109696 5863936 6948864 6951424 5506048 6611968 7378944 5898240 5933568 7159808
2229G159808J72032O84032m64384M23424J26976N23776k89792K12992m21376L61472
$$ 7159808 7331840 8015872 7551488 7974912 8101888 8625664 8335872 8548864 8127488 8488960
2219H488960j321984o25152J628672j72032o75840J038336L74784l22048j067008
$$ 8488960 7166976 6541824 8170496 7998464 7322624 8360960 8735744 8413696 7346688
2210G346688N64224r6768M3008L49696L97824j039360K60096r31840m4544P61856
$$ 7346688 7910912 7814144 7857152 8206848 8604672 7565312 7825408 6893568 6849024 7610880
2200G610880R94816q22784J81248o59968M86400l25120M43904j266688J152000
$$ 7610880 8605696 7782912 7964160 7304192 7790592 7465472 7909376 6642688 7794688
2191G794688j353216K31424J084928M46976n48352J118720j176064J30048m45440
$$ 7794688 6441472 6672896 7757824 8204800 7656448 8775168 7599104 7729152 7283712
2182G283712N05856K8672m04992o75840k56000Q35072m80256l12320L80928j73568
$$ 7283712 7789568 7818240 7413248 6737408 6481408 7316480 6836224 6523904 6904832 6731264
2172F731264J87392M55680M24960N38624j326080R65632n58592k27328N120j98656
$$ 6731264 6918656 7374336 7799296 8337920 7011840 7977472 7418880 7191552 7196672 6998016
2162F998016N87776l12320m40320o4512N07904l45088k66752n32480n25824Q32000
$$ 6998016 7585792 7273472 6833152 6768640 7276544 6931456 6664704 6132224 5606400 6438400
2152F438400k87744J71008R4208k68288r5232L07200m50560Q70912k31936k17088
$$ 6438400 6150656 6321664 6415872 6147584 6052352 6359552 5908992 6779904 6547968 6330880
2142F330880m06016J36704p30624M92032J373696j725440Q38656o27712J099264
$$ 6330880 5924864 6061568 5330944 5822976 7196672 5471232 6309888 5682176 6781440
2133F781440j94560L94752q0896j53088M55680o42560P12192l07712P4752N10464
$$ 6781440 6586880 6981632 6900736 6747648 7203328 6560768 7272960 6965248 7040000 7550464
2123G550464m68992J54112m81280J000448n80096r7792J255936J86880r07776
$$ 7550464 7081472 7235584 6754304 7754752 7174656 7076864 8332800 8519680 7611904
2114G611904L66080l67104J51040n60640k67264K24768j32096K189824j609728
$$ 7611904 7977984 7610880 7761920 7201280 6934016 7158784 7026688 9216512 7606784
2105G606784K94912J297408j118720k26304J28512K22720P48544j83296P16800
$$ 7606784 7901696 9199104 8080384 7854080 7982592 8205312 8953856 8770560 9487360
2096I487360M54144p34208R41568j222144m79232J572864j20832p4752l14880
$$ 9487360 9941504 9207296 10148864 8926720 8447488 10020352 9899520 9824768 9509888
2087I509888J239552q65792R51296P12704j064960M9664K78016q88832J259008
$$ 9509888 10749440 9883648 10834944 11547648 10482688 10532352 10810368 9921536 11180544
2078A1180544o97344m76672J39776r49248J119744K72896q77056j76128O13888
$$ 11180544 10483200 10006528 10146304 9197056 10316800 10589696 9712640 9536512 10150400
2069A0150400P79776m41856J76640j79200j601024K061312r51296J128448o77888
$$ 10150400 10930176 10488320 10664960 10485760 8884736 10946048 9994752 11123200 10445312
2060A0445312q52480J501184q45824j69984R96864j84320O28736L584p19872N40160
$$ 10445312 9592832 11094016 10248192 10078208 11075072 10890752 11519488 11523072 10803200 11343360
2050A1343360m15744R84064o10816K84160j244672R96352J87904j68448j040384
$$ 11343360 10927616 11911680 11300864 11585024 10340352 11336704 11524608 11356160 10315776
2041A0315776J31584o95296L50208R80480r49248j17248M02944m06016N34016
$$ 10315776 10447360 9752064 10102272 11082752 10133504 10016256 10419200 10013184 10547200
2032A0547200J108480J30560J959424J123840O873088K200064j795072l478016
$$ 10547200 11655680 11786240 13745664 14869504 21742592 23942656 22147584 18669568
2024A8669568o641152k814976N15072o75840j51552k87232K68288j035776M61824
$$ 18669568 12028416 9213440 9728512 9052672 8901120 8613888 8882176 7846400 8308224
2015H308224j73568r07264J076736m77696k09408j157120J015808k83136J172480
$$ 8308224 8134656 7227392 8304128 7826432 7617024 6459904 7475712 7192576 8365056
2006H365056j612800J076224r0112j5360J5872M21888r3696n06880j54624q96512
$$ 8365056 6752256 7828480 7738368 7723008 7738880 8160768 8067072 7560192 7405568 6509056
1996F509056J57184J96608K00704J243136q84736m41344n00736J333248j393152
$$ 6509056 6666240 6862848 7063552 8306688 7421952 6980608 6479872 7813120 6419968
1987F419968J156096P23968p91552M46464j259008Q0384J155584l51232J210880
$$ 6419968 7576064 8300032 7508480 7954944 6695936 6776320 7931904 7580672 8791552
1978H791552r47200n5808k89280l46624J825280j571840J53600R60000p37280
$$ 8791552 7844352 7788544 7499264 7152640 8977920 7406080 7559680 8519680 7782400
1969G782400K67776k86208J182208o45120k95424L94240O02624J69472J121792
$$ 7782400 8050176 7763968 8946176 8301056 8005632 8399872 9002496 9171968 10293760
1960A0293760j526272M48000O62528j334784Q86784M41856k70848q31488K01216
$$ 10293760 8767488 9215488 9878016 8543232 9430016 9871872 9601024 8769536 8970752
1951H970752R18528J80736j90976m74624m76160n40672L77344j76128l02080L94752
$$ 8970752 9889280 10070016 9879040 9404416 8928256 8387584 8764928 8588800 8286720 8681472
1941H681472N57056j94048j804800N05856m65408M72576l44064O85056N36576
$$ 8681472 9238528 9044480 7239680 7745536 7280128 7752704 7408640 8093696 8630272
1932H630272j231872P00416l60448K76992k04288l58400O4000j27488M08576J486848
$$ 8630272 7398400 8098816 7738368 8015360 7811072 7452672 7516672 7389184 7797760 9284608
1922I284608j043968l16416P75168j27488m82816l60960R24672n43744J154560
$$ 9284608 8240640 7924224 8699392 8571904 8089088 7728128 8652800 8109056 9263616
1913I263616j14176q37120J65888J041920J23904q6016M76672l17952M57216O37952
$$ 9263616 9149440 8312320 8478208 9520128 9644032 9558016 10034688 9716736 10173952 10811904
1903A0811904k082816K289664M00384j430016q4480J57184k2016k85184N11488
$$ 10811904 8729088 11018752 11419136 9989120 9904640 10061824 10039808 9754624 10266112
1894A0266112P30624r43616J055744j302016J620992p07072R53344J9456k48320
$$ 10266112 10996736 10053120 11108864 9806848 11427840 10720768 11674112 11693568 11445248
1885A1445248M63872l09248O35904k58048N85728n35552M55168l93728Q98560
$$ 11445248 11909120 11599872 12235776 11977728 12563456 12027904 12483072 12089344 12987904
1876A2987904M49536k2016j90976K00704J22368N55008j01888L69664P02464q44800
$$ 12987904 13437440 13415424 13224448 13425152 13547520 14102528 14000640 14370304 15072768 14227968
1866A4227968O91200o23616j40288p56224P27040l07200o62016o00576J63328
$$ 14227968 14919168 14295552 14155264 13399040 14126080 13818880 13156864 12556288 12719616
1857A2719616J039360n78048m60288o28736j00864m01920J662464r88160l87072
$$ 12719616 13758976 13180928 12720640 12091904 11991040 11589120 13251584 12263424 11876352
1848A1876352J081856l34336j15200J149440j471488R46176j199104J427456p07584
$$ 11876352 12958208 12623872 12508672 13658112 12186624 13132800 11933696 13361152 12653568
1839A2653568j94560j075200J522688o65600o26688N40672j14176N69344m31104
$$ 12653568 12459008 11383808 12906496 12240896 11614208 12154880 12040704 12610048 12178944
1830A2178944m98688L9424j69984J136640q94464o86080q26368J082368K94912
$$ 12178944 11680256 11719680 11549696 12686336 11791872 11105792 10279424 11361792 11656704
1821A1656704j886720O86592k12480O2976n6320M54656q45312Q8576r37984J63328
$$ 11656704 9769984 10456576 10244096 10307072 10250752 10705408 9860096 9948672 9010688 9174016
1811I174016P88992j339392K92352j11616O87104j126400O22592q26880K76480
$$ 9174016 9963008 8623616 8915968 8804352 9491456 8365056 8987648 8160768 8437248
1802H437248P93600n18656n27872P00928J033728j691136N56032K35008j123840
$$ 8437248 9230848 8712192 8184320 8885248 9918976 8227840 8783872 9018880 7895040
1793G895040R13920q16640j12640Q35072j273344J034752j571328J907200p2192
$$ 7895040 8808960 7992320 7879680 8714752 7441408 8476160 6904832 8812032 8739840
1784H739840K38592r85088J461248j103872k09920k05312J222144j616384P63392
$$ 8739840 8978432 7993344 9454592 8350720 8140800 7935488 9157632 7541248 8304640
1775H304640O25152J75104k21184J094656r50784P4240R9840K68288K78016N07392
$$ 8304640 8929792 9104896 8883712 9978368 9027584 9101824 9201664 9469952 9747968 10255360
1765A0255360l2256R62560o07744J768448k087424J800192n9392r53856R65632
$$ 10255360 10223104 11185664 10577920 12346368 10258944 12059136 11999744 11045888 12011520
1756A2011520q21760R70240j72032J455616j200128J225216j690624R32352n37600
$$ 12011520 11189760 12160000 11987968 13443584 12243456 13468672 11778048 12710400 12172800
1747A2172800J729536q704o33856J74080R12896K11968L86560N04832K58560Q94464
$$ 12172800 13902336 13893632 13259776 13433856 14346752 14558720 14945280 15450112 15708672 16603136
1737A6603136p49568Q21248J04960N80608Q32512p86432J000960L25120Q08960
$$ 16603136 15853568 16674816 16779776 17360384 18192896 17406464 18407424 18732544 19541504
1728A9541504N67808m42368J238016N71392R30816J669632j20832J626112J128448
$$ 19541504 20109312 19666944 20904960 21476352 22407168 24076800 23955968 25582080 26710528
1719B6710528R85600J135616l92704L923456Q76032K921472j035264J425408L262976
$$ 26710528 27696128 28831744 28439040 32362496 33238528 36160000 35124736 36550144 39813120
1710C9813120J321472k08384J906176p33696J459712N11488Q60160J072128R64096
$$ 39813120 41134592 40926208 42832384 42098688 43558400 44069888 44930048 46002176 46966272
1701D6966272R00096J481216K367488L33312L162112J659392L030528K297344
$$ 46966272 47866368 49347584 51715072 52048384 55210496 56869888 59900416 62197760
1693F2197760K978304M194304L875328M514304N742080N451264P408128P911424
$$ 62197760 65176064 69370368 73245696 77760000 83502080 88953344 96361472 104272896
1685A04272896Q990720O466560L225088k696192p254528r648640j1899904j1959808
$$ 104272896 113263616 119730176 122955264 120259072 113004544 103355904 91456000 79496192
1677G9496192j3239808j0993664j0174976p902720o231040m251136k795008m455424
$$ 79496192 66256384 55262720 45087744 37185024 30953984 26702848 23907840 19452416
1669A9452416j631744K27328k546688n51936L01056j660928l14880q07424r31328
$$ 19452416 17820672 18048000 15501312 14949376 15250432 13589504 13274624 12467200 11535872
1660A1535872Q4992n6832n76000R3696j152512p31136N50400j055232j024j45920
$$ 11535872 11620864 11564032 10988032 11081728 9929216 9198080 9748480 8693248 8692224 8546304
1650H546304J90464j52576M66432j842176J490432o10816j543680J776640j850368
$$ 8546304 8736768 8584192 9050624 7208448 8698880 8088064 6544384 8321024 6470656
1641F470656n03296R89184l12832N4272R66656j517056j38752R7792p29600j12128
$$ 6470656 5967360 6956544 6643712 6697984 7664640 6147584 6008832 6106624 5377024 5264896
1631E264896N65248L84000j116160P14752l92192o30272L85024J116160j580032
$$ 5264896 5830144 6214144 5097984 5812736 5420544 4790272 5175296 6291456 4711424
1622D711424R78432q07936j276928L15904R62560j20320m12160o17472O33344
$$ 4711424 5689856 4881920 3604992 3920896 4883456 4763136 4350976 3733504 4366848
1613D366848l01056r6768L98336j028608N89824L87072O73280j706496O26688
$$ 4366848 4065792 3969024 4367360 3338752 3928576 4315648 4988928 3282432 3909120
1604C909120j054720J473536n80096r3696J757184j756160P35744m55168j217024
$$ 3909120 2854400 4327936 3747840 3654144 5411328 3655168 4390912 3935744 2718720
1595B718720l12832J769472k87744N91872j284608J77664p06560K049536j652224
$$ 2718720 2405888 4175360 3887616 4479488 3194880 3372544 2665984 4715520 3063296
1586C063296L90656J96608Q11520j85856J47968j594880J951744r65632M58752
$$ 3063296 3453952 3650560 4462080 4276224 4424192 2829312 4781056 3815424 4274176
1577D274176k66240J206272j713664M14208P10656o21568J09056n07392m30592
$$ 4274176 4007936 5214208 3500544 3914752 4625408 4003840 4112896 3605504 3174912
1568C174912L37408K7136M48000J96096J225728j576448L55840K95424N9392k52928
$$ 3174912 3512320 3539456 3987456 4183552 5409280 3832832 4188672 4484096 4543488 4290560
1558D290560J424896j953280P97184J105920p52640L10784N38112l11808M08064
$$ 4290560 5715456 3762176 4559360 5665280 4912640 5223424 5761536 5449728 5857792
1549E857792P5776J098240l43040l12832M98688q2432K18624P51104O90688n72416
$$ 5857792 5933568 7031808 6688768 6375936 6874624 6792192 7010816 7761920 8452608 7880192
1539G880192J04960p75680J975296n8368R46176n86752K762752J05984Q14080
$$ 7880192 7985152 7209472 9184768 9126400 10072576 9485824 12248576 12354560 13168640
1530A3168640K49856m49024k088960q49408Q59136j083392j149952O83520n16096
$$ 13168640 13418496 12969472 10880512 10031104 10890240 9806848 8656896 9340416 8824320
1521H824320J053184k67264r07264J109504q14592j49504J915904k052096J364992
$$ 8824320 9877504 9610240 8702976 9812480 8997888 8848384 10764288 8712192 10077184
1512A0077184j474560P28576r77920J55136p75680J134592k3552O22592m62336
$$ 10077184 8602624 9331200 8353280 8508416 7732736 8867328 8843776 9466368 9004032
1503I004032n4272Q5504k08896O22080O28224M77184J232384J836032o97344J01376
$$ 9004032 8949760 9035264 8826368 9448448 10076672 10553856 11786240 13622272 12924928 13026304
1493A3026304J487360o59456P20896L97824j357312l93216k014720K17088j893376
$$ 13026304 14513664 13854208 14575104 14972928 13615616 13222400 11207680 11424768 9531392
1484I531392q71936k42688K10944m53632r1648K30400q48896n30432k50368J350656
$$ 9531392 8659456 8416768 8627712 8174080 8082432 8312832 7463936 6933504 6683136 8033792
1474H033792j105920J26464M97152n82144L50208J480704q76544Q2432P15776
$$ 8033792 6927872 7054336 7551488 6969344 7319552 8800256 7923712 8006144 8721920
1465H721920M93056O9632k49344j24928R23136j163264K68800n59616k31936j039360
$$ 8721920 9214976 9284608 9035264 8910336 9833472 8670208 8939008 8379392 8147456 7108096
1455G108096j29536L13856j370624J176064n67808j856512Q57600J7408Q8064
$$ 7108096 6978560 7292416 5921792 7097856 6530048 4673536 5531136 5548544 5636608
1446E636608j893376n07392J847296n62176l04128o1952L73248K65728o98368
$$ 5636608 3743232 3235840 5083136 4520960 4216832 4154880 4528128 4793856 4095488
1437D095488J43872O96320j171456N93920n84192p91552M35712Q16128K46272
$$ 4095488 4239360 4935680 3764224 4358144 3773952 2982400 3418112 4234240 4480512
1428D480512j945088J089536L56352j43360n18656K21184k14528L54816J198080
$$ 4480512 2535424 3624960 3981312 3837952 3319296 3540480 3325952 3680768 4878848
1419D878848j203200l38432p0144r01120M28032N84704j513472J641984j388544
$$ 4878848 3675648 3337216 3267072 2365952 2793984 3378688 1865216 3507200 2118656
1410B118656n18144k28352Q47360M76672j110528l3792J050624p21408J70496
$$ 2118656 1600512 1372160 2219520 2696192 1585664 1551872 2602496 1881088 2051584
1401B051584j21344L584q01792J096704H01280l44064J661952r03168N67808o0416
$$ 2051584 1930240 1933824 1132032 2228736 801280 457216 2119168 1216000 1783808 1723392
1391A723392p23968M67968m83840L14880J42848K15040C28704N62688L69152L65568
$$ 1723392 999424 1467392 983552 1298432 1441280 1656320 328704 891392 1260544 1626112
1381A626112E90336P22432N56032n77024l4816m30080N70880r9840M66944p4752
$$ 1626112 590336 1312768 1868800 1291776 1256960 826880 1397760 1297920 1764864 1690112
1371A690112m78208N18656l77856m63360M59264O81472J02400P63904F21056J5872
$$ 1690112 1211904 1730560 1352704 889344 1348608 2030080 2132480 2896384 621056 636928
1361F36928P10656P8848k18624K62144O46144l45600n67296J47968R35936I64096
$$ 636928 1347584 1426432 1207808 1469952 2116096 1770496 1203200 1351168 2287104 964096
1350A404416F58432d4032A532928o07232J51552l44064q1408A60256K004992B28864
$$ 1404416 658432 -44032 1532928 925696 1077248 733184 651776 160256 2165248 228864
1339A187328N84192p67488Q9088Q32000m2496r5744k15040N25312L4304N16608
$$ 1187328 1771520 1004032 1093120 1925120 1882624 1786880 1571840 2097152 2131456 2648064
1329B648064p34720l98848N90336k74944k62144N09952j06496j26976N4784J20832
$$ 2648064 1913344 1514496 2104832 1829888 1567744 2077696 1971200 1844224 1899008 2019840
1319B019840M87936A065472J559040M31616j037824P75680j212928K007552j263616
$$ 2019840 2507776 1065472 2624512 3056128 2018304 2793984 1581056 3588608 2324992
1310B324992M9152m75136q44288O656j85856L75808K21184j04960J89952F58944
$$ 2324992 2374144 1899008 1054720 1061376 875520 1251328 1472512 1367552 1557504 658944
1299B62144P10144O4000l55840Q83200a063936D52608J345536k19136r4208j32608
$$ 262144 972288 1036288 680448 1563648 -1063936 452608 1798144 1579008 1484800 1352192
1289A352192L65056n21216P7312O07744k02240G38816N62176k44224B11456J085952
$$ 1352192 1717248 1196032 1273344 1881088 1678848 738816 1300992 1056768 211456 1297408
1279A297408D01920L68128A80736P99232M096n3760k87232N71392L30752l94752
$$ 1297408 401920 770048 180736 979968 984064 930304 643072 1214464 1545216 1150464
1269A150464p0144J16736J185280A100800k30912R5744P2192P81312F59968J09056
$$ 1150464 1080320 1197056 2382336 1100800 869888 965632 1037824 1819136 659968 769024
1259G69024O99392j81248B46272J146880o51776l6864J86880L15904k27840L05664
$$ 769024 1468416 1287168 246272 1393152 741376 704512 891392 1207296 979456 1285120
1249A285120R33376G47520J41312m42368h1920I83552M6080J10592a01376A833984
$$ 1285120 2218496 747520 888832 446464 -81920 983552 1029632 1140224 -101376 1833984
1238F29760o5024J070592G18336O77888a53088A062400m52608J145344G7312J003008
$$ 629760 564736 1635328 718336 1396224 -153088 1062400 609792 1755136 77312 1080320
1228A080320M60800L66080H76544j08544j75104d0448A720320o30272N4272a60768
$$ 1080320 1541120 1907200 876544 768000 592896 -40448 1720320 1090048 1144320 -160768
1217A734144q66304C16416L44576p4752A84832O02624k22208j64864K47808j12640
$$ 1734144 867840 316416 660992 586240 184832 787456 565248 400384 648192 535552
1207E35552R37472m79232D13184l4304K97472J51040j18784J438720c7888F13888
$$ 535552 1473024 993792 413184 378880 676352 827392 708608 2147328 -37888 613888
1196F04672M56192J66400J289728G70048J296384F45120J687040H91392K72896
$$ 604672 1060864 1227264 2516992 770048 2066432 645120 2332160 891392 1164288
1187A164288M27008R0112k8672k40640E50912O25152J190912F32832J658368r90208
$$ 1164288 1591296 1681408 1652736 1412096 550912 1176064 2366976 632832 2291200 1300992
1177A300992o3488N20192j58208o34880J095168J330688A189888N46816j17248
$$ 1300992 1237504 1757696 1599488 964608 2059776 3390464 1189888 1736704 1619456
1168A619456G30624R86112L1232E40672J356800p54688P6288n14048J482752k68288
$$ 1619456 730624 1716736 1747968 540672 1897472 1142784 1219072 705024 2187776 1919488
1158A919488m81280P92576q57600J188352K0992j246208O69696P88992A115136
$$ 1919488 1438208 2230784 1373184 2561536 2582528 1336320 2006016 2795008 1115136
1148A747456M00384n70880o3488g5776A044992B26816R33376j5360j5872J54112
$$ 1747456 2147840 1576960 1513472 -75776 1044992 226816 1160192 1144832 1128960 1283072
1138A283072L70688m92544j65888m89472K50880J042944H37120M70528F52800
$$ 1283072 1653760 1161216 995328 505856 756736 1799680 837120 1307648 652800
1128B54976o9120N02784J284096n120J1776r79456n12Q25856E34528J842176M7616
$$ 254976 185856 688640 1972736 1967616 1979392 999936 999424 1825280 534528 2376704 2424320
1117B424320B74432L55328O24128n00224L04640m58240N74464b22720A107456
$$ 2424320 274432 629760 1253888 753664 1058304 600064 1174528 -222720 1107456
1107B561536I95328K99520k64704Q13056M93056H75520N12512C18464Q09984J901056
$$ 2561536 995328 1294848 1030144 1843200 2336256 875520 1388032 318464 1128448 3029504
1097C029504A040896E1712K585600j064960L39456K96448l86048Q97024n73952
$$ 3029504 1040896 51712 2637312 1572352 1911808 2208256 1822208 2719232 2145280
1088B145280H87296Q71424J12128M38272N98016r28256m67968n98016J802752
$$ 2145280 887296 1758720 1870848 2309120 2907136 1978880 1510912 912896 2715648
1079B715648l15392J030144M57728j478656J143296k61120J032192k69312R63072
$$ 2715648 2400256 3430400 3888128 2409472 3552768 3291648 4323840 4054528 5017600
1070E017600J227776J387520M68480J095168J676800j80224L0208k221056J886720
$$ 5017600 6245376 7632896 8101376 9196544 10873344 10693120 10723328 8502272 10388992
1061A0388992L52768K40640R87136N74976J648640P45472L503616J876480K237440
$$ 10388992 10741760 10982400 11969536 12544512 14193152 14938624 18442240 20318720 22556160
1052B2556160N437952R635840J9786240N7779200L9733248k0207616k2020608
$$ 22556160 27994112 37629952 57416192 115195392 154928640 134721024 112700416
1045A12700416D1399296A7787904p434752l993600r54368l57376j101312p86432
$$ 112700416 41399296 17787904 10353152 6359552 5405184 5047808 3946496 3160064
1037C160064l4304j310208R05216k49344J662976m52608N74976J626112r43616
$$ 3160064 3125760 1815552 2720768 2471424 4134400 3681792 4256768 5882880 4939264
1028D939264j47968B112512l59424n10464J066496m70528l96800O37440o40000
$$ 4939264 4791296 2112512 1753088 1242624 2309120 1838592 1441792 2079232 1439232
1019A439232o69184L0720J217024H66816O89152D85376O17984j34656M57216o02624
$$ 1439232 770048 800768 2017792 866816 1555968 485376 1103360 968704 1425920 823296
1009H23296L98336J66400N9392o06208L55840C90656M13696f90176F98880c29216
$$ 823296 1221632 1388032 1447424 841216 1197056 390656 804352 -690176 698880 -329216
998H98048I9328R53344J75616j44896n5296b54976D82816I3696O78912j80736
$$ 898048 99328 1052672 1228288 1083392 1028096 -254976 482816 93696 772608 591872
988E91872g36256B14528Q38144A74592P78752m7104b85696F62528O27712m29568
$$ 591872 -736256 214528 1052672 174592 953344 906240 -285696 662528 1290240 860672
978H60672g5776A17760L95264I8816K2016P94112J5872B05312e6832A17248J23904
$$ 860672 -75776 117760 513024 98816 120832 914944 930816 205312 -56832 117248 241152
967B41152B9184L94240j75104a001472A135616O78400c03104A011712k37056N67808
$$ 241152 29184 423424 248320 -1001472 1135616 1814016 -303104 1011712 774656 1342464
957A342464m24448D41344K82112K95936D07040A59744K05824j62304L37920r1136
$$ 1342464 918016 441344 723456 1019392 407040 159744 365568 203264 541184 450048
947D50048b04800H67328k24256K3040C20512M6592A60768c68128C61472M97664
$$ 450048 -204800 867328 643072 666112 320512 367104 160768 -368128 361472 859136
937H59136L73248C92704O77376k50368b99008H87296j60768A42336J97632P03488
$$ 859136 1232384 392704 1070080 819712 -299008 887296 726528 142336 339968 1043456
927A043456a85344E25312a89952M4544B5088H192L05152M32640B74432K086400
$$ 1043456 -185344 525312 -189952 -145408 25088 8192 313344 745984 274432 2360832
917B360832A28512d21888E7344M1472R57952B16576J94048Q28928e31456j10080
$$ 2360832 128512 -421888 57344 98816 1056768 216576 410624 1239552 -531456 -641536
907f41536H66304k41664K92352l49184n7344N47328a58208H90368C47648Q13056
$$ -641536 866304 624640 916992 567808 510464 1057792 -158208 890368 347648 1160704
897A160704C63008K9184e39136A47968a129984C06176J18784e08928A60768O49728
$$ 1160704 363008 392192 -539136 147968 -1129984 306176 424960 -508928 160768 810496
887H10496C46624M68480a57696A251840l69152a080832A14176a12128m04992E00224
$$ 810496 346624 815104 -157696 1251840 882688 -1080832 114176 -112128 -517120 500224
876e3760n2224C54816j59232f99392A21344L59936A81760O70720A39264G168h2944
$$ -53760 -105984 354816 195584 -699392 121344 481280 181760 852480 139264 7168 -82944
864C10272E6320a15200F19520e6832E43232L11808b25280j90976A098752c29728
$$ 310272 56320 -115200 619520 -56832 543232 855040 -225280 -416256 1098752 -329728
853F53824j48992d91520j16224F59968F9120J66912b04800I11872f38464B53440
$$ 653824 504832 -491520 -607744 659968 69120 236032 -204800 911872 -638464 253440
842C79904j8432j10592a04960H53504l35872r7280Q2944O17472g57760J48480
$$ 379904 361472 250880 -104960 853504 517632 420352 503296 1120768 -757760 -609280
832f09280i8816o58432E7856K16064E8880P01952e80608A94560r1136e64224F59456
$$ -609280 -98816 -757248 57856 273920 58880 760832 -580608 194560 103424 -564224 659456
820b00192B92352R39008A34656b55488D00896L25120l44576M16256L04640j49504
$$ -200192 292352 1231360 134656 -255488 400896 726016 381440 797696 1102336 952832
810I52832A26976N52960B54464L07200h96000D91008J184768F28224j71520N32480
$$ 952832 126976 679936 254464 561664 -896000 491008 1675776 628224 456704 989184
800I89184A0752J180672l08736M57728E72928J637888o20544j63328j43360R9840
$$ 989184 10752 1191424 882688 1340416 572928 2210816 1590272 1426944 1283584 1383424
790A383424D04992O84032q5504M53120K6624j32608a2288B404864Q69888A89952
$$ 1383424 404992 1089024 1003520 1456640 1483264 1350656 -12288 2404864 3274752 189952
779E20192O21568B19648L04128b8160A382400D94592N18656e55520j54112B71360
$$ 520192 1141760 219648 523776 -28160 1382400 494592 1013248 -555520 -709632 271360
768I49760L14880b2528H69376j56672j05472a46432E35552a34656F01600i216
$$ 949760 1264640 -22528 869376 712704 607232 -146432 535552 -134656 601600 -9216
757A438208E10976k03264M79744j78688o7072k67264l8400N97504d1472A99680
$$ 1438208 510976 307712 787456 608768 541696 274432 236032 833536 -41472 199680
746B95424d77184J08032F77888b27840F65600Q85248D34176J22368k0480j95584
$$ 295424 -477184 -369152 677888 -227840 665600 1550848 434176 556544 536064 340480
736C40480g06048C38432B1504M02432j48480Q78592k92352C59936D096J004544
$$ 340480 -706048 338432 21504 423936 275456 1154048 861696 359936 4096 1008640
726A008640m43904n8880c32800H14592l5328A2288P28064B60096J419264D81792
$$ 1008640 564736 505856 -332800 814592 779264 12288 740352 260096 1679360 481792
715b60096l21536C64032c7888J2288C13344a014784d84864F21568O54336C78880
$$ -260096 -581632 364032 -37888 -25600 313344 -1014784 -484864 621568 1275904 378880
704G92576k80064c20512C08224f6048A062912D15232b53440E99040a99168k65728
$$ 792576 512512 -320512 308224 -66048 1062912 415232 -253440 599040 -199168 -464896
694d64896a38240m39296A150464j68960j30048o3488C37920g0656k62144g680
$$ -464896 -138240 -577536 1150464 981504 851456 787968 337920 -70656 -332800 -7680
683e27872A072640e14048G22432a46944q6016k49344A058304M79232l24608E21216
$$ -527872 1072640 -514048 722432 -146944 -232960 -482304 1058304 1537536 1212928 521216
672F7072L96800B26304a12640D12160A59232L01568i89184a4848G23968C56864
$$ 67072 463872 226304 -112640 412160 159232 460800 -989184 -14848 723968 356864
661E63712g97696A81760J069568D83840p2704F7072N56032O7072j02400a37728
$$ 563712 -797696 181760 1251328 483840 411136 67072 623104 690176 587776 -137728
650C54304d76160H7040i6256j42848E64224j21856b68800H64256h27904A88416
$$ 354304 -476160 87040 -96256 -239104 564224 442368 -268800 864256 -827904 188416
639I67680i61536d06016H07936M54656b86208O144j25440E21728b20160A022464
$$ 967680 -961536 -406016 807936 1262592 -286208 -280064 -405504 521728 -220160 1022464
628g20384L39456J22368C28192A18272i04704A47968K58560e81120J37728D46464
$$ -720384 -380928 -258560 328192 118272 -904704 147968 406528 -581120 -443392 446464
617E71904g39328G87456J34656J284608f4000l9424F89664j62304d20352a74592
$$ 571904 -739328 787456 922112 2206720 -64000 -103424 689664 527360 -420352 -174592
606g21920B30400i0112n3248m05504A25952c6352m608n47328N1712A135104i60512
$$ -721920 230400 -90112 -143360 -548864 125952 -36352 -40960 -588288 -536576 1135104 -960512
594A224192A71008P44960l19488B03264c5840B50880A04448e71904D51584J59744
$$ 1224192 171008 915968 596480 203264 -35840 250880 104448 -571904 451584 611328
584F11328d38272a96608j73056D61824e54496H88320e5296F69184j48480A5872
$$ 611328 -438272 -196608 -369664 461824 -554496 888320 -55296 669184 520704 15872
573E64224M53632C51744A11616L62496O1952L31776b8160m79232D66432c82464
$$ 564224 1017856 351744 111616 474112 536064 867840 -28160 -507392 466432 -382464
562c54304K1504B17600K31936a9456E51424E1712b91328C26144J58720J095680
$$ -354304 -332800 217600 449536 -19456 551424 51712 -291328 326144 484864 1580544
552A580544A54624Q32000b61120F14400c9424G16800B40128K5600M3520h25856
$$ 1580544 154624 986624 -261120 614400 -39424 716800 240128 265728 309248 -825856
541C01568M07552h23808A90976j7920c09248D7104M20352P12704C01056J56672
$$ 301568 709120 -823808 190976 173056 -309248 47104 467456 1180160 301056 457728
531D57728L33824R728j73056h84224D75648K1504b63168I55392p168m7616C37408
$$ 457728 791552 801280 628224 -884224 475648 497152 -263168 955392 948224 900608 337408
519A080832M00384O34368q22272A37728o8096Q58112G2704N8880K10944i9328
$$ 1080832 1481216 2115584 1293312 137728 69632 927744 72704 131584 342528 -99328
508G99744l84512d11136B15040P07584D52096c66592B32448M0448f83520O0928
$$ 799744 415232 -411136 215040 922624 452096 -366592 232448 272896 -683520 -622592
498f22592j7920J19808A090560A3312O48192h1920C72736R29280C61984a057792
$$ -622592 -640512 -520704 1090560 13312 661504 -81920 372736 1302016 361984 -1057792
487a37216G19872a25952n23264J52064a95584g1680G5264P36768r8304d57728
$$ -137216 719872 -125952 -649216 -497152 -195584 -71680 75264 812032 713728 -457728
476F89152j0240J39264k44224r5744A024f00576B01216O75328i44640b0992D10112
$$ 689152 678912 818176 573952 478208 1024 -600576 201216 876544 -944640 -20992 410112
464I46688p5264b60608C27680N6320a86368N3760A16736N67808c9936A18784a80736
$$ 946688 871424 -260608 327680 384000 -186368 -132608 116736 684544 -39936 118784 -180736
452F51264a78688E42208O00576a003520b49856k73920F57408c53792J16736m72576
$$ 651264 -178688 542208 1142784 -1003520 -249856 -523776 657408 -353792 -237056 -709632
442g09632A94048J17760a239040A29024J34144h53504L64544o2464B72896a25952
$$ -709632 194048 311808 -1239040 129024 263168 -853504 -488960 -551424 272896 -125952
431A338880m66432d17792D95616a44896I44640f6048j030656c3280j24928L1744
$$ 1338880 872448 -417792 495616 -144896 944640 -66048 -1096704 -33280 -158208 -126464
421a26464F03648M63872a87904A073664A43360K02752p9872J80736a48992D11136
$$ -126464 603648 1067520 -187904 1073664 143360 346112 266240 446976 -148992 411136
410h34560c74272A072640m92544m5056p5776d39808H02304k56512L06176a65888
$$ -834560 -374272 1072640 580096 535040 459264 -439808 802304 545792 851968 -165888
399I09824C00032K04800J66912J32608A63840b4576j8944E48864i26720A176064
$$ 909824 300032 504832 671744 804352 163840 -24576 -43520 548864 -926720 1176064
388B34496a38752K5600A001984D54144q704f45632B48832L67104F2976J92512
$$ 234496 -138752 -113152 1001984 454144 445440 -645632 248832 615936 62976 255488
378B55488E7856O28224g680G52640L33312C23072K04288J13664f5024a2800o47680
$$ 255488 57856 686080 -7680 752640 1085952 323072 527360 641024 -65024 -12800 -660480
367f60480E85728D6592a688576A249280a56160A170944a6384B22208K83648j75104
$$ -660480 585728 46592 -1688576 1249280 -156160 1170944 -16384 222208 505856 330752
357C30752M05504k13504q5504N08416B69312K15040c78880O0416E53984k62656
$$ 330752 736256 522752 437248 945664 269312 484352 -378880 -318464 553984 291328
347B91328l6352m9664d00896g6288C8400N60640E4784a01888M9152j256960J54624
$$ 291328 254976 205312 -400896 -76288 38400 599040 54784 -101888 -52736 -1309696 -1155072
336a155072a88416A79200O63552a06496F6560R3184N64224l02080A09568D0960
$$ -1155072 -188416 179200 842752 -106496 66560 159744 723968 421888 109568 40960
325h48896A31072M0960N39136d49024E95456q3456k17600l0720J320448c4304
$$ -848896 131072 172032 711168 -449024 595456 512000 294400 263680 1584128 -34304
314C52256K31936%b77504F02112b92864I42080K82112l69152a05984k62656o56896
$$ 352256 584192 584192 -277504 602112 -292864 942080 1224192 855040 -105984 -368640 -1025536
303a025536B84160d42368G71072l64032l7888i09824D11648e62176I40544a098752
$$ -1025536 284160 -442368 771072 407040 369152 -909824 411648 -562176 940544 -1098752
292E62176B28864L0720h704j63328l13344F41536c65056B81600b89280A079296
$$ 562176 228864 259584 -8704 -172032 -485376 641536 -365056 281600 -289280 1079296
281b86720A43872i3696E15584e120C06688i05216C35872G6800R6256P46496n3760
$$ -286720 143872 -93696 515584 -5120 306688 -905216 335872 76800 173056 919552 865792
270H65792k24256a55136A118208a414656B48832L42528a01888A08032Q87808h39680
$$ 865792 641536 -155136 1118208 -1414656 248832 591360 -101888 108032 995840 -839680
259f35904D81280k17088N58080l97312K1504A09056M9664Q78592k60608C73760
$$ -635904 481280 264192 822272 424960 446464 109056 158720 1037312 776704 373760
248B072064A62304B4064J17760J16736c9424q6016A037312B77504e12512a63328
$$ 2072064 162304 24064 141824 258560 -39424 -125440 1037312 277504 -512512 -163328
237H18176R21088p66464g20384F66112B0480d97664B66752a8432B30912J106944
$$ 818176 1739264 972800 -720384 666112 20480 -497664 266752 -18432 230912 1337856
227A337856D58752M68992a070592C45088L89632C5840L08224R3184J42848c48672
$$ 1337856 458752 927744 -1070592 345088 734720 35840 344064 437248 580096 -348672
216G05536D3008Q10496q8064d15744B92352j7920K45760b48320j1776D64384b88768
$$ 705536 43008 853504 765440 -415744 292352 274432 520192 -248320 -260096 464384 -288768
204a168384D4032K92352d25984J42336A36704R13920a07008A11104R08800J53088
$$ -1168384 44032 336384 -425984 -283648 136704 1050624 -107008 111104 1019904 1172992
194A172992B67264d74112A499648D75136L88608A7920Q24320M28032A91488N60128
$$ 1172992 267264 -474112 1499648 475136 863744 17920 842240 1270272 191488 751616
184G51616O144b9696B39104J538560o19520C14880K46272k74944K38592q1920
$$ 751616 757760 -29696 239104 1777664 1158144 314880 561152 286208 524800 442880
174D42880K0992G2192b89280A188864C10784M03456k23232J17248n4784O45120
$$ 442880 463872 72192 -289280 1188864 310784 714240 491008 608256 553472 1198592
164A198592c01056A77664c06688K0480g5264p0144E86752K51904C42016P19872
$$ 1198592 -301056 177664 -306688 -286208 -75264 -145408 586752 838656 342016 1061888
154A061888a92000D79744a90464Q4480D89472r2160b9696H38144c96800k60096
$$ 1061888 -192000 479744 -190464 -105984 489472 397312 -29696 838144 -396800 -656896
144f56896A370624E95456f62528A126912D71040j80224J41312d05504H22784a285632
$$ -656896 1370624 595456 -662528 1126912 471040 290816 432128 -405504 822784 -1285632
133a9968n03808J16736B95424P6288H0896d64384A55648N10464B28864c43552
$$ -19968 -523776 -407040 295424 371712 80896 -464384 155648 666112 228864 -343552
122f00576F56384b65216B05824K28352a10080n99040K58048I19040A3312K99520
$$ -600576 656384 -265216 205824 434176 -110080 -709120 -451072 919040 13312 312832
112C12832N20192f75328I05728C60448n5296A40800N9904L02080A88928L64544
$$ 312832 833024 -675328 905728 360448 305152 140800 200704 502784 188928 553472
102E53472L44064j74592C29728d44928m2496H59648E7856J449472A024O4000J259008
$$ 553472 897536 722944 329728 -444928 -487424 859648 57856 1507328 1024 65024 1324032
91A324032C86048b54464D50560N91872l74272e29408E1712d79232A11104b36544
$$ 1324032 386048 -254464 450560 1042432 668160 -529408 51712 -479232 111104 -236544
80a116672E20704a22368G57248J19296A85344K96960I7280h7552l9424j0752A26976
$$ -1116672 520704 -122368 757248 876544 185344 482304 97280 -87552 -126976 -137728 126976
68C24608b01216A24928J70496M31104K40128a42848C71712J40288h60672B38080
$$ 324608 -201216 124928 295424 726528 966656 -142848 371712 512000 -860672 238080
57C37408b74944e0176A251840L20000c05664F31296L85536A22368L68640b25280
$$ 337408 -274944 -50176 1251840 1571840 -305664 631296 1016832 122368 491008 -225280
46i43104H85248l69152b98496H3968K20160A22368b81600E43744j20320a037312
$$ -943104 885248 516096 -298496 83968 304128 122368 -281600 543744 423424 -1037312
35H79104L1232g2704D88960R5744q4992D5056n12Q48384h47872c02592j83296
$$ 879104 910336 -72704 488960 584704 499712 45056 44544 892928 -847872 -302592 -485888
24d85888D31616b51392R1648G16288l25120d46976D75648c18464A14688M4544
$$ -485888 431616 -251392 -159744 716288 391168 -446976 475648 -318464 114688 159232
14A59232f31808C72224j08544b4064q56576B08896K5088C6352K28352a54624k38592
$$ 159232 -631808 372224 263680 -24064 -880640 208896 233984 36352 264704 -154624 -393216
3c93216A14176M10624b35008
$$ -393216 114176 524800 -235008
##END=
