##TITLE=1213
##JCAMPDX= 6.0         $$ Bruker NMR JCAMP-DX V2.0
##DATA TYPE= NMR SPECTRUM
##DATA CLASS= XYDATA
##ORIGIN= NUTS EXPORT
##OWNER= Administrator
$$ 1.72 TOPSPIN		Version 2.1
$$ 2016-02-23 12:17:59.574 -0800  Administrator@X
$$ Compression mode = diff/dup
##.OBSERVE FREQUENCY= 90.275459
##.ACQUISITION MODE= SIMULTANEOUS (DQD)
##.ACQUISITION SCHEME= undefined
##.AVERAGES= 16
##.DIGITISER RES= 22
##SPECTROMETER/DATA SYSTEM= 
##.PULSE SEQUENCE= zg30
##.SOLVENT NAME= None
##.SHIFT REFERENCE= INTERNAL, None, 1, 14.55551
##AUDIT TRAIL= $$ (NUMBER, WHEN, WHO, WHERE, PROCESS, VERSION, WHAT)
$$ ##TITLE= Audit trail, TOPSPIN		Version 2.1
$$ ##JCAMPDX= 5.01
$$ ##ORIGIN= Bruker BioSpin GmbH
$$ ##OWNER= Administrator
$$ $$ E:/data/jwist/nmr/1213/1/pdata/1/auditp.txt
$$ ##AUDIT TRAIL=  $$ (NUMBER, WHEN, WHO, WHERE, PROCESS, VERSION, WHAT)
(   1,<2016-02-23 08:17:46.027 -0800>,<Administrator>,<X>,<jcamp>,<TOPSPIN 2.1>,
      <fromjdx created from
       E:\data\jwist\nmr\uniandes\1213
       data hash MD5: 8K
       0A 61 BD 3E C4 8D 66 DF 94 19 1A B4 30 31 A7 47>)
$$ ##END=
$$ 
$$ $$ hash MD5
$$ $$ 37 D6 7E B8 DD AD 89 65 6F 4E 1C 46 18 9F 18 89
##$RELAX= 
$$ Bruker specific parameters
$$ --------------------------
##$DU= <E:>
##$EXPNO= 1
##$NAME= <1213>
##$PROCNO= 1
##$TYPE= <nmr>
##$USER= <jwist>
##$ACQT0= 0
##$AMP= (0..31)
100 100 100 100 100 100 100 100 100 100 100 100 100 100 100 100 100 100
100 100 100 100 100 100 100 100 100 100 100 100 100 100
##$ANAVPT= 1
##$AQSEQ= 0
##$AQ_mod= 3
##$AUNM= <au_zg>
##$AUTOPOS= <>
##$BF1= 90.275459
##$BF2= 400.02
##$BF3= 400.02
##$BF4= 400.02
##$BF5= 400.02
##$BF6= 400.02
##$BF7= 400.02
##$BF8= 400.02
##$BYTORDA= 0
##$CFDGTYP= 0
##$CFRGTYP= 0
##$CHEMSTR= <none>
##$CNST= (0..63)
1 1 145 1 1 1 1 1 1 1 1 1 1 1 1 1 1 1 1 1 1 1 1 1 1 1 1 1 1 1 1 1 1 1 1
1 1 1 1 1 1 1 1 1 1 1 1 1 1 1 1 1 1 1 1 1 1 1 1 1 1 1 1 1
##$CPDPRG= <>
##$CPDPRG1= <>
##$CPDPRG2= <>
##$CPDPRG3= <>
##$CPDPRG4= <mlev>
##$CPDPRG5= <mlev>
##$CPDPRG6= <mlev>
##$CPDPRG7= <mlev>
##$CPDPRG8= <mlev>
##$CPDPRGB= <>
##$CPDPRGT= <>
##$D= (0..63)
0 1 0 0 0 0 0 0 0 0 0 0 0 0 0 0 0 0 0 0 0 0 0 0 0 0 0 0 0 0 0 0 0 0 0 0
0 0 0 0 0 0 0 0 0 0 0 0 0 0 0 0 0 0 0 0 0 0 0 0 0 0 0 0
##$DATE= 0
##$DBL= (0..7)
120 120 120 120 120 120 120 120
##$DBP= (0..7)
150 150 150 150 150 150 150 150
##$DBP07= 0
##$DBPNAM0= <>
##$DBPNAM1= <>
##$DBPNAM2= <>
##$DBPNAM3= <>
##$DBPNAM4= <>
##$DBPNAM5= <>
##$DBPNAM6= <>
##$DBPNAM7= <>
##$DBPOAL= (0..7)
0.5 0.5 0.5 0.5 0.5 0.5 0.5 0.5
##$DBPOFFS= (0..7)
0 0 0 0 0 0 0 0
##$DE= 6.5
##$DECBNUC= <off>
##$DECIM= 2432
##$DECNUC= <off>
##$DECSTAT= 4
##$DIGMOD= 1
##$DIGTYP= 12
##$DL= (0..7)
0 120 120 120 120 120 120 120
##$DP= (0..7)
150 150 150 150 150 150 150 150
##$DP07= 0
##$DPNAME0= <>
##$DPNAME1= <>
##$DPNAME2= <>
##$DPNAME3= <>
##$DPNAME4= <>
##$DPNAME5= <>
##$DPNAME6= <>
##$DPNAME7= <>
##$DPOAL= (0..7)
0.5 0.5 0.5 0.5 0.5 0.5 0.5 0.5
##$DPOFFS= (0..7)
0 0 0 0 0 0 0 0
##$DQDMODE= 0
##$DR= 22
##$DS= 2
##$DSLIST= <SSSSSSSSSSSSSSS>
$$ [...]
##$SPOFFS= (0..31)
0 0 0 0 0 0 0 0 0 0 0 0 0 0 0 0 0 0 0 0 0 0 0 0 0 0 0 0 0 0 0 0
##$SUBNAM0= <"">
##$SUBNAM1= <"">
##$SUBNAM2= <"">
##$SUBNAM3= <"">
##$SUBNAM4= <"">
##$SUBNAM5= <"">
##$SUBNAM6= <"">
##$SUBNAM7= <"">
##$SUBNAM8= <"">
##$SUBNAM9= <"">
##$SW= 20.5580556627758
##$SWIBOX= (0..15)
0 0 3 4 0 0 0 0 0 0 0 0 0 0 0 0
##$SW_h= 8223.68421052631
##$SWfinal= 0
##$TD= 65536
##$TD0= 1
##$TE= 300
##$TE2= 300
##$TE3= 300
##$TEG= 300
##$TL= (0..7)
0 120 120 120 120 120 120 120
##$TP= (0..7)
150 150 150 150 150 150 150 150
##$TP07= 0
##$TPNAME0= <>
##$TPNAME1= <>
##$TPNAME2= <>
##$TPNAME3= <>
##$TPNAME4= <>
##$TPNAME5= <>
##$TPNAME6= <>
##$TPNAME7= <>
##$TPOAL= (0..7)
0.5 0.5 0.5 0.5 0.5 0.5 0.5 0.5
##$TPOFFS= (0..7)
0 0 0 0 0 0 0 0
##$TUNHIN= 0
##$TUNHOUT= 0
##$TUNXOUT= 0
##$USERA1= <user>
##$USERA2= <user>
##$USERA3= <user>
##$USERA4= <user>
##$USERA5= <user>
##$V9= 5
##$VALIST= <valist>
##$VCLIST= <CCCCCCCCCCCCCCC>
##$VD= 0
##$VDLIST= <DDDDDDDDDDDDDDD>
##$VPLIST= <PPPPPPPPPPPPPPP>
##$VTLIST= <TTTTTTTTTTTTTTT>
##$WBST= 1024
##$WBSW= 4
##$XGAIN= (0..3)
0 0 0 0
##$XL= 0
##$YL= 0
##$YMAX_a= 1112872704
##$YMIN_a= -1768104.448
##$ZGOPTNS= <>
##$ZL1= 120
##$ZL2= 120
##$ZL3= 120
##$ZL4= 120
##$ABSF1= 10
##$ABSF2= 0
##$ABSG= 5
##$ABSL= 3
##$ALPHA= 0
##$AQORDER= 0
##$ASSFAC= 0
##$ASSFACI= 0
##$ASSFACX= 0
##$ASSWID= 0
##$AUNMP= <proc_1d>
##$AXLEFT= 0
##$AXNAME= <>
##$AXNUC= <off>
##$AXRIGHT= 0
##$AXTYPE= 0
##$AXUNIT= <>
##$AZFE= 0.1
##$AZFW= 0.1
##$BCFW= 1
##$BC_mod= 2
##$BYTORDP= 0
##$COROFFS= 0
##$CY= 15
##$DATMOD= 1
##$DC= 2
##$DFILT= <>
##$DTYPP= 0
##$F1P= 0
##$F2P= 0
##$FCOR= 0.5
##$FTSIZE= 0
##$FT_mod= 4
##$GAMMA= 1
##$GB= 0
##$INTBC= 1
##$INTSCL= 1
##$ISEN= 128
##$LB= 0.3
##$LEV0= 0
##$LPBIN= 0
##$MAXI= 10000
##$MC2= 0
##$MEAN= 0
##$ME_mod= 0
##$MI= 0
##$NCOEF= 0
##$NC_proc= -9
##$NLEV= 6
##$NOISF1= 0
##$NOISF2= 0
##$NSP= 1
##$NTH_PI= 0
##$NZP= 0
##$OFFSET= 14.55551
##$PC= 1
##$PHC0= 0
##$PHC1= 0
##$PH_mod= 0
##$PKNL= yes
##$PPARMOD= 0
##$PPDIAG= 0
##$PPIPTYP= 0
##$PPMPNUM= 2147483647
##$PPRESOL= 1
##$PSCAL= 4
##$PSIGN= 0
##$PYNMP= <proc.py>
##$REVERSE= no
##$SF= 90.2741450139047
##$SI= 8192
##$SIGF1= 0
##$SIGF2= 0
##$SINO= 400
##$SIOLD= 32768
##$SPECTYP= <>
##$SREGLST= <1H.CDCl3>
##$SSB= 0
##$STSI= 0
##$STSR= 0
##$SW_p= 1497.18866228788
##$SYMM= 0
##$S_DEV= 0
##$TDeff= 0
##$TDoff= 0
##$TI= <>
##$TILT= no
##$TM1= 0
##$TM2= 0
##$TOPLEV= 0
##$USERP1= <user>
##$USERP2= <user>
##$USERP3= <user>
##$USERP4= <user>
##$USERP5= <user>
##$WDW= 1
##$XDIM= 8192
##$YMAX_p= 1112872448
##$YMIN_p= -1767936
##$CURPLOT= <PDFCreator>
##$CURPRIN= <$PDFCreator>
##$DFORMAT= <normdp>
##$LAYOUT= <+/1D_H.xwp>
##$LFORMAT= <normlp>
##$PFORMAT= <normpl>
##$SURQMSG= 1
$$ End of Bruker specific parameters
$$ ---------------------------------
##XUNITS= HZ
##YUNITS= ARBITRARY UNITS
##XFACTOR= 0.182762287876938
##YFACTOR= 1
##DELTAX= -0.182762287876938
##NPOINTS= 8192
##FIRSTX= 1497.0059
##FIRSTY= -1400320
##LASTX= 0
##MAXY= 1112872448
##MINY= -1767936
##XYDATA= (X++(Y..Y))
8191 -1400320 79360 663040 -482816 -239616 -207872 820736 190464 838656 -326656 -356352
8181 -356352 691200 -847872 957440 -352256 -15872 73216 -228352 -1062400 593408 -400896
8170 506880 649728 872960 509440 602624 281088 -1007104 51712 -545792 -596992 -439296
8160 -439296 24064 -1109504 -131072 141312 -229888 374272 -188416 321024 440320 356864
8150 356864 316928 336384 466432 237056 -510976 -154112 -114176 -556544 -51200 45056 170496
8139 170496 442880 -148992 567808 -24576 -699392 -221696 -337920 -675328 217088 907776
8129 907776 978944 87040 533504 577024 848896 347648 -276992 -1313792 262656 37888
8118 635904 -484352 365568 -206336 -67072 768512 -278016 392704 -4608 486400 428544
8108 428544 297472 -174592 437248 622592 -354304 616960 -718336 125952 756224 -36864
8097 1119744 528384 110080 214016 -485888 -852480 -46592 -780800 970752 -223744 -1767936
8087 -1767936 -571904 14336 -53760 -897024 421376 -502784 520192 -183296 579072 227840
8076 295936 405504 13824 104960 -396800 192512 -431616 239616 -275456 682496 239104
8065 -400896 -615424 421888 99328 -299008 -643072 -459264 -1283072 91648 131072 772608
8055 772608 897536 172544 -589312 563712 -44032 -1061376 717824 -95744 -743936 255488
8044 -599040 -244224 -564224 -896512 -77824 -871936 133120 -841728 -135680 -167936 755200
8033 303104 701440 617472 -464896 -660992 -905216 -227840 -115200 194560 1062400 -429056
8022 -229376 166912 227328 -64000 147968 446976 -251392 342528 549888 108544 -499712
8011 310272 -151552 -384512 -996864 -279552 -176128 -329728 -590336 -741376 -91648 93184
8000 -1089024 -160768 -176128 -423936 460800 391680 350208 1631744 -343040 877568 1214464
7990 1214464 313856 622592 -722432 -325120 -347136 -687104 -590848 317952 -473600 534528
7979 114688 175104 552448 219648 -445440 160768 479232 365568 -494592 -183296 -379392
7969 -379392 13312 -663040 -660480 -112640 -18944 -232448 -45568 212480 -543232 -79360 950784
7957 -392192 -573952 -306688 -67072 -224256 -614400 -613376 279040 785408 496640 95232
7946 -391168 683520 -210944 -1121792 -477184 -1582592 -366592 -323072 -364544 -150016 -152576
7936 -152576 108544 -266752 68096 -654848 -500736 -224256 -347136 -118272 -1065984 1049088
7925 -653824 26624 201216 229888 18944 179200 -514048 612864 112640 1232384 -840192
7914 -495104 378880 -326656 -305152 733696 246272 -515072 456192 31232 306688 -82432
7903 -112128 -526848 -656384 210432 -416768 -398336 177152 -397824 329216 174080 -952320
7892 -655360 262656 382464 189952 -394240 837632 -1014784 -502784 -331776 -403456 -300032
7882 -300032 20992 -522752 -181248 -44032 121344 -154624 532992 -350208 136704 103424
7872 103424 -572416 156672 -79872 -1182720 19456 -177664 344576 892928 462336 884736
7862 884736 784384 -258048 -78336 -361984 -558592 499200 441344 1284608 -38912 679936
7851 582656 -540672 -515072 156672 731136 29696 243712 1366528 1018880 -577024 15872
7840 684032 664064 223232 242688 92160 -573952 112128 -218112 431104 128000 329728
7830 329728 305152 -624128 228864 -468992 205824 217600 664576 -395264 481280 -611840
7819 -402432 54272 334336 596992 265216 -677888 292352 68096 175616 -555008 -297472
7809 -297472 -902656 -1070592 428544 -285696 -461312 -548864 870912 -244224 816640 349184
7798 113664 -88064 -101376 -1392640 -394240 408576 209408 -138240 -601600 465408 45568
7787 457728 59392 647680 -414208 80384 -493568 -175104 470016 126464 -139776 -851456
7777 -851456 267776 -451584 9728 612864 24576 -505856 400896 726528 1298944 410624
7766 233984 180736 -883712 -26624 -609280 -349696 -296960 -310272 -421888 392192 825856
7756 825856 305152 144384 -579584 -209920 186880 -132096 -160768 -197632 199680 -770048
7745 265728 -324608 -360448 344576 383488 -78336 -306176 372224 -605184 231424 391168
7735 391168 -308736 52224 -313856 167936 -31744 -120832 -25600 -137216 -246272 -744960
7725 -744960 -588800 644608 128000 -436224 -194048 599552 253952 -814080 -117248 -35840
7714 -550912 381440 -148480 -184832 -972800 -393216 913408 -596992 352768 -738816 500736
7703 -360448 -837120 588800 -155136 389120 -120832 444928 -109056 55808 479744 -245760
7692 547840 -792064 -33280 623616 343552 1013760 1424896 32768 149504 -247808 216064
7681 -14848 -275456 -637440 902656 -530432 -526848 -377344 -761856 -699904 778240 -738816
7670 489984 -1536 60928 -1230848 118784 320000 38912 -186368 264704 168448 417792
7660 417792 507392 -8704 -815104 288768 -329216 -182784 132096 290304 776704 -317440
7649 77824 -571904 -210944 -378368 577024 570368 -411648 -488960 25600 150528 291328 -1191424
7637 871936 379392 1117696 195584 -731136 -162816 336384 44544 387072 659968 -763392
7626 676352 317952 -214016 -455168 -628736 -462848 245248 838656 24576 14336 566784
7616 566784 -576512 -453120 408576 359424 353280 -838656 95744 -368640 -495104 1331712
7605 38912 559104 -592896 28160 827904 -749568 848384 -958464 19456 -730624 788992
7594 -586752 493568 132608 -269824 12288 -1233408 203264 -116224 165376 -919040 -216064
7583 230400 322560 -764928 354304 -177152 -157696 -193536 -102400 -125952 686592 38400 198144
7572 198144 -374272 -261632 720384 -207360 -210944 492544 111616 -502784 256512 270848
7562 270848 -280064 198656 511488 -573952 188416 -950784 256000 -554496 23552 728064
7552 728064 456704 672768 164352 734208 178688 -410112 518144 -643584 251904 678912
7542 678912 122368 552960 -83456 103936 -866304 -48128 -503808 -73728 -1340416 -197632
7531 66560 -183808 -252928 24064 -931840 814080 -1650688 -742912 -118272 -302080 487936
7520 291840 6144 -59392 51712 -552448 -297984 -90624 1036800 -1269760 -671744 1176064
7509 195584 472576 -118272 278528 303104 74752 -222208 -592384 250368 -337920 -595456
7499 -595456 804352 164864 -110592 -564224 279040 969728 -224256 346624 -806400 156672
7488 248320 537088 -983552 367104 1209856 -479744 131584 302592 -465920 -2560 -547840
7478 -547840 -197120 273408 494080 12288 34304 670720 605696 755712 573440 859136
7468 859136 845824 217600 -175104 318464 342528 246272 -274432 -317952 816640 -28672 -237056
7457 -237056 -128000 -443904 834560 53760 -130560 448512 -295936 -143872 770560 184832
7446 -510464 -249856 -477696 -31232 122368 350720 -295424 -441856 119296 37888 656896
7436 656896 229888 194048 440832 -200192 -723456 578048 647168 -529920 -489984 -254464
7426 -254464 -242176 38400 837120 428544 205824 442368 52736 -25088 1191936 -734720
7415 -1127936 1075712 953856 -446976 651264 -1174016 -199680 -505344 -244736 -123904
7406 -123904 -4096 1419264 -672256 -202752 652288 421888 796672 662016 -492032 145920
7395 647168 -112128 529920 -556544 -126976 -809984 -422400 43520 -761344 -198656 562176
7384 748032 275456 1158656 -114176 131584 -645120 1123328 715776 454656 -39424 116224
7373 238080 443904 -154112 -825856 201216 -561152 444928 459776 929280 -421376 1080832
7362 -784384 431616 -833536 835072 416768 369664 832000 -31744 195072 220672 468992
7352 468992 -65024 -21504 86528 -879104 233984 1010688 565248 733184 916992 506368
7342 506368 626176 -28672 -744448 929280 -179200 -423424 1461760 434176 108544 1111040
7332 1111040 -613888 876032 -335360 -948736 -8704 -192512 457216 515584 532992 -51712
7321 163840 622080 -781312 -138240 79360 -674816 662016 -275968 381952 572928 1592320
7311 1592320 -219136 504320 -525312 698368 458752 -111104 27648 739328 522240 113152
7300 -329216 1467904 711168 -473088 -468992 -523776 132096 321024 56320 474624 -658432
7289 89600 -786944 927232 -51200 -141824 264192 -63488 194048 -287232 175104 -233984
7278 980480 -321536 1074688 816128 -146432 -358912 -449536 168960 -169984 113152 -811520
7267 309248 -536064 1037824 -49664 366592 566272 -647168 879104 190976 595968 898048
7257 898048 -393216 -880640 982016 -766464 541184 -315904 556032 504320 328704 1040384
7247 1040384 552448 686592 -1038336 841216 524288 156672 -389632 37888 1203200
7238 1203200 -397824 -459776 -429056 -336384 -476672 108032 -75264 150016 440320 760320
7228 760320 -865280 242176 136192 1045504 570880 563200 375808 497152 517120 546816
7218 546816 -396288 237056 103936 -342528 506880 -334848 -357888 -5632 742400 -1032192
7207 1149952 -435712 -306176 913920 275456 374784 38400 738304 144384 116224 43008
7196 656896 828416 -642560 198656 -189440 1352192 -440320 581120 -163840 641024 203776
7185 474112 122880 1102336 95744 -113664 276480 -53760 213504 -81408 218112 707584
7175 707584 -348672 384512 576000 -994304 -154624 528896 -6656 890880 -13824 -838144
7165 -838144 29696 -89088 242688 -362496 -740864 274944 113152 -36352 -175104 96768
7154 -705024 -684544 507904 -398336 521216 -267264 -121856 287232 477696 -553984 -362496
7144 -362496 -439808 275456 263168 662528 92160 17408 1306112 -622592 1058304 474624
7133 -75776 233984 491520 150528 571392 512512 996352 948224 163840 -1128448 -494080
7122 140800 -416256 402432 502784 217600 -143872 251904 -31744 524800 64512 81408
7112 81408 -233472 -28672 200704 -615424 1030144 -587264 -331776 63488 702464 -162816
7101 -1321984 522752 701952 271872 -618496 -103424 -125952 -220160 -320000 256512 98816
7090 -1665536 654336 518656 301568 -584192 1093632 162304 529408 695808 79360 -245760
7079 479232 -177152 -384512 -281088 -158720 631808 422400 676352 648192 506368 -379392
7068 765440 380416 183296 420864 -52224 3072 -119296 249344 1656832 1219584 713728
7058 713728 739328 311296 940032 -592896 294400 -93184 578560 -238080 397312 84480
7047 31232 -96256 51712 1082368 1296384 740864 -117248 556032 -445440 435712 113152
7036 -321536 976896 492032 -20480 336896 1098240 -137728 158720 617984 905728 -641024
7025 318464 1227776 225792 -324608 526848 284160 630272 347136 1327104 985600 178176
7014 1074176 -846336 657408 -315392 -158208 333312 -256512 338944 201728 50688 563200
7004 563200 1152000 -246272 229376 31744 -850432 -408576 -87552 -33280 1037824 4096
6993 300032 -1226752 804352 801792 -1037824 29696 824832 285696 198144 -1177600 -154112
6982 903680 -159232 550912 346624 244736 -156160 806400 539136 997888 707072 -302080
6971 738816 -410112 -524288 552448 -327168 -285184 685056 650752 -43520 -367104 3072 959488
6960 959488 632320 -150528 -829440 280064 -480768 546816 291328 201728 179200 1526784
6950 1526784 323072 -445440 -235520 641536 -39936 -215040 -1315840 730112 -541184 291328
6939 17920 573440 50176 -525312 -36352 338432 -751104 1526784 229376 355840 706560
6929 706560 456704 413184 1082368 -764928 1201664 143872 785408 -475136 260096 -107008
6918 -1166848 627200 -21504 -51712 -173056 337408 46080 8192 -145408 -1094656 -62976 -50688
6907 -50688 683520 570880 -13312 914944 1500672 684032 347136 -702464 -34816 -520192
6897 -520192 -507392 110592 -854528 204288 430592 448512 1044480 400896 75264 822784
6887 822784 -299520 -220160 609280 577024 481280 -607744 -266240 219136 969216 -391168
6876 -82944 1349632 720896 103936 417280 115200 -69632 516096 -221184 -392192 -89088
6865 253952 -57856 330752 969728 -609792 -896000 751104 -746496 194560 625664 -137728
6854 -153088 -697856 1335808 567808 197120 -206848 1221120 -251904 350720 969216
6845 969216 -1077248 -604160 50688 571392 238080 135680 822272 429568 667648 212480
6834 -485376 -829440 156672 -429568 -47104 -296960 -342016 139776 45568 45568 416256 -249344
6822 274432 727040 -348160 -1158656 286208 939008 -887808 161280 270848 77824 733184
6812 733184 -18432 -488448 869888 -437248 393216 626688 364032 1516544 622080 -275968
6801 -398848 -12288 -306688 229376 -603136 895488 -641024 827392 1291264 1303552 116224
6790 -646144 52224 282112 44544 -179712 688640 462336 -731136 758784 444416 12800
6779 230400 -155648 837632 303616 807936 379392 1604608 792064 1009152 10240 -222208
6768 648704 156672 -275456 475136 -472064 135680 239616 -483328 -301568 -412672 -861184
6758 -861184 -321536 491520 389632 386048 282624 1269248 151552 -568832 1185792 262144
6747 655360 -346112 550400 -34304 692736 43520 637952 -302592 -141312 -82944 -249344
6737 -249344 15360 -252928 789504 992768 1406464 501760 -620032 185856 678912 305664
6726 -154112 -7680 677888 631296 212480 -75264 501248 300032 194048 -204800 441344
6715 297984 -352256 -191488 1436160 -259584 179200 281088 -320512 376320 1076224 218624
6704 -212480 1563136 -51200 377856 -45056 649216 955904 247296 -182784 -846336 19968
6693 817152 958976 439808 377856 -828928 797184 197120 -524800 -632832 862720 1017856
6683 1017856 25088 1310720 614912 88576 -87552 440320 857088 363520 156672 1356288
6673 1356288 696320 993792 13824 513024 1120256 -927232 44032 43520 1243648 273920
6662 840192 1103360 -42496 478720 343040 -398848 1067008 -1065472 498176 1637888
6653 1637888 436736 -1148928 56832 -6144 -804352 791040 -539136 726528 -412160 -133120
6642 41472 532480 -128512 168448 452096 12288 674816 358912 769536 -349696 935424
6631 -590336 817152 188416 93184 11264 -353792 -1167360 -86528 -427520 606720 174592
6620 -320000 986624 1031680 1021952 686592 264192 536576 -295936 59392 2048 -261120 -454144
6609 -454144 1500160 -362496 361472 383488 -283648 683008 -23040 17408 -1022464 557568
6598 1215488 329216 -104448 594944 -178688 -644096 1242112 798208 94720 824320 -575488
6587 -17408 -721408 669696 1325056 112128 366080 816128 207360 69120 1021440 338432
6576 5632 -584704 347648 19968 -448000 -92672 989184 617472 449024 944128 574976
6566 574976 1098752 361984 257536 -401408 59392 59904 812032 -391680 206848 737792
6556 737792 -238080 425472 -381952 -115200 777216 4096 207360 453632 -449024 691712
6545 734208 1046016 126464 716288 218624 885760 643584 157184 148992 -89088 48640
6534 359936 85504 1013248 1089024 1071616 412672 -74240 431104 -529920 672256 82432 310784
6523 310784 227840 261120 -776704 847360 -537600 1350144 -88064 443392 -247808 1232384
6512 -124416 1383424 1547776 466944 532480 979456 800768 -314368 621568 693760 1528832
6502 1528832 -1024512 653312 -3584 97792 496640 3584 -569344 9728 -107520 1170432
6491 133632 -64000 826880 -603648 179200 66560 783360 -115200 95232 1567232 768000
6480 997888 -253952 460800 421376 -146944 230912 -20480 84992 -13824 -653312 -407552
6470 -407552 -871424 -141824 604160 1217024 35328 795648 260096 1043456 770560 1139200
6460 1139200 162304 -633344 508416 1186816 -296960 916480 300544 35328 652288 -197120
6449 1408000 1043456 1384960 -438784 714240 395264 332288 826880 760832 344576 357376
6439 357376 -286720 -248832 -188928 712192 -444416 -145408 -631808 666112 700416 -95744
6428 196096 549888 -145920 -433664 -147456 -424960 1391104 177664 673792 -9216 -1253376
6418 -1253376 709632 122880 -349696 845824 979968 787968 280576 149504 26624 813056
6408 813056 728576 850944 450048 29184 -410624 -1210880 -259072 1210368 -166400 -856064
6398 -856064 787968 760832 1220608 884736 614912 -284160 602624 -53248 355840 -434176
6387 619008 442880 281600 1144832 1487872 1096192 -358912 250368 741376 288256 299008
6377 299008 -10240 708096 -233984 979968 172032 544256 550912 1041920 260096 424960
6367 424960 -109056 1411072 787456 395776 509440 467968 393728 262656 780800 1199104
6357 1199104 -375808 79872 -992768 682496 -179712 -452608 434176 696832 1102336 1144832
6347 1144832 423936 466944 572928 438784 1128960 335360 -100352 -670208 -378368 637952
6336 1336832 690688 661504 968704 906752 567296 150016 -791040 93696 1007104 1033728
6326 1033728 350720 854528 -642048 792576 -164864 274432 -827904 -792576 946688 -432640
6315 195072 814080 1185792 1054208 -322560 273920 -1016320 -23552 -171520 -510976 820736
6304 1252864 483840 512 616448 -379904 602112 -870912 74752 1117184 419840 -43008
6293 866304 653824 -627200 544768 441344 1584640 984576 357888 1006592 681472 121344
6282 685568 269824 11776 211456 -309248 -114176 848896 160768 305664 247808 875520
6272 875520 453632 652288 0 -893952 -516096 -629760 307200 190976 854016 385024 80384
6260 827904 876544 98304 240640 -186368 -123392 493568 125952 797696 288256 877056
6250 877056 613376 -326656 812032 392192 -67072 1196032 458240 1198080 1601536 157184
6239 -386560 86016 960512 300544 335360 640000 -88576 -125952 -345088 -103936 728576
6228 631808 787968 398336 178176 -503296 107520 208896 661504 714240 333312 -427520
6217 1164800 651776 184320 187904 -541184 -39936 15360 -1129984 1519616 -257536 704512
6206 1264128 489472 92160 1346560 1101312 -329728 919552 237568 -152576 -98816 543744
6195 1300992 -77824 -284672 -1179648 1088512 492544 1381888 1026048 509952 -1058816
6185 338944 1462272 110592 627712 1354752 331776 51200 1260544 619008 1012736 779264
6175 779264 1066496 389120 321536 404480 612352 603136 -45056 460800 -347648 1007616
6164 234496 751616 -300032 294400 -264192 -452096 868352 378880 -229376 183296 1325056
6154 1325056 1066496 903680 1733120 -205312 879104 436736 -401408 522752 318464 -77312
6143 128000 56832 1424896 1096704 -187392 -304640 74240 311808 985600 104960 65536
6133 65536 569856 -624640 287232 232960 551936 1016832 137728 739328 265216 884224
6123 884224 113664 32256 -223232 272896 267264 602112 429056 180224 448000 460800
6113 460800 -15360 811008 1043456 -36352 57344 484864 -501760 -249856 564224 407552
6103 407552 670208 1179648 250880 718336 -210432 41472 1347072 2048 -884736 698368
6092 356864 294400 1300480 1271296 867328 394752 121344 964608 -235520 142336 706048
6082 706048 508416 -56832 -274944 -443904 815616 -188416 1306112 -779776 271360 499712
6072 499712 -946176 478720 29696 -552448 196608 473088 883200 -142336 -45568 139776
6061 -72192 369664 133632 -31232 -434176 290816 -397824 -415744 359424 433152 -305664
6050 29696 -68608 -12800 695296 169984 539648 883200 272896 53760 870912 207872
6039 590336 175616 -375296 -1055744 -212480 217088 -148480 667648 1181696 1435648 483840
6028 618496 118272 940032 -236032 -98304 1110016 516608 338944 555520 223232 461312
6018 461312 1107968 474624 54784 429568 -25088 555520 303616 -512 736256 653824 686592
6007 686592 11264 51712 404992 -596480 610816 1285120 -778752 731648 -117248 478208
5996 467968 102400 1361408 729088 696320 452608 -183808 256512 723968 391168 476672
5986 476672 814080 972288 248320 579072 623616 1107456 1079808 -520704 -201216 -748544
5976 -748544 418816 -653824 110080 551936 908800 110592 719360 -159744 478208 843264
5966 843264 888832 82944 154112 -749568 749056 -233984 343040 181248 -116736 384512
5955 -372736 514560 1236992 1019904 892416 971264 -750592 464896 224256 140800 -272896
5944 -270336 1759232 1020928 944128 86528 478208 -136704 -779264 -702976 101376 533504
5934 533504 1141760 204288 652800 2037248 1969664 -832512 236544 471040 280576 178688
5924 178688 523776 181760 1413632 995840 1944576 284672 925696 1347584 -30208 191488
5913 61952 633344 875008 692736 59392 559104 667136 780800 1041920 151552 638976
5903 638976 933888 129024 -316928 297984 555520 1052672 1217024 761856 832512 117248
5892 -190976 674304 -719872 390656 279552 144896 450048 697856 -144896 49664 -153600
5881 975360 1118720 410112 2048 868352 153600 695808 150016 619520 -642048 611328
5870 1152000 1385472 1798656 1074688 -358400 1380864 517120 838144 337408 620544
5861 620544 1174016 -371200 662016 -208896 396288 1084928 -373760 818176 -542208 1032704
5850 9728 349184 1075712 -18944 812544 35328 654336 372224 474624 -497664 287232
5839 636928 719360 592384 -1412608 207872 392192 663040 289280 -314880 -199680 1283584
5828 652288 59904 724480 1608704 1117696 1199104 123392 653824 1233408 827904 605696
5818 605696 1194496 93696 873984 859136 669696 1190912 152576 764928 -251904 353792
5807 1211392 1510400 1409536 955904 205824 749056 1183744 651776 629760 538112 -146432
5796 1068544 -229376 52224 1416704 1108992 1595392 1170944 -23040 -614400 524288 613888
5786 613888 668160 665088 -719872 809984 1056256 129024 512000 1626112 283648 717312
5776 717312 671232 1000448 744960 739328 559104 733184 174080 -484352 78848 -60416 1362944
5764 302080 721408 396288 311808 606208 1830912 573440 721408 -398848 535040 -756224
5753 935936 -165888 -201216 1040896 1146880 439296 148992 477696 313856 503296 847872
5743 847872 2243072 -13312 567808 658432 1140224 777728 960512 839168 1161728 1761792
5733 1761792 592384 372736 773632 -131072 492032 1165312 1111552 -35328 324608 653312
5723 653312 1297408 1109504 1201152 -199680 -434176 -135680 -14336 -2048 313344 1028096
5713 1028096 843264 820736 376832 1028096 474624 504832 1251840 542720 224256 -177152
5702 554496 397824 173568 235008 669184 1009664 676352 1520640 -376832 1104896 390144
5691 988160 1008128 758784 696832 289280 198656 47616 -425984 2074624 1370624 689152
5681 689152 -268288 1640448 448512 1640960 747008 928256 38912 513536 -302080 1133056
5670 1353728 574464 927744 232448 214528 955392 1418240 1113088 1054208 157184 889856
5660 889856 927744 504832 1894400 1582592 2288128 1233408 197632 704512 148992 723968
5650 723968 -46080 612352 913408 -669184 1967104 1011200 534016 572928 -179200 -296448
5640 -296448 622080 369152 751616 416768 74240 164352 527872 632320 287744 -90624
5629 720896 1380864 54784 736256 -218624 999424 835072 165888 1233408 254976 498176
5619 498176 428544 1003520 719360 717824 379392 258048 507392 140288 185344 2158080
5609 2158080 390656 448512 412160 2247680 715264 506368 -222208 542720 514048 1362944
5599 1362944 1480192 497152 914944 1444352 928256 450560 1612800 725504 1054720
5590 1054720 1358336 70144 601088 1007104 404992 630784 -187392 419840 1431040 826880
5580 826880 628736 982016 1727488 988160 1302016 217088 424448 1238528 1358336 2100224
5570 2100224 538624 1581056 901120 -6656 776704 865792 968704 1224704 1372160 662528
5559 588288 129536 903168 919040 2336256 584192 158720 1132544 776704 1355264 1911808
5549 1911808 1996800 984576 1982976 1029632 1439232 1101312 710144 1627648 2577408 967168
5538 1673728 940544 1135104 419840 748032 1091072 1388032 -268288 696320 108032 826368
5528 826368 1379840 94720 1492992 1021952 538624 1408512 1136128 921088 1100288 734208
5518 734208 314368 -785920 189952 985600 117248 378880 1311744 993280 1077248 340480
5507 599040 1606656 632832 262656 756736 -173568 612352 -295936 197632 366592 918528
5497 918528 1205760 -545792 882688 1573888 615936 1267712 633856 -166912 546816 82944
5486 -154112 1401344 1767936 307712 126464 325632 880640 1590272 -495616 828928 1200640
5476 1200640 160256 1348608 667136 -59904 686592 557568 457216 823808 1013760 46592
5465 104960 1154048 856064 443392 459776 1675776 -191488 1517056 -295424 1184768
5455 1270784 1292800 485376 1125376 476672 1201664 -212992 -194560 747008 1122304 1663488
5445 1663488 1196032 314880 1009664 1669120 842752 962048 432128 925696 1473024 293376
5434 1756672 474624 836096 768512 1605120 1789440 1307648 1048064 1594880 1456640 -2560
5423 1484800 614400 1256960 338944 1411072 1652736 501760 1123328 584192 687104
5414 687104 1879040 1474560 2130944 437760 390144 1450496 1404928 990720 1074688 1330688
5404 1330688 1075712 1276416 -569344 1048064 1356800 1273344 1169408 797696 1286656 1461760
5394 1461760 1426432 1442304 1374208 1334272 1543168 1238528 1487360 1560064 1452544 1731584
5384 1731584 780800 1774080 1911808 1034752 1268736 318464 1107456 876544 242176 1373184
5374 1373184 1322496 1072640 1396224 1648640 1179136 1973760 -286208 1354752 1483264 1249792
5364 1249792 1159680 126464 1533952 1725440 1467392 1660416 1125376 880640 828416 930816
5354 930816 857600 1571328 -175616 761344 935936 -417792 1295360 1150976 559104 681472
5344 681472 176128 186368 287232 68608 955904 1076736 1363456 -64512 896512 1532928
5334 1532928 744960 112640 154624 974848 982528 571392 871936 358912 310272 -46080
5323 1733120 601088 812544 181248 713728 608256 749568 -180736 111616 936448 440320
5312 845312 644608 504832 -551936 1224192 652800 584704 371712 30208 664064 1192448
5302 1192448 148992 -101888 1315328 776704 928256 1647104 807936 833024 353792 521728
5292 521728 1005056 -349184 429056 1098752 1418240 715264 1387520 -99840 -453120 1156096
5281 657408 669696 1162240 815104 735232 0 305152 355840 1184256 1014272 -778240 243712
5269 531968 1368064 1640960 1335808 587776 659456 1806848 1382400 454656 800768 1279488
5259 1279488 379904 1189376 1031168 2041856 794112 586240 1195520 1602560 -130048
5249 345088 918528 289280 1348608 1284608 603136 2327552 963584 631808 1196544 420352
5238 1902080 930816 245248 1417728 1473024 972800 1444864 965120 1297408 1112576 407040
5227 1382912 75776 321536 1165312 1671680 -132096 414208 1293312 1226240 553984 854528
5217 854528 629248 1452032 84992 1602048 678912 2010112 -48128 1781248 894976 457728
5207 457728 612864 526848 1182208 1553920 885760 1938944 -498176 814080 706560 1812992
5197 1812992 -71680 1462784 937472 673792 876032 2191872 1713664 1610240 1316352
5188 1316352 1845760 1142784 1065984 687104 838656 1345024 1352704 611328 1195008 1645568
5178 1645568 1013248 562176 -82432 933888 -71680 415744 1438208 1027584 925184 596992
5168 596992 486400 824320 508928 1049088 541696 514560 1782784 499200 93184 1605632
5158 1605632 1548800 1310720 1665536 1692160 1145344 546816 1853440 1734144 1487360 2152448
5148 2152448 1228800 1727488 2849792 2255872 2637824 2483712 3334656 2119680 878080
5138 1252352 1123328 1024000 540672 252928 444416 958976 1274880 1471488 1216000 899072
5128 899072 751616 559616 1632768 414720 156160 503296 -96768 1392128 1785856 540160
5117 233984 982016 774656 1370112 2506752 1788928 1073152 316928 1136128 791040 1261056
5107 1261056 1600512 943104 835584 1200128 603136 790528 1059840 121344 1577472
5098 1577472 215552 1465856 358912 691712 1452544 893440 813056 980992 1205760 2228224
5088 2228224 1138688 1353216 1293312 987136 1480704 1353216 600064 776704 1975296
5079 1975296 731648 1083904 186368 1549312 871424 726528 1566208 1013760 1460224
5070 1460224 291840 1209344 195072 1579520 617984 1243136 932352 720384 1239552
5061 1239552 -55808 674816 332800 357376 1567744 1580032 832000 193536 1819136 1631744
5051 1631744 974336 1351680 1036800 1334784 500224 1883648 1577984 1753088 1095168
5042 1095168 1453056 1556480 631808 873472 1211904 1551360 779776 681472 361984 1341440
5032 1341440 1042432 1333760 2093056 410624 1465344 410112 1596928 469504 550912
5023 550912 1144320 1164288 443392 1520640 781312 1586176 1629184 1831936 1233920 1054208
5013 1054208 877056 797184 2142720 1100800 804352 1374720 699392 335872 905216
5004 905216 1400832 1139712 1465344 156672 998400 1368064 1373696 1450496 559104 1676288
4994 1676288 1534464 562176 570880 963072 1265152 2021888 1346560 612352 1200640 994304
4984 994304 387072 908288 2005504 2053632 2104320 2028032 141824 1452544 1430528 686080
4973 1520640 2545152 2157568 1623552 1473536 186880 1665536 308736 1828352 950784
4964 950784 637952 1200128 740864 881152 1529856 917504 349696 1104896 1225728 1245696
4954 1245696 360960 1655808 1205248 656384 -16896 1265152 1774592 1940992 581632
4944 1124352 1722880 1136640 2464256 -538112 540672 1474560 1375232 2045952 1252352 2155520
4934 2155520 610816 887296 492032 1797632 1398784 1925120 1696768 840192 1234944
4925 1234944 942080 626688 389120 122880 746496 1362944 2113024 997888 1053184 1610240
4915 1610240 1822208 956928 481280 1173504 880640 1082368 2476544 449024 1402880
4906 1402880 1132544 1156096 1618944 1656320 1108480 825344 1601536 1517568 2113536 1750528
4896 1750528 1341440 1305088 2126336 1764352 2260992 3093504 3379712 2436608 2721792 3795968
4886 3795968 2810368 3876864 5179904 4860928 5777920 6316544 5023744 6053376 4976640
4877 4976640 4643328 3309568 2285056 2396672 1833984 2608640 2049536 1519616 940032
4868 940032 935936 1531392 1496064 967168 1745408 1461248 1666560 1195008 926208 1078272
4858 1078272 1928704 1775104 1108992 1204224 1793536 565760 855552 1669120 1588224 410624
4847 1658368 895488 1265664 2713088 1245184 2397184 1312256 1677824 1674752 1336320
4838 1336320 1733632 1095680 297472 1230848 1363968 1424896 566272 472576 -357888 1553920
4827 1909248 375808 1726976 1121792 2291200 600064 845312 1994240 1243136 2079232
4818 2079232 1180672 1222144 1018368 819712 1055744 1334784 1588736 1825280 1852928 1307136
4808 1307136 1430528 2240512 1348608 643584 1284096 405504 1716736 1186304 873472
4799 873472 1736192 2260480 1078272 914432 1064960 1202688 1467392 2338816 1133568
4789 1286144 1333760 1063424 1038336 1050624 888320 1125376 1343488 1570816 1806848 958976
4779 958976 1349632 1455104 1038848 982528 1633280 1010176 -134144 1391104 1336320 1449472
4769 1449472 619008 1126912 1026048 1627648 2061312 1662976 1758208 1743360 1060352 2049024
4759 2049024 1452032 280064 1177088 1009664 1159168 1567744 153600 1811968 1503744
4750 1503744 529408 901632 1754112 1132544 2124800 1013760 1016320 632832 1349120 867328
4740 867328 1214464 1573376 1812992 1280512 1384448 2462208 1275904 1460224 1368064 2039808
4730 2039808 1276416 279040 1616384 699392 1572864 1788928 2609152 1634304 1718784 1175552
4720 1175552 1813504 2538496 2043904 2075136 1414656 750080 1427456 2511360 891904 1037312
4710 1037312 1900032 2728448 2294272 1990144 1639936 2047488 2313728 1609728 1003520 1333760
4700 1333760 2181632 2926592 1773568 3107328 2140160 1148928 2224640 1664512 1682432
4691 1682432 2691072 1111552 1354240 1596928 1064448 1338368 2534912 2162176 512000
4681 492544 1696256 1516544 1726464 1915392 965632 1263616 485888 1836032 1719296
4672 1719296 1022976 1200640 2123264 2324480 2882560 2030080 2078208 1997824 1968640 1159168
4662 1159168 1851904 885760 1605632 1032704 1650176 1762816 1818112 694784 1971200 1850368
4652 1850368 1307136 1213952 1141248 829440 2053120 1057792 1680384 1676288 2578944 2420224
4642 2420224 1487360 774656 2531840 817152 1232384 3177472 1694208 1362432 790016
4633 790016 2314752 1784320 1967616 1616896 2834432 536064 2201088 1663488 2698752
4624 2698752 1742848 2661888 2534400 1842688 1360896 3361280 2204160 1952768 1586176
4615 1586176 2366464 2576384 1851392 1142784 1814016 2792960 2335744 3113984 2421760 2264576
4605 2264576 1503232 1798656 1178624 1085440 2317312 1745408 2736640 1413632 1505280 1096704
4595 1096704 1437696 2447360 1987584 1207296 1778688 2917376 2868736 1677824 3277824
4586 3277824 2983936 2427904 3317760 3371008 3629568 4081152 2878976 3410944 1841152
4577 1841152 3441152 4197376 2837504 2500096 2959360 1498624 2599424 2004992 2987008
4568 2987008 2565120 2415616 2174976 1576448 2269184 1507840 2488832 1258496 1342464 2025472
4558 2025472 2087936 897536 1249280 1660928 1291264 2241024 1797632 1618432 749056 1394176
4548 1394176 1012736 1734144 2006016 2180096 1579008 2076672 2127872 920064 2027520 1341952
4538 1341952 2062848 2529792 1874432 1805824 1936384 922624 1298944 1233408 1921024 1626112
4528 1626112 1656320 1316352 2192896 2289152 1672192 2243584 1412096 1463808 2184192 1423360
4518 1423360 804352 1617920 1883648 1822208 2095616 1235968 2183680 2278400 1979904 856576
4507 3330560 885760 1814528 757248 2524672 1306112 1884672 1415680 1801728 2376704
4498 2376704 3127808 2464256 1544704 1735168 2476032 1920000 2778624 2547200 2609664 2447872
4488 2447872 3852288 3292160 2467840 2917376 3044352 1665536 2711040 4557824 1432064
4478 3571712 3324416 2313728 2832896 3036672 3355136 1969664 2902016 2092032 1991168
4469 1991168 1588736 2371072 1696256 1694208 1436672 3084800 2115072 2292224 3068928 2189824
4459 2189824 2850816 2404352 1875968 1772544 2166272 2521600 2268672 1821184 1504768 1180672
4449 1180672 1486848 1743360 2163712 1673216 2302464 2025984 2526720 2226176 1471488 2082304
4439 2082304 1758208 3036672 1876480 1560576 1739264 2656256 2169344 1135616 2226176
4430 2226176 2421248 2107904 2646528 2269184 1661440 2088448 2341888 2716160 2233856 2899968
4420 2899968 2737152 2051072 2799104 2372096 2305536 2071552 3003904 2549248 1789952 3020800
4410 3020800 1882624 2186752 2055680 2225664 1370112 2446848 1101312 1439744 1867264
4401 1867264 1702400 1208320 1530880 2149888 1614848 2766336 2437632 1935872 2753024
4392 2753024 2095104 2302464 2974720 1626112 2672640 1930240 1655808 1714688 2691072
4383 2691072 2266112 2214400 2109440 2120704 3268096 2932224 2408448 2249728 2416640 2771456
4373 2771456 2656768 3287552 3313664 3441152 3082752 2964480 3776000 2197504 3123200 3260416
4363 3260416 1785856 1662976 3220992 2135040 2412032 1454080 2449920 2248704 2565120
4354 2565120 2126848 939008 2344960 262656 2984960 2522624 2438144 1952768 2565120
4345 2565120 2337792 3042816 1585664 1289216 2681856 1464320 2683904 2565632 1737216
4336 1737216 2385408 2112512 1897472 2021376 2287616 2309632 3094528 2911744 1654784 1942528
4326 1942528 2157568 1659904 2687488 2003456 3646976 2375680 2918912 1991168 2940928
4317 2940928 3992576 3217408 1582080 858112 2282496 1299456 2068480 1617920 1918464
4308 1918464 1826304 2078720 1456128 1460224 1654784 2169344 2923520 1549312 1758208 1395200
4298 1395200 1576960 1764864 2039296 1658368 1757696 2160128 2292736 2024960 2330112 1882624
4288 1882624 1841664 1463296 2946560 2929664 2460160 2241024 1502720 2667520 2573312 1046016
4277 1916928 1437696 2163712 2761728 1831936 2902528 2291200 1893888 2459136 2284032
4268 2284032 1780224 2109952 2046464 2345984 2865664 2344448 1820672 2439168 1657344 1711104
4258 1711104 1897984 2415104 2272256 2641920 1758720 1420288 1683968 2223104 1824256 1847808
4248 1847808 1871360 2484224 2709504 582144 1289216 1729536 1758208 2497536 1385984 1046528
4238 1046528 2143232 1699328 1890816 1962496 1815552 2109952 2071552 1038848 1896960 1716736
4228 1716736 3223552 2200576 1927168 2295296 2046464 3168768 2772992 1269248 627200
4218 2370048 3017216 2011136 1622016 1172480 1017344 2496000 1630208 2684928 2520576
4209 2520576 1732096 2744320 1912320 2207232 2360320 2451456 2408448 1658368 3227648 2737152
4199 2737152 2930688 3022336 1960448 2898432 2259456 1864704 1715712 2170880 1791488 2496512
4189 2496512 3615232 1547776 2360832 2402816 2901504 2320384 2578944 2197504 2557440
4180 2557440 2855936 2747904 2643456 1351168 2430976 2289664 1585664 1703936 2782208
4171 2782208 3453440 2198016 2266624 3656192 2820096 1882112 2480128 2850304 2539008
4162 2539008 3172864 3260928 3490304 2908672 2535424 2161664 3732480 4073472 3502080 3270144
4152 3270144 2856448 3540480 2451456 3891200 4214272 4071424 4762624 4313088 4384256
4143 4384256 4214784 3788800 4582912 3855872 3909120 4560896 5067776 2822656 3097088 2332672
4133 2332672 1771008 2989568 2905088 3457536 2763776 3134464 2939392 3486720 3543552 3221504
4123 3221504 2827776 2575360 3214848 2110464 2270720 2783744 1910272 2369536 2375680 3491840
4113 3491840 2841088 3015168 1818112 2319872 2669056 2173952 2606592 2458112 2715136
4104 2715136 3328000 2530304 3426304 3101696 3292672 2410496 1625600 2495488 9681920
4095 9681920 2655744 2224128 2446336 2963456 3081216 2574336 1724928 2444800 2925056
4086 2925056 2524672 2946560 3070464 3058688 3311104 2834944 2229248 3256832 3662336 3424768
4076 3424768 3063296 4717056 4660224 3604992 3927552 2165248 3573248 4623872 3908608
4067 3908608 3909632 3673088 3703808 3575808 3846144 4494336 3055616 3867648 3294208 3714560
4057 3714560 3184128 3630080 3366912 3460608 2944000 3172864 2516480 2837504 3311104 2580480
4047 2580480 3643392 3375104 2085376 1680896 1870336 2216960 1342464 1561088 942080
4038 942080 2587136 1513472 1330688 1974272 2009600 2583552 2308096 2243072 2324992 3284992
4028 3284992 2020864 1425408 1677312 1995264 2862592 2954752 886784 1439744 2660352
4019 2660352 1719296 1848320 2428928 1885696 2515456 925696 2014208 1764352 1115136
4010 1115136 1716224 1840128 1807360 2490880 2407936 1486336 1726464 2114560 2697728 2424320
4000 2424320 1764352 3314688 2699776 2490368 2450944 1799680 2817024 2713600 2810368 3161600
3990 3161600 3085824 2477568 1711104 2016768 1460736 2138112 3180032 3043840 3398656 2835456
3980 2835456 2574848 2464256 3133440 1845760 4182016 2930688 2916864 3099136 3070464
3971 3070464 3322368 2769920 1250304 2388992 2168832 2298368 2600448 4301824 3977728
3962 3977728 3290112 3005440 3863040 4332032 3515392 3672576 3463680 3074560 3929088 3902976
3952 3902976 3421696 3925504 4070400 3632128 4809728 4237312 2333696 3317248 2992128
3943 2992128 3959808 4416512 4173824 4019712 4756992 4064256 3705344 3699712 5204992 4242432
3933 4242432 4957184 4046336 3579392 4461568 4110848 4083712 3965952 3672576 4297728 5008384
3923 5008384 3972096 4304384 4641280 4781568 5239808 5442048 4781568 5604352 5251584
3914 5251584 5336576 4955136 5877760 6801408 5484032 6783488 6141952 6800896 7057408
3905 7057408 7148544 6249984 6856704 8412672 6390272 6978560 6316544 6799872 6583808
3896 6583808 7123456 6249472 8123392 6965760 8239104 8327168 8365056 7905792 8203776
3887 8203776 8691712 6562816 6801408 4976640 4699136 3880960 5029376 3968000 2958336
3878 2958336 3508224 4723712 3684352 4305408 3540480 3343360 3435520 3343872 2436096 3240960
3868 3240960 3116032 3551232 4102144 3163136 3953664 3217408 3520000 3422208 4136448 3176448
3858 3176448 2677248 2737152 3257856 3051008 3379712 2772992 2920960 2900992 2760192 3075072
3848 3075072 3963904 3312128 3807232 3219968 4852736 3197440 3516928 3362304 3413504
3839 3413504 3497984 3611648 3745792 2818048 2723328 4579840 3753472 4152832 2809344 3912704
3829 3912704 4049920 3136512 3122688 3498496 2766336 2892800 3429376 3536384 3045376 3088384
3819 3088384 3054080 3681280 4220416 3275776 3869184 3901440 2811904 3375616 3907072 3018240
3809 3018240 3099648 3337728 4251648 3021312 3101696 4216320 4246528 2753536 4296704
3800 4296704 3513856 3303424 3356160 3590656 4075008 3394048 2245632 3074560 3338240 2873856
3790 2873856 4079616 4133376 3342848 3885568 3553792 3820032 2262016 3727360 4200448
3781 4200448 4156416 3766784 3644928 3720192 3014144 3680768 2914816 3235328 3663360 3973632
3771 3973632 4446208 4601344 3822080 3306496 4947456 3618816 3795968 3785216 3744256 3079680
3761 3079680 4237824 3135488 3491328 3407872 3784704 4002816 3598336 4602368 3904000
3752 3904000 4549632 3620352 4225024 4042240 3451904 3502080 4118016 3203072 2812416 4157952
3742 4157952 5893120 4421632 4286976 4164608 4540928 4099072 5094400 4797952 4907008
3733 4907008 3761152 3246080 4111360 4653568 4672512 3342336 5407744 5435904 5421056 5025792
3723 5025792 4448256 4868096 4775936 6110720 4295680 5739520 5711360 5399552 3991552
3714 3991552 4367872 5172224 4824576 4255232 4057088 4177408 4472832 5356544 4835328 6150656
3704 6150656 6217728 5172736 6345216 6021120 6660608 5966848 5129728 6046208 6123008 6905856
3694 6905856 5696512 5629440 6901248 5865984 7575552 8637440 6305792 8265216 7449600
3685 7449600 8156160 7582208 8683520 8607232 9166336 7954944 9866240 9297408 9214464
3676 9214464 10381312 10179584 10622464 11408384 11895296 12414976 10763776 11091968 11408384
3667 11408384 10915328 11218432 11771392 12757504 13063680 13164032 14030848 15452160 15780352
3658 15780352 15987200 16898048 17738752 16728064 17843712 18360320 18679296 19390976 19457536
3649 19457536 19642368 20197888 21267968 22889472 23805952 25682432 26043904 28483584 28592128
3640 28592128 28897280 28120064 27995136 26940416 26950656 25893888 25802752 23156736 21039616
3631 21039616 19462656 17903104 16587264 15279616 11558400 12128768 11308544 11481600 10839040
3622 10839040 10806784 10324992 9642496 10084352 8964096 8982016 8724992 9142272 8712704 10076160
3612 10076160 9654784 9108480 10019328 8888320 9074176 8532992 8466944 8033792 7341568
3603 7341568 6625280 7322624 6619136 6913024 6618112 6314496 5926912 7385600 6907392
3594 6907392 6094848 7948288 6710272 6289920 7381504 6698496 6899712 6691328 7376896
3585 7376896 7056384 7368192 6500864 6501376 6846976 7342592 7418368 6088192 6484992 7611904
3575 7611904 7627264 7224320 8046080 6163456 6962688 6859264 6298112 7318016 6705152
3566 6705152 6883328 7156224 6863360 6880256 6307328 7613952 6559744 7201280 6396928
3557 6396928 6364672 6489088 6559744 7034880 7622144 7114240 6633472 8047616 7889920 7523840
3547 7523840 7728128 7241728 6941696 7367680 6859264 6690304 7251456 7663616 6594048
3538 6594048 7925248 7161344 6014464 6738432 5592576 6625280 6724096 7890944 7619072
3529 7619072 7556608 7336448 6459392 8273920 7288320 8230912 8369152 7913472 6920192 7691264
3519 7691264 8270848 8803328 7757312 8324608 7429632 8527360 7456768 8923648 9084928
3510 9084928 7226880 7956992 9480704 8314880 8229376 9060864 8743424 9241600 9392128
3501 9392128 9128960 9329152 8495616 8906752 8489984 9169408 9529344 9379840 9908224 10100736
3491 10100736 9715200 9748480 9873408 9698816 10346496 10194432 10673664 11456512 11022336 10932736
3481 10932736 10375680 10765312 11003904 11618304 10739712 11214848 11771904 10215424 13073408
3472 13073408 12047360 12955136 13429248 12694528 12679680 12772352 12472832 13043712 12882432 11923456
3462 11923456 11934208 11636736 13515264 13212672 12793344 12915712 12342784 11790336 10567168
3453 10567168 11436032 12214784 11173376 10870272 12086784 12563456 13600256 13668352 14424576
3444 14424576 15648256 16107520 16534528 17336320 17100288 18548736 18491904 19262464 20027904
3435 20027904 19892736 21020160 21597184 22707200 24147456 25168384 26615808 26916864 27731968
3426 27731968 29426688 29477376 31962112 33078784 34620416 36685312 36609536 37553664 40346624
3417 40346624 42384384 44823040 46276096 48142848 52163584 54663168 57841664 61916160
3409 61916160 67425792 71492096 75364864 82146816 88332288 94721536 101460992 108315648
3401 108315648 115042816 123339264 132429312 141602304 152254464 163300864 177077760 190993408
3393 190993408 208634880 228387840 252270080 280715264 315489792 356737536 415827456
3386 415827456 496814592 611432960 764902912 943918080 1085133824 1112872448 1013916672
3379 1013916672 835912704 643480064 477311488 351900160 262834688 201277440
3373 201277440 159303680 128850944 107237376 91146752 78772224 68921856 62825984
3366 62825984 56597504 50600960 48013824 44595200 42346496 40224768 37971456 35186176
3358 35186176 33631232 32213504 31716864 28366848 29080576 26704384 25966080 25492480 23184896
3349 23184896 22860800 21603328 20688896 18984448 19649024 18699264 19694592 18335744 17927680
3340 17927680 18112512 18260480 17898496 17338368 16757248 17340928 16981504 15286784 15874560
3331 15874560 15425024 15589888 14414336 14822912 14545408 14280704 14656512 14998528 13122048
3322 13122048 15068160 14114304 13455872 14370304 14069248 13816320 13375488 13544960 13563904
3313 13563904 13171200 12586496 12407808 10979840 10572288 11560960 10350592 11258368 10048512
3304 10048512 9431040 6865920 6366720 7022592 4907520 6424576 6067200 4795904 6987776
3295 6987776 6257664 4833280 4686848 4608512 5500416 5771776 5149184 5872128 5374976 5225984
3285 5225984 5895168 4912128 5517312 5646336 6508032 6019584 5108736 5983232 4843008
3276 4843008 6018048 4681216 4541440 4647424 4688896 4320768 5350912 5023232 5615104
3267 5615104 5023232 4208128 4548608 4551680 3532800 4118528 4919296 4920320 5126144 4956160
3257 4956160 6029312 4898816 4829696 3868160 4328448 4643840 5057024 5133312 4687872 5178880
3247 5178880 4967424 4535808 4964352 4225536 4617216 5213184 4391424 3289600 4718080
3238 4718080 4572160 3873792 4682240 4249088 5041152 4446720 4112384 4435456 4688384 5617664
3228 5617664 5386240 5019136 5305856 4694528 5558272 4366848 5886464 4653568 4162048
3219 4162048 4350464 3341312 3357184 4559872 4690944 4948480 3717632 4231168 5017088
3210 5017088 5134336 4794880 4583424 5651968 4001792 4633088 4440576 4830208 5537792
3201 5537792 4830208 4242944 6596608 6627328 7227904 7299584 8794112 9593856 9325056 10274816
3191 10274816 11204096 10818560 11362816 10426368 9932800 8804352 8301568 7625728 8876032
3182 8876032 8332288 6892032 8899584 8258048 9156096 8941056 8480768 9866752 9154048
3173 9154048 8510464 8609280 8630272 9373696 9678336 8609280 10125312 8458752 9264640
3164 9264640 9848320 10268160 10122752 10696704 10549760 11886592 10853888 12782592 13586432
3155 13586432 14595072 13643776 15215616 16721408 16853504 17886720 18208256 19034112 19180032
3146 19180032 19319808 21463040 20584448 21076480 21611520 21067264 22094848 21677056 21922304
3137 21922304 21702144 21778944 22466048 23019520 23587840 24523776 24918528 23773184 24845824
3128 24845824 25305088 25084928 23598080 20726272 20112896 17399296 15307776 12862464 12767232
3119 12767232 11299840 12319232 11686912 10250752 11531776 12582400 12086272 11050496
3111 11050496 11476992 10298880 10664448 10971648 10399744 9847808 10529280 8936960 9646080
3102 9646080 8035328 10295808 8270336 8639488 8740352 8023552 7855616 7114752 6433280
3093 6433280 6179328 7213568 5745152 5976576 5933568 4651520 4013056 5635584 4014592
3084 4014592 4493312 5306368 4776960 4628992 5113344 4754944 4709376 3886080 5108224 4794368
3074 4794368 4728832 5416960 5220864 4748288 5385216 4822528 5044736 5040640 6049792 5769216
3064 5769216 5180416 5270528 5018624 5876736 5126656 3762688 4413952 5007872 4288512 4694016
3054 4694016 3537920 4338688 4040192 4094976 3374080 4488704 4230144 4382720 3479040
3045 3479040 4052480 4622848 5466624 3760640 4376064 5566464 3972608 4754432 4490752
3036 4490752 3148800 3806208 4555264 3918336 3989504 4861440 5465600 4230144 4604928
3027 4604928 4825600 4369408 5103104 5412864 4819968 5235712 5815808 4973568 4584960 5133824
3017 5133824 5040640 4286976 3913728 4644864 3756544 4457472 3609600 3795968 4062208 3315712
3007 3315712 4218368 4435456 3463680 3526656 3642368 4470784 3495424 3944960 4792320 3369984
2997 3369984 4151808 3047424 3962368 3025920 3472384 3940352 4080128 4402688 3561472
2988 3561472 4295168 4606976 3761664 3727872 3632640 4029440 4239360 4432896 4971520 4206592
2978 4206592 5455872 4551168 5207040 5362176 6098432 6906880 7280640 6673408 7980032
2969 7980032 8329216 10605056 13399040 19653632 22730752 22103040 22176256 23184896 20371456
2960 20371456 15934464 11667456 7844864 6087168 5032448 4465152 4109824 3849216 3345920
2951 3345920 3387904 3718144 3420160 3543552 2998784 3868160 2455552 3500032 3118592
2942 3118592 3547136 3202560 4071424 3259392 3590656 2835968 3124224 3508736 3423232 3786752
2932 3786752 3032576 3024896 4541952 5051392 3546624 3062784 3476992 3096576 4678656
2923 4678656 3587584 2931712 3825664 3312640 3042304 4060672 3313664 4367872 2987520
2914 2987520 3973632 3592704 4197888 4766208 5067264 5142528 4557824 5243392 4634624 4457472
2904 4457472 4633088 3493888 4787712 3929600 4600832 4640768 4537856 4597760 4162048 4066816
2894 4066816 4263936 5139456 4418560 4896256 4403712 5066752 3975680 4420096 4720640
2885 4720640 3787776 4346368 3747328 3072512 5017600 5316608 4172800 4871168 5421056
2876 5421056 6064128 5753344 7428096 6448640 6730752 5541888 6318080 5338112 5745152
2867 5745152 5189120 4942336 4254208 4924416 5703168 4291072 3647488 4487168 3831296
2858 3831296 4259840 3754496 4317696 3729920 4045824 3602432 5157376 4467712 4189184
2849 4189184 3915264 3791872 5921280 4749824 4486656 4536832 4509184 3989504 4786176 3974656
2839 3974656 3589120 4132352 3822592 4270592 4310016 5172736 4047872 3741696 4970496
2830 4970496 3962368 3770368 4540928 3767808 4285952 2960896 4580864 4469760 3582976
2821 3582976 4120576 3298304 3116032 4314624 4053504 3417600 3881472 3905024 3323392 3387904
2811 3387904 4016128 3409408 3262976 2967040 4222464 3975680 3092480 3529728 3920384
2802 3920384 4014080 3310592 4133376 3124224 4031488 4503552 4428288 4192768 4514816 4641792
2792 4641792 4337152 4054528 4516864 4646400 3382272 4514304 3848192 3213312 3545088
2783 3545088 3692032 4292096 4168704 3975168 3483648 3454976 3587072 4348928 3704320 4264960
2773 4264960 3728896 3431424 4149760 4610048 5472768 4606976 4611584 4813312 5112320 4229120
2763 4229120 5108736 5133312 4684288 5067776 4638720 4967424 5456896 5627904 6516736 6535680
2753 6535680 6738944 6362112 7929856 9439744 11180032 14940160 24215552 34527744
2745 34527744 29812736 24214528 15801856 11226624 7030784 5050880 4859392 5034496
2737 5034496 5910016 4391424 3827712 4370432 4265984 3636736 3761664 4118528 1778176
2727 3875328 4131840 3660800 4236800 3637248 3624960 4098048 4350464 3230208 4433920
2718 4433920 2619392 4019200 3152384 2944512 3157504 3228160 3750912 2920448 2834944 4218880
2708 4218880 3022336 4025344 4090368 3598848 3956224 3245568 3679232 2947584 2868224 3386880
2698 3386880 3012096 3418112 3346944 3460096 2679808 3307520 4184064 3205120 3053056 3679232
2688 3679232 2023424 3893248 3459072 3912704 3358720 4176384 4561408 4748800 4456960
2679 4456960 5028352 4396544 5228544 5026816 5864960 4740096 5602816 4823040 6419968
2670 6419968 5595136 6672896 7107584 6503936 6710272 7784448 8475648 9490944 9982976
2661 9982976 9839616 12616192 16462848 22956544 36840960 46882304 42854400 35047936
2653 35047936 24452096 18121216 14265344 12700160 13829120 17487872 25629696 31846912
2645 31846912 29467648 22921728 19246592 14897152 14571008 16954880 21373952 33969664
2637 33969664 42942464 37014528 28680704 20551680 15124480 11911168 12880896 15800832
2629 15800832 25182208 29637120 25504768 19767296 14028288 10541568 8157696 9298432
2621 9298432 9687552 13361664 17360384 13328896 12140544 8798720 6608896 5222912
2613 5222912 4066816 4405248 3532288 3596800 3545088 3093504 4651008 3303936 2966528
2604 2966528 3160064 4419584 3672064 3995136 4101632 4953600 4891136 5688832 6432768 5991424
2594 5991424 6118912 5311488 5202944 5149184 5565440 4619264 4743168 3758080 3694592 3272704
2584 3272704 3152896 3995136 2385920 2573312 1875456 2698240 2639360 3436032 1274368
2574 2951168 1568256 2266624 2557952 2603520 2715648 2612736 2562560 1953792 1802752 2036736
2564 2036736 2237952 1829888 1521152 2106368 2051584 1663488 1162240 2398720 1815040 1864192
2554 1864192 2157568 1566208 1427456 675840 2058240 2197504 1381376 1867264 2246144
2545 2246144 2254336 2519040 2710528 1795584 2522112 2001408 1642496 1497600 3449856 2151936
2535 2151936 1789440 1850880 1737728 1049600 1176576 1294336 1820672 1389056 1713664 1273344
2525 1273344 1672704 1012736 1861120 1453568 1827328 2191360 2100224 2200576 1194496 2883072
2515 2883072 2617344 2200064 902144 2209792 1038848 1404416 1224192 1129472 1296896
2506 1296896 2646528 849920 2753024 1766912 2611712 2794496 2633216 2144768 1192448
2497 1192448 2136576 1006080 1611264 2009600 2120704 2104320 2344960 2149888 2092032 2265088
2487 2265088 1763840 1713152 2220544 2263552 899584 1282560 1319936 1716224 2649088 694272
2476 2611712 2262528 1948160 1316864 1201664 2744832 2597888 1915392 2255872 2061312
2467 2061312 1793024 2234368 1924608 683008 1803776 1974784 2750464 2732544 1355264
2457 3058176 1713664 1958912 2235904 1766400 1010176 2355200 1411584 2675200 1773056
2448 1773056 3097600 1404928 3064832 1982464 2931200 1807872 2598912 2615296 2575360
2439 2575360 2385920 1087488 2030080 2649600 1818112 2541568 2418176 2452480 3172352 1734656
2429 1734656 1801216 3326976 2657280 2916352 2443776 3589632 2625024 2052096 3067904
2420 3067904 2940416 3318272 3287552 2613760 3085312 3236352 3593728 2815488 3804672 3057152
2410 3057152 3691008 3800064 4636160 4207104 4073984 4408320 4450304 4499456 4688384 4810752
2400 4810752 5204992 4973056 3941376 4892160 3691520 4275712 3742208 4419584 3712000
2391 3712000 4759552 3802112 3984384 5025280 4130816 4301824 3949056 4015616 3490816
2382 3490816 4204032 3611648 4347904 3775488 5273088 4313600 4015616 4289024 4606976
2373 4606976 4648448 5662208 4602368 4818432 4909056 4665344 4226048 3197952 3640320
2364 3640320 3045376 5098496 3835392 4373504 4814848 3186688 3491840 4052480 3435008
2355 3435008 3355648 2909696 4838400 3301888 3208192 2231808 2247168 3620352 3390464 4269568
2345 4269568 4439040 3987456 3623424 3331584 4225024 4021760 4020224 3218944 2952704 3152384
2335 3152384 3870720 3474432 3110912 3143680 2759680 3639296 2372608 3351552 2293760
2326 2293760 3281920 3550208 2838016 1147904 2806272 3069952 2900992 3115008 3380224
2317 3380224 4421632 3195392 3231232 2729984 2647552 2856448 3096576 2916352 3708416 3320832
2307 3320832 2242048 3388928 3969536 3133952 3543552 3224064 2938368 3169280 3729920
2298 3729920 3393536 4455936 3173888 2554368 4649984 3840512 4131328 3419136 2831360
2289 2831360 4121600 3005440 3534848 2907136 2982912 2951168 3445248 3105280 4192768
2280 4192768 2951168 3189248 3070976 3012608 2526208 2962944 3610624 2892288 3743232 3348992
2270 3348992 3972608 3703296 4060672 4133376 3555840 4043264 3830272 4127744 4163072 4110336
2260 4110336 4518400 3511808 3295744 3857920 3410432 3282432 3657216 4158976 2706432
2251 2706432 4080640 3511296 4674560 4410880 2782208 3841024 3422720 3955712 3727360
2242 3727360 4004352 4009472 3724288 4709376 4145152 3497984 4278784 3879936 3566080 2904064
2232 2904064 2970624 2534912 3364352 4266496 3506176 2834944 3406336 3684352 3103744 3236352
2222 3236352 4001792 3785728 4115968 3974144 4766720 4553728 4281344 4219904 4523008 4597760
2212 4597760 4336128 4144128 4828672 5011456 4274688 4630528 4718592 4803584 3808768 4368896
2202 4368896 5578752 4293632 5555712 4852736 5997056 5477376 5271040 5354496 5246976
2193 5246976 5478912 6017536 5916672 5881856 6458368 6891008 6195200 5089280 5489664 5746688
2183 5746688 6678016 6624256 7501312 6387712 7832064 7325696 7622144 8973312 8695808
2174 8695808 7195136 7449088 7627776 7406592 6584320 7603712 7880192 7554048 7357952
2165 7357952 6623232 7157760 8331264 7878656 8510464 7284224 7655424 8047616 7058944
2156 7058944 8064000 8104960 7952384 8126976 7299072 8065024 8185856 7697920 7663104 7079936
2146 7079936 7591424 7186944 7112704 7586816 7700480 6757376 7424512 7121408 7851008 7687680
2136 7687680 5875200 6585344 7229440 6404096 6437376 6107136 7154688 7516672 7115264
2127 7115264 6580224 6321664 7330816 7681024 6268928 7452160 7252992 7045120 6383616
2118 6383616 6620672 5537280 6825984 6942208 7284224 5797888 5822976 5518336 5544960
2109 5544960 6249984 5793792 5178368 5815808 6333952 5312000 5399552 5849088 5199360 5316608
2099 5316608 6683136 4823040 5725184 4759552 5072896 5280768 4938752 5219328 6988288
2090 6988288 5816320 6096384 6203392 6737408 6404608 6501888 6380032 5792256 5897728 7159296
2080 7159296 6320640 6924800 6123008 6682112 7290368 6532608 6967808 6651392 7312384 6567424
2070 6567424 7715840 7282688 6906880 7463936 7308288 8019456 6664704 6112256 8510464
2061 8510464 7706112 7989248 7057408 7661568 8476672 8603136 8287744 8416256 8482816 8743936
2051 8743936 7771136 7983616 9170944 9160192 8877568 8788992 9386496 8721408 9732096 9731072
2041 9731072 9820672 9622016 8892928 9426432 10556416 10096640 9415168 10719232 9650176
2032 9650176 9670144 10559488 10782208 10426368 10007552 10791936 9432064 9871360 10649600 10653696
2022 10653696 10017280 10373120 9519104 10281984 9995264 9726464 10550272 9691648 9782784 9698816
2012 9698816 9942016 10187776 10357760 10362880 11306496 10578432 10039296 10987520 10751488 10478592
2002 10478592 10284032 11442176 11888128 11048960 9973760 11760640 9235456 10162688 11070976
1993 11070976 10804736 10806784 9798144 9814528 10708992 10143744 11681280 10030592 10802688
1984 10802688 11401728 13237248 20491264 24731136 21930496 18050048 14346240 11245056
1976 11245056 9014272 8349696 8723456 6725120 7794688 7177216 7029248 8120320 7020032
1967 7020032 7424512 6809600 6837760 7172096 7740928 5542912 6847488 7093760 7140352 7060480
1957 7060480 7559680 5998080 6051328 6141952 6659584 6553088 7764992 6675456 6339584
1948 6339584 5910016 5222400 6101504 6134784 5954560 6566912 6253568 6244864 5907456 6362112
1938 6362112 6553600 6538752 5538816 6915072 7179776 7404544 6472192 6588416 6584320 6773248
1928 6773248 6305280 6987264 6630400 6032896 6391296 6776832 6548992 7541248 6798848 7635968
1918 7635968 7005696 7370752 6965248 7939584 8194048 6568960 7869440 7554560 7571968
1909 7571968 7227904 8579584 8263680 7911936 8150016 8216064 7578112 7641600 9065472 8375808
1899 8375808 8591872 8245760 8677888 8463360 9014784 9257472 8725504 8507392 8898048 8311808
1889 8311808 9030144 8519168 7310336 7340032 7455744 7858688 7614976 6860288 8126464
1880 8126464 6640640 7089152 6914048 7638528 7926272 7490048 6745600 6493696 8476160
1871 8476160 7767552 6806528 8344576 8732672 8169984 8753152 7919104 8583168 9117184
1862 9117184 8907776 8812032 9792000 10831360 10118656 9427968 10190336 8241664 8768512
1853 8768512 10199552 9763840 9566720 9982976 9452032 10339840 9752064 10166784 10548736
1844 10548736 10916352 11236864 11187200 11235840 11068928 11785728 11422208 11473408 12434944 11972096
1834 11972096 11711488 11581440 13272064 11739648 12880896 13913088 13726720 14696960 14973440
1825 14973440 14263296 14315520 14572032 14472192 14731264 14245888 14091264 13716480 13850112 14118400
1815 14118400 14795264 12451840 12987904 13613056 13024768 11920896 13480960 11692032 12036096
1806 12036096 13039616 13052928 12783104 12896768 12557312 11926016 13179904 12435456 12518400
1797 12518400 12769792 11760128 12577280 12165120 13124096 12754432 12391424 12136448 12025856
1788 12025856 12183552 10773504 12343296 12376064 11663872 11409920 12301824 11851776 11828224
1779 11828224 11102720 10532352 11746304 10293248 11523072 9346560 9056256 8943616 9271808
1770 9271808 9616896 9335296 8728064 9631232 9281536 8888832 8099328 9201152 8742400
1761 8742400 8380928 9603584 8032256 9317888 8529920 9003008 8157696 9169408 8025088
1752 8025088 8535552 8160256 8623616 7123456 8459776 8633344 8389632 7600640 7643136
1743 7643136 8148992 8056320 8877568 8690176 7420928 8076288 8340992 8422400 7628288 8014336
1733 8014336 7848960 8484864 8712704 7704576 8483328 9068544 7989248 8667136 9324544
1724 9324544 8693760 8368640 8847872 9849856 10397184 9416704 8624128 9296896 9612800
1715 9612800 9374208 10153984 9496576 11437568 10805248 10250240 10976768 10710016 10718208 11460608
1705 11460608 11019264 10596352 12036096 10999808 12103168 12383744 12520448 12985856 13687808
1696 13687808 15036928 14245888 14624768 15045632 15185920 14824448 16167424 16076800 16873984
1687 16873984 17761792 17316352 18172416 17887232 18653184 20633600 19752448 21440512 22677504
1678 22677504 23233536 24535552 25829888 26405888 27535872 28657152 29748736 32193536
1670 32193536 32762880 34624000 36295168 38464000 39723008 40481280 41458688 42230272 44164608
1661 44164608 44171776 44975104 47045632 47111168 47865856 49430528 49858048 51918848 55228416
1652 55228416 56500736 58867200 60377600 64892928 67870208 70157824 74953728 79642112
1644 79642112 85752832 92508160 100832256 110381056 118213120 125883904 128230400 126606848
1636 126606848 120289280 110983168 99065856 86944256 73275392 61472768 49547776
1629 49547776 41825280 35954176 30458880 26638848 24307200 22348288 20036096 20145152
1621 20145152 18654208 16482304 16386048 15845376 14558208 13682176 14843904 13551616 13254144
1612 13254144 12120576 13152256 11103744 12014592 11665920 11765760 11525120 10601984 10950144
1603 10950144 9916928 9449984 10511360 9370112 9133056 9498624 8979456 8943616 8892416
1594 8892416 8643584 8498176 9036800 8035328 9031168 6865408 7657984 7780864 7811072
1585 7811072 7624192 7888896 7290368 8460288 7380992 7384064 7456768 7055360 6541824 6652928
1575 6652928 6999040 6466048 7221760 6393344 6245376 6810624 6545408 4399616 5494272
1566 5494272 6171136 4898304 6252032 5193216 4902400 5153792 4786176 4477952 3586560
1557 3586560 4594688 4717056 4519424 4637696 4705792 4110848 4594688 4397568 5539328
1548 5539328 3598336 4045312 3969536 4080128 4677120 4310528 4467712 3961856 2916352
1539 2916352 4189184 3372544 4902400 4036096 3984384 4273664 4004864 4596736 4764160
1530 4764160 4815360 4278784 4436480 4232704 3534336 4018176 4673536 5215744 4070400 4908544
1520 4908544 5765120 3847168 5054976 4529152 4157440 4755968 5178880 6056960 3836928
1511 3836928 5658112 5670912 4926464 4959232 6175744 6477824 6189568 6302720 4794880
1502 4794880 5732864 6243840 7200768 5734912 6670848 6953472 8557056 7821312 7546368
1493 7546368 7458304 8196608 8769536 9099264 9718784 10361856 11248640 12193280 12250624 10962432
1483 10962432 10727936 10323456 10149376 10061312 9250816 10151936 8453120 9272320 10084352
1474 10084352 10064384 9172992 9098752 9292288 9620480 9200128 8939008 8546816 10037760 9262592
1464 9262592 8046592 9372672 9144320 9777664 10175488 8511488 10079232 10116096 9524736
1455 9524736 10479616 10299904 11193856 12024832 13259776 12658176 14131712 14122496 15217664
1446 15217664 15656448 15181312 14910976 14174720 13544448 11436544 11923456 10107904 9829376
1437 9829376 9392640 9303552 9499648 9626112 9866240 7791616 9137664 10054144 8506880
1428 8506880 8293888 8543232 8821760 8882688 9049600 10910208 11859456 12436992 12703744 14079488
1418 14079488 13620736 13194240 13151232 12987904 12829696 11526144 9576960 11007488 8945664
1409 8945664 9803776 9520128 8213504 7768576 8488960 8790016 7396864 6180864 7424512
1400 7424512 5937664 7098880 6744576 5838848 7437312 7017472 6725632 5127168 6402048
1391 6402048 7565824 6515712 5770240 5779968 4705280 6382592 5253120 5612032 5511680
1382 5511680 5096960 5102080 4413952 3078656 2291200 2720256 4440576 3521024 3301888 3786752
1372 3786752 2951168 2103296 2304512 2960896 3654144 3182592 1724416 2523136 2535424 2147840
1362 2147840 1861120 3366912 1324544 2023936 3172352 2441216 2513920 2790400 2204160
1353 2204160 1806848 1675264 2799104 1785344 1906688 1371648 1121792 587264 1341952
1344 1341952 1103360 518144 1742336 2096640 1031680 1185792 1798144 1548800 1378816
1335 1378816 729600 1549824 1447936 1004032 123904 -37888 1677312 1351168 592896 1449984
1325 1449984 2290688 3080704 1047040 1025024 1304064 1552384 276992 1990656 1036800
1316 1036800 1204736 760832 752128 -100864 504832 1422848 252416 1745920 1618944 1736704
1306 1736704 1119744 809984 1266688 1556480 1054208 654336 1154560 41472 927744 1266688
1296 1266688 1054720 52224 539136 1492992 1570304 1285120 1091584 416256 967168 1181696
1286 1181696 1224192 1094656 1348608 1472512 898048 1116672 638976 1602560 484352 1453568
1276 1453568 -144896 644608 1211392 1716736 -265728 -105984 1438208 1929728 770048
1266 1176576 1384448 761856 1349632 1174528 1494528 2066432 2091008 1741312 1740800 1739264 624128
1254 1680384 2468352 597504 608768 1746944 -335872 1317888 1157120 625152 926720
1245 926720 1100800 833536 1226240 848384 356352 -260096 1038336 663552 247808 1051136
1235 1051136 2187776 371712 1496064 923136 1448960 580608 806400 1418240 888320
1226 888320 886784 783872 1261568 1080832 1242112 98304 1040896 598528 591360 80384 1464320
1215 1464320 1248768 302592 692736 1220096 1639424 1230848 1777152 572416 914432 1572352
1205 1572352 1743872 3072 1139200 821248 1552896 1363968 -38912 688128 517632 1291776
1195 1291776 -271360 729600 1739264 250368 295936 532480 1590272 777216 603648
1186 603648 1693696 667136 999424 636928 1006080 1029120 1259520 1267200 717312 1165312
1176 1165312 777216 577536 1163264 1477632 466944 377856 504832 800768 807936 610304
1166 610304 595456 878592 257024 963584 1479168 1291776 1590784 307712 1201152 971776
1156 971776 -158720 1369088 174080 538624 1057280 774656 772608 706560 500736 1027072
1146 1027072 599552 526848 48640 -462848 1069056 440832 289792 683520 1713664 440320
1135 -238592 1044480 1463808 851456 -129536 594944 1567744 454144 541696 903680 474624
1125 474624 1010688 1149952 502272 1284608 360960 547328 879104 922112 902656 315904
1114 -6656 1617920 1402368 -272384 334848 104448 210944 834048 -101376 -33792 1154048
1103 -238592 801792 1678336 1185280 1521664 665600 638976 259584 750592 1221120 774144
1093 774144 1082368 601088 917504 640000 -89088 1245184 296960 800768 -308736 1281024
1082 -362496 -27136 1443328 -213504 657408 378880 -62976 663552 555008 1616896 76800
1071 -282112 55296 -400896 1337344 97792 431616 1147392 908800 237568 84480 953856
1061 953856 273408 74752 -701952 8704 1487872 756736 -3584 722432 1142272 818176
1051 818176 88064 1525760 852992 2305024 184832 235520 1316352 726528 1094656 718336
1041 718336 2331136 1622016 1263104 515584 368640 -332800 1262592 1103360 908800
1032 908800 1744896 1639936 1766912 2115072 2020864 2222592 2741760 1801216 3125760 2732544
1022 2732544 3862528 5149696 5186048 4786176 4320256 4637184 4408832 5416448 5859840
1013 5859840 6086144 6439424 7797248 8166400 9091584 10080768 12388352 18382848 25200640
1004 25200640 54755840 85380096 66483200 51173888 28302848 15220736 9797632
997 9797632 5542912 4774912 3695104 2290688 3809280 2610176 2353664 2516992 1254912
987 1873408 1616896 2566656 1584640 2615296 2862080 1806848 1158144 1256448 1414144 1326080
977 1326080 1254400 1333248 1356288 1704960 1356800 759296 379904 1226240 637440 -125952
966 763392 1035264 801280 468992 276992 436224 623104 822272 162304 1076224 855040
956 855040 631296 1831936 1232384 1313792 501248 467968 260096 498176 933376 506368
946 506368 -160768 51712 777728 723456 265728 788992 338432 1326592 1034240 463360
935 443392 1554944 567296 264192 165376 -937984 548352 515584 87552 246272 564736
925 564736 753664 750080 54784 212480 484352 412672 -552448 683008 672768 509440 623616
914 623616 1156608 1521664 -51712 832000 647168 566272 -508416 1182720 639488 447488
904 447488 883200 1245696 -86528 464384 -504832 749568 -523776 433152 -125952 323584
893 -386048 262656 29184 685568 420352 87040 1328128 431104 425472 14848 346624 346624
882 346624 748544 467456 682496 -177664 1426432 778752 708096 70144 -437248 615424
871 -199680 211968 -833536 39936 -354816 213504 -335360 970752 571904 -252928 234496
860 -274432 1483776 154112 120320 316416 -105472 199168 60928 -781824 376320 51200
849 -112128 568832 932864 -880128 546304 -811008 717824 913920 -233984 544256 973312
839 973312 120832 221696 169984 919552 -880640 307200 -429056 656896 -23552 30208
828 -665088 107520 -280064 364544 -343040 -545792 1726976 231936 -139776 -174080 -288768
818 -288768 757248 661504 1684480 935424 -173568 244736 -930816 79872 185856 -222208
807 -1139200 1253376 -293376 1446400 -671744 386048 668160 -1358336 442880 -120320
797 112640 459264 502272 1285120 599040 -15360 -32768 -561664 -36864 441856 352256 659968
786 659968 63488 108544 120320 325120 297984 1312256 531456 934400 -315904 607744
775 -93696 601088 1558016 -168960 264704 899584 630784 541184 477184 445952 477696 -1113088
763 -25600 860160 785408 1076736 650752 745984 509952 760832 -42496 1409024 636416
752 609280 1405952 1480192 99328 634368 1034752 1316352 1679872 200704 998400 485376
741 -862208 438784 -517120 -595968 337408 426496 275456 -889344 1053184 899072 -445440
730 885760 1006592 745984 379904 459264 860672 86016 188416 -374784 728064 176640
719 161792 891904 116736 309760 193024 -460288 643072 4096 1029120 515072 -538112
708 173056 -571392 -676352 540160 -727552 162304 487424 1292288 -210944 -435200 1142272
697 9728 -1209856 328192 286720 763904 559104 -57856 872448 -942080 154112 -8192 -550912
686 -550912 -428032 75776 -603648 19968 1092608 79872 -396800 -209408 648192 394240
676 394240 957440 -108544 -158208 780800 891392 -512512 329216 -700928 33280 -867840
665 47616 -262656 -132608 -396800 639488 -208896 144896 -497664 -526336 82432 520192
655 520192 67584 282112 347136 -165888 288768 -587264 727552 -331776 -227328 -14336
644 -1047552 -226816 411648 135168 229376 -327168 322560 649728 774656 -253440 19456
633 -274432 -103424 65024 492032 937472 -116736 719360 197120 111616 923648 683520
623 683520 477696 867328 -710656 929792 -879616 -863744 -1332736 1068032 1072640 -543744
612 197120 108544 1052160 418304 424448 -139264 -732672 669696 -1182720 -681472 219648
601 25600 -385536 -450560 -673280 -1103360 -473600 228864 -1256448 166400 173568 -55808 301568
589 -1094144 246272 368640 -433152 45568 349696 -47616 965632 61952 314368 -531456
578 520704 -455680 823808 199168 -318976 303616 -214528 -528896 -928768 72704 -345088
567 372224 931328 -4096 216576 321536 416256 -606720 -975360 -734208 1193984 815616
557 815616 -178688 40960 -439808 -375808 -354304 735232 205312 -357888 -560128 -84992 -90112
546 -90112 -766464 446464 -723456 -159232 770048 315904 931328 -730112 823808 -380928
535 782336 333312 -300032 512 -466944 -697344 -19968 -476160 -152576 -371712 715264 -548864
523 -504832 -40448 518656 -729088 468992 -194048 -142848 -711680 -1083904 840192 601088
513 601088 -826368 -177152 -83456 -219136 933888 400896 948736 449024 86016 802304
503 802304 30720 -778752 -71168 -53760 -701952 -10752 94208 920064 1358848 478208 -1125376
491 -376832 -459264 -231424 569344 319488 -329728 564224 848384 -319488 -535552 574976
480 -430080 0 -634880 811520 -621568 -203776 385536 832512 -243712 -809472 506368 327168
469 327168 -49664 -281088 -248832 195072 -578560 -430592 -641536 -683520 -1073664 800256
458 264704 -872448 -502784 -555520 -949760 -111616 245760 270336 -53248 152576 49664 101376
447 101376 877056 -986624 -256512 375808 1331200 455680 -710656 -759296 -111104 -1178112
437 -1178112 747520 -136704 60416 184320 449536 -515072 -373248 -1091584 -23040 195584
426 -342528 412160 242688 202240 -747008 175104 541184 589312 -179712 -1560576 -1033728
416 -1033728 817152 141312 -124416 -66560 224768 273920 -566272 -43520 96256 744448
406 744448 418304 -607232 212992 -322048 -633344 610304 802304 -522752 -74240 658944
395 -112640 -1007104 17408 603648 -434688 -182784 842240 -60928 348672 -762880 -348672
384 -592384 -665600 232448 -332288 173568 -607744 -405504 -308736 -168960 -132096 433664
373 203776 -487424 911360 381440 -215040 -326656 221696 -408064 116736 99328 -343040
362 -35328 -448000 164352 -351232 -344576 288768 -547840 -110592 284160 1022976 466944
351 -408576 -103936 -482816 880640 226304 -141312 45568 -433152 -774656 430592 -214016
340 -321024 -187904 -688640 1449472 -993792 -132096 52736 46080 382976 182784 -60928
329 -248320 -186880 97792 -151040 196096 -248320 893440 -79360 -474624 -1121792 156160
318 -1143808 41472 -378880 -189952 609792 -281088 -50688 190464 145408 -1072640 -72192
307 -756224 -170496 -471040 349184 -228864 -232448 286208 358912 -620032 -654336 -229888 163328
295 13312 -1371648 -1176576 -165376 163328 638976 -240640 -900096 -108544 -384512 531456
284 136704 427520 -805888 327168 -668160 208896 -484864 -46080 160768 31744 -656384
273 -459264 489984 -791552 923136 -137728 628736 357888 -96768 359936 -467968 659456
262 413184 -423424 -1013760 -219648 -264704 -675840 585216 -753664 -353280 530432 -872960
251 53760 137728 564224 -402944 -306176 -69632 -197120 369152 289280 -5632 615936 429568
240 429568 719360 -136192 -285184 -245248 1019904 -620032 129536 -395776 -128000 196608
229 -84480 88576 -636416 110080 -97280 -583680 -1004544 -231424 634368 44544 -1317376
218 176640 675840 -552448 241664 284160 30208 -100864 -878592 -114688 -54784 403968
207 -472576 -412672 -759808 -126976 589824 -499712 -617984 -1143808 -457728 -146432 543744
196 -910336 -567296 665088 99840 -1108480 -310784 -198144 -562176 -624640 858624 -278528
185 399872 -815616 164864 -512000 740864 -548352 -7168 25600 286208 552448 337408
175 337408 330240 -144896 -1097216 514560 -40960 -910336 -864768 128000 -1342976 419328
164 346112 -451584 -58880 712704 -156160 76800 -923136 -604672 840704 -351232 233984
153 314880 -49664 -268800 -74240 164352 -1256448 218624 -500224 622592 -830976 -822272
143 -822272 -465408 13312 -602112 104448 360448 385024 -139776 -40960 -606720 -385536
133 -385536 489984 478208 -399872 -736768 -398336 222720 -251392 185856 289792 187392
123 187392 -449536 -273920 30720 -557056 585728 -673792 -200704 -1024512 -1319424 -103424
112 -960512 52736 294400 -150016 -709632 -303104 -150528 388608 37888 182784 77824
101 -239616 671744 -844800 417792 -387584 378880 -550912 -536064 -163840 -57344 -1404928
91 -1404928 318464 -704512 -828416 -563712 -221696 -205824 -1106432 1077248 283648 -382464
80 226816 682496 548352 420352 -1071104 -181760 -381952 -49152 -131072 -419328 -289792
70 -289792 -1424384 -335872 343552 -38912 -336384 -688640 -407552 -303616 290816 -238592
59 -460288 -1106944 -763392 51200 428544 844800 -563200 448000 -386560 -577536 -872448
49 -872448 55808 -512512 95744 1218048 -485888 444928 -107520 138240 621056 -743424
38 -284160 287232 -14336 -817664 398848 -931840 -334848 498688 -310272 7168 -1034752
27 -776192 589312 -200704 196096 -179712 -935936 -545280 358400 158720 257536 598016
17 598016 -301568 260608 -496640 -113152 388096 -1147392 943104 828416 754688 -341504
6 350208 288256 -97792 -573952 -180736 218624 -1093632
##END=
