##TITLE=1217
##JCAMPDX= 6.0         $$ Bruker NMR JCAMP-DX V2.0
##DATA TYPE= NMR SPECTRUM
##DATA CLASS= XYDATA
##ORIGIN= NUTS EXPORT
##OWNER= Administrator
$$ 1.72 TOPSPIN		Version 2.1
$$ 2016-02-23 12:18:08.449 -0800  Administrator@X
$$ Compression mode = diff/dup
##.OBSERVE FREQUENCY= 90.275459
##.ACQUISITION MODE= SIMULTANEOUS (DQD)
##.ACQUISITION SCHEME= undefined
##.AVERAGES= 16
##.DIGITISER RES= 22
##SPECTROMETER/DATA SYSTEM= 
##.PULSE SEQUENCE= zg30
##.SOLVENT NAME= None
##.SHIFT REFERENCE= INTERNAL, None, 1, 14.66982
##AUDIT TRAIL= $$ (NUMBER, WHEN, WHO, WHERE, PROCESS, VERSION, WHAT)
$$ ##TITLE= Audit trail, TOPSPIN		Version 2.1
$$ ##JCAMPDX= 5.01
$$ ##ORIGIN= Bruker BioSpin GmbH
$$ ##OWNER= Administrator
$$ $$ E:/data/jwist/nmr/1217/1/pdata/1/auditp.txt
$$ ##AUDIT TRAIL=  $$ (NUMBER, WHEN, WHO, WHERE, PROCESS, VERSION, WHAT)
(   1,<2016-02-23 08:23:18.152 -0800>,<Administrator>,<X>,<jcamp>,<TOPSPIN 2.1>,
      <fromjdx created from
       E:\data\jwist\nmr\uniandes\1217
       data hash MD5: 8K
       A5 35 EA C9 A6 0B 87 6A F1 36 C2 92 98 17 DB CD>)
$$ ##END=
$$ 
$$ $$ hash MD5
$$ $$ 65 E2 E7 41 39 20 B1 03 6D 06 B0 C0 D8 17 EE 29
##$RELAX= 
$$ Bruker specific parameters
$$ --------------------------
##$DU= <E:>
##$EXPNO= 1
##$NAME= <1217>
##$PROCNO= 1
##$TYPE= <nmr>
##$USER= <jwist>
##$ACQT0= 0
##$AMP= (0..31)
100 100 100 100 100 100 100 100 100 100 100 100 100 100 100 100 100 100
100 100 100 100 100 100 100 100 100 100 100 100 100 100
##$ANAVPT= 1
##$AQSEQ= 0
##$AQ_mod= 3
##$AUNM= <au_zg>
##$AUTOPOS= <>
##$BF1= 90.275459
##$BF2= 400.02
##$BF3= 400.02
##$BF4= 400.02
##$BF5= 400.02
##$BF6= 400.02
##$BF7= 400.02
##$BF8= 400.02
##$BYTORDA= 0
##$CFDGTYP= 0
##$CFRGTYP= 0
##$CHEMSTR= <none>
##$CNST= (0..63)
1 1 145 1 1 1 1 1 1 1 1 1 1 1 1 1 1 1 1 1 1 1 1 1 1 1 1 1 1 1 1 1 1 1 1
1 1 1 1 1 1 1 1 1 1 1 1 1 1 1 1 1 1 1 1 1 1 1 1 1 1 1 1 1
##$CPDPRG= <>
##$CPDPRG1= <>
##$CPDPRG2= <>
##$CPDPRG3= <>
##$CPDPRG4= <mlev>
##$CPDPRG5= <mlev>
##$CPDPRG6= <mlev>
##$CPDPRG7= <mlev>
##$CPDPRG8= <mlev>
##$CPDPRGB= <>
##$CPDPRGT= <>
##$D= (0..63)
0 1 0 0 0 0 0 0 0 0 0 0 0 0 0 0 0 0 0 0 0 0 0 0 0 0 0 0 0 0 0 0 0 0 0 0
0 0 0 0 0 0 0 0 0 0 0 0 0 0 0 0 0 0 0 0 0 0 0 0 0 0 0 0
##$DATE= 0
##$DBL= (0..7)
120 120 120 120 120 120 120 120
##$DBP= (0..7)
150 150 150 150 150 150 150 150
##$DBP07= 0
##$DBPNAM0= <>
##$DBPNAM1= <>
##$DBPNAM2= <>
##$DBPNAM3= <>
##$DBPNAM4= <>
##$DBPNAM5= <>
##$DBPNAM6= <>
##$DBPNAM7= <>
##$DBPOAL= (0..7)
0.5 0.5 0.5 0.5 0.5 0.5 0.5 0.5
##$DBPOFFS= (0..7)
0 0 0 0 0 0 0 0
##$DE= 6.5
##$DECBNUC= <off>
##$DECIM= 2432
##$DECNUC= <off>
##$DECSTAT= 4
##$DIGMOD= 1
##$DIGTYP= 12
##$DL= (0..7)
0 120 120 120 120 120 120 120
##$DP= (0..7)
150 150 150 150 150 150 150 150
##$DP07= 0
##$DPNAME0= <>
##$DPNAME1= <>
##$DPNAME2= <>
##$DPNAME3= <>
##$DPNAME4= <>
##$DPNAME5= <>
##$DPNAME6= <>
##$DPNAME7= <>
##$DPOAL= (0..7)
0.5 0.5 0.5 0.5 0.5 0.5 0.5 0.5
##$DPOFFS= (0..7)
0 0 0 0 0 0 0 0
##$DQDMODE= 0
##$DR= 22
##$DS= 2
##$DSLIST= <SSSSSSSSSSSSSSS>
$$ [...]
##$SPOFFS= (0..31)
0 0 0 0 0 0 0 0 0 0 0 0 0 0 0 0 0 0 0 0 0 0 0 0 0 0 0 0 0 0 0 0
##$SUBNAM0= <"">
##$SUBNAM1= <"">
##$SUBNAM2= <"">
##$SUBNAM3= <"">
##$SUBNAM4= <"">
##$SUBNAM5= <"">
##$SUBNAM6= <"">
##$SUBNAM7= <"">
##$SUBNAM8= <"">
##$SUBNAM9= <"">
##$SW= 20.5580556627758
##$SWIBOX= (0..15)
0 0 3 4 0 0 0 0 0 0 0 0 0 0 0 0
##$SW_h= 8223.68421052631
##$SWfinal= 0
##$TD= 65536
##$TD0= 1
##$TE= 300
##$TE2= 300
##$TE3= 300
##$TEG= 300
##$TL= (0..7)
0 120 120 120 120 120 120 120
##$TP= (0..7)
150 150 150 150 150 150 150 150
##$TP07= 0
##$TPNAME0= <>
##$TPNAME1= <>
##$TPNAME2= <>
##$TPNAME3= <>
##$TPNAME4= <>
##$TPNAME5= <>
##$TPNAME6= <>
##$TPNAME7= <>
##$TPOAL= (0..7)
0.5 0.5 0.5 0.5 0.5 0.5 0.5 0.5
##$TPOFFS= (0..7)
0 0 0 0 0 0 0 0
##$TUNHIN= 0
##$TUNHOUT= 0
##$TUNXOUT= 0
##$USERA1= <user>
##$USERA2= <user>
##$USERA3= <user>
##$USERA4= <user>
##$USERA5= <user>
##$V9= 5
##$VALIST= <valist>
##$VCLIST= <CCCCCCCCCCCCCCC>
##$VD= 0
##$VDLIST= <DDDDDDDDDDDDDDD>
##$VPLIST= <PPPPPPPPPPPPPPP>
##$VTLIST= <TTTTTTTTTTTTTTT>
##$WBST= 1024
##$WBSW= 4
##$XGAIN= (0..3)
0 0 0 0
##$XL= 0
##$YL= 0
##$YMAX_a= 1203153024
##$YMIN_a= -1867594.752
##$ZGOPTNS= <>
##$ZL1= 120
##$ZL2= 120
##$ZL3= 120
##$ZL4= 120
##$ABSF1= 10
##$ABSF2= 0
##$ABSG= 5
##$ABSL= 3
##$ALPHA= 0
##$AQORDER= 0
##$ASSFAC= 0
##$ASSFACI= 0
##$ASSFACX= 0
##$ASSWID= 0
##$AUNMP= <proc_1d>
##$AXLEFT= 0
##$AXNAME= <>
##$AXNUC= <off>
##$AXRIGHT= 0
##$AXTYPE= 0
##$AXUNIT= <>
##$AZFE= 0.1
##$AZFW= 0.1
##$BCFW= 1
##$BC_mod= 2
##$BYTORDP= 0
##$COROFFS= 0
##$CY= 15
##$DATMOD= 1
##$DC= 2
##$DFILT= <>
##$DTYPP= 0
##$F1P= 0
##$F2P= 0
##$FCOR= 0.5
##$FTSIZE= 0
##$FT_mod= 4
##$GAMMA= 1
##$GB= 0
##$INTBC= 1
##$INTSCL= 1
##$ISEN= 128
##$LB= 0.3
##$LEV0= 0
##$LPBIN= 0
##$MAXI= 10000
##$MC2= 0
##$MEAN= 0
##$ME_mod= 0
##$MI= 0
##$NCOEF= 0
##$NC_proc= -9
##$NLEV= 6
##$NOISF1= 0
##$NOISF2= 0
##$NSP= 1
##$NTH_PI= 0
##$NZP= 0
##$OFFSET= 14.66982
##$PC= 1
##$PHC0= 0
##$PHC1= 0
##$PH_mod= 0
##$PKNL= yes
##$PPARMOD= 0
##$PPDIAG= 0
##$PPIPTYP= 0
##$PPMPNUM= 2147483647
##$PPRESOL= 1
##$PSCAL= 4
##$PSIGN= 0
##$PYNMP= <proc.py>
##$REVERSE= no
##$SF= 90.274134695139
##$SI= 8192
##$SIGF1= 0
##$SIGF2= 0
##$SINO= 400
##$SIOLD= 32768
##$SPECTYP= <>
##$SREGLST= <1H.CDCl3>
##$SSB= 0
##$STSI= 0
##$STSR= 0
##$SW_p= 1497.18866228788
##$SYMM= 0
##$S_DEV= 0
##$TDeff= 0
##$TDoff= 0
##$TI= <>
##$TILT= no
##$TM1= 0
##$TM2= 0
##$TOPLEV= 0
##$USERP1= <user>
##$USERP2= <user>
##$USERP3= <user>
##$USERP4= <user>
##$USERP5= <user>
##$WDW= 1
##$XDIM= 8192
##$YMAX_p= 1203152896
##$YMIN_p= -1867264
##$CURPLOT= <PDFCreator>
##$CURPRIN= <$PDFCreator>
##$DFORMAT= <normdp>
##$LAYOUT= <+/1D_H.xwp>
##$LFORMAT= <normlp>
##$PFORMAT= <normpl>
##$SURQMSG= 1
$$ End of Bruker specific parameters
$$ ---------------------------------
##XUNITS= HZ
##YUNITS= ARBITRARY UNITS
##XFACTOR= 0.182762287876938
##YFACTOR= 1
##DELTAX= -0.182762287876938
##NPOINTS= 8192
##FIRSTX= 1497.0059
##FIRSTY= -398848
##LASTX= 0
##MAXY= 1203152896
##MINY= -1867264
##XYDATA= (X++(Y..Y))
$$ plain form
8191 -398848 342016 -220160 -993792 533504 93696 -723968 221184 -32768 -735744 83456
8180 615936 539648 608256 625664 -550912 374272 435712 -183296 174080 517632 -358400
8169 -35840 1220096 -954368 -437760 463360 126976 596992 473088 -1093120 320512 -193024
8158 -209408 -961024 -779776 -27136 38912 -255488 517120 698368 -1085952 -719872 -208896
8147 -74240 -837120 119296 -228352 -430592 -1158144 -395776 -675840 650752 352256 -1163776
8136 512 172032 -218624 -161792 -299008 99328 26624 43008 434688 -348160 -651776 -404992
8125 -404992 -942080 223744 788992 210944 -707072 335872 -353792 -65536 636416 -277504
8114 -9216 -833536 -237568 -769024 650752 -420864 45568 4096 -1042944 -637440 -774656
$$ packed form
8191c98848C42016b20160p73632E33504I3696g23968B21184c2768p02976H3456
8180F15936p6288O8608J7408e50912C74272O1440a83296A74080L43552c58400
8169c5840A220096i54368d37760D63360A26976M70016j23904a093120C20512a93024
8158b09408p51616J81248b7136C8912b55488E17120J81248a085952L66080b08896
8147g4240p62880A19296b28352k02240p27552c95776k80064F50752k98496a163776
8136E12J71520b18624N6832j37216I9328B6624J6384L91680c48160l03616K46784
8125d04992n37088B23744N65248B10944g07072C35872c53792f5536F36416b77504
8114i216q24320b37568n31456F50752d20864D5568D096a042944M05504j37216
$$ plain form
8104 -774656 -133120 -26624 -60928 -872960 -7680 -748032 -171008 112128 438272 -133120
8093 -414208 -776192 -189440 -227328 -1003520 -889344 -344576 -290304 -505856 402432 -1351680
8082 -377344 966144 -691712 855040 112128 -43008 -131584 -382976 -211968 -209920 -100352
8071 -1601536 -652800 -95232 -174080 561152 -476160 1114112 -201728 654336 256512 -457728
8060 -509440 -607744 -822272 -22016 -589824 -309760 -353280 -923136 434176 49664 -304640
8049 -464384 -549888 -247808 31232 -570880 -96256 248320 -662016 434176 647680 79360
8038 -112640 512000 -1120768 -701952 -607744 -279552 -969216 -77312 -444928 85504 -335360
8027 -953856 -435200 -497152 -891392 -1536 -104960 403968 462336 -284160 -858624 -495104
$$ packed form
8104g74656a33120b6624l4304q12032g680p40352a71008A12128L26144a33120
8093d14208l61984a89440l7888p76192J14176c44576N4272k15552D02432a351680
8082c77344I66144f91712H55040A12128d3008q8576k51392J71008K048a00352
8071a601536f52800i5232p8848E61152d76160A114112b01728F54336B56512d57728
8060e09440r8304k14528b2016n67808K80064m3520n69856D34176D9664c04640
8049d64384q5504b47808C1232e70880i6256B48320f62016D34176K13504G9360
8038a12640E12000a120768M18816R4208b79552o89664g7312l67616H5504c35360
8027i53856d35200o1952l94240a536j03424D03968N8368b84160n74464L63520
$$ plain form
8017 -495104 -182784 -1152512 -1388544 -401408 -458240 -936960 -314880 468992 -1226752 648192
8006 -544256 280576 -393728 1102848 358912 591360 584192 -1216000 522752 -707072 -273408
7995 911360 -219136 -355328 -73728 220672 -562176 -437248 543232 -411648 -88576 -134656
7985 -134656 -822784 12800 -660480 595456 -534016 56832 408064 520192 237056 -925184
7974 -372224 635904 952832 -11264 -990720 -643072 3584 -76800 -420352 739328 24576 -22528
7962 212480 -862720 229376 -111616 -929792 -38912 -1165824 -1120768 647168 -127488 -269824
7952 -269824 -438272 866816 -112640 1082368 145408 -294912 -166912 315904 -158208 -610816
7942 -610816 -582144 975872 191488 -314880 737792 -739328 39936 1163776 779776 221184
$$ packed form
8017d95104a82784r69728k36032d01408n6832m78720c14880D68992a226752F48192
8006e44256B80576c93728A102848C58912K32448p168a216000E22752g07072b73408
7995I11360b19136j36192g3728B20672e62176J24928E43232d11648h8576m6080
7985a34656o88128A2800f60480E95456e34016E6832L51232J12128B37056i25184
7974c72224F35904L16928a1264r79456L47648C584g6800l43552G39328B4576b2528
7962B12480h62720B29376a11616q18176c8912j126912M5056F47168a27488j42336
7952b69824j68448H66816a12640A082368A45408b94912J28000C15904a58208m52608
7942f10816K8672I75872A91488c14880G37792g39328C9936J123840l84000B21184
$$ plain form
7931 386560 -358400 1056256 -260608 498176 512512 -782336 309760 359424 949248 71680
7920 -487424 156672 -543744 -275456 4608 -364032 -315904 -502784 -24576 465920 -177664
7909 -139776 -480256 -151552 -200192 390656 -903168 -303104 1024 -379392 -800256 382464
7898 -956928 -266240 -453120 387584 -329728 680960 15872 155648 -211968 317952 -350720
7887 -167936 1245184 51712 -512 -544768 -293376 -1092608 -815104 -99840 78336 -525824 -928768
7876 -928768 167936 -53760 -521728 311296 204288 -984576 -1285120 -1018880 11776 -1088000
7865 10752 -960000 -901120 -125952 -224256 181760 -317440 -548864 729088 193024 284672
7855 284672 -693760 609792 162816 190464 402944 -434688 417280 -275456 808448 -984576
$$ packed form
7931C86560c58400A056256b60608D98176J4336g82336C09760M9664N89824G1680
7920d87424A56672e43744K68288D608c64032M8128j86880b4576D65920a77664
7909a39776l40480a51552m8640C90656i03168c03104A024c79392m20864C82464
7898i56928b66240j86880C87584c29728F80960A5872J39776b11968C17952c50720
7887a67936A245184E1712e12n44256K51392p99232K77504i9840G8336e25824m02944
7876i28768A67936e3760m67968C11296j07008i84576l00544K66240A1776a088000
7865A0752i60000N8880a25952r8304A81760c17440k31424G29088A93024R1648
7855B84672f93760F09792A62816K7648K12480d34688D17280b75456H08448i84576
$$ plain form
7844 455680 -183808 -93696 -212992 26624 -1027584 -426496 184832 -215040 366592 -276992
7833 655872 -108032 -519168 356352 -693248 -1377792 76288 104448 385536 -591360 -491520
7823 -491520 109056 788992 663552 -833024 -374272 -1088000 -87552 -675328 429056 -819200
7812 1347584 -585216 -378368 159744 -521216 -97792 618496 304128 -524800 4608 999936
7802 999936 1023488 39424 -41984 -982528 -274432 271360 205312 385536 98816 142336 860672
7791 860672 1103360 69120 -1049088 540160 -170496 940544 131584 -29696 -836096 556544
7780 -186880 -436224 -294400 -686080 -509440 -73216 -609280 -1205248 -488448 604160 -341504
7769 -456704 -782848 -37888 -564224 331776 -28672 -668160 -968704 623616 -373248 -850944
$$ packed form
7844D55680a83808R0112j19296B6624a027584d26496A84832b15040C66592b76992
7833F55872a08032m11136C56352f93248o84544G6288K8160K81088e91360R9840
7823d91520A09056O79936j25440h33024c74272p13728h7552n87776D29056h19200
7812A347584e85216K06848A59744e21216i7792F18496C04128e24800D608R95328
7802I99936K3552C9424d1984r40544b74432B71360o6048J80224I8816M3520P18336
7791H60672K42688F9120a049088E40160a70496I40544A31584b9696q06400E56544
7780a86880k49344J41824l91680J76640g3216n36064n95968d88448F04160c41504
7769d56704l26144c7888n26336C31776b8672o39488l00544F23616c73248m77696
$$ plain form
7759 -850944 240128 537600 -119296 101888 706048 -642048 -388608 57344 -675840 179200
7748 -354816 521728 601600 386048 -313856 -978432 308224 -416256 -109056 137216 -233984
7737 -116224 -801792 -45568 552448 154624 142336 -1174528 -392704 -628736 356864 398848
7727 398848 174080 -697344 255488 -95744 487424 231424 -39936 -675328 -662528 361984
7716 166912 -475648 -97280 285696 149504 -574976 584704 499200 -168960 75776 -449536
7705 -247808 49152 -744448 -1189376 467968 -291840 -69632 -169984 -1252352 -222720 -90112
7694 -252928 -215552 -1275392 -1042944 -454656 -1080320 351232 72704 -1438720 -15360 456192
7683 762880 -168448 301568 221696 287744 930304 -144384 249344 -808448 36352 -212992
$$ packed form
7759h50944B40128K97472a19296A01888O04160f42048K53440E7344f75840A79200
7748c54816E21728P9872k15552c13856o64576C08224d16256a09056A37216b33984
7737a16224o85568d5568E52448A54624j2288a174528c92704k36032C56864M1984
7727C98848A74080f97344B55488i5744D87424B31424c9936o35392J2800C61984
7716A66912d75648i7280B85696j36192e74976E84704q5504a68960G5776d49536
7705b47808D9152g44448m44928D67968b91840f9632j00352j082368b22720i0112
7694b52928L7376j059840K32448d54656o25664C51232G2704a438720a5360D56192
7683G62880a68448C01568p9872O6048O42560a44384B49344h08448C6352b12992
$$ plain form
7672 130048 350720 209920 553984 -375808 -1385984 22016 -450560 312320 -396288 -292352
7662 -292352 -123904 -483328 -257024 -151040 110080 -95744 28160 -741376 -603136 -204288
7651 -186368 359424 -512000 -723968 -60928 -268288 -244224 -1230848 -142336 11264 -625664
7640 551936 -284672 -1688064 677376 369664 -670208 -642048 200192 -316416 15360 100352
7630 100352 -1321984 -478208 914432 -367616 745984 -227328 -462848 204288 -66560 191488
7619 -195584 -59904 2048 -703488 143360 -1227776 60928 -619008 300032 -87040 427008
7608 209920 -78848 -674816 -1238528 687616 244224 205312 -304128 -726528 -94720 -777216
7598 -777216 68096 249344 27648 -357376 692736 -69632 -69632 211968 327168 -244736 -482816
$$ packed form
7672A30048K20672j40800L44064c75808j010176B2016d50560C12320c96288J03936
7662b92352a23904l59424K26304J05984A10080i5744B8160g41376J38240b04288
7651a86368C59424e12000k11968f0928k07360K4064r86624a42336A1264f25664
7640E51936b84672j403392F77376l07712f70208K8160B00192c16416A5360Q4992
7630A00352a321984d78208I14432c67616G45984b27328k35520B04288f6560A91488
7619a95584e9904B048g03488A43360a227776F0928f19008C00032h7040D27008
7608B09920g8848n95968n63712F87616B44224l8912c04128m22400i4720o82496
7598g77216F8096J81248B7648c57376F92736f9632%B11968J15200b44736k38080
$$ plain form
7587 -482816 467968 -267264 1024 -210432 288256 -773632 -240128 95232 257536 -958976
7576 -66560 324608 29696 -869888 -589824 -101376 58880 329216 -145920 880640 311808
7565 -843776 -289280 -237056 -485888 -413184 -704512 243200 187904 1029120 -760320 -198656
7554 104448 576000 -146944 -748032 -212992 -1043968 -192512 359936 -479744 -318464 -12800
7543 431616 -1006080 418304 10752 262656 253440 523776 -632832 702976 -452608 964096
7532 -253440 -1009664 619520 867840 -609792 494080 208896 73728 -888832 -929792 -313344
7521 601600 -78336 -675328 975872 315904 -1082368 -544768 -681984 200704 -108032 -1163776
7511 -1163776 -129024 804352 677888 -531456 573952 113152 -838144 807936 -33792 1521152
$$ packed form
7587d82816D67968b67264A024b10432B88256g73632b40128I5232J62304i58976
7576f6560C24608B9696h69888K80064a01376E8880K70336a45920H80640C11808
7565h43776b89280N2224k48832P2704k91328B43200n5296Q41216g60320a98656
7554A04448M71552a46944o01088b12992q30976a92512C59936d79744J61280a2800
7543D31616a006080D18304A0752K51904r216K70336f32832G02976d52608I64096
7532b53440p56224F19520K48320f09792D94080B08896G3728h88832m0960c13344
7521F01600g8336n96992I75872C15904a082368N37600j37216B00704a08032j055744
7511a163776a29024H04352j26464e31456E73952A13152h38144H07936c3792A521152
$$ plain form
7500 -232960 -410624 636928 971264 298496 -158720 645632 -429568 395264 -4096 567808
7489 128512 1167360 -793088 -475136 344576 22528 184832 325632 -163840 -620544 -54784
7478 654336 251392 1209344 -1295872 645120 408576 -681984 370688 15360 229888 -340480
7467 -106496 698880 -1867264 433152 71680 153600 -251392 101376 -466944 -197120 260096
7456 -396800 -227328 -774144 -50688 619008 -1110528 181248 -626176 391168 391680 -520192
7445 -128000 1257984 1221632 -903168 738816 -279552 271360 621056 -753664 735232 114688
7434 286720 -74240 223744 -257536 -235008 316928 231424 7168 566272 726528 -926720 -358912
7422 -46592 277504 -537600 -587264 301056 633856 -387072 -877056 -43008 -133632 -329728
$$ packed form
7500b32960j77664F36928L34336B98496a58720F45632d29568C95264d096E67808
7489A28512J038848g93088L17952C44576B2528J62304J40800a63840m56704e4784
7478F54336B51392R57952a295872F45120k36544f81984C70688A5360K14528c40480
7467a06496F98880a867264D33152G1680Q1920b51392A01376d66944a97120B60096
7456c96800J69472n46816e0688F19008a110528A81248f26176C91168N12e20192
7445a28000A257984l6352i03168G38816b79552B71360L49696g53664G35232A14688
7434B86720g4240B23744b57536K2528C16928q5504G168N59104J60256i26720c58912
7422d6592B77504e37600m9664C01056L32800c87072m89984d3008r0624j96096
$$ plain form
7412 -329728 456192 -559104 -943616 573952 -97792 259584 1041920 -287744 391680 386048
7402 386048 17408 -875520 -750592 124928 536064 669184 313344 306176 16896 -546816
7391 -126976 600576 143872 363008 867328 -98304 222208 503808 -75776 121856 -563200
7380 181248 378368 589312 883712 -545280 24576 -363008 165376 88576 -556032 -1267200
7370 -1267200 -222720 -614400 -420352 -197120 -370176 815616 437760 -607744 322048 -50688
7359 -771584 -580096 663552 -148992 687104 -487424 88064 -340992 288256 420352 -70656
7348 1191424 474112 -58880 191488 -192000 -662016 148480 -275968 81920 125952 86528
7338 86528 208896 -159744 -472576 -538624 471552 -1631232 80384 235008 148480 206848
$$ packed form
7412c29728D56192e59104l84512E73952i7792B59584P82336b87744C91680n632
7402C86048A7408h75520J24928A24928M11136J33120C13344p168A6896e46816
7391a26976F00576A43872K19136N04320i8304B22208K81600g5776A21856e63200
7380A81248J97120K10944K94400e45280B4576c63008A65376p6800e56032p11168
7370a267200b22720l91680J94048a97120j73056H15616l77856f07744C22048e0688
7359g71584J91488F63552a48992F87104d87424H8064c40992B88256J32096g0656
7348A191424D74112e8880A91488a92000m70016A48480b75968H1920M4032l9424
7338H6528J22368a59744l12832o6048D71552a631232H0384J54624q6528N8368
$$ plain form
7328 206848 44032 370688 -528384 174080 -130048 -25600 515072 -641536 623616 609792
7318 609792 443904 -934912 -295424 -402944 -287232 -198656 -164352 -62464 -535552 368640
7307 365568 -463360 -118272 -511488 -227328 641536 -989184 -695296 -218112 186368 -296448
7296 -1296896 109056 1203712 -451072 -1044992 760320 -1051136 -429056 234496 -295424
7286 -179712 -17408 -224256 -655872 -317440 689152 -910848 -158208 626176 -496640 52736
7275 -167424 490496 -409600 -26624 -858112 319488 72192 -365568 -606720 738816 94208
7264 -314880 -485376 35840 -785920 390656 261120 254464 -539136 -175616 284160 331776
7254 331776 -728576 149504 221184 -730624 377344 1536 -567808 -397312 -910848 -347136
$$ packed form
7328B06848D4032L26656e28384A74080a30048b5600E15072f41536F23616j3824
7318F09792j65888i34912b95424j07520J15712Q8576L4304f2464m73088C68640
7307C65568d63360a18272l93216b27328F41536i89184K93888b18112A86368b96448
7296a296896A09056J094656d51072n93920G60320a051136d29056B34496b95424
7286a79712a7408k06848m31616c17440F89152i10848a58208F26176d96640E2736
7275a67424D90496d09600b6624q31488C19488G2192c65568k41152G38816I4208
7264c14880j70496C5840g85920C90656j29536o656e39136a75616B84160M7616
7254C31776g28576A49504P1680g30624C77344A536e67808J70496n13536c47136
$$ plain form
7243 1102336 30208 -276992 -34816 330240 3584 -493056 484352 -454144 -165376 500224
7232 -846336 -239616 -128512 148480 -380928 -321024 826368 -388608 -103424 -324608 -1469440
7222 -1469440 790016 -341504 -1213440 -297984 665600 144384 -99840 -264704 -868352 187392
7211 -506880 297472 -430592 86528 995840 -490496 -1074688 -168448 -267776 538112 -130048
7200 -366080 504832 256000 -26624 1207296 345600 -280064 5120 -437248 -89600 187392
7189 1032704 146944 -592896 -523776 433152 -74240 -275968 164352 -222208 -36352 -698880
7179 -698880 -320000 491520 276480 116224 -169984 39936 -156160 107520 -174080 -540160
7169 -540160 -290816 34304 -276480 -741888 -203264 -453120 -1243136 -10752 83456 -19456
$$ packed form
7243A102336C0208b76992c4816C30240C584d93056D84352d54144a65376E00224
7232h46336b39616J11104A48480c80928N9904H26368c88608a03424k21184j144832
7222a469440G90016c41504q71936b97984F65600A44384i9840j64864o03648A87392
7211e06880B97472d30592H6528R09312d90496n84192a68448r9328E38112a30048
7200c66080E04832k48832b6624A207296C45600b80064E120d37248h9600A87392
7189A032704A46944e92896O9120D33152g4240k01728A64352b22208c6352o62528
7179f98880c20000D91520k15040A16224a69984C9936a56160A07520a74080l66080
7169e40160K49344C4304b76480m65408b03264k49856p90016a0752H3456a9456
$$ plain form
7158 135680 -286720 307200 695808 -361984 -835072 -989696 -721920 -635392 -741888 230912
7147 -643072 -652288 197120 -384000 -369152 -41472 105984 -1395712 -1153536 673792 -11776
7136 135168 433152 -525824 -515584 -217088 -1033216 -152064 -423936 504320 763904 -718336
7125 159744 115712 415744 -762880 -131584 389632 -115200 37376 320512 727040 233984
7114 -1618432 149504 719872 -415744 51712 -296960 -52224 -741888 347136 311296 -228864
7103 506880 440320 -390656 133120 132096 -1063936 -383488 -51200 -579584 53760 518656
7093 518656 223232 -44032 -403456 11264 -903168 562688 -629760 -837632 -392704 -35328
7082 -282112 -1377792 346624 -748032 -369152 -1622528 -128000 -333312 -1022464 -844800
$$ packed form
7158A35680b86720C07200L88608c61984m73088j54624K67776Q6528j06496B30912
7147f43072r216A97120c84000J4848d1472A05984a395712K42176F73792a1776
7136A35168K97984e25824J0240b17088q16128a52064k71872E04320K59584g18336
7125A59744m4032L00032g62880a31584C89632a15200C7376K83136M06528B33984
7114a618432A49504N70368d15744E1712b96960e2224o89664C47136l5840b28864
7103E06880o6560c90656A33120j024a063936c83488e1200n28384E3760M64896
7093E18656B23232d4032l59424A1264i03168E62688f29760k07872c92704c5328
7082b82112j095680C46624g48032c69152j253376a28000k05312o89152J77664
$$ plain form
7073 -844800 -1559552 -767488 759296 -1209344 389632 568320 -217600 621056 1150464 -202752
7062 740352 -92160 -802304 -141312 -115200 -557056 -731136 -131072 -844800 -908288 -801280
7052 -801280 -313344 178176 -14336 -106496 748032 780800 -242688 -1090048 -402432 -254976
7042 -254976 -352768 766976 -894976 179200 427520 -867328 -696320 -842752 -205312 -377344
7032 -377344 -397824 348672 35840 -850944 -669184 493568 -1766912 384000 -339456 230912
7021 -443392 539648 899072 -676864 179712 -125952 -101376 -233984 -502272 -274432 -360448
7011 -360448 880128 -690688 734208 -1090560 22528 -197120 548352 -985088 -375296 107520
7000 575488 134656 -293888 908288 -554496 54784 -301568 690688 -109056 -205312 -494080
$$ packed form
7073h44800p14752g67488G59296a209344C89632J78688b17600F21056N29408b02752
7062G40352i2160p10144a41312K6112m41856j74080a31072p13728o3488J07008
7052h01280c13344A78176a4336r2160G48032L2768b42688q47360d02432J47456
7042b54976r7792G66976h94976A79200K48320h67328J71008j46432b05312j72032
7032c77344k0480C48672C5840h50944J81760D93568a766912C84000c39456B30912
7021d43392E39648L59424f76864A79712a25952K4576j32608k68288K27840q6016
7011c60448H80128f90688G34208a090560B2528a97120E48352i85088c75296A07520
7000E75488A34656b93888I08288e54496E4784c01568F90688a09056r6256k88768
$$ plain form
6990 -494080 194560 -466944 -390144 -445440 133120 -928256 -537088 470016 123904 -380928
6979 -233472 -169984 865792 742400 720384 169984 189440 -24576 -751104 271872 67072 -150016
6967 525824 120832 223232 -626688 -393216 -121856 1063936 687104 94720 59904 -228864
6956 -290304 256000 316928 300032 -261632 -1181184 -898048 -220672 -613376 -10240 900096
6945 -747008 -105472 -310272 -41984 -580608 -261632 -603648 563712 -316416 -380928 741376
6934 -552448 563200 -102912 122880 369664 -460288 -616448 118784 -85504 474112 -684544
6923 301568 -317952 427008 -156160 220672 -176640 -289792 -803840 -487936 -270336 701952
6912 279040 429056 -519168 -365568 706048 645120 -125440 920064 -1042944 -411136 -75776
$$ packed form
6990d94080A94560d66944P6800n5296A33120i28256L91168D70016A23904c80928
6979b33472O3488H65792j23392k2016A69984J9456b4576p26528B71872F7072a50016
6967E25824A20832J02400f26688K33472a21856A063936l76832I4720l4816b28864
6956b90304B56000O0928j6896b61632r19552K83136b20672l92704a0240I00096
6945g47008a05472k04800d1984n38624b61632l42016E63712c16416o4512G41376
6934e52448E63200a02912A22880K46784d60288j56160A18784h5504D74112f84544
6923C01568c17952D27008a56160B20672a76640j13152n14048L15904K17600G01952
6912B79040J50016e19168J53600G06048o0928a25440I20064a042944d11136g5776
$$ plain form
6901 -409600 81920 -2560 620544 -44032 -201216 -799744 1043968 -18944 -242688 -616960
6891 -616960 -84480 289792 -657408 35840 -406016 -574976 -26112 -532480 422912 -604672
6880 -219136 262144 -1047552 1146880 -578048 -8192 -1410560 287232 695296 -337408 84992
6869 -418304 -489472 695296 459264 -655872 -601600 1000960 -49664 915968 -474112 -586240
6859 -586240 -150528 44544 158208 290304 -165376 353792 38912 -115712 -237056 -16384
6848 -754176 -240128 -363008 494080 -1073664 725504 -229376 -269312 204800 -867328 -386560
6837 603648 -64000 -156160 -818688 633344 -1289216 47104 305152 671232 -474624 -92672
6826 -638464 356352 198656 -801280 -631808 216576 369152 -483328 76288 358912 874496
$$ packed form
6901d09600H1920b560F20544d4032j57184n98528A043968a8944k23744l74272
6891f16960h4480B89792f57408C5840d06016j68960b6112n06368D22912f04672
6880b19136B62144a047552A146880e78048h192j402368B87232M08064c37408H4992
6869d18304p1168F95296k36032f55872N4272A000960d9664I15968d74112j12128
6859e86240a50528D4544J13664J32096a65376C53792C8912a15712j21344a6384
6848g54176b40128j22880D94080a073664G25504b29376l9936B04800h67328c86560
6837F03648f4000r2160o62528F33344a289216D7104K58048L66080d74624i2672
6826f38464C56352j57696h01280J69472B16576J52576d83328G6288K82624N15584
$$ plain form
6816 874496 196608 625664 75264 659456 380416 47616 -582656 -478208 -110592 90112
6805 350208 -642048 -815616 -310272 -195072 386048 -168960 -89600 -16896 211456 -64000
6794 210944 650240 -305664 -38400 237056 694272 589312 -288256 -17408 493056 1106432
6784 1106432 354304 -265728 -220160 -192512 -657920 -6144 448512 109568 -484352 -317952
6774 -317952 -360448 -50688 367104 472576 -1031168 -321024 -254464 -314880 -742912 596480
6763 -137728 877056 -46080 197632 672768 172544 151552 -77312 631808 -318464 705536
6752 -264192 235520 -332800 -681984 415232 -827392 397824 -64000 -189440 233984 -445952
6741 -50688 773632 11264 802816 1016320 -140288 -139264 228864 221184 513536 -678400 88064
$$ packed form
6816H74496A96608M29056G5264N84192k79040D7616e82656J04448a10592I0112
6805C50208f42048j73568c10272J15200C86048a68960P9360a6896B11456f4000
6794B10944M39296c05664c8400B37056M57216j04960b88256a7408D93056O13376
6784A106432C54304b65728M5568K7648m65408f144D48512A09568d84352J66400
6774c17952m2496e0688C67104J05472a031168c21024O6560o0416m28032E96480
6763a37728H77056d6080A97632M75136A72544k0992g7312F31808c18464G05536
6752b64192B35520c32800l49184D15232h27392C97824f4000j25440B33984d45952
6741e0688G73632A1264P91552K13504a40288J024B28864p680K92352f78400H8064
$$ plain form
6729 696320 -396800 -413696 842240 510976 299520 396800 -617984 -821248 28672 460800
6719 460800 -75776 40448 538112 -162304 6144 -688640 -566784 359424 -563712 195072
6708 187392 148480 -28672 46080 39936 -243712 -273408 -156160 -537600 -126976 368640 369152
6697 369152 148480 631296 -197632 -1053696 -525824 -64000 628224 -662528 5632 -62464
6686 410112 877056 920576 27136 -114176 -359936 334848 579584 219136 265216 -129536
6675 -115200 -303104 1345024 -985088 69632 -517120 -228352 549888 599552 550912 634880
6665 634880 -981504 122368 307712 182784 101888 -489472 -359424 169984 -1793536 -354304
6654 -62976 -1046528 -432640 -236032 229376 168960 -133120 357888 1186304 -550400 451072
$$ packed form
6729F96320c96800j6896H42240l31264k11456R7280f17984k03264B8672M32128
6719D60800g5776D0448M97664a62304F144f88640J21856C59424e63712A95072
6708A87392l8912b8672D6080o144b43712k9696J17248l81440a26976C68640N12
6697C69152A48480M82816a97632q56064e25824f4000F28224f62528E632f2464
6686D10112M66944M3520B7136a14176k45760C34848K44736B19136M6080a29536
6675a15200j87904A345024i85088F9632e17120b28352E49888M9664m8640Q3968
6665F34880i81504A22368J85344j24928q0896d89472J30048A69984a793536c54304
6654f2976r83552d32640J96608B29376o0416a33120C57888Q28416e50400D51072
$$ plain form
6643 456192 -184320 1544704 787968 -285184 -785408 461824 353792 88576 417792 -243712
6632 25088 273920 115712 360960 -350720 326656 -148992 82432 -672256 1243648 841216
6622 841216 296960 570368 -381952 -394240 -585728 16896 -307712 -262144 757248 -404480
6611 178176 -745472 -846336 123904 8704 7680 500224 -712704 573440 -33792 147968 609792
6600 609792 81920 -399360 187904 562688 677888 113152 -249856 -233472 -308736 -62464
6589 422400 438784 67072 -450560 491008 40960 233472 137728 -288768 -697856 -662528 292352
6577 178176 -380416 50176 -604160 -261632 -1280000 282112 -834560 1028608 -617472 -432640
6567 -432640 610304 365568 722432 -332288 -519168 -95744 -204800 468992 644096 214528
$$ packed form
6643D56192a84320A544704p56736b85184n00224D61824j08032H8576L29216b43712
6632B5088K48832A15712K45248c50720C26656a48992H2432f72256A243648m02432
6622H41216B96960K73408c81952j2288j91488A6896c07712M5568G57248d04480
6611A78176g45472j00864A23904H704j024M92544g12704E73440c3792A47968M61824
6600F09792H1920c99360A87904L74784J15200A13152b49856J6384p5264f2464
6589D22400J6384F7072d50560D91008D0960J92512r5744b88768m09088L5328B92352
6577A78176c80416E0176f04160b61632j018368B82112h34560A028608f17472J84832
6567d32640F10304k44736L56864c32288j86880i5744j09056D68992J75104B14528
$$ plain form
6556 12800 544768 552960 329216 151040 -77824 38912 556032 -394240 39424 799744 -232448
6544 -134656 -265216 -749056 157184 -986624 -1195008 218112 -737792 -631808 -531456 -745472
6534 -745472 224768 -397312 -131584 177152 -433664 645632 -890880 -53248 -246272 -175104
6524 -175104 -98816 -1149440 -123392 348672 -124416 -548352 -138752 635392 -41984 -259072
6514 -259072 -361984 -300032 1536 49152 -1140736 72704 -326656 161280 -303616 118784
6503 349184 -504320 -99328 -161280 -510464 598016 106496 457216 1073152 -60416 302592
6492 -209408 -109056 76800 144384 897024 572416 -96256 -519168 23552 -479232 1435136
6481 -82944 -10752 -62464 250880 -359424 166912 -223744 357888 738816 662528 179712
$$ packed form
6556A2800N31968Q192k23744A51040g7824C8912N17120c94240C9424P60320b32448
6544a34656j30560m83840A57184i86624k08384B18112g37792J05984J00352k14016
6534g45472B24768c97312a31584A77152d33664F45632h90880e3248j93024P1168
6524a75104P6288j050624a23392C48672a24416m23936a38752F35392d1984k17088
6514b59072j02912O1952A536M7616a140736G2704c26656A61280c03616A18784
6503C49184e04320i9328o1952l49184E98016A06496L50720O15936f0416C02592
6492b09408J00352G6800O7584P52640l24608i6256m22912B3552d79232A435136
6481h2944a0752n1712B50880c59424A66912b23744C57888L80928p6288A79712
$$ plain form
6470 245248 461824 -71680 -191488 -942592 -118272 -1368064 350208 -196096 -539648 -646144
6460 -646144 -326656 -750080 152064 716288 281088 -697344 -1127424 176128 -751104 -169472
6449 266240 392704 -299008 54272 138240 -625664 1377280 -308224 98304 206848 157184
6439 157184 429056 487936 325632 390144 -395264 -649728 -727552 -600576 -605184 406528 -263168
6427 -740864 453120 -285184 642048 1307136 -429568 34304 75776 2048 112640 845312
6417 845312 -686592 643584 -366592 -889344 176640 493568 -731136 454144 -24576 299008
6406 66560 -879616 -547840 214016 -231936 322560 622592 -166400 349696 668160 -177664
6395 -586752 -85504 -512000 409088 263168 1064448 32768 -491520 -239104 348160 119296
$$ packed form
6470B45248K16576g1680j19808p51104a18272j249792C50208a96096l43552j06496
6460f46144L19488m23424A52064N64224B81088f97344m30080A76128g51104a69472
6449B66240J26464b99008E4272Q3968f25664A377280c08224I8304J08544m9664
6439A57184K71872N8880j62304O4512c95264k54464p7824J26976m608D06528b63168
6427g40864D53120b85184F42048O65088d29568C4304M1472B048J10592P32672
6417H45312f86592F43584c66592n22752A76640L16928g31136D54144b4576B99008
6406F6560h79616L31776B14016b31936C22560L00032a66400C49696L18464a77664
6395e86752h5504m26496D09088j45920Q01280C2768d91520b39104C48160A19296
$$ plain form
6384 383488 1094656 -550400 -322560 370176 565760 -269824 -18944 -53760 -163328 -417280
6374 -417280 -401920 -577024 504832 -892416 712192 449536 129024 679936 4608 -198656
6363 518144 -816128 323072 566784 -606720 -782336 219136 147968 1888768 119296 -1159680
6352 -839168 -200192 616448 166912 -76800 614912 694272 -85504 291840 646656 -448512
6341 147456 209920 232960 213504 350720 899584 -391168 45568 242688 299520 -41472 -832000
6330 -832000 42496 -407040 247808 11264 166400 -535040 -358400 -765440 -274944 -660480
6320 -660480 -64512 460288 -241664 -512512 427520 82944 486912 -794624 -959488 -586240
6310 -586240 -1060864 -108544 -88064 -275456 653312 -319488 -320000 -954880 -75264 -839680 -664576
$$ packed form
6384C83488P11168e50400K27840C70176J95584b69824a8944l4816j09568k53952
6374d17280J5360j75104E04832h92416G12192k62656A29024N50912D608a98656
6363E18144h16128C23072K43712f06720j75616B19136p1168J740800A19296a159680
6352h39168b00192F16448A66912g6800F14912P9360h5504B91840L54816d48512
6341A47456O2464K3040j9456J37216N48864c91168D5568J97120N6832d1472p90528
6330h32000D2496d07040B47808A1264J55136e35040J76640m07040b74944l85536
6320f60480f4512D60288b41664k70848D27520H2944M03968g94624j64864L73248
6310e86240m74624a08544K0480j87392F53312c19488n12o34880g5264p64416J75104
$$ plain form
6299 -664576 -24576 598016 -66048 -1144320 -338432 1024000 -1001472 370688 -428032 -105984
6288 -956928 -21504 -335872 -186368 -667136 211968 -396288 184832 43008 -306176 -43520
6277 -193536 -600064 -1126912 309248 4608 378880 171520 -280576 -238080 -533504 905728
6266 -101888 474112 102400 758272 -152064 -1168384 -558592 1200128 798720 147456
6256 -450048 -667136 152064 429568 129024 -871936 -914944 -159744 332288 344576 -146944
6245 -80896 310784 797184 -400896 614912 -319488 393728 -628736 9216 -265728 -246784
6235 -246784 207360 -312320 92672 19968 548352 357888 714240 -219648 517120 301056
6225 301056 758272 -620032 -513024 -550400 54272 1228288 49664 274944 245760 433664
$$ packed form
6299f64576b4576E98016f6048j078272c38432A024000a001472C70688d28032a05984
6288i56928b1504l14368J49504m80768B11968c96288A84832D3008c06176d3520
6277a93536m06528n26848C09248D608L74272A71520b80576M2496k95424I05728
6266a01888D74112A02400O55872a52064j016320e58592A200128m01408A47456
6256d50048k17088A52064K77504A29024h71936m3008a59744C32288J2288a46944
6245h0896C10784M86400d00896F14912c19488C93728f28736I216b65728J8944
6235b46784B07360c12320I2672A9968N28384j90464L56352b19648E17120k16064
6225C01056M57216f20032J07008l7376E4272J174016D9664K25280k9184J87904
$$ plain form
6215 433664 -259584 116736 -950272 998400 -104448 29184 326144 854016 379392 -829440
6204 -123904 -448512 -378880 45568 331264 -157696 -287232 -307200 1064448 -408576 -325632
6194 -325632 77824 1011712 108544 -563712 87552 -599552 -430592 81920 651264 -239104
6183 -3072 -81408 343040 438272 -657408 337408 -376320 -307200 65024 -133632 -158720 -1014272
6172 -1014272 -543744 492032 -331776 -206336 -167424 601600 1101312 -130048 -549376 -384000
6162 -384000 -1234944 563712 642048 -676864 -181760 159232 519680 49152 451584 872960
6152 872960 1460224 862720 -193536 -588288 105984 -46592 443904 382464 563712 783872
6142 783872 302080 -202240 -1166848 53248 565760 -113152 -44544 87040 -334336 200704
$$ packed form
6215D33664b59584A16736i50272I98400a04448B9184K96960N27872C79392h29440
6204a23904l24608O9632D5568K85696a57696j29536j9968A064448d08576Q2944
6194c25632G7824R33888A08544e63712H7552e99552J68960H1920N69344b39104
6183c072p8336C43040R5232f57408C37408c76320O9120F5024a33632k5088q55552
6172a014272M70528D92032c31776J25440L8912F01600M99712a30048m19328J65376
6162c84000q50944E63712P8336f76864a81760A59232L60448D9152M02432M21376
6152H72960N87264n97504a93536l94752A05984d6592D43904o1440J81248K20160
6142G83872C02080b02240r64608E3248N12512a13152d4544H7040c34336B00704
$$ plain form
6131 243712 219648 -196096 -212992 -242176 469504 -506880 -48640 355840 -409088 -192000
6120 -246784 -323072 -773120 -247296 -827904 -751104 -1128960 302592 -614400 724992 286720
6109 164352 388608 -346112 -218624 -366592 949760 -283648 598528 179200 -892928 -427008
6098 -905728 313344 -212480 79360 -819712 -122368 -656384 -378368 107520 677888 231936
6087 -65024 990208 -316928 -316928 -89600 170496 614400 -349696 -389120 -1040384 -206336 -782336
6076 -782336 80384 -666624 425984 531968 -99840 563712 720384 -1067520 34816 152576
6066 152576 993280 -948224 -255488 318976 -581120 331776 -138240 -170496 78848 -97792
6055 -999424 1127424 81408 -557056 29184 973824 703488 -768512 323584 -358400 306176
$$ packed form
6131B43712k4064a96096j6896k9184D69504e06880d8640C55840d09088a92000
6120b46784p6288m50048b47296n80608P6800l77856C02592f14400G24992B86720
6109A64352K24256c46112J27488j47968I49760b83648E98528A79200h92928d27008
6098i05728C13344b12480G9360h19712a22368n34016K78016A07520N70368B31936
6087f5024I90208c16928%h9600A70496M43904c49696l9424o51264b06336n76000
6076g82336H0384f66624D25984J05984i9840E63712J56672a067520C4816J17760
6066A52576Q40704i48224b55488C18976e81120C31776a38240l2256G8848i7792
6055i99424A127424H1408e57056B9184R44640k70336g68512C23584c58400C06176
$$ plain form
6044 -471552 121856 -515072 87552 282112 -510976 -550912 671232 694784 686080 385024 -533504
6032 -456192 -231424 763392 -545280 397312 -290816 -841216 975360 -595456 702464 217600
6021 961536 267264 -695296 626688 -260608 576512 -337920 -12800 728576 1173504 546304
6010 250368 534528 -533504 671744 -646144 -119296 404992 230912 221184 392192 -171008
5999 612352 -155136 633856 921600 -366080 -29184 44032 297984 501248 384000 264704
5989 264704 416768 1486848 -279040 5632 54272 443392 248832 -541184 560640 156160
5978 102400 67072 -61952 663040 -580096 -4608 -814592 -312832 -451072 -159744 233472
5967 -216064 -172544 658944 923136 279552 -21504 -131584 -181248 -262656 -477184 419840
$$ packed form
6044d71552A21856e15072H7552J94560e10976l9936F71232K3552q704l01056e33504
6032d56192K24768G63392e45280C97312b90816n50400I75360e95456G02464B17600
6021I61536B67264f95296F26688b60608E76512c37920a2800G28576M44928E46304
6010B50368K84160e33504F71744f46144a19296D04992j74080r728J71008a71008
5999F12352a55136F33856K87744c66080b9184D4032K53952K03264j17248j19296
5989B64704J52064J070080b79040E632M8640L89120j94560e41184E60640A56160
5978A02400l5328f1952F63040e80096d608q09984c12832j38240a59744B33472
5967b16064M3520F58944K64192B79552b1504j10080m9664q1408k14528D19840
$$ plain form
5956 -512000 0 -197632 924672 548352 -18432 876544 96768 -457216 138752 64000 290816
5945 290816 -316416 148992 445440 219136 334336 723968 331776 92672 557568 -118272
5934 -98304 845312 50688 1021440 56832 -777216 -536576 155136 -408576 306176 -228864
5923 -380928 952832 -262656 1119232 730624 -112128 276480 -911360 -209920 -442880 -152064
5912 246272 -359424 343040 1191936 -331776 -244224 299520 -146944 -384000 777216 -375808
5901 -330752 -736256 220160 -481280 -319488 997888 181760 184832 936448 133120 272896
5891 272896 101888 1055744 -881152 -759296 915968 385024 -944640 1006080 378368 -334336
5880 -1361920 702976 220672 849408 -570368 -832000 430592 1289728 -379392 -844800 123904
$$ packed form
5956e12000@a97632I24672l76320a8432H76544I6768d57216A38752F4000K26816
5945B90816c16416A48992K96448B19136J15200L89632C31776I2672M64896a18272
5934i8304H45312E0688R70752E6832g77216K40640A55136d08576C06176b28864
5923c80928I52832b62656A119232l88608a12128B76480i11360b09920k32960a52064
5912B46272c59424C43040Q48896c31776Q7552B99520a46944k37056G77216c75808
5901c30752m05504B20160d81280J61792I97888A81760L072P51616A33120J39776
5891B72896A01888R53856h81152J21856I15968C85024i44640A006080C78368c34336
5880a361920G02976B20672O28736e70368k61632D30592Q59136c79392m65408A23904
$$ plain form
5869 -371712 -158720 230912 290304 1019904 256000 76800 -128000 51712 753152 282112
5858 -546304 4096 982016 842240 -21504 446464 -291328 498688 -138240 -514560 670720
5847 -450560 -12288 997376 200704 -265728 72704 -192512 -1005056 67584 -7168 13312 489984
5836 489984 -331776 -215552 -38400 443904 -250368 412672 214528 -475648 131072 -4096
5825 72704 377856 156672 -583168 568320 268288 738304 -769536 -101888 691712 327168
5814 -517120 -359424 -133120 -64000 -752128 -190464 275456 82432 765440 -292864 -467456
5804 -467456 -407552 -186368 -74240 18944 74752 -504320 -686080 -372224 505344 563712 -529920
5792 130560 114176 72192 129024 -186880 -1155072 -26112 32768 -647168 219136 137216 -321024
$$ packed form
5869c71712a58720B30912N9392P29600B56000G6800a28000E1712P01440B82112
5858e46304D096R77920j39776b1504D46464b91328D98688a38240l76320F70720
5847d50560a2288I97376B00704b65728G2704a92512q12544F7584g168A3312M76672
5836D89984c31776J16224c8400D43904b50368D12672j98144d75648A31072d096
5825G2704L05152A56672e83168E68320B68288M70016g69536a01888F91712C27168
5814e17120J57696a33120f4000o88128a90464B75456H2432O83008b92864j74592
5804d67456N9904a86368g4240A8944N5808e04320j81760L13856E05344N8368e29920
5792A30560j6384m1984N6832a86880r68192b6112C2768f47168B19136q1920c21024
$$ plain form
5780 -644096 601600 -495616 994816 362496 -10240 48640 603136 24576 -412160 38400
5769 650240 129024 533504 -136704 487424 -314368 529920 -414720 602112 249856 882176
5759 882176 906752 -32768 -752128 -259072 -551424 -119296 18432 -704512 193024 163840
5749 163840 1140736 -75264 -62976 -408064 321024 258560 -720896 270336 347136 -95744 -580608
5738 -580608 -1231360 803840 -600576 -33792 634368 -215040 581120 615424 -89088 463360
5727 -324608 -408576 -747008 437248 344576 -37376 -174080 -193024 -46080 -131584 737280 -777216
5715 -120320 -908288 479744 -431616 265728 -893440 -1400320 642560 178688 96768 -1581568
5704 -372736 1171968 -1540096 1489920 764416 -436736 619520 1259008 1020416 -77824
$$ packed form
5780f44096F01600d95616I94816C62496a0240D8640N54496B4576d12160C8400
5769F50240A29024M04480a36704D87424c14368E29920d14720F02112B49856O32320
5759H82176K4576c2768p19360b59072k92352a19296A8432g04512A93024k9184
5749A63840R76896g5264J2288l45088C21024o2464g20896B70336P6800i5744m84864
5738e80608o50752H03840f00576c3792F34368b15040E81120L4304h9088D63360
5727c24608q3968l38432D37248r2672c7376j36704j8944d6080q5504G37280g77216
5715a20320p87968D79744d31616B65728h93440n06880F42560A78688q1920a581568
5704c72736A171968a540096A489920p25504d36736F19520O39488k38592g7824
$$ plain form
5694 414720 391168 1224192 363008 497664 775680 -1141248 730112 306688 155136 236032
5684 236032 224768 -792576 270848 809984 -208896 -126976 222208 -864768 689152 -477184
5673 -327168 967168 -276480 -155136 687616 -821760 1353728 -395776 -809472 610816 617472
5663 617472 514048 -769024 1155584 888832 -676864 796672 -469504 269824 1119232 185344
5652 -293888 904192 825856 -732160 474112 88576 -363008 285184 250880 -537600 -584704
5642 -584704 251392 939520 -1078272 -54784 910848 -305152 1073664 101376 221696 -369664
5631 813568 10752 -265728 452096 -104448 863232 249344 647168 252416 1118720 -35328
5620 181248 1022976 -278016 -74240 960000 766976 -820224 -60928 193024 305664 660992
$$ packed form
5694D14720k3552Q33024C63008J34656K78016a141248G30112C06688j51552Q0896
5684B36032j1264g92576B70848N39136b08896Q1920B22208h64768F89152d77184
5673c27168I67168b76480J21344F87616h21760A353728c95776m13696F10816O656
5663F17472j03424g69024A155584k66752f76864G96672d69504B69824Q49408A85344
5652b93888I04192p8336g32160D74112H8576c63008B85184l4304e37600m7104
5642e84704B51392O88128a078272e4784I10848c05152A073664A01376J20320c69664
5631H13568A0752b65728D52096a04448H63232B49344L97824B52416Q66304c5328
5620A81248Q41728b78016g4240I60000j93024h20224f0928A93024J12640L55328
$$ plain form
5610 660992 130560 -582656 453120 -114688 -522240 779776 -817152 -450560 -873984 -41984
5599 -152064 348672 136192 508928 -351744 51200 812544 300032 104448 349696 -339968
5588 69632 1304064 -29696 375296 616448 312832 -345600 -325120 54784 -48640 -747008
5578 -747008 1293312 718848 -16896 575488 -884736 -157696 450560 1430016 -1013760 -330240
5567 386048 1292288 216064 360448 943616 261632 848384 278016 293888 -742400 322560
5556 -115712 146432 634368 -20480 1345024 202752 -627200 909824 934400 1639424 312832
5545 -31232 470528 -304128 393728 83456 128000 1008640 963072 -458752 595456 -652800
5534 987648 52736 -204800 -252416 -864256 -228864 -162304 660480 481792 946688 485888
$$ packed form
5610F60992A30560e82656D53120a14688m07552G79776h17152L66592m23424d1984
5599a52064C48672A36192L72736c51744E1200P61344C00032A04448K45248c39968
5588F9632J234432b9696C75296K41152l03616c45600K0480E4784d8640o98368
5578g47008A293312n74464a6896E75488h84736a57696D50560R79456a013760c30240
5567C86048R06240B16064J44384N83168B61632N86752B78016J5872g42400C22560
5556a15712A46432M87936b0480A345024B02752f27200I09824K4576P05024C12832
5545c1232D70528c04128C93728H3456M4544Q80640m5568d58752E95456f52800
5534I87648E2736b04800m7616o11840b28864O6560F60480j78688M64896m60800
$$ plain form
5524 485888 223744 1013248 192000 290304 -26112 405504 -358912 777728 471552 229888
5513 -171520 135680 1359872 -352768 1060352 184832 173568 871424 1077248 81920 -80384
5502 782848 800256 904704 687616 937984 -25600 665600 1986048 31232 1605632 449536
5491 -56320 1807872 335872 1263104 -58368 1499136 935424 198656 382976 560640 1135616
5481 1135616 87552 56320 432640 -107008 305152 340992 -430592 766464 -280576 -981504
5471 -981504 -245760 66560 -859648 691200 138752 -109056 490496 1124352 -810496 -75264
5460 1659392 -538112 -51200 413184 564224 528896 -459264 54784 359936 79872 -146432
5449 409600 -267264 -89088 225792 -459264 -523776 -464896 -67072 128000 -146432 -137728 -709632
$$ packed form
5524D85888B23744P89504A92000R8304b6112D05504c58912G77728l06176B29888
5513a71520A35680J224192c52768A060352A84832j1264O97856K05824H1920h0384
5502G82848J7408J04448k17088K50368b5600F65600J320448C1232J574400D49536
5491e6320A807872C35872R27232e8368A499136n63712A98656J84320J77664N74976
5481A135616H7552l1232L76320a07008C05152L5840d30592G66464b80576p00928
5471i81504b45760F6560h59648F91200A38752a09056D90496O33856h10496g5264
5460A659392e38112e1200D13184J51040l5328d59264E4784L05152G9872a46432
5449D09600b67264h9088B25792d59264o4512N8880f7072A28000a46432Q704n71904
$$ plain form
5438 -709632 169472 262144 -368640 320000 629760 543232 -104960 842752 -7680 -616448
5428 -616448 653312 160768 361984 676352 975872 433664 -580096 1044992 449536 741888
5418 741888 -123392 728576 330240 913408 17920 342016 352768 1088512 -114176 735744
5407 632320 -531968 -9728 -317440 163840 359936 429568 943104 -226816 538112 624640
5397 624640 930816 1350656 94208 -140288 684032 868352 513536 431616 71680 353792
5387 353792 1385472 982016 207360 1123840 -367616 190976 203264 557568 375296 1141760
5377 1141760 702464 1511936 284672 1059840 1278976 92672 1591808 66560 873472 628224
5367 628224 997888 1126400 628224 813568 272896 719360 1336832 1453056 1425408 1620992
$$ packed form
5438g09632A69472R2672c68640C20000L09760q6528a04960H42752g680o08768
5428f16448F53312A60768K01216L14368K99520D33664e80096A044992D49536K92352
5418G41888a23392G28576C30240N83168A7920L24096J0752P35744a14176G35744
5407F32320e31968i728l07712A63840J96096O9632N13536b26816E38112Q6528
5397F24640L06176M19840I4208a40288F84032J84320l54816q1920G1680K82112
5387C53792J031680m03456B07360R16480c67616A90976J2288L54304j82272P66464
5377A141760m39296Q09472B84672P75168K19136I2672J499136F6560Q06912k45248
5367F28224L69664J28512m98176J85344B72896M46464O17472J16224k7648J95584
$$ plain form
5357 1620992 -71168 600576 692736 625664 624128 359936 159744 769024 551424 388096
5347 388096 1779712 342528 1745920 -223232 227840 1156608 1739264 986112 1224704
5338 1224704 175616 854528 953344 805888 1117184 1218560 951296 90624 106496 882688
5328 882688 880128 799232 1295872 1767424 475648 436224 581632 679424 999424 478208 54784
5316 550912 639488 1037824 331264 1521664 1237504 732672 493056 184320 520192 702976
5306 702976 1200128 1607680 930304 802816 314368 768512 375808 1296896 17408 916480
5296 916480 1451520 1168384 344064 399872 207872 756736 -426496 -327680 336896 -617472
5285 162816 517120 430080 532480 513536 421888 677888 771072 -1467392 -17408 628224
$$ packed form
5357A620992g1168F00576R2160o7072j536k64192A59744O09280k17600j63328
5347C88096J391616C42528J403392b23232B27840R28768N82656p53152K38592
5338A224704A75616O78912R8816j47456L11296J01376k67264I0624J5872P76192
5328H82688k560q0896M96640M71552D75648l9424J45408R7792L20000D78208E4784
5316E50912Q8576L98336C31264J190400k84160n04832k39616A84320L35872J82784
5306G02976M97152M07552o77376j27488C14368M54144C75808R21088A7408Q99072
5296I16480N35040k83136C44064N5808j92000N48864d26496R8816C36896f17472
5285A62816L54304q7040J02400j8944r1648K56000R3184a467392a7408F28224
$$ plain form
5274 -721920 -91136 374272 -5632 221184 182272 566784 375296 765440 -2048 -639488 1267200
5262 647168 813056 218624 88064 647680 441856 -18432 819200 408064 819712 342528
5251 -77824 280576 183296 836096 72192 797184 547328 -174592 383488 249856 -436736
5240 -450048 -175616 366080 921600 -1259008 657408 -174080 697856 1592832 -39424 -1035264
5230 -1035264 458240 35328 -140800 133120 -129024 51200 286720 699392 621056 -657920
5219 -673792 159232 1058304 565248 191488 -178176 644096 992768 705536 -241152 236032
5208 924672 411648 -754688 -517632 -845824 -86528 757760 287744 651776 -1270272 95744
5197 -152576 -88576 408576 46080 84480 863232 1389056 474112 1393152 430080 637440
$$ packed form
5274g21920i1136C74272e632B21184l8912L84512j91488L90144b048o37440A267200
5262F47168J65888B18624H8064N59616k05824a8432H19200D08064M11648C42528
5251g7824B80576r7280O52800G2192P24992k49856a74592C83488j33632d36736
5240d50048a75616C66080N55520a259008F57408a74080F97856Q94976c9424r95840
5230a035264D58240C5328a40800A33120a29024E1200K35520M12672p8336f57920
5219f73792A59232Q99072m93056A91488a78176F44096L48672k87232b41152B36032
5208I24672D11648g54688K37056l28192h6528G57760B87744L64032a270272I5744
5197a52576O4000D08576D6080L8400P78752N25824D74112R19040D30080K07360
$$ plain form
5187 637440 740352 142336 535552 -1089024 -509952 -140800 734720 -270336 650752 39424
5176 562176 713728 -90624 -246784 1057280 -824832 638464 467968 454656 -331264 -486912
5166 -486912 258048 -303616 1428992 559616 1065472 -414720 599552 359424 -31232 -132096
5156 -132096 -122880 340480 -951808 815616 122368 1263104 410112 -324096 892928 1182208
5146 1182208 -157696 564736 662528 920064 -104960 1425408 783872 -58368 243200 1156096
5136 1156096 442368 361472 -498688 -46592 -210944 1804288 521728 1066496 31744 1503744
5126 1503744 -172032 152576 57344 1725952 35328 410112 398336 450048 -481280 -178176
5115 1697280 216064 240640 528384 133632 614400 1164800 169984 332288 114176 -461824
$$ packed form
5187F37440J02912A42336L93216a089024e09952a40800G34720b70336F50752C9424
5176E62176J51552i0624j56160A057280h24832F38464j70496j3312c31264j55648
5166d86912B58048c03616A428992E59616N05856d14720E99552k40128c1232j00864
5156a32096R216C40480i51808H15616A22368J140736D10112c24096H92928K89280
5146A182208a57696E64736R7792K57536a04960A425408o41536e8368B43200R12896
5136A156096D42368q0896d98688d6592j64352A804288E21728N44768C1744J472000
5126A503744a72032A52576E7344J668608C5328L74784j1776N1712d81280a78176
5115A697280B16064K4576K87744A33632M80768N50400A69984J62304A14176d61824
$$ plain form
5104 460800 565760 1144320 147456 5632 1539584 238592 1008128 503808 1349632 75264
5093 111104 950272 1126912 188416 1191424 603648 787968 1881600 607744 124416
5083 928768 809472 2316288 1152000 1595392 1762304 869888 820736 397824 817664 79360
5072 -39936 1742848 244224 36352 731136 -61952 82944 628224 396288 952320 -398336
5061 724992 965632 -291840 -163840 26624 -132608 -30208 202240 221696 521728 -206848
5050 390656 1027072 242688 1021952 1621504 -712704 840192 60928 262144 1072128 731648
5040 731648 300544 -181760 275968 375808 1015296 901120 759808 560128 1190400 672256
5030 672256 860672 74752 561664 1489920 913408 141824 -86528 -491520 138752 278528
$$ packed form
5104D60800J04960N78560A47456E632J533952B38592P69536E03808Q45824G5264
5093A11104Q39168J76640A88416J003008n87776J84320J093632F07744A24416
5083I28768j19296J506816A152000M43392J66912H69888m9152C97824M19840G9360
5072c9936A742848B44224C6352O94784f1952H2944N45280k31936N56032c98336
5061G24992K40640b91840J28000B6624a32608c0208B02240J9456L00032b06848
5050C90656O36416B42688P79264N99552g12704H40192F0928K01216Q09984l40480
5040G31648C00544a81760B75968R9840O39488j14176j41312j99680O30272n18144
5030F72256J88416G4752M86912R28256n76512A41824h6528m04992A38752J39776
$$ plain form
5020 278528 724480 -499200 929280 -54272 1236480 1199104 396288 -748544 538112 320512
5010 320512 443392 140800 5120 -365056 -382464 -80384 530944 355328 -14848 -350720 -102400
4998 1349120 347136 -370176 -331776 581632 421376 -178176 1080832 190464 773120 248320
4987 -292864 883200 1344000 861184 231936 -322560 51200 -371200 402944 1174016 -194560
4976 652288 329728 876544 524800 944128 662528 -96256 1004032 833024 -677376 926720
4965 -497664 658432 705024 1079296 1027584 529408 -238080 100864 211968 1224192 -33792
4954 648192 -55296 228352 1202176 1201664 1484288 127488 390656 1691648 430080 435712 811008
4943 811008 562176 532992 -214528 1973760 72704 1225216 1229312 -381440 1040384 1574912
$$ packed form
5020B78528M45952d99200I29280e4272A236480l7376C96288g48544E38112k17600
5010C20512J22880A40800E120c65056j7408h0384E30944j75616a4848l35872a02400
4998A349120C47136c70176L8400E81632j60256a78176A080832A90464N82656B48320
4987b92864H83200M60800m82816B31936c22560E1200c71200D02944P71072a94560
4976F52288l22560N46816l51744M19328k81600i6256A004032j71008f77376I26720
4965d97664F58432M6592L74272n1712m98176b38080A00864J11104J012224c3792
4954F48192e5296B28352R73824n12K82624A27488K63168J300992D30080N632L75296
4943H11008k48832k9184b14528A973760G2704J152512M096c81440A040384N34528
$$ plain form
4933 1574912 1083904 824832 146944 258048 23040 1158144 1234432 210944 1311232 59392
4922 1040384 706560 240640 571904 739328 -182784 952320 92160 598528 -264192 500736
4911 303616 1198592 738816 462336 -456192 567808 1294336 1340416 -12288 1221632 1815552
4901 1815552 441856 706048 885760 1057280 481792 690688 631808 1627136 375808 382464
4891 382464 1087488 1001984 -106496 808448 685056 1116160 558080 840192 1189888 901632
4881 901632 247296 1243136 -217600 -184320 119808 -122880 971776 1492992 406016 491520
4871 491520 394240 -291840 1012224 255488 278016 1118208 804352 1267200 1240064 1827328
4861 1827328 284160 363008 416768 245760 773632 405504 -117248 1245696 528384 367616
$$ packed form
4933A574912m91008k59072A46944J11104B3040J135104P6288B10944J100288E9392
4922A040384l33824B40640L31264J67424a82784I52320I2160N06368b64192E00736
4911C03616Q94976m59776k76480d56192E67808P26528M6080a2288A221632N93920
4901A815552D41856K64192J79712J71520D81792K08896n8880R95328C75808O656
4891C82464P05024q5504a06496H08448j23392M31104E58080K82112L49696k88256
4881I01632B47296R95840b17600L3280A19808a22880I71776N21216D06016Q5504
4871D91520r7280b91840A012224B55488K2528Q40192l13856M62848k7136N87264
4861A827328B84160P8848N3760j71008N27872l68128a17248A245696E28384j60768
$$ plain form
4851 367616 -154624 901120 1246208 405504 994816 1556480 405504 -41472 561664 1484800
4841 1484800 1131520 630272 1464320 1681920 1489920 1482752 1655296 1058816 957440 2529280
4831 2529280 2299392 2693120 2363904 3807232 3384832 3929088 5327360 4578304 5242880
4822 5242880 3072512 3097600 3096576 2673664 3050496 2093568 1180160 147968 1157632 1070080
4812 1070080 153088 784384 2019328 1232896 209920 131072 731136 521728 472576 1212416
4802 1212416 1641472 125952 817664 900096 792576 405504 556544 43520 245248 -487424
4791 1235968 1026560 204288 498688 143872 529408 446976 754176 607744 1139200 595968
4781 595968 124416 1340928 149504 1213440 452608 1216512 444416 656896 93184 1136640
$$ packed form
4851C67616a54624I01120L45088D05504N89312N61664D05504d1472E61664R23136
4841A484800l53280n01248Q34048K17600j92000p168J72544n96480j01376J571840
4831B529280k29888L93728l29216J443328m22400N44256J398272p49056O64576
4822E242880k170368K5088j024m22912L76832r56928r13408A47968J009664q7552
4812A070080A53088O31296J234944p86432B09920p8848O00064k09408m9152P39840
4802A212416M29056A25952O91712Q2432j07520l87072J51040D3520K01728d87424
4791A235968k09408B04288K94400A43872L85536q2432L07200j46432N31456n43232
4781E95968A24416J216512A49504J063936D52608P63904D44416K12480I3184J043456
$$ plain form
4771 1136640 305152 113152 290304 -299520 -173056 197632 604672 -400896 733184 408064
4761 408064 1225216 764416 70144 463872 1409024 -142848 35840 891904 1140736 1451008
4751 1451008 -61952 627200 1294848 1000960 1561600 203264 342016 886272 530432 933376
4741 933376 395264 152064 2205184 921088 861184 32768 56320 1071616 821248 1356800
4731 1356800 1896448 1591808 265216 -77824 661504 2160640 943616 -153088 746496 335360
4720 239104 -735232 1596416 991744 640000 817664 764416 158208 1220096 755200 723968
4710 723968 7168 1330176 541696 557568 -854528 148480 367104 734208 119296 1632768
4700 1632768 1441792 160256 421888 262144 -207872 926208 -232960 736256 805376 1598976
$$ packed form
4771A136640C05152A13152J77152b99520J26464A97632M07040d00896G33184l25120
4761D08064Q17152m60800G0144L93728R45152a42848C5840Q56064K48832L10272
4751A451008f1952F27200O67648k93888N60640B03264J38752N44256l55840M02944
4741I33376C95264A52064K053120I21088n9904C2768K3552J015296k50368N35552
4731A356800N39648l04640B65216g7824F61504J499136I43616a53088G46496C35360
4720B39104g35232A596416o04672l51744J77664n3248A58208J061888m64896l1232
4710G23968G168J323008E41696J5872h54528A48480K18624L67104A19296J513472
4700A632768j90976A60256K61632j59744b07872I26208b32960G36256O9120P93600
$$ plain form
4690 1598976 -79360 848384 -95744 -76800 1572352 526336 -404992 -163328 667648 1916928
4680 1916928 584192 1303040 -377344 1496576 556544 1753088 966656 1568768 1438208
4671 1438208 270336 763904 601600 932352 2312192 743936 723456 1552384 912896 1702912
4661 1702912 846848 1196032 216576 -199680 742400 1375744 1060864 -220160 1328128
4651 1063424 1467904 1307136 2071552 1249792 580608 1004032 1153024 806912 1630720 72704
4640 1443840 1161216 1519616 494592 503296 1584640 897024 332288 -407040 1504768 1602560
4630 1602560 1031168 1404928 957952 1492480 753152 236032 693248 933376 367104 1464320
4620 1464320 946176 1689600 1789440 937984 1026560 1079808 898048 130048 1290240 1293824
$$ packed form
4690A598976g9360H48384i5744J8944A572352E26336d04992a63328F67648J249280
4680A916928E84192P18848c77344A496576E56544J196544p86432O02112j30560
4671A438208B70336M93568j62304L30752J379840G43936k0480Q28928o39488P90016
4661A702912H46848L49184B16576a99680G42400O33344l14880b20160A328128
4651A063424M04480j60768P64416q21760E80608M23424J48992l46112Q23808G2704
4640A443840k82624L58400D94592Q704J081344o87616C32288d07040A504768R7792
4630A602560n71392L73760m46976N34528p39328B36032M57216K40128C67104J097216
4620A464320n18144P43424R9840q51456Q8576N3248j81760A30048J160192L584
$$ plain form
4610 1293824 93696 1395712 1871360 936960 124416 334848 1148416 1862144 1098752 1700352
4600 1700352 804352 1524736 1271296 1181696 793600 1191936 431104 656384 911872 930304
4590 930304 -82432 109056 987136 322560 897024 1149952 1377792 1082880 201216 1170432
4580 1170432 1032704 1118208 795648 283648 1365504 2255360 1082880 1382400 2351616
4571 2351616 722432 1841152 2212864 1413120 1574912 1766912 2084352 1745920 2735616
4562 2735616 1197056 1690624 1885696 1555968 2680320 1752576 2266624 2403840 3014656
4553 3014656 1142272 1060352 1324544 806912 2131968 941568 1017344 1352704 1933824 1540096
4543 1540096 1249792 1285120 1024000 631296 1802240 1946112 2227712 2158592 1954816 841216
$$ packed form
4610A293824I3696J302016M75648r34400A24416K10432Q13568P13728p63392O01600
4600A700352H04352P20384k53440q9600l88096L98336D31104K25280K55488J8432
4590I30304h2432A09056Q78080C22560N74464K52928K27840k94912B01216R69216
4580A170432j37728Q5504l22560B83648J081856Q89856A082880K99520R69216
4571B351616G22432J118720L71712p99744J61792J92000L17440l38432R89696
4562B735616A197056M93568J95072l29728J124352r27744N14048J37216O10816
4553C014656A142272q1920K64192n17632J325056I41568P5776L35360N81120l93728
4543A540096k90304L5328k61120l92704J170944J43872K81600o9120k03776H41216
$$ plain form
4532 1546752 1782784 551936 1897984 1854464 1841152 1344000 1680896 2004480 1138688 582144
4522 582144 1935360 1408000 1375744 1592320 1853440 2098176 1395200 2547712 1757184 2412544
4512 2412544 1801216 492032 1169920 304640 2370560 1086464 740352 1153536 1431552
4503 1431552 1289216 707072 384512 874496 1331200 1594368 921600 1013760 594432 433152
4493 433152 705536 1371136 880128 1087488 905728 998912 527360 1026048 1101312 584192
4483 584192 900608 440832 734720 276992 1014784 220160 1058304 1434112 786944 1688064
4473 1688064 447488 1986048 1266688 855040 1702400 74240 795648 1921536 716288
4463 920576 806912 855040 2238464 848384 1103872 930304 1760256 1297920 960000 1081344
$$ packed form
4532A546752K36032E51936J346048m3520j3312m97152L36896L23584q65792n56544
4522E82144J353216n27360l2256K16576K61120K44736p02976J152512p90528O55360
4512B412544o11328D92032O77888C04640K065920A086464l46112M13184K78016
4503A431552j42336n82144l22560M89984M56704K63168o72768R2160m19328j61280
4493D33152K72384O65600m91008K07360j81760R3184m71552M98688P5264n17120
4483E84192L16416D40832K93888B76992P37792B20160Q38144L75808o47168R01120
4473A688064D47488J538560p19360m11648Q47360G4240P21408J125888G16288
4463I20576j13664M8128J383424H48384K55488j73568Q29952m62336l37920J21344
$$ plain form
4453 1081344 1216000 486400 944640 1761792 1264128 846848 1671680 1174528 1321984 1845248
4443 1845248 681472 1711104 1680896 1348096 1175040 1572352 1978368 1753600 2093568 922112
4432 1001472 1391616 2253824 1782784 1570816 3100160 1469952 1545728 1405440 1909248
4423 1909248 2007552 2157056 2180096 1286656 2084352 1604096 2332672 2188800 1679360 1798656
4413 1798656 2118656 1815552 1409536 2141184 1877504 2240512 1529344 2046976 1683968 478720
4402 1606144 1431552 2159616 2034688 1968640 1255936 776192 1517568 958464 1033728 1131008
4392 1131008 343552 1379840 969728 2365440 1840640 890880 1532928 1898496 1769472
4383 1769472 1596416 1623040 1639936 1538560 1504768 1697792 1284608 1924608 893440 1228288
$$ packed form
4453A081344J34656D86400M58240Q17152m97664m17280Q24832m97152J47456N23264
4443A845248F81472J029632l0208l32800j73056L97312M06016k24768L39968I22112
4432A001472L90144Q62208m71040k11968J529344A469952P5776j40288N03808
4423A909248R8304J49504K3040q93440P97696m80256P28576j43872n09440J19296
4413A798656L20000l03104m06016P31648k63680L63008p11168N17632l63008D78720
4402A606144j74592P28064j24928o6048p12704m79744P41376n59104P5264R7280
4392A131008C43552J036288m10112J395712n24800H90880O42048L65568j29024
4383A769472j73056K6624J6896j01376l3792J93024m13184O40000H93440L34848
$$ plain form
4373 1228288 1183232 1464320 1617920 1318400 2240512 1204736 1621504 2247680 547328 2324480
4363 2324480 1885696 1520640 2342400 1554944 1659392 751104 851968 2312192 2193920
4354 2193920 1579008 1247232 1404928 851968 925184 1056768 1400320 981504 1167872 1497600
4344 1497600 1021440 823296 733184 1004544 1522688 1095680 656384 1062912 586752 1457664
4334 1457664 1433088 1165824 1096704 1456640 1534464 997376 531456 1293824 1744896 1957376
4324 1957376 738816 1284608 961536 1178112 1539584 674304 1807872 1932800 1743872
4315 1743872 1542656 2245120 1241600 727040 2663936 1642496 2449920 2888192 1893376
4306 1893376 1956864 1696768 1139712 1653760 1618944 1393664 1479680 1236480 1412096 562176
$$ packed form
4373A228288m5056K81088J53600k99520R22112j035776M16768O26176E47328J777152
4363B324480m38784l65056Q21760p87456J04448G51104J00864J460224j18272
4354B193920o14912l31776J57696n52960P3216J31584L43552m18816J86368L29728
4344A497600m76160j98144r0112K71360N18144m27008m39296M06528m76160Q70912
4334A457664k4576k67264o9120L59936P7824n37088m65920P62368M51072K12480
4324A957376G38816N45792l23072K16576L61472F74304J133568J24928j88928
4315A743872k01216P02464j003520n14560J936896j021440Q07424M38272r94816
4306A893376O3488k60096n57056N14048l4816k25280Q6016k43200J75616E62176
$$ plain form
4295 1469440 1961984 1316352 91136 974848 1488384 917504 1630208 622592 1397248 1948672
4285 1948672 1262080 1648640 1138688 1989120 728576 1163776 1249792 1210368 1221120 1849344
4275 1849344 1392128 1097216 2348032 1750016 1587712 1487872 1862144 2847232 1951232 1323008
4265 1323008 2389504 1609728 2637312 2206208 1175552 952832 1490432 873472 1718784
4256 1718784 1293824 1793024 1535488 1179648 1176576 1404416 2447360 1691648 2388992 2220544
4246 2220544 3243008 1471488 1875456 1215488 903680 1522688 788480 1823744 1272320
4237 1272320 1383424 1153024 710656 1735680 1196544 1628160 1081344 1353728 1226240
4228 1226240 1114112 236544 694272 718848 1346560 1481728 785920 1830912 1038336 1067520
$$ packed form
4295A469440M92544o45632I1136Q83712N13536n70880P12704F22592P74656N51424
4285A948672o86592L86560n09952Q50432G28576M35200Q6016l9424J0752O28224
4275A849344m57216k94912J250816n98016j62304r9840L74272R85088q96000o28224
4265A323008J066496p79776J027584m31104j030656k22720N37600o16960Q45312
4256A718784m24960M99200k57536l55840l072K27840J042944p55712O97344j68448
4246B220544J022464A471488M03968o59968l11808O19008p34208J035264n51424
4237A272320J11104k30400m42368J025024n39136M31616n46816K72384j27488
4228A226240j12128B36544M57728K4576O27712J35168o95808J044992p92576K9184
$$ plain form
4218 1067520 804864 370688 1880576 1474048 854016 1915904 437248 1216000 25600
4208 1124864 1769984 1111552 893952 884736 1224192 910848 1464832 1058816 1847296 2265600
4198 2265600 953856 1703424 1688576 1263616 1538560 734208 1437696 1267712 2462720 1168384
4187 990720 2199040 1610240 1143296 1055232 2324480 1216000 1321472 2307072 1392128
4178 1392128 1200128 1497088 794112 1214464 1713152 1871360 1248256 1609728 2403840 1854464
4168 1854464 1659392 1690112 978944 1157632 2260992 1524736 1829376 -122368 1911808
4158 2079232 1632256 3026944 2050048 1279488 2042880 2799104 1750528 1035264 2168832
4149 2168832 1674240 1600512 2407936 2859008 2126336 1774080 1766912 1863680 2213376 2430976
$$ packed form
4218A067520k62656C70688J509888m06528o20032J061888D37248P78752B5600
4208A124864O45120o58432k17600r216L39456l13344N53984m06016P88480M18304
4198B265600I53856P49568j4848m24960K74944G34208P03488j69984J195008A168384
4187I90720J208320n88800m66944q8064J269248j108480J05472R85600r14944
4178A392128j92000K96960p02976M20352M98688J58208o23104L61472P94112n49376
4168A854464j95072L0720p11168J78688J103360p36256L04640a22368A911808
4158B079232m46976J394688r76896p70560P63392P56224j048576p15264J133568
4149B168832m94592p3728Q07424M51072p32672l52256p168R6768L49696K17600
$$ plain form
4139 2430976 2218496 2388992 2147840 2548224 2414080 2280960 2318848 2274816 2498048 2504704
4129 2504704 1500672 2520064 1373696 2794496 1807360 1466880 1506304 1658368 2060288
4120 2060288 2445824 3265536 2077696 2372608 1947136 2531840 1627648 2128384 1802752
4111 1802752 1221632 2352128 927744 1870336 773632 1417216 2206208 1764864 1112576
4102 1112576 2560000 1972224 2792448 2008576 2192896 1658880 8219136 2266624 2010112
4093 2010112 1701376 2025984 2500608 2690048 2553344 2664960 2013184 3156992 3059200 2950656
4083 2950656 2797056 3021824 2481152 2856448 2163200 2487296 2585088 3185152 1937920 2570752
4073 2570752 2617344 1543680 2871808 2330112 1979392 2075136 1903616 2316288 1482240 1622016
$$ packed form
4139B430976k12480J70496k41152M00384j34144j33120L7888m4032K23232O656
4129B504704j004032J019392j146368J420800r87136l40480L9424J52064M01920
4120B060288L85536Q19712j187840K94912m25472N84704r04192N00736l25632
4111A802752n81120J130496I27744R42592G73632O43584P88992m41344o52288
4102A112576J447424n87776Q20224p83872J84320n34016O560256B266624k56512
4093B010112l08736L24608M74624J89440j36704J11616o51776J143808r7792j08544
4083B950656j53600K24768n40672L75296o93248L24096R7792O00064j247232O32832
4073B570752M6592j073664J328128n41696l50720R5744j71520M12672q34048J39776
$$ plain form
4063 1622016 1773568 1850368 2416128 2108928 1726976 1286144 2243072 2020352 1654272 2678272
4053 2678272 1985536 1925120 2678272 2369536 2692096 1807360 2015232 1446400 2788352 1932288
4043 1932288 1595904 2582016 2737152 2043904 2536960 1724416 1752064 2225664 1167872 2092032
4033 2092032 2046464 965632 1548288 2128384 1271296 1315328 2290688 1894400 2485248 2383872
4023 2383872 1299456 1940992 2409984 2746880 1659904 2205696 2990080 2596352 2995200
4014 2995200 2785280 3326464 2441728 3493888 2828288 1867264 2856448 2230272 2150400 2051584
4004 2051584 1762816 2518016 1873920 2397696 2519040 2018816 2670080 2850304 2557952 2201600
3994 2201600 1006080 2343424 2496512 2080768 2360832 1112576 1768448 1868800 1112576
$$ packed form
4063A622016J51552P6800N65760l07200l81952m40832R56928k22720l66080J024000
4053B678272o92736o0416P53152l08736L22560q84736K07872n68832J341952q56064
4043A932288l36384R86112J55136o93248M93056q12544K7648M73600j057792R24160
4033B092032m5568I65632N82656N80096q57088M4032R75360l96288N90848j01376
4023B383872j084416O41536M68992L36896j086976N45792P84384l93728L98848
4014B995200k09920N41184q84736J052160o65600r61024R89184o26176p9872r8816
4004B051584k88768P55200o44096N23776J21344n00224O51264J80224k92352l56352
3994B201600A006080J337344J53088m15744K80064A112576O55872J00352p56224
$$ plain form
3985 1112576 1173504 1874944 998400 55808 1624576 1108480 1854976 1904640 1231360 -63488
3974 622080 723456 1606656 1986048 912384 1267712 1059840 688128 1159680 1521152 2379264
3964 2379264 1212928 2155008 475136 619008 1641472 1878016 1354240 1090048 731136
3955 731136 2186752 1336320 2117632 1541632 966656 1613824 1112064 1324032 996864 1598464
3945 1598464 2446848 2120192 1172992 731136 674816 1076736 1844736 802304 1543680 1504768
3935 1504768 2252288 884224 1009664 1246208 1180160 2092032 911360 2514944 2562048 2972672
3925 2972672 2235392 2061824 2472960 2205696 3202560 2929664 2810368 1722368 2711552
3916 2711552 3207168 4251648 3146240 2104320 2811904 4215808 3560960 3844096 4259840
$$ packed form
3985A112576O0928P01440q76544E5808J568768n16096P46496M9664o73280f3488
3974F22080J01376Q83200L79392I12384L55328k07872l71712M71552L61472Q58112
3964B379264j166336R42080D75136J43872J022464K36544n23776k64192l58912
3955G31136J455616q50432P81312n76000n74976O47168n01760K11968l27168O01600
3945A598464Q48384l26656r47200m41856n6320M01920P68000H02304P41376l8912
3935A504768P47520H84224J25440K36544o6048R11872I11360J603584M7104M10624
3925B972672p37280j73568M11136k67264R96864k72896j19296j088000R89184
3916B711552M95616J044480j105408j041920P07584J403904o54848K83136M15744
$$ plain form
3907 4259840 3629568 4392960 5022720 4111360 5992960 4276736 4935168 5848064 6246400
3898 6246400 4821504 5522432 5463552 5422080 4971008 4274176 4482560 3098112 3711488 4577280
3888 4577280 4717568 5286400 5256192 5054464 4577280 4705280 4882432 6203904 5509120 5371392
3878 5371392 5647360 5242368 5883392 6206464 6086656 6569984 6708736 5822976 7190016
3869 7190016 6945280 7179776 7180288 7142912 7352832 8311296 7839744 8634880 8852992 8300544
3859 8300544 8664064 10296832 11032064 11892224 11750912 12211712 12493824 10938880 8916480
3850 8916480 8796672 7484416 7230976 6369280 3996160 4378112 3651584 4131840 2634240
3841 2634240 2643968 2628608 2499584 3582976 2353152 3096576 1726976 2039808 3470848
$$ packed form
3907D259840o30272P63392O29760r11360J881600j716224O58432R12896L98336
3898F246400j424896P00928n8880m1472m51072o96832K08384j384448O13376Q65792
3888D577280J40288N68832l0208k01728m77184J28000J77152J321472o94784j37728
3878E371392K75968m04992O41024L23072j19808M83328J38752q85760J367040
3869G190016k44736K34496N12l7376K09920R58464m71552P95136K18112n52448
3859H300544L63520J632768P35232Q60160j41312M60800K82112j554944k022400
3850H916480j19808j312256k53440q61696k373120L81952p26528M80256j497600
3841B634240R728j5360j29024J083392j229824P43424j369600L12832J431040
$$ plain form
3832 3470848 1962496 1751040 2953216 2162688 2361856 2650112 2999296 2792448 2475008
3823 2475008 3150336 2681856 2297856 3540992 2441728 1761280 2028544 2449408 2560000
3814 2560000 1795584 1950208 1913856 1893376 2884096 2865664 3676672 1865216 2274816 1801728
3804 1801728 2293248 2391552 3080192 1628672 2204160 1619968 1408512 1650176 2220032 2361344
3794 2361344 3169280 1684480 2228224 2262528 2085888 1512960 1880064 1444352 1954816 1210368
3784 1210368 1497088 2252800 2027008 2697216 2351104 1393152 2263552 2539520 2233344 1903104
3774 1903104 1824256 1809920 1345536 2266112 2161664 2434560 1410560 1152000 2480128 2826240
3764 2826240 1724416 1616384 2116096 2736128 3266048 1921536 2752000 1905152 1810944
$$ packed form
3832C470848j508352k11456J202176p90528J99168K88256L49184k06848l17440
3823B475008O75328m68480l84000J243136j099264o80448K67264M20864J10592
3814B560000p64416J54624l6352k0480R90720j8432Q11008j811456M09600m73088
3804A801728M91520R8304O88640j451520N75488n84192k11456K41664N69856J41312
3794B361344Q07936j484800N43744L4304j76640n72928L67104m35712N10464p44448
3784A210368K86720P55712k25792O70208l46112r57952Q70400K75968l06176l30240
3774A903104p8848j4336m64384R20576j04448K72896j024000k58560J328128L46112
3764B826240j101824j08032M99712O20032N29920j344512Q30464q46848r4208
$$ plain form
3755 1810944 1655808 2012160 1477632 1307136 2343936 2915328 1684480 1742336 1170432
3746 1170432 1743360 3420160 2945536 1795584 2728448 1727488 2584064 2191360 2184192
3737 2184192 1806336 1036288 2204672 2212864 1894400 2707456 1286144 2611712 857600
3727 1952768 2187776 1494528 1440768 1795584 2326016 2126336 3223040 2248704 1731584 2225664
3717 2225664 2108928 2510848 1852416 2932224 1091072 2672640 1509888 2642944 1638912
3708 1638912 1309696 2250240 2324992 2005504 3422208 2375680 2145792 1367040 2294272
3699 2294272 1686528 2529280 1823232 3180032 1677312 2089984 2610176 2233856 1971712
3690 1971712 1406464 1690112 2839040 3275776 2679808 3191296 2291712 1208320 1454592
$$ packed form
3755A810944j55136L56352n34528j70496J036800N71392j230848N7856n71904
3746A170432N72928J676800m74624j149952R32864j000960Q56576l92704p168
3737B184192l77856p70048J168384Q192l18464Q13056A286144J325568H57600
3727A952768K35008o93248n3760L54816N30432j99680J096704r74336n17120M94080
3717B225664j16736M01920o58432J079808A091072J581568j162752J133056j004032
3708A638912l29216R40544P4752l19488J416704j046528k29888p78752R27232
3699B294272o07744Q42752p06048J356800j502720M12672N20192l76320k62144
3690A971712n65248K83648J148928M36736n95968N11488q99584j083392K46272
$$ plain form
3681 1454592 2967552 2093568 2688512 2095104 2640896 3336704 2295296 2268672 2478592
3672 2478592 2573312 2348544 3597824 2394112 2192384 3827200 2787840 2746368 3726848
3663 3726848 3885568 3929088 3389952 2013696 3905024 4481024 4185088 4928000 4503552
3654 4503552 5574656 6351360 5426688 4910080 4210176 4208128 4869632 5401600 4763648 4073984
3644 4073984 5123072 4746752 5789184 6021632 5586944 6190592 5950976 5378048 5822464
3635 5822464 5744640 6791680 6901760 7464960 6903296 5935616 7418368 7034880 8886272
3626 8886272 8749056 7635968 8376832 8480768 9229312 9661440 10449920 10721280 11989504
3617 11989504 11537408 12846592 13321216 13719552 14708736 14061568 15034880 16130048 15988224
$$ packed form
3681A454592J512960q73984N94944n93408N45792O95808j041408k6624K09920
3672B478592R4720k24768J249280j203712k01728J634816j039360m1472R80480
3663C726848J58720M3520n39136j376256J891328N76000k95936P42912m24448
3654D503552J071104P76704r24672n16608o99904k048O61504N31968o37952o89664
3644D073984J049088l76320J042432K32448m34688O03648k39616n72928M44416
3635E822464p7824J047040J10080N63200n61664r67680J482752l83488J851392
3626H886272j37216j113088P40864J03936P48544M32128P88480K71360J268224
3617A1989504m52096J309184M74624L98336R89184o47168R73312J095168j41824
$$ plain form
3608 15988224 16006656 17531392 18227712 17897472 18938880 18933760 19309568 19879936 21954048
3599 21954048 21724160 21924864 22770176 23705088 25034752 25940992 27009024 27258368 27712000
3590 27712000 26083840 24397312 23518720 22330880 21484544 18554368 16686592 14861312
3582 14861312 13170688 10317824 10246656 9353728 8603648 7608832 7706624 7815680 8247808
3573 8247808 8223232 7312384 7249920 6999552 6472704 6942208 8600576 7843328 7065088 7403520
3563 7403520 5876736 6267904 6422528 6308864 6392832 6680064 7102464 6795264 5398528
3554 5398528 7091200 7394304 6837760 6646784 5625856 5163520 5342720 5435904 5144064
3545 5144064 4471808 5321728 2849792 4005376 4694528 3452416 4876800 3497984 4296192
$$ packed form
3608A5988224J8432J524736O96320l30240J041408n120L75808N70368K074112
3599B1954048k29888K00704Q45312R34912J329664R06240J068032K49344M53632
3590B7712000j628160j686528q78592j187840q46336k930176j867776j825280
3582A4861312j690624k852864p1168q92928p50080r94816R7792J09056M32128
3573H247808k4576r10848o2464k50368n26848M69504J658368p57248p78240L38432
3563G403520j526784L91168J54624j13664Q3968K87232M22400l07200j396736
3554E398528J692672L03104n56544j90976j020928m62336J79200R3184k91840
3545E144064o72256Q49920k471936J155584O89152j242112J424384j378816P98208
$$ plain form
3536 4296192 4921344 4924416 4085760 4115968 5213184 4380160 3672064 3976704 5405696 4729856
3526 4729856 4147200 4299776 4353024 3996160 3330048 3633152 3878400 4102144 5140992 4601856
3516 4601856 5183488 3009536 4214272 4247040 4588032 4433920 4651520 3894784 4601856
3507 4601856 3515392 5006848 4419584 3919360 3678208 4456448 4722176 4699136 4035072
3498 4035072 4161536 5208576 4461056 4704768 5749760 4209152 4559872 4310528 4691968
3489 4691968 3943936 4317184 4897792 3966976 4604416 5116416 4776960 5044736 3806208
3480 3806208 4608512 4092928 3595776 3468800 4995072 4030464 4477952 3938304 3579904
3471 3579904 3783680 4027392 4561920 4007424 3795968 5390848 3669504 3404800 4473344
$$ packed form
3536D296192O25152L072q38656L0208J097216q33024p08096L04640J428992o75840
3526D729856n82656J52576N3248l56864o66112L03104K45248K23744J038848n39136
3516D601856N81632k173952J204736L2768L40992j54112K17600p56736P07072
3507D601856j086464J491456n87264n00224k41152P78240K65728k3040o64064
3498D035072J26464J047040p47520K43712J044992j540608L50720k49344L81440
3489D691968p48032L73248N80608r30816O37440N12000l39456K67776j238528
3480C806208Q02304n15584m97152j26976J526272r64608M47488n39648l58400
3471C579904K03776K43712N34528n54496k11456J594880j721344k64704J068544
$$ plain form
3462 4473344 4529664 3926016 3605504 4229632 3197952 3718144 5180928 4297728 3408896
3453 3408896 4132352 4923904 5441024 3631104 5023232 5420032 4808704 4337664 4737024
3444 4737024 4644352 5469696 3184640 4235264 3382272 3512832 3857408 3830272 3704832 3439104
3434 3439104 2830848 4631040 4332544 5066240 4625920 4675584 5798912 5879296 5984768 6348288
3424 6348288 6267904 7059456 7469056 7105536 6593024 5278208 6211584 6606848 6134272 5721600
3414 5721600 5695488 6513664 6508544 6179328 6381056 6050304 6556672 5526016 6127616 7230464
3404 7230464 8111104 8444416 8423424 9039360 8666624 8410624 9134592 8494592 8522240 9913344
3394 9913344 8823296 9787904 9982464 10669568 10113024 10761728 10758656 11366912 12033024 12792320
$$ packed form
3462D473344N6320o03648l20512O24128j031680N20192J462784q83200q88832
3453C408896P23456P91552N17120j809920J392128L96800o11328m71040L99360
3444D737024r2672Q25344k285056J050624q52992J30560L44576k7136j25440k65728
3434C439104o08256J800192k98496P33696m40320M9664J123328Q0384J05472L63520
3424F348288q0384P91552M09600l63520n12512j314816R33376L95264m72576m12672
3414E721600k6112Q18176n120l29216K01728l30752N06368j030656O01600J102848
3404G230464Q80640L33312k0992O15936l72736k56000P23968o40000K7648J391104
3394I913344j090048R64608J94560O87104n56544O48704l072O08256O66112P59296
$$ plain form
3384 12792320 13770752 14796800 16578560 16659456 16621056 16614912 16193536 18753024 18892288 19668992
3374 19668992 20220928 21237760 20502016 22543872 24210944 24444928 25142784 26372608 26024960
3365 26024960 29626368 30631424 30516736 32405504 34376704 35242496 37617152 39586816
3357 39586816 42785280 47784960 51757056 58966016 64846336 71243264 78411264 84705792
3349 84705792 92562944 98534912 107016704 113563648 122780160 131844608 143633408 154418176
3341 154418176 168756224 183578112 201992192 223044608 249884672 282485248 324041216
3334 324041216 378916352 453335552 558112768 701366784 882666496 1071415808 1201969664
3327 1201969664 1203152896 1074512384 880467968 684470272 523187200 404240896
$$ packed form
3384A2792320R78432J026048J781760Q0896l8400o144m21376K559488J39264P76704
3374A9668992N51936J016832p35744K041856J667072K33984O97856J229824l47648
3365B6024960L601408J005056j14688J888768J971200Q65792K374656J969664
3357C9586816L198464M999680L972096P208960N880320O396928P168000O294528
3349H4705792P857152N971968Q481792O546944R216512R064448J1788800J0784768
3341A54418176J4338048J4821888J8414080K1052416K6840064L2600576M1555968
3334C24041216N4875136P4419200J04777216J43254016J81299712J88749312J30553856
3327A201969664J183232j28640512j94044416j95997696j61283072j18946304
$$ plain form
3321 404240896 317234176 254284800 208353792 175220224 151678976 133134848 118134272
3314 118134272 105973248 96551424 86988288 80340480 75426304 69661696 64676352 61609472
3306 61609472 57669632 53498880 52082688 48217600 46191616 44045824 42539008 40070144
3298 40070144 40022016 38065152 36535808 35409920 33321984 30741504 30404096 29085696 28510208
3289 28510208 27494912 26436608 25530880 24907264 24439808 24366080 23001600 22579712 21664768
3280 21664768 20839424 19830784 20025856 18831360 18734592 18719744 18290176 18896384 18219520
3271 18219520 19967488 18621952 17333248 16930304 17212416 17586688 17101312 17196544 16179200
3262 16179200 16700416 16382464 14760960 14263296 15071232 14644736 14242816 14110720 14188032
$$ packed form
3321D04240896q7006720o2949376m5931008l3133568k3541248j8544128j5000576
3314A18134272j2161024r421824r563136o647808m914176n764608m985344l066880
3306F1609472l939840m170752j416192l865088k025984k145792j506816k468864
3298D0070144m8128j956864j529344j125888k087936k580480l37408j318400n75488
3289B8510208j015296j058304r05728o23616m67456p3728j364480m21888r14944
3280B1664768q25344j008640J95072j194496r6768j4848m29568O06208o76864
3271A8219520J747968j345536j288704m02944K82112L74272m85376R5232j017344
3262A6179200N21216l17952j621504m97664Q07936m26496m01920j32096P7312
$$ plain form
3253 14188032 14846976 13925888 14176256 13668352 12580864 13754880 13265920 13185024 11729408
3244 11729408 11902464 13122048 12165120 11523072 11706880 11753984 11067904 11725824 10331648
3235 10331648 9696256 10545664 10284544 8950272 9614336 9605120 10146304 10118656 9763328 10257920
3225 10257920 9003008 11028992 10609664 10346496 10046976 10447360 9426432 9858048 9527808
3216 9527808 9683968 8291840 9992704 8281088 9133056 7654912 8409088 8763904 7769088
3207 7769088 8385024 7399424 8288256 8646144 8295424 7924224 7010816 7033856 7108096 7207936
3197 7207936 6911488 6766592 7217152 7927808 8507392 7611392 8105472 6644736 6365696
3188 6365696 6644224 6530560 7633920 6835200 6738432 6986752 6971392 8011264 6105600
$$ packed form
3253A4188032O58944r21088K50368n07904j087488J174016m88960q0896j455616
3244A1729408J73056J219584r56928o42048J83808M7104o86080O57920j394176
3235A0331648o35392Q49408k61120j334272O64064r216N41184k7648l55328M94592
3225A0257920j254912K025984m19328k63168k99520M00384j020928M31616l30240
3216I527808J56160j392128J700864j711616Q51968j478144P54176L54816r94816
3207G769088O15936r85600Q88832L57888l50720l71200r13408K3040P4240R9840
3197G207936k96448j44896M50560P10656N79584q96000M94080j460736k79040
3188F365696K78528j13664J103360p98720r6768K48320j5360J039872j905664
$$ plain form
3179 6105600 5175296 6556672 6862336 6375424 6817792 6349312 6020096 6963200 6567936
3170 6567936 6963712 7297024 6732288 6623232 6196224 5723136 6535168 5597184 5203968 5764096
3160 5764096 6130688 6041600 5237760 5030400 6077440 5722112 5819392 5971968 5643264 6225920
3150 6225920 4918272 6630400 6364672 6308352 5992448 6863872 7220224 6445056 6929408
3141 6929408 7569920 7960576 7995392 9308160 11211776 11113984 11195904 11460608 10885632 11205120
3131 11205120 11899392 11632128 11870720 10857984 10152448 10470912 9442816 9976320 11741696
3122 11741696 10799616 11337216 11012608 10844160 10804736 12496896 10840576 11933184 11567616
3113 11567616 12127744 12357632 11228160 12026368 13116416 11812352 11996160 13926400 12674048
$$ packed form
3179F105600r30304J381376L05664m86912M42368m68480l29216R43104l95264
3170F567936L95776L33312n64736j09056m27008m73088Q12032r37984l93216N60128
3160E764096L66592q9088q03840k07360J047040l55328R7280J52576l28704N82656
3150F225920j307648J712128k65728n6320l15904Q71424L56352p75168M84352
3141F929408O40512L90656L4816J312768J903616r7792Q1920K64704n74976L19488
3131A1205120O94272k67264K38592j012736p05536L18464j028096N33504J765376
3122A1741696r42080N37600l24608j68448l9424J692160j656320J092608l65568
3113A1567616N60128K29888j129472P98208J090048j304064J83808J930240j252352
$$ plain form
3104 12674048 13594112 13277696 14528000 13827584 14682624 12943360 14810112 15818240 15515648
3095 15515648 15347712 15149056 16823808 16633856 17110528 17606144 18285056 19747328 20361216
3086 20361216 19963904 21514240 22113792 21881856 22681088 23240192 23289856 24235008 25143808
3077 25143808 26124800 26598400 27073536 27575296 28644352 27997184 29242880 29090304 31091712
3068 31091712 32809984 34337280 34086912 35118592 35384320 35381248 33258496 30035968 27261440
3059 27261440 23699456 20818944 19571712 18338816 16498688 15373312 14962176 13895680
3051 13895680 14160384 12878336 11902976 11755520 12035072 10660352 10607616 9130496 10275328
3042 10275328 9953792 9818112 9771008 9447936 8513536 8136704 8430592 7618560 8018432 6988288
$$ packed form
3104A2674048R20064l16416J250304p00416Q55040j739264J866752J008128l02592
3095A5515648j67936j98656J674752j89952M76672M95616O78912J462272O13888
3086B0361216l97312J550336N99552k31936P99232N59104M9664R45152R08800
3077B5143808R80992M73600M75136N01760J069056o47168J245696j52576K001408
3068C1091712J718272J527296k50368J031680K65728l072k122752l222528k774528
3059B7261440l561984k880512j247232j232896j840128j125376m11136j066496
3051A3895680K64704j282048r75360j47456K79552j374720n2736j477120J144832
3042A0275328l21536j35680m7104l23072r34400l76832K93888q12032L99872j030144
$$ plain form
3032 6988288 7359488 6720512 6640128 6993408 5804032 5908992 6014464 5585408 5630976 5445120
3022 5445120 5363712 5306368 5932544 6301696 6361600 5513216 4901888 5373952 6184448 6318080
3012 6318080 4983296 6130688 5034496 5648896 5396480 6328320 5913600 5508608 5168128
3003 5168128 5814272 4404736 5806592 4756480 5466112 5402112 5117952 5040640 5547520
2994 5547520 5433344 5727232 5810176 4664320 5521408 5241856 4975616 5834752 5119488 5838336
2984 5838336 6289408 6237696 5258240 6162432 7147008 6338560 5904896 5321728 5327360 4960256
2974 4960256 5450752 5764096 5650432 4355584 5446144 5558784 6501376 5912576 6773760
2965 6773760 6841344 6012928 5967360 5652992 6543872 5061120 5230080 4177920 5585408
$$ packed form
3032F988288L71200o38976q0384L53280j189376J04960J05472m29056M5568j85856
3022E445120q1408n7344O26176L69152N9904q48384o11328M72064Q10496J33632
3012F318080j334784J147392j096192O14400k52416R31840m14720m04992l40480
3003E168128O46144j409536J401856j050112P09632o4000k84160p7312N06880
2994E547520j14176K93888Q2944j145856Q57088k79552k66240Q59136p15264P18848
2984E838336M51072n1712r79456R04192R84576q08448m33664n83168N632l67104
2974D960256M90496L13344j13664j294848J090560J12640R42592n88800Q61184
2965F773760O7584q28416m5568l14368Q90880j482752J68960j052160J407488
$$ plain form
2956 5585408 6266880 6111232 5583872 5895680 5301760 5590528 5159936 5379584 6071296 4881920
2946 4881920 5534208 5944832 4843520 4700160 5154304 5649920 4951040 5679616 4577792
2937 4577792 5646336 4492800 5196288 5520384 4849152 5576192 5292544 3793920 5805568
2928 5805568 5355520 6195712 5249536 5539840 5991936 6530048 5519360 6397440 6521344
2919 6521344 5764096 7128064 6632960 5939712 7810048 7739392 9427456 10285568 14232064
2910 14232064 17265152 21198336 21948928 20999168 20342784 19771392 16223744 11380736 9586176
2901 9586176 6971904 5918720 6723584 5734912 5422080 5810176 5751296 5149184 4351488
2892 4351488 5164032 4966912 4875264 4720128 4340736 5868544 5253120 4357120 4750848 4470784
$$ packed form
2956E585408O81472j55648n27360L11808n93920K88768m30592K19648O91712j189376
2946D881920O52288M10624j101312j43360M54144M95616o98880P28576j101824
2937D577792J068544j153536P03488L24096o71232P27040k83648j498624K011648
2928E805568m50048Q40192r46176K90304M52096N38112j010688Q78080J23904
2919F521344p57248J363968m95104o93248J870336p0656J688064Q58112L946496
2910A4232064L033088L933184P50592r49760o56384n71392l547648m843008j794560
2901I586176k614272j053184Q04864r88672l12832L88096n8880o02112p97696
2892D351488Q12544j97120r1648j55136l79392J527808o15424q96000L93728k80064
$$ plain form
2882 4470784 3682304 4867584 3990528 4502016 4321280 5261312 5286912 4673536 4796416 5512192
2872 5512192 5513216 6417408 5144576 5747200 6104576 5785088 5736960 5693952 6204928 6129664
2862 6129664 5391872 5431296 5916672 6209024 6437376 6445056 5453824 5524480 5074432 5669888
2852 5669888 5592064 5329408 5692416 5495808 5014016 5568000 5680128 6440960 6321152 5387776
2842 5387776 5060608 5931008 5633024 5662208 5626368 4565504 5506048 5493760 4800512 5338624
2832 5338624 5168128 5498880 5041664 5292544 5158400 5450240 4413440 5924864 4584960
2823 4584960 5837312 5788160 6257664 5215744 6069760 5980160 6231552 5670400 7156736
2814 7156736 5968384 7179264 5859840 7357952 6798336 6770176 7649280 7215616 7538688
$$ packed form
2882D470784p88480J185280q77056N11488j80736R40032K5600o13376J22880P15776
2872E512192J024R04192j272832O02624L57376l19488m8128m3008N10976p5264
2862F129664p37792L9424M85376K92352K28352P680r91232P0656m50048N95456
2852E669888p7824k62656L63008j96608m81792N53984J12128P60832j19808r33376
2842E387776l27168Q70400k97984K9184l5840j060864R40544j2288o93248N38112
2832E338624j70496L30752m57216K50880j34144K91840j036800J511424j339904
2823D584960J252352m9152M69504j041920Q54016q9600K51392n61152J486336
2814G156736j188352J210880j319424J498112n59616k8160Q79104m33664L23072
$$ plain form
2805 7538688 8249856 8476160 9678848 9603072 10981376 10782720 10787840 10820096 10161152 9996288
2795 9996288 8967168 7827968 8686592 7347712 6285312 5740032 6042112 6435840 6156288
2786 6156288 5970944 5824000 6310400 5117440 5646848 5653504 5275648 5021184 5681152 4758528
2776 4758528 4482560 5599744 5453824 5023232 5067776 5445120 4544000 5127680 4478464 5035008
2766 5035008 5063168 4888576 4451328 4914176 5246464 4812288 4067328 4396544 4443136 5885952
2756 5885952 4802560 5153792 4706304 5402112 4946944 5816320 5464064 5412864 5069312 5473280
2746 5473280 4119552 4768256 5356032 4294144 4430848 6117376 5252608 5762560 4673536
2737 4673536 5568512 4851200 5277184 4318720 4607488 4965888 4629504 4496896 5512192
$$ packed form
2805G538688P11168K26304J202688p5776J378304j98656N120L2256o58944j64864
2795I996288j029120j139200Q58624j338880j062400n45280L02080L93728k79552
2786F156288j85344j46944M86400j192960N29408O656l77856k54464O59968r22624
2776D758528k75968J117184j45920m30592M4544L77344r01120N83680o49216N56544
2766E035008K8160j74592m37248M62848L32288m34176p44960L29216M6592J442816
2756E885952j083392L51232m47488O95808m55168Q69376l52256n1200l43552M03968
2746E473280j353728O48704N87776j061888J36704J686528q64768N09952j089024
2737D673536Q94976p17312M25984r58464K88768L58400l36384j32608J015296
$$ plain form
2728 5512192 5695488 4925952 5063680 5531648 5703680 5007360 5237248 4988928 4362752 4722688
2718 4722688 4228096 4307456 4067328 6220800 5032448 4964352 5687808 5034496 4451840 5721088
2708 5721088 5197824 4538880 5269504 4847104 5504512 4791296 4893696 5072384 4986880 5790720
2698 5790720 6549504 6931968 6653952 7187968 7420416 10342912 15945216 21939200 27869696
2689 27869696 30837248 23838208 15258624 10141696 8876032 6822912 6179840 6061568
2681 6061568 6670336 4999680 5775872 4632576 4201984 4557312 3655680 4270592 4243968
2672 4243968 4378624 4069376 3637248 3910656 3893248 4659712 4487680 3719680 4589568 4721152
2662 4721152 4182016 3691520 3423232 4345856 4274688 3983360 3630080 3777536 4751872 4319232
$$ packed form
2728E512192J83296p69536J37728M67968J72032o96320K29888k48320o26176L59936
2718D722688m94592P9360k40128K153472j188352o8096P23456o53312n82656J269248
2708E721088n23264o58944P30624m22400O57408p13216J02400J78688q5504Q03840
2698E790720P58784L82464k78016N34016K32448K922496N602304N993984N930496
2689B7869696K967552o999040q579584n116928j265664k053120o43072j18272
2681F061568O08768j670656P76192j143296m30592L55328r01632O14912k6624
2672D243968J34656l09248m32128K73408j7408P66464j72032p68000Q69888J31584
2662D721152n39136m90496k68288R22624p1168k91328l53280J47456R74336m32640
$$ plain form
2652 4319232 4312064 3940864 5219840 5609984 5067264 4053504 4119040 4284928 4185600 3769344
2642 3769344 4471296 4835840 4345856 3429888 4264960 3750912 4155904 4266496 2258432
2633 2258432 4365312 4318208 3635712 4099072 2197504 2640896 4187648 3171328 4452352
2624 4452352 3936256 4558336 5575680 4669952 3891712 3709952 5632000 4530176 4913664
2615 4913664 4937216 5800960 6090752 5505536 5447680 6354432 7080960 6381568 7735296 9039872
2605 9039872 8924672 10484736 14350336 20643328 30046720 39259136 40533504 32042496
2597 32042496 21557760 16088064 14299136 12595712 13962240 18568192 23268864 28902400
2589 28902400 29045248 22471680 16302080 13778432 15060480 16782336 22327808 30178304
$$ packed form
2652D319232p168l71200J278976L90144n42720j013760O5536J65888r9328m16256
2642C769344P01952L64544m89984r15968Q35072n14048M04992J10592k008064
2633B258432K106880m7104o82496M63360j901568M43392J546752j016320J281024
2624D452352n16096O22080J017344r05728p78240j81760J922048j101824L83488
2615D913664K3552Q63744K89792n85216n7856R06752P26528o99392J353728J304576
2605I039872j15200J560064L865600O292992R403392R212416J274368q491008
2597C2042496j0484736n469696j788928j703424J366528M605952M700672N633536
2589B8902400J42848o573568o169600k523648J282048J721856N545472P850496
$$ plain form
2581 30178304 38197760 38551552 29864960 19734016 14798848 13711360 15161344 17520640
2573 17520640 21584896 26201088 26938368 21498368 13701120 10765824 9572352 9943552
2565 9943552 11732992 12861952 14897152 15415808 12485120 9214464 7729152 7332864 5070848
2556 5070848 6391808 5276672 6053888 5021696 5154304 5800960 5131776 4642304 5334528
2547 5334528 5341184 6286848 5896704 5676032 7068160 7244288 7088640 7498240 7425536 8101888
2537 8101888 7321088 6865920 6713856 7089664 7749120 5650432 5278720 5377024 5098496 5923840
2527 5923840 5373440 5472768 4819968 3751936 3127808 3356672 3710976 3133440 4449792
2518 4449792 3477504 4214272 3823616 3359232 3003904 2482176 2789888 2753536 3303936 3369984
$$ packed form
2581C0178304Q019456L53792q686592j0130944m935168j087488J449984K359296
2573A7520640M064256M616192P37280n440000p797248k935296j193472L71200
2565I943552J789440J128960K035200N18656k930688l270656j485312l96288k262016
2556E070848J320960j115136P77216j032192J32608O46656o69184m89472O92224
2547E334528O656R45664l90144k20672J392128J76128j55648M09600p2704O76352
2537H101888p80800m55168j52064L75808O59456k098688l71712R8304k78528Q25344
2527E923840n50400R9328o52800j068032o24128K28864L54304n77536J316352
2518D449792r72288P36768l90656m64384l55328n21728L07712l6352N50400O6048
$$ plain form
2508 3369984 4069376 2230272 2888704 2666496 2608128 3987456 2796544 2272768 2702848
2499 2702848 3062784 2805248 3105792 2317824 2263552 3256320 2807808 2300416 1753600 2531328
2489 2531328 2844672 2569728 2556928 2991104 1682432 3084288 2862592 2684416 1703424
2480 1703424 2744320 2837504 2891264 2928640 2412032 3158528 3287040 3181056 3079680 2970624
2470 2970624 2295808 2555392 2549760 1940480 2316800 2370048 2808320 3324416 4101120 2361344
2460 2361344 2345984 2516480 2536960 1964544 1717760 3368960 2053120 2451456 2371584 3352576
2450 3352576 2775552 3566592 2980864 2994688 2501632 3263488 2426368 3110400 3415552 2267648
2440 2267648 2447360 2596352 3430400 2332672 2420224 1472512 3027456 2845696 2693632
$$ packed form
2508C369984O99392j839104O58432k22208n8368J379328j190912n23776M30080
2499B702848L59936k57536L00544p87968n4272R92768m48512n07392n46816P77728
2489B531328L13344k74944j2800M34176j308672J401856k21696j78176r80992
2480A703424J040896R3184N3760L7376n16608P46496J28512j05984j01376j09056
2470B970624o74816K59584n632o09280L76320N3248M38272N16096P76704j739776
2460B361344j5360J70496K0480n72416k46784J651200j315840L98336p9872R80992
2450C352576n77024P91040n85728J3824m93056P61856q37120O84032L05152j147904
2440B267648J79712J48992Q34048j097728Q7552r47712J554944j81760j52064
$$ plain form
2431 2693632 3348992 2867200 2977792 2372608 2652672 3420160 2510848 2762240 3452416 1716736
2420 1252864 2806272 3035648 2892800 3076608 2592768 3774464 2073088 1933312 2508800
2411 2508800 2861056 1886208 2679296 1860608 2378240 2211840 2294784 2606080 2738176 3231744
2401 3231744 1716224 2151936 2848256 2471936 1798656 2914304 2087424 3137024 2012672
2392 2012672 2933760 2982400 2414080 2291712 2944000 2997760 2380800 2868736 2677760 3196928
2382 3196928 3029504 2857984 3000832 3623936 1746944 2397696 3471872 3374592 3429376 3911168
2372 3911168 3833856 3342336 3122688 3118080 3939840 2522624 4358656 2714112 3737600
2363 3737600 2617856 2934272 3909632 3527680 4177920 4213248 3282432 4158976 3927552 4692480
$$ packed form
2431B693632O55360m81792J10592o05184K80064P67488r09312K51392O90176A716736
2420A252864J553408K29376j42848J83808m83840J181696j701376j39776N75488
2411B508800L52256r74848P93088q18688N17632j66400Q2944L11296J32096M93568
2401C231744j515520M35712O96320l76320o73280J115648q26880J049600j124352
2392B012672R21088M8640n68320j22368O52288N3760o16960M87936j90976N19168
2382C196928j67424j71520J42848O23104A746944O50752J074176r7280N4784M81792
2372C911168p7312m91520k19648m608Q21760j417216J836032j644544J023488
2363C737600j119744L16416R75360l81952O50240L5328r30816Q76544k31424P64928
$$ plain form
2353 4692480 3776000 4049920 3734016 4703232 4296704 4247552 4002816 4950528 4785664 4472320
2343 4472320 3814912 4613632 4560384 4684288 4605952 4636160 4493312 5302784 3890176 4599808
2333 4599808 5103616 4977664 4769280 4552704 4348416 4804096 4542464 5031424 4886528 4076544
2323 4076544 5440512 5179904 5499904 5700096 5659136 5308416 4787712 5294592 5313536 4911104
2313 4911104 5340672 4716544 4950528 5430272 5631488 5217792 4303360 4281344 3899904 4027904
2303 4027904 4507648 4187136 4061696 4085760 4043776 4392448 5236736 4512768 3522048 3700736
2293 3700736 3557888 4449792 4205568 4260352 3568640 4281344 3556352 3810816 3415552 4694016
2283 4694016 3813376 3325440 2966016 3950080 3536896 3743744 3712000 3410944 3427328 3783680
$$ packed form
2353D692480r16480K73920l15904R69216m06528m9152k44736R47712j64864l13344
2343D472320o57408P98720n3248J23904p8336L0208j42848Q09472j412608P09632
2333D599808N03808j25952k08384k16576k04288M55680k61632M88960j44896q09984
2323D076544J363968k60608L20000K00192m0960l50720n20704N06880J8944m02432
2313D911104M29568o24128K33984M79744K01216m13696r14432k2016l81440J28000
2303D027904M79744l20512j25440K4064m1984L48672Q44288p23968r90720J78688
2293C700736j42848Q91904k44224N4784o91712P12704p24992K54464l95264J278464
2283D694016q80640m87936l59424R84064m13184K06848l1744l01056J6384L56352
$$ plain form
2273 3783680 3514368 4129792 2842624 3175936 3224576 3376640 3100672 2806272 3076608 2906112
2263 2906112 3001344 3563008 3183104 3545088 3471360 2966528 3156480 2958848 4752896 3796992
2253 3796992 3495936 2389504 3573760 3701760 3491840 4606464 2739712 3117056 4070912
2244 4070912 3450368 3637248 3421184 4390400 3678208 4260352 3411456 3101696 3144704 3318784
2234 3318784 3672576 3086848 2819072 3267584 3207168 3344384 3559424 3590656 3239936 2771968
2224 2771968 3258368 3208192 4036096 3391488 3369984 3190272 2892800 3500544 4185600 3226624
2214 3226624 3526656 3947008 2756096 4217344 3180544 3773440 4607488 3292672 3921408
2205 3921408 4413952 4473344 3837952 3534848 4717568 3533824 3368960 3450368 4197888 3968000
$$ packed form
2273C783680k69312O15424j287168L33312M8640J52064k75968k94400K70336j70496
2263B906112R5232N61664l79904L61984p3728n04832J89952j97632J794048r55904
2253C796992l01056j106432J184256J28000k09920J114624j866752L77344R53856
2244D070912o20544J86880k16064R69216p12192N82144q48896l09760M3008J74080
2234C318784L53792n85728k67776M48512o0416J37216K15040L1232l50720m67968
2224B771968M86400n0176Q27904o44608k1504j79712k97472O07744O85056r58976
2214C226624L00032M20352j190912J461248j036800N92896Q34048j314816O28736
2205C921408M92544N9392o35392l03104J182720j183744j64864Q1408P47520k29888
$$ plain form
2195 3968000 4553728 4213248 3369984 2873344 4491264 3908096 3900928 4396544 4534272 3840000
2185 3840000 4453888 3970048 4466688 4072448 4730880 4297216 3609600 3943424 3294720 3965952
2175 3965952 3760128 3865088 4235776 4296704 3834368 4020224 4533760 4459520 3589120 3958784
2165 3958784 4266496 4296192 4212736 4770816 4310528 4773376 5152256 4818432 4991488 4297728
2155 4297728 5693440 5002240 5349888 4850688 4776960 4441088 4747776 5675008 5574656 5637120
2145 5637120 4842496 5646336 6016512 5028864 5665792 5478912 5122048 5874176 5113856 5456384
2135 5456384 5306368 6144000 6407168 6089728 7598080 7143424 6679552 6542848 7141376
2126 7141376 6581760 7438848 8138240 8252928 7917568 7893504 8745472 7784448 7307776 8194048
$$ packed form
2195C968000N85728l40480q43264m96640J617920n83168p168M95616J37728o94272
2185C840000O13888m83840M96640l94240O58432m33664o87616L33824o48704O71232
2175C965952k05824J04960L70688O0928m62336J85856N13536p4240q70400L69664
2165C958784L07712K9696q3456N58080m60288M62848L78880l33824J73056o93760
2155D297728J395712o91200L47648m99200p3728l35872L06688R27232j00352O2464
2145E637120p94624Q03840L70176r87648O36928j86880l56864P52128p60320L42528
2135E456384j50016Q37632K63168l17440J508352m54656m63872j36704N98528
2126G141376n59616Q57088O99392J14688l35360k4064Q51968r61024m76672Q86272
$$ plain form
2116 8194048 7499264 7993856 6873600 8113152 7724544 7976960 7679488 8644608 8517632
2107 8517632 7989248 7372288 7633920 8701440 6607872 7427584 7551488 7108608 7531520
2098 7531520 7693824 8753664 7492096 8487424 7394816 6885888 6678016 6223360 6570496
2089 6570496 7219200 6589952 7312896 7316992 6948864 7184896 7473152 7066112 6556160 6431744
2079 6431744 6221312 5774848 6002176 7040000 6521856 6126080 6564864 6904320 7408640
2070 7408640 7141376 7266304 6538240 6967296 5897728 6702592 5965312 6346752 5950464
2061 5950464 6328832 5713408 5730816 7251968 6818816 6985216 5593600 7235072 5655040
2052 5655040 5561856 6147072 4883968 5171200 5453312 4680704 5527040 5553152 5184000 4825088
$$ packed form
2116H194048o94784M94592j120256J239552l88608K52416k97472R65120j26976
2107H517632n28384o16960K61632J067520k093568Q19712J23904m42880M22912
2098G531520J62304J059840j261568R95328j092608n08928k07872m54656L47136
2089F570496O48704o29248P22944M096l68128K36032K88256m07040n09952j24416
2079F431744k10432m46464K27328J037824n18144l95776M38784L39456N04320
2070G408640k67264J24928p28064M29056j069568Q04864p37280L81440l96288
2061E950464L78368o15424J7408J521152m33152J66400j391616J641472j580032
2052E655040r3184N85216j263104K87232K82112p72608Q46336K6112l69152l58912
$$ plain form
2042 4825088 5258752 5392896 5741568 5891584 5358592 5551616 5470720 5749760 5865984 6683136
2032 6683136 6212096 5667840 5708288 5944832 6253568 6398464 6753280 5828096 5932032 5518848
2022 5518848 5900288 7384576 6373376 6363648 6588928 6497792 7194624 6491648 5680640 6001152
2012 6001152 6709760 6298112 6348800 7105024 7264768 7159808 6943232 6578688 8292352 7157760
2002 7157760 7224320 7351296 7325184 6691840 7796224 7570944 7951360 7631360 9465856 7949312
1992 7949312 7786496 7953408 9136128 8427520 8914944 8646144 9275904 9605120 9817088
1983 9817088 8946688 10408448 9922560 10033664 9072640 9861120 9788928 9563648 8413184
1974 8413184 8981504 9975296 8507904 9929728 9819136 10045440 10828288 9157120 8293376
$$ packed form
2042D825088M33664J34144L48672J50016n32992J93024q0896K79040J16224Q17152
2032F683136m71040n44256M0448K36544L08736J44896L54816r25184J03936m13184
2022E518848L81440J484288j011200r728K25280r1136O96832p02976q11008L20512
2012F001152P08608m11648N0688P56224J59744j04960k16576l64544J713664j134592
2002G157760O6560J26976k6112o33344J104384k25280L80416l20000J834496j516544
1992G949312j62816J66912J182720p08608M87424k68800O29760L29216K11968
1983I817088q70400J461760m85888J11104r61024P88480p2192k25280j150464
1974H413184N68320R93792j467392J421824j10592K26304P82848j671168q63744
$$ plain form
1965 8293376 10751488 9144832 8987136 9452032 8606208 9122816 9539584 9021952 8866816
1956 8866816 10766336 9674752 9678336 10626560 10577408 11533824 10885120 10236416 10786304 9938432
1946 9938432 10158080 9552896 9329664 9127936 9546752 10121216 9496064 8505344 10006016
1937 10006016 9499648 10285056 10444800 10356736 10465280 9667584 9288704 9827840 12276224
1928 12276224 13551104 16188416 19698688 22309888 19493376 13568512 11780096 9896960
1920 9896960 9928192 8799232 8187904 7801856 8609792 8097280 7526912 6823424 7918080
1911 7918080 7866368 7179776 8323072 7884288 6508032 7684096 7845376 7130624 7936512
1902 7936512 6626304 7038464 7176192 6714368 6714880 6676992 6201856 7035392 7050752 7241216
$$ packed form
1965H293376K458112j606656j57696M64896q45824N16608M16768n17632j55136
1956H866816J899520j091584L584R48224m9152R56416o48704o48704N49888q47872
1946I938432K19648o05184k23232k01728M18816N74464o25152r90720J500672
1937A0006016n06368P85408J59744q8064J08544p97696l78880N39136K448384
1928A2276224J274880K637312L510272K611200k816512n924864j788416j883136
1920I896960L1232j128960o11328l86048Q07936n12512n70368p03488J094656
1911G918080n1712o86592J143296m38784j376256J176064J61280p14752Q05888
1902G936512j310208M12160J37728m61824N12l7888m75136Q33536J5360J90464
$$ plain form
1892 7241216 7297536 6815232 7157760 7205376 6228992 7318528 8161792 7174144 7223808 6300160
1882 6300160 8076288 6182400 6298624 7506432 6821376 6262784 7284736 6852096 6617088
1873 6617088 7719424 7310848 6472704 7192064 7265792 7064064 7415808 8670720 7841792
1864 7841792 7639552 8163328 7919616 8202752 8279552 8145920 8334848 7719424 8612352 8885248
1854 8885248 8053760 8494592 8023040 8857088 8336384 7518720 8489984 8510464 8941568 9228288
1844 9228288 8158208 8881152 7435264 8043520 6946304 6034432 6899200 7717376 6932480
1835 6932480 7005696 7335424 6394368 6404096 7358976 6908928 6134272 7457792 5591040 7451648
1825 7451648 6517760 6816256 7044096 6786560 6237184 6722048 7137792 7364608 7496192 7304192
$$ packed form
1892G241216N6320m82304L42528M7616r76384J089536Q43264r87648M9664r23648
1882F300160J776128j893888J16224J207808o85056n58592J021952m32640k35008
1873F617088J102336m08576q38144P19360P3728k01728L51744J254912q28928
1864G841792k02240N23776k43712K83136P6800j33632J88928o15424Q92928K72896
1854H885248q31488M40832m71552Q34048n20704q17664R71264K0480M31104K86720
1844I228288j070080P22944j445888O08256j097216r11872Q64768Q18176p84896
1835F932480P3216L29728r41056R728R54880m50048p74656J323520j866752J860608
1825G451648r33888K98496K27840k57536n49376M84864M15744K26816J31584j92000
$$ plain form
1815 7304192 7547904 7086080 8015360 8996864 7693824 8635904 8054784 8253952 8920576
1806 8920576 8110080 9527296 8683008 9889280 8814080 8488960 8777728 9303552 9220608
1797 9220608 8961024 9203200 9879040 9971712 9531392 9952256 9257984 10278400 9562624 10458112
1787 10458112 11185152 10980352 11186688 10524160 10720768 11509248 11436544 11045888 12292608
1778 12292608 11607040 13384704 11609088 12243456 12712448 13282304 12632576 13765120 13646336
1769 13646336 14395904 13948928 13849088 12913664 12891136 14084608 13473280 13885952 13233664 12065792
1759 12065792 12996608 11671040 12009984 11731968 12008448 12857344 12066304 12579328 11705344
1750 11705344 12007936 12180992 12622848 11469824 11911680 12040704 11317248 12134400 12168704
$$ packed form
1815G304192K43712m61824R29280R81504j303040R42080n81120J99168O66624
1806H920576q10496J417216q44288J206272j075200l25120K88768N25824q2944
1797I220608k59584K42176O75840R2672m40320M20864o94272J020416p15776Q95488
1787A0458112P27040k04800K06336o62528J96608P88480p2704l90656J246720
1778A2292608o85568J777664j775616O34368M68992N69856o49728J132544j18784
1769A3646336P49568m46976r9840r35424k2528J193472o11328M12672o52288j167872
1759A2065792R30816j325568L38944k78016K76480Q48896p91040N13024q73984
1750A1705344L02592J73056M41856j153024M41856J29024p23456Q17152L4304
$$ plain form
1741 12168704 12038144 11915776 11777536 12241920 11519488 11709440 11711488 12620800 11287552 11271680
1731 11271680 11624448 11156480 11546112 12292608 11887616 10785792 11586560 11257856 10916864
1722 10916864 9676288 10435584 9966080 10689024 9617920 9276928 9347072 8287744 9953792
1713 9953792 8485888 8244736 9573888 8994304 8249344 8750080 7408128 8302080 7618048
1704 7618048 8378880 7615488 8709120 7053312 8478720 7700480 8093696 7208448 7148032
1695 7148032 7376384 8163328 7277056 7454208 6713856 7746560 7579136 7636480 7364096 6403584
1685 6403584 7263744 7157248 6919168 7089152 7998464 7178240 6773248 7413248 7607808 7717888
1675 7717888 6599168 7696384 8401920 7691776 7803904 7751168 8169472 8076800 7477248 8935936
$$ packed form
1741A2168704j30560j22368j38240M64384p22432J89952K048R09312j333248j5872
1731A1271680L52768m67968L89632P46496m04992j101824Q00768l28704l40992
1722A0916864j240576P59296m69504P22944j071104l40992P0144j059328J666048
1713I953792j467904k41152J329152n79584p44960N00736j341952Q93952o84032
1704G618048P60832p63392J093632j655808J425408p78240L93216q85248o0416
1695G148032K28352P86944q86272J77152p40352J032704j67424N7344k72384r60512
1685F403584Q60160j06496k38080J69984R09312q20224m04992O40000J94560J10080
1675G717888j118720J097216P05536p10144J12128n2736M18304r2672n99552J458688
$$ plain form
1665 8935936 5956096 8569344 7533056 8921600 7862784 9658368 9594880 9516544 10792448
1656 10792448 9157632 9824768 9149952 10490368 10073600 9787392 11044352 9857536 9834496
1647 9834496 11347456 10926080 10958848 10925568 11898368 11784192 12261376 11996160 12127232 12819456
1637 12819456 12446208 13391360 13622784 14408192 14323200 14904320 15363584 15218688 15068160 16952832
1627 16952832 16652800 17750016 19080704 19313152 19572224 20190208 22073856 22552064 22654976
1618 22654976 24403968 25801728 26208768 27064320 29916672 31639040 32369664 33922560 36210688
1609 36210688 36386816 38872576 39068672 40184320 41692672 41660928 42170880 43034624 44528640
1600 44528640 44940800 46297088 46916608 48942080 51714048 52816896 55003648 59571712
$$ packed form
1665H935936k979840K613248j036288J388544j058816J795584o3488p8336J275904
1656A0792448j634816O67136o74816J340416m16768k86208J256960j186816k3040
1647I834496J512960m21376L2768l3280R72800j14176M77184k65216J31072O92224
1637A2819456l73248R45152K31424P85408q4992N81120M59264j44896j50528J884672
1627A6952832l00032J097216J330688K32448K59072O17984J883648M78208J02912
1618B2654976J748992J397760M07040Q55552K852352J722368P30624J552896K288128
1609C6210688J76128K485760J96096J115648J508352l1744N09952Q63744J494016
1600D4528640M12160J356288O19520K025472K771968J102848K186752M568064
$$ plain form
1592 59571712 61826560 64658432 69359616 74103808 79499776 85606400 93361152 102767616
1584 102767616 111124480 118089728 123469824 122589696 117919232 109717504 101074432 90458624
1576 90458624 77909504 66206208 56838144 47645696 41093632 35905024 32751616 29044736
1568 29044736 26123264 24731648 24210432 21607424 20859392 19421696 18247680 18350592 17109504
1559 17109504 15734272 16827392 16026112 15190016 16019456 13793280 14168064 13957632 13696000
1550 13696000 13318144 12322304 12495360 12183552 12085248 11894784 11452416 10489344 10732544 10305024
1540 10305024 10967552 9695744 10358272 10044928 9195008 8328704 9090048 10022912 8174080
1531 8174080 9634304 9008640 8432640 8052224 9035264 9145344 8684544 8546816 7637504
$$ packed form
1592E9571712K254848K831872M701184M744192N395968O106624P754752R406464
1584A02767616Q356864O965248N380096q80128m670464q201728q643072j0615808
1576I0458624j2549120j1703296r368064r192448o552064n188608l153408l706880
1568B9044736k921472j391616n21216k603008p48032j437696j174016J02912j241088
1559A7109504j375232J093120q01280q36096Q29440k226176L74784k10432k61632
1550A3696000l77856r95840J73056l11808r8304j90464m42368r63072K43200m27520
1540A0305024O62528j271808O62528l13344q49920q66304P61344R32864j848832
1531H174080J460224o25664n76000l80416R83040J10080m60800j37728r09312
$$ plain form
1522 7637504 8729600 6453248 8664064 8844288 8748544 8461824 7136256 7452160 6675456
1513 6675456 6330880 6356992 6730752 6649344 7245824 5525504 6146560 6735872 6476800 6135296
1503 6135296 6241792 5932032 7092736 6013440 5424128 6043136 5646336 5681152 5056512
1494 5056512 6224384 5730304 6012928 6258688 5598720 6244864 6001664 5611520 5615616 5428224
1484 5428224 6293504 4830208 6021120 5768704 5499392 4938240 5740032 5380096 5058048
1475 5058048 5143552 7036928 5677568 5540864 5280768 5548032 5403648 6798336 5652992
1466 5652992 5244416 5023232 4475392 4391424 5843456 5245440 5501440 6098944 5135360 6231040
1456 6231040 5645312 5606400 4879360 5803008 6884864 7302656 5852160 7319040 7472640
$$ packed form
1522G637504J092096k276352K210816J80224r5744k86720j325568L15904p76704
1513F675456l44576K6112L73760q1408N96480j720320O21056N89312k59072l41504
1503F135296J06496l09760J160704j079296n89312O19008l96800L4816o24640
1494E056512J167872m94080K82624K45760o59968O46144k43200l90144M096j87392
1484E428224Q65280j463296J190912k52416k69312n61152Q01792l59936l22048
1475E058048Q5504J893376j359360j36704k60096K67264j44384J394688j145344
1466E652992m08576k21184n47840q3968J452032n98016K56000N97504r63584J095680
1456F231040n85728l8912p27040R23648J081856M17792j450496J466880J53600
$$ plain form
1447 7472640 7201280 7409152 6685184 7475712 6297600 7241728 7706624 7873024 9040896
1438 9040896 8657408 8683520 8415744 9947136 11694592 11197440 12359168 13758464 13629952
1429 13629952 13101568 13686272 12637696 11769856 10701824 10862080 11053568 10850304 11029504
1420 11029504 10286592 10547200 11915776 9895424 10711040 11070976 10364928 10823168 9327104
1411 9327104 9593856 9864192 9761792 10492928 9359360 10223616 9491456 9467392 10454528 9813504
1401 9813504 9713152 10283520 10735616 10112512 11325440 11906560 14020608 14477824 14834688
1392 14834688 15049728 15042048 15456768 15542784 14732800 15020032 14465536 12681728 13051904 12076544
1382 12076544 9608192 10463232 10444288 10119168 9854976 10304512 10143232 10354688 9734656
$$ packed form
1447G472640k71360K07872p23968P90528j178112R44128M64896J66400J167872
1438I040896l83488K6112k67776J531392J747456m97152J161728J399296j28512
1429A3629952n28384N84704j048576q67840j068032J60256J91488k03264J79200
1420A1029504p42912K60608J368576k020352Q15616L59936p06048M58240j496064
1411I327104K66752K70336j02400P31136j133568Q64256p32160k4064R87136o41024
1401I813504j00352N70368M52096o23104J212928N81120K114048M57216L56864
1392A4834688K15040p680M14720Q6016q09984K87232n54496j783808L70176r75360
1382A2076544k468352Q55040j8944l25120k64192M49536j61280K11456o20032
$$ plain form
1373 9734656 9241088 8843776 10587648 9793024 9368064 8669696 10758656 10261504 11280896
1364 11280896 11307008 12537856 12822016 13027840 13403136 12738048 11989504 10593792 10351104
1355 10351104 10285568 10610688 9847296 9651200 9751552 9829888 8671232 8056832 8693760 8464896
1345 8464896 8083456 8068608 7492096 7705088 6961664 8511488 7587840 6647808 7519744 7548928
1335 7548928 7972864 6658048 7788544 6465536 7377408 6328832 7404032 7391744 6601728
1326 6601728 7149056 6466560 7031808 7493120 6967808 6799872 6008320 7033856 6764544
1317 6764544 4885504 6194688 5465088 5024768 4651008 4670464 4690944 5171200 4065280
1308 4065280 4723200 3684352 4200960 3138048 3834368 3783680 2731520 3431936 3489792
$$ packed form
1373I734656m93568l97312J743872p94624m24960o98368K088960m97152J019392
1364A1280896K6112J230848K84160K05824L75296o65088p48544j395712k42688
1355A0351104o5536L25120p63392j96096J00352P8336j158656o14400O36928k28864
1345H464896l81440j4848n76512K12992p43424J549824r23648r40032Q71936K9184
1335G548928M23936j314816J130496j323008R11872j048576J075200j2288p90016
1326F601728N47328o82496N65248M61312n25312j67936p91552J025536k69312
1317F764544j879040J309184p29600m40320l73760J9456K0480M80256j105920
1308D065280O57920j038848N16608j062912O96320n0688j052160P00416N7856
$$ plain form
1299 3489792 4106752 3960832 2500096 3020800 2798080 3637248 2914816 2150400 3152384
1290 3152384 3132928 3165696 2705920 2449920 2420224 2846208 2543616 2979328 2519040 2613248
1280 2613248 1739776 1981440 2334720 2869760 1643520 2699264 1809408 1373184 2732032
1271 2732032 2736640 1476608 1812480 2752000 1882112 2368000 2701824 2531840 1724928 1800704
1261 1800704 1780736 2290176 2428928 2466816 1398272 2003456 1179136 1363968 2109440 2208256
1251 2208256 2916352 2476544 2452992 1776640 1871360 2371584 1964544 2674688 2025984 1481216
1241 1481216 2555904 2585088 2711040 1071616 1972224 3252736 2390528 1683968 2509824
1232 2509824 1536000 2236416 2499072 2752512 2626048 2754048 1669120 2886144 3106816
$$ packed form
1299C489792O16960j45920j460736N20704k22720Q39168p22432p64416J001984
1290C152384j9456L2768m59776k56000k9696M25984l02592M35712m60288R4208
1280B613248q73472K41664L53280N35040j226240J055744q89856m36224J358848
1271B732032M608j260032L35872R39520q69888M85888L33824j69984q06912P5776
1261A800704j9968N09440J38752L7888j068544O05184q24320J84832P45472R8816
1251B208256P08096m39808k3552o76352R4720N00224m07040P10144o48704n44768
1241A481216J074688K9184J25952A071616R00608J280512q62208p06560Q25856
1232B509824r73824P00416K62656K53440j26464J28000j084928J217024K20672
$$ plain form
1223 3106816 1899520 2499584 1922048 1713664 1633792 2012672 1131008 1978368 2750464 1786368
1213 1786368 2905088 2736640 3190784 2651648 2796544 1427456 2843648 1818112 2538496
1204 2538496 2161152 1590784 1641984 2846720 1380864 1289728 1601536 1910272 2302464 2266624
1194 2266624 2466816 1751552 2102784 1447424 1725440 2488832 2258944 2542080 1454592
1185 1454592 1353216 486912 1245696 2509824 1805824 1672192 2326528 1181696 1362944
1176 1362944 2192896 2247680 1588224 2507776 1655296 2492928 2150400 2105856 2546688 1261056
1165 1424384 1696768 1780224 1835520 2269696 1356800 2270720 1958912 2851840 2002432 1410048
1155 1410048 2332160 2146816 1892352 1458688 651264 1390080 1736704 1947136 2077696 1676288
$$ packed form
1223C106816j207296O00064n77536k08384p9872L78880q81664Q47360P72096r64096
1213A786368J118720j68448M54144n39136J44896j369088J416192j025536P20384
1204B538496l77344n70368N1200J204736A380864r1136L11808L08736L92192l5840
1194B266624K00192p15264L51232o55360K78016P63392k29888K83136j087488
1185A454592j01376D86912P58784J264128p04000j33632O54336j144832J81248
1176A362944Q29952N4784o59456R19552q52480Q37632l42528m4544M40832A261056
1165A424384K72384Q3456N5296M34176r12896R13920l11808Q92928q49408n92384
1155A410048R22112j85344k54464m33664F51264P38816L46624K10432J30560m01408
$$ plain form
1145 1676288 2034688 1297408 1352704 1456640 1410048 1802240 2000384 1546752 1981952 1216000
1135 1216000 1501696 1779200 1115136 842240 1886720 1506304 2372096 1428992 2282496
1126 2282496 1813504 678400 2256384 1729536 1758208 1783296 660480 1571840 2274816 1689600
1116 1689600 1676800 2046976 1708544 2020864 1355776 845312 1449472 1885184 1115648 1477632
1106 1477632 826368 391168 1289728 582144 1984000 1619456 2130432 2212352 1737728 1388032
1096 1388032 2772480 2356736 1138176 1412096 2680320 1750016 90624 1256960 2246656
1087 2246656 1982464 1548288 1553920 2087424 1998848 1991680 1609728 579584 1367552 1696256
1077 1696256 1777152 1006592 1423360 1397760 1411072 1117696 2201088 1689600 1942528 1854464
$$ packed form
1145A676288L58400p37280N5296J03936m6592L92192J98144m53632M35200p65952
1135A216000K85696K77504o64064k72896J044480l80416Q65792r43104Q53504
1126B282496m68992F78400J577984n26848K8672K5088F60480R11360P02976n85216
1116A689600j2800L70176l38432L12320o65088n10464O04160M35712p69536L61984
1106A477632o51264C91168Q98560E82144J401856l64544N10976Q1920m74624l49696
1096A388032J384448m15744A138176K73920J268224r30304I0624J166336R89696
1087B246656k64192m34176N632N33504q8576p168l81952E79584P87968L28704
1077A696256Q0896p70560M16768k5600J3312k93376J083392n11488K52928q8064
$$ plain form
1067 1854464 1356288 1222144 1252352 1743360 1443328 1756160 1433088 1735680 1261568 819712
1057 819712 1483264 1901056 1788416 1601024 1916416 1528320 1953280 2460160 1579520 2419200
1047 2419200 911360 1623040 340992 981504 1474048 873472 702464 350720 92672 1587200
1037 1587200 1429504 1631232 213504 750592 467968 2369536 1345024 789504 1813504
1028 1813504 -50688 2004480 1277440 105472 1185792 1026048 1061376 171520 854016 578560
1018 578560 1628672 724992 1724416 1925120 1153024 906240 857088 637440 1529856 1379328
1008 1379328 1021952 1454080 1216000 1904128 578560 906240 236032 156160 1842688 1379328
998 1379328 684032 1188352 1305600 617984 -266752 977408 318464 1808384 1489920 1882112
$$ packed form
1067A854464m98176j34144L0208M91008l00032L12832l23072L02592m74112m41856
1057H19712O63552M17792j12640j87392L15392l88096M24960N06880q80640Q39680
1047B419200I11360P11680C40992O40512M92544o00576j71008C50720I2672J494528
1037A587200j57696K01728B13504N37088k82624J901568j024512n55520J024000
1028A813504e0688B004480p27040A05472J080320j59744L5328A71520O82496k75456
1018E78560J050112G24992R99424K00704p72096k46784m9152k19648Q92416j50528
1008A379328l57376M32128k38080O88128E78560L27680B36032p9872J686528m63360
998A379328F84032N04320J17248F17984b66752I77408C18464J489920l18464L92192
$$ plain form
988 1882112 472576 1415168 602624 1062400 183808 1156608 1384960 2138112 1231872 743936
978 743936 1055232 1344512 1650688 363008 2292736 2282496 1735680 1941504 2657792 2310144
968 2310144 2762752 3588096 4083712 5125632 5265920 4137984 4032000 4699648 4375552
959 4375552 5078528 5779456 5423616 4990976 6540800 6575104 8582144 9589248 10159104
950 10159104 16202752 28910592 48138752 68582400 73318400 52923904 27126272 15670272
942 15670272 11276288 8287744 6807552 6446080 4034560 4174848 3773440 3703296 3773440
933 3773440 3800576 3163648 3709440 3514368 3281408 4898304 4382208 1928192 2902016 2698752
923 2698752 4215296 1672192 2318336 1802240 1992192 2106368 1741312 1972224 2294272
$$ packed form
988A882112D72576R42592F02624M59776A83808R72800K28352P53152r06240m87936
978G43936L11296K89280L06176C63008J929728j0240n46816K05824P16288l47648
968B310144M52608Q25344M95616J041920J40288j127936j05984O67648l24096
959D375552P02976P00928l55840m32640J549824L4304K007040J007104N69856
950A0159104O043648J2707840J9228160K0443648M736000k0394496k5797632j1456000
942A5670272m393984k988544j480192l61472k411520J40288m01408p0144P0144
933C773440K7136o36928N45792j95072k32960J616896n16096A928192R73824k03264
923B698752J516544A672192O46144n16096J89952J14176l65056K30912L22048
$$ plain form
914 2294272 2445312 2349056 2737152 1792512 1092608 1407488 1767424 736256 1621504 1389568
904 1389568 1711104 2052096 788480 984064 2118144 1329664 1434112 2249728 632320 1364480
894 1364480 1200640 1478656 1578496 803840 1577984 1989120 894976 1219584 1477120 1795584
884 1795584 2131456 738304 1628672 1807360 1839104 992768 1519616 1142784 1464320 1128448
874 1128448 763392 242176 1579520 1765376 1328128 1694208 877056 815616 1534464 570368
863 808448 1230336 726016 1329664 1609216 857088 767488 1911296 999936 1420288 680448
852 249856 1259008 1024000 354816 1267200 2298368 1732096 330752 956928 1863680 1768448
842 1768448 -33280 1143296 1570304 553472 1473536 335872 1111040 221184 1421312 1853440
$$ packed form
914B294272J51040r6256L88096r44640o99904L14880L59936G36256Q85248k31936
904A389568L21536L40992G88480J95584J134080p88480J04448Q15616F32320P32160
894A364480j63840K78016R9840p74656P74144M11136H94976L24608K57536L18464
884A795584L35872G38304Q90368J78688L1744q46336N26848l76832L21536l35872
874A128448l65056B42176J337344J85856m37248L66080q17152o1440P18848E70368
863H08448M21888n04320O03648K79552p52128q9600J143808r11360M20352F80448
852B49856J009152k35008C54816R12384J031168n66272C30752O26176R06752r5232
842A768448c3280A143296M27008E53472R20064C35872P75168B21184J200128M32128
$$ plain form
832 1853440 1004544 404480 1086976 883200 919552 496640 516608 1080320 691200 607744
822 607744 528896 1210880 -697344 1230848 855552 806400 1284096 1650688 801280 1530368
812 1530368 160768 448000 1118720 391680 72192 1100800 335360 1064960 1856000 53760
801 -590848 9728 380928 1890304 1133568 1891840 879616 951808 436736 332288 1641472
791 1641472 495616 459264 750592 -683008 1003520 1430528 423424 741888 702976 812032
781 812032 402944 1325056 -310272 874496 617472 721920 506880 1684992 1120256 1492480
771 1492480 508416 509440 209920 1740288 1068544 1084416 892928 1882112 -335360 398848
760 493056 712192 420864 168960 1209344 201216 768000 1007104 1537536 1796096 1168384
$$ packed form
832A853440q48896D04480O82496k03776L6352m22912J9968N63712l89120q3456
822F07744p8848O81984f97344A230848l75296m9152M77696L66592H01280P29088
812A530368A60768K87232O70720C91680G2192J028608C35360P29600P91040E3760
801e90848I728L71200J509376p56736P58272H79616P2192D36736j04448J309184
791A641472D95616l6352K91328f83008A003520M27008D23424L18464l8912J09056
781H12032D02944R22112c10272H74496k57024J04448k15040J178112n64736L72224
771A492480E08416J024B09920J530368o71744J5872j91488R89184c35360C98848
760D93056K19136k91328A68960J040384B01216N66784K39104N30432K58560o27712
$$ plain form
750 1168384 530432 110592 1051648 -190464 1058816 778240 1044480 885760 1902592
741 1902592 989696 701440 77312 541696 465920 1531904 1376768 1700352 1370624 475648
730 1065472 749056 878080 706560 1423872 1700864 949248 488960 856576 551936 924672
720 924672 512000 152576 513024 366080 1382912 504320 409600 850944 744960 1092096
710 1092096 1547264 -77312 907776 1466368 1758720 350208 1757184 2330112 1059840 1162240
700 1162240 2158592 898560 1131520 565760 805376 2063360 1536000 1808896 688128 -22528
689 385024 997376 2027520 1004544 1179648 1425408 1679360 1770496 3024896 1901568
680 1901568 1827840 194560 147456 374784 1560576 325120 -387072 299520 53248 674816
$$ packed form
750A168384E30432A10592R41056a90464A058816k80576K66240j58720J016832
741A902592r12896k88256G7312M64384p5776J065984j55136L23584l29728D75648
730A065472l16416J29024j71520P17312K76992p51616m60288L67616l04640L72736
720I24672m12672A52576L60448j46944J016832E04320r4720M41344j05984L47136
710A092096M55168g7312I07776N58592K92352C50208J406976N72928A059840J02400
700A162240R96352H98560K32960E65760K39616J257984n27360K72896F88128b2528
689C85024O12352J030144A004544J75104K45760K53952R1136J254400j123328
680A901568p3728A94560m7104K27328J185792C25120c87072B99520E3248O21568
$$ plain form
670 674816 684544 1452032 996864 627712 654848 1287168 132096 526336 880640 1234944
660 1234944 1204224 631808 367616 -82944 421888 1231872 -93696 685056 501760 774144
650 774144 499200 190976 -389632 993792 586752 298496 289280 -28672 733184 1246720
640 1246720 -88064 413696 119296 585216 1027584 101376 145408 889344 514048 1232384
630 1232384 844288 1043456 434176 268288 800768 -225280 569856 752128 1697280 1220096
620 1220096 120320 285696 697856 1160704 -28160 1678336 431616 1066496 1104896 1090560
610 1090560 255488 1081856 485888 467968 1153536 -322048 353280 -543232 327168 946688
600 946688 720896 -386048 1184256 -127488 40448 813056 22016 -524800 1861120 413696
$$ packed form
670F74816R728P67488m55168l69152K7136O32320A32096L94240L54304L54304
660A234944l0720n72416k64192h2944D21888Q09984i3696F85056j83296K72384
650G74144k74944A90976c89632I93792m07040k88256r216b8672G33184N13536
640A246720h8064D13696A19296M65920M42368A01376M4032P43936l75296P18336
630A232384l88096J99168D34176j65888N32480b25280E69856J82272R45152m77184
620A220096A20320J65376M12160M62848b8160A678336D31616O34880L8400j4336
610A090560B55488Q26368D85888j7920O85568c22048C53280e43232C27168O19520
600I46688k25792c86048A184256a27488D0448P72608B2016e24800A861120D13696
$$ plain form
589 1168896 -21504 803840 327680 856576 589312 -172544 830464 1208320 -255488 235008
578 337920 470016 1198592 26624 887296 304128 1015808 483328 -102912 166912 244736
568 244736 282112 197632 -147456 730624 568320 649728 1223680 84992 359424 899072 466944
557 466944 468480 -174080 77312 379392 315392 854016 52224 -399872 159232 1005056 632832
546 632832 -357888 713728 -628224 145408 -53248 1195520 624640 -243712 987648 412160
535 471040 1205248 -529408 880128 561152 484864 777728 646656 837632 331264 224768
525 224768 928256 327680 823296 1107456 -705536 -122880 -308224 -276480 828416 1062912
515 1062912 -149504 330240 -20992 320512 107008 1247744 170496 1150464 -779776 1169920
$$ packed form
589A168896b1504H03840C27680N28896k67264a72544H30464L77856b55488B35008
578C37920J32096P28576B6624Q60672C04128P11680D83328a02912A66912P7824
568B44736L7376q4480a47456G30624j62304Q1408N73952H4992K74432N39648m32128
557D66944J536a74080G7312L02080o4000N38624E2224c99872A59232Q45824l72224
546F32832c57888G13728f28224A45408e3248A195520n70880b43712I87648D12160
535D71040P34208e29408H80128l18976p6288K92864j31072J90976C31264j06496
525B24768P03488C27680M95616K84160g05536a22880j85344L1744H28416K34496
515A062912a49504C30240b0992C20512A07008J140736A70496R79968g79776A169920
$$ plain form
504 526848 687104 66560 798208 867328 527360 0 877568 477184 1105408 460800 -68608
492 812032 857088 155648 262144 371712 -675328 46592 1537024 13312 565760 552448
482 552448 1213952 40448 104960 1109504 1277440 370688 694272 -75776 -674304 214528
471 -187904 838144 -378368 875520 452096 1167872 517632 -178176 387072 -272384 180224
460 1081344 -133632 35328 1032192 184320 96256 89600 769536 1076736 192000 -368640
449 216576 427520 208896 113152 954880 454656 33280 415232 35840 646144 338944
439 338944 -364032 -586752 890880 -378880 506368 573440 599040 39936 159744 286720
429 286720 -47616 -107520 -585216 257024 106496 642560 482816 645632 1522688 845824
$$ packed form
504E26848J60256F6560P31648O9120l39968@H77568m00384O28224D60800f8608
492H12032M5056A55648J06496J09568f75328D6592J490432A3312N52448j3312
482E52448O61504D0448O4512J004544J67936C70688L23584g5776n98528B14528
471a87904H38144c78368H75520m23424P15776E17632a78176C87072b72384A80224
460A081344a33632C5328R96864A84320q8064o656O79936L07200A92000c68640
449B16576K10944B08896r5744Q41728D54656C3280L81952C5840O10304l07200
439C38944c64032k22720H90880c78880E06368O7072K5600C9936J19808J26976
429B86720d7616n9904m77696B57024A06496N36064j59744J62816Q77056o76864
$$ plain form
419 845824 1125888 412160 1310720 1688576 1197056 882176 1484800 220160 -109056 531968
408 694784 723968 1176576 122880 -525824 -60416 585728 958976 303104 365056 1159680
398 1159680 318976 317440 -170496 854016 829440 -2560 1317888 936448 178176 754688
388 754688 -728064 -254464 399872 -249856 588800 308736 -557056 477696 1093120 180224
377 23552 -179712 -114176 -36864 445952 386560 167936 -272896 337408 -963584 585216 344576
366 344576 281600 1000960 513536 369664 -194560 -612352 415232 663552 1836544 105472
355 -109568 -980480 512000 103424 22016 -617472 782336 64512 -207872 -149504 -295936
345 -295936 -969728 250368 449536 239616 1200128 -251904 -601600 952320 244736 540672
$$ packed form
419H45824K80064D12160Q98560L77856m91520l14880O02624B20160a09056E31968
408F94784K9184M52608A22880e25824f0416E85728L73248C03104O1952P94624
398A159680C18976j536a70496H54016k4576b560A317888l81440A78176N76512
388G54688g28064b54464C99872b49856E88800k80064e57056D77696O15424A80224
377B3552a79712O5536c6864D45952n9392A67936b72896C37408i63584E85216k40640
366C44576o2976P19360m87424j43872a94560m17792D15232K48320J172992A05472
355a09568q70912E12000A03424B2016f17472G82336F4512b07872N8368j46432
345b95936o73792B50368J99168k09920R60512b51904l49696I52320B44736K95936
$$ plain form
335 540672 -489984 1101824 323072 -976896 -539136 715264 504320 1258496 65536 -176128
324 1419776 433664 71168 -62976 -189440 -369152 342528 621568 560640 444416 -1054720
313 905216 36352 1239552 281600 -701952 471552 64512 208384 -164864 -707584 -644608
303 -644608 -384512 164864 1324032 421888 1205760 -110592 -419840 1133568 -35840 34816
292 -269824 204288 196608 1124864 22016 918016 -73728 316416 -283648 -236032 -329216 198144
280 -202752 1308672 -317952 -81920 -173056 -883200 -358912 -208896 -372736 154624 461312
270 461312 -830976 103936 166912 799232 748032 -239104 383488 -48128 776704 -502272
259 254464 501248 -917504 339968 556544 452096 754176 -519168 -820224 -138240 312832
$$ packed form
335E40672d89984A101824C23072i76896M37760G15264k10944P54176F5536a76128
324A419776D33664G1168f2976j26464j79712C42528K79040o0928j16224a054720
313I05216C6352J203200B81600g01952D71552F4512J43872a64864n42720O2976
303f44608K60096A64864J159168D21888P83872a10592l09248A133568c5840C4816
292b69824B04288p680R28256B2016Q96000g3728C16416b83648M7616r3184A98144
280b02752A308672c17952h1920r1136p10144c58912J50016j63840A54624L06688
270D61312h30976A03936O2976O32320n1200b39104C83488d8128G76704e02272
259B54464K46784i17504C39968K16576j04448L02080e19168l01056a38240C12832
$$ plain form
248 -786432 744448 -51200 168448 105984 -715776 393728 -656896 -522240 468992 123904
237 -135168 110592 69632 -854016 202240 -207360 -1092096 407040 231424 -260096 -313856
227 -313856 -179712 484864 112128 161280 1035264 528384 245760 396288 -75264 -494080
217 -494080 -397824 45056 -443392 -46080 1507328 -433152 1680384 -132608 386048 3072
206 493056 469504 278016 -126976 452096 -90624 556032 71168 331264 1309696 456192
195 400384 396288 -758784 -516608 -342016 122368 -39424 101376 -475648 208896 239104 291840
184 291840 -189440 851968 -413696 -640000 452096 549888 1205760 718336 1250816 268800
173 94720 489984 608768 -402944 -228352 702464 521216 -716800 -410624 -79872 781824
$$ packed form
248g86432G44448e1200A68448o2464g15776C93728f56896J34656D68992A23904
237a35168A10592m0960h54016B02240b07360q84736D07040j75616b60096n3760
227c13856J34144D84864A12128M9152Q73984n06880B45760J50528g5264m18816
217d94080R6256D5056d43392d6080A507328d33152A680384a32608C86048C072
206D93056k3552j91488a26976D52096i0624E56032G1168K60096R78432D56192
195D00384m096g58784K42176J74592A22368c9424A01376d75648B08896L0208N2736
184B91840a89440H51968d13696k26304D52096R7792O55872m87424N32480B68800
173I4720L95264J18784d02944J74592G02464j81248g16800L06176g9872G81824
$$ plain form
162 477184 55808 -699904 352256 381952 -497664 -5120 1081344 595456 -233984 -264192 728064
150 139264 932352 255488 234496 -36352 249856 -145920 100864 -160768 1216512 -744448
139 -77824 172032 -666624 -20480 345600 121856 -952832 -107520 126464 372736 -307712
128 257024 -317440 372224 -227840 1297920 256000 187904 30720 -52736 429056 -488960
117 355328 190976 237568 -793600 489472 -2048 110592 -645632 355328 -516096 -395776
107 -395776 113152 585216 -1217536 -318464 18944 309248 791552 427008 582144 586240
97 586240 432640 -885760 -56832 786432 -658944 -103936 619008 755712 550400 -88064
86 -1299456 286208 431104 312832 279552 551424 605184 -576000 -245248 184832 -114688
$$ packed form
162D77184E5808f99904C52256K9696d97664e120A081344m85888b33984l0208G28064
150A39264P93088B55488k0992c6352B49856a45920A00864a60768A216512g44448
139g7824A72032f66624b0480C45600A21856i52832a07520A26464K46272c07712
128B57024c17440C72224b27840A297920B56000o8096C0720e2736D29056d88960
117C55328j64352M6592g93600D89472b048A10592f45632C55328e16096J20320
107c95776A13152M72064a217536c18464A8944K90304M82304l64544J55136M096
97E86240j53600h85760e6832G86432f58944a03936F19008J36704k05312h8064
86a299456B86208J44896j18272l3280K71872N3760e76000b45248A84832a14688
$$ plain form
75 964096 192000 -564224 485376 -368640 18944 -762368 568832 -22528 372736 148992
64 178176 577536 -542720 409088 -578048 1042432 22528 -81408 42496 210432 -408064
53 246272 -72192 494592 -54784 1013760 606720 -250880 35328 -267264 -578560 -377344
43 -377344 -97280 486912 -676352 -674304 52224 -331776 570880 570880 -1262592 663552 271360
31 302080 950272 994304 628224 -508928 -693760 726528 -344064 428032 -120320 37376
20 -825344 -125440 -690176 -843776 -1005568 -131072 243712 87552 351744 -103936 -6656 -284160
9 -284160 -415232 320512 515072 1514496 -413696 326144 -500224 -694272 -818176
0 -818176
$$ packed form
75I64096A92000e64224D85376c68640A8944g62368E68832b2528C72736A48992
64A78176L99360e42720D09088e78048A042432B2528h1408D2496J67936d08064
53B46272g2192D94592e4784A013760m07040b50880C5328b67264l11296K01216
43c77344i7280D86912f76352K048E2224c31776E70880%a262592F63552B71360
31C02080O48192M4032l66080e08928j84832G26528c44064D28032a20320C7376
20h25344a25440n64736j53600j61792a31072B43712H7552K64192a03936f656k77504
9b84160j31072C20512J94560R99424d13696C26144e00224j94048j23904
0h18176
##END=
