##TITLE=1241
##JCAMPDX= 6.0         $$ Bruker NMR JCAMP-DX V2.0
##DATA TYPE= NMR SPECTRUM
##DATA CLASS= XYDATA
##ORIGIN= NUTS EXPORT
##OWNER= Administrator
$$ 1.72 TOPSPIN		Version 2.1
$$ 2016-02-23 12:18:15.121 -0800  Administrator@X
$$ Compression mode = diff/dup
##.OBSERVE FREQUENCY= 90.275459
##.ACQUISITION MODE= SIMULTANEOUS (DQD)
##.ACQUISITION SCHEME= undefined
##.AVERAGES= 16
##.DIGITISER RES= 22
##SPECTROMETER/DATA SYSTEM= 
##.PULSE SEQUENCE= zg30
##.SOLVENT NAME= None
##.SHIFT REFERENCE= INTERNAL, None, 1, 14.85192
##AUDIT TRAIL= $$ (NUMBER, WHEN, WHO, WHERE, PROCESS, VERSION, WHAT)
$$ ##TITLE= Audit trail, TOPSPIN		Version 2.1
$$ ##JCAMPDX= 5.01
$$ ##ORIGIN= Bruker BioSpin GmbH
$$ ##OWNER= Administrator
$$ $$ E:/data/jwist/nmr/1241/1/pdata/1/auditp.txt
$$ ##AUDIT TRAIL=  $$ (NUMBER, WHEN, WHO, WHERE, PROCESS, VERSION, WHAT)
(   1,<2016-02-23 08:27:41.527 -0800>,<Administrator>,<X>,<jcamp>,<TOPSPIN 2.1>,
      <fromjdx created from
       E:\data\jwist\nmr\uniandes\1241
       data hash MD5: 8K
       3E 16 92 CD 1C E1 6C 01 46 B4 6E 06 7C 68 C6 93>)
$$ ##END=
$$ 
$$ $$ hash MD5
$$ $$ C5 16 63 4D 54 09 21 C0 27 15 6C 18 BA 0C F3 D8
##$RELAX= 
$$ Bruker specific parameters
$$ --------------------------
##$DU= <E:>
##$EXPNO= 1
##$NAME= <1241>
##$PROCNO= 1
##$TYPE= <nmr>
##$USER= <jwist>
##$ACQT0= 0
##$AMP= (0..31)
100 100 100 100 100 100 100 100 100 100 100 100 100 100 100 100 100 100
100 100 100 100 100 100 100 100 100 100 100 100 100 100
##$ANAVPT= 1
##$AQSEQ= 0
##$AQ_mod= 3
##$AUNM= <au_zg>
##$AUTOPOS= <>
##$BF1= 90.275459
##$BF2= 400.02
##$BF3= 400.02
##$BF4= 400.02
##$BF5= 400.02
##$BF6= 400.02
##$BF7= 400.02
##$BF8= 400.02
##$BYTORDA= 0
##$CFDGTYP= 0
##$CFRGTYP= 0
##$CHEMSTR= <none>
##$CNST= (0..63)
1 1 145 1 1 1 1 1 1 1 1 1 1 1 1 1 1 1 1 1 1 1 1 1 1 1 1 1 1 1 1 1 1 1 1
1 1 1 1 1 1 1 1 1 1 1 1 1 1 1 1 1 1 1 1 1 1 1 1 1 1 1 1 1
##$CPDPRG= <>
##$CPDPRG1= <>
##$CPDPRG2= <>
##$CPDPRG3= <>
##$CPDPRG4= <mlev>
##$CPDPRG5= <mlev>
##$CPDPRG6= <mlev>
##$CPDPRG7= <mlev>
##$CPDPRG8= <mlev>
##$CPDPRGB= <>
##$CPDPRGT= <>
##$D= (0..63)
0 1 0 0 0 0 0 0 0 0 0 0 0 0 0 0 0 0 0 0 0 0 0 0 0 0 0 0 0 0 0 0 0 0 0 0
0 0 0 0 0 0 0 0 0 0 0 0 0 0 0 0 0 0 0 0 0 0 0 0 0 0 0 0
##$DATE= 0
##$DBL= (0..7)
120 120 120 120 120 120 120 120
##$DBP= (0..7)
150 150 150 150 150 150 150 150
##$DBP07= 0
##$DBPNAM0= <>
##$DBPNAM1= <>
##$DBPNAM2= <>
##$DBPNAM3= <>
##$DBPNAM4= <>
##$DBPNAM5= <>
##$DBPNAM6= <>
##$DBPNAM7= <>
##$DBPOAL= (0..7)
0.5 0.5 0.5 0.5 0.5 0.5 0.5 0.5
##$DBPOFFS= (0..7)
0 0 0 0 0 0 0 0
##$DE= 6.5
##$DECBNUC= <off>
##$DECIM= 2432
##$DECNUC= <off>
##$DECSTAT= 4
##$DIGMOD= 1
##$DIGTYP= 12
##$DL= (0..7)
0 120 120 120 120 120 120 120
##$DP= (0..7)
150 150 150 150 150 150 150 150
##$DP07= 0
##$DPNAME0= <>
##$DPNAME1= <>
##$DPNAME2= <>
##$DPNAME3= <>
##$DPNAME4= <>
##$DPNAME5= <>
##$DPNAME6= <>
##$DPNAME7= <>
##$DPOAL= (0..7)
0.5 0.5 0.5 0.5 0.5 0.5 0.5 0.5
##$DPOFFS= (0..7)
0 0 0 0 0 0 0 0
##$DQDMODE= 0
##$DR= 22
##$DS= 2
##$DSLIST= <SSSSSSSSSSSSSSS>
$$ [...]
##$SPOFFS= (0..31)
0 0 0 0 0 0 0 0 0 0 0 0 0 0 0 0 0 0 0 0 0 0 0 0 0 0 0 0 0 0 0 0
##$SUBNAM0= <"">
##$SUBNAM1= <"">
##$SUBNAM2= <"">
##$SUBNAM3= <"">
##$SUBNAM4= <"">
##$SUBNAM5= <"">
##$SUBNAM6= <"">
##$SUBNAM7= <"">
##$SUBNAM8= <"">
##$SUBNAM9= <"">
##$SW= 20.5580556627758
##$SWIBOX= (0..15)
0 0 3 4 0 0 0 0 0 0 0 0 0 0 0 0
##$SW_h= 8223.68421052631
##$SWfinal= 0
##$TD= 65536
##$TD0= 1
##$TE= 300
##$TE2= 300
##$TE3= 300
##$TEG= 300
##$TL= (0..7)
0 120 120 120 120 120 120 120
##$TP= (0..7)
150 150 150 150 150 150 150 150
##$TP07= 0
##$TPNAME0= <>
##$TPNAME1= <>
##$TPNAME2= <>
##$TPNAME3= <>
##$TPNAME4= <>
##$TPNAME5= <>
##$TPNAME6= <>
##$TPNAME7= <>
##$TPOAL= (0..7)
0.5 0.5 0.5 0.5 0.5 0.5 0.5 0.5
##$TPOFFS= (0..7)
0 0 0 0 0 0 0 0
##$TUNHIN= 0
##$TUNHOUT= 0
##$TUNXOUT= 0
##$USERA1= <user>
##$USERA2= <user>
##$USERA3= <user>
##$USERA4= <user>
##$USERA5= <user>
##$V9= 5
##$VALIST= <valist>
##$VCLIST= <CCCCCCCCCCCCCCC>
##$VD= 0
##$VDLIST= <DDDDDDDDDDDDDDD>
##$VPLIST= <PPPPPPPPPPPPPPP>
##$VTLIST= <TTTTTTTTTTTTTTT>
##$WBST= 1024
##$WBSW= 4
##$XGAIN= (0..3)
0 0 0 0
##$XL= 0
##$YL= 0
##$YMAX_a= 1139748992
##$YMIN_a= -1972307.456
##$ZGOPTNS= <>
##$ZL1= 120
##$ZL2= 120
##$ZL3= 120
##$ZL4= 120
##$ABSF1= 10
##$ABSF2= 0
##$ABSG= 5
##$ABSL= 3
##$ALPHA= 0
##$AQORDER= 0
##$ASSFAC= 0
##$ASSFACI= 0
##$ASSFACX= 0
##$ASSWID= 0
##$AUNMP= <proc_1d>
##$AXLEFT= 0
##$AXNAME= <>
##$AXNUC= <off>
##$AXRIGHT= 0
##$AXTYPE= 0
##$AXUNIT= <>
##$AZFE= 0.1
##$AZFW= 0.1
##$BCFW= 1
##$BC_mod= 2
##$BYTORDP= 0
##$COROFFS= 0
##$CY= 15
##$DATMOD= 1
##$DC= 2
##$DFILT= <>
##$DTYPP= 0
##$F1P= 0
##$F2P= 0
##$FCOR= 0.5
##$FTSIZE= 0
##$FT_mod= 4
##$GAMMA= 1
##$GB= 0
##$INTBC= 1
##$INTSCL= 1
##$ISEN= 128
##$LB= 0.3
##$LEV0= 0
##$LPBIN= 0
##$MAXI= 10000
##$MC2= 0
##$MEAN= 0
##$ME_mod= 0
##$MI= 0
##$NCOEF= 0
##$NC_proc= -9
##$NLEV= 6
##$NOISF1= 0
##$NOISF2= 0
##$NSP= 1
##$NTH_PI= 0
##$NZP= 0
##$OFFSET= 14.85192
##$PC= 1
##$PHC0= 0
##$PHC1= 0
##$PH_mod= 0
##$PKNL= yes
##$PPARMOD= 0
##$PPDIAG= 0
##$PPIPTYP= 0
##$PPMPNUM= 2147483647
##$PPRESOL= 1
##$PSCAL= 4
##$PSIGN= 0
##$PYNMP= <proc.py>
##$REVERSE= no
##$SF= 90.2741182557478
##$SI= 8192
##$SIGF1= 0
##$SIGF2= 0
##$SINO= 400
##$SIOLD= 32768
##$SPECTYP= <>
##$SREGLST= <1H.CDCl3>
##$SSB= 0
##$STSI= 0
##$STSR= 0
##$SW_p= 1497.18866228788
##$SYMM= 0
##$S_DEV= 0
##$TDeff= 0
##$TDoff= 0
##$TI= <>
##$TILT= no
##$TM1= 0
##$TM2= 0
##$TOPLEV= 0
##$USERP1= <user>
##$USERP2= <user>
##$USERP3= <user>
##$USERP4= <user>
##$USERP5= <user>
##$WDW= 1
##$XDIM= 8192
##$YMAX_p= 1139748864
##$YMIN_p= -1972224
##$CURPLOT= <PDFCreator>
##$CURPRIN= <$PDFCreator>
##$DFORMAT= <normdp>
##$LAYOUT= <+/1D_H.xwp>
##$LFORMAT= <normlp>
##$PFORMAT= <normpl>
##$SURQMSG= 1
$$ End of Bruker specific parameters
$$ ---------------------------------
##XUNITS= HZ
##YUNITS= ARBITRARY UNITS
##XFACTOR= 0.182762287876938
##YFACTOR= 1
##DELTAX= -0.182762287876938
##NPOINTS= 8192
##FIRSTX= 1497.0059
##FIRSTY= -1076736
##LASTX= 0
##MAXY= 1139748864
##MINY= -1972224
##XYDATA= (X++(Y..Y))
$$ plain form
8191 -1076736 128512 -830976 87552 991232 -928256 513536 -404480 -263680 103936 344064
8181 344064 1170944 512512 -846336 281088 221184 -830464 -455680 642560 452608 -446464
8170 -354816 -647680 -117248 296960 -397312 -296448 528896 -132608 -1150976 -38400 -79872
8160 -79872 -152064 -1121280 152576 -51712 -562688 6656 -608256 -333312 418304 -1565184
8149 -1583104 -486400 129536 -71168 -638464 -859136 414208 -397312 972288 -1158656 -48128
8138 1149440 220672 -366592 -581632 589312 -574464 -89600 49152 -19968 -23552 520192
8127 -636928 823296 -290816 -212480 425984 -110080 -871424 -558080 -638464 374272 655360
8117 655360 -595456 593408 356352 -216064 -988160 -230400 -972288 125440 -108544 -65536
$$ packed form
8191a076736A28512h30976H7552R03680i28256E13536d04480J40800A03936K40128
8181C44064Q26880E12512h46336B81088n9904h30464L74784F42560j89952d46464
8170c54816k92864a17248B96960c97312J00864E28896a32608j018368c8400m1472
8160g9872p2192r69216A52576e1712n10976F656f08256K74944D18304a565184
8149a583104d86400A29536g1168n67296k20672D14208c97312I72288a158656d8128
8138A149440B20672c66592k15040E89312e74464h9600D9152a9968l584E20192
8127f36928H23296b90816P8336D25984a10080p61344L13344q0384C74272K81088
8117F55360e95456E93408k37056b16064p72096b30400p41888A25440a08544M3008
$$ plain form
8107 -65536 -194560 -23552 333312 -55808 -433664 660480 -644096 -146944 -337920 141824
8096 304640 -825856 657408 49152 -747520 -135680 301056 26624 -968192 467968 171520
8085 407552 258560 106496 283136 -561664 -354304 974336 -198144 -7680 1883136 -446464
8074 38400 -219136 16384 -68608 -321024 -462336 92672 -449024 396288 648192 -19456 -172032
8063 -172032 -1086464 65024 -80384 801792 -792576 -266240 -259072 -550400 30208 240640 -620544
8051 207360 -414720 -357888 -211968 3584 -250368 186368 -1611264 -112640 45568 218112
8041 218112 169984 -112640 -363008 677376 -683520 339456 615424 -285184 117760 -350720
8030 77824 -72192 -189440 -326144 -252416 481280 -299008 -373760 -145920 -816640 -357888
$$ packed form
8107f5536j29024b3552C33312e5808l77856F60480f44096a46944j90976A41824
8096C04640h25856F57408D9152g47520a35680C01056B6624i68192D67968A71520
8085D07552j48992A06496J76640e61664K07360I74336a98144g680A883136d46464
8074C8400b19136A6384f8608k52416j41312I2672d49024C96288K51904a9456j52576
8063a72032r14432F5024h0384H01792g92576b66240P168k91328C0208K10432f20544
8051B07360d14720N6832J45920C584b50368A86368a611264a12640D5568J72544
8041B18112m8128a12640k50368F77376f83520C39456K75968b85184A17760c50720
8030G7824g2192j17248j36704P3728D81280b99008p4752a45920o70720c57888
$$ plain form
8019 975360 576000 -2560 -1129472 -361472 410112 -140288 -817664 331776 694272 -756224
8008 -274944 380928 1317888 1648640 -196096 -697344 400384 -260608 379392 -91648 921088
7997 147456 -768000 374272 -428032 -1207808 569856 -385536 435200 -955904 -669696 -660992
7987 -660992 -354304 -10752 219136 193024 -84480 -619008 87040 -260096 541184 -404480
7976 1047552 -155648 22528 182784 264704 422400 -247808 100864 856576 82432 -741888
7965 543744 1036800 106496 -562688 -631808 178688 299520 1239040 -702976 744448 -383488
7954 1317888 -521728 -427520 17408 -138752 -180736 -431104 -616448 -993280 -31744 -354304
7944 -354304 -536064 94720 732160 -902656 -539136 293376 -865280 -126464 353792 -676352
$$ packed form
8019I75360l99360b560j126912c61472D10112a40288o77376C31776L62496g56224
8008b74944C80928R36960L30752a96096n01248D00384b60608C79392i1648I21088
7997A47456g68000C74272d28032p79776E69856c85536D35200i55904K86208Q704
7987f60992L06688a0752B19136k6112h4480n34528H7040b60096E41184d04480
7976A047552a55648B2528J60256Q1920J57696b47808A00864P55712H2432g41888
7965E43744M93056A06496e62688o9120A78688J20832R39520g02976G44448c83488
7954A317888e21728R4208A7408a38752m1984k50368j85344l76832c1744l22560
7944c54304j81760I4720O37440i02656L63520B93376h65280a26464C53792f76352
$$ plain form
7933 176640 -96768 -967680 -287744 871424 459776 58880 -743936 -190976 -361472 352768
7922 -755712 -430592 -687104 97280 15360 325632 -264704 228864 80896 -446464 -385536
7912 -385536 -610816 -811520 16896 -157184 -413184 103936 -412672 543232 -336384 -345088
7902 -345088 -259584 -15872 -8704 312320 -206848 536064 -630272 954880 11776 -379904 -498176
7891 -498176 -364544 -628224 280576 709632 -123392 -128000 176128 -517120 -333824 -915968
7881 -915968 83968 -548352 -655872 -44032 -511488 465408 -485888 635392 -94720 137216
7870 -119296 594944 621568 532480 115200 148992 138240 -217088 215552 -293888 308736
7859 141824 -1289728 -830976 -804352 -347648 -239616 -505344 -529408 219648 189952 -695296
$$ packed form
7933A76640i6768q70912b87744H71424m11648E8880g43936a90976j70496C52768
7922g55712L25120k56512I7280A5360L10272b64704B28864H0896d46464O0928
7912c85536k25280k00704A6896a57184k56000A03936d12672E43232c36384q704
7902c45088Q5504a5872P168C12320b06848E36064f30272I54880A1776c79904j18272
7891d98176J33632k63680B80576M29056a23392m608A76128e17120J83296n82144
7881i15968H3968e48352j07520d4032m67456D65408d85888F35392i4720A37216
7870a19296E94944K6624q9088A15200L3792j0752b17088B15552b93888C08736
7859A41824a289728M58752K6624c47648J08032k65728k4064B19648k9696f95296
$$ plain form
7848 -649216 790016 -357888 -222208 407552 116736 -307200 -516096 305152 -339968 -361984
7838 -361984 -23552 -130560 420352 -1349120 203776 148480 -493568 -399872 -342528 68096
7827 1250816 -223232 602624 853504 1019904 -198144 -149504 -194560 580096 -150016 520704
7816 -845824 -454656 482304 -816640 523264 200192 25600 -266240 274944 -557056 152064
7805 74752 -784384 123392 -203264 -833024 -84480 159232 -130560 198144 24064 -940544
7794 135680 -437248 -307200 -10240 96256 -339968 584704 -535040 -1056256 -857600 383488
7783 113152 301056 -369664 436736 1549824 -273408 -883200 263168 -1157120 -26112 -843776
7773 -843776 -22016 -821760 -796160 238592 55808 428032 230912 -924160 193024 -109056
$$ packed form
7848f49216G90016c57888J35680D07552A16736c07200k08896C05152c39968k2016
7838c61984b3552j07008D20352a349120B03776n5296d93568R3696N7344F8096
7827A250816b23232F02624K50880J66400a98144M8640m5056E80096a50016E20704
7816h45824L91168D82304h16640E23264B00192B5600b66240B74944e57056A52064
7805G4752g84384A23392b03264o29760h4480A59232a30560A98144B4064i40544
7794A35680d37248J30048a0240I6256c39968E84704e35040n21216J98656C83488
7783A13152J87904c69664D36736J113088b73408o09792B63168a157120b6112q17664
7773h43776b2016p99744K5600B38592E5808L72224j97120i24160A93024a09056
$$ plain form
7762 235008 337920 -434688 -958464 89600 398848 175616 -90112 -883200 -467456 -176640
7751 -53248 -164864 913920 594944 -345088 -400384 441344 240128 -1032704 77312 -369664
7740 267264 -667136 -1125888 -514048 -467968 953344 -243712 396800 169984 -239616 -156672
7730 -156672 -684544 512 -884224 -351744 -516096 -287232 309760 319488 54784 -945664 -665088
7719 -665088 -223744 -484352 -198144 -489984 551424 21504 -734208 230400 6656 -675840
7708 878080 135168 -603136 272384 298496 -244736 -235520 421888 521216 -232448 357888
7697 -651776 158208 438784 -858112 -997888 234496 -574976 -209408 -243200 635904 -714240
7686 139264 -1311232 -474112 -480256 -547328 -278528 -273920 1116672 574464 55808 -319488
$$ packed form
7762B35008J02912d34688n23776H9600L09248A75616i0112p93088M15744a76640
7751e3248j11616I13920l18976c45088n5296D41344k01216a032704G7312c69664
7740B67264f67136m58752e14048M6080I53344b43712C96800A69984b39616Q2944
7730a56672n27872E12h84224c51744j64352K28864C09760R728E4784i45664K80576
7719f65088b23744k60608a98144k91840E51424B1504g34208B30400F656f75840
7708H78080A35168f03136B72384K6112b44736R216D21888R9328b32448C57888
7697f51776A58208K80576h58112j39776B34496e74976b09408l3792F35904g14240
7686A39264a311232d74112o144o7072K68800M608A116672n42208E5808c19488
$$ plain form
7675 1162752 534016 -783872 788480 684032 812544 848384 79360 656384 92672 302592
7665 302592 -174080 -666624 -94208 -482304 117760 549376 442880 -146432 -264192 434688
7654 -731136 169984 248832 -436224 -27136 -651776 313856 124416 -691200 159744 -211456
7643 -340992 823296 560128 182784 173056 -617984 -472064 -349184 182272 8192 -313856
7632 -165888 -411136 -534528 -882688 -51712 127488 607232 415232 163840 -926720 -802816
7622 -802816 -738304 -877056 -180224 -176128 -198656 175104 -564224 -841728 -190464 -495616
7612 -495616 -196096 282112 164352 -2560 -574976 -86016 98816 136192 423424 128000 185344
7601 185344 -625664 583680 -619008 -623104 -4608 76800 -104448 -837120 -263168 429568 -658944
$$ packed form
7675A162752E34016g83872G88480j04448J28512L5840G9360N77024I2672K09920
7665C02592a74080m92544i4208l88096A17760M31616j06496a46432j17760D34688
7654g31136A69984P8848d36224b7136o24640C13856A24416f91200A59744b11456
7643c40992H23296k63168A82784r728f17984J45920J22880A82272H192c13856
7632a65888k45248j23392l48160e1712A27488M79744j92000A63840i26720J23904
7622h02816O4512j38752a80224M096k2528A75104e64224k77504a90464l05152
7612d95616a96096B82112j17760b560n72416h6016I8816L7376K87232A28000N7344
7601A85344f25664E83680f19008m096d608G6800a04448p32672b63168D29568f58944
$$ plain form
7589 -212480 468992 -322048 -536576 -64512 -165376 -138240 111616 873984 -283648 269312
7578 -342016 511488 569856 393216 -114688 -297984 -236544 -1142784 220672 -909312 131584
7567 -274432 -100352 -4096 1092608 291328 569344 -297984 197632 -404992 -93184 32768
7556 -500224 598528 -99840 -64512 -584704 397312 -394240 -340992 -1023488 210944 -296960
7545 -442880 -889856 -487936 -77312 -888320 -458240 413184 92672 286720 -1226752 12288
7534 393216 250368 70656 780288 -32768 213504 271360 -138240 -667648 701952 -985088
7523 339968 42496 -328192 -388608 625664 -326656 -232448 -259584 297472 -1321472 -566272
7512 52224 -287232 -342528 450560 -75264 -1006080 -692736 121344 -1077248 63488 -245248
$$ packed form
7589b12480D68992c22048k14528f4512j00864K7136A11616P62368b83648B69312
7578c42016E11488N8368j76640a14688j83296O1440r06240B20672i09312A31584
7567b74432a00352d096A092608B91328K78016b97984A97632d04992i3184C2768
7556e00224E98528i9840L5328n20192C97312c94240N3248o82496B10944b96960
7545d42880m46976M01920g7312q11008M30080D13184I2672J94048a226752A2288
7534C93216j42848G0656P09632c2768B13504N7856a38240n29408G01952i85088
7523C39968D2496c28192o0416F25664c26656R4208k7136B97472a321472e66272
7512E2224b87232n5296D50560g5264r30816L13344A21344a077248F3488b45248
$$ plain form
7501 -9216 -1030144 424960 432128 -611840 487424 2560 -314880 284160 -65024 -1110016 473600
7489 -350208 -865280 -331776 80896 170496 512 -847872 -552448 436224 29696 -672256 -1074688
7478 -1074688 -100864 -317952 680960 1374208 612352 103936 -275456 -1124352 -615424 -509952
7468 -509952 -152576 903168 -758784 -326144 48640 608256 -879616 25600 -211968 -861184
7458 -861184 -114688 -340480 -1210880 488960 48640 252928 -1375232 -40960 -252928 172032
7447 -434176 -1238016 -259072 692224 -626176 -1385472 -595456 -894464 -411136 214528 11776
7436 256000 1302016 -524800 -699904 -743936 -48640 378880 -272384 153088 595456 -947200
7425 -218112 -707584 363008 -302592 -1010176 -1097728 39424 -792064 -75776 16896 886272
$$ packed form
7501i216j020928D24960P168f11840D87424B560c14880B84160f5024j044992D73600
7489c50208n15072c31776H0896Q9600E12h47872K95424D36224B9696f72256m02432
7478a074688a00864k17088F80960O93248F12352A03936b75456q48896N08928J05472
7468e09952a52576I03168g58784c26144D8640N59616h79616B5600b11968o49216
7458h61184a14688k25792q70400D88960D8640K04288a375232d0960k11968A72032
7447d34176q03840b59072F92224f26176p59296e95456k99008d11136B14528A1776
7436B56000J046016e24800j75104m4032d8640C78880b72384A53088M42368i47200
7425b18112m89472C63008c02592p07584q7552C9424g92064g5776A6896Q69376
$$ plain form
7415 886272 -563200 44544 -748544 -87040 -812032 -594944 -129536 -453120 -239104 -171008
7405 -171008 -292352 -1487872 335360 -201728 528896 1265152 189440 69120 205312 -531968
7394 -419840 -715264 701952 -714752 17920 618496 -393216 -284160 -23552 -1057280 -612864
7384 -612864 74240 726016 -926720 -69632 -1027072 -350208 -548352 -36352 165376 639488
7374 639488 -1410048 -312320 -328192 374272 988672 152576 -473600 12800 -441856 -75776
7363 253952 -31744 -215552 -574976 402944 55808 245760 415232 -548352 420352 -436224
7352 -477184 -481792 -976384 95232 -1041920 -326656 -507904 -1115136 535040 -20480 -123904
7342 -123904 115200 662016 -365056 -9216 -113664 -391168 -459264 -297472 98816 -20992 272896
$$ packed form
7415H86272e63200D4544g48544h7040p24992K17088a29536l23584K14016O8096
7405a71008j21344j195520C35360b01728E28896P36256A89440F9120J36192e31968
7394d19840k95424G01952g14752A7920O00576c93216J09056b3552j033728M44416
7384f12864G4240O51776i26720f9632r57440c50208j98144c6352A65376M74112
7374F39488a410048c12320j5872C74272O14400A52576d73600A2800d41856g5776
7363B53952c1744j83808l59424D02944E5808J89952J69472e48352D20352d36224
7352d77184m608m94592I5232a041920c26656j81248o07232E35040b0480j03424
7342a23904A15200N46816c65056i216j04448k77504o8096J61792I8816b0992B72896
$$ plain form
7330 -565248 -434176 249856 -362496 -37888 -496640 -423424 843776 449024 -606208 -341504
7320 -341504 62976 -319488 979456 109056 -1145856 -829952 371712 -874496 113664 81920
7310 81920 -720384 -438272 79360 77824 -679424 112640 -262656 216576 -293888 -110592
7299 -970752 -55296 -223744 393728 334848 -177664 504320 -696320 381952 211456 -1177600
7288 131584 262656 -79872 205824 619008 38912 -464896 347648 -558592 -229376 -385536
7278 -385536 1345024 -1051136 -646144 -301568 -368640 -495104 2048 901632 410112 -212992
7267 397824 -274944 -666112 -931328 -280064 938496 316416 -436224 -209920 1254400 -1022976
7256 -958976 381440 -249856 -721920 -1310720 31232 -336896 -53248 -474112 -429056 -197120
$$ packed form
7330e65248J31072B49856c62496c7888m58752P3216H43776l94752f06208K64704
7320c41504F2976c19488I79456A09056a145856L15904C71712h74496A13664l1744
7310H1920g20384K82112G9360j536f79424A12640b62656B16576b93888a10592
7299i70752e5296j68448C93728n8880a77664E04320f96320C81952j70496a177600
7288A31584J31072g9872B05824M13184C8912d64896C47648e58592b29376j56160
7278c85536A345024a051136M04992c01568o7072j26464B048Q99584D10112b12992
7267C97824b74944l91168k65216b80064I38496C16416d36224b09920A254400a022976
7256i58976C81440b49856m72064n88800C1232c36896e3248m20864M5056a97120
$$ plain form
7245 355840 452608 -426496 730624 -541184 -292352 -1288704 601088 605184 570368 1172992
7235 1172992 -605696 -212992 -934400 -530432 -931840 -33280 668672 1218560 -184832 -306176
7225 -306176 -416256 102912 -581632 1112064 -198656 125952 153600 693760 -24064 -248832
7215 -248832 -128000 -10240 1109504 -813056 350720 -331264 510976 -410624 -105984 457216
7204 -828928 122368 57856 -544256 -143360 288256 1043456 -679424 212992 -203264 -188416
7194 -188416 -1021952 159744 437248 647680 23040 -838144 -186368 -39424 501248 -219648
7183 -221696 -731648 610304 -781312 -594432 146944 -6144 318976 -22016 -28672 -954368 -506368
7172 -506368 870912 666624 -145408 -295424 -89088 -518144 -1074688 -1135104 -233472 632832
$$ packed form
7245C55840R6768d26496G30624e41184K48832r96352F01088M096l4816O02624
7235A172992f05696b12992p21408M03968m01408c3280F68672N49888a84832j21344
7225c06176j10080A02912e81632A112064a98656A25952K7648N40160b4064k24768
7215b48832J20832a0240A109504h13056C50720c31264E10976d10624a05984D57216
7204h28928A22368E7856e44256a43360B88256P55200f79424B12992b03264J4848
7194a88416q33536A59744K77504K10432B3040h38144a86368c9424E01248b19648
7183b21696n09952F10304g81312J86880A46944f144C18976b2016o656r25696M48000
7172e06368H70912k04288a45408j50016h9088m29056n56544o0416b33472F32832
$$ plain form
7161 -19456 -4096 -322560 -903680 942080 80896 -729600 -361984 132096 -644608 170496
7150 -278528 -2560 227840 755712 -1223680 227840 -44032 -181760 -98304 7168 -1408000
7139 -822784 -340992 -610304 59392 498688 -56320 -812544 -351744 -467456 176128 -98304
7128 11264 -489472 -682496 192512 -1264128 220160 517632 99328 271872 7168 -342528
7117 627712 -483840 -476672 -680960 -1460224 -174592 -796672 910848 -8704 -275456 -458752
7107 -458752 -528896 -44032 -22016 74240 169984 708096 -163328 -31232 -159232 -715264 -1453056
7096 -1453056 202240 120832 834048 -160768 -1069056 -654848 -55808 -428544 -605184 -812032
7086 -812032 -141312 -1483776 500224 820224 -219648 24064 -661504 -306688 744448 708096
$$ packed form
7161a9456d096l18464n81120I42080H0896g29600c61984A32096f44608A70496
7150b78528b560B27840N27872a223680B27840d4032j37728Q3456G168a408000
7139h22784c40992k69312E9392M39296e6320p56224c51744j15712A76128i8304
7128A1264d89472j93024A92512a264128B20160K97472I9328J72544G168c42528
7117F27712d83840P168k04288p79264a74592o22080I10848h704k66752j83296
7107d58752p0144d4032b2016G4240R5744N38112a63328c1232j28000n56032p37792
7096a453056B02240q1408P13216a60768r08288M14208e5808l72736j76640k06848
7086h12032a41312j342464E00224L20000b19648B4064f61504c06688G44448l6352
$$ plain form
7076 708096 58368 -301056 -1186816 -74752 290816 35328 242688 412160 -825344 -265216
7065 -283648 -1094656 -940032 34304 582144 886272 -980992 -714240 198144 -592384 1444864
7054 326144 181760 -261632 -1289216 35840 202752 409600 -594432 101888 159744 -301056
7043 245248 -397824 -122880 -197632 970240 -405504 167936 1339904 -1161728 194560 -50688
7032 240640 -980992 239104 -713216 80896 856064 647680 67072 -1284608 95232 -494080
7021 1007104 350208 -564736 -472576 418304 178688 835072 -353280 53248 -707072 307712
7010 93696 -631296 694784 -193024 -245248 -505856 -80384 27648 -287232 -539648 -285184
7000 -285184 195584 -504320 -556032 396800 58368 -401408 1067520 132608 -1235968 -104448
$$ packed form
7076G08096E8368c01056q85760g4752B90816C5328K07360J69472h25344b65216
7065b83648q11008J54624C4304N47840L04128i80992K66752A98144e92384A444864
7054C26144j44384b61632j027584C5840J66912K06848e94432A01888N7856c01056
7043B45248c97824a22880p4752I70240d05504A67936J171968a161728A94560e0688
7032B40640i80992B39104g13216H0896P75168k08384F7072a284608I5232d94080
7021A007104C50208e64736R2160D18304A78688O56384c53280E3248g07072C07712
7010I3696f31296F94784a93024n2224k60608h0384B7648b87232k52416K54464
7000b85184A95584e04320n1712C96800E8368d01408A067520A32608a235968a04448
$$ plain form
6989 -1133568 160768 360448 77824 -28672 -35840 -482816 404480 -776192 496128 -155648
6978 -552448 -130048 -521216 -501248 586240 -52224 -1477632 -394752 -223232 11264 13312
6968 13312 558592 718848 503296 858624 53760 -543744 -229888 -520704 -739328 -862208
6958 -862208 374272 655360 -287744 -1449472 370688 -571392 209408 81408 -309760 -151040
6947 -234496 232448 202752 328192 -516096 -651776 -13312 289280 -320000 -397824 -657920
6937 -657920 71168 127488 -77824 -228864 418304 268288 -713728 423936 94208 -1035264
6926 346112 -6144 -46592 849920 -643072 -59392 -879616 -20480 595456 381952 -500736 491520
6914 305664 -161280 -52736 551424 -545792 793088 -369664 -107520 -677888 -608256 -302592
$$ packed form
6989a133568A60768J99680G7824b8672p168m46976D04480g76192D96128a55648
6978e52448a30048l91168J9968E86240e2224j425408c94752J71520A1264K048
6968A3312N45280J60256k15552L55328E3760e43744b29888k90816k18624j22880
6958h62208C74272K81088b87744j161728C70688e71392B09408H1408c09760a51040
6947b34496B32448k9696J25440e16096j35680a3312B89280c20000p7824k60096
6937f57920G1168N6320g7824j51040D18304j50016g13728D23936I4208a035264
6926C46112f144m0448H49920f43072e9392q20224b0480E95456k13504e00736D91520
6914C05664a61280e2736E51424e45792G93088c69664a07520n70368O9632c02592
$$ plain form
6903 -345600 437760 223744 -439296 -1159168 403456 -229888 -687104 149504 -358912 -201728
6893 -201728 228352 -107008 -381440 162304 277504 582144 -674816 -61440 -419840 -623616
6883 -623616 -213504 -34304 585216 -724992 -448512 296448 -390656 -555520 -312832 -992768
6873 -992768 833536 -343552 757760 -192000 -313344 -53248 -243712 -450048 472576 214016
6862 -433152 -646144 -417280 155648 -251392 136704 1171456 875520 -84480 -574976 -263168
6851 67584 734208 126464 854016 -185856 923136 -71680 241152 -1020928 -261632 741888
6840 151040 -1286144 -345088 198656 -1027072 -975872 117248 116736 380928 -108544 514560
6829 -49152 -334848 669696 74752 -15360 -1075200 145920 774656 -1665536 -434176 -323584
$$ packed form
6903c45600D37760k14016d39296p19872D03456b29888m57216A49504c58912J57184
6893b01728B28352a07008k74432A62304J15200L04640f74816f1440l58400k03776
6883f23616b13504c4304E85216g24992K76480B96448c90656j64864K42688o79936
6873i92768H33536c43552G57760a92000j21344e3248j90464k06336D72576B14016
6862d33152k12992K28864A55648b51392A36704J034752k95936h4480m90496b63168
6851F7584O66624A26464P27552a85856I23136g1680B41152a020928b61632G41888
6840A51040a286144c45088A98656a027072N1200A17248n12K64192a08544E14560
6829d9152k85696F69696G4752a5360j059840A45920O28736a665536d34176J10592
$$ plain form
6819 -323584 363008 -157184 -505344 -1194496 28160 -105984 -1017856 514048 817152 -301568
6808 357376 227840 24576 -753152 14848 143360 -235008 -927232 -743936 -335872 203776
6797 -40448 -278528 -1344512 581120 -332288 -601088 57344 138240 -157696 -166400 765440
6786 -349696 -648704 823808 703488 124416 -184832 -281600 326144 51200 -539648 -310272
6776 -310272 -949248 -381440 -1252864 130560 282624 388096 -312320 -1972224 -782336 -291840
6765 -350208 517120 -522752 566272 41472 -300032 134144 -648704 -162816 -678400 -1627136
6755 -1627136 444928 -434688 202240 86016 -261632 142848 -679936 -1042432 -321536 -271872
6745 -271872 761856 328704 -613376 489472 471552 -117248 -1149952 43520 410112 -792576
$$ packed form
6819c23584C63008a57184l48160o89152B8160a05984r11872E14048L03104c01568
6808C57376j29536B4576g53152A4848J28512b35008o92224J83296c35872B03776
6797d0448k38080j065984E81120c32288k68800E7344Q0896a57696q704G65440
6786c49696k99008H23808j20320A24416a84832r6768C26144E1200e39648K29376
6776c10272o38976c81440q71424A30560J52064J05472c12320j659904g82336b91840
6765c50208E17120e22752E66272D1472c00032A34144f48704a62816n15584r48736
6755a627136D44928d34688B02240H6016b61632A42848f79936l62496c21536M9664
6745b71872G61856C28704f13376D89472j7920a17248j032704D3520L66592g92576
$$ plain form
6734 128000 368128 -581120 -755712 -1224192 -472576 -450560 -486400 275456 -147456 142336
6723 -192512 -423424 -506880 -151552 222720 155648 -159744 -103936 752640 -180736 -1286656
6713 -1286656 -549888 -156160 -866304 -65536 478720 -795648 114688 -367104 230912 -954368
6702 -204800 -117248 -76800 991232 484352 48640 -662528 602624 879616 -155136 1425920
6691 -486912 492032 -266752 -284160 -384512 631296 -919040 940544 -624640 453120 135168
6680 320512 1222656 -78848 333312 -389120 -270336 79872 411648 -734720 -906752 -730624
6670 -730624 -657920 168448 -588288 84992 -689152 494080 -322560 705024 754688 -87040
6659 -992768 -486400 -180736 133632 -325120 -105472 -455168 -433152 387584 -233984 -269312
$$ packed form
6734A28000K40128e81120j74592m68480d72576K2016l5840B75456a47456A42336
6723a92512k30912q3456a51552B22720o7072a59744N5808G52640a80736j105920
6713a286656e49888a56160p10144f5536D78720g95648A14688c67104B30912i54368
6702b04800Q7552M0448I91232D84352D8640f62528F02624K76992a55136A425920
6691d86912D92032b66752j7408j00352F31296i19040I40544f24640D53120A35168
6680C20512R02144g8848C33312c89120J18784G9872L31776g34720j72032J76128
6670g30624P2704A68448e88288H4992f89152D94080c22560G05024M9664h7040
6659i92768d86400a80736A33632c25120a05472l49696K2016C87584b33984l5328
$$ plain form
6649 -269312 372224 111104 -943616 68608 -299008 -1244672 -626688 -812032 -736768 -133120
6638 -55296 -677376 -183808 -442368 -635392 448512 583168 -233472 406528 531968 -245760
6627 382464 209408 -128512 -48640 -156672 230912 -719872 -860672 103424 967168 -361984
6616 -1183744 195584 251392 -243712 -453120 -260608 -133120 -844800 -496128 467456 -280576
6605 -227328 -136192 -566784 -418816 -547840 -97792 256000 496640 360448 503296 376832
6595 376832 -81920 204288 9728 664064 486912 315904 -102912 234496 -28160 911360
6584 40448 -984064 -53760 625664 33280 -10240 -843264 -312832 105984 -457728 50176 136704
6573 136704 -1171456 528384 77312 -1142272 -407040 634880 -56832 -210944 544768 -215040
$$ packed form
6649b69312C72224A11104i43616F8608b99008r45664O17984j85344P5264a33120
6638e5296o22080a83808k58560j93024D48512J34656b33472D06528J25440b45760
6627C82464j73056a28512d8640j08032B30912g19872j40800A03424Q63744c61984
6616a183744A95584N5808b43712k09408J92512J27488p11680L48672D67456b80576
6605b27328R1136m30592J47968j29024i7792B56000K40640j36192J42848j26464
6595C76832h1920B04288I728O54336j77152j71008a02912B34496b8160I11360
6584D0448i84064e3760F25664C3280a0240q33024c12832A05984d57728E0176Q6528
6573A36704a171456E28384G7312a142272d07040F34880e6832j54112E44768b15040
$$ plain form
6562 888832 630272 -324096 -722944 96256 -100352 -133632 -167936 365056 -493056 283648
6551 -351744 637440 -104448 321536 9216 583168 415744 -330240 -35840 -109568 156160
6540 273920 -442880 1190912 534528 525312 -31232 572928 164864 -355840 474112 129536
6529 137728 88576 -391680 -106496 -293376 -940544 188928 61440 108544 -204800 -400384
6519 -400384 219136 125440 -375296 65536 264192 -377344 -151552 -211456 694784 47104
6508 -27648 407552 -643072 806400 438272 -409088 37888 -590336 728064 -230400 -210944
6498 -210944 -84480 -1519104 -790528 311808 -329216 -67584 408576 -662528 -221184 777728
6487 166400 52736 -677376 596992 155648 -56832 398336 -402944 -667648 -1633280 -1178112
$$ packed form
6562H88832k58560c24096l98848I6256a00352l3280l4304C65056d93056B83648
6551c51744F37440a04448C21536I216N73952j67424c30240c5840p3728A56160
6540B73920d42880A190912E34528r216c1232E72928A64864c55840D74112A29536
6529A37728m9152c91680a06496j86880o47168A88928F1440M7104b04800j95584
6519d00384B19136r3696c75296F5536J98656c77344a51552n9904F94784D7104
6508b7648D07552f43072H06400l68128d09088C7888e90336G28064b30400J9456
6498b10944h4480j434624P28576C11808c29216f7584D08576f62528b21184G77728
6487A66400E2736f77376E96992A55648e6832C98336d02944k64704r65632M55168
$$ plain form
6477 -1178112 420352 -210432 329728 -499712 -323584 266752 -487936 137216 622080 -162816
6466 -147456 -196096 246272 636928 -46592 -640000 93696 -825856 476672 -467456 -672768
6456 -672768 -379392 108032 -287232 -343040 526848 373248 -811008 169984 -67584 -496640
6446 -496640 -616960 -213504 28160 -242688 -1351168 57344 437248 -575488 -229376 1071104
6435 1052672 -345088 473600 746496 -454656 112128 -62976 130560 58880 -294912 -1636352
6425 -1636352 -672256 69120 307712 193024 134144 588800 -189440 -589824 -168448 -127488
6415 -127488 -1036800 584704 453120 -144384 -242176 358400 776192 -453632 -325632 -212480
6405 -212480 48640 -616960 -1428992 -617984 473088 -206336 239104 914944 331264 -564224
$$ packed form
6477a178112D20352b10432C29728d99712J76128B66752d87936A37216M84864a62816
6466a47456m8640B46272L90656d6592n93408I3696h25856D76672d67456k05312
6456f72768K93376A08032b87232n5808E26848j53600h11008A69984f7584m29056
6446d96640j20320b13504B8160b42688j108480E7344L79904e75488b29376A071104
6435A052672c45088D73600K72896d54656A12128f2976A30560E8880b94912j341440
6425a636352f72256F9120K38592j14688n8880M54656a89440m00384a68448M0960
6415a27488r09312E84704j31584a44384r7792C58400M17792d53632J28000J13152
6405b12480D8640f16960q12032f17984D73088b06336B39104O75840C31264e64224
$$ plain form
6394 -165888 -652800 -602112 236032 249856 -247808 259072 226816 -1030656 -854528 -470016
6384 -470016 315392 622080 -350208 -1138176 -210432 -1033216 -38912 -151552 -168960 392192
6373 -67584 -135168 507392 281088 -416256 -269824 195584 -495616 71168 321024 120320
6362 -36864 -536064 -199168 -145408 516096 -375808 -1106944 -425472 403968 454656 858112
6352 858112 -230912 8192 -473088 962048 -188416 911360 -690176 -809984 -721920 232960
6341 -200704 821760 947200 139776 -133120 -516608 -514048 -235520 270336 668160 425472
6331 425472 -1113600 232960 -124928 195584 118784 134656 654848 1501696 -1612288 361984
6320 -504832 -448000 396288 118272 359936 22016 -202240 -675328 609280 59904 -484864
$$ packed form
6394a65888m86912N0688B36032J3824b47808B59072l2256a030656J76128L84512
6384d70016C15392L06688c50208p87968b10432q22784c8912j12640j7408C92192
6373f7584o7584E07392k26304d16256J46432A95584d95616G1168K49856A20320
6362c6864m99200a99168N3760E16096c75808p31136d25472D03968N0688M03456
6352H58112b30912H192d73088I62048a88416I11360f90176j19808Q8064B32960
6341b00704H21760J25440A39776a33120l83488K560b35520B70336L97824k42688
6331D25472a113600B32960a24928A95584p6800J5872N20192Q46848a612288C61984
6320e04832N6832C96288A18272K41664B2016b02240m73088F09280E9904d84864
$$ plain form
6309 -719872 -77824 -153088 482304 -258048 454656 194560 -965632 -681984 -288768 -161280
6299 -161280 -304128 -285696 -347648 211456 -175104 517632 153600 -151552 868864 -64000
6288 -392704 -270848 264192 -161280 259584 -367104 484864 0 -955904 877568 117248 83456
6277 83456 8704 -76288 336896 -402944 -442880 -291328 143360 144384 -297472 -387584 532480
6265 -456704 -231424 -40960 711168 870400 -159744 -821760 -325120 50176 -403456 -651776
6255 -651776 206848 515072 300544 523264 -273920 794112 398848 -430080 -244736 -519168
6245 -519168 -360960 219136 1291264 -820224 -1052672 -453120 -249344 -868864 -552448 400896
6234 -228352 356352 -401920 -324096 663040 -462848 438784 643584 -443392 1247744 -519168
$$ packed form
6309g19872g7824p5264D82304b58048D54656A94560i65632K83648b88768J27488
6299a61280j42848J8432o1952B11456a75104E17632A53600a51552H68864f4000
6288c92704J21856B64192a61280B59584c67104D84864@i55904H77568A17248l3792
6277H3456H704g6288C36896d02944l9936J51552A43360J024b97472r0112E32480
6265d56704K25280d0960G11168J59232a59744o62016c25120E0176d03456k48320
6255f51776B06848L08224k14528K22720b73920G94112l95264d30080J85344k74432
6245e19168J58208B19136J072128h20224k32448d53120K03776o19520L16416D00896
6234b28352C56352d01920P7824F63040d62848D38784K04800d43392A247744e19168
$$ plain form
6223 -687104 -556544 -432640 -532992 500736 83968 1236480 -118784 471040 122368 534016
6213 534016 126464 -123904 -95744 119296 -194560 897536 200192 -1392128 -1164288 264192
6202 1170432 -987136 -508928 -405504 568320 -345600 -468992 83968 250880 510976 -38400
6191 -350720 561152 -787456 -404480 253440 740352 -749568 -188416 -250880 -70656 70144
6180 312832 35840 502272 863232 45568 367104 21504 -621568 -130048 477696 -662016
6169 -234496 -482304 1003520 810496 -500736 27648 110592 -49152 -82944 89088 708096
6159 708096 -8192 -465920 -143872 -658432 -105984 563712 -1023488 -441856 -252928 -641536
6149 -641536 46080 915456 719360 -419840 1070080 -368128 -365056 957440 5632 532480
$$ packed form
6223f87104J30560J23904j00352E00736H3968J152512a18784D71040A22368M11648
6213E34016A26464a23904K8160A19296a94560H97536B00192a392128K27840B64192
6202A170432i87136M78208J03424E68320c45600j23392H3968J66912K60096c8400
6191c50720E61152g87456L82976B53440M86912g49568a88416o2464g0656G0144
6180C12832C5840M66432L60960D5568L21536B1504f21568a30048D77696f62016
6169b34496k47808A003520j93024e00736B7648Q2944d9152l3792H9088O19008
6159G08096h192m57728a43872n14560a05984E63712a023488d41856J88928l88608
6149f41536D6080Q69376j96096d19840A070080c68128L072I57440E632N26848
$$ plain form
6139 532480 771584 585216 630784 492032 -512 329728 -849408 -390656 -203776 -911872
6129 -911872 266752 -454144 51712 -918528 -46080 299520 -489472 672768 607744 -249856
6118 -459264 -255488 1089536 230400 1018880 -821248 -552448 139264 601088 -317440 -630784
6108 -630784 -109056 -380416 -347648 -384000 104448 -625664 471040 -729600 -338944 613888
6097 -335872 32768 -218624 13312 -109568 744448 -582144 463872 -545280 -186368 -508928
6087 -508928 -136704 520704 -546304 -318464 304128 595456 -268800 -849920 -63488 965632
6076 422912 1385472 361984 207360 -701440 146432 68608 1189376 -148480 -48128 -933376
6066 -933376 -8704 -1005568 9216 -135680 -618496 -181760 -263680 28672 -548352 244224 -430080
$$ packed form
6139E32480K39104j86368M5568j38752e12C29728h49408c90656J86880p08096
6129i11872B66752d54144E1712i18528d6080B99520d89472F72768o5024b49856
6118d59264K03776A089536B30400P88480h21248K68800A39264M61824c17440l13344
6108f30784a09056k71360L2768l6352A04448f25664D71040g29600c38944F13888
6097c35872C2768b18624A3312a09568G44448e82144D63872e45280a86368l22560
6087e08928a36704E20704e46304K27840C04128K91328b68800n81120f3488I65632
6076D22912R62560C61984j54624g01440A46432F8608J120768a48480d8128q85248
6066i33376h704r96864I216a35680m82816a81760q1920B8672e48352B44224d30080
$$ plain form
6054 253952 312320 682496 -866816 243200 -161792 -107520 -946176 376832 -207360 174592
6043 343040 -125952 -445440 79360 161792 585216 919552 -678912 556032 -247808 201216
6032 -3072 -666624 -25088 134656 -199168 -911872 -124928 -43520 -640512 -86528 -394752 435712
6020 1151488 -317952 -220160 -363008 501760 526848 792064 -420352 379904 -182272 -891904
6010 -891904 -893440 -888832 690176 497664 -295936 -242176 -154624 138752 -492032 -1201664 41472
5998 -236032 -1151488 -231936 321536 159232 18944 285184 -349184 26624 344064 988672
5988 988672 -516096 -566272 183808 842240 -351744 -438784 378368 -625664 -329216 -321536
5978 -321536 888832 304640 309760 -494592 406528 134144 -7168 846336 575488 -404992
$$ packed form
6054B53952N8368L70176h66816B43200a61792N4272q38656C76832b07360A74592
6043C43040a25952l19488G9360Q2432M23424L34336f78912E56032b47808B01216
6032c072o63552b5088A34656a99168p12704a24928d3520n96992h6528l08224D35712
6020A151488c17952R7792j42848E01760K5088K65216d20352C79904a82272p09632
6010h91904j536M608F90176j92512b95936N3760Q7552A38752d92032p09632D1472
5998b36032r15456b31936C21536A59232A8944K66240c49184B6624L17440O44608
5988I88672e16096n0176A83808O58432c51744q7040C78368f25664K96448P680
5978c21536H88832C04640N120d94592D06528A34144g168H46336k70848d04992
$$ plain form
5967 -776192 -1184768 -368640 356864 320512 -417792 -40448 223232 1207296 1084928 -83456
5956 525312 -2048 -208384 310272 -141312 -39424 89088 -1536 -58368 -342528 -510976 128512
5944 508416 -124416 -830464 -49664 -497664 340480 -228352 98816 -70656 -794624 -290816
5933 255488 -1152512 -814592 173056 944640 1227776 -1014784 -161792 -562688 -717824
5924 -717824 -417792 -181760 -303104 172544 575488 -309760 -495616 -746496 -49152 -388096
5914 -388096 -314880 -204288 377344 -1058816 -246784 -28672 -814592 -80896 1520640 -546816
5903 -174592 831488 141824 31232 561152 940544 -302080 95744 -167424 220672 -1139712
5892 445952 -995328 -21504 -982016 -1075712 312320 115712 55808 -140800 880640 -144384
$$ packed form
5967g76192m08576c68640C56864l6352d17792d0448B23232R84064j22368h3456
5956E25312b048k06336C10272a41312c9424H9088a536n6832k84160j68448A28512
5944E08416a24416p06048d9664m48000C40480b28352I8816g0656p23968b90816
5933B55488a152512L37920A73056P71584K83136a014784a61792m00896j55136
5924g17824L00032a81760j21344A72544M02944c09760j85856k50880d9152l38944
5914c88096P3216J10592C77344a058816b46784b8672p85920h0896A520640e46816
5903a74592H31488A41824C1232N29920L79392c02080I5744a67424B20672a139712
5892D45952i95328b1504r60512r3696C12320A15712E5808a40800H80640a44384
$$ plain form
5881 686080 -1399296 -60928 80896 884224 -257024 1033728 -612352 -483840 619520 -120320
5870 723456 -93696 -226816 -512 16384 589312 -147456 -468992 97792 433664 -596480 -77824
5858 383488 -77824 -385024 909312 -1029120 119296 73728 1001984 -299008 -407552 71168
5847 1020928 -1117184 -235008 159232 -1143808 -106496 -496128 -593920 1453568 -475136
5837 -76288 -88576 171008 -18432 -932352 -594944 -641024 762880 -370176 -191488 -996352
5827 -996352 -66560 -757248 761856 -993792 -639488 -566784 78336 80384 204800 -425984 -114176
5815 -19968 -1098240 129536 -613888 37376 846848 -610816 60928 -471040 369152 -607232
5804 444416 -148992 -763904 -135680 610816 202752 422400 -453632 -391680 -1413632 328704
$$ packed form
5881F86080a399296f0928H0896Q03328b57024A033728f12352J28512F19520a20320
5870G23456i3696j33120e12A6384N72928a47456l21536I7792L35872e96480g7824
5858C83488g7824l07200I09312a029120A19296m5568R28256b99008j08544G1168
5847A020928a117184b35008A59232a143808a06496l89632r7792A453568d75136
5837g6288j2288A71008a8432r13920L37408m6080G62880c70176J78688q04864
5827i96352f6560o90688G61856i93792L54304P2704G8336K048J24416d25984a14176
5815a9968j078272A29536f13888C7376Q09472f10816F0928d71040C69152f07232
5804D44416a48992o14912a35680F10816B02752K19648d53632O1952j021952C28704
$$ plain form
5793 -484352 -299008 -126976 276480 730112 -370176 473088 -471040 94720 -261120 -645120
5783 -645120 -658432 393728 545792 365568 -303616 77824 475648 94720 266752 436736
5773 436736 650240 -615936 285696 526336 394240 -96768 -489984 749568 496128 -1209344
5762 572928 -176640 8704 587776 909824 -172544 -203776 -19456 -96256 251392 -488448 138240
5750 480256 -288768 -293376 535552 -246272 -389632 -624128 1218048 6144 -1022464 -78336
5739 717312 686592 76800 152576 416256 -486400 111616 -632832 141824 416256 189952
5728 -17920 -459776 -46080 311296 -460800 -233472 -556032 122880 -123392 308736 691200
5718 691200 -286720 -547840 -591360 699904 319488 -416256 -759296 48640 427520 1033216
$$ packed form
5793d84352J85344a26976B76480M53632c70176D73088d71040I4720b61120l84000
5783f45120j3312C93728J52064j80224c03616G7824L97824I4720J72032J69984
5773D36736K13504f15936B85696K40640j32096i6768l93216G49568k53440a209344
5762E72928a76640H704N79072L22048a72544l1232a9456p6800B51392d88448A38240
5750D80256b88768m608E35552b46272j43360k34496A218048F144a022464g8336
5739G17312l0720G6800P5776K63680d86400A11616f32832A41824K74432A89952
5728a7920m41856d6080C11296d60800K27328l22560A22880a23392C08736L82464
5718F91200b86720k61120m3520F99904C19488d16256l43040D8640L78880O05696
$$ plain form
5708 1033216 -705536 263680 -697344 97792 -317952 -148992 1017344 -258560 -39936 -152576
5698 -152576 79872 -265216 -997376 -264192 -793600 -335360 505856 -378368 -474112 -222720
5687 183808 -102912 -272384 -646656 187392 -401920 -532480 -234496 264704 723968 146944
5676 516608 3584 -273920 -893952 -289792 -726528 -258560 112640 260608 -199680 -61440
5665 -509440 -424960 712192 -477696 496128 1801216 841216 -1281536 -1198592 164352 -935424
5654 -271872 679424 428544 -463360 324096 -150528 111104 -719360 344576 628736 580608
5644 580608 -888320 -520192 242176 144896 -313856 -259072 671744 -102912 167936 953856
5634 953856 -101888 -678400 128000 93696 588800 165376 -355328 -728576 1640448 -523264
$$ packed form
5708A033216g05536B63680f97344I7792c17952a48992A017344b58560c9936j12640
5698a52576G9872b65216p32160b64192n29408c35360E05856c78368r5744b22720
5687A83808a02912j69472l74272A87392d01920j30560b34496B64704M59264A46944
5676E16608C584b73920o20032b89792m36736b58560A12640J47968a99680f1440
5665e09440Q4480G12192d77696D96128J305088H41216a281536Q2944A64352i35424
5654b71872F79424k50880d63360C24096a50528A11104g19360C44576K84160m8128
5644E80608h88320L68128B42176r7280c13856N4784F71744a02912A67936P85920
5634I53856a01888n76512A28000l4304M95104A65376c55328l73248A640448e23264
$$ plain form
5623 -658944 195072 419840 990720 51200 -207872 -173056 235520 731136 -1189376 188416
5612 -38912 -1071104 -458752 1025536 175104 741376 325632 599040 455680 575488 531456
5602 531456 462336 -123392 95744 28672 327680 163840 -10240 -660992 1096704 -911872
5591 -223232 113664 -136704 -248320 -48128 1042944 -92160 1220096 433152 -32256 -663040
5581 -663040 786944 592896 -631808 738304 -328704 893440 -748544 278528 358912 -580608
5570 393728 802304 952320 240128 959488 -517120 -595456 350208 114688 -434176 -52736
5559 26624 217088 1058304 -263168 573440 238592 -22016 297984 155648 75776 -801792
5548 691200 309248 900608 -337408 439296 -1310208 -88576 -623616 -167936 688640 -310272
$$ packed form
5623f58944A95072K24768N70880E1200b07872L4816B35520M95616a189376A88416
5612c8912j032192d58752A025536A75104N66272C25632K73408j43360J19808m4032
5602E31456o9120a23392I5744B8672K99008A63840a0240o50752A096704i11872
5591b23232A13664a36704j11616d8128A042944i2160A220096D33152c2256o30784
5581f63040G86944j94048f31808G38304c28704H93440g48544B78528Q0384e80608
5570C93728M08576J50016B40128P19360e17120p8336C50208A14688d34176e2736
5559B6624J90464Q41216b63168E73440B38592b2016B97984j42336G5776h01792
5548F91200C09248N91360c37408D39296a310208h8576n35040a67936F88640c10272
$$ plain form
5537 -361984 -108032 565760 224768 568832 -348672 -345088 1022464 -56832 323072 114688
5526 -70656 1097216 -190976 -220672 -343552 184320 -875008 -261632 416768 1069056 -88576
5515 -659456 -79360 702976 74752 -436736 59392 162816 847872 78848 469504 575488
5505 575488 9728 -134656 58880 172032 -125952 1054208 -659968 -1042432 558592 -275456
5494 166400 -195584 -546304 655872 -166400 543232 99328 -631808 395776 -429568 107520
5483 1125888 -1123840 -394240 -125440 1264128 261632 308224 -722944 308224 -437248
5473 577536 -317440 774656 694784 419840 -136192 -332800 800768 591360 590848 -452096
5462 214528 -534528 -1167360 -268288 919040 -206336 194560 -157184 744960 432640 888832
$$ packed form
5537c61984a08032E65760B24768L44064c48672L584A022464e6832C23072A14688
5526g0656A097216a90976k9696j22880A84320h75008b61632D16768O52288h8576
5515f59456g9360G02976G4752d36736E9392J03424O85056G8848L90656J05984
5505E75488I728a34656E8880J13152a25952A054208f59968l82464E58592b75456
5494A66400a95584l50720F55872a66400E43232I9328f31808C95776d29568A07520
5483A125888a123840c94240a25440A264128B61632M6592g22944C08224d37248
5473E77536c17440G74656p9872k74944a36192j96608H00768k09408n12d52096
5462B14528e34528o32832b68288I19040b06336A94560a57184G44960l12320M56192
$$ plain form
5452 888832 -1075200 375296 475648 -259072 -530944 -489984 -223232 125440 -375808 -819712
5442 -819712 -546304 884224 315904 90624 375808 -860672 117248 170496 -488448 -696320
5432 -696320 -1624064 153088 -60928 -548352 -397312 -485888 393216 848384 1241088 525824
5421 72192 379392 349696 218112 751104 -129536 686592 879104 294400 -269312 573952
5410 395776 -140288 346624 1296896 2059776 642560 746496 1507840 1259520 1170432 975360
5400 975360 374784 -430592 -132096 707072 828416 -25600 317440 169472 1072128 957440
5390 957440 -185344 307200 1039872 -205312 -253440 -118784 1487872 587264 -538624 -699904
5380 -699904 1272320 721408 829440 24576 171008 80384 -140800 -686080 852480 580608
$$ packed form
5452H88832a075200C75296J00352b59072k71872M0960b23232A25440c75808m43904
5442h19712K73408H84224C15904I0624K85184h60672A17248N3248d88448k07872
5432f96320r27744A53088f0928m87424J51040q8576C93216M55168L92704E25824
5421G2192L07200k9696j31584N32992a29536F86592J92512B94400b69312E73952
5410C95776a40288C46624R50272P62880F42560J03936P61344k48320q9088j95072
5400I75360C74784d30592a32096G07072J21344b5600C17440j47968R02656j14688
5390I57440a85344C07200P32672b05312m8128a18784A487872E87264e38624j61280
5380f99904A272320n50912J08032B4576J46432H0384a40800n45280H52480k71872
$$ plain form
5370 580608 -18944 818688 223232 -67584 -556032 376832 800256 -586752 310784 -500224
5359 -894976 -164352 -477184 1341440 45568 -81408 -100352 -699392 477696 530432 -88576
5348 -204800 -181248 -1027072 174592 630784 393728 380416 -213504 -226816 1024 523264 284160
5337 284160 551936 -701440 -364032 90112 -32768 1358848 230912 344064 343552 1028608
5327 1028608 637952 -55808 -778240 -705536 -17920 121856 -261120 -39424 791552 -324096
5316 -58368 -551936 -215552 266752 -94208 115712 715776 178176 627712 -58880 -894976
5306 -894976 260096 199680 69120 137216 414208 489984 594432 1237504 1134592 -486912
5295 586240 -208896 -760320 -302080 133120 677376 94208 427520 -301056 -65536 1268224
$$ packed form
5370E80608a8944H18688B23232f7584m88448C76832M23424e86752C10784e00224
5359h94976a64352l12832A341440D5568h1408j8944n99040D77696N2736h8576
5348b04800K3552q45824A74592M56192k37056j3312b13504j3312A024N22240k39104
5337B84160K67776g01440L37408I0112c2768A358848B30912J13152n12O85056
5327A028608l90656e5808p22432P2704a7920A21856b61120c9424G91552c24096
5316e8368m93568b15552B66752i4208A15712O00064A78176M49536e8880q36096
5306h94976B60096o0416F9120O8096K76992P5776J04448O43072j02912d86912
5295E86240b08896n51424c02080A33120N44256I4208L33312c01056f5536A268224
$$ plain form
5284 -117760 753152 535552 559616 135680 1230336 2560 225280 813056 167424 1306112
5274 1306112 454144 852480 793600 288768 -45568 352256 354816 1061888 -302592 589824
5263 727552 785408 681472 -19968 316416 145920 431104 476160 775680 876544 1994752
5253 1994752 281600 734720 919552 835584 1707520 106496 -222208 443392 244736 1293824
5243 1293824 983040 525312 1633280 -359424 903680 -291840 1713152 1069056 591872
5234 591872 975872 983040 301056 1584640 187392 187904 388608 517632 3072 1166336 468992
5222 1084416 954368 633856 801280 505344 564224 190976 685056 309760 886784 931840
5212 931840 1305088 460288 1059328 1289728 1468416 219136 -244736 -147456 1050112 1097728
$$ packed form
5284a17760G53152k17600K4064A35680J094656B560K22720N87776A67424J138688
5274A306112D54144L98336n8880B88768d5568C52256K560P07072c02592E89824
5263G27552N7856j03936a9968C16416A45920K85184M5056K99520J00864J118208
5253A994752B81600M53120J84832q3968Q71936A06496b22208D43392j98656J049088
5243A293824l10784m57728J107968c59424I03680b91840A713152o44096m77184
5234E91872L84000P168C01056J283584A87392N12K00704J29024C072J163264D68992
5222A084416j30048l20512J67424k95936N8880A90976M94080C09760N77024M5056
5212I31840L73248D60288N99040K30400J78688B19136b44736R7280A050112M7616
$$ plain form
5202 1097728 1517568 93696 -436224 155648 1050112 -102912 -409600 304128 62464 -480768
5191 772096 293888 -175104 -34816 279552 -569344 -193024 716288 281600 475648 98816
5180 -240128 -308224 -88576 1531904 38912 1173504 -1173504 327168 -316416 -76288 -616448
5170 -616448 207360 -661504 1312256 108032 191488 433152 673792 -134656 623616 -24064
5159 922624 196096 967168 536064 357888 423424 413696 -284160 -75264 389120 308736 515072
5148 515072 -679424 -7168 589824 537088 -819712 -128512 -1122816 -340480 1269760 -370688
5137 1029632 174080 755712 899584 516608 95232 -16896 405504 560640 18944 97280
5127 97280 604672 415232 -314880 497152 914944 -427520 275968 704000 346112 -465408
$$ packed form
5202A097728M19840I3696d36224A55648Q94464a02912l06688C04128F2464d80768
5191G72096B93888a75104c4816B79552e69344a93024G16288B81600J94048I8816
5180b40128o8096h8576A531904C8912J134592a173504C27168c16416g6288n40160
5170f16448B07360f61504A312256A08032Q3456K41664K40640a34656F23616b4064
5159I22624A96096P71072m31104j78176O5536r728b84160g5264C89120q0384K06336
5148E15072f79424g168E89824n2736h19712a28512r94304c40480A269760c70688
5137A029632A74080N81632J43872l82976I5232a6896D05504J55136A8944P8336
5127I7280N07392j89440c14880D97152M17792d27520B75968M28032C46112d65408
$$ plain form
5116 -52736 10752 -35840 467456 -57344 -678912 454656 1259008 225280 261120 -591872 243200
5104 418816 365056 86528 -166912 859648 -1297920 -571392 1053184 1294336 295424 1444352
5094 1444352 39424 -585216 -48640 265216 -117248 1031168 1083392 156160 -49152 167424
5083 -145920 132096 322048 39424 199680 596992 -648192 49152 436224 -60416 408576
5072 269312 820224 588288 -61440 539136 -555520 -44032 27136 373760 778240 -550912
5061 -427008 452608 273920 251904 -531968 -187392 86528 708608 198144 -584704 581120
5050 248832 145408 969216 255488 -242176 -5632 391168 -621568 387072 786432 326144
5039 807936 37888 -615936 976896 683008 815104 505856 744448 474624 613888 -37888
$$ packed form
5116e2736A0752c5840D67456e7344o21568D54656Q04352B25280L5840e91872B43200
5104D18816n3760H6528a66912H59648a297920e71392A053184K41152B95424J148928
5094A444352C9424e85216d8640B65216a17248A031168N2224A56160d9152A67424
5083a45920A32096J89952C9424J60256L97312f48192D9152L87072f0416D08576
5072B69312N50912k31936f1440E39136e55520d4032B7136L46624M04480e50912
5061d27008D52608j78688k2016e31968a87392H6528O22080A98144e84704E81120
5050B48832j03424Q23808B55488b42176e632C91168f21568C87072L99360C26144
5039H07936C7888f15936I76896k93888J32096l09248K38592k69824J39264c7888
$$ plain form
5028 1000960 199168 -129024 719360 445952 882688 392704 91648 1794560 81920 422400
5018 422400 93696 83968 769536 369664 360960 1024000 517120 -195072 518144 91648 1392640
5007 1392640 1311744 -199168 -178176 187904 715776 406528 1273344 985088 812032 1300480
4997 1300480 1667584 1631232 793600 1086976 1822720 1544192 1147392 694784 2133504 792064
4986 1592832 1486336 572416 -10240 -218112 592896 412672 146944 -1139712 527360 -692224
4975 548864 1209344 -407552 -197632 -169472 343552 204800 -410112 502784 -386048 -486912
4965 -486912 17920 -281600 -221696 512 -641024 -162304 -28160 281088 -1176064 388096 620544
4954 620544 384512 909824 957952 260096 552448 -982016 173056 372736 901632 310784
$$ packed form
5028A000960A99168a29024G19360k73408M36736C92704I1648J702912H1920L40480
5018D22400I3696r728O85568C69664q704O63040n06880a95072E18144I1648J300992
5007A392640q0896a99168K0992A87904N27872l09248Q66816k88256j73056M88448
4997A300480L67104l6352G93600K93376P35744k78528l96800m52608J438720G92064
4986A592832j06496E72416a0240k07872E92896j80224A46944a139712E27360f92224
4975E48864O60480d07552a97632K8160C43552j38752d10112E02784c86048j00864
4965d86912A7920b81600N9904E12f41024a62304b8160B81088a176064C88096K32448
4954F20544k36032N25312M8128B60096K92352i82016A73056J99680N28896C10784
$$ plain form
4943 -84992 256000 295424 -9216 120832 777216 162816 1267200 255488 1297408 -506368
4932 701952 146432 -300544 104960 406016 375296 -12288 767488 -15360 185344 310272
4922 310272 9216 -283648 521728 -711680 206848 -1252352 129024 12800 -378880 -88576
4911 455168 -1094656 -290304 467456 608768 -569344 514560 -424448 -218112 211456 1040896
4901 1040896 -101888 -45056 15360 -296960 429056 -3072 662528 793600 -522752 229376
4890 -38912 -23552 903680 311296 209408 327680 803328 579072 1080320 512000 -147968
4879 20480 707072 676352 242688 43008 -492544 145920 287744 1285120 625152 833024
4869 833024 -113664 1302016 1534976 -135680 27648 -276992 984576 -547328 627712 157696
$$ packed form
4943h4992B56000L9424i216A20832O56384A62816J104384B55488J041920e06368
4932G01952A46432c00544A04960L01056l0720a2288G67488a5360A85344J24928
4922C10272I216b83648E21728g11680B06848a252352A29024A2800c78880h8576
4911D55168a094656b90304D67456J41312e69344E14560d24448K06336B11456Q29440
4901A040896a01888d5056A5360b96960D29056c072F62528J31072e22752B29376
4890c8912J5360I03680C11296j01888J18272M75648k24256N01248E12000a47968
4879B0480O86592l0720B42688D3008d92544A45920J41824R97376F25152K07872
4869H33024a13664A302016K32960a35680B7648b76992I84576e47328F27712A57696
$$ plain form
4858 -132608 1665024 1126400 1090560 901120 317952 1221120 590336 318464 625152 178688
4847 851968 279040 215040 1486336 650240 717824 793088 -339456 484352 87040 2059264
4837 2059264 773120 788480 911360 957440 1582592 140800 1456640 878080 -722944 1251328
4826 -13824 -179712 884736 642048 179200 504320 -53760 17408 859136 1232896 469504
4815 129024 838144 42496 695808 244224 -404992 609280 -82944 756224 176640 976384
4805 976384 -63488 -293376 1118208 305152 -411648 242176 342528 717312 1128448 122368
4794 764928 615936 -337920 397312 497152 1053696 -59904 224768 950272 421376 129024
4783 1511424 399872 900096 491520 349184 1179648 494080 1058816 535040 1002496 662016
$$ packed form
4858a32608A665024n38624l5840j89440C17952R03168E90336k71872L06688A78688
4847H51968B79040o4000J271296F50240O7584P5264c39456D84352H7040J972224
4837B059264G73120J5360J22880M6080O25152A40800J315840n78560g22944A251328
4826a3824j65888H84736k42688A79200L25120e3760A7408Q41728L73760D69504
4815A29024P09120D2496O53312B44224d04992F09280h2944G56224A76640P99744
4805I76384f3488k29888A118208C05152d11648B42176J00352L74784M11136A22368
4794G64928j48992c37920C97312R9840N56544e9904B24768P25504D21376A29024
4783A511424C99872N00224m08576j42336Q30464D94080N64736n23776M67456l40480
$$ plain form
4773 662016 1033216 739840 915456 918528 -663040 221184 783872 -388096 -518656 850432
4762 471552 699904 118272 -387584 486400 531968 -706560 770560 445440 957952 710656
4752 710656 1054720 892928 332800 1076224 845312 79872 523776 595456 1689088 1827328
4742 1827328 1509376 2199552 1834496 2850304 3849216 3862528 4069376 3345408 3390976 3086336
4732 3086336 3200512 2359296 2048000 1759744 1637888 1588224 739840 249856 335872 998400
4722 998400 148992 1632256 160256 687616 443904 1229824 600064 943616 429056 889856
4712 889856 1342464 446464 450560 389632 -270336 1489408 557056 647680 1378816 1217536
4702 1217536 701440 1346560 887296 29696 -383488 881152 624128 963072 311296 188928
$$ packed form
4773F62016L71200k93376J75616L072f63040B21184N62688c88096j30560H50432
4762D71552K28352A18272c87584D86400M5568g06560G70560l25120N12512k47296
4752G10656L44064j61792C32800P43424k30912G9872M43904P1680J093632J38240
4742A827328l17952O90176l65056J015808R98912J3312K06848p23968M5568l04640
4732C086336J14176q41216l11296k88256j21856m9664G39840B49856Q6016O62528
4722I98400A48992J483264A60256N27360k43712P85920F00064L43552D29056M60800
4712H89856M52608D46464M096o0928b70336A489408E57056R0624P31136j61280
4702A217536n16096O45120m59264B9696c83488H81152k57024L38944C11296j22368
$$ plain form
4692 188928 627712 11264 697856 75776 1428480 1435648 907264 1498624 331264 98816
4681 679936 1391104 373248 512 -562176 735744 1115648 -690176 235008 744960 955904
4671 955904 1960960 1389568 849408 759296 260608 888832 257024 394240 683520 -846336
4660 1268224 278528 -154624 372224 497152 104448 167936 323584 69632 387584 709632
4650 709632 255488 168960 1017344 701440 1016320 -76288 1418240 237056 559616 705024
4640 705024 307200 958976 919040 860160 777216 1298944 643584 290816 142336 224256
4630 224256 235008 362496 788480 880128 902656 2560 402944 552960 111104 358912 373248
4619 373248 -119808 40448 486400 16896 461824 155136 723968 -1029632 -450560 103936
$$ packed form
4692A88928M38784A1264O86592G5776J352704P168n28384N91360C31264I8816
4681F79936P11168C73248E12e62176G35744L79904f90176B35008N09952K10944
4671I55904J005056n71392n40160r0112B60608O28224B57024J37216K89280h46336
4660A268224B78528a54624C72224J24928A04448O3488J55648F9632L17952L22048
4650G09632B55488q6528Q48384l15904L14880g6288A418240B37056L22560J45408
4640G05024C07200O51776l9936n8880q2944N21728F43584B90816A42336Q1920
4630B24256J0752J27488M25984R1648K2528B560M00384J50016A11104K47808J4336
4619C73248a19808D0448M45952A6896M44928A55136N68832a029632d50560A03936
$$ plain form
4608 -129024 884736 486400 -293888 -101888 552960 43520 327168 760320 1295360 303104
4597 384000 391168 691712 -475136 98304 1242624 630272 856576 843264 -73216 1103360
4586 1696256 34304 933888 1130496 755712 666112 1505792 985088 1318912 1203200 1129984
4576 1129984 2098688 606720 445440 542208 1187328 303616 1895936 840192 1548800 522752
4565 875008 446464 348160 582656 1233408 972800 1745920 547840 552960 613376 1863680
4555 1863680 208896 561664 1643520 914944 1035264 -322048 716288 1161728 -53248 126976
4544 -295424 582144 1306112 1055744 1641472 1838592 565248 1558528 823808 1364992 401408
4533 -84480 1451008 768000 1133056 339456 1207296 -285184 273920 636416 1031680 329728
$$ packed form
4608a29024H84736l98336b93888a01888E52960D3520K83648M33152N35040C03104
4597C84000P168L00544d75136I8304J144320o12352K26304j3312g3216A103360
4586A696256C4304Q99584J96608l74784q9600Q39680n20704L33824j15712p3216
4576A129984R68704F06720j61280R6768O45120C03616J592320H40192P08608E22752
4565H75008m28544r8304K34496O50752k60608P73120E47840N120O0416J250304
4555A863680B08896L52768J081856p28576J20320c22048G16288M45440e3248A26976
4544b95424E82144P23968k50368N85728J97120E65248R93280p34720N41184D01408
4533h4480A451008o83008L65056C39456Q67840b85184B73920L62496L95264C29728
$$ plain form
4522 1551872 531456 1709056 864768 895488 491520 864256 -461824 1653760 1416192
4513 1416192 1069056 736768 1708544 1035776 1207808 -124928 352256 774656 1639936 1103360
4503 1103360 1077760 878080 1159680 449536 1029632 977920 576000 1446400 53248 1984000
4493 1984000 1125888 1184256 627200 -25088 982528 710144 647168 746496 727552 774144 1249792
4482 1249792 1268224 608768 335360 1011200 1460736 1074176 1449472 626688 809984 1077248
4472 1077248 899584 1206784 826368 1430016 1741824 1187328 1781760 1005568 1480192 185344
4461 884224 412672 947200 199168 1358848 1057280 803840 1268224 1875456 1257472 177152
4450 1148928 1290752 260096 117760 1009664 564224 996352 1020416 1017856 1431552 847872
$$ packed form
4522A551872E31456J177600q44288L0720m03968L72736d61824A653760k37568
4513A416192l47136l32288R71776o72768J72032a24928C52256M22400Q65280n36576
4503A103360k5600j99680K81600D49536N80096n1712m01920Q70400E3248J930752
4493A984000q58112N8368n57056b5088I82528k72384o2976R9328j8944M6592M75648
4482A249792J8432F08768k73408O75840M49536l86560L75296F26688J83296K67264
4472A077248j77664L07200l80416O03648L11808n54496N94432p76192M74624A85344
4461H84224D12672N34528A99168J159680l01568k53440M64384O07232o17984A77152
4450A148928J41824B60096A17760Q91904m45440M32128K4064k560M13696n83680
$$ plain form
4440 847872 814592 504832 967680 1984000 1260544 1550848 1539072 1811968 -472064 164864
4429 1146368 377856 218624 2038272 2053632 397824 1231360 1380864 1523200 635904 214016
4418 392192 925696 463360 2080768 1575936 927232 2153472 868352 1065472 1029120 323072
4407 113664 289792 1059328 1051136 821248 742912 1311744 1170944 270848 1263104 449024
4396 433152 -593408 1742848 309760 1304064 1910784 1146368 369664 1380864 498688
4386 322560 -199168 388608 1274880 -157696 295424 364544 45568 1465344 875008 1213440
4376 1213440 166400 946688 -238080 1436672 402432 340480 148480 694272 335872 610816
4366 610816 705536 -17920 1038848 388608 2463744 2557440 1105920 504832 1284608 562176
$$ packed form
4440H47872l3280l09760M62848J016320p23456K90304j1776K72896d72064A64864
4429A146368C77856j59232J819648J5360C97824Q33536J49504J42336F35904B14016
4418C92192N33504m62336J617408n04832o48704J226240H68352J97120l6352C23072
4407A13664J76128P69536q192k29888p8336N68832j40800B70848R92256D49024
4396D33152e93408A742848C09760R94304O06720p64416C69664J011200D98688
4386C22560a99168C88608Q86272a57696B95424O9120D5568J419776n90336L38432
4376A213440A66400P80288b38080A436672D02432o1952A48480N45792C35872K74944
4366F10816R4720a7920A038848C88608K075136R3696A105920E04832P79776E62176
$$ plain form
4355 333312 8192 1499648 2023424 1910272 1470464 1743872 1058304 818688 1022976 2215936
4345 2215936 1386496 1503744 1914368 1229312 2412544 1539072 1809408 654336 1578496
4336 1578496 2138112 1380864 1565184 1546240 2007040 1330688 1702912 1525760 1576960 1950208
4326 1950208 1406464 1085952 924160 2201600 2008064 617472 2342912 1366016 1275392
4317 1275392 1361408 345088 1407488 1247232 1433088 1794560 1182720 1479680 1283072 2302976
4307 2302976 1262080 2495488 665600 1391616 1557504 1241600 886272 1691136 1651712
4298 1651712 1525760 457216 520192 1078272 1316352 1532928 1455104 1267712 2935808 1337856
4287 1455104 1745408 1232896 1473536 1075200 1101312 1024512 1514496 2309120 1722880 2568704
$$ packed form
4355C33312H192J491456N23776j13152m39808K73408o85568k39616K04288J192960
4345B215936q29440J17248M10624o85056J183232q73472K70336F54336R24160
4336A578496N59616p57248J84320j8944M60800o76352L72224j77152N1200L73248
4326A950208n43744l20512j61792J277440j93536F17472J725440r76896r0624
4317A275392Q6016C45088J062400j60256J85856L61472o11840K96960j96608J019904
4307B302976j040896J233408F65600P26016J65888l15904l55328Q04864l9424
4298A651712j25952D57216O2976N58080K38080K16576p7824j87392J668096A337856
4287A455104K90304n12512K40640l98336K6112p6800M89984P94624n86240Q45824
$$ plain form
4277 2568704 2414080 3425280 2180096 2191360 2366976 3252224 2053120 1057792 1503744
4268 1503744 2490880 2356224 2485248 1826304 2805248 1817600 1582592 1351680 1748992 1262080
4258 1262080 1123840 364544 423424 1857024 906752 906240 648192 1452032 -512 254464 2113024
4247 2113024 1396224 1545728 1129472 1587200 1604608 854016 1455616 1091584 552960 1180160
4237 1180160 1528320 1552896 853504 1360896 2616832 1481728 1411584 1801728 947200 661504
4227 661504 1143296 1774592 1309696 1991680 1644032 2482688 1210880 1757696 1068032 459776
4216 1015296 1113600 1327616 487424 1375744 1317376 2333696 779264 1936384 1428480 869376
4206 869376 1496064 1689088 92672 1500672 1634816 1469952 2159616 1584128 1499648 1072128
$$ packed form
4277B568704j54624J011200j245184J1264J75616Q85248j199104r95328M45952
4268A503744R87136j34656J29024o58944R78944r87648k35008k30912L97312m86912
4258A262080j38240C64544N8880J433600I06752n12k58048Q03840e12B54464J858560
4247B113024p16800J49504m16256M57728J7408p50592O01600l64032n38624O27200
4237A180160L48160K4576o99392N07392J255936j135104p0144L90144q54528k85696
4227F61504M81792O31296m64896O81984l47648Q38656A210880N46816o89664D59776
4216A015296R8304K14016D87424Q88320n8368J016320G79264J157120n07904n59104
4206H69376O26688J93024I2672J408000J34144j64864O89664n75488q4480m27520
$$ plain form
4196 1072128 800768 1059840 1094656 2308608 1324544 768000 1122304 1464832 1340416 1149952
4186 1149952 1106944 745984 1461248 966656 1219584 1612288 1823232 916992 1346560 1103360
4176 1103360 1411584 1669632 1622528 1371648 1204224 1534976 1009664 917504 1057280 1467392
4166 1467392 1030144 1236992 539648 253440 1804288 504320 872448 861184 756224 142848
4155 498176 1924608 952832 1344000 584192 672768 1020416 1276928 1191936 1403904 1174016
4145 1174016 670208 1477120 -3584 747520 1123840 1200128 1389568 902144 1284096 909824
4135 909824 1317376 670208 977920 997376 804864 778752 425472 1625600 1154560 440320
4124 492544 1305600 1554432 1948160 700928 1798144 210944 1688576 1175552 1754112
$$ packed form
4196A072128k71360K59072L4816J213952r84064n56544L54304L42528j24416j90464
4186A149952m3008l60960P15264m94592K52928L92704K10944r06240M29568k43200
4176A103360L08224K58048m7104k50880j67424L30752n25312r2160J39776M10112
4166A467392m37248K06848E39648B53440J550848E04320L68128j1264j04960A42848
4155D98176J426432I52832L91168E84192Q8576L47648K56512q4992K11968k29888
4145A174016n03808Q06912c584G47520L76320P6288J89440m87424L81952l74272
4135I09824M07552o47168L07712J9456j92512k6112l53280J200128m71040D40320
4124D92544Q13056K48832L93728G00928J097216B10944J477632n13024N78560
$$ plain form
4115 1754112 756736 1230336 1156608 1246720 100352 1084416 1506816 858624 1497600 -107520
4104 -159744 1008128 765952 771072 493568 824320 1724416 352256 681472 5125120 526336
4093 -8192 989696 787456 853504 707584 771584 236032 1029632 307712 1267712 1192960 1280512
4082 1280512 863744 199680 1461248 382976 1136640 1256960 365568 1266688 1282048 1155072
4072 1155072 1695744 2003968 1909248 1409024 1248768 281088 1859072 1673728 1286656 1824768
4062 1824768 2127360 2520576 1952768 1286144 1571328 1716224 2123264 1235968 1913856 1533952
4052 1533952 2468864 1697280 2354688 1916928 1238016 1266176 2068992 2546176 897024 1967616
4042 1967616 2231808 1136640 1395712 2048000 2470912 1854464 2072064 2757632 2007040
$$ packed form
4115A754112G56736M73600p3728R0112A00352R84064M22400o48192O38976a07520
4104a59744A008128k42176N120k77504L30752R00096C52256L29216M443648E26336
4093h192I89696k02240O6048j45920O4000B36032P93600C07712R60000p4752Q7552
4082A280512m16768A99680J261568C82976P53664J20320C65568R01120J5360j26976
4072A155072N40672L08224r4720n00224j60256B81088J577984j85344l87072N38112
4062A824768L02592L93216n67808o66624K85184J44896M07040q87296O77888l79904
4052A533952R34912p71584O57408m37760o78912K8160Q02816M77184H97024J070592
4042A967616K64192j095168K59072O52288M22912o16448K17600O85568p50592
$$ plain form
4033 2007040 1393152 2074112 2592256 1128448 2853376 3321344 2433024 3344384 2519552
4024 2519552 2786816 3195904 2937344 1774080 2088448 2660864 3538432 1873920 3421696
4015 3421696 2335744 3180032 3544064 2684416 3047936 3050496 3445760 2644992 3001856 1974272
4005 1974272 2377216 2170368 2610176 3102720 2460160 1473024 2928128 2830336 2634752 2722816
3995 2722816 4212224 1801728 1772032 2971136 2894848 2697728 1694208 2994688 1064448
3985 2227712 1538048 884736 2007040 2398208 2036224 2162688 2196992 2417152 1155072
3975 1404928 1619968 1459200 1257472 1000960 947200 2021888 2087424 1261056 1547264 1604096
3965 1604096 1459200 1212928 1867776 1333760 2031104 363520 2135040 2606592 1094656
$$ packed form
4033B007040o13888O80960N18144A128448J724928M67968q88320R11360q24832
4024B519552K67264M09088k58560j163264L14368N72416Q77568j664512J547776
4015C421696j085952Q44288L64032q59648L63520K560L95264q00768L56864j027584
4005A974272M02944k06848M39808M92544o42560r87136J455104r7792j95584Q8064
3995B722816J489408A801728k9696J199104p6288j97120j003520J300480A064448
3985B227712o89664o53312J122304L91168l61984J26464L4304K20160A155072
3975A404928K15040j60768k01728k56512n3760J074688O5536q26368K86208N6832
3965A604096j44896k46272O54848n34016O97344C63520J771520M71552A094656
$$ plain form
3955 323072 1169408 1873408 1631232 1454592 908288 1359872 2135040 2382848 1040896 842240
3945 842240 819712 2532864 681984 715776 1691648 1308160 927232 951808 1939456 1136640
3935 1136640 1338880 1776640 1644032 1025024 1605120 1971200 1672704 2113536 1808896 1309184
3925 1309184 1769984 1350656 2298880 3131392 257536 2519552 2700800 1922560 1419776
3916 1419776 1088512 1543680 1797632 917504 518144 1718784 2505216 942080 49664 1003520
3906 1003520 1391616 1674240 795648 1998848 531968 1511424 -127488 1615872 802304
3896 998912 206848 1812480 1022976 1223680 2107392 1346560 1518592 323072 1399808
3887 1399808 481792 1460736 541184 1729024 1167360 968704 1179648 1988096 1704448
$$ packed form
3955C23072Q46336P04000k42176j76640n46304M51584P75168K47808A040896j98656
3945H42240k2528J713152F81984L3792R75872l83488l80928K4576R87648q02816
3935A136640K02240M37760j32608o19008N80096L66080k98496M40832l04640m99712
3925A309184M60800m19328R48224Q32512B57536K262016J81248p78240n02784
3916A419776l31264M55168K53952q80128l99360J200640P86432I42080D9664R53856
3906A003520L88096K82624G95648J203200E31968R79456a27488A615872H02304
3896I98912B06848J605632p89504K00704Q83712p60832J72032C23072J076736
3887A399808D81792R78944E41184J187840n61664j98656K10944Q08448k83648
$$ plain form
3878 1704448 871424 1461248 872960 1473024 959488 1897472 880640 511488 592384 1406464
3868 1406464 1006592 1637376 1350144 1287168 1374720 582144 -324608 1299456 1330688 861184
3858 861184 1182720 1289216 1477632 1009664 1575936 1188864 955392 1226240 1413632 941568
3848 941568 872448 1063424 985600 1577984 1260544 1124352 1943552 1055232 1113088 973824
3838 973824 972288 832512 1816064 1670144 1347584 1743872 1795584 1331712 1629696 1581056
3828 1581056 824320 2185216 1519616 1512960 1780224 2008064 2898432 1587200 2133504 2395136
3818 2395136 1766400 2229248 2596864 2772480 2339840 2565632 2208768 2843648 4268544
3809 4268544 3360768 3856384 3901952 3384832 3451904 4001280 4039168 4440576 3961344 3692032
$$ packed form
3878A704448q33024N89824n88288O00064n13536R37984H80640l69152Q0896Q14080
3868A406464l99872O30784k87232o2976Q7552E82144c24608A299456L1232m69504
3858H61184L21536J06496J88416m67968N66272l87072k33472K70848J87392m72064
3848I41568o9120J90976p7824N92384l17440j36192Q19200q88320N7856j39264
3838I73824j536j39776R83552j45920l22560L96288N1712m63872K97984m8640
3828A581056p56736J360896o65600o656K67264K27840Q90368j311232N46304K61632
3818B395136o28736M62848L67616J75616m32640K25792l56864O34880J424896
3809D268544r07776M95616M5568n17120O7072N49376L7888M01408m79232k69312
$$ plain form
3799 3692032 5202944 4177920 4357632 4621824 3687936 4570624 5220864 4232704 5265408
3790 5265408 4947456 5477888 6554624 5810688 6668288 6343168 7719936 7162880 6967808
3781 6967808 6623744 7473664 6742528 6316544 7288320 8071168 6883840 9267712 8087552
3772 8087552 9442816 9710592 10039296 11030528 10945536 11293696 11485184 12824064 13359616
3763 13359616 13232640 13644800 14496768 15945728 16369664 16779264 19338240 19798016 22386688
3754 22386688 23714816 26042880 27472896 27710464 28447744 26328576 24137216 20589056
3746 20589056 17726976 15704064 13082112 10915328 7400960 7033344 6644736 5123584
3738 5123584 3418112 3455488 5177344 3254784 3879424 4145152 3469312 2680832 3210752
$$ packed form
3799C692032J510912j025024J79712K64192r33888Q82688O50240r88160J032704
3790E265408l17952N30432J076736p43936Q57600l25120J376768n57056j95072
3781F967808l44064Q49920p31136m25984R71776P82848j187328K383872j180160
3772H087552J355264K67776L28704R91232q4992L48160J91488J338880N35552
3763A3359616j26976M12160Q51968J448960M23936M09600K558976M59776K588672
3754B2386688J328128K328064J430016K37568P37280k119168k191360l548160
3746B0589056k862080k022912k621952k166784l514368l67616l88608j521152
3738E123584j705472L7376J721856j922560O24640K65728o75840p88480N29920
$$ plain form
3729 3210752 2983424 3274240 3208192 2826240 4179968 2496512 2898432 2914816 2722304 3211264
3719 3211264 3121152 3368960 1896960 2798592 2882048 2285056 2704384 2078720 1929216 1711616
3709 1711616 2407424 2047488 2142720 2739200 1420288 2261504 1139200 2038272 680960
3699 1671680 2139136 1995264 1825792 2459648 1581568 2597376 1840640 2779648 1600512
3690 1600512 1945088 1771520 2185216 1461248 2613760 1994752 2421248 2089984 1986048
3681 1986048 2470400 2353152 1639424 2784256 2198016 2252800 1883136 1458176 1247744 1425920
3671 1425920 1936384 1715712 1129984 2796544 2655744 1733120 1196032 674816 1528832
3662 1528832 2040832 1600512 1933312 1095680 2344448 1824256 1104896 2304512 1472512
$$ packed form
3729C210752k27328K90816o6048l81952J353728j683456M01920J6384j92512M88960
3719C211264r0112K47808j472000R01632Q3456n96992M19328o25664j49504k17600
3709A711616O95808l59936R5232N96480j318912Q41216j122304Q99072F80960
3699A671680M67456j43872j69472O33856q78080J015808p56736R39008j179136
3690A600512L44576j73568M13696p23968J152512o19008M26496l31264j03936
3681A986048M84352j17248p13728J144832n86240N4784l69664m24960k10432J78176
3671A425920N10464k20672n85728J666560j40800r22624n37088n21216Q54016
3662A528832N12000m40320L32800q37632J248768n20192p19360J199616q32000
$$ plain form
3653 1472512 922624 922112 1799168 1371136 1196544 1625600 1393152 1959936 1357824 1603072
3643 1603072 1335296 1061376 1350144 2107904 2956800 2590208 932864 2275328 1239040
3634 1239040 1850880 1005568 1762304 2216960 1500672 1261568 1363968 942592 1279488 1904128
3624 1904128 2475008 1668096 1099776 2372096 2549760 879104 2471936 2104320 1492992
3615 1492992 1486336 1392128 1301504 972800 1716736 978432 1312256 2446848 2066432 2311680
3605 2311680 1647104 2916864 2281472 1859072 1152000 2138112 1886720 2006016 2626560
3596 2626560 1103360 1361408 1759744 2575360 1751552 1146368 1956864 2937344 1995776
3587 1995776 2568704 2236928 2555904 2454016 2221568 2356224 1494016 1783296 1441792 1361408
$$ packed form
3653A472512n49888n12Q77056m28032j74592M29056k32448N66784o02112K45248
3643A603072k67776k73920K88768P57760Q48896l66592I32864J342464j036288
3634A239040O11840q45312P56736M54656p16288k39104J02400m21376L36896O24640
3624A904128N70880q06912n68320J272320J77664H79104J592832l67616o11328
3615A492992o656r4208r0624l28704P43936p38304L33824J134592l80416K45248
3605B311680o64576J269760o35392m22400p07072R86112k51392J19296O20544
3596B626560A103360K58048L98336Q15616q23808o05184Q10496R80480r41568
3587A995776N72928l31776L18976j01888k32448J34656q62208K89280l41504q0384
$$ plain form
3577 1361408 1134080 2634240 2845184 2726400 2128896 2308608 1853440 1556480 1937920
3568 1937920 1568256 3136512 1932288 2425344 2621952 3288576 2954240 1950208 2573312
3559 2573312 3461120 2342912 3036160 2178048 3015168 3867136 2356736 2890240 3458560
3550 3458560 3308544 3253760 3069440 3634688 3693056 4025856 2656256 3745280 3539456 3982336
3540 3982336 3582976 4419584 4289024 3899904 4334080 4204544 6084608 6436864 6362112 6238720
3530 6238720 5904896 7843840 8353792 7885824 7598592 9224704 7316992 8656384 9379840
3521 9379840 8819712 10004992 10390528 10463232 11561472 12948480 14410752 14990848 14348800
3512 14348800 16915456 17029632 18648064 20637696 21379072 21899776 23348736 23562752 25239552
$$ packed form
3577A361408k27328J500160K10944j18784n97504J79712m55168k96960L81440
3568A937920l69664J568256j204224M93056J96608O66624l34336j004032O23104
3559B573312Q87808j118208O93248q58112Q37120Q51968j510400N33504N68320
3550C458560j50016n4784j84320N65248N8368L32800j369600J089024k05824M42880
3540C982336l99360Q36608j30560l89120M34176j29536J880064L52256p4752j23392
3530F238720l33824J938944N09952m67968k87232J626112j907712J339392P23456
3521I379840n60128J185280L85536P2704J098240J387008J462272N80096o42048
3512A4348800K566656J14176J618432J989632P41376N20704J448960K14016J676800
$$ plain form
3503 25239552 26026496 28815360 30473728 34119680 34158592 38194176 40287744 41344000 41721856
3494 41721856 41757696 38792192 35829760 31962112 28410880 22758912 20736000 17907712
3486 17907712 16576512 13633536 12027392 11102208 10439680 11237376 10117120 9248256 9216000
3477 9216000 8377344 9180672 9350144 7584256 8214528 7502336 7446528 7713280 7822336 8090624
3467 8090624 7922688 6482944 7640064 6852096 6876160 6718464 5713920 6332928 5245440
3458 5245440 5777408 3909120 4350464 4525568 3621888 3795456 3138048 4623872 4157952
3449 4157952 3233792 4906496 4574720 3709952 4285440 3462144 3628544 3539968 3362304 3305984
3439 3305984 4102144 3858944 2557952 4229120 3331072 3133952 3359232 3392000 3643392
$$ packed form
3503B5239552P86944K788864J658368L645952L8912M035584K093568J056256L77856
3494D1721856L5840k965504k962432l867648l551232n651968k022912k828288
3486A7907712j331200k942976j606144r25184o62528P97696j120256q68864l2256
3477I216000q38656Q03328J69472j765888O30272p12192n5808K66752J09056K68288
3467H090624j67936j439744J157120p87968K4064j57696j004544O19008j087488
3458E245440N31968j868288M41344J75104r03680J73568o57408J485824m65920
3449D157952r24160J672704l31776q64768N75488q23296J66400q8576j77664n6320
3439C305984P96160k43200j300992J671168q98048j97120K25280L2768K51392
$$ plain form
3430 3643392 4244992 4650496 3330560 3456000 3387904 3101696 2702336 2612736 2959872 3272704
3420 3272704 3767296 3890176 3690496 3364864 3222528 3577856 3578368 5018112 3374080 3659264
3410 3659264 3757056 3501056 3522048 3077120 3528704 3120128 3372544 4270080 3043840 2264064
3400 2264064 3401728 3071488 3506176 4004352 3182080 2526208 3371008 2986496 4207616
3391 4207616 3362816 3200512 4407296 2942976 3009536 3316224 3010560 3132928 2942464
3382 2942464 3768320 3211264 2605056 2038784 3434496 3579392 3048448 1876992 2783744
3373 2783744 3471872 3311104 3915264 2967552 3184128 2870272 3400192 3540480 3684352 3385856
3363 3385856 3143680 2440704 2168832 2702848 3696128 4386304 4594176 3536896 3680768
$$ packed form
3430C643392O01600M05504j319936J25440o8096k86208l99360q9600L47136L12832
3420C272704M94592J22880j99680l25632j42336L55328N12J439744j644032K85184
3410C659264R7792k56000K0992m44928M51584m08576K52416Q97536j226240p79776
3400B264064J137664l30240M34688M98176q22272o55872Q44800l84512J221120
3391D207616q44800j62304J206784j464320O6560L06688l05664J22368j90464
3382B942464Q25856n57056o06208n66272J395712J44896n30944j171456R06752
3373B783744O88128j60768O04160r47712K16576l13856N29920J40288J43872k98496
3363C385856k42176p02976k71872N34016R93280O90176K07872j057280J43872
$$ plain form
3354 3680768 2433024 3958784 2944512 3073024 2768896 3650048 1893376 2102784 3189248
3345 3189248 3276288 2870784 3863040 3484160 3996160 4000768 4837376 3664384 3990528 5276160
3335 5276160 3966976 5001216 3734016 4818432 5298176 4732928 4831744 4334080 4838912
3326 4838912 5197824 4665856 3319808 5876224 4616704 4902400 4607488 3848704 4962304
3317 4962304 4291072 4884480 4377600 4463616 5772288 5901312 5704704 5104128 6603776
3308 6603776 8439296 8268800 8192512 8417280 9259520 10068992 9636864 9120256 9324032 9139712
3298 9139712 9920512 9144320 9864704 10466304 10047488 9859584 10682368 10547712 11031040 11923456
3288 11923456 11956736 12331008 13071872 12460544 13166080 12444160 13179392 13231104 13913600 15319040
$$ packed form
3354C680768j247744J525760j014272J28512l04128Q81152j756672K09408J086464
3345C189248Q7040m05504R92256l78880N12000M608Q36608j172992L26144J285632
3335E276160j309184J034240j267200J084416M79744n65248R8816m97664N04832
3326D838912L58912n31968j346048K556416j259520K85696k94912p58784J113600
3317D962304o71232N93408n06880Q6016J308672J29024j96608o00576J499648
3308F603776J835520j70496p6288K24768Q42240Q09472m32128n16608K03776j84320
3298I139712P80800p76192P20384O01600m18816j87904Q22784j34656M83328Q92416
3288A1923456L3280L74272P40864o11328P05536p21920P35232N1712O82496J405440
$$ plain form
3278 15319040 15640576 16470528 17784832 18710528 19525632 20642816 22259712 23282688 23418368
3269 23418368 26608128 27555328 30258176 30954496 33453568 36655104 38427136 42022912
3261 42022912 45362688 51460096 56832512 61794304 69256704 78301184 86510080 96673792
3253 96673792 108914176 120445440 134521856 150537728 167927296 187496960 212930048
3246 212930048 242112000 278477824 327342592 393458176 478009856 592810496 734298624
3239 734298624 887469056 1019143168 1109200896 1139748864 1075346432 922404352 736040448
3232 736040448 572046848 446016512 352754688 283487232 233367040 197092352 169099776
3225 169099776 148836864 132538368 119599104 109720064 100368896 93490176 87784960 82091008
$$ packed form
3278A5319040L21536Q29952J314304R25696Q15104J117184J616896J022976J35680
3269B3418368L189760R47200K702848O96320K499072L201536J772032L595776
3261D2022912L339776O097408N372416M961792P462400R044480Q208896J0163712
3253I6673792J2240384J1531264J4076416J6015872J7389568J9569664K5433088
3246B12930048K9181952L6365824M8864768O6115584Q4551680J14800640J41488128
3239G34298624J53170432J31674112R0057728L0547968o4402432j52942080j86363904
3232G36040448j63993600j26030336r3261824o9267456n0120192l6274688k7992576
3225A69099776k0262912j6298496j2939264r879040r351168o878720n705216n693952
$$ plain form
3217 82091008 77324288 72000512 68147712 64655872 62103552 60227072 56560640 53375488
3209 53375488 51591168 49870848 47522304 46390784 45034496 43981312 42091520 40416256
3201 40416256 40808960 38730240 37899264 36955648 36113408 34885632 33128960 33370624 31467008
3192 31467008 30393344 29402624 29074432 29061632 27444736 27257856 26811904 26256384 24651264
3183 24651264 24544256 24435200 23027712 22721536 23282176 22218752 22549504 22588416 21210112
3174 21210112 20469760 20082688 20802048 19374592 17964544 18536960 18758144 17928704 18436608
3165 18436608 19356672 17827328 18386432 18802688 19089408 18318336 18374656 18156032 16822784
3156 16822784 17875456 17253888 18564096 17916928 15685632 16132096 16084480 14981632 16511488
$$ packed form
3217H2091008m766720n323776l852800l491840k552320j876480l666432l185152
3209E3375488j784320j720320k348544j131520j356288j053184j889792j675264
3201D0416256L92704k078720q30976r43616q42240j227776j756672K41664j903616
3192C1467008j073664r90720l28192j2800j616896j86880m45952n55520j605120
3183B4651264j07008j09056j407488l06176N60640j063424L30752L8912j378304
3174B1210112p40352l87072P19360j427456j410048N72416K21184q29440N07904
3165A8436608R20064j529344N59104M16256K86720p71072N6320k18624j333248
3156A6822784J052672o21568J310208o47168k231296M46464m7616j102848J529856
$$ plain form
3147 16511488 15351808 14851072 14832640 14795264 13606400 13936128 15262720 14105600 15444480
3138 15444480 14450176 12508672 13982720 13640192 14102016 13150720 12889600 13992960 12646400
3129 12646400 13946368 13369856 14099456 14191104 13953024 13943296 12401152 12749824 13718528 12557312
3119 12557312 11591168 12000256 12271616 11710464 11681280 12185088 11628544 11159040 11659776 10480640
3109 10480640 10987008 11209216 11059200 11969536 10214912 11367424 10324992 10819584 10399744
3100 10399744 11651072 9939968 9533440 9851904 10341376 9962496 9646080 9971200 9160192
3091 9160192 11002880 9242112 9623040 9860096 9785856 8904704 10162688 9769472 9450496
3082 9450496 9578496 9140736 9988096 10058240 8654336 9972224 8844288 8226816 8246784
$$ packed form
3147A6511488j159680n00736j8432l7376j188864L29728J326592j157120J338880
3138A5444480r94304j941504J474048l42528M61824r51296k61120J103360j346560
3129A2646400J299968n76512P29600R1648k38080r728j542144L48672R68704j161216
3119A2557312r66144M09088K71360n61152k9184N03808n56544m69504N00736j179136
3109A0480640N06368K22208j50016R10336j754624J152512j042432M94592m19840
3100A0399744J251328j711104m06528L18464M89472l78880l16416L25120q11008
3091I160192J842688j760768L80928K37056p4240q81152J257984l93216l18976
3082I450496J28000m37760Q47360P0144j403904J317888j127936o17472J9968
$$ plain form
3073 8246784 8796160 9051648 9193984 9513984 7812608 8431616 8847872 8921600 9156608 9144320
3063 9144320 8353280 8967168 8613888 7728640 8755712 9304576 8351232 8655360 8835072
3054 8835072 10206720 10101760 10409984 11134976 11121152 12365824 13132800 13968896 15071232
3045 15071232 14618112 14615040 13089280 15030784 14465024 13027840 13729280 14022144 13925376
3036 13925376 14515712 14158848 14345728 14184448 15384576 16367616 15636992 15415808 16441344
3027 16441344 16257024 16864768 17043968 17460224 18061824 18318336 18127872 17362944 18042880
3018 18042880 19701248 19223552 20496384 21204480 20164096 21420544 21538816 22104064 22957056
3009 22957056 23909376 23657984 22755328 25067520 26390016 26429952 28564480 29713920 30173696
$$ packed form
3073H246784N49376K55488J42336L20000j701376O19008M16256P3728K35008j2288
3063I144320p91040O13888l53280q85248J027072N48864r53344L04128J79712
3054H835072J371648j04960L08224P24992j3824J244672P66976Q36096J102336
3045A5071232m53120l072j525760J941504n65760j437184P01440K92864r6768
3036A3925376N90336l56864J86880j61280J200128R83040p30624k21184J025536
3027A6441344j84320O07744J79200M16256O01600K56512j90464p64928O79936
3018A8042880J658368m77696J272832P08096j040384J256448J18272N65248Q52992
3009B2957056R52320k51392r02656K312192J322496L9936K134528J149440M59776
$$ plain form
3000 30173696 32863232 34427904 34736640 36697600 38159872 40311808 41464832 43063296
2992 43063296 44379136 45851648 48240640 48245760 51027968 51891200 53636096 56324608 58638336
2983 58638336 59899904 63104000 64397824 65543168 64727552 61085184 57235968 52220928
2975 52220928 45941760 41755136 37151744 34000896 29471232 26550784 25371136 22666752
2967 22666752 21886976 19216896 19973632 19105280 18554368 18766848 16687616 16316928 16802304
2958 16802304 16408064 15753216 16355328 15253504 15513600 15863296 14225408 12282880 12811776
2949 12811776 13205504 12334080 10757632 11326976 11091968 10759168 11012608 10357760 9717248
2940 9717248 10484224 9502720 9473024 9014784 8926720 9076736 8973824 9070080 8483328 9129984
$$ packed form
3000C0173696K689536J564672L08736J960960J462272K151936J153024J598464
2992D3063296J315840J472512K388992N120K782208Q63232J744896K688512K313728
2983E8638336J261568L204096J293824J145344q15616l642368l849216n015040
2975E2220928o279168m186624m603392l150848m529664k920448j179648k704384
2967B2666752p79776k670080P56736q68352n50912K12480k079232l70688M85376
2958A6802304l94240o54848O02112j101824K60096L49696j637888j942528N28896
2949A2811776L93728q71424j576448N69344k35008l32800K53440o54848o40512
2940I717248P66976r81504k9696m58240q8064J50016j02912R6256n86752O46656
$$ plain form
2930 9129984 8383488 8983552 7272448 7986688 8055808 6607360 7971328 7918080 6849024
2921 6849024 8179712 7883776 7133184 8214016 7159296 7710720 7699456 8152064 6311936
2912 6311936 6225920 7256576 6348288 5159936 6702592 5801472 7151616 6153728 5175808
2903 5175808 5386240 5852160 6484480 6714880 6517248 6726144 7638016 6096896 7110656
2894 7110656 6175744 6645248 6792192 5919232 5568000 6491648 6278656 6603264 7516672 6435328
2884 6435328 6052864 5488640 5320704 5565952 6057472 6645248 7343616 7084544 6908416 6659072
2874 6659072 7267328 6360064 5979648 5666816 6254592 6850560 6577152 6043136 5899264 5722112
2864 5722112 5605376 4861952 6070784 6432256 6074368 6223360 6102528 6127104 5733376 5652480
$$ packed form
2930I129984p46496O00064j711104P14240O9120j448448J363968n3248j069056
2921F849024J330688k95936p50592J080832j054720N51424j1264M52608j840128
2912F311936q6016J030656r08288j188352J542656r01120J350144r97888r77920
2903E175808K10432M65920O32320K30400j97632K08896R11872j541120J013760
2894G110656r34912M69504J46944q72960l51232R23648k12992L24608R13408j081344
2884F435328l82464n64224j67936K45248M91520N87776O98368k59072j76128k49344
2874F659072O08256r07264l80416l12832N87776N95968k73408n34016j43872j77152
2864E722112j16736p43424J208832L61472l57888J48992j20832K4576l93728q0896
$$ plain form
2854 5652480 5811712 4537344 5377536 5394432 4605952 5250048 4795904 5609984 3977728
2845 3977728 5776384 5232128 3796480 4577792 5311488 5269504 5289472 5670400 4858368 5476864
2835 5476864 5255680 5874176 4958208 6022144 6355456 5789184 6324224 7001088 7258624
2826 7258624 8282624 7762944 9296384 11282944 13089792 15459328 17698304 19305472
2818 19305472 18984960 16955392 16116224 15526912 11109376 8499200 7109120 7363584 6239744
2809 6239744 5133824 5615104 5759488 5136384 5511680 6147584 4632064 5818880 5271040
2800 5271040 5969920 4803584 5175296 5165056 4870656 4687872 4792320 4479488 4513792 5356544
2790 5356544 4777472 5265920 5743104 5825536 5749760 6588928 5189632 6583296 5626368 7337984
$$ packed form
2854E652480J59232j274368Q40192J6896p88480O44096m54144Q14080j632256
2845C977728J798656n44256j435648P81312P33696m1984J9968L80928q12032O18496
2835E476864k21184O18496r15968J063936L33312n66272N35040O76864K57536
2826G258624J024000n19680J533440J986560J806848K369536K238976J607168
2818A9305472l20512k029568q39168n89312m417536k610176j390080K54464j123840
2809F239744j105920M81280J44384o23104L75296O35904j515520J186816n47840
2800E271040O98880j166336L71712j0240k94400j82784J04448l12832L4304Q42752
2790E356544n79072M88448M77184Q2432p5776Q39168j399296J393664r56928J711616
$$ plain form
2780 7337984 6050304 6354432 6473728 4084736 5752320 7095296 5308416 6204416 5824000
2771 5824000 6296064 7300608 6533120 6009344 5920768 6717440 6965760 6357504 6256128 5917184
2761 5917184 5633024 4887040 6046208 6162944 6126592 6600192 6841344 5986304 5836288 6654976
2751 6654976 5953536 6345216 6387200 6878720 5705728 6632960 7043072 7068672 7162368 6080512
2741 6080512 6878720 6452224 6956032 7118336 6551040 7942656 7434752 7760384 8668672
2732 8668672 7550464 9085440 8819200 8640000 9323520 11539456 13801984 15510016 16577536
2723 16577536 18190336 18377728 18431488 18361856 17547776 15757824 15532544 12016640 10452992
2714 10452992 9613312 9502208 8614400 7667712 7756288 7475200 7791104 6814208 7514624 6846976
$$ packed form
2780G337984j287680L04128J19296k388992J667584J342976j786880Q96000l80416
2771E824000M72064J004544p67488n23776q8576P96672K48320o08256j01376l38944
2761E917184k84160p45984J159168J16736l6352M73600K41152q55040j50016Q18688
2751F654976p01440L91680M1984M91520j172992R27232M10112K5600R3696j081856
2741F080512P98208m26496N03808J62304n67296J391616n07904L25632R08288
2732H668672j118208J534976k66240j79200O83520K215936K262528J708032J067520
2723A6577536J612800J87392N3760o9632q14080j789952k25280l515904j563648
2714A0452992q39680j11104q87808r46688Q8576k81088L15904r76896P00416o67648
$$ plain form
2704 6846976 6904832 5946368 5457408 5676032 6943744 7567360 5902336 6573568 7376384
2695 7376384 5846016 5502464 5486592 6205440 6420992 6195712 6539776 4769280 4736512 5337600
2685 5337600 5493248 5445632 5737984 5107712 5708800 5321728 5993984 6058496 6063616 5312000
2675 5312000 7391232 5144576 5008896 5398528 4698112 4858368 6455296 4503552 5595136
2666 5595136 5216768 4775936 5482496 5018624 5379072 4757504 5729792 4958720 5915648 4560384
2656 4560384 6404608 5584384 4802048 4925440 5837312 5295616 6068224 6150144 5696000 5646336
2646 5646336 5106688 5768192 5730816 5231104 4755456 3977728 5645824 5270016 4787712 6052864
2636 6052864 5267456 5018112 4884992 5412864 4807168 4788224 4671488 5426176 4591616 5609984
$$ packed form
2704F846976N7856r58464m88960K18624J267712O23616j665024O71232Q02816
2695G376384j530368l43552j5872P18848K15552k25280L44064j770496l2768O01088
2685E337600J55648m7616K92352o30272O01088l87072O72256O4512N120p51616
2675E312000K079232k246656j35680L89632p00416J60256J596928j951744J091584
2666E595136l78368m40832P06560m63872L60448o21568R72288p71072R56928j355264
2656D560384J844224q20224p82336J23392R11872n41696P72608Q1920m54144m9664
2646E646336n39648O61504l7376m99712m75648p77728J668096l75808m82304J265152
2636F052864p85408k49344j33120N27872o05696j8944j16736P54688q34560J018368
$$ plain form
2626 5609984 4640256 5956608 4975616 5109248 5438464 5566976 5593088 5383680 5071360 4425216
2616 4425216 5214720 5807616 5265920 4441600 5649920 6170624 5670912 6443008 6392832 7267328
2606 7267328 6555648 8328192 11165696 16960000 17413632 20065792 22589440 22596608 14393856
2597 14393856 10149376 8830464 7220224 6364160 5550080 5796352 5656576 5370368 4161024
2588 4161024 5519872 5255168 6484480 4619776 4664832 3750912 3521024 4530688 4978688
2579 4978688 5033472 4666880 5451264 4925952 4329984 5189120 6102016 5307392 6094336 4490240
2569 4490240 3939328 4051456 4585984 4763136 4025856 5660160 5217792 5344768 5474816
2560 5474816 6172672 6510080 5429248 4516864 4808192 3701760 5416448 4083712 3527680
$$ packed form
2626E609984r69728J316352r80992J33632L29216J28512K6112k09408l12320o46144
2616D425216P89504N92896n41696q24320J208320N20704m99712P72096n0176Q74496
2606G267328p11680J772544K837504N794304M53632K652160K523648P168q202752
2597A4393856m244480j318912j610240q56064q14080K46272j39776k86208j209344
2588D161024J358848k64704J229312j864704M5056r13920k29888J009664M48000
2579D978688N4784l66592P84384n25312n95968Q59136R12896p94624P86944j604096
2569D490240n50912J12128N34528J77152p37280J634304m42368J26976J30048
2560E474816O97856L37408j080832r12384K91328j106432J714688j332736n56032
$$ plain form
2551 3527680 4498944 4147200 5324800 3713536 4133376 4766720 3461632 3932672 4094464
2542 4094464 4173824 4043264 3035648 4136960 4276736 3380736 4217856 4485120 4515840 4534784
2532 4534784 5346816 3367424 4993536 5998592 4569088 6127104 3999744 5915136
2524 5915136 6356992 5548032 6215680 5439488 5955584 6308864 7154688 7698944 8852480
2515 8852480 11768832 16036352 22574080 25262080 29429760 32135680 30020608 23342592
2507 23342592 16993792 14430208 13468160 16263168 20155904 21452800 22923776 25782272
2499 25782272 24787456 18532352 15674368 16103424 19177472 25892864 26510336 30333440 34592256
2490 34592256 32881152 22811136 17268736 15335424 16566272 19595776 22145536 23064064
$$ packed form
2551C527680R71264l51744J177600j611264M19840O33344j305088M71040J61792
2542D094464P9360j30560j007616J101312J39776q96000Q37120K67264L0720J8944
2532D534784Q12032j979392J626112J005056j429504J558016k127360J915392
2524E915136M41856q08960O67648p76192N16096L53280Q45824N44256J153536
2515H852480K916352M267520O537728K688000M167680K705920k115072o678016
2507B3342592o348800k563584r62048K795008L892736J296896J470976K858496
2499B5782272r94816o255104k857984M29056L074048O715392O17472L823104M258816
2490C4592256j711104j0070016n542400j933312J230848L029504K549760R18528
$$ plain form
2482 23064064 27476992 24079360 16011264 12932608 11905536 12371456 13974016 14069248 14285824
2473 14285824 15159296 15983616 11923968 9659904 10174464 8315392 7863808 8569344 8781824
2464 8781824 8185344 7865856 9147904 7653888 7473664 7710208 6862848 6450688 6941184
2455 6941184 7570944 6606848 6801920 8413696 7450624 8348160 7092736 8179712 6820352
2446 6820352 6695424 6533120 6580736 5986304 5460480 6096384 6068736 6033408 6149632 5004288
2436 5004288 5322240 4881920 3902976 2519552 3413504 4612096 4512768 3220480 3884544
2427 3884544 3701760 4099072 3439616 3214336 3626496 3014144 2961920 2816512 3484672 3297280
2417 3297280 4019712 2720768 4050432 4804096 3729408 3746304 3753472 3508736 2890752 3102208
$$ packed form
2482B3064064M412928l397632q068096l078656j027072M65920J602560R5232K16576
2473A4285824Q73472Q24320m059648k264064N14560j859072m51584P05536K12480
2464H781824n96480l19488J282048j494016j80224K36544q47360m12160M90496
2455F941184O29760r64096J95072J611776r63072Q97536j255424J086976j359360
2446F820352j24928j62304M7616n94432n25824O35904k7648l5328J16224j145344
2436E004288L17952m40320r78944j383424Q93952J198592r9328j292288O64064
2427C884544j82784L97312o59456k25280M12160o12352n2224j45408O68160j87392
2417C297280P22432j298944J329664P53664j074688J6896P168k44736o17984K11456
$$ plain form
2407 3102208 3990016 2371072 3148288 2426368 3353088 2860032 3548160 3042816 4115968
2398 4115968 3063808 3535872 3684352 2841088 3902976 3619328 3846144 2320384 3441664
2389 3441664 3258368 2676224 3805184 3175424 3467776 2437632 4188672 2718208 2342400
2380 2342400 3877376 3037696 3009024 2670592 3133440 2816000 3499008 3044352 2811392 2120192
2370 2120192 3085312 2928128 2669056 2861056 2692608 3510272 2784256 3761664 2934272 2095104
2360 2095104 3911680 3420160 2757120 2809856 3722240 2533376 3363840 3589120 3383296
2351 3383296 3050496 2999808 3706368 3412480 3515904 3591680 3888128 3543552 3357184 3652608
2341 3652608 1836544 3615744 3187200 2248704 2514944 3701760 3021312 2676736 2004480
$$ packed form
2407C102208Q87808j618944P77216p21920R26720m93056O88128n05344J073152
2398D115968j052160M72064J48480q43264J061888k83648K26816j525760J121280
2389C441664j83296n82144J128960o29760K92352j030144J751040j470464l75808
2380B342400J534976q39680k8672l38432M62848l17440O83008m54656k32960o91200
2370B120192R65120j57184k59072J92000j68448Q17664p26016R77408q27392q39168
2360B095104J816576m91520o63040N2736R12384j188864Q30464K25280k05824
2351C383296l32800n0688P06560k93888J03424P5776K96448l44576j86368K95424
2341C652608j816064J779200m28544r38496K66240J186816o80448l44576o72256
$$ plain form
2332 2004480 2332160 2038784 3329536 2013184 3342336 2384384 2021376 2904576 2362880
2323 2362880 1990144 2619392 2592768 2280448 2224128 3105792 2472960 2798592 2936832 2220544
2313 2220544 1702400 2215424 3363840 2513920 2335744 2469376 2469888 3373568 3330560 3256320
2303 3256320 3030528 4250112 3395072 2866176 3608576 3203072 2958848 2959360 2811392 4244480
2293 4244480 2707968 3270656 3740672 3275776 3136512 3539968 3275776 3551744 3123712
2284 3123712 3535360 3461632 3984384 3098112 3282432 3451904 3207680 2793472 3671552 4395008
2274 4395008 3918848 3958272 4275200 4457984 4988416 5257728 3908096 5740032 4036608
2265 4036608 4994560 5228544 5268992 5288960 4685312 5219328 5960704 5348352 5575680 5529600
$$ packed form
2332B004480L27680k93376J290752j316352J329152r57952l63008Q83200n41696
2323B362880l72736O29248k6624l12320n6320Q81664o32832L25632J38240p16288
2313B220544n18144N13024J148416q49920j78176J33632N12R03680m3008p4240
2303C256320k25792J219584q55040n28896P42400m05504k44224N12j47968J433088
2293D244480j536512N62688M70016m64896j39264M03456k64192K75968m28032
2284C123712M11648p3728N22752q86272J84320J69472k44224m14208Q78080P23456
2274D395008m76160L9424L16928J82784N30432K69312j349632J831936j703424
2265D036608R57952K33984M0448J9968o03648N34016P41376o12352K27328m6080
$$ plain form
2255 5529600 5041152 4492288 6269952 4982784 5053440 6266880 5645312 5521920 5434368
2246 5434368 5236736 5415424 6161920 6227968 5275648 5981696 4956672 5123584 4924416 5347328
2236 5347328 7093248 5098496 5911040 5202432 6005248 5855232 6203904 6682624 6360576
2227 6360576 6543360 6879232 6394368 5950976 5535232 4752384 5742080 4833792 5202944 4804096
2217 4804096 4562944 5449216 4517376 3806208 4755968 3987968 3836416 3014144 3993088 3099648
2207 3099648 4599808 4570112 3875328 4313600 4004352 4504064 4387840 3342848 4974080
2198 4974080 3220992 4032512 4854272 3626496 4321280 3636736 3103744 4360192 3910656
2189 3910656 4135936 3123712 3665408 3124224 3728384 3696128 4513792 2663424 3053056
$$ packed form
2255E529600m88448n48864J777664j287168P0656J213440o21568j23392q7552
2246E434368j97632J78688P46496O6048r52320P06048j025024J66912j99168M22912
2236E347328J745920j994752Q12544p08608Q02816j50016L48672M78720l22048
2227F360576J82784L35872m84864m43392m15744p82848R89696r08288L69152l98848
2217D804096k41152Q86272r31840p11168R49760p68000j51552q22272R78944q93440
2207C099648J500160k9696o94784M38272l09248M99712j16224j044992J631232
2198D974080j753088Q11520Q21760j227776O94784o84544n32992J256448m49536
2189C910656K25280j012224N41696n41184O04160l2256Q17664j850368L89632
$$ plain form
2180 3053056 3048960 2281984 2374656 3870208 3537408 2936832 3485696 3832832 3080704 2164736
2170 2164736 4000768 4280320 3001344 2337280 2650112 3808768 4068864 4180992 2806272
2161 2806272 4593664 3284480 3907584 4081664 3074560 3703296 3977216 3947008 3840512
2152 3840512 3383808 3431936 3148800 3718144 4103680 3520000 2969088 4420096 2814464
2143 2814464 2933248 2532864 3784704 3752960 2842624 2312704 3357696 1919488 3736064
2134 3736064 3023872 3539968 3782144 3786752 2443264 2268160 3919872 2897408 3608576
2125 3608576 3954688 3022848 2908160 3643392 4013568 3838464 3287040 5134848 4089344
2116 4089344 4749824 4446720 2198016 3927040 3194368 3317248 3495936 3264512 3536384
$$ packed form
2180C053056m096p66976R2672J495552l32800o00576N48864L47136p52128r15968
2170B164736J836032K79552j278976o64064L12832J158656K60096J12128j374720
2161B806272J787392j309184O23104J74080j007104O28736K73920l0208j06496
2152C840512m56704M8128k83136N69344L85536n83680n50912J451008j605632
2143B814464J18784m00384J251840l1744r10336n29920J044992j438208J816576
2134C736064p12192N16096K42176M608j343488j75104J651712j022464P11168
2125C608576L46112r31840j14688P35232L70176j75104n51424J847808j045504
2116D089344O60480l03104B198016J729024p32672J22880J78688k31424K71872
$$ plain form
2107 3536384 4189184 3226112 3953152 3074560 3016704 4754432 2943488 3742720 3246080
2098 3246080 3585024 3497984 3947008 3885056 3462144 3461632 3587584 4485120 2400768 4525056
2088 4525056 4409344 3758080 2710016 4171776 3118080 3484160 2917376 3110400 3484160
2079 3484160 4438528 3084800 3055616 3730432 4099584 3281408 3772928 4324352 3925504 3965952
2069 3965952 4360192 4813312 3793920 4919296 4235776 4374016 4485120 4050944 4794368
2060 4794368 5056000 4983808 4763136 3968000 4366336 4892160 4491776 6000128 5226496 5992448
2050 5992448 4564992 5604352 6069760 5560832 5608448 5438464 5476864 6129152 6395392 6254080
2040 6254080 6730240 6261760 7092736 6997504 7234560 7512064 7818752 8102912 7426560 8748544
$$ packed form
2107C536384O52800r63072P27040q78592n7856J737728j810944P99232m96640
2098C246080L38944q7040M49024o1952m22912n12J25952Q97536k084352K124288
2088D525056j15712o51264j048064J461760j053696L66080n66784J93024L73760
2079C484160R54368j353728k9184O74816L69152q18176M91520N51424l98848M0448
2069C965952L94240M53120j019392J125376o83520J38240J11104m34176P43424
2060D794368K61632p2192k20672p95136L98336N25824m00384J508352p73632P65952
2050E992448j427456J039360M65408n08928M7616j69984L8400O52288K66240j41312
2040F254080M76160m68480Q30976r5232K37056K77504L06688K84160o76352J321984
$$ plain form
2030 8748544 7539200 7689728 8025088 7064064 7204352 7616512 7452672 7963136 7202304
2021 7202304 7885824 7815168 7787008 7696896 8147456 9027584 8801792 8156160 9269248 8412160
2011 8412160 8417280 8628736 8829440 8918528 8814080 8926208 10072576 8392704 8209408 7385600
2001 7385600 9202688 6921216 6769152 7941632 7106048 7856128 6382080 7004672 6674432
1992 6674432 5771264 6819840 7987200 5834752 6280704 7280128 5748736 6308352 7033856
1983 7033856 6537728 5790208 7095296 6299648 6755840 6949888 7039488 6609920 6126592 7035904
1973 7035904 5810688 6686720 6106624 5986816 5443584 5518336 5561856 5658624 5021184 5670400
1963 5670400 4938752 6054400 4913152 4515840 4611584 4568064 4221952 5026304 4709376 5857792
$$ packed form
2030H748544j209344J50528L35360r61024J40288M12160j63840N10464p60832
2021G202304O83520p0656k8160r0112M50560Q80128k25792o45632J113088q57088
2011H412160N120K11456K00704Q9088j04448J12128J146368j679872j83296q23808
2001G385600J817088k281472j52064J172480q35584P50080j474048O22592l30240
1992F674432r03168J048576J167360k152448M45952R99424j531392N59616P25504
1983G033856m96128p47520J305088p95648M56192J94048Q9600m29568m83328R09312
1973G035904j225216Q76032n80096j19808n43232P4752M3520R6768o37440O49216
1963E670400p31648J115648j141248l97312R5744m3520l46112Q04352l16928J148416
$$ plain form
1953 5857792 4421120 4950528 4556800 5056512 4965376 4331008 4518912 5965312 5095936
1944 5095936 5568000 4550144 5853696 6162944 5268480 6417408 5026816 5094912 5178880
1935 5178880 5750784 5273600 5954048 6235136 6075392 6418432 5748224 6961664 5477376
1926 5477376 5909504 6265856 6470656 6702080 5332480 6595072 4823040 6808064 6159872
1917 6159872 6598656 6681600 6653952 6711808 7191040 6660096 6995968 6876672 6572544 8081920
1907 8081920 7870464 7925760 8331264 7750656 7477248 8735232 8689152 7088640 9051648
1898 9051648 8236032 9034752 8117760 9259008 7906816 9091584 8805888 7666176 9379328
1889 9379328 8970752 8711168 7977984 8343040 9615360 8443392 9144832 9592320 7927808
$$ packed form
1953E857792j436672N29408l93728M99712r1136o34368J87904J446400q69376
1944E095936M72064j017856J303552L09248q94464J148928j390592O8096Q3968
1935E178880N71904m77184O80448K81088j59744L43040o70208J213440j484288
1926E477376M32128L56352K04800K31424j369600J262592j772032J985024o48192
1917F159872M38784Q2944k7648N7856M79232n30944L35872j19296l04128J509376
1907H081920k11456N5296M05504n80608k73408J257984m6080j600512J963008
1898I051648q15616P98720r16992J141248j352192J184768k85696j139712J713152
1889I379328m08576k59584p33184L65056J272320j171968P01440M47488j664512
$$ plain form
1880 7927808 10062336 8263680 8477696 7945728 7988224 9025024 8441344 9182208 8182272
1871 8182272 9673728 8239104 8444928 8899072 8553472 7480832 8297472 9692672 9088512
1862 9088512 8745984 10011136 9864704 8900608 10265088 9573376 9693184 9465856 8438784
1853 8438784 8696320 9110528 9578496 8561152 9365504 9108480 8511488 10480640 8895488
1844 8895488 9057792 10069504 9433600 10224640 11840000 15124480 15781888 16705536 18816512
1835 18816512 19652608 13219840 11353088 9992192 9247744 8925184 7985152 8422912 7427072
1826 7427072 8037376 7853056 8091648 8134144 7694848 6785024 6983168 7405568 6479872 7503872
1816 7503872 6321152 6703104 7173632 7237120 7789568 6460928 7051776 6175232 6355456
$$ packed form
1880G927808K134528j798656K14016n31968M2496J036800n83680P40864r99936
1871H182272J491456j434624K05824M54144l45600j072640Q16640J395200o04160
1862I088512l42528J265152j46432r64096J364480o91712J19808k27328j027072
1853H438784K57536M14208M67968j017344Q04352k57024n96992J969152j585152
1844H895488J62304J011712o35904P91040J615360L284480O57408R23648K110976
1835A8816512Q36096o432768j866752j360896p44448l22560r40032M37760r95840
1826G427072O10304j84320K38592M2496m39296r09824J98144M22400r25696J024000
1816G503872j182720L81952M70528O3488N52448j328640N90848q76544J80224
$$ plain form
1807 6355456 5639680 5419520 6450176 6543360 5889024 5371392 6996480 6650880 5725184
1798 5725184 7062528 7177728 6441984 6083072 7563776 6743552 6903296 6157824 6764032
1789 6764032 6453248 6283776 6292992 5665280 6766080 5547520 6881792 7574528 6386176
1780 6386176 6752768 8216576 6902784 6354432 6837760 6747648 7130112 6485504 7534592
1771 7534592 7397888 6674944 7824384 7244800 7552512 7050752 8506368 8019456 7476736
1762 7476736 8356352 8552448 8774656 8720384 9106432 8985088 9137664 9130496 10228224 9398784
1752 9398784 9408512 8395264 9141760 9433600 8479232 9293312 7687168 8519168 7558656 7215104
1742 7215104 8023552 7079936 6483456 7282688 6364672 7691776 7104000 6510080 7424512
$$ packed form
1807F355456p15776k20160J030656R3184o54336n17632J625088l45600r25696
1798E725184J337344J15200p35744l58912J480704q20224J59744p45472O06208
1789F764032l10784j69472R216o27712J100800j218560J334272O92736j188352
1780F386176L66592J463808j313792n48352M83328r0112L82464o44608J049088
1771G534592j36704p22944J149440n79584L07712n01760J455616m86912n42720
1762G476736Q79616J96096K22208n4272L86048j21344J52576p168J097728q29440
1752I398784R728j013248P46496K91840r54368Q14080j606144Q32000r60512l43552
1742G215104Q08448r43616n96480P99232r18016J327104n87776n93920R14432
$$ plain form
1733 7424512 7083520 7345664 5915136 5747200 6451712 6226432 6769664 6731264 6814720 6640128
1723 6640128 6963712 6512128 6385664 7109120 7738880 6675968 6528512 7442432 8240128
1714 8240128 7226880 7307776 7503360 7647232 7552512 8096768 8653312 8268288 8369152 7926784
1704 7926784 8936448 8804352 7984128 8874496 8992768 9134592 8501760 8214528 9122304
1695 9122304 9984000 9217024 9191424 9974272 9565696 9506304 10750976 9732608 10028032 9658368
1685 9658368 9727488 11382272 11148800 11937280 10886656 12003328 12369920 11810304 11942912
1676 11942912 10809344 11755008 11146240 12434432 11038720 12149248 12388864 11616768 11640832
1667 11640832 11516928 12498432 11408384 11667968 11612672 11563008 10772992 11307008 11883008 11787264
$$ packed form
1733G424512l40992K62144j430528j67936P04512k25280N43232l8400Q3456j74592
1723F640128L23584m51584j26464P23456O29760j062912j47456R13920P97696
1714H240128j013248Q0896J95584J43872r4720N44256N56544l85024J00864m42368
1704G926784J009664j32096q20224Q90368J18272J41824o32832k87232R07776
1695I122304Q61696p66976k5600P82848m08576n9392J244672j018368K95424l69664
1685I658368O9120J654784k33472P88480j050624J116672L66592n59616J32608
1676A1942912j133568R45664o08768J288192j395712J110528K39616p72096K4064
1667A1640832j23904R81504j090048K59584n5296m9664p90016N34016N76000r5744
$$ plain form
1657 11787264 11816960 11529216 12089856 10711552 11122688 11770880 12031488 11526144 11236864
1648 11236864 11893760 11477504 11533312 12404736 11007488 10903552 11783168 11110912 10444288
1639 10444288 11691008 11165184 11569152 10615808 11036672 9910272 10721792 9647616 9878528
1630 9878528 10252288 10670080 9593856 9027072 10746368 8620032 8695296 9595392 9457664
1621 9457664 8647168 8261120 9041408 9007616 7868416 8977408 8917504 8389120 7168512
1612 7168512 8805376 8829952 7466496 6916608 7978496 8376320 6922752 6682112 6692864
1603 6692864 8230400 6449152 7047680 7052288 7031296 6870528 7841280 6945792 6089728 6466560
1593 6466560 7074816 7818240 6920192 7462912 6602240 7266304 5504000 6789120 7859712
$$ packed form
1657A1787264K9696k87744N60640j378304M11136O48192K60608n05344k89280
1648A1236864O56896m16256N5808Q71424j397248j03936Q79616o72256o66624
1639A0444288J246720n25824M03968r53344M20864j126400Q11520j074176K30912
1630I878528L73760M17792j076224n66784J719296k126336P5264R00096j37728
1621I457664q10496l86048P80288l3792j139200J108992n9904n28384j220608
1612G168512J636864K4576j363456n49888J061888L97824j453568k40640J0752
1603F692864J537536j781248N98528M608k0992j60768R70752q95488q56064L76832
1593F466560O08256P43424q98048N42720q60672O64064j762304J285120J070592
$$ plain form
1584 7859712 6813696 6396928 7498240 7910912 6590464 7788032 6471168 7489536 7127552
1575 7127552 8020480 7384064 7284224 6896640 7641600 8382976 7908352 7966720 8440832 8290816
1565 8290816 8520704 8787968 9336320 9050624 8875520 9030656 8373760 9451520 8749568
1556 8749568 10053632 9888256 10115072 9098752 10693120 10949120 10671104 10357760 11249152
1547 11249152 10812928 11192832 12649472 11782144 11762176 12784128 12302848 12277248 13039104
1538 13039104 13762560 13494784 14125568 15161344 14291456 17318912 15095808 17267200 18094592
1529 18094592 21266432 19574272 20800512 22236672 23754240 25374208 25278464 27707904
1521 27707904 28709888 29897728 30437888 30907904 32457216 32677888 32785920 34097152 35758080
$$ packed form
1584G859712j046016m16768J101312M12672j320448J197568j316864J018368l61984
1575G127552Q92928o36416r9840l87584P44960P41376m74624N8368M74112j50016
1565H290816K29888K67264N48352k85696j75104J55136o56896J077760p01952
1556H749568J304064j65376K26816j016320J594368K56000k78016l13344Q91392
1547A1249152m36224L79904J456640q67328j9968J021952m81280k5600P61856
1538A3039104P23456k67776O30784J035776q69888L027456k223104K171392Q27392
1529A8094592L171840j692160J226240J436160J517568J619968r5744K429440
1521B7707904J001984J187840N40160M70016J549312K20672J08032J311232J660928
$$ plain form
1512 35758080 35274240 36060672 37540352 38589440 39418880 42361856 44802048 46262784 48878080
1503 48878080 52175360 55974400 57796096 63703552 68607488 75052032 82214912 90144768
1495 90144768 99658240 103756288 108966400 108300288 105292800 97444864 88101888 78449664
1487 78449664 67987456 59125760 50502144 42740736 36569088 33012736 29084672 26011136
1479 26011136 25492992 22521344 22684672 20566528 19300352 19445248 18914816 18551296 17851904
1470 17851904 16285696 15788032 15260672 15308800 14896640 15417344 13902848 12874752 13344768
1461 13344768 12640768 12523008 12878336 11913216 12298752 11806720 11657728 12441600 11297792
1452 11297792 10582528 10936832 10754048 9555968 10954240 10387968 10274816 9404928 9432576
$$ packed form
1512C5758080m83840P86432J479680J049088Q29440K942976K440192J460736K615296
1503D8878080L297280L799040J821696N907456M903936O444544P162880P929856
1495I0144768R513472M098048N210112o66112l007488p847936r342976r652224
1487G8449664j0462208q861696q623616p761408o171648l556352l928064l073536
1479B6011136n18144k971648J63328k118144j266176J44896n30432l63520o99392
1470A7851904j566208m97664n27360M8128m12160N20704j514496j028096M70016
1461A3344768p04000j17760L55328r65120L85536m92032j48992P83872j143808
1452A1297792p15264L54304j82784j198080J398272n66272j13152q69888K7648
$$ plain form
1443 9432576 9713664 8980992 9373184 8785920 9773568 9019904 8236544 9643520 8204288
1434 8204288 9229824 8799232 8586240 9055232 9060864 8404992 8604160 8434688 7654912 8620544
1424 8620544 7248896 8222208 6916096 7224832 7259136 7996416 7506944 7887360 7318016
1415 7318016 6814208 7959040 6734848 6596608 7422976 6718976 5797888 7245312 6499328
1406 6499328 7117824 6227968 6693376 7005696 6804992 5585408 6560768 6488576 5999104 6511104
1396 6511104 6046720 7426560 6053888 7304704 4981760 5627904 6786560 6530048 6512640
1387 6512640 6347264 5985792 5793792 6887936 6267392 6628864 5914112 6514176 5729792
1378 5729792 5237248 6415872 6459904 7628800 6503424 8355840 7208448 7688192 6617088
$$ packed form
1443I432576K81088p32672L92192n87264R87648p53664p83360J406976j439232
1434H204288J025536m30592k12992M68992N632o55872J99168j69472p79776R65632
1424H620544j371648R73312j306112L08736L4304P37280m89472L80416n69344
1415G318016n03808J144832j224192j38240Q26368p04000r21088J447424p45984
1406F499328O18496q89856M65408L12320k00704j219584R75360p2192m89472N12000
1396F511104m64384J379840j372672J250816k322944O46144J158656k56512j7408
1387F512640j65376l61472j92000J094144o20544L61472p14752O00064p84384
1378E729792m92544J178624M4032J168896j125376J852416j147392M79744j071104
$$ plain form
1369 6617088 8049664 7254016 7600128 6502400 6838272 6779392 8202752 5949952 6370304
1360 6370304 7658496 7228416 7592960 7199232 7849472 7799296 7078400 8417792 8649216
1351 8649216 6652416 7247872 8139776 7797248 9063936 8963072 9310208 9548800 10673664
1342 10673664 9961984 10710528 10270208 11825664 10724352 11239936 10016256 10639360 9725952
1333 9725952 9732096 9605632 8822784 10063872 9795584 9576448 9265664 8875520 8760832 9228800
1323 9228800 10045952 9464320 10639872 10113024 10153984 9223680 9875968 9815040 9338368 9807360
1313 9807360 8958976 9166848 10384896 9009152 10454016 10763264 12383744 12973568 13629440
1304 13629440 13924864 15654912 15080448 14203904 15750656 15277568 15010304 13785088 12548608
$$ packed form
1369F617088J432576p95648L46112j097728L35872n8880J423360k252800M20352
1360F370304J288192m30080L64544l93728O50240n0176p20896J339392K31424
1351H649216j996800N95456Q91904l42528J266688j00864L47136K38592J124864
1342A0673664p11680P48544m40320J555456j101312N15584j223680O23104r13408
1333I725952O144j26464p82848J241088k68288k19136l10784l90144j14688M67968
1323I228800Q17152n81632J175552n26848M0960r30304O52288o0928m76672M68992
1313I807360q48384K07872J218048j375744J444864L09248J620480N89824O55872
1304A3629440K95424J730048n74464q76544J546752m73088k67264j225216j236480
$$ plain form
1295 12548608 12431360 11512320 10451968 10456064 10185728 9677824 9567744 10080256 9257472 8523264
1285 8523264 9666560 8769536 9870336 10386432 10719232 10121216 10542592 10303488 10157056
1276 10157056 11266048 10983424 11502080 11495936 11932672 12073984 11065856 11036672 11058176 11469312
1266 11469312 11103744 12341248 10004480 10363392 10436096 10153984 10348544 9901056 11171840
1257 11171840 9867264 9682944 8871424 9539584 9771520 9263104 9389568 9916928 10547200
1248 10547200 9528832 10216448 10713600 10435584 9605120 10325504 10226176 10379264 9713152
1239 9713152 8829952 10065408 9502208 9894400 9110528 9344000 8930816 7671808 6724608
1230 6724608 7677952 6289920 6607360 6491648 5620224 6440448 5286400 5490176 5530624
$$ packed form
1295A2548608j17248r19040j060352M096k70336n07904j10080N12512q22784p34208
1285H523264J143296q97024J100800N16096L32800n98016M21376k39104j46432
1276A0157056J108992k82624N18656o144M36736J41312j008128k9184K1504M11136
1266A1469312l65568J237504k336768L58912P2704k82112J94560m47488J270784
1257A1171840j304576j84320q11520O68160K31936n08416J26464N27360O30272
1248A0547200j018368O87616M97152k78016q30464P20384r9328J53088o66112
1239I713152q83200J235456n63200L92192p83872K33472m13184j259008r47200
1230F724608R53344j388032L17440j15712q71424Q20224j154048K03776M0448
$$ plain form
1221 5530624 4116480 4463616 4871168 4438528 4431872 4250112 4621312 4384768 4967936 3161600
1211 3161600 4431360 4287488 2960384 3749376 2945024 4064768 3863040 3180544 3464704
1202 3464704 3823104 3060736 3287040 2770432 3423232 3641856 3054592 3166208 2435584 3668480
1192 3668480 3522048 2316288 2736640 2628096 2337280 2852352 3265024 2066944 3441152
1183 3441152 3205120 3463168 2474496 2737664 2528768 2841088 3100672 2620928 3473408 2639872
1173 2639872 2378752 2375168 2944512 2544128 3301376 3230208 2757120 1918976 2987008 1931776
1163 1931776 2622976 2109440 2686464 2319872 1821184 1886720 1557504 2493952 1775616 2190336
1153 2190336 1674752 1364480 1862656 2132480 3289088 2514432 2708480 2228736 1641472
$$ packed form
1221E530624j414144L47136M07552m32640o656j81760L71200k36544N83168j806336
1211C161600J269760j43872j327104P88992q04352J119744k01728o82496K84160
1202C464704L58400p62368K26304n16608O52800K18624n87264J11616p30624J232896
1192C668480j46432j205760M20352j08544k90816N15072M12672j198080J374208
1183C441152k36032K58048r88672K63168k08896L12320K59584m79744Q52480q33536
1173B639872k61120l584N69344m00384P57248p1168m73088q38144J068032j055232
1163A931776O91200n13536N77024l66592m98688O5536l29216R36448p18336M14720
1153B190336n15584l10272M98176K69824J156608p74656J94048m79744n87264
$$ plain form
1144 1641472 2121728 1821184 2632192 3026944 2667520 2098176 1710080 2164224 3246592
1135 3246592 2491904 2294784 2145280 3261952 2187776 3558912 2658304 2912256 2646016
1126 2646016 3210752 2695680 3384320 2670592 3214848 3145728 3805696 3116032 3105280 3472384
1116 3472384 3733504 3507200 4681728 4883968 4162048 2438144 1907200 2860544 2653696
1107 2653696 3059200 2124800 2609664 1932288 1963008 1851392 2580992 2074112 2589184 1973248
1097 1973248 2751488 3239424 2455040 3138560 3305472 1885184 1947136 3145216 2050048
1088 2050048 2441216 2260992 2532864 1702912 2631680 2518016 2439680 2152448 2643968 1975808
1078 1975808 1747968 2264576 2877440 2240512 1258496 2322432 1991680 2408448 2915328
$$ packed form
1144A641472M80256l00544Q11008L94752l59424n69344l88096M54144J082368
1135C246592p54688j97120j49504J116672j074176J371136r00608K53952k66240
1126B646016N64736n15072O88640p13728N44256o9120O59968o89664j0752L67104
1116C472384K61120k26304J174528K02240p21920j723904n30944R53344k06848
1107B653696M05504r34400M84864o77376L0720j11616P29600n06880N15072o15936
1097A973248P78240M87936p84384O83520J66912j420288O1952J198080j095168
1088B050048L91168j80224K71872q29952R28768j13664p8336k87232M91520o68160
1078A975808k27840N16608O12864o36928r82016J063936l30752M16768N06880
$$ plain form
1069 2915328 2035200 2542080 2736640 2468864 1753600 2765312 1972224 1619968 2104320
1060 2104320 2345984 2042368 2519552 1524736 1879040 2683904 2842624 1754112 2025472
1051 2025472 2380800 1977344 2402816 1545216 3321856 2649600 2437632 1444352 1514496 2172416
1041 2172416 1905664 2228224 1836032 2554368 2988544 1888256 2787328 2372608 2250240
1032 2250240 2446336 2399232 2178560 1607168 2161664 1531392 3101696 1663488 2403840
1023 2403840 1692672 2102272 2225664 779264 1801728 1387520 2105344 1585664 1131008
1014 1131008 1777664 2177024 2151936 2467328 1396224 2630656 2522624 2421760 1261568
1005 1261568 2170368 2224640 2216960 2063360 1773056 1675264 1526784 2791424 943616 1956352
$$ packed form
1069B915328q80128N06880J94560k67776p15264J011712p93088l52256M84352
1060B104320K41664l03616M77184r94816L54304Q04864J58720j088512K71360
1051B025472L55328m03456M25472q57600J776640o72256k11968r93280P0144O57920
1041B172416k66752L22560l92192P18336M34176j100288Q99072m14720j22368
1032B250240J96096m7104k20672n71392N54496o30272J570304j438208P40352
1023B403840p11168M09600J23392G79264J022464m14208P17824n19680m54656
1014A131008O46656L99360k5088L15392j071104J234432j08032j00864j160192
1005A261568R08800N4272p680j53600k90304r7792j48480J264640I43616J012736
$$ plain form
995 1956352 2340352 2577408 1971200 2161664 2214912 811008 1230848 2956800 977408 2021376
985 2021376 1550848 2679808 2142208 2977280 1771520 3247104 1895424 3003904 1961472
976 1961472 2322944 3052544 1652224 2248192 1904640 261632 1482752 1880064 2046976
967 2046976 1231360 846848 816128 816128 965632 2073600 2168320 590336 2468352 1063424
956 1788928 1193472 1193472 2460160 955392 1676288 754688 1173504 1731584 856064 558592
946 558592 1061888 1768448 717312 1433600 1637888 466432 1552384 814592 1089536 1296384
936 1296384 1688576 1726976 776192 1097216 543232 797184 1724416 1099264 1222144 1120768
926 1120768 2063872 966656 1303040 1025536 1036288 2216960 1681408 883712 645120 1537536
$$ packed form
995A956352L84000K37056o06208J90464N3248H11008M19840J725952I77408J043968
985B021376m70528J128960n37600Q35072j205760J475584j351680J108480j042432
976A961472L61472P29600j400320N95968l43552B61632J221120L97312J66912
967B046976q15616l84512l0720%J49504J107968R4720E90336J878016A063424
956A788928n95456%J266688I55392P20896G54688M18816N58080H56064k97472
946E58592N03296P06560G17312P16288K04288D66432J085952p37792K74944K06848
936A296384L92192L8400G76192L21024E43232K53952R27232o25152J22880j01376
926A120768R43104I66656L36384k77504J0752J180672n35552p97696k38592Q92416
$$ plain form
916 1537536 1549312 683008 927232 519168 1092096 104448 1890304 546816 601088 842752
906 842752 477184 758784 1062400 988160 1819136 792576 584192 420352 830976 1205760
896 1205760 968704 705536 892416 1847296 1892352 1285632 1524224 196608 1652736 2153984
886 2153984 1379328 916480 1986048 1393152 2327552 1523200 1688576 1697280 3880448 4082176
876 4082176 4932096 5567488 5913088 5756928 5526528 5319168 6582272 7270400 7048192 7867392
866 7867392 9776640 10451968 11893760 15274496 19524608 32260608 60483072 71327744
858 71327744 76432896 103208960 110980608 62497792 32933888 22755840 15590912 12218368
850 12218368 10199040 8708096 6766080 5061120 6285824 5495296 4695040 5732352 6188032
$$ packed form
916A537536J1776F83008K44224m08064N72928A04448J785856E46816N4272K41664
906H42752l65568K81600L03616p4240Q30976G92576k08384j63840M10624L74784
896A205760k37056k63168J86880R54880M5056o06720K38592A96608J456128N01248
886B153984p74656m62848J069568n92896R34400q04352J65376Q704K183168K01728
876D082176Q49920O35392L45600j56160k30400k07360J263104O88128k22208Q19200
866G867392J909248O75328J441792L380736M250112J2736000K8222464J0844672
858G1327744N105152K6776064P771648m8482816k9563904j0178048p164928l372544
850A2218368k019328j490944j942016j704960J224704p90528q00256J037312M55680
$$ plain form
841 6188032 5370880 5348352 6151168 6004224 5491200 4610048 3845120 3486208 4124672 3389952
831 3389952 3883008 3043840 2910720 3000320 2180096 3718656 4156416 3567104 3228672 3200000
821 3200000 3294208 2854400 1583104 2714112 3516416 2437120 1965056 2658304 2715648 3310080
811 3310080 2123776 2414592 3435520 1976320 1874432 1883136 1934848 2670592 2467328 2199040
801 2199040 1264128 1232896 2213888 2443776 1574400 2208256 1899520 2330112 1858560 2128384
791 2128384 2075136 1025024 1783296 1779200 1789952 1140224 1900544 972288 2128384 1918976
781 1918976 1199616 1589248 1172992 2118144 660992 2223104 1400320 1256448 1778688 909824
771 909824 978432 466944 2530816 2511360 1415168 1663488 1056256 350208 1614848 1767936
$$ packed form
841F188032q17152k2528Q02816j46944n13024q81152p64928l58912O38464p34720
831C389952M93056q39168j33120Q9600q20224J538560M37760n89312l38432k8672
821C200000R4208m39808j271296J131008Q02304j079296m72064O93248N7344N94432
811C310080j186304K90816J020928j459200j01888Q704N1712P35744k03264k68288
801B199040r34912l1232R80992K29888q69376O33856l08736M30592m71552K69824
791B128384n3248A025024P58272m096J0752o49728P60320r28256J156096k09408
781A918976p19360L89632m16256R45152F60992J562112q22784j43872N22240q68864
771I09824O8608D66944K063872j9456j096192K48320o07232C50208J264640J53088
$$ plain form
761 1767936 1626112 1205760 1755136 1002496 2350592 1410048 1800192 1748480 2499072 1410560
751 1410560 896000 1035264 906752 2710016 1843712 1804288 1672704 1362432 973824 740864
741 740864 1783808 677376 2135040 1438208 1541632 1715200 1453568 1146880 1544704 1777664
731 1777664 1905152 1317888 689152 1156608 329216 1723904 1054720 1875968 1375744 1229312
721 1229312 854528 2027520 1252352 1276416 1462272 1677312 1093120 2365440 1022464
711 1609728 2354176 922112 87040 780800 678912 345088 2093056 1120256 1655296 465920
700 455168 2469888 1544704 1652224 448000 870400 1690624 744448 387584 1527296 1048064
690 1048064 467456 246784 2203136 160256 -61440 1114112 812032 1640448 1077760 1875968
$$ packed form
761A767936j41824m20352N49376p52640J348096r40544L90144n1712P50592j088512
751A410560n14560J39264j28512J803264q66304l9424j31584l10272l88608k32960
741G40864J042944F77376J457664o96832J03424J73568k61632l06688L97824K32960
731A777664J27488n87264o28736M67456C29216J394688o69184Q21248n00224j46432
721A229312l74784J172992p75168K4064J85856K15040n84192J272320A022464
711A609728P44448I22112H7040O93760j01888l33824J747968r72800N35040D65920
700D55168K014720r25184J07520D48000M22400Q20224G44448l56864J139712m79232
690A048064D67456k20672J956352A60256f1440A114112l02080Q28416n62688P98208
$$ plain form
680 1875968 1178624 863232 226304 911360 673792 1110528 451072 313344 2212352 1251328
670 1251328 1324032 1218048 1527296 822784 1069568 266752 1531392 -1536 446976 1049088
660 1049088 1560576 1492992 1122816 1515520 1351168 458752 384512 1697280 327168 397312
650 397312 726016 845312 1226240 1242624 568320 1535488 829440 1656320 1829376 1618432
640 1618432 1629184 2274816 292352 1508864 1192960 830464 1319424 357888 1347584 110080
629 1359360 1281024 1354240 732672 1823744 2089472 1119744 1781760 2012160 1280512 1909248
619 1909248 2003456 1702400 2626560 2080768 2122752 2384896 2176000 1832448 2142208 1992704
609 1992704 3158016 2386432 3064832 3713024 3955712 4473856 3424256 4269568 4793344
$$ packed form
680A875968o97344l15392B26304O85056k37568M36736D51072j37728J899008r61024
670A251328P2704j05984L09248p04512K46784B66752J264640a536D46976O02112
660A049088N11488o7584l70176L92704j64352D58752p4240J312768C27168P0144
650C97312L28704J19296L80928J6384E68320R67168p06048Q26880J73056k10944
640A618432J0752O45632B92352J216512l15904l62496M88960C57888R89696A10080
629A359360p8336P3216o21568J091072K65728r69728O62016K30400p31648O28736
619A909248R4208l01056R24160n45792M1984K62144k08896l43552L09760j49504
609A992704J165312p71584O78400O48192K42688N18144j049600Q45312N23776
$$ plain form
600 4793344 4709376 4983808 4515328 3492352 2947584 2280960 2029056 1472512 1174016 1098240
590 1098240 1013248 1298944 400896 684032 1707008 547840 17408 1088000 506368 1362944
580 1362944 177152 448000 117248 1777664 965632 1196032 441344 1227264 2046976 613376
569 701440 515584 797696 38912 537088 917504 -48640 858112 1009664 1507328 -220672
558 829952 770560 1436672 1031680 1762816 874496 1279488 790528 886784 1224192 1079808
548 1079808 549376 392704 613888 641024 -324096 554496 394752 1006080 649216 268800
537 1167872 1416192 975360 501760 1172480 1730560 979968 2421760 1091072 817152
528 817152 472576 303104 620032 1066496 888320 582656 1016320 544768 836096 994816
$$ packed form
600D793344q3968K74432m68480j022976n44768o66624k51904n56544k98496p5776
590A098240q4992K85696D00896K83136J022976E47840A7408J070592E06368Q56576
580A362944A77152K70848A17248J660416q12032K30400D41344P85920Q19712F13376
569G01440j85856K82112C8912M98176L80416d8640H58112J51552M97664b20672
558H29952n9392O66112m04992P31136H74496M04992m88960R6256L37408j44384
548A079808n30432j56672K21184K7136c24096E54496j59744O11328l56864B68800
537A167872K48320m40832m73600O70720N58080p50592J441792A091072k73920
528H17152l44576j69472L16928M46464j78176l05664M33664m71552K91328J58720
$$ plain form
518 994816 1165312 -151040 371200 -33280 244224 904192 1061888 714752 519168 878080
508 878080 1974272 304128 361472 86528 530432 205312 355840 684032 412672 769536
498 769536 391168 66560 624640 199680 377856 46080 701952 -259072 717824 1022464
488 1022464 745472 887296 1091584 1003520 94720 -599552 262656 1085952 274432 -111616
477 395264 646656 1132032 699392 -409600 666112 515072 217088 573440 -76800 482816
466 316928 1285632 372224 922112 -335872 -386048 -167424 1109504 -253440 1210880 -558592
455 -283136 571392 100864 -704000 766976 961536 600576 194560 222208 439296 649216
445 649216 314368 614912 1135104 420864 638464 764416 548352 1316864 -779264 -93184
$$ packed form
518I94816J70496a51040C71200c3280B44224O59968J57696l47136j95584L58912
508H78080J096192C04128N7344H6528M43904B05312J50528L28192k71360L56864
498G69536l78368F6560N58080A99680J78176D6080O55872b59072G17824L04640
488A022464k76992J41824K04288q8064I4720e99552B62656Q23296B74432a11616
477C95264K51392M85376m32640d09600F66112j51040B17088L56352g6800D82816
466C16928R68704C72224N49888c35872n0176a67424A109504b53440A210880e58592
455b83136E71392A00864g04000G66976J94560l60960A94560K7648K17088K09920
445F49216C14368L00544N20192D20864K17600J25952k16064P68512g79264i3184
$$ plain form
434 -412160 -313344 246784 1236480 1501696 819712 975360 783872 1105920 191488 1115648
424 1115648 1008128 1217536 35328 -1097216 -366592 822272 -92160 1352704 -283136 -300544
414 -300544 929280 261632 359936 1239552 265728 71680 1197568 301056 928256 -740352
403 370176 1206784 755200 -359424 988672 712704 532992 263168 74752 481792 1389056
393 1389056 126976 1046528 1167360 82432 357376 151040 -37376 640000 664064 -284160
382 964608 -61440 67072 -536576 -90112 1651200 547840 224768 -140288 -473600 -524288
372 -524288 8192 594432 96256 614912 -503808 500224 1350656 366080 969216 62464 1125888
361 1125888 526336 44544 1224704 548352 1476096 87552 609792 557056 251392 306176
$$ packed form
434d12160R8816B46784R89696K65216o81984J55648j91488L22048A91488R24160
424A115648j07520K09408C5328a097216c66592H22272i2160A352704b83136j7408
414c00544I29280B61632R8304Q79616B65728G1680J125888C01056O27200g40352
403C70176Q36608m51584c59424I88672k75968j79712B63168G4752M07040R07264
393A389056A26976R19552J20832H2432K74944A51040c7376F40000K4064b84160
382I64608f1440F7072e36576i0112A651200E47840B24768a40288l33312n0688
372e24288H192N86240I6256N18656e03808E00224Q50432C66080O03136F2464J063424
361A125888E26336D4544J180160E48352R27744H7552N22240n2736B51392N4784
$$ plain form
351 306176 88064 604672 15872 214528 1848320 1209856 913920 2141184 1286144 1793536
341 1793536 1400832 1699328 678400 413696 107520 880128 712192 581120 521728 145408
330 -817152 12288 588800 -855040 208384 -641536 55808 747520 471552 41984 75776 -132608
318 653312 492032 -9216 515072 510976 422912 633344 589824 459264 402944 -551936 -348672
307 -348672 1144832 890368 1030144 -467968 264192 -325120 267776 650752 23552 504832
297 504832 -433152 -258048 457728 508928 519168 -206848 550912 3584 175616 901120 1025536
286 1025536 -636928 77824 -130560 795136 163840 586752 296960 -572928 825856 224768
275 -111616 13824 98816 1805312 -49152 621568 627712 -515584 456192 -967680 572416 356352
$$ packed form
351C06176H8064N16608A5872J98656J633792o38464k95936J227264q55040N07392
341A793536l92704K98496F78400k64704A07520P72608j67936j31072n9392A45408
330h17152A2288N76512h55040B08384f41536E5808O91712k75968D1984L3792a32608
318F53312j61280i216E15072m096q8064K10432m3520j30560n6320e51936K03264
307c48672A144832k54464J39776d67968B64192c25120B67776L82976B3552M81280
297E04832d33152J75104D57728N1200J0240b06848E50912C584J72032P25504J24416
286A025536f36928G7824a30560G95136A63840M22912k89792e72928H25856B24768
275a11616A3824Q4992J706496d9152F21568O144e15584D56192i67680E72416k16064
$$ plain form
264 356352 564736 -429568 333312 -60928 1118720 -537088 -378880 488448 35328 -814592
253 -215040 -602624 -470016 646144 503296 651776 -198144 484352 331776 -175616 241664
242 568320 -267776 -434688 308224 798208 -196608 332288 -683008 -50688 315392 794624
232 794624 771072 142336 -1156096 -244736 139264 -284672 17408 100864 573440 448000
222 448000 -844288 -345600 585216 -60928 1313792 622080 -260096 -166912 19456 -662528
211 -508416 -147456 1010688 1208832 505344 -137728 -356864 508928 -877056 -212992 537600
200 356864 669696 1344000 688640 -400896 -335872 243200 94720 370176 602624 707584
190 707584 175104 -219648 344064 395776 1117184 -399872 -626688 65536 128000 -326656
$$ packed form
264C56352K08384d29568C33312f0928A118720e37088J58208D88448C5328h14592
253b15040l87584J32608F46144j42848J48480a98144D84352j52576a75616B41664
242E68320b67776j66912C08224M89984a96608C32288f83008e0688C15392M79232
232G94624k3552A42336a156096b44736A39264b84672A7408Q3456M72576j25440
222D48000h44288c45600E85216f0928A313792F22080b60096R3184A9456f62528
211e08416a47456A010688J98144E05344a37728k19136E08928h77056b12992E37600
200C56864L12832O74304o55360d00896O5024B43200I4720K75456K32448J04960
190G07584A75104b19648C44064N1712P21408c99872k26816F5536O2464c26656
$$ plain form
179 246272 -6656 179712 1312256 484352 117760 -699904 -104448 104960 386560 640512
169 640512 120832 1010176 -423936 -634368 -160256 208384 83456 -4096 26624 -318976 -172544
158 -172544 91648 688128 982528 115712 302080 130048 741888 -1004544 -1269760 766976
147 -307712 445440 101376 372224 188928 -899584 397312 623616 -601600 -484352 -399872
137 -399872 379392 308224 84992 272896 673792 1057280 -124928 46080 576000 612864 -257536
125 -572416 748544 1286144 66048 -593408 1282048 1398272 373248 685568 558592 291328
115 291328 763904 701440 130048 369152 -451072 -751616 -937472 860160 -972288 743424
104 -66048 128512 117248 566272 807936 1385472 61952 551424 471552 -280064 801280 394752
$$ packed form
179B46272f656A79712J132544D84352A17760f99904a04448A04960K81600K53952
169F40512A20832Q89344d23936k10432a60256B08384H3456d096B6624c18976J46432
158a72544I1648N96480K94400A15712J86368A30048O11840a004544k65216G66976
147c07712D45440A01376K70848j83296h99584C97312K26304f01600J17248Q4480
137c99872C79392p1168H4992J87904M00896L83488a24928D6080N29920L6864b57536
125e72416G48544N37600F6048e93408A282048J16224C73248L12320j26976k67264
115B91328M72576o2464A30048K39104d51072l00544j85856H60160i72288G43424
104f6048A28512j1264M49024K41664N77536F1952M89472p9872b80064H01280C94752
$$ plain form
92 47616 -534016 657408 807936 -306688 -469504 845312 723456 113152 893440 -84480
81 177152 434176 290816 -310272 953344 -202240 403968 106496 515584 939520 52224
70 1112064 485376 505344 542208 81408 1093632 -255488 -64512 -353280 -217600 61952 -386560
58 -509440 209408 108032 -187392 515072 17408 -640000 -502784 -142848 611328 436224
48 436224 -34816 516608 527872 863232 363008 1081344 509952 886784 893440 41984 458240
37 458240 92160 740864 -25600 -195584 797696 -411136 -269312 439296 85504 -694272 -279552
25 -44032 346112 -71680 1204736 348160 -138240 1058304 579584 342528 784896 237568
14 -438272 -939520 738816 -122368 -236544 -522752 478720 742400 -230912 -18944 -221696
$$ packed form
92D7616e34016F57408J50528c06688j62816H45312j21856A13152P80288h4480
81A77152K57024j43360c10272I53344b02240D03968A06496M09088M23936E2224
70A112064D85376J9968L6864H1408J012224b55488f4512k88768J35680F1952c86560
58e09440B09408j01376a87392E15072A7408f40000J37216a42848F11328j75104
48D36224c4816E16608J1264L35360C63008P18336E09952L76832O656D1984M16256
37D58240I2160O48704b5600j69984G97696d11136J41824D39296H5504f94272b79552
25d4032C46112g1680A204736C48160a38240A058304m78720k37056M42368B37568
14d38272n01248G38816a22368j14176k86208D78720K63680b30912a8944k02752
$$ plain form
4 -221696 415744 -377344 110080 378880
0 378880
$$ packed form
4b21696D15744c77344A10080K68800
0C78880
##END=
