##TITLE=1246
##JCAMPDX= 6.0         $$ Bruker NMR JCAMP-DX V2.0
##DATA TYPE= NMR SPECTRUM
##DATA CLASS= XYDATA
##ORIGIN= NUTS EXPORT
##OWNER= Administrator
$$ 1.72 TOPSPIN		Version 2.1
$$ 2016-02-23 12:18:22.527 -0800  Administrator@X
$$ Compression mode = diff/dup
##.OBSERVE FREQUENCY= 90.275459
##.ACQUISITION MODE= SIMULTANEOUS (DQD)
##.ACQUISITION SCHEME= undefined
##.AVERAGES= 16
##.DIGITISER RES= 22
##SPECTROMETER/DATA SYSTEM= 
##.PULSE SEQUENCE= zg30
##.SOLVENT NAME= None
##.SHIFT REFERENCE= INTERNAL, None, 1, 14.92079
##AUDIT TRAIL= $$ (NUMBER, WHEN, WHO, WHERE, PROCESS, VERSION, WHAT)
$$ ##TITLE= Audit trail, TOPSPIN		Version 2.1
$$ ##JCAMPDX= 5.01
$$ ##ORIGIN= Bruker BioSpin GmbH
$$ ##OWNER= Administrator
$$ $$ E:/data/jwist/nmr/1246/1/pdata/1/auditp.txt
$$ ##AUDIT TRAIL=  $$ (NUMBER, WHEN, WHO, WHERE, PROCESS, VERSION, WHAT)
(   1,<2016-02-23 08:30:42.715 -0800>,<Administrator>,<X>,<jcamp>,<TOPSPIN 2.1>,
      <fromjdx created from
       E:\data\jwist\nmr\uniandes\1246
       data hash MD5: 8K
       7D 59 D8 63 B8 17 4F B2 5D 40 18 B5 7A C1 F9 8B>)
$$ ##END=
$$ 
$$ $$ hash MD5
$$ $$ 45 6C 95 92 B1 BE 52 6F 41 17 B6 8E 92 B9 2F C6
##$RELAX= 
$$ Bruker specific parameters
$$ --------------------------
##$DU= <E:>
##$EXPNO= 1
##$NAME= <1246>
##$PROCNO= 1
##$TYPE= <nmr>
##$USER= <jwist>
##$ACQT0= 0
##$AMP= (0..31)
100 100 100 100 100 100 100 100 100 100 100 100 100 100 100 100 100 100
100 100 100 100 100 100 100 100 100 100 100 100 100 100
##$ANAVPT= 1
##$AQSEQ= 0
##$AQ_mod= 3
##$AUNM= <au_zg>
##$AUTOPOS= <>
##$BF1= 90.275459
##$BF2= 400.02
##$BF3= 400.02
##$BF4= 400.02
##$BF5= 400.02
##$BF6= 400.02
##$BF7= 400.02
##$BF8= 400.02
##$BYTORDA= 0
##$CFDGTYP= 0
##$CFRGTYP= 0
##$CHEMSTR= <none>
##$CNST= (0..63)
1 1 145 1 1 1 1 1 1 1 1 1 1 1 1 1 1 1 1 1 1 1 1 1 1 1 1 1 1 1 1 1 1 1 1
1 1 1 1 1 1 1 1 1 1 1 1 1 1 1 1 1 1 1 1 1 1 1 1 1 1 1 1 1
##$CPDPRG= <>
##$CPDPRG1= <>
##$CPDPRG2= <>
##$CPDPRG3= <>
##$CPDPRG4= <mlev>
##$CPDPRG5= <mlev>
##$CPDPRG6= <mlev>
##$CPDPRG7= <mlev>
##$CPDPRG8= <mlev>
##$CPDPRGB= <>
##$CPDPRGT= <>
##$D= (0..63)
0 1 0 0 0 0 0 0 0 0 0 0 0 0 0 0 0 0 0 0 0 0 0 0 0 0 0 0 0 0 0 0 0 0 0 0
0 0 0 0 0 0 0 0 0 0 0 0 0 0 0 0 0 0 0 0 0 0 0 0 0 0 0 0
##$DATE= 0
##$DBL= (0..7)
120 120 120 120 120 120 120 120
##$DBP= (0..7)
150 150 150 150 150 150 150 150
##$DBP07= 0
##$DBPNAM0= <>
##$DBPNAM1= <>
##$DBPNAM2= <>
##$DBPNAM3= <>
##$DBPNAM4= <>
##$DBPNAM5= <>
##$DBPNAM6= <>
##$DBPNAM7= <>
##$DBPOAL= (0..7)
0.5 0.5 0.5 0.5 0.5 0.5 0.5 0.5
##$DBPOFFS= (0..7)
0 0 0 0 0 0 0 0
##$DE= 6.5
##$DECBNUC= <off>
##$DECIM= 2432
##$DECNUC= <off>
##$DECSTAT= 4
##$DIGMOD= 1
##$DIGTYP= 12
##$DL= (0..7)
0 120 120 120 120 120 120 120
##$DP= (0..7)
150 150 150 150 150 150 150 150
##$DP07= 0
##$DPNAME0= <>
##$DPNAME1= <>
##$DPNAME2= <>
##$DPNAME3= <>
##$DPNAME4= <>
##$DPNAME5= <>
##$DPNAME6= <>
##$DPNAME7= <>
##$DPOAL= (0..7)
0.5 0.5 0.5 0.5 0.5 0.5 0.5 0.5
##$DPOFFS= (0..7)
0 0 0 0 0 0 0 0
##$DQDMODE= 0
##$DR= 22
##$DS= 2
##$DSLIST= <SSSSSSSSSSSSSSS>
$$ [...]
##$SPOFFS= (0..31)
0 0 0 0 0 0 0 0 0 0 0 0 0 0 0 0 0 0 0 0 0 0 0 0 0 0 0 0 0 0 0 0
##$SUBNAM0= <"">
##$SUBNAM1= <"">
##$SUBNAM2= <"">
##$SUBNAM3= <"">
##$SUBNAM4= <"">
##$SUBNAM5= <"">
##$SUBNAM6= <"">
##$SUBNAM7= <"">
##$SUBNAM8= <"">
##$SUBNAM9= <"">
##$SW= 20.5580556627758
##$SWIBOX= (0..15)
0 0 3 4 0 0 0 0 0 0 0 0 0 0 0 0
##$SW_h= 8223.68421052631
##$SWfinal= 0
##$TD= 65536
##$TD0= 1
##$TE= 300
##$TE2= 300
##$TE3= 300
##$TEG= 300
##$TL= (0..7)
0 120 120 120 120 120 120 120
##$TP= (0..7)
150 150 150 150 150 150 150 150
##$TP07= 0
##$TPNAME0= <>
##$TPNAME1= <>
##$TPNAME2= <>
##$TPNAME3= <>
##$TPNAME4= <>
##$TPNAME5= <>
##$TPNAME6= <>
##$TPNAME7= <>
##$TPOAL= (0..7)
0.5 0.5 0.5 0.5 0.5 0.5 0.5 0.5
##$TPOFFS= (0..7)
0 0 0 0 0 0 0 0
##$TUNHIN= 0
##$TUNHOUT= 0
##$TUNXOUT= 0
##$USERA1= <user>
##$USERA2= <user>
##$USERA3= <user>
##$USERA4= <user>
##$USERA5= <user>
##$V9= 5
##$VALIST= <valist>
##$VCLIST= <CCCCCCCCCCCCCCC>
##$VD= 0
##$VDLIST= <DDDDDDDDDDDDDDD>
##$VPLIST= <PPPPPPPPPPPPPPP>
##$VTLIST= <TTTTTTTTTTTTTTT>
##$WBST= 1024
##$WBSW= 4
##$XGAIN= (0..3)
0 0 0 0
##$XL= 0
##$YL= 0
##$YMAX_a= 1772039424
##$YMIN_a= -3876064.256
##$ZGOPTNS= <>
##$ZL1= 120
##$ZL2= 120
##$ZL3= 120
##$ZL4= 120
##$ABSF1= 10
##$ABSF2= 0
##$ABSG= 5
##$ABSL= 3
##$ALPHA= 0
##$AQORDER= 0
##$ASSFAC= 0
##$ASSFACI= 0
##$ASSFACX= 0
##$ASSWID= 0
##$AUNMP= <proc_1d>
##$AXLEFT= 0
##$AXNAME= <>
##$AXNUC= <off>
##$AXRIGHT= 0
##$AXTYPE= 0
##$AXUNIT= <>
##$AZFE= 0.1
##$AZFW= 0.1
##$BCFW= 1
##$BC_mod= 2
##$BYTORDP= 0
##$COROFFS= 0
##$CY= 15
##$DATMOD= 1
##$DC= 2
##$DFILT= <>
##$DTYPP= 0
##$F1P= 0
##$F2P= 0
##$FCOR= 0.5
##$FTSIZE= 0
##$FT_mod= 4
##$GAMMA= 1
##$GB= 0
##$INTBC= 1
##$INTSCL= 1
##$ISEN= 128
##$LB= 0.3
##$LEV0= 0
##$LPBIN= 0
##$MAXI= 10000
##$MC2= 0
##$MEAN= 0
##$ME_mod= 0
##$MI= 0
##$NCOEF= 0
##$NC_proc= -10
##$NLEV= 6
##$NOISF1= 0
##$NOISF2= 0
##$NSP= 1
##$NTH_PI= 0
##$NZP= 0
##$OFFSET= 14.92079
##$PC= 1
##$PHC0= 0
##$PHC1= 0
##$PH_mod= 0
##$PKNL= yes
##$PPARMOD= 0
##$PPDIAG= 0
##$PPIPTYP= 0
##$PPMPNUM= 2147483647
##$PPRESOL= 1
##$PSCAL= 4
##$PSIGN= 0
##$PYNMP= <proc.py>
##$REVERSE= no
##$SF= 90.2741120386129
##$SI= 8192
##$SIGF1= 0
##$SIGF2= 0
##$SINO= 400
##$SIOLD= 32768
##$SPECTYP= <>
##$SREGLST= <1H.CDCl3>
##$SSB= 0
##$STSI= 0
##$STSR= 0
##$SW_p= 1497.18866228788
##$SYMM= 0
##$S_DEV= 0
##$TDeff= 0
##$TDoff= 0
##$TI= <>
##$TILT= no
##$TM1= 0
##$TM2= 0
##$TOPLEV= 0
##$USERP1= <user>
##$USERP2= <user>
##$USERP3= <user>
##$USERP4= <user>
##$USERP5= <user>
##$WDW= 1
##$XDIM= 8192
##$YMAX_p= 1772039339
##$YMIN_p= -3876064
##$CURPLOT= <PDFCreator>
##$CURPRIN= <$PDFCreator>
##$DFORMAT= <normdp>
##$LAYOUT= <+/1D_H.xwp>
##$LFORMAT= <normlp>
##$PFORMAT= <normpl>
##$SURQMSG= 1
$$ End of Bruker specific parameters
$$ ---------------------------------
##XUNITS= HZ
##YUNITS= ARBITRARY UNITS
##XFACTOR= 0.182762287876938
##YFACTOR= 1
##DELTAX= -0.182762287876938
##NPOINTS= 8192
##FIRSTX= 1497.0059
##FIRSTY= -2175722
##LASTX= 0
##MAXY= 1772039339
##MINY= -3876064
##XYDATA= (X++(Y..Y))
8191 -2175722 166493 -869858 -154511 359374 409209 472258 -553738 -1043119 1758248 -725457
8180 1254047 216075 -579194 2635552 -1157045 -654918 518403 1703933 3228679 -22478
8170 -444880 -750233 573446 2134009 751695 1281317 238181 -1175545 -1551850 -1433586
8161 -1433586 1564572 -1407088 -979512 1181993 940275 1295578 383416 1168329 -1149959
8151 614818 -302108 202909 -394672 -419426 -183027 928916 1024024 -2729243 -29032 1912828
8140 -2352445 -1200869 252980 282737 876936 866886 -3876064 359179 2028824 1144246
8131 1144246 -293632 -709829 1081698 -921918 300964 75034 365066 13413 -789647 2564976
8120 187749 -1064124 -394557 -766907 1874754 -912279 292916 283028 571820 2154189 -143068
8109 -1340434 -1845101 1968957 -326546 -1068189 1785666 1563940 1329647 21749 203395
8100 203395 1289305 -597427 1019819 -709288 -541897 453022 -1151001 151254 -231038
8090 -461619 -1723058 1062712 -1549478 1110870 231356 -1011356 331181 -866196 -508326
8081 -508326 1663634 -893550 471831 750871 -818679 464210 -2814589 1012960 -1143485
8071 206302 177460 351523 -240380 401850 425485 2156055 128944 1764835 -1750146 1262003
8060 1647285 252704 1619496 -1143074 431551 504459 392504 430674 -1463358 2679761
8050 -394670 -412596 -1394639 30176 -867503 -542477 -549926 -774499 1504873 -1693288 598215
8039 1509268 -206564 2591400 -1107703 36237 563807 720108 -7229 255129 -294754 1285964
8028 -956744 -821142 -110000 602612 -588633 576129 -1307229 156529 -660557 799922 -980783
8017 2094101 -1862529 -224819 843036 1990048 570327 636010 -57745 1202017 -369576
8007 451055 -365117 -870677 58759 1575324 346571 -30633 1300032 -1533477 280585 -389357
7996 661230 104551 734740 1859118 -81060 -543291 929359 941233 878951 1449762 1655693
7986 1655693 1414115 928617 -997834 2142307 2379967 -875518 515110 -50710 -15738 1895566
7975 568647 -492534 959670 -1336732 -1407038 689375 419849 -377063 2299678 2164422 2963102
7965 2963102 -259020 -1179067 -31044 -1269890 -116060 454958 983355 222615 368923 -308900
7954 301059 -51189 70441 -1302770 605159 -735162 -993909 -941240 621403 1129547 945594
7944 945594 3206407 139960 -935442 -804153 -743012 -1681820 437402 849059 -1146369 -934820
7934 -934820 -895337 -1113666 -389792 -620173 -975271 -367661 159131 537423 875765 871966
7924 871966 908054 224186 -1610874 1729902 -544572 387304 -524345 -579810 -1219949 444002
7913 183835 -285321 506452 520639 585030 968426 1833796 2804500 820707 -1503499 -64575
7902 -1070790 -1751660 -545079 -1904201 -1262422 1058615 1425310 1387185 -662203 1199314
7892 2967494 920862 -395942 2541205 1779614 1643857 -354781 -693181 1556624 -876281
7882 893438 -103894 40425 709040 -537350 588221 1788997 1529036 -361342 972021 1089058
7872 1089058 1851288 -954310 1542561 996712 -205229 -197142 1028953 -180969 -693316 825589
7861 1962170 -1289133 138382 -1020072 1121814 1266845 127545 167965 509746 -334993
7851 983773 1098842 -161893 517792 857742 501029 1361018 -27014 1852341 521889 696148
7841 696148 160711 -1106840 -470900 1471995 884496 1009117 1921001 1996934 446508 2143629
7831 2143629 -832819 1535587 -144015 141745 380305 -1977962 72937 -833934 745776
7821 -437737 2655927 -368695 1916569 708948 -432145 -1892596 709231 434448 328870
7812 328870 2219045 731131 -282777 928862 -1157277 1926165 1709208 1300708 384020
7802 746043 1424687 -209032 165945 1004149 924065 1455778 391198 -202011 -270597 1889952
7791 2802863 878233 1231823 1637847 827567 -979277 356329 398505 -411538 -1735217 1977830
7780 366799 864411 -530965 -835827 384222 -1073548 -1819822 -7514 938912 2063643 2441838
7770 2441838 1873452 2015429 474950 -817724 -747825 370375 2434748 982188 206304 1286475
7760 1286475 658021 441036 -569570 -1768884 -994795 787791 -1798922 -8237 -404229 -20623
7749 1463181 -2134019 9157 -1163220 250760 -1159003 1178211 2325585 655168 1333959
7740 1333959 480828 -187370 -985525 589187 -539893 1362715 -1524328 1850006 1581428
7731 1581428 1058101 -364726 1091827 1091942 -1025688 -1985579 1318734 -386834 2849790
7721 209737 -2574712 1140406 618117 -1462558 584229 1701265 896885 1783469 1419
7711 210923 211809 -4968 -325790 -361042 -185769 1167900 260463 -42636 189668 532835 664137
7700 664137 2278213 -532785 -786320 874368 -528816 -2146806 591259 920425 345723
7690 1721475 -39951 -1447417 -271070 -225287 400131 2610636 -515535 -931339 -453910 177336
7679 1719291 1361297 1169379 -1776656 2364870 -1428284 -3501 -103516 747935 843479 2514135
7669 2514135 3092070 2361218 622550 -58847 79154 905556 259125 1398199 -338382 274662
7658 -372130 630486 70528 1186142 1044653 1175753 -1007553 581433 133433 1265336
7649 1265336 1344051 1051416 299815 -982031 1258136 250235 1386572 588153 -1046832
7639 -1015478 1872545 725756 -111587 -733944 -191307 1626466 444573 -841580 -933778
7630 -933778 2671726 957466 1930295 377885 462817 1632331 517510 1823880 -1116785
7620 -1246285 -1486440 1634837 -1188999 106813 -269199 59873 -1736166 1380411 1471298
7611 1471298 -710351 -160645 402795 -106185 -669814 313412 794402 -964198 -563469 -481423
7601 -481423 1536873 -52412 1036086 1057694 -16740 92680 809943 -362657 -398798 -36967
7590 1782183 -147258 1468820 1034813 482911 2417490 1408181 -1160422 -771398 -227092
7580 -3166219 326779 921246 572804 -1022773 -1849446 957637 849336 -1289075 -1618527
7571 -1618527 1725228 -1384005 953052 897204 39057 1597196 1275266 -1014309 628554
7561 216451 -1008260 -682415 994969 316371 1026958 -443045 988301 1121861 1154082 170555
7550 1348910 1727507 806443 -1317116 1206873 1237232 -1230279 695390 -793127 1724306
7540 -1529335 771153 758893 -823105 -192098 -863822 -2360732 877355 -1004141 311035
7530 2042784 389601 1172897 1342642 1535554 394705 35444 -1762153 1710366 1176415
7521 1176415 1215805 894764 779940 -2292322 559583 -277627 -1330787 920325 638515
7512 638515 1136785 305867 -194834 87572 593324 -176513 1815887 420519 707232 1294643
7502 1294643 2312162 2149384 -375294 -108957 1090510 -435560 677638 -2036858 -319894
7492 -894063 2337388 818802 2410205 1399911 2434043 1943607 1534731 -552022 1136862
7482 -2314568 -1861459 621910 2182057 -2265762 -1237435 639628 -1388948 313416 -1492188
7472 1514973 522609 822880 178630 -856024 -887068 550483 34106 -644774 1203007 563446
7461 -945363 194200 -441065 987778 2609731 2178011 -584223 -500892 -63517 -685480 1846936
7450 -728028 -1003735 1700293 1230164 1104035 233134 1116183 -556197 1278650 -1051046
7440 -622888 -929062 -793695 1520854 2700273 -16918 28507 1478301 973768 -1795290
7430 295052 1743462 2495037 296433 -1036354 299929 1282476 -945753 712080 -137630
7420 271685 394624 -784448 -247169 -2685791 -2084857 633112 678540 2035410 -397498 -1189093
7410 -1189093 2442918 -242206 2141488 1042492 1590948 -461365 21656 -162313 -234644
7401 -234644 -1843857 -700102 222657 -1207198 522377 597382 -2505077 2645747 275509
7391 1156409 193035 -28553 1557703 1450580 1273205 -368371 1314583 1540948 -1987551
7381 1327863 -746851 1415921 -2955144 1621294 -161760 675135 2343157 -463521 -1400675
7372 -1400675 -1933919 -459289 259100 184729 -1378282 2213859 1077000 1219602 848424
7363 848424 1040867 1329220 427556 -510358 -1861645 459315 1164686 1465208 1627312 -351449
7352 1098919 -116169 -514671 -1185312 252107 353127 241866 455207 -188065 -623668 -442889
7342 -442889 -366694 -1649503 -329388 441485 -1695603 -1866553 2827436 861707 247174
7332 1109751 -737003 9958 994936 -933977 1199875 -246155 178599 908956 -417619 -108052
7321 -1487878 336230 -213022 1896472 654169 69970 204532 594508 -538052 1258127
7311 683787 -275515 -1081917 354340 95768 1510175 -340918 1012683 885582 244489 -374416
7300 1133614 -665777 2412910 1917319 3303278 -842380 -109899 233296 -1322032 1794729
7290 -38419 -750823 684932 -431289 -264298 -385725 1173246 996478 1124887 72543 1747812
7280 1747812 -2000816 -336084 1311127 298131 1436796 -569300 -823138 1324062 1193348
7271 1193348 2127440 946251 1466854 1869184 -949500 1384836 485806 88864 1818592
7262 1818592 1056380 -1064164 -348811 1328499 -1171021 592936 271826 -274914 821125
7252 1247110 1100806 1360675 -710487 1177906 -492657 -1985508 -196785 1505363 -427947
7242 989568 349001 2129522 56743 -286767 -90662 2165735 306670 1118846 1109964 1308427
7232 1308427 2502652 -184991 -1470528 1065135 1119970 514545 2672975 -304848 -170484
7223 -170484 609118 1293944 -1243911 217932 712901 -447564 828219 -549275 116407 1274849
7213 1274849 -459889 750000 -409644 542001 -783936 -164865 -12164 1869546 2187624 454915
7202 -42155 1020794 1664940 -235995 2146362 -790868 770790 23911 -1041245 413292 -188095
7191 -553395 -1520631 1970157 -2401428 1655042 2737538 1450177 1723927 2056673 -1007369
7181 -847729 -66764 377606 51760 974510 587962 -382259 133911 1661681 1276484 363949
7170 487537 214443 933463 1278684 716422 840026 -1209175 -1217470 -1387158 90676 -640713
7159 798336 287224 783676 -389820 -98904 -22272 197927 -1782446 -599968 1524515 1345417
7149 1345417 -530311 378911 -2812515 -2558586 380439 -1358653 1806965 -266909 -704009
7140 -704009 637859 1056954 -267168 1384397 779054 -234630 -41652 638425 -1380942 -1601615
7130 -1601615 872339 187151 2732204 2063166 -1560925 -86106 -546596 -1308098 390050
7120 185065 -970250 -258156 -218856 -699195 -24390 13855 -1558073 -63947 924812 -951268
7109 955497 2485515 -1625567 405218 1087896 -2136294 1003425 -1732482 1462085 967835
7100 967835 1230648 -1908191 8182 -248942 32886 -352234 -183971 2392412 580686 -883567
7089 1455121 -480945 -120680 2624870 -20284 -200 -1120641 1413281 1058612 1549018 1086540
7079 1086540 1315911 -1200411 -721205 462705 -1291332 1685783 -487325 615526 -1015687
7069 -842048 782053 1646581 1107435 679829 1107768 -550569 637890 -193024 2727607 350098
7058 -679444 -1000166 -149400 1593683 1841936 -917222 -1265643 -1237644 1510879 -534902 468962
7047 799527 677567 -499374 -1077145 1058441 -1320002 703371 1829079 -662170 480067
7037 1571655 89594 -850663 -2826594 -127197 1822961 -2136571 1421050 2681683 90022
7027 -559410 -1093190 -58437 1322917 601542 530080 -776584 207447 -666935 -1869538 1854607
7016 2502017 951862 -1323540 1612807 1231597 536444 -800851 452296 1674054 199067
7006 1005072 -320275 184598 369046 762030 755174 -755869 362047 -739211 529855 -400410
6995 -1488869 -242067 458358 -1316049 226879 -1509556 292069 -1765040 -796979 -1105082
6986 -1105082 924956 1032170 -302616 1076746 1732487 -1143018 384633 156688 -486110
6976 -1649920 385280 -402042 2238404 -377319 3304322 1461520 1387902 735257 305045
6966 1285324 552017 -369086 3796779 -39816 2414443 -715374 733079 -324520 633650
6956 8032 803253 391763 778017 1201435 -537308 1429966 -968629 -353654 222870 -1274049
6945 539089 -745098 1859126 1334966 196771 926809 -2090227 313504 1228058 720512
6936 720512 808497 -1199204 -2153293 2129635 -2052180 -587003 2358991 -1607281 1057169
6926 621096 919019 -515616 112212 991531 668651 188230 2066781 792289 1006648 411081
6915 385982 303046 323960 -667213 -282974 -277306 350884 -1468059 -940895 2076356 -1142792
6904 1564030 2039504 -203949 2168926 -946486 2779846 672435 -246608 -1481014 3330810
6894 -197703 1513791 860161 228566 -200304 2164961 -221077 237523 363113 -172778
6884 64762 803798 2520837 -546028 2580286 741870 -125242 1747311 -389219 -696731
6875 -696731 -1998405 -212101 769756 1532742 37313 -257418 -405934 37237 1024279 1074893
6865 1074893 -1163868 713699 4017840 359497 1256780 -454052 1235197 1659174 592142
6855 2084585 1028577 -1477878 1729531 -25081 300567 1260467 -873470 234852 -388723
6845 -200443 -455998 -37555 446183 -439153 3478515 1091419 975731 1800688 45697 -1056673
6834 94486 1357368 1722997 -209353 1013001 638435 810212 1019252 1825316 -704309 106915
6823 561566 47987 -821749 2707340 672743 -2191729 -611717 1229343 -472257 29090 211063
6813 211063 537083 790157 -88812 -1135749 89671 392719 -324412 -646717 -1348184 -186915
6802 147128 696433 -490989 748274 432907 -1490825 1752328 1674604 1310211 -111944 55904
6791 354754 -189489 -413382 143403 515135 3237493 -514507 -557723 2469601 1213294
6781 2259514 1487341 -84151 86102 3071645 827854 670962 -1757847 -36059 135345 -160591
6770 301081 1825698 -114292 -1347491 2270108 1911769 349956 -1950953 1044203 -1594183
6760 862274 386984 1111450 -180656 1313634 635563 1728009 -874199 -389505 157988
6750 844663 1018470 1561761 961862 1472726 558572 -2697560 282250 -191198 -85149 -671097
6740 -671097 -486338 1178355 466258 1196697 -1015944 692691 509548 -1885470 342158
6730 -509 -470647 1269442 -229554 -198635 -102985 1261613 700989 3278236 1476594 -74775
6719 1007478 1611411 945645 1957203 2170681 11327 1784671 1135444 -477430 -436448 -69504
6708 1764969 348890 -461305 -54656 -829609 -375731 -1387316 141393 -57438 1279941 -60624
6697 -120897 16371 296301 -716973 1385542 1593524 236838 1052362 454141 685778 -1375339
6686 1075130 1631363 647887 -1833534 2830138 965111 1721963 498247 -1514901 1090359
6676 -51063 684597 -664443 -407448 -316176 -322708 390927 -414747 3228814 351031 481138
6666 481138 -313105 -1055986 -409604 -930938 860398 -123223 1374030 946458 -657839 1642313
6655 877700 2484368 -32595 1646960 622637 990357 -1311341 431799 289512 759264
6646 759264 2303004 1991581 -149949 -688025 -632783 616514 1771030 208436 -982169 -830315
6636 -830315 -560961 -705293 -945278 688856 -749537 268948 -309577 620960 855479 1184989
6626 1184989 -51814 926160 268068 443208 -316835 -1519290 735931 1319642 116862 -1151246
6615 1245778 579700 1461601 -317502 2286541 1152320 1303792 -799383 526932 -247475
6605 -320823 -868739 -714129 3597474 259704 2264396 461867 -575321 1544330 -394591
6595 1746187 -569321 -1303838 -557945 -492952 -1343815 1251774 -476419 -77539 2847974 926307
6584 641813 1142604 -431285 -559032 330719 1489678 463762 814319 1179163 77449 139615
6574 139615 1242070 -1552902 -97671 581922 -933763 1217042 -421695 345401 -489196
6564 -982427 -1889377 -1100937 649653 2074045 630779 -26910 1042539 930061 1812165 -267231
6553 -59856 -457775 967537 -139739 174865 850835 -24646 655381 460136 1061684 719441
6543 719441 -200478 -162828 1446694 10725 1602438 409475 -877331 1865122 -593941 1858024
6532 2965242 505610 295723 -53148 1057115 -958371 2278019 177770 -1024801 -1257414
6523 -1257414 1202782 504619 -548079 3180827 -1595496 -1053479 1613710 -961618 818673
6513 1096173 268006 -261287 718792 1300067 2374238 -1418583 -284322 861885 -72225
6503 1560351 1668287 364397 350103 -490107 8415 545596 382131 1039017 120804 1108812
6493 1108812 1914925 1134792 -568056 1007337 591534 -1700712 493790 1462847 -1115026
6483 -161486 26297 1077705 1254374 1141801 1050911 1359111 455678 503762 3873 585267
6473 585267 2313896 2039290 -175814 703595 345368 108879 -328299 -46574 417571 156823
6462 -693975 -718497 1465030 1724796 1243398 -2397350 -362511 351509 1551224 1310011
6453 1310011 307211 876229 538059 1219221 1298811 -848649 785826 1713714 9890 1264644
6443 1264644 2122431 -560218 -721106 406177 456952 610376 2137236 1182382 -365819 1298610
6432 -646144 994053 -998493 -8233 356620 -204740 2281419 1965343 2155920 1544991 -470718
6421 -1056423 -574215 1076186 544502 -579480 1244899 -1029242 1078851 1737172 -1882465
6411 1708628 349388 612126 1454602 -180687 819264 263638 -1122744 -266708 552820
6401 2113911 -1888350 63873 -49926 111744 -2156191 2008519 -774663 -1876714 -2497915
6392 -2497915 2094734 677425 -41324 450154 1117623 481253 2572922 1306639 1774605
6383 1774605 884257 -1084846 2371579 -898211 1678400 641400 1089337 430397 -661715
6373 -826724 334935 320631 -552484 1963458 1664347 1475064 1509982 -86926 2179230 -1547196
6362 2632065 1620397 -59285 1349539 -275104 1728912 928438 -455178 -2703379 1344319
6352 1789810 671197 893594 1084932 -2444120 2503711 -318151 -826530 715179 -1509396
6342 383077 1253531 2796445 179153 572255 1704280 -506221 1032731 -375139 1532722
6332 780272 3308119 425775 -363173 1003018 1354971 504955 -438424 -533422 2398701
6322 -422180 -228908 -1240283 1947285 -610331 1021308 1698827 671341 2397516 -609303
6312 1414372 1828667 -830927 520988 -389911 334215 1718144 -953767 1537472 -120365
6302 2601384 1865344 -1462683 203225 -1317255 1937832 1996781 -1528089 -268959 -2728711
6293 -2728711 -446053 1484602 1382489 622420 -634094 975885 1075219 2305840 -596569
6283 -204461 1041206 2082383 166531 -444635 -233470 -824210 -165722 609855 868997
6274 868997 509267 247405 -965056 907962 52557 -551544 1904251 230761 974472 -1612561
6263 -197867 1057459 785382 -664314 -562750 626058 -72782 -746237 590308 818481 1288988
6253 1288988 -574426 523934 1145956 2723560 -612018 2678181 1244045 1910294 2818444
6244 2818444 -1057077 1529175 1298540 244134 856890 1022223 2803726 -1149833 -216201
6234 1207827 782961 -660760 1728539 385074 880350 1600421 1855549 -723304 87859 2156201
6224 2156201 2706671 -1138959 872371 2029203 279675 67659 600294 2158803 710381
6214 640291 1324971 1014407 -326315 877166 -1193908 301956 658586 1134603 1960847 467349
6203 3560015 -928164 -915375 3145033 1165809 1747974 -848491 -925622 5648 415726 -242171
6192 2783819 727309 1043800 -1750123 -587739 -797378 523692 1679413 1780562 1943264
6183 1943264 -256188 1206156 159283 1552026 -131119 2644321 521859 1862142 2777095
6174 2777095 -281901 230177 78077 476129 638510 -543907 799336 1473514 2316992 1484507
6164 1484507 1135043 -722325 1822609 1504794 2015095 872344 541389 2297763 832830
6154 1171096 336071 -2041057 -270594 1761186 811505 924142 -239516 -1077060 126327
6144 2444747 504925 1893816 2270767 -74104 -450817 505364 1207868 -1317136 -590883
6134 716461 -2420307 432863 818903 46979 1001181 -121556 1368564 1102388 2835545
6125 2835545 -971511 -830753 1435261 1490414 2031069 61429 1309464 210754 82510 1291139
6115 1291139 160495 -993330 64894 -726951 1452368 -20935 -373813 1616065 1338266 -531955
6104 454903 1264762 1291543 890109 810137 489502 527744 939348 -340176 461268 368398
6094 368398 766749 -983568 2168062 1663012 -384410 -2230084 1290052 -106010 -2340221
6085 -2340221 1048302 255931 127638 1777664 -221453 -34074 2130368 -348329 29739
6075 -337096 1258078 540182 -917805 -222236 2162515 365961 1202691 -442706 1694765
6065 22591 441326 3244594 970396 1563803 1520758 -1235336 1802780 -64813 -533389 285890
6054 995492 -76781 373889 432747 1219773 1134881 860055 15938 -1072525 207234 1079994
6044 1079994 1495754 -653742 267331 126358 1995056 699966 750270 1101606 419861 982706
6034 982706 444593 2266723 -681230 1876207 1991014 -622401 -423254 264828 -2385248
6024 496586 -536692 1525403 526083 1008736 1556298 1355395 480100 -793500 27537 -39494
6013 385183 1990548 -616757 2101536 2046587 943368 2253756 1040662 -1248753 521994
6003 1972543 708336 -390148 2014505 449433 -599980 1553274 -162335 -983435 735119
5993 1623661 -868441 2145949 311718 599809 1814632 -914677 388373 1920712 2348564
5984 2348564 2200435 1284807 2162396 -1201110 986563 1635539 -399240 863180 395411
5974 1307673 538310 313942 1529618 -74957 2248442 658571 2928505 2218141 536013
5964 1385589 795220 1362532 -1214176 -1242960 1518196 481656 1714209 805067 2225408
5955 2225408 321639 1284839 546975 -687007 2271768 1615372 209808 -516701 1193347
5945 557282 1926307 158911 1335062 758592 1207462 -532119 450434 1428360 -213015
5935 1024229 2472254 498813 577130 1772043 1912182 4281 -1408196 -1320302 1456911 -702153
5924 1224862 2562356 -96110 507139 -195547 -170656 526795 142427 -622990 -269308 -567139
5914 -567139 -16999 1186088 369386 617043 1655953 904413 434788 -791929 1813081
5904 -213692 -379259 1897520 168838 457473 1264405 397200 654714 807142 27328 773613
5894 773613 -68537 428077 975835 2826603 1406884 2197142 2821379 790722 -754233 765699
5883 452722 1761199 -1075145 -387407 -1703708 1599022 2744206 822393 572967 -835507
5873 -508592 -970289 -71621 2123448 420013 1372814 1395361 509136 68013 -342349 2850257
5862 -239630 450217 -1204658 -531223 608491 817719 987246 1436701 286358 102078 -405619
5851 1624229 759952 2152184 1909276 1216673 2968560 827229 1971890 1265127 859784
5842 859784 -653848 1400786 -252544 48720 730950 479002 1444892 2561400 3228960 488644
5831 -56969 -111711 589407 -515051 3377167 938379 425620 -2229617 551309 931601 1436741
5821 1436741 656757 2496369 416038 376635 2108526 -113735 -1182977 307391 -151277
5811 729293 2102241 1667195 1203792 295462 1678685 1513598 573724 753472 3049602
5802 3049602 236036 2556072 2750983 2748943 -141553 1375336 -642345 1382566 528846
5792 526216 3221194 538669 1207565 333799 -150673 -519343 637743 1859945 1218080
5783 1218080 847695 2022810 903900 109042 1055091 1932299 -85017 -726391 909630 170167
5772 882205 1585900 1832991 295337 1735747 2577598 2624740 89617 -186682 1523003 1029587
5762 1029587 193170 -591460 1438994 -271239 1878711 1642480 -248320 514706 1069453
5753 1069453 563391 491660 564450 -81856 1041894 -31442 -522413 963059 2182675 2922998
5743 2922998 1907646 674804 2838391 -906078 1179763 1303346 529288 -406 2443919
5733 1357663 -296088 1420215 2657655 2867138 600994 -430839 162781 632317 3076555
5724 3076555 1714138 1256734 28933 953268 595512 402469 1427732 3376866 1203879
5714 2405871 -658214 -241158 111963 436356 1964676 -639951 920834 1544088 746461
5704 209176 -627151 662387 614864 -32287 2230383 2394967 422140 4637208 519592 1173135
5694 1173135 1053491 1111760 2093872 2220905 439152 -43994 3021043 749297 -316739 1561107
5683 2553391 1567441 777339 2015926 958679 936333 370543 1212382 1642546 815008 156456
5672 2131493 1423413 -256945 -2006850 500594 390917 -77953 2357490 927819 2364558
5663 2364558 2271924 -882395 467943 3240828 1492145 -907552 -1576018 680938 2107449
5654 2107449 515365 2023269 -835213 1311521 158426 -108555 1273645 1765085 1055908
5645 1055908 1633192 1910945 -34289 678133 3074153 1876771 428723 -254215 -256896 924987
5634 1236057 2037964 709699 947187 1480013 1163433 -259792 62011 1372786 63291 974956
5624 974956 1330300 -57004 -1351330 924339 416937 448729 1174583 1838789 833560 367481
5613 1353036 2245938 522681 2078026 529464 381283 647037 1444272 272673 -716613
5603 -8769 1883009 596696 2178435 1541832 355042 1271353 787190 -1352147 47291 119782
5593 119782 -224411 279590 1348784 684725 371034 -961626 1067276 1506014 629068
5583 869889 1891097 52929 1247821 453666 519832 234929 1739332 1240663 -846148 1221604
5572 393940 1568676 1084626 793506 2273921 2117748 891916 1541676 -42715 2046685
5562 1109668 2597354 964828 48947 1465587 1989145 1733521 -208526 1080233 1913355
5553 1913355 1891429 2486882 2282164 1184806 -404086 659764 2516118 1866975 1033404
5544 1033404 -141164 1100410 1822417 2347030 1065528 1876087 -197026 2380759 1021170
5534 2123381 715869 3328214 -701533 1268895 748519 362845 2064680 1750816 982367
5525 982367 -1372441 767242 9260 978840 220623 961998 1288955 108396 869937 -1534426
5514 613136 830274 2082585 3204099 179095 1080940 898197 1145112 -849443 557560
5504 730839 1020833 563472 2384586 2138648 2900729 414929 2121553 567916 -1101836
5494 -1527112 1918241 -75538 2164985 279345 805693 641010 -191816 -569406 733730
5484 938166 1280313 1941890 1048916 -39400 1932432 1476823 2057223 1051927 627139 3115780
5474 3115780 1418099 1910815 163765 611298 -276124 1601794 -948210 1390326 2235435
5465 2235435 351362 1032721 2808069 147923 736503 -190403 -1028968 3031435 -413009
5455 1687225 -365889 965013 1120990 -197953 2200142 1372276 31779 2829961 1600935
5446 1600935 2037708 416424 626593 55434 2276605 1466873 196147 2616535 1755289
5437 1755289 2673044 1643427 1544457 331991 1875456 -12632 -502665 180274 -375645 2290383
5426 -1540256 640771 1334220 277276 -351855 292395 930154 1476463 1192964 -211529 549519
5415 1050613 -261492 638083 2741596 -217656 -799547 715995 302618 735311 991514
5406 991514 2912686 -592006 1534396 -286962 1659176 1787156 3013799 -74322 142419
5396 3526461 1355969 764331 1889788 2670141 1775259 -1329683 135742 1631454 811104
5386 -1041135 2600194 1656101 412529 1343375 782892 -97714 -753040 1188282 970555
5377 970555 2478650 1057431 1241674 1506785 2570609 1655247 2325354 2919642 3736257
5368 3736257 1378937 605646 -151063 1328629 2808435 2395269 4392508 664181 2558292
5359 2558292 3163034 760872 2071852 1338710 2965185 1135077 1373335 1755557 1021787
5350 1021787 926268 1874649 2891257 323726 602162 747591 1515641 -203125 -1001010 -1177142
5340 -1177142 2002353 1684444 661842 -916956 1008288 -335876 2162868 -964923 1010275
5330 1494309 995780 3278098 1611378 1996899 504598 3502241 675820 909497 942573
5321 942573 3588195 3172128 98847 518067 -811315 1551655 1530742 2543680 1349591
5312 1349591 3825141 2162949 2381594 272330 35716 839516 2129812 -201871 1389100
5302 -1589262 2097014 1042255 2559813 1134510 1087121 1176690 1446968 2504045 3146102
5293 3146102 -205326 2245237 375058 768189 2443622 -949484 1515910 -736955 2691558
5283 1267376 -611244 1468718 2077446 565074 598858 1695473 2410253 1581889 1681485 623550
5272 1832674 845796 1221523 925131 956509 -566147 1576700 4358393 789369 2404113
5263 2404113 3516899 250992 187971 -161220 3201681 1749104 3001124 1500879 -610708
5253 2294666 1389389 2298003 2047441 3087228 778225 2189775 777908 2234638 1853454
5244 1853454 563444 1212331 -93605 1906715 1727645 1682702 2651590 1052281 2539463
5235 2539463 2642641 2452673 1715041 2076486 1082738 1316485 3307784 1676505 -465182
5225 1728656 2645594 1604377 2325995 -360462 2960222 1928963 2203106 2023105 3677272
5216 3677272 1764378 965138 2873545 3267083 3380268 908281 4239852 1681857 1882023
5207 1882023 566739 2346443 953165 2854986 4077701 2892310 2587466 911240 2784804
5198 2784804 3167872 1313231 1095199 2320969 1062868 1355444 2165969 2873930 1221025
5188 2888724 -188984 2274553 3970464 962969 2009010 -352697 2778424 1424342 1616813
5179 1616813 1067285 2304928 1884396 517087 3233697 3753865 1209172 2041751 2107850
5170 2107850 764349 2142577 2613946 1440590 1114268 -361384 1795230 2356460 -45038
5160 312762 1678419 2471771 732644 138158 475684 153275 1046656 700394 1342148 224663
5149 -1080890 3114674 -142023 37462 -1122880 1682861 788600 2195773 -235079 1134173
5139 -38332 991104 883989 250019 -533830 382732 3184726 1521398 1180978 2324303
5130 2324303 -168931 781236 1256103 1738398 1036496 897404 1333641 3881547 1025198
5120 1746152 -724231 2567510 781295 765925 2335011 933443 1962857 2343966 1127487
5110 1092743 2481380 2506170 79626 3518423 1976999 -678707 2782722 1654635 825603
5100 2369800 -356827 1409639 2263625 947476 817132 2665969 1257638 3993068 -60047
5090 1552570 -211610 -1106215 2483656 -818505 2906803 2324016 1264001 2661990 1629899
5081 1629899 1653859 3049542 99058 1072099 597920 1826168 2002508 -281026 263387 472775
5071 472775 2558767 346392 2334542 606793 242482 1200869 463440 670649 1811975
5062 1811975 2341510 281722 1193453 1325373 307134 3903686 -202085 2905061 1960515
5053 1960515 -115769 1466611 1891649 -133316 1589816 1453254 1486198 1753432 2094355
5044 2094355 1909754 47735 537711 217489 3498324 1403217 3407595 1982199 1381471
5035 1381471 2053597 1454654 340192 1819840 1660292 2287939 2702225 234510 2544132
5026 2544132 2335471 3802257 1509552 3999439 2101021 1432218 1484303 1349269 538427
5016 2124910 2333711 552167 474286 1475105 98609 2197548 1611146 2750197 -235347
5006 2444199 309725 2578763 923048 -322441 2502831 537522 1248641 2071991 1272962
4997 1272962 823071 2894398 859175 2659031 1469429 3755384 3333123 3225933 2505972
4988 2505972 1201872 333500 1182272 578852 1858420 1543634 410087 285017 1522405
4979 1522405 1002217 2787080 1865918 2141636 -598002 949591 2133025 2795660 942315
4969 2303882 2807783 1546475 1516735 3528862 3198780 3005561 4619882 4415424 2486501
4960 2486501 3136148 3140157 4705525 4251858 6029990 4547643 3800198 3278063 2585008
4951 2585008 3439810 1977597 2494077 1919353 903010 3189315 3807115 1939628 3853502
4942 3853502 3041597 3555055 1229445 2827830 900452 -301257 1785450 980968 1534231
4933 1534231 1741113 -295402 2784488 2150306 1203441 824205 3143994 -327536 314840
4923 -8539 1935058 -228849 3206777 1054710 -1057057 1684920 1843008 1073513 1373014
4914 1373014 2479092 1237737 146008 1913775 1546233 1698055 2183563 1726882 3064322
4905 3064322 22312 2957832 1993814 1107300 -448897 2036554 1287301 1500950 1961500
4896 1961500 417961 3322725 1127152 1035872 2207346 -414991 200371 1760596 118013
4886 2368483 2788659 3358164 1891124 1942283 2096763 2325842 2344912 1598694 4075884 736742
4875 798764 2258002 1938652 1058476 1292735 3840623 3658865 3811309 3230623 1646832
4866 1646832 1101946 -550028 1409759 549256 2978665 2754453 402452 1807179 1992593
4857 1992593 407811 2664773 4309343 1836877 3213286 4682993 573589 3210771 3485769
4848 3485769 1605445 1730390 1613043 3430838 4488799 4292423 2404030 -111702 1329049
4838 1267130 1998092 4347980 -5909 -143525 1152872 3471736 2074754 2981124 880976
4828 1965881 808852 2115089 3047394 846913 1914587 934184 854541 389521 1912579
4819 1912579 4239979 2629155 1449591 3058232 4222826 2559193 696932 3100749
4811 3100749 3923137 2238999 1813393 1873840 3000512 1820389 2907457 2689848 3781164
4802 3781164 2467761 2540500 2731146 3044483 1125450 2653402 4102660 2783920 3138160
4793 3138160 2125454 1799937 783722 3832075 839908 840347 4026004 1494935 2706929
4784 2706929 1654817 3707097 862497 2920189 1569914 1134336 2467262 2389519 1655485
4775 1655485 906289 3483359 2620953 207609 2097477 1168521 2980342 1079596 1608925
4766 1608925 3409275 1812043 -131021 1735610 2108402 4969303 1391165 2845270 3362554
4757 3362554 4502792 3242471 -34651 2990852 1219062 4513326 2925740 3231008 673635
4747 1675819 4021935 1857019 2866128 1700621 1030712 1529851 570745 999883 3456181
4738 3456181 2628900 1212198 1122514 2154152 1761277 2026876 3715215 1023139 2216077
4729 2216077 3010889 2634829 -4681 1099769 2121688 1199536 4093950 2483852 683894
4719 629564 4299403 2787083 2700612 3165115 3489444 5568911 3620120 5088588 2628530
4710 2628530 3405210 3604882 5090631 4571198 3781078 7096985 8760927 7742376 8206450
4701 8206450 9493259 7677152 9624354 9192614 5587911 6754753 5714459 3854760
4693 3854760 3226536 3569100 4205044 2217246 2812386 794984 164384 1636168 4740705
4684 4740705 1153231 1772602 4842497 540910 1233604 2372920 1696664 1984236 4353672
4675 4353672 2517073 2330350 4291328 1643602 2191184 1622348 2310315 1390572 2596801
4666 2596801 764459 1368297 783285 2603937 3444041 1033694 1212535 2273246 1770109
4657 1770109 3305828 2049862 1040859 483634 2721034 778091 1260407 2087209 687698
4647 1821833 17003 1646616 -531414 3074478 -623347 2135574 3939297 1856965 1854312
4638 1854312 4228156 3921069 3284538 1633596 4000067 2187552 1819475 1850098 2602396
4629 2602396 2570129 3036150 1546049 1239892 1000506 1937934 2772689 1104142 1304377
4620 1304377 1291148 3335487 1369506 964434 2534122 1715474 3733731 3368306 2713440
4611 2713440 2412118 2395621 2237542 1036925 1973555 4873987 2572875 3193150 3608203
4602 3608203 3202140 32868 2692186 3523674 2829543 2809576 2065531 4685592 2577865
4593 2577865 3107134 1892444 2455014 -330626 2125476 2816019 3122268 1136779 2409909
4584 2409909 2912287 2744943 4721429 2287875 2877743 1125653 4491634 1543391 2958543
4575 2958543 2614554 4075984 537678 3305615 2485941 436908 974589 4567284 3387616
4566 3387616 3100534 764206 2759677 84103 3505813 1757379 2038709 2633939 2900047
4557 2900047 2065270 3456007 2303994 883019 3936479 2121305 2299264 1815157 3075637
4548 3075637 3379268 2025153 2360711 1924843 4321309 191319 697511 3189681 4934246
4539 4934246 2475388 1931003 3139932 2559873 3195802 2612583 2084764 2298830 2578657
4530 2578657 2352084 3690811 6025271 3923492 2566256 3488586 4228857 2898655 2646470
4521 2646470 2076577 5918399 4404057 2507430 3056995 3242701 2999037 1705705 2695073
4512 2695073 2544229 3059177 1509799 3176134 2639309 3692429 3178280 5435595 3680115
4503 3680115 1756327 4812473 5285579 2431596 2706853 2363725 2120660 3062862 2504935
4494 2504935 1766919 2144040 2794376 1198283 863596 3135776 1860873 789721 1670761
4485 1670761 2816339 3141389 2372972 4542848 2634956 -125624 2139913 2993641 4857672
4476 4857672 3570173 3455048 1742252 3307913 2828939 3584544 3638126 3845919 2833787
4467 2833787 4114759 3508097 4402857 5527992 5272398 4747066 3712948 2200895 3365083
4458 3365083 3421820 3338249 2516139 3039140 3785080 2749393 4265698 4761874 4296817 5150260
4448 5150260 1367076 5241080 3681728 2648317 4342454 5655915 3775556 4251144
4440 4251144 4487513 5183009 3076451 3322847 3277690 4174598 4809860 4844060 4811830 4992136
4430 4992136 4828400 4676201 984025 2813895 2245171 1911353 3886915 2763533 3782753
4421 3782753 4107065 2144069 360655 1840211 6220254 4170480 3407005 4053886 6381519
4412 6381519 2033926 1596413 4723489 4332956 5056388 3189687 4543725 4392517 5481265
4403 5481265 3649807 3646852 5073317 3979547 4008820 3064471 3668682 3435019 4594534
4394 4594534 4057628 5326040 3087415 4423800 3720830 3191160 3159774 2313008 3908965
4385 3908965 4202754 5806911 2532419 4807792 4764556 1583873 4713121 2990391 5466957
4376 5466957 3981197 2458770 2874512 4290720 2841554 2839604 2119196 2971950 4102209
4367 4102209 2303728 3357486 2281785 3010502 3474057 1476302 2513498 1752028 4256865
4358 4256865 4017518 1178192 4053430 2626810 3245046 2576393 2457627 1107443 2803923
4349 2803923 3700682 3609684 4420657 2612912 2404275 3516544 1869663 4665837 3493070
4340 3493070 3654511 2761566 3031676 2320962 2230888 3202350 3971007 3696359 3957135 4458428
4330 4458428 3042830 3458888 4412670 2686120 3608731 3939575 2940224 4843637 3836791
4321 3836791 2711701 1434630 2678359 2785351 5010870 5398748 3112632 4816366 3520250
4312 3520250 5159585 5350712 3942291 4177136 4011871 4051218 4927324 5607675 4144574
4303 4144574 5248252 3547906 6072252 4789112 6437997 3720527 4881950 2834522
4295 2834522 3727222 5767137 4171333 2431925 4438490 5411003 1265496 4027874 3019634
4286 3019634 5009120 5329431 3570770 3929151 3145586 3934691 5374494 2778017 3225966
4277 3225966 4402017 2823909 2179579 3850832 5321413 6042165 2195176 2982375 2759404
4268 2759404 603483 2292827 3339101 3300927 2321743 4735550 3927837 4049603 3587108
4259 3587108 2996637 4154342 3095449 4454371 3934833 4528378 3484381 2446601 4287715
4250 4287715 3582900 2975366 3602168 3059981 4415917 4654492 2986228 2256139 4842511
4241 4842511 4560626 4047541 5182411 4942199 6552849 5432293 2638657 5833119 3119039
4232 3119039 5442933 4560194 3855466 5748490 4276442 3008248 4263793 1160072 3791884
4223 3791884 4900939 4052154 5434583 3696839 4945995 2943358 5171692 2950441
4215 2950441 4833506 4433506 5183129 6261411 3595966 4575590 4949635 3214940 6239453
4206 6239453 5020045 3936416 6924332 3715507 4199990 4400890 6236508 4199859 7397440
4197 7397440 3664467 5550589 5958737 3299123 6544667 4398999 3601006 7094536 8148096
4188 8148096 4994886 5881439 8360891 6931821 7342730 6238205 6255408 4835567 6677819
4179 6677819 4342010 5006581 6161967 5908008 5920637 4144057 6460836 5202112 3972561
4170 3972561 3086019 6534815 5972721 5253896 4339154 7353250 4743861 7101547 5623378
4161 5623378 4928477 5870927 4881243 5225653 5388978 3881970 4577392 3234822 4140411
4152 4140411 2713230 6229809 6003653 3614237 3967923 4032690 2804577 4764589 4534584
4143 4534584 6088707 5885642 4331094 4114496 3240626 4099496 3937457 3613957 3720951
4134 3720951 4993294 3950546 1386918 3718351 5576269 4097134 6345865 2066822
4125 4377883 4732462 4112653 3159081 2183958 5387825 3605015 3449592 3176856 4271915
4116 4271915 3015595 4103788 4667399 4322622 2718969 3807133 4213818 386649 2641189
4107 2641189 4710184 2796344 3811296 4798451 4225071 4148619 1218368 3369070 5073863
4098 5073863 4536139 4799149 10498563 3958469 5225873 4525033 2801589 3529943 3253755
4089 3253755 3838389 2141427 3401345 3165668 4502352 3309200 3841679 2534634 2624819
4080 2624819 3026268 3993823 2248674 2836139 4199564 4004110 3568493 3909192 1682372
4070 3256437 5053461 6328570 2555034 4087906 3824608 2677476 4275149 3406947 2551315
4061 2551315 3929175 1736285 5351889 3298081 4461805 2417509 4656424 3712955
4053 3712955 3703857 3496430 2864840 2322158 3129759 4861637 3693078 2181144 3843945
4044 3843945 3455480 3651448 2169271 4531126 4684078 2609804 2939678 3203042 3511777
4035 3511777 6221366 4804964 2462799 2970961 4003132 3177008 3050851 1969946 6110143
4026 6110143 4626152 2009271 4152676 3486914 4391122 3273076 3691943 4145038 2858849
4017 2858849 4707434 2381402 3249347 4198646 3624595 2546883 4768640 3557798 3134494
4008 3134494 4790465 2401517 4166239 3867283 4776953 5313739 5906523 4909099 2584702
3999 2584702 6202960 6853115 4850184 6361841 5512028 6406219 5093273 5586155 2482811
3989 5174931 3035843 6527816 4431104 4796547 5255107 4050390 3865897 6615243 6942581
3980 6942581 6081657 5802989 6557949 6894436 6186994 6767572 6894479 6392926 6503623 7133472
3970 7133472 7364400 6729231 6669941 6119951 6306717 6973928 6937175 8514893 9023846 6881298
3960 6881298 8363891 7960793 6500156 7002621 9815015 8137224 7593482 8550099 9138123
3951 9138123 8298401 8894385 7278623 10918104 9532624 9776217 9241645 7766043 10564058
3942 10564058 8674205 6085490 8441436 8886791 7697351 7341190 10024505 7080759
3934 7080759 6882064 8516844 9555999 7266810 7758409 8570057 9231804 9006123 9920283
3925 9920283 7547830 9569463 7627622 7560856 6810520 5717874 4419816 6769508 4791590
3916 4791590 5674782 6519437 7079959 6474593 4661605 5131514 4165813 7959832 5678291
3907 5678291 6335704 6921489 5452522 5274583 7029599 5467657 5236279 6178956 5085691
3898 5085691 4540710 6733842 5998485 6887155 7969305 4209363 6652355 7101587 5724593
3889 5724593 7140090 6857286 2857814 9018001 5175520 7368078 6892274 2907119 7813570
3880 7813570 5560370 5985604 6525506 5783418 6227982 5353895 6707051 7169674 6395312
3871 6395312 3287060 7224998 6602472 6214660 6032831 4640239 5836814 5603971 5555707
3862 5555707 4244507 3219762 5371590 3549347 6011404 3334670 3674196 4739049
3854 4739049 4952401 4856899 4341073 2767958 3370974 4397380 3226560 4580495 4233678
3845 4233678 3645146 3271265 2245307 3834194 3153566 2987655 5401310 5045322 2849549
3836 2849549 2963986 4198652 3033913 5386379 2742599 3177029 5055173 4716293 3547362
3827 3547362 4614141 86784 2991572 4856515 3555540 4106212 4196357 3890502 5164520
3818 5164520 5103267 4676901 6679484 2778840 4540134 4763848 6501196 5500284 3947002
3809 3947002 3069474 5951912 5227401 5581018 4367183 3717608 5919732 5370360 2739726
3800 2739726 2703923 3272346 5266737 5408294 5245530 5492102 4274535 5485094 6513723
3791 6513723 5285502 5248565 5040131 3356347 4878300 4894495 5468042 5745574 5731928 4608880
3781 4608880 7456181 7628917 7727724 5910782 7309687 6704175 4902566 5755364 5502346
3772 5502346 5177864 4518020 6095667 5728061 5690152 4843082 6367586 6130096 6460302
3763 6460302 6298890 4473476 5510079 5729400 6066546 6094485 5625153 7745526 6059227
3754 6059227 7821949 5110918 5829377 8816967 6885390 8363944 8751316 7535806 8022614
3745 8022614 7367730 9511656 11033291 8209599 10704508 9382926 11680506 9169668
3737 9169668 10871429 9641135 9979207 10432595 12890348 10400870 13891249 12859285 10761765
3728 10761765 14050225 13054603 13615325 13720628 11871970 13608437 15700345 14152524 13691736
3719 13691736 13970668 14698891 16264892 13679225 17353996 14781618 17077308 17598366 17653370
3710 17653370 18541708 19852618 18571216 21730822 19930216 20439674 19868530 19831706 22680680
3701 22680680 22456796 23119028 25599867 24671141 24638675 26712496 28193529 29485320 27138560
3692 27138560 28737752 30298651 34235965 37525673 43024965 48383352 54102833 59141184
3684 59141184 58562900 56087336 50707081 43777001 38534237 34176090 27524702 23147622
3676 23147622 19114250 16176515 12884493 13147254 8716789 10023843 10508967 9903258 9577847
3667 9577847 7609293 7879049 7506134 7735578 8313181 8672378 6664483 9025955 7852821
3658 7852821 6934365 6570193 2771049 6480008 5762634 8388880 6996874 5038199 6228429
3649 6228429 5679184 8024848 5928718 6568190 7400151 4524918 5736366 7989529 5696552
3640 5696552 6287495 7087044 4868072 5333320 5637053 4581334 6827197 5218898 5897826
3631 5897826 5940894 6038976 6234928 4553536 5470242 6978014 4016332 6317886 4067296
3622 4067296 5255531 5817864 6335044 7367032 6426089 5343099 6010649 3881404 4962452
3613 4962452 5691593 4474222 4847167 6936774 5940218 6028616 3034582 7194807 5293288
3604 5293288 7049135 5273602 5790600 4349388 5330055 4740040 6171179 6139812 5443388
3595 5443388 6043222 4226999 4509815 6162227 5749050 5491493 7062727 6806044 7163419
3586 7163419 3923601 7780636 6614718 6476188 6500914 7639624 7398633 6787126 5131834
3577 5131834 6761512 7218612 7026016 4669137 7942191 6201562 5528265 6919775 7585712
3568 7585712 6292910 5867142 7429161 7278543 6147875 6097392 4890036 6282653 8174307
3559 8174307 7645286 8804555 6770271 6462072 7542690 8465357 4394567 6527631 7800373
3550 7800373 8021563 8360676 6612771 7310547 6068069 5798027 9217276 6409633 8124383
3541 8124383 8316959 8563451 7831469 9196953 10332935 8074220 8835595 9041999 8288654
3532 8288654 7238495 8156430 6500853 6159651 6339522 5096604 6752429 5985350 6449574
3523 6449574 7039888 6654865 6958550 7185546 8700252 8442926 6766514 8232682 7336503
3514 7336503 7743102 7038684 6358790 6451568 7700801 7391807 7739402 9276558 7640856
3505 7640856 8552731 9508270 9088391 10394014 8119665 9528666 9752658 11861271 13253212
3496 13253212 13097261 14364848 16004805 14592029 17362982 16202086 15089710 13298462
3488 13298462 16084529 14362947 14112328 16641026 13363819 15887112 17394058 18094050
3480 18094050 19609456 18217601 16773756 19088612 16336420 20949160 23002488 22635072
3472 22635072 24443724 22571876 26107853 25426880 28626083 28120777 33706281 35623050
3464 35623050 37377829 42430389 44290785 48300704 48685264 46557581 45348180 43818233
3456 43818233 45666201 46441025 49660949 48306821 50591172 51521497 52502224 59508764 59728796
3447 59728796 61740880 65809248 65560596 68335611 63585484 55794680 47099925 39621893
3439 39621893 34433781 29821175 24627002 21651104 21725846 22093114 19965920 20210768 21051216
3430 21051216 20871048 19476240 18631078 16919078 16916602 13828665 13715652 12092996 14231331
3421 14231331 14286571 10169081 12340594 12395382 12900275 10789637 9985246 8134832 13521593
3412 13521593 11584715 10834752 11609874 10065782 11040645 11182111 10637217 10821000 12404622
3403 12404622 10327072 12855103 11353675 12693613 10956949 9998003 10289614 10881684 8685835
3394 8685835 10480484 10460744 11215028 10537530 8844835 9871837 9874306 11474685 9214176
3385 9214176 10969976 7642646 10820679 9804105 9000489 10887302 8909300 10817112
3377 10817112 8891256 12128431 10507209 10305049 11273304 9816034 11755841 9183868
3369 9183868 10194598 9383201 10530745 9683692 10516043 8829605 9063715 11822233 9748165
3360 9748165 9607395 12014322 9611173 9148471 10439360 11270003 10029837 10754733 9692409
3351 9692409 9559503 8969572 9834029 11257405 9576000 8865454 9748843 8604755 9561878
3342 9561878 8305380 9083651 11589315 10259421 8885485 9273102 11120152 10659667 10972084
3333 10972084 9828746 11238334 11612349 11697051 12457176 13388336 11380959 12111446 13204689
3324 13204689 13384759 10795739 14524299 10624927 14675657 12201115 10747019 12575755
3316 12575755 13870579 12520594 11367946 15200672 10879249 13290765 13180830 13339086
3308 13339086 12599339 13460310 13346775 15910598 13165664 13844416 12449739 11388534 12161221
3299 12161221 15245932 14694505 14690020 13236769 15064395 13973841 13781323 13763808 13300744
3290 13300744 15975016 16183476 14339569 15164700 13332395 15910386 15177766 14980740 17380564
3281 17380564 16417267 17522762 19568210 20642390 20411182 17745484 20586868 19740910 18782180
3272 18782180 18940482 18567672 18867986 20726470 24045651 22357382 18528094 25187894 22476076
3263 22476076 23663504 24271074 26199526 25588114 22691642 25072090 24960706 28206625 26545498
3254 26545498 30504980 31208173 31040472 31146030 33073752 32520309 33086997 36153937 36337421
3245 36337421 38872497 40797705 41375269 40341605 43302209 45160100 48322929 50067437
3237 50067437 51777440 56136744 60549076 61800148 66994308 72638459 75806571 79901316
3229 79901316 86956979 96621298 105285274 112419266 122121833 134738825 143792136 157658728
3221 157658728 171958919 187688134 203062773 223764533 245471859 271901106 302121296
3214 302121296 334019343 376311598 425670155 489200264 579740451 704745566 881630741
3207 881630741 1114914250 1385565373 1640685105 1772039339 1702656687 1477740601
3201 1477740601 1189094854 919418323 705065117 548063333 432452042 344768687
3195 344768687 281616977 233744916 200783141 177274679 155969703 141411048 126437577
3188 126437577 117885362 108187473 98596978 95101162 86692155 80650884 76573259 72011156
3180 72011156 67230876 65527123 63374516 60767484 60383168 55603721 54584020 51735441
3172 51735441 52229721 50624840 49959961 49836597 48496737 46453605 45326840 44116045 43179897
3163 43179897 42539521 38895801 40177369 38604741 38163061 36207009 37501534 36237089
3155 36237089 38547202 35407513 31395831 33637090 32724994 31534743 32191723 32953958 30671040
3146 30671040 29284003 27953099 30297154 28146257 28668394 28070632 26504988 26319433 27657560
3137 27657560 26653552 26918032 25062653 26378640 23430651 23111936 22283880 24643579 22134018
3128 22134018 23121019 22671342 25352092 24673778 24705531 24983994 22930756 23556926 21932964
3119 21932964 20406118 23939256 20067627 21541454 21268521 17498031 19597892 19537916 20608482
3110 20608482 21062050 17554642 20376048 17418224 19862012 18070348 17823250 16710940
3102 16710940 17685209 18494234 17909664 16721171 17954958 16586732 15952348 16677743 16639950
3093 16639950 18207358 18575158 16077906 16043863 16150490 15735548 13903961 15559757 15248284
3084 15248284 16359933 13962395 13426170 15074811 15658248 15108494 15424510 15860239 13732563
3075 13732563 16419872 14538253 12089367 14175968 15080849 15728111 15655130 15557301 15040305
3066 15040305 17553994 15198328 13763422 13982434 14017169 15137038 13858110 11810208 15448485
3057 15448485 14191817 14948494 13316974 15248362 14314326 16960596 15018813 16231274
3049 16231274 14524002 17831606 17496846 17570362 18559838 18750664 18127952 18297698 18659726
3040 18659726 17094048 18314986 16476577 16925699 17706331 19823998 19290518 20411252 20171988
3031 20171988 21383654 21162038 20813056 24668841 23027654 23847910 24733808 22462102 23593230
3022 23593230 24738964 28035526 26164790 28896199 30219549 29258695 31912213 33008923
3014 33008923 32370035 36246450 35559178 37911933 37482261 36974237 37612418 38784265 35712957
3005 35712957 36634378 34847545 33056648 33454875 34995638 36602609 37630002 38790301
2997 38790301 38351534 38302717 40161957 41406806 42178845 44869156 47513248 47038177 48615036
2988 48615036 50668712 50707949 55559108 54622169 60299832 63249556 64188332 67144892 68148771
2979 68148771 72463731 72021852 74702820 78291027 80500803 82485091 84864651 83575411
2971 83575411 87292347 92464611 93168418 96090723 103383811 107124530 112806433 113290609
2963 113290609 112305282 105701762 94486195 82181267 70671964 59939156 56178664 51180272
2955 51180272 42099365 38875793 35604133 33190397 29943742 26262920 26273088 24386538
2947 24386538 21955550 22464616 21551712 21519748 21802514 22239118 18546691 19953008 22022560
2938 22022560 23131330 23190574 24618054 24116920 22914030 22529658 22315674 21819194 23318781
2929 23318781 22536222 21334022 22167640 19938370 19259696 18676248 19469504 20014174 19813300
2920 19813300 18342701 18670840 17479452 16929570 15749678 15976631 14617516 15377560 13215264
2911 13215264 15923341 12658283 14387741 13218710 12702405 13585600 9043435 13046806
2903 13046806 10974086 12292368 11735918 10358818 10645639 11821099 10001830 11732477
2895 11732477 9788557 12993311 10883246 10847000 11158043 11384881 13113743 10242358 13323351
2886 13323351 11895047 12606560 10018305 13155292 10846956 9705917 12703788 9954533
2878 9954533 9693335 8960162 9471370 9709044 6375809 8749124 7417572 7542222 9273326
2869 9273326 7864767 8582786 7569883 8911351 9247186 9264215 9785181 10813881 9840876
2860 9840876 10029910 9540661 10501901 10043649 8737411 10992949 11932012 8955778 9730088
2851 9730088 7997598 9980498 9409680 8786839 9577390 11418178 10520388 12040119 10597978
2842 10597978 11424317 8992386 11225260 8770166 9232327 9521671 7546651 7456862 10046883
2833 10046883 7312828 9393175 7565709 6012547 9209418 8473342 6551025 8514739
2825 8514739 7585557 8800892 5489580 8314790 9330789 8331757 10315130 8707830 8021207
2816 8021207 7949551 9704211 10495369 9792668 9917097 8740381 6589720 8564969 8160094
2807 8160094 10039503 10266563 10649275 10525508 9487424 10405088 10133994 11598090 11151063
2798 11151063 11034092 9712166 11047922 13999568 13694151 12677832 13848131 16327109
2790 16327109 16825330 19360532 20217178 26934227 32571836 42445505 41063305 38887382
2782 38887382 40928993 44058513 31510437 23239461 17942708 16662069 13262824 11979148
2774 11979148 12844030 12057180 12994064 10672277 11995668 11059505 13035563 10034236 13826030
2765 13826030 11793043 9295905 11135410 11238956 12427639 12770938 7809339 9659445
2757 9659445 10919302 11619617 10332508 9924363 9923181 11791383 12572958 10887314 13173211
2748 13173211 11430762 13840399 11913202 12523387 11983904 11131144 12710470 11533627 12206039
2739 12206039 11870001 11841474 15264458 12346264 13653227 16736115 15040572 14447776 17767814
2730 17767814 16751862 16723863 22592314 25038614 29553827 31405773 34019109 38477509
2722 38477509 35518589 32803132 31383337 29331118 26608805 23737358 23827552 20727756
2714 20727756 20609300 15966602 14220459 11373615 16721428 13796942 15107790 12887032
2706 12887032 12296788 12855216 13270938 11145035 11051131 12393030 11948544 12221017 13464975
2697 13464975 13595786 12623093 10318985 10780622 11059931 12798743 11219369 10789122 12402554
2688 12402554 12183274 14278578 11354445 13375960 11900134 11605127 10516802 11052072 14072214
2679 14072214 9202664 9808247 11956772 10044108 10678363 11407528 11078836 11653709 11493304
2670 11493304 10961074 11599866 10606454 11129103 12390068 9519376 7297822 11250623 10036074
2661 10036074 10500261 10241068 10465555 11229389 9865796 8422861 10875177 9260094 9266871
2652 9266871 9367645 9578437 10959946 10430098 11839163 7933697 8955829 12441850 10546187
2643 10546187 11383100 9434003 10252288 9413592 10263018 13204789 11400006 9620433 9318957
2634 9318957 9940155 8992880 9690856 8756572 10887744 8294591 10260520 9939253 8634396
2625 8634396 10000462 7146629 8754528 9455077 9783700 7511693 8854261 8844081 8576487
2616 8576487 9007044 10908918 10781855 10680781 10099178 12257323 8437399 9128281 8918653
2607 8918653 8537259 9268197 9074742 12048019 12388659 9044288 11379586 8848111 10726213
2598 10726213 12755460 8729457 10961042 8927682 8185048 9563488 10023718 8528420
2590 8528420 10758136 10944518 9492768 12563483 6991753 11163227 10838663 9107425 10128921
2581 10128921 9313442 11447408 11859550 9467154 9172740 11695453 10447345 11019553 12307613
2572 12307613 13789086 12948897 15245008 21607784 28549614 34695845 53147516 59238380
2564 59238380 43623145 30857694 22622766 17482627 16191803 13349837 13244332 13429739
2556 13429739 11312467 9989089 11017074 11196256 10585425 10541726 11124410 9233377 8614969
2547 8614969 10718132 9706345 10959289 10907452 8932538 9393376 9310577 11058563 11496041
2538 11496041 9643797 10043846 8840226 7730481 8604995 8445405 7808501 8687521 9799458
2529 9799458 9774497 9957365 9736196 9342832 9320552 10537761 9412625 8138687 8187389 7271443
2519 7271443 9243545 8572776 9809403 7119238 9298845 7141855 9932319 8261295
2511 8261295 7425861 7457157 9015652 9234615 8961062 10304519 11298511 9188751 11999779
2502 11999779 9189019 11548610 11277138 10892009 9977195 11261207 12734781 9936817 12743504
2493 12743504 11557045 10812809 13522971 13316021 15392783 13876461 15977669 16807124 20276036
2484 20276036 20010662 19345490 21040460 21158422 25416010 30966372 37066445 48809009
2476 48809009 69487532 66603488 50438468 35897593 25692702 23508470 18564278 21084114
2468 21084114 24157660 27857262 37678793 37441361 28465754 22458862 20500666 20681746
2460 20681746 20947440 27938721 32127066 44615245 46401689 35840117 27354185 23192448
2452 23192448 17850958 20040964 21943908 24904822 34495454 35906961 26115663 20697338
2444 20697338 15801340 15963592 13815258 15591593 16654389 21791334 22162336 17008712
2436 17008712 14186254 14046775 10201768 7873868 8328404 9086856 7622445 8183870 8697395
2427 8697395 9467212 7451024 8671235 7502199 8554065 10378820 9951678 10582496 12263926
2418 12263926 11826300 14689094 14236444 15479911 12738830 13086693 12351626 13684616 11997073
2409 11997073 10109061 11644232 9998698 9608174 7286861 10826407 8414306 9442496
2401 9442496 8693902 6765838 7243223 8111578 6591962 7827221 7299026 6534280 7487524
2392 7487524 5752320 4787555 5833612 5647718 5279007 6234760 7089922 6001659 4433666
2383 4433666 4574760 7293401 5820850 6000393 6679410 7244666 6359491 6302057 4584305
2374 4584305 4946531 4646675 5768608 8023847 4699143 7600098 5792235 6137859 4586413
2365 4586413 6582955 6083577 5707225 3901050 5654753 5631924 8406543 7038843 4729442
2356 4729442 6336813 5869388 5872223 4855733 4037841 5664289 8284460 6124466 5839003
2347 5839003 5737153 7772084 6576521 6581092 9327946 6077407 5867935 6673498 4904136
2338 4904136 5640616 6382548 7912041 3811450 5352508 8245102 6193605 7754988 5326817
2329 5326817 6419863 6044235 9329203 5972006 7014366 5856490 6672905 6373021 7671870
2320 7671870 6731651 6482142 7715850 4223866 4786106 5462300 5121564 5034996 7174462
2311 7174462 5443740 4957558 4656355 5468180 5900383 5959716 7722958 5685640 7863322
2302 7863322 6353024 4987405 7022124 6744109 3842661 4829194 8099972 7916182 7051417
2293 7051417 5010354 4741574 4339296 4630622 6512510 7263913 5556014 4390770 5434171
2284 5434171 7010786 6939593 6436072 6263491 4829892 8095826 4878090 6086531 5900265
2275 5900265 6866278 7488966 7772237 5486524 5970057 5576067 6192734 8965216 4990337
2266 4990337 4823866 6407605 7319619 6350691 6629762 6939235 6067559 6706816 6950133
2257 6950133 7876264 7971633 6964017 7663592 6760497 9660693 6917156 6536522 10063241
2248 10063241 8238944 8588789 7544889 8681945 8953464 8878197 8411441 8515505 8613561
2239 8613561 10143153 12040972 10338422 11899095 12098508 10570825 10220092 11324736 10823507
2230 10823507 10107619 9411317 11859446 10227602 10487596 10305754 9529798 11629599 10331471
2221 10331471 11497099 8354638 9295515 12512289 10988047 11191906 11420701 8890077 7893014
2212 7893014 8125675 8316189 11711787 10005570 10262810 8762924 9188641 9200150 10784131
2203 10784131 11893897 9775223 11443469 8943511 9274295 7435384 10548363 9935199
2195 9935199 13077298 11468392 10408782 11263150 10714086 9518358 10864986 11041303 11501707
2186 11501707 12239724 8878027 7217657 10461209 10242700 7853679 10526369 7436123
2178 7436123 7665562 11011685 6561352 10336362 9153266 10722494 6040484 10474208
2170 10474208 9634015 9201348 8874484 9346594 7397898 7077695 9840896 8213972 9763792
2161 9763792 8372191 9068689 10467489 8102596 8055077 7821310 4750385 7115991 7648891
2152 7648891 8478752 7592821 5170260 7908660 8316337 7791009 7625821 7509667 6075996
2143 6075996 4799049 7145886 7912383 7087704 6077056 7299064 5720331 8090948 8678881
2134 8678881 6032485 5576129 9188076 8063486 8566045 9699814 8628950 7594165 8423876
2125 8423876 7537508 7455618 8529983 8684357 7783596 8436256 9066669 9270469 7760342
2116 7760342 7529648 5428925 6235355 8130778 7239567 7161322 8793860 6221374 8606311
2107 8606311 8449474 5788318 8790273 5764611 6539891 11030842 8420521 5258543 6228496
2098 6228496 9610039 8798515 6105392 4885822 8136506 7343040 9472498 8247636 9234928
2089 9234928 6512278 8470800 8818048 7603224 8932237 9270620 9470919 10595428 8707325
2080 8707325 9327190 8311767 9895809 7887584 8112132 7111238 7993438 9687462 8600370
2071 8600370 8056883 9171275 9792727 10047371 8849515 9632727 8034516 8395817 11312536
2062 11312536 8975661 6804369 7993962 6330610 10502648 9110098 9713222 8688224
2054 8688224 9035343 7987716 6572389 7987428 8642041 5945341 8089978 7286929 7813672
2045 7813672 7383383 7863022 7113922 9274381 7766348 9711517 9452125 10613826 9117569
2036 9117569 8513891 10384595 9590078 7845706 9550512 8406413 10990179 10473846 11809468
2027 11809468 8479468 8378562 9021541 8604796 9586191 11317874 9611464 10311498 9810378
2018 9810378 9491750 9268294 10759129 11506862 10893379 13270884 10655498 10849697 11147292
2009 11147292 11797826 14141217 11028670 14161976 14436706 14045878 11723232 12248573 16262342
2000 16262342 14352104 17191442 16946638 18349844 18093017 17037357 17262602 16991240 14287450
1991 14287450 16608716 15837377 14322967 16998674 16102217 18049122 16946874 18042002
1983 18042002 15645924 16784576 18162030 14803917 17836988 18608014 16015134 17974184
1975 17974184 17400948 17591156 20347548 18783434 18916646 18098254 16518450 16130796 17992856
1966 17992856 17567926 18064678 18436737 17620273 17304111 18758118 16898576 18495578 17856840
1957 17856840 18915310 14589600 17261260 16619949 17351734 18801424 17728400 17140840 17397255
1948 17397255 19976108 18615226 19168366 17678570 19614482 20407236 20141216 21265368 19777798
1939 19777798 20541346 20939200 19617710 20937292 20025840 18196052 16526465 18766640 16554574
1930 16554574 14250927 14122290 13142070 11543100 13576173 12716466 14664780 13635846 13808908
1921 13808908 11546843 12491325 10769349 11709727 11772854 11768659 12563062 13478443 11147332
1912 11147332 10635737 11523420 13904451 12753476 13676723 11999492 13179533 13302855 14107160
1903 14107160 15249226 12940210 13308446 12737603 10620332 12481739 14817459 14654806 13031476
1894 13031476 11129634 13487636 12330605 14541355 13370699 15391921 13743267 13756560
1886 13756560 14570460 13431957 14820993 13623597 15227788 15778228 14760053 12523537
1878 12523537 14034516 14427789 14019140 14176818 12876688 16340562 14490949 17912828 17087630
1869 17087630 16344542 18158846 16451805 19495370 17749350 16960648 19298656 18249226
1861 18249226 20449216 20229084 21222846 18459746 19319488 20066184 17007312 18225340 18270902
1852 18270902 19190978 19109081 17473936 17290964 20253196 19856058 19465390 20189588 19764282
1843 19764282 21104318 19359180 18176028 19480214 18639661 17486318 18066546 19508338
1835 19508338 20256742 16821582 17726436 22603172 19121482 20142512 21189242 19037527
1827 19037527 18806670 20005956 20025618 19500050 19520738 19618859 20075166 19230142 19247382 20643434
1817 20643434 17379799 18395900 20032310 18819106 18426426 18402158 19647334 19993840 18037381
1808 18037381 19929678 18794650 21209320 22378230 26267614 29742094 36421601 47412105
1800 47412105 35798037 29176221 24588852 22142820 19213128 18806964 16998026 17232764
1792 17232764 16506006 16673271 15588421 17510792 13790057 16273402 15167756 17804424
1784 17804424 15642388 15385648 14711281 15565997 16477981 15306296 14698638 15132179 16765528
1775 16765528 12898426 14036160 14947886 15274915 14276547 14850723 16074269 14876340 12408508
1766 12408508 14796518 15065323 14966714 14284172 14598872 15838032 11674582 11983260 14870473
1757 14870473 13423800 13861102 13944750 15613214 14868673 13312105 14700233 14792335 12955299
1748 12955299 14637863 13973507 13707494 14702130 15066534 14531116 15942706 14588807 15676070
1739 15676070 14858385 15537248 16352331 16199873 15790704 16290561 13471304 16749992 15378733
1730 15378733 14876681 16136875 16696729 18242942 16624556 15961522 17294085 16661093 19142514
1721 19142514 18151194 17962722 19561908 19136506 21768348 20150430 20998616 20435372 22025420
1712 22025420 21344794 19564342 18902957 18800654 19571800 19277280 18799434 20134688 21917938
1703 21917938 23111205 19738978 23143476 23512876 20644907 21641484 22566242 21006408 18796746
1694 18796746 17343470 19425025 18455062 19049431 18251922 16224939 16736137 18836030 17574636
1685 17574636 16880606 19895228 15561521 17115741 18767070 19938998 18487868 20825688
1677 20825688 17469038 19643160 19787558 18232928 20179034 19901772 19045456 18744412 20541166
1668 20541166 21056296 18985228 20866208 18083280 19261238 22074237 21293870 21628334 21136706
1659 21136706 24039534 21769286 23856886 24558914 23469028 22581676 23415866 23374338 25415370
1650 25415370 24159384 26832883 27138712 25791336 27136742 28101925 27508773 25037004 26530732
1641 26530732 25672466 26701370 25466254 26759090 25920474 25445602 24385552 24564557 25075634
1632 25075634 23572303 25667720 25516510 23595420 24323594 23893541 24505958 24886434 24766946
1623 24766946 21762610 23980772 23152488 24602506 22720610 22938724 25608353 22782962
1615 22782962 20070406 23436472 23662208 25061669 24652499 22256526 23271675 23499012 23632684
1606 23632684 23378834 22117336 23500288 22425686 21923666 20647988 19887564 22982902 20276944
1597 20276944 19892548 19940306 18639896 20100126 19842864 19532774 19087386 19182788 19870804
1588 19870804 20360862 17943169 17499022 16896980 16155131 18712550 17669004 17002878 15247381
1579 15247381 16291043 19072164 17456276 16701562 16002722 15372113 16968942 18443118 16159346
1570 16159346 15071210 17102558 15483904 14482685 15760238 14881937 18498160 17797476
1562 17797476 15108819 14964881 16534629 18022238 14959228 15691995 14336177 17116702
1554 17116702 14614681 15497856 14177424 16271599 17817292 16928690 15193263 16072986 15289468
1545 15289468 17073782 16172544 16371945 17876938 17573348 16748804 15462949 16380697 19122952
1536 19122952 17910220 16823990 16842986 19523654 17866226 19285464 20670052 21014524 20346438
1527 20346438 20189500 20584642 21996358 20424556 22535860 22004930 21875612 21670948 23230552
1518 23230552 24180156 25977761 24684336 25496850 25825692 25087302 25674054 26900385 27486948
1509 27486948 27970429 29488755 29872155 30724005 29121206 30264804 33181803 34618577 34225181
1500 34225181 36429469 35880246 36229489 40740893 41094989 44325553 45575689 46749321 50070220
1491 50070220 52620861 57636668 58460708 60402292 66044996 65724552 67913348 71688987
1483 71688987 71410291 74491396 76760083 77184491 78519363 81830891 80807004 82261099
1475 82261099 85392963 88603379 93668306 93616498 99637131 104571930 107403746 115455273
1467 115455273 122850617 130130337 138410041 149211896 159643864 177746470 195306838
1460 195306838 209522021 224594724 235442979 239127971 229254132 213793845 194391925
1453 194391925 173732103 152143448 127592521 109129706 91792210 80966939 68794004
1446 68794004 59097649 56030385 49211124 47056641 42518213 37825885 38240989 37102261
1438 37102261 34891793 32790746 33574397 31942618 31316891 29819689 29243158 29318301 26606704
1429 26606704 28349574 27261184 25861616 24760770 24384211 23376278 23601412 22414498
1421 22414498 22876136 23676196 20653698 21742654 21303888 19690806 19546432 21461194 20717094
1412 20717094 19198430 19028656 17844576 19971212 17679124 16600467 17966206 16592269
1404 16592269 17110487 17804342 17365052 17128982 17734426 17086360 17196000 15988000 17401608
1395 17401608 14322107 14776413 16017429 16875009 17874398 12863436 14836551 12331406 13834546
1386 13834546 12534339 13291931 12365193 13058840 14895954 14572268 12945892 11272187 12528581
1377 12528581 12718464 11826375 10258185 10906575 12913384 11611478 11303741 12106940 10917974
1368 10917974 12292330 10843872 12338390 10485836 9381039 11242806 13058012 9465896
1360 9465896 12082412 12256389 12573761 9926390 11531884 10755096 9947157 10480315 10380306
1351 10380306 10850758 11701385 9524680 10862548 10451050 11090109 10565499 11193053 9561335
1342 9561335 9190466 9376339 11975963 10059531 9447508 9863956 11739934 10693513 9799333
1333 9799333 12218424 11433319 12269206 13359201 13762074 14571999 12125922 13805702 14505151
1324 14505151 14348926 14840646 14679249 14804724 16287891 15196709 17930155 16461534 18025406
1315 18025406 17243712 17307825 17983380 18421212 19805418 22346856 23002956 25539758 24777400
1306 24777400 26518232 27740000 28983134 26958600 26880780 23627918 22693415 22005218 23149784
1297 23149784 21183960 21236274 22120728 20158388 22095692 23128804 23303684 21842636 23235158
1288 23235158 23669008 21331950 21793224 20494010 21165609 22823320 20073832 21722948 22907180
1279 22907180 21452524 23835592 21916230 23115420 23257548 23596528 25393156 26161227 26325413
1270 26325413 30271156 31725473 34176266 32436958 34089805 33195341 34297438 32453894
1262 32453894 30415756 29237367 27197106 26902416 26825350 22805152 24321684 23732762 24077058
1253 24077058 22151300 23319364 22214242 23257008 22206782 25638812 23262156 26338507
1245 26338507 24290834 25112086 25157856 25621848 26870259 29696272 28682642 28424770 29661358
1236 29661358 30277766 29236947 30178192 27581446 29203332 30235941 29641893 28889681 27080976
1227 27080976 26607754 26312980 26388760 27056457 25107027 25793544 24564020 24626750 26477542
1218 26477542 23861698 25803026 23322065 22777826 21577870 19977260 18558930 17406763
1210 17406763 14371844 13872753 13249035 10860313 10628471 10640492 10296434 9562530 8187921
1201 8187921 10903157 6905519 9246044 9408619 8673915 7206870 7645292 6111114 8608247
1192 8608247 6201858 6802851 5418906 6608363 7529339 6731412 6598727 6433884 5340495
1183 5340495 7338344 6189871 5221499 6031918 5973624 6304420 5610448 5969727 5206921
1174 5206921 6377311 5165263 6270841 5745526 4736148 4571201 5660531 3591469 4994022
1165 4994022 3729045 4994297 4954258 3790660 3001263 3839025 6280770 3823062 5732843
1156 5732843 4313532 5644618 5185548 3670773 3386359 5609512 5134749 3243379 4933926
1147 4933926 4823437 4149213 5099677 6033514 4349083 5083394 4051001 4544005 2259300
1137 1791302 1751905 3821739 2674119 4219878 4363982 2823748 2908256 2666619 3336929
1128 3336929 2623270 2338116 3357504 3040023 1690217 4149860 3776539 6127846 3194021
1119 3194021 5254797 1545440 5176159 4267540 3653358 1704204 3410281 4568783 3722321
1110 3722321 4286002 3987852 2234380 2844149 4650936 3459065 4631595 3174667 2585069
1101 2585069 3123984 4053011 4654932 4698180 3257111 3298369 6500629 2877156 5443292
1092 5443292 3856005 5253212 3460543 6441117 4921295 3374828 1791221 7037945
1084 7037945 4499738 3202118 5699143 4721855 4287745 5015437 6478622 7217616 6134455
1075 6134455 3855818 7143459 5497423 4762085 3764533 2944116 6320354 4858042 3220587
1066 3220587 5029669 4662423 4233774 6006933 8474545 3237250 3372334 5356687 2460177
1056 5604194 5544730 3228093 3200154 6033186 3130746 4018974 2947447 2655729 3224460
1047 3224460 4798280 2499662 3659778 2584468 6516548 3249691 4679737 4016808
1039 4016808 4999597 4719008 5094935 5666837 4347095 3591284 3609574 4104515 3386101 3415443
1029 3415443 3406944 5419604 4341338 5554729 3559945 3099743 2385335 5174828 2436583
1019 3318978 4360287 4175354 4677847 5544496 4518310 4541137 2915623 3767938 3529247
1010 3529247 3141453 3373376 5128163 5312144 4887030 2571039 3752038 3554603 5052513
1001 5052513 5196963 2726412 5924363 4407449 4378110 4002798 3040625 3636349 4347108
992 4347108 5122648 4393936 3240796 5056330 4959951 5685384 3833703 3717139 5346415
983 5346415 4995559 3919468 4272609 4866033 4146708 5749262 6157978 5233508 5385689
974 5385689 4317256 3618983 6267525 5452930 3738756 4224123 2726438 5907785 3337495
965 3337495 2765598 3838114 2894196 4764681 2355511 2719105 1780376 3477775 1502732
955 2228295 4321150 2621373 315970 229003 3293132 1903058 1636717 2115377 1887216
946 1887216 3004548 2209397 3132334 2386572 4250385 1726682 3084400 1817868 1023931
937 1023931 1054170 2632868 3987170 2526797 -269324 -428568 930505 2067275 1018781
927 1990877 2936207 3027302 1829264 1236956 2258509 2703980 3295114 1740619 1380243
918 1380243 1482892 758444 1867699 2212334 2527241 1921214 644204 706957 1252058 408962
907 1866689 503753 2403416 41808 2053300 501554 2551672 54588 1355727 730035
898 730035 2209280 2641830 1504013 1080993 2507385 2661615 -1366894 1906077 1559508
889 1559508 1383090 102287 2091832 1204477 2148804 -300608 -575838 2218006 1354562
880 1354562 131116 965528 1432677 3387576 1689835 628978 1526865 1556062 1666462 -603048
869 -900301 4889373 1662599 1538735 502868 704634 693097 -1563409 2548898 2955374
860 2955374 2129729 822361 945987 1636356 2478881 3963524 481204 2980865 2606228
851 2606228 2891400 1143831 2767107 2864163 1408777 3346243 3064878 4064512 4362720
842 4362720 4997438 5630668 5324705 4993018 5659511 4002295 5576735 6012430 5366277
833 5366277 6624728 7577752 7088734 9504971 10736858 14019557 14774566 21582190 38435793
824 38435793 49435260 97782138 106569274 65253656 38323093 23642875 16280261 14211771
816 14211771 9472534 8845178 7261658 5718238 6606212 5868823 4154240 5037009 1922396
806 4836039 5332293 4613501 5770396 2838947 5562490 3223608 1935309 3088302 3878412
797 3878412 2367559 2549381 1528848 -282359 3877331 2934768 3343813 3776784 1748961
787 2500916 1499513 3764429 2280861 2828011 4161446 3105538 2932989 2760723 4985654
778 4985654 4251414 2729882 2979109 2743383 3195328 1774888 922321 1710654 2134714
769 2134714 2830265 2413989 3615830 1390536 3963128 1351791 164694 2136645 684648
759 3751457 1319806 443891 2168771 3286902 2694656 2385881 1506809 2525297 3224070
750 3224070 1801506 3028194 1036536 2677239 3122923 2806085 1876082 1282532 2880297
741 2880297 3983288 2316975 2619940 3343980 2878325 3251159 3631928 1981492 2592680
732 2592680 3260931 974808 1998435 2637945 1600686 1184846 449842 1922367 -538268
722 3206871 985154 1651096 1664735 1974748 790523 -540547 -211862 -14592 1287402 2147377
712 2147377 3501874 1738825 1433380 1435914 464667 2157677 2239629 -99488 1618037 619333
701 3208785 2587361 441883 8672 2267461 844286 1322255 259997 -1313183 -366302 -98555
690 48513 1748252 -130695 -330182 1238402 920876 -249137 284016 1219202 256403 497633
680 497633 992498 436398 -172778 2140230 -771280 -1304802 1437192 623635 652741 604004
670 604004 -51074 808448 1940333 695371 1892573 570001 2280321 1377662 2599025
661 2599025 -1311752 576782 -235936 -1544237 951069 1415061 2220956 1610961 620097
651 851085 1314352 1252678 871934 71909 1131645 1565134 -593273 880249 2429219 1681126
641 1681126 1925981 1123057 3096237 1302112 -1596972 1372828 2059299 -305296 270953
631 217551 -1211884 1580209 833625 -703023 3869501 1619015 -1601922 3663826 -261243
621 459656 1230236 2196990 -1116093 2334694 1638697 2970348 879009 2405512 445635
611 1360124 -543706 680519 2366326 1877868 699962 1482167 753211 318524 1449269
602 1449269 2427279 1314475 2751252 2349669 2431585 1156287 3748828 3631288 3904315
593 3904315 2292178 1082927 1397527 1439051 3319888 2963923 3738090 5299565 3191638
584 3191638 4345118 3480171 4480242 4356417 4494403 1719077 91266 2542807 3233469
575 3233469 -316120 1858245 1522821 2727813 2364555 2860441 358784 760003 -540646
565 1235373 108826 944770 217845 1147339 1516987 -1920326 1558046 1707040 -862800
555 1223135 737261 159625 1049867 3484556 -462242 2293741 289022 749511 375366
546 375366 1220111 -516806 1874656 -46414 400155 1555825 525227 1642023 834982 1274056
536 1274056 -239725 -106145 -1373089 102179 1086937 1345978 2551131 -141601 -672547
527 -672547 -707086 329747 818295 1431572 -794371 570084 -481173 309185 2240400 1321835
517 1321835 2013703 2759791 2301879 2161268 2345191 -1930231 -1117174 -1015020 15801 -2840844
506 446845 584944 298611 -3251084 1305879 -1281625 322515 -1601816 468112 2880655
497 2880655 -346180 693655 -837698 457669 1051024 -227230 1270542 350665 279050 -1620482
486 -129302 -1315935 -15474 -1094627 -3127687 -921749 1264117 302521 -66776 -801827 1432861
475 880801 1187280 -235189 -486437 -494671 1130676 -1117137 82117 1243813 1547433 1876260
465 1876260 -692683 -1688515 3221922 579189 30771 171833 -924000 -336621 282783 405022
455 405022 -335351 -587109 463847 -247575 440728 1163323 1532733 512823 -177651 1848451
444 1520608 -218313 1452469 -765589 -656066 343855 1246653 203867 -729254 -2008942
435 -2008942 140987 1851679 3216605 347291 980573 -364268 -696136 -1019497 17807 1702991
425 1702991 418396 -313959 680961 39481 721653 726262 -418724 1436509 -897004 1370147
414 11236 -828433 -278011 -280642 -1539178 -1247184 -757254 367527 -687641 -1186154 504483
403 286538 1837246 602893 2830313 -966433 -321567 1260212 1543888 2314046 -451224
393 661067 -1443106 2046331 -416176 397028 -1227089 2285473 149416 2214359 -1942597
383 30136 115938 -1647388 1200611 60786 4039188 410500 808317 822207 75597 1593074
373 1593074 2186076 771273 2055743 205266 472893 -662251 -526179 -29280 1268582 -610366
362 -1035686 -573343 392592 -961843 980997 -1355567 334305 -1105678 1782324 941509
353 941509 697726 -839044 866589 379258 -513554 -674818 30650 -985350 1990548 838727
342 1196094 969716 1215449 677685 337942 84323 -191834 -705209 -210178 -292158 -845232
332 -845232 -418430 157668 -199781 465106 380904 1577763 314343 716349 1703590 -1120893
321 -1404259 -231377 -615458 374961 -49361 665580 -3130400 -269524 -275759 -1000253 -1834637
311 -1834637 -547819 -1512981 -3179728 1176325 -640384 1451071 -1807952 -2004403 -733455
301 -1158538 -386982 268976 -2051813 -84504 1205900 1458914 -449884 -1013172 -573372 -155534
290 -791306 1569171 -808715 -296591 114693 -586265 -1348915 -996116 -2031230 1099000
280 977571 -790134 483757 1652340 -301629 -644431 1522652 -976692 -127846 -246380 941764
269 537909 1152057 3043984 1685374 -497975 1321186 -1761453 530973 973416 1414697
260 1414697 -347107 11659 2047468 -64823 3695 341965 3319660 1043431 802677 329438
249 -303196 -895655 -1377163 -670748 970931 -277865 -995769 244677 -1143839 -405956 1380384
238 -1211442 348759 180294 1077814 -1161843 615444 1062467 1587291 381950 -361178 1063742
227 880450 1533608 -1844780 -850660 -1295628 465454 -947855 791648 1496136 -114863 43977
216 562310 12596 139362 74060 -244075 24112 -355775 490470 799081 964304 412591
205 -433439 532008 2048377 -2052046 -816740 -1605038 -446640 1193732 465782 1408074
196 1408074 -1106914 -546613 -1220279 -447278 -967611 -163668 -936504 -179348 148047 2388270
186 2388270 -1476248 -1066452 77768 -134489 -1664077 -1085902 -2425197 180072 -321518
176 716715 426237 1905199 1154905 745400 -1639135 127097 779831 -263412 -1289723
167 -1289723 -1416560 -471921 268536 -483134 -1361075 -195051 1050568 -424954 -1491105
158 -1491105 56153 -1670009 -552268 -274341 -1182077 -54144 518483 99077 1334079 1289728
148 1289728 2648420 1110483 -874022 -2219304 -23598 489249 561103 793881 707200 -473903
137 -486348 -1716873 -1199537 266277 -933023 -1810530 155842 -31503 -117590 1613978 1252633
127 1252633 -987701 -1932821 -48460 1304281 -596416 -969980 -933297 209820 1047677 -498862
116 235191 -1308920 -1425347 -91652 -116004 -2871610 -10245 -129216 -1128230 -312062 -163824
106 -163824 502075 848706 -2041807 -672634 -95694 198446 116210 656815 564376 -425408
95 -333248 624077 -38886 -993301 -1012901 -2235433 -29664 1782013 -333680 1164171 -2601
84 -769336 -70582 -1016439 300550 850457 467141 170733 -1908806 -846019 401866 11988
73 -998668 -1858624 -599000 -1212266 1329761 -1305875 -715947 262850 495257 663574 -1058117
62 -1288974 395735 561883 309403 636599 -338804 -752027 -590439 -1548017 1181254 -836923
51 1216430 426636 134972 -465485 1181049 -302385 -554254 1824765 921448 -580854 -69042
40 -301046 -973145 -2013291 -969485 -1537189 -229937 55376 -2080078 10332 482579 -1252501
29 1204441 -1244250 -1198110 -357460 -494425 -1758957 252689 1718965 -188597 -1866905
20 -1866905 -1918210 459870 1219076 -301716 -2991 1996332 -285251 -983788 -1738275 -813260
9 695523 159607 -252622 -990482 -1580326 -244317 2006748 -701748 2917530 -196988
##END=
