##TITLE=1307
##JCAMPDX= 6.0         $$ Bruker NMR JCAMP-DX V2.0
##DATA TYPE= NMR SPECTRUM
##DATA CLASS= XYDATA
##ORIGIN= NUTS EXPORT
##OWNER= Administrator
$$ 1.72 TOPSPIN		Version 2.1
$$ 2016-02-23 12:18:31.965 -0800  Administrator@X
$$ Compression mode = diff/dup
##.OBSERVE FREQUENCY= 90.275459
##.ACQUISITION MODE= SIMULTANEOUS (DQD)
##.ACQUISITION SCHEME= undefined
##.AVERAGES= 16
##.DIGITISER RES= 22
##SPECTROMETER/DATA SYSTEM= 
##.PULSE SEQUENCE= zg30
##.SOLVENT NAME= None
##.SHIFT REFERENCE= INTERNAL, None, 1, 14.4659
##AUDIT TRAIL= $$ (NUMBER, WHEN, WHO, WHERE, PROCESS, VERSION, WHAT)
$$ ##TITLE= Audit trail, TOPSPIN		Version 2.1
$$ ##JCAMPDX= 5.01
$$ ##ORIGIN= Bruker BioSpin GmbH
$$ ##OWNER= Administrator
$$ $$ E:/data/jwist/nmr/1307/1/pdata/1/auditp.txt
$$ ##AUDIT TRAIL=  $$ (NUMBER, WHEN, WHO, WHERE, PROCESS, VERSION, WHAT)
(   1,<2016-02-23 08:31:39.855 -0800>,<Administrator>,<X>,<jcamp>,<TOPSPIN 2.1>,
      <fromjdx created from
       E:\data\jwist\nmr\uniandes\1307
       data hash MD5: 8K
       57 40 44 46 E1 53 AF A2 A6 CD 2C 8B CB 6E 28 E9>)
$$ ##END=
$$ 
$$ $$ hash MD5
$$ $$ 61 FD 18 03 F7 7B F8 7F 81 85 93 4B C2 AA 0D CF
##$RELAX= 
$$ Bruker specific parameters
$$ --------------------------
##$DU= <E:>
##$EXPNO= 1
##$NAME= <1307>
##$PROCNO= 1
##$TYPE= <nmr>
##$USER= <jwist>
##$ACQT0= 0
##$AMP= (0..31)
100 100 100 100 100 100 100 100 100 100 100 100 100 100 100 100 100 100
100 100 100 100 100 100 100 100 100 100 100 100 100 100
##$ANAVPT= 1
##$AQSEQ= 0
##$AQ_mod= 3
##$AUNM= <au_zg>
##$AUTOPOS= <>
##$BF1= 90.275459
##$BF2= 400.02
##$BF3= 400.02
##$BF4= 400.02
##$BF5= 400.02
##$BF6= 400.02
##$BF7= 400.02
##$BF8= 400.02
##$BYTORDA= 0
##$CFDGTYP= 0
##$CFRGTYP= 0
##$CHEMSTR= <none>
##$CNST= (0..63)
1 1 145 1 1 1 1 1 1 1 1 1 1 1 1 1 1 1 1 1 1 1 1 1 1 1 1 1 1 1 1 1 1 1 1
1 1 1 1 1 1 1 1 1 1 1 1 1 1 1 1 1 1 1 1 1 1 1 1 1 1 1 1 1
##$CPDPRG= <>
##$CPDPRG1= <>
##$CPDPRG2= <>
##$CPDPRG3= <>
##$CPDPRG4= <mlev>
##$CPDPRG5= <mlev>
##$CPDPRG6= <mlev>
##$CPDPRG7= <mlev>
##$CPDPRG8= <mlev>
##$CPDPRGB= <>
##$CPDPRGT= <>
##$D= (0..63)
0 1 0 0 0 0 0 0 0 0 0 0 0 0 0 0 0 0 0 0 0 0 0 0 0 0 0 0 0 0 0 0 0 0 0 0
0 0 0 0 0 0 0 0 0 0 0 0 0 0 0 0 0 0 0 0 0 0 0 0 0 0 0 0
##$DATE= 0
##$DBL= (0..7)
120 120 120 120 120 120 120 120
##$DBP= (0..7)
150 150 150 150 150 150 150 150
##$DBP07= 0
##$DBPNAM0= <>
##$DBPNAM1= <>
##$DBPNAM2= <>
##$DBPNAM3= <>
##$DBPNAM4= <>
##$DBPNAM5= <>
##$DBPNAM6= <>
##$DBPNAM7= <>
##$DBPOAL= (0..7)
0.5 0.5 0.5 0.5 0.5 0.5 0.5 0.5
##$DBPOFFS= (0..7)
0 0 0 0 0 0 0 0
##$DE= 6.5
##$DECBNUC= <off>
##$DECIM= 2432
##$DECNUC= <off>
##$DECSTAT= 4
##$DIGMOD= 1
##$DIGTYP= 12
##$DL= (0..7)
0 120 120 120 120 120 120 120
##$DP= (0..7)
150 150 150 150 150 150 150 150
##$DP07= 0
##$DPNAME0= <>
##$DPNAME1= <>
##$DPNAME2= <>
##$DPNAME3= <>
##$DPNAME4= <>
##$DPNAME5= <>
##$DPNAME6= <>
##$DPNAME7= <>
##$DPOAL= (0..7)
0.5 0.5 0.5 0.5 0.5 0.5 0.5 0.5
##$DPOFFS= (0..7)
0 0 0 0 0 0 0 0
##$DQDMODE= 0
##$DR= 22
##$DS= 2
##$DSLIST= <SSSSSSSSSSSSSSS>
$$ [...]
##$SPOFFS= (0..31)
0 0 0 0 0 0 0 0 0 0 0 0 0 0 0 0 0 0 0 0 0 0 0 0 0 0 0 0 0 0 0 0
##$SUBNAM0= <"">
##$SUBNAM1= <"">
##$SUBNAM2= <"">
##$SUBNAM3= <"">
##$SUBNAM4= <"">
##$SUBNAM5= <"">
##$SUBNAM6= <"">
##$SUBNAM7= <"">
##$SUBNAM8= <"">
##$SUBNAM9= <"">
##$SW= 20.5580556627758
##$SWIBOX= (0..15)
0 0 3 4 0 0 0 0 0 0 0 0 0 0 0 0
##$SW_h= 8223.68421052631
##$SWfinal= 0
##$TD= 65536
##$TD0= 1
##$TE= 300
##$TE2= 300
##$TE3= 300
##$TEG= 300
##$TL= (0..7)
0 120 120 120 120 120 120 120
##$TP= (0..7)
150 150 150 150 150 150 150 150
##$TP07= 0
##$TPNAME0= <>
##$TPNAME1= <>
##$TPNAME2= <>
##$TPNAME3= <>
##$TPNAME4= <>
##$TPNAME5= <>
##$TPNAME6= <>
##$TPNAME7= <>
##$TPOAL= (0..7)
0.5 0.5 0.5 0.5 0.5 0.5 0.5 0.5
##$TPOFFS= (0..7)
0 0 0 0 0 0 0 0
##$TUNHIN= 0
##$TUNHOUT= 0
##$TUNXOUT= 0
##$USERA1= <user>
##$USERA2= <user>
##$USERA3= <user>
##$USERA4= <user>
##$USERA5= <user>
##$V9= 5
##$VALIST= <valist>
##$VCLIST= <CCCCCCCCCCCCCCC>
##$VD= 0
##$VDLIST= <DDDDDDDDDDDDDDD>
##$VPLIST= <PPPPPPPPPPPPPPP>
##$VTLIST= <TTTTTTTTTTTTTTT>
##$WBST= 1024
##$WBSW= 4
##$XGAIN= (0..3)
0 0 0 0
##$XL= 0
##$YL= 0
##$YMAX_a= 1326140800
##$YMIN_a= -2047383.04
##$ZGOPTNS= <>
##$ZL1= 120
##$ZL2= 120
##$ZL3= 120
##$ZL4= 120
##$ABSF1= 10
##$ABSF2= 0
##$ABSG= 5
##$ABSL= 3
##$ALPHA= 0
##$AQORDER= 0
##$ASSFAC= 0
##$ASSFACI= 0
##$ASSFACX= 0
##$ASSWID= 0
##$AUNMP= <proc_1d>
##$AXLEFT= 0
##$AXNAME= <>
##$AXNUC= <off>
##$AXRIGHT= 0
##$AXTYPE= 0
##$AXUNIT= <>
##$AZFE= 0.1
##$AZFW= 0.1
##$BCFW= 1
##$BC_mod= 2
##$BYTORDP= 0
##$COROFFS= 0
##$CY= 15
##$DATMOD= 1
##$DC= 2
##$DFILT= <>
##$DTYPP= 0
##$F1P= 0
##$F2P= 0
##$FCOR= 0.5
##$FTSIZE= 0
##$FT_mod= 4
##$GAMMA= 1
##$GB= 0
##$INTBC= 1
##$INTSCL= 1
##$ISEN= 128
##$LB= 0.3
##$LEV0= 0
##$LPBIN= 0
##$MAXI= 10000
##$MC2= 0
##$MEAN= 0
##$ME_mod= 0
##$MI= 0
##$NCOEF= 0
##$NC_proc= -9
##$NLEV= 6
##$NOISF1= 0
##$NOISF2= 0
##$NSP= 1
##$NTH_PI= 0
##$NZP= 0
##$OFFSET= 14.4659
##$PC= 1
##$PHC0= 0
##$PHC1= 0
##$PH_mod= 0
##$PKNL= yes
##$PPARMOD= 0
##$PPDIAG= 0
##$PPIPTYP= 0
##$PPMPNUM= 2147483647
##$PPRESOL= 1
##$PSCAL= 4
##$PSIGN= 0
##$PYNMP= <proc.py>
##$REVERSE= no
##$SF= 90.2741531028323
##$SI= 8192
##$SIGF1= 0
##$SIGF2= 0
##$SINO= 400
##$SIOLD= 32768
##$SPECTYP= <>
##$SREGLST= <1H.CDCl3>
##$SSB= 0
##$STSI= 0
##$STSR= 0
##$SW_p= 1497.18866228788
##$SYMM= 0
##$S_DEV= 0
##$TDeff= 0
##$TDoff= 0
##$TI= <>
##$TILT= no
##$TM1= 0
##$TM2= 0
##$TOPLEV= 0
##$USERP1= <user>
##$USERP2= <user>
##$USERP3= <user>
##$USERP4= <user>
##$USERP5= <user>
##$WDW= 1
##$XDIM= 8192
##$YMAX_p= 1326140416
##$YMIN_p= -2046976
##$CURPLOT= <PDFCreator>
##$CURPRIN= <$PDFCreator>
##$DFORMAT= <normdp>
##$LAYOUT= <+/1D_H.xwp>
##$LFORMAT= <normlp>
##$PFORMAT= <normpl>
##$SURQMSG= 1
$$ End of Bruker specific parameters
$$ ---------------------------------
##XUNITS= HZ
##YUNITS= ARBITRARY UNITS
##XFACTOR= 0.182762287876938
##YFACTOR= 1
##DELTAX= -0.182762287876938
##NPOINTS= 8192
##FIRSTX= 1497.0059
##FIRSTY= 63488
##LASTX= 0
##MAXY= 1326140416
##MINY= -2046976
##XYDATA= (X++(Y..Y))
8191 63488 -235520 338944 -261632 -139264 -111104 469504 424448 -3584 -126464 -174080 144384
8179 90624 -591360 26624 103936 221696 -291328 -298496 -201728 -169472 202752 -67584 -1029120
8168 -1029120 -654336 -985600 -1184768 -47616 99840 546816 58880 -38912 -788480 -1363968
8158 -1363968 -815616 -462848 -79360 495616 -113152 -910336 600576 -244224 -96256 -251904
8148 -251904 -11776 -578048 -123392 441344 -205312 -335360 -513024 345088 -165888 -727040
8138 -727040 47104 227328 903168 567296 -264704 514048 24064 -305152 -159232 296448
8127 457216 287744 -393728 -112640 156672 -373760 -262144 481792 -452608 112128 396288
8117 396288 -165888 127488 -209408 -705024 217600 -291840 -1134592 -351744 -363008 -135168
8106 295424 -247296 -26112 -328704 -182272 -886784 908800 352256 677376 487936 -1059840
8095 -483840 453632 221696 -598528 192000 -493056 -261632 -400896 611328 -561152 445440
8084 -155648 599552 31744 -256512 -232960 145408 -927744 471040 -652288 615936 53248
8073 -190464 -184320 -366592 -13824 -444416 -917504 -146432 -103936 -746496 -710656 568320 -117760
8061 -436224 68608 357888 226304 43008 2048 -440320 -190464 973312 17920 312320 549376
8050 549376 450560 -233472 -1536 -706560 61440 -126464 1100288 397824 -1057280 1145344
8039 -1148928 -340992 -584704 -588800 -117248 -140800 -46592 -580096 -472064 136192 -275968
8028 507904 -590848 223232 249856 105472 276992 -453120 541184 710656 -422912 -51712
8017 436736 72704 124928 -717312 -327168 -295936 -178176 75264 373248 102912 -330752
8006 -812544 441344 -884224 82944 -624128 330752 -188416 -508416 -527872 -1038336 -315392
7995 -580096 510976 164352 -71168 -224768 799744 160768 -15872 302592 -359936 417280
7984 -578048 -1351680 259072 -527360 889344 324096 435200 560640 -629248 -120832 -804864
7974 -804864 -606208 142336 -156672 -47616 -400384 -523776 -615424 -28160 -709120 581632
7963 231424 262144 -1061376 542720 -194560 50176 217088 797184 -46080 -475136 -48128
7952 988160 -85504 800256 -1051648 -521728 169472 -153600 284160 252928 -1352704 -241152
7941 -793088 -918016 -287232 -72192 -1376256 -343552 -686592 84992 130560 373248 1176576
7931 1176576 168448 183808 193024 123904 699392 -550400 -164352 802816 -208384 551936
7920 -801280 -59904 -142848 -1072128 400384 -402432 272896 340992 275456 695808 398336
7910 398336 -344576 -88576 -338432 61440 552448 -605696 -1339904 -566784 145920 635392
7900 635392 -311296 -757248 -398848 1060864 -630784 944128 -157696 963584 -491008 137728
7889 98304 -415744 453632 -67584 -521728 318976 -922112 -20992 626688 342016 55296
7878 -648704 -700416 -502272 572416 27136 -288256 -277504 -281088 -658944 316416 112640 364032
7867 364032 178176 225792 81408 116224 96256 -128000 1148416 611840 312832 -418304
7856 -442368 -848896 392704 -65024 397312 -330752 -142336 827392 639488 584704 -327168
7845 -423936 -9728 922112 -220160 909824 -165376 -429568 80896 -569344 275456 -879104
7834 438784 678400 614400 15872 -1017344 22016 -979456 223232 35328 266752 922624
7824 922624 9728 343552 1077248 -329728 929280 -672256 1062400 -284160 925696 809984
7814 809984 465408 -510464 598016 -54272 -371200 -327168 -56320 -986624 -370176 -357376
7804 -357376 -136704 546304 94208 -1141248 -41984 -352256 -220160 378368 -278016 -83456
7793 48640 122880 293888 515584 -782848 -1164800 -332800 -881664 -240640 311808 -281088
7782 -313856 -191488 118272 -206848 320000 29184 -229376 178176 306176 -88576 -318976
7772 -318976 31232 463872 43008 26624 458240 528896 -426496 -717312 453632 -521216
7761 -367104 -652800 -346624 61952 -1113600 -1244672 324096 238080 370176 88064 -447488
7750 -31232 -254976 -412160 -154624 538112 -61952 -211968 -176640 190464 792064 354816
7739 465920 287744 769024 341504 628224 -394752 -189952 379904 -466432 141824 523264
7729 523264 -944640 595456 -615424 -630272 139776 1047552 -371200 -417280 563200 -3072
7718 116224 478720 176640 -10752 -780800 -791552 -239104 -487424 -67584 -491520 -74240
7707 -653312 -131584 -269312 -755200 -36864 336896 -935936 499200 -291840 -17408 348160
7696 806912 220672 885760 -93184 -275968 185856 -129536 23040 -113664 -561664 -727552
7686 -727552 243200 410624 -721408 36352 -32768 56832 100352 -636416 560640 -287744
7675 472576 -5632 503808 992768 -604160 171008 323584 232448 2560 -628224 -152064 154112
7663 554496 16384 247296 61440 -478720 100864 -308736 -349696 -47616 -162816 102400
7652 713728 -586240 -801792 -396288 376832 200192 -1575936 430592 -131584 220160 679424
7642 679424 936448 59904 265216 -364032 461824 195072 -424448 -33280 -626176 -481280
7632 -481280 655872 -305664 532480 -262656 -18944 567296 72192 499200 366080 600576
7622 600576 -367616 -128512 -163840 140800 151552 -266240 783872 426496 64512 381952
7612 381952 490496 167936 -1028096 -104448 108544 -505344 -117248 599040 452096 -413184
7601 -317440 697344 363008 -475648 -76288 -230400 -2560 745472 220672 -188928 189952
7590 796672 -95232 1008640 -259072 -512512 -381952 757760 -360960 210432 488448 607232
7580 607232 451072 -233472 793600 -273408 528384 -334848 -491520 -643072 -48640 408576
7569 261120 314880 -440320 688128 1334272 -324096 368640 139264 -523264 -102912 877568
7558 574464 4096 -380416 -71168 -159232 781312 -335872 218624 -943104 20480 1006592 145920
7546 -473600 -29696 -806912 -35840 872960 -156160 -594944 627712 -619008 124416 416256
7536 416256 572928 993280 109568 172544 594944 356864 -141312 845312 319488 -537600
7525 -414208 -1154048 -528896 1104896 1113600 4608 -494080 798720 -334336 -712704 -309248
7514 569344 130560 -301568 -218624 -381440 -379392 159232 -569856 573952 736256 -799232
7503 -136704 729088 230912 249344 -174080 889856 321536 -102400 -379392 -55808 -1085440
7493 -1085440 909312 546816 762368 301568 -204800 681472 -856576 -238592 529920 1015808
7483 1015808 -460288 -105984 156672 -466432 -204800 -417280 318976 56320 769024 625152
7473 625152 -484864 -200192 -362496 860672 386048 465408 161280 772608 69632 719872
7463 719872 -439296 -12288 705536 -599552 -386560 -613888 -95744 -782336 -644608 -662528
7453 -662528 633856 498176 -594432 -455168 550912 -449024 226304 54272 -64000 -566272
7443 -566272 -1208832 -262656 705024 -321024 -745472 -25600 122880 477184 -23040 920576
7432 -269824 -603136 379904 -38400 595968 1727488 -222208 -203264 128512 572928 298496
7422 298496 497152 48128 187392 382464 550912 -320512 356352 138240 -372224 483328
7411 28160 -303616 -614912 -338944 110592 -243200 381952 562688 -55808 260096 -30208
7400 24064 302080 -558080 -204800 137728 323072 39424 -184832 -709632 198656 690688
7390 690688 649728 534016 -478208 -382976 576000 494592 -278528 886272 134144 265728
7380 265728 790016 575488 -189440 -343552 789504 556032 480256 -689152 -188416 -464384
7370 -464384 -176128 387072 -250880 541184 964608 653312 -459264 518656 -488448 1095168
7359 -291840 115200 -198144 565248 -302592 -512 281088 -722944 103424 -400384 -373248
7349 -373248 321536 435712 235520 347648 190464 -5120 1113600 949248 228352 -172544
7338 68608 421888 -249856 1347072 767488 284160 253952 495104 1238016 -129024 786432
7327 553472 -620032 -602112 -794624 370688 446464 154112 505856 634880 -95744 -233984
7317 -233984 -578560 45056 910336 98816 883712 239616 -362496 808448 784896 -888320
7306 -29696 381952 240640 -55808 53760 -48128 370688 97280 624128 546304 -102400 -221184
7295 -221184 34816 38400 741888 519168 -116224 375808 -103936 914944 184320 521728
7285 521728 -370688 -307200 -140800 17408 352768 -5632 -385024 -722432 600064 2048 466944
7274 466944 -56320 246272 -8704 141312 324096 351744 121856 -222208 284160 581120
7264 581120 777728 735232 814592 -149504 679936 -73728 909824 513536 506880 446464 1029632
7253 1029632 431104 621056 -628224 -866816 261632 583168 675328 895488 -1123328 407040
7242 65024 851456 -947712 -588288 292864 126464 -510976 483328 -20992 595968 167936
7231 -1088000 -80384 189440 511488 165888 -525824 279040 -15872 988672 -28672 127488
7220 143872 -1048576 1071104 44032 173056 427520 1085440 -71168 -151040 1108992 -57344
7209 272896 920576 755712 552448 -129536 628736 645120 1158144 270336 331776 709120
7199 709120 91648 1066496 -20480 -175104 -346624 526336 -196096 74752 -242688 275968
7188 -87040 494592 -283648 -475136 637440 1196544 -28160 -516096 1025024 -357376 -31744
7177 741376 -882688 46080 224256 508416 -588288 480768 243200 -1024 -239616 884736
7166 -320512 488960 1016832 151552 -328192 -107520 755712 936960 1024000 -730624 -880128
7156 -880128 255488 605184 1112064 595456 967680 1505280 -509440 280064 69120 922112
7146 922112 -272384 -87040 -754688 899584 151040 86016 300032 311808 -184832 53248
7135 355328 398336 120320 -322560 -465920 926208 -481792 407040 1026048 392192 292352
7125 292352 19456 634880 1172480 622080 -798208 106496 712704 137216 -222208 254976
7114 453120 -204800 -43008 297472 858112 680960 477184 497664 562688 169984 233984
7104 233984 557056 1032704 374272 378880 872448 -346112 829440 445952 564224 320000
7094 320000 -766976 247296 437248 -84480 848384 379904 -724480 235520 663040 142336
7083 -585728 -189440 202240 148480 -186368 812544 -187904 -79872 373760 482816 595456
7073 595456 105984 -105984 189440 308224 310784 49664 -444416 -363008 825344 478720
7063 478720 884736 -173056 424448 611328 -115200 811520 -238080 -216064 126976 337920
7053 337920 30720 -529408 517632 -714752 851456 297984 140288 -732672 714752 1087488
7043 1087488 -145920 757760 926208 -151040 830976 229376 62464 -510976 220672 -317440
7032 -232960 1474048 -59904 434688 35328 -512512 -154112 1015808 326144 -325120 -208896
7022 -208896 35328 320512 -46592 928256 620544 -438272 95744 117248 464896 -115200
7011 584704 -692224 -30208 -78336 1047040 214016 427008 1205248 941056 263680 133120
7001 133120 1061376 -387072 363520 -629248 -213504 -570880 597504 68096 -524288 941056
6990 210944 56320 542720 843264 34816 -251392 278528 -89088 678912 385536 74240
6979 1179648 264704 -290304 722944 649728 -498176 -1321984 -825856 559104 -455680 786432
6968 -551936 536064 -502272 549888 1082880 459264 259584 62464 -260608 671744 744448
6958 744448 -613376 294912 -59392 79360 502784 93696 215040 -457216 1200640 -1170944
6947 -321024 68608 630272 726016 -879616 747008 631296 -270848 483328 528384 558080
6937 558080 577024 892928 -111104 -54272 232960 -270336 174080 -548352 282624 893952
6927 893952 4608 155648 783872 167936 -566784 935424 462336 876544 -457216 303616
6916 -1399808 -491520 -425472 253952 49152 295936 -456704 240640 140288 -169984 834048
6905 -124416 -1002496 878592 133120 743936 779776 269312 -218112 1157120 437248 1284096
6895 1284096 812544 197632 1238016 275456 52224 241664 655360 1297920 888320 -180224
6884 334336 1290752 -263680 85504 1084416 407040 1023488 481280 250368 -243200 -125952
6874 -125952 -334848 624128 402432 761856 1528320 997888 409088 -269312 60416 -851968
6863 342528 343552 701952 -240128 -259584 759296 -361984 112128 142336 1049088 -374784
6852 -59904 -450560 87552 -112128 283136 -92672 144896 -65024 240640 -112640 -12288 543232
6840 682496 396800 425984 483840 916480 627712 -999936 720896 614400 861696 1188864
6830 1188864 -19968 272896 48640 -114688 1039360 1653248 1349632 413184 145408 456704
6820 456704 200192 435200 703488 -187904 -264704 -1252352 -106496 253440 -522240 -541184
6810 -541184 680448 814080 219136 243200 899072 473088 240128 141312 877568 204800
6799 -420864 939008 913920 -189952 1405952 419328 893952 -11776 -282112 940032 1251840
6789 1251840 237568 -70656 1350144 1059840 -344064 651776 435712 86528 665600 -612352
6778 -128512 1380352 1203200 19456 424448 179200 402432 456192 -238592 158208 399872
6768 399872 688128 -700416 -594432 425984 -147456 427520 715264 521216 -36864 226816
6757 527872 566784 229376 -130560 266240 36352 -635904 930304 -524288 139776 9216
6746 208384 557056 458752 516608 65536 345600 -305152 86016 352256 591872 -40960 -560640
6735 -560640 1049600 839168 940032 -688128 317952 -533504 -169472 1125888 224768
6725 246784 -185856 308736 675840 -90112 94208 -246784 258560 2048 -271872 702976
6714 1137664 -78848 267264 652800 206336 82944 -467456 1594880 111104 527872 188416
6703 -248320 329216 1262592 1117184 1242624 -458240 53248 621056 611840 1191936 596480
6693 596480 733696 815616 -533504 -61952 465408 545792 -601600 819200 465408 -335872
6682 537088 645120 534528 758784 410624 451072 -163328 1017344 325632 969216 296448
6671 632320 827392 -14336 723456 65024 -579072 572416 238080 1020928 216576 1238528
6661 1238528 248320 1189376 276480 -469504 763904 210432 1039872 48640 502272 34816
6650 434176 632320 530944 557056 -70656 1042944 130048 515584 -366080 309760 92672
6639 42496 -33280 -346112 406528 -179200 159232 702464 404992 180224 -141312 231936
6628 908288 473600 483328 1113600 -241664 607232 3584 -308736 -931328 50688 1150976
6618 1150976 -78848 977920 742912 -73728 266240 617984 461824 -408064 1413632 -71680
6607 60416 -291328 817152 -300032 -191488 531968 -706560 788992 -113664 -12288 953344
6596 666112 -515584 1862144 549376 297472 252928 -89600 214528 768000 -310784 672768
6585 -415744 208384 326144 1354752 -29184 16384 39936 1304064 915968 110080 497152
6575 497152 -38912 611840 -413184 -406016 -205824 -71168 357888 -701440 99328 1304064
6565 1304064 -635392 249344 180736 1604608 346112 233472 468992 1073664 958464 627200
6555 627200 -578560 526848 358400 1244160 -845824 692224 922112 106496 955392 1046016
6545 1046016 448512 -238592 -20992 81408 -528896 1196032 865792 966656 516096 356352
6535 356352 460288 -421376 1187840 441856 509440 1212416 1361920 -45056 64000 440320
6525 440320 58368 -336896 1223168 462848 190976 -696832 -399360 -132096 121344 927232
6515 927232 270336 -157184 735232 1182720 -20480 208896 755200 356352 226304 540160
6505 540160 735744 726016 585728 688128 386560 735744 -105984 676352 554496 -299008
6494 -619520 578048 1255424 -64000 -415232 -106496 -122880 675328 244224 -59392 1222656
6483 76800 450048 584192 -7168 112640 1300480 -121344 548352 543232 -54272 378880 386560
6472 386560 406528 601088 -414720 445952 -37888 925696 396800 791552 -155648 -10240
6461 689664 1195008 691200 619008 -135680 187904 -422400 -164352 318976 592384 977408
6451 977408 431616 52224 593920 220160 -227840 117248 148480 -186880 112640 165376
6441 165376 258560 -149504 -289280 515072 438784 632832 838656 232960 -5120 -273920
6431 -273920 -504832 1039360 77824 1143296 562688 596992 120320 -216064 -550912 -47616
6420 -228864 672768 141824 -236032 -585216 224768 1663488 445440 -575488 1094656
6410 538112 940544 578560 993792 394752 628736 1547264 598528 53760 -114688 1060352
6399 1594880 955392 -333824 428032 974848 890880 633856 837632 877568 281600 -174080
6388 -108544 980480 637440 233984 93184 177664 -73728 -526848 811520 -1536 301056 878592
6377 878592 724992 136704 666112 466944 -219648 2152960 981504 1961984 204800 187392
6367 187392 671744 914432 555008 719872 -541696 556032 1212416 655360 462336 -732160
6356 -115712 264192 974848 447488 1292288 78336 1039872 566784 -393216 705536 763904
6346 763904 723456 914944 631296 54784 165376 157184 1485312 52736 -6144 1134080 -224768
6334 969728 0 677376 92672 1415680 745472 -304128 338944 885760 296960 -87040 942592
6322 -15360 -229376 599040 854528 -12800 914432 958976 654336 1006080 1650176 -591872
6311 807936 855040 1202176 99840 872960 -71168 710656 841728 1706496 312832 97280
6300 123904 503296 -109056 1318400 493568 227840 644608 364544 -276992 759808 154112
6289 688640 1040384 1501696 984064 196096 763904 879104 53248 1541632 -36864 934400
6278 570880 1316352 715264 897024 117248 437760 1048064 -479232 349696 667136 -27648
6267 1102336 1341440 1273344 5120 772608 802304 1697792 8704 848384 -135680 353792 771584
6256 771584 614912 -69632 1605120 1871872 -159744 1814528 1251840 421888 -530432 269312
6245 487424 320000 1326592 247296 1141760 593920 353792 869376 393216 -406016 1326080
6234 1020928 -197120 -111104 824320 663040 453120 2037760 1076736 471552 -81408 1077248
6223 896512 583168 327680 524288 1241088 -233472 933888 832512 1220608 421376 -201728
6212 648192 398848 844288 414208 507392 963072 552960 278528 882688 836608 701952
6202 701952 188928 552448 -129536 2301952 -136704 924160 647680 896512 509440 995840
6192 995840 546816 790528 679936 721408 916480 622592 1124864 578560 44544 637952
6182 637952 -89600 736768 380928 1491456 1131008 531968 1601536 -411648 827392 577536
6172 577536 -153600 971264 1041920 1466368 323072 932352 822272 1130496 969216 326656
6161 850944 -114688 662016 -282112 670208 850432 376832 379904 680960 1110528 897536
6151 897536 1628672 504832 716288 1285632 918528 292352 568320 32256 1168384 577536
6140 418304 924672 948224 1025536 219648 318976 1261568 174080 856576 647680 899072
6130 899072 1304576 49152 152064 401408 998400 506368 588288 800768 489472 819200
6120 819200 -176640 974336 1212416 -176128 -3072 454144 292864 802816 1737216 177152
6109 598016 1082880 524288 201728 985088 60416 235008 651264 20480 6656 -541184
6098 1465344 1476096 1258496 1713664 1311744 350720 1123328 359424 591872 363520 1287168
6088 1287168 1121792 640000 309760 367616 782848 569344 112640 1392640 998912 1857024
6078 1857024 1102848 1059328 620544 774656 886272 322048 129536 657920 1091072 923136
6068 923136 985600 529920 863232 -1003520 1196544 553472 1330688 177664 1139200 759808
6058 759808 910336 1128448 811520 -61952 260608 1062912 1301504 1080832 83968 409600
6048 409600 547840 621056 111616 1137664 1258496 1253888 1483776 829952 942592 771584
6038 771584 957440 798720 971264 680960 173056 1153024 112128 385024 -142336 -512
6027 115200 668672 334848 1171968 718336 723456 -75264 757248 416768 366592 619008
6017 619008 506368 641536 -435200 181248 853504 837120 1862144 1935360 1133056 1089024
6007 1089024 797184 1185280 75776 1293824 883200 1305088 758272 614400 -558080 322048
5996 1168896 828928 1230336 122880 1544704 1354240 745984 175104 941056 602624
5987 602624 1248256 881664 307712 214016 757760 775168 1265152 414720 386560 539136
5977 539136 1222144 560128 1296896 836096 467968 1331712 408576 781824 411136 907776
5967 907776 1904640 1106432 1210368 689664 1591808 389632 885248 84480 772096 162304
5956 496128 1122816 729088 1055232 2119680 1159168 1028096 410624 1725440 163328
5946 1198592 408064 651264 608256 1206784 2240512 -248832 247296 1463296 1207296
5937 1207296 321536 1520640 1115136 539648 1404416 919040 344576 1202688 980992
5928 980992 1340416 716288 675328 1703424 442368 222208 514560 1333248 423424 1087488
5918 1087488 570880 1752576 1257472 1195008 738304 1138688 -127488 823808 1625088 -329728
5907 708096 555520 1445888 710656 773120 926208 721408 1040896 1172992 666624 1120768
5897 1120768 512512 571392 1349120 1519104 396800 806400 100864 923136 1593344 508416
5886 374784 1618432 464896 480256 592896 1203712 609280 1148928 1019904 473088 1140736
5876 1140736 1622016 829440 986112 678912 268288 833024 845824 838144 988672 -116736
5865 1126912 -243712 1011200 -46080 1449472 1968128 912384 604160 1400320 241152
5855 1588224 1614848 893440 865280 1314816 1328128 1238528 1274880 605696 1242112 854528
5845 854528 1659392 353792 955904 151040 523776 898048 480768 1194496 820224 1077760
5835 1077760 826880 -8704 967680 1248256 961536 991232 619008 892416 871424 511488
5825 511488 1269248 -550912 1434624 638976 488448 52224 650752 540160 557568 1759744
5815 1759744 850944 1536000 211968 861184 538624 1618944 1055232 332800 1396736
5806 1396736 361472 1089536 840192 894464 1249792 984576 1235968 1060864 643072 1135104
5796 1135104 201216 959488 977408 1648640 1212416 835584 937984 918016 1339904 1463808
5786 1463808 1263104 1160704 920576 496640 1214976 1170432 858624 373248 837632 1050112
5776 1050112 474112 834048 -31744 1834496 2084864 553472 1337856 1384960 1847808 324608
5765 1081856 1169920 696320 333824 617984 1116160 338944 1083392 614912 1461248 1046528
5755 1046528 974336 520192 793600 2361856 1551872 884736 1589248 417280 1073664 350720
5744 707072 -401920 326144 990720 1299456 915968 1562624 489472 965120 318464 469504
5734 469504 1153536 629248 417792 330752 393728 14848 1110016 287232 1886720 1214464
5724 1214464 1225216 467456 996352 1266176 457216 1672192 1234432 730624 -119296 351744
5713 622080 850432 761856 1435648 1523200 722432 714752 1711616 1139200 231936 1226752
5703 1226752 481792 1502208 1172480 1655296 1253376 1282048 648192 723456 986624 1154048
5693 1154048 154112 817664 1618944 344064 1635328 1915904 62464 612864 722432 689664
5683 689664 1062912 701440 617984 566784 1231360 499712 1048576 8704 859648 881664 103936
5671 1134592 1743872 114176 581632 818688 1315328 1195008 338432 53248 1379840 890368
5661 890368 192000 702976 1435648 726528 867840 741376 1976320 374784 671744 1124352
5651 1124352 512000 985600 510464 541184 772096 477696 1323008 783360 932352 1717760
5641 1717760 623616 1436160 354816 1369088 1069056 1096704 1226240 423936 896000 1314816
5631 1314816 558080 1417728 1277952 418816 633856 651776 409600 193024 536064 638464
5621 638464 39424 1398272 550400 1537024 1921024 736768 2245632 1008128 1611264
5612 1611264 1340928 627712 1607680 400384 1088000 1288704 1313792 1213440 1979392 1944576
5602 1944576 981504 1110016 1364992 945152 1629184 1652736 1347072 531968 1797120 1539584
5592 1539584 1908224 862720 1406464 1747968 1174016 1528832 1502720 2302464 1094656 1895936
5582 1895936 1551360 1216000 1575936 1020928 1230848 1587200 623104 1571840 1577472 1340416
5572 1340416 1707008 140288 731648 905216 453120 1569792 871936 1761792 674304
5562 847872 1017856 776192 1283072 300544 1125888 569344 1644544 1547776 620544 714752
5552 714752 1034752 1911296 1675264 498176 653312 2017792 1059840 518656 577536 1106432
5542 1106432 1530368 987648 610816 1052160 438784 1106944 1818112 803840 1323520 300032
5531 951296 977920 867328 495616 1649664 929792 444928 732672 1502720 1072640 613376
5521 613376 1498624 1709568 483840 1262592 1330688 1439232 587776 675840 1202688 713728
5511 713728 1124352 295936 1484288 931840 665088 1753600 495616 932352 865280 1610240
5501 1610240 923136 1449984 1655296 318976 401408 886272 657408 1568768 791552 504832
5491 504832 1773056 678400 658432 1095168 1444864 1247744 1180672 1689088 1254400 862720
5481 862720 1418752 1503232 1156608 2976256 2236416 1470464 1695232 1663488 1513472 1713664
5471 1713664 1989632 1527808 1561600 1050624 1555456 926720 1854464 633344 1779712 789504
5460 1949696 1278976 1498112 1164288 1841152 1038848 2475520 892928 2364928 2514944
5451 2514944 1200640 1992192 2421760 1098240 1397248 1332736 2288128 2004480 1948160 2307584
5441 2307584 476672 2791424 821760 2197504 1724928 1885184 1131008 1533952 1700864
5432 1700864 1278464 1584640 1586176 1817088 1626624 1877504 1504256 2390528 1964032 1064960
5422 1064960 1966080 1415168 2454528 1479680 1541632 1719296 1332736 618496 1849344
5413 1849344 611328 833024 572928 1892864 1919488 2015232 1177088 2071040 1025536 1749504
5403 1749504 532992 973824 1606144 368128 1167360 1195520 1469952 700928 1067520 434176
5392 527360 1547776 1290240 945152 1476608 1561088 1242624 1182720 1561600 1394176 669696
5381 918016 1379840 854528 2177024 1793536 1150976 1649152 1189888 868864 1529344 977408
5371 977408 1731072 390656 1017344 1928704 687104 191488 1034240 1230848 1626112 1040384
5361 1040384 5120 1323008 1371136 809984 -331776 905216 1420800 887296 1910272 1679360
5351 1679360 1179648 1147392 1479680 1570816 1928192 1105920 668672 1001984 1722880 663552
5340 1160192 1666048 1366528 1242624 1416192 1271808 1321472 1357312 1699328 1293824 1289216
5330 1289216 1671168 986624 924672 1472000 1613312 1628672 709120 1674752 839168 2009088
5320 2009088 1382912 36352 1624064 1314304 1314816 1442816 65024 885760 829952 883712 837120
5309 837120 1603072 1100288 1320448 882176 1183744 1431552 2527232 568320 728576 1074688
5299 1074688 1949696 2228736 975872 1099776 1208832 466944 1528832 1070080 952320
5290 952320 545792 1193472 857600 1162240 913408 1583616 1261056 2339840 1050624
5280 1193984 728576 1874432 1875968 1503232 2322944 1092096 2077184 2328064 1007104
5270 1057792 2094080 626176 1221120 1377280 1697792 1051648 1263616 935424 1089536
5261 1089536 1209344 1184768 1682432 1159680 1948160 1412608 2370560 702976 1055232 2072576
5251 2072576 593920 916992 1902080 1277952 539136 1189376 284672 727552 1952768
5242 1952768 1232896 1785856 761856 1699840 1951744 893952 1796608 1701376 2207744 2289152
5232 2289152 2171904 783872 1564160 1799168 1132544 1519104 1596928 1019392 2050560 1193984
5222 1193984 1582592 704512 1938432 1055232 525824 1683968 1007104 296448 2330624
5213 2330624 1144320 2071552 1979392 2162176 1963520 1439232 1608192 1273856 1712640 527872
5202 1358336 503808 1584640 1651712 1041408 1358848 772096 2108416 1265152 897536
5193 897536 731648 2141696 1116160 1720832 2302976 821248 1778688 1848320 1615360 1440768
5183 1440768 1241600 1340416 1633280 1329152 1779712 1112064 2861568 2856960 2756096 2343936
5173 2343936 2924544 2302464 2619392 2945536 2888704 3932672 3700736 2792960 1635328
5164 1635328 3571200 2342400 2304512 1158656 1277440 1575936 2288640 1075200 838144
5155 838144 1826304 1621504 1703424 593920 1162752 1170944 1730560 1075200 1023488 1516544
5145 1516544 1596416 1086976 65024 834048 193024 1627648 891392 1080320 1819136 706560
5134 1297408 1183744 1413120 1137664 1287168 794624 1349120 803840 637440 2229760
5125 2229760 1022464 1565696 1484288 1190912 2003968 1050624 328192 169984 1498624
5116 1498624 1338368 1701888 842240 1442816 2134528 1312256 453632 1100800 1114112 2434048
5106 2434048 1251328 1125888 2281472 1759232 486912 1530368 2154496 1462272 1460224
5097 1460224 1742336 1803776 1922048 2234368 1309696 1266688 1623552 1748480 2008064 1408512
5087 1408512 1911296 2409984 1152512 1560576 1310208 1359360 1997824 1751552 1453056 1570816
5077 1570816 674304 2186240 1143296 991232 1776128 2490880 1060864 863744 973312
5068 973312 1457664 1509376 1043968 1933312 2171904 2193408 2309632 1800704 2176512 2081792
5058 2081792 1201152 1052672 2129920 1871872 1844224 1351168 1099776 2011136 1345536 2239488
5048 2239488 2369536 2670592 1752064 2140672 2164224 1255936 1116160 2010624 2273280 2384896
5038 2384896 2185728 1602048 1667584 1527808 1499648 1452032 2579456 2642944 2862592 1371136
5027 2063360 1778176 2532352 1570304 2947584 1697792 1939968 2067968 991744 2319360
5018 2319360 2883072 2771456 1863168 1905664 1951744 1610752 2518528 2336256 1914880 1825792
5008 1825792 1847808 1731072 2156032 1629696 1562624 2485760 1555968 1927168 1661440 1950720
4998 1950720 2078208 1344512 1946624 1392128 1816576 1102336 1844224 2824192 1361408
4988 1627136 2144768 1455104 2170880 2379776 1537024 2710528 1653248 1513984 1668608
4979 1668608 1960448 2185216 2550272 2075648 2216448 2459136 1244160 3182592 1856000
4970 1856000 2463232 2450432 1438720 1622528 1137664 2012672 1502720 1131520 2489856
4961 2489856 2132992 1814016 2522112 2162176 2363392 2565632 1732096 2710016 1648640
4952 1648640 1640448 2498560 2617344 2380288 2720768 2679296 2768384 1774080 2884096 2128896
4942 2128896 3044864 3120128 2093056 3476992 1700864 3328512 2920448 3571712 2913792
4933 2913792 2999296 3062272 3686912 2560000 4055552 5438976 5215232 5377024 5919232
4924 5919232 4976128 4391936 4562944 4036096 3283968 2212352 1648640 2382848 2424320 1888768
4914 1888768 1404416 2015744 2435584 1371648 1986048 2209280 2386944 1951232 1478656
4905 1478656 2027008 1867264 1454080 1798144 2510336 1728000 1104896 1410048 1462784 2206720
4895 2206720 2626560 901632 1757696 1805824 722944 2160128 1363968 2234368 1568768 1936896
4885 1936896 1085952 1788416 3139584 1530880 1853952 1392128 2143744 2071552 1481216
4876 1481216 1681408 1831424 2358784 2070528 2078720 1613824 820224 1693184 2059264 1553920
4866 1553920 2705920 2364416 2238976 1560064 2099712 2525184 1924608 1652736 1946112
4857 1946112 1493504 2439680 2015744 2161152 1678848 1816064 2325504 2011136 2379264 2057728
4847 2057728 1774592 2662912 2624000 1521152 1408512 1851904 2232832 2158592 2731008 2105856
4837 2105856 2601472 2097664 2628608 2496000 2249216 3131392 1827840 1453056 1740800
4828 1740800 1314304 1709568 3047936 1635840 2431488 2301952 1652224 1304576 2252800
4819 2252800 2570240 2450432 1759744 901120 1768960 2631168 1426432 1426432 1818112 2259456
4809 2259456 2103808 2280448 3011584 2220544 2187776 1726976 3255808 3178496 1586688 3536384
4799 3536384 1543168 1359360 1802240 1142272 1814528 2316800 1951744 2255872 2418176
4790 2418176 1252864 1718784 1410048 2074624 2399744 1675776 2323456 1500672 1681920
4781 1681920 2498560 2170880 1275904 1693184 2859520 2880512 2402304 2864128 2984448 3059200
4771 3059200 2469376 2393600 1849856 2602496 2224128 1668608 2294784 2787840 2143744 2702848
4761 2702848 2318336 1967104 2405888 2756608 2302976 3285504 3094016 2947584 2902016 2827776
4751 2827776 3338752 1889280 3548160 2551808 2440704 3126272 2262528 2701824 3734528
4742 3734528 2663424 4012544 2334208 2846720 2506752 2673664 1924096 1875456 2309632
4733 2309632 2690560 2750976 1622016 2946048 2132480 2605568 2600448 3443712 2746368 3167744
4723 3167744 1773056 2614784 2683392 3476992 2176512 3144704 2783232 2685952 3038208 3303936
4713 3303936 2404864 2426368 1502208 2693632 2157568 2350592 2902528 2714624 2645504 1618944
4703 1618944 2902016 2730496 3108864 2904064 3126784 1939968 2987008 2920448 2169344
4694 2169344 1071104 1769472 2254336 2812928 3161088 2201600 2436608 1992704 2544640
4685 2544640 2277376 2442752 2685952 1643008 3707392 1870336 2805248 2339840 3276800
4676 3276800 2345472 2277376 3051008 2900992 3023360 3154944 2991104 3918848 3258368 3849728
4666 3849728 3031552 3627008 3345920 2964480 3256832 2865152 3833856 3532800 3471360 3959808
4656 3959808 3410944 3563520 2834944 2007552 4004352 1888256 2688512 3283456 3225088
4647 3225088 1937408 2282496 2062848 2359808 3539968 2019840 2928640 2329088 3325952
4638 3325952 2844672 3239424 3488256 2493440 2713600 4312576 2568704 4013568 3489280
4629 3489280 4894720 3027456 4017664 2914816 3705344 3457024 3790336 4151296 2871808
4620 2871808 3191296 3234304 3482624 3963904 3382272 3456512 3285504 3897856 3951616 2918912
4610 2918912 3010048 2974720 2727424 3121152 2796032 2366976 2741248 2437632 2217472 2405376
4600 2405376 2799616 3009024 2159104 3187712 3633152 2510848 3128832 2549760 1680896
4591 1680896 2092032 897536 2168320 2042368 3436032 3154432 2188800 2169856 1908224
4582 1908224 2081280 2455552 2040320 3182592 2446848 2727424 2529792 2172416 2061824
4573 2061824 2622464 2766336 2563072 1789952 1400832 2727936 2598912 2741248 2539008
4564 2539008 3550720 1572864 2281984 2683904 2842112 1534464 2030592 3235840 2760704
4555 2760704 3418112 3346432 2093568 2024448 3794944 1907712 2855424 2952192 3223040 3660288
4545 3660288 2941952 3501568 3212288 3786752 4414976 3198976 3129856 3263488 3632128 3429376
4535 3429376 3808256 4391936 4370432 4228608 3015680 3427328 4440576 3406336 3974144
4526 3974144 3556864 3563520 3865088 4109312 4289024 3506688 3519488 4473344 2995200 2882048
4516 2882048 2371584 2583552 3930112 2622976 3389440 3237888 2993664 2731008 2989568
4507 2989568 3216896 2771456 3138560 3031040 2517504 2933248 2379776 3989504 3201536
4498 3201536 2598400 2906624 2762752 3428352 3476480 3011072 1611776 3257856 2434048
4489 2434048 3051520 3236864 2585088 3227648 2974720 2854400 2151936 2322944 2096128 2036736
4479 2036736 3227136 2332672 3121664 2139648 2750464 2439680 3660288 3871744 4011008
4470 4011008 4218880 3484160 2789888 3047936 4148224 4196864 4576768 4038144 4051968 4598784
4460 4598784 2984960 3129856 3783168 3193344 3405824 3461632 2721792 3816448 3444224
4451 3444224 3460608 4184576 2251264 2846720 4125184 3984384 3376640 2533376 3987456
4442 3987456 2324480 3716096 4891136 3565568 4073984 3445760 3158016 3623936 2553856
4433 2553856 4028928 4085760 4457472 3855872 3963904 5389824 3488256 3364352 3938304
4424 3938304 3820544 4653568 4236800 3433984 4251136 3618816 5174784 4014080 4878336
4415 4878336 3988992 4683264 4626432 5809664 5309440 4444672 5249536 5050880 5676032 5060096
4405 5060096 4449280 4079104 4129792 4435968 5622784 4877312 4867072 5280256 4642816 4627968
4395 4627968 4695040 5780992 6210048 4886528 4866048 5477376 5747200 5440000 5755904 5278720
4385 5278720 5395456 4720128 4357120 4934144 4078592 2908160 3262464 3510784 4465152
4376 4465152 4061696 3813888 3261952 4006912 3985920 3321856 4349440 3780608 4225536 3383296
4366 3383296 3978752 4074496 5046784 3670528 3798016 3826688 3540480 3461632 4171776 2849280
4356 2849280 2972160 3958272 2978816 3198464 4126208 3668992 3638784 2950656 3355136 4057600
4346 4057600 3788800 3492352 2967040 2833920 3594752 3027968 3284480 4328960 3428864
4337 3428864 3846656 3828224 3770880 3573760 2657792 4120064 3612160 2486784 2541568 3486208
4327 3486208 2459648 3048960 2202624 3290624 3982336 3873280 2813440 3689472 3782656
4318 3782656 3134464 3633664 3232768 3998720 2721792 2691072 3288576 3804672 2893312 2857472
4308 2857472 2920448 2957824 3340800 3688960 2941440 3533824 3097600 2286592 2980352 3499520
4298 3499520 2814464 3263488 3822592 3163136 3396096 3095040 3851264 3710976 3420160 2511360
4288 2511360 3757568 3572224 3884032 2742784 2498560 3838464 2134016 3355648 2853888
4279 2853888 3428352 3044864 2749440 2600960 3500544 2589696 3390976 3526144 3247104 2513920
4269 2513920 2599936 3490816 3646464 2752512 3207680 3342336 2219008 3952640 2296320
4260 2296320 3686400 2603008 3094528 3490816 3442176 3511296 3373568 2739712 3729408 2847744
4250 2847744 2760192 3226112 3936256 3325952 3757568 4397568 3269632 2413056 3863552
4241 3863552 2863104 3540992 3704832 2880512 3623424 3203584 4527104 4221440 3638272
4232 3638272 2787328 4810240 3515904 3136512 3258880 3643392 5211136 3617280 4015104
4223 4015104 3394560 3599872 3742208 3731456 3375616 4011520 3857408 3470336 3400192 4248576
4213 4248576 2864640 3076608 3351040 3113472 3149312 3387392 3443200 3904512 4581888 4667904
4203 4667904 3554304 3669504 4592640 4532736 4442112 4090368 3602432 4554240 4784640 3829760
4193 3829760 3649024 5415936 4128768 5508096 4534784 4729344 5768192 4767744 4491776
4184 4491776 4806144 4623360 5132800 5480448 5769216 4896768 5007872 4794880 4432896 5068800
4174 5068800 4960768 5009408 3895808 4254720 4853760 3661824 4113408 2870272 4647936
4165 4647936 3843072 4204032 3996672 3628032 3457536 3422720 3097088 3288064 4905984 4956160
4155 4956160 4071424 4014592 4430336 4042752 4995584 5026304 4889088 5111808 4271616 4951040
4145 4951040 4856320 4294144 4577792 5284352 4878848 5305344 4449280 5215232 3515392 5411840
4135 5411840 4997632 4672000 4003328 4238848 4899840 5588992 5114368 5690880 6484992 6240256
4125 6240256 5903360 6076416 6489088 7255040 7430144 8087040 7958528 8106496 9040896 8074240
4115 8074240 8372224 8188928 7575040 8412160 7662080 8862208 8813568 8566272 9149440 9187840
4105 9187840 9369088 8922624 8934400 9899008 9930240 9340928 8896512 9356288 9702400 16400896
4095 16400896 9039872 8599552 10957824 9321984 9023488 10364416 9817088 10749440 10770432
4086 10770432 11394560 11896832 13007360 12619264 12917248 13423104 13963776 14629888 15070720
4077 15070720 14354432 15934464 15752192 16475648 16920064 18603520 19344896 19855872 21958144
4068 21958144 23459840 23190528 22769664 22379520 19041280 17491456 15008768 11571200 11612672
4059 11612672 8860160 8046592 6892544 6844416 5545984 6342144 4868608 5807616 5698560
4050 5698560 5246464 5358592 4897280 5334528 4309504 4471296 4155392 3816448 5783040
4041 5783040 5581312 5148160 4854272 4742656 4640256 4983808 5391360 4430848 4158464 3315200
4031 3315200 5259776 4563456 4722688 4312576 5050368 4235264 5343232 4263936 4146176
4022 4146176 4801024 4864512 3953152 4817920 5251584 6269952 4798976 5741568 5140480
4013 5140480 4302848 5448192 5201408 5111808 5209088 5138432 4559872 6347776 5637632 4994048
4003 4994048 5644288 5795328 5867520 4395008 5146624 5968384 3679232 4233216 4398592
3994 4398592 4166656 4442112 4403712 3702272 4079104 4538880 3825152 4457472 4839936 4654592
3984 4654592 4164096 4421632 5199872 5108224 4900864 4762112 4520448 4439552 4231680 5126656
3974 5126656 4303360 3748864 4172288 5175808 3626496 4153856 4096512 4286976 4137472
3965 4137472 4889088 4611072 5884928 3570176 3799552 4866560 4990464 4524544 4175360
3956 4175360 5056512 4134912 4261888 5592064 5067264 4752384 4767744 5379584 5197824 3532800
3946 3532800 4392960 4436480 4848128 4280832 4580352 3536896 4639232 4365312 4207616
3937 4207616 3863552 3481600 4104192 5400576 6056448 3653632 4658176 3683328 4311552
3928 4311552 4617216 5160448 4667904 4264960 5184512 4612608 4328960 4626432 3731456 4341248
3918 4341248 4833792 4003840 4616192 3653120 2988032 4810240 5221376 4304384 4237312 4446720
3908 4446720 4960768 4302848 4224000 5159424 3657728 4669440 3853312 5387776 4412416
3899 4412416 4776448 5986304 5341696 3443712 4227072 5356544 3102208 4965376 5121024
3890 5121024 4521984 4763136 5343232 4115456 3686400 4978176 4707840 3728896 3945472
3881 3945472 5139456 4403712 4212224 5209088 4858880 5195264 5070848 4482560 5314560
3872 5314560 4605952 4001792 4028416 4578816 4957184 4091904 4838912 4754944 5362176 4219904
3862 4219904 4174848 5526016 5207552 4969472 4445696 4189184 5093376 3706880 4847616
3853 4847616 5479936 5253632 5553664 3883520 5184512 4591104 4896768 5307392 4583936
3844 4583936 5417984 4540928 5484032 5034496 6689792 6546432 6062592 5224448 4383232
3835 4383232 5144064 5745664 5386240 5323776 4723200 3773952 4841984 4571136 5685248
3826 5685248 4065280 4993536 5060096 5597184 5560320 5200384 6179328 5718016 6811136 5849088
3816 5849088 5977600 6092800 6209536 5422592 6190080 6276608 6745600 6490112 6445568 6075904
3806 6075904 6772224 7094784 6156288 6803968 6814208 6853120 7228416 6638592 7734272 7175168
3796 7175168 7195136 7666176 7889920 7477248 7582720 7773184 8710656 8040960 8395776 8294400
3786 8294400 8305664 8347648 8769536 9291264 9131008 9552896 9081856 10170880 9362432 9358848
3776 9358848 11036672 11697664 12005376 10848768 12672512 12406784 14152192 13667840 15247872
3767 15247872 17243136 18674688 19321856 19294208 20933632 22604288 22746624 23433728 23128576
3758 23128576 24232448 25197568 26079744 27569664 27806208 28343808 31777792 32053760 34301952
3749 34301952 35674624 36968448 35462144 31850496 28555264 24137216 20254720 17594880
3741 17594880 15662080 14103552 13187584 12082176 11023872 9321472 10852352 10559488
3733 10559488 9907200 10094080 9899008 9897984 9516544 9132544 9094144 10148352 9523712 9197568
3723 9197568 9569792 9539072 9555968 10565120 10153472 10893312 10610176 10903552 11101696 10338816
3713 10338816 9642496 9858560 9402880 10423296 10415616 8981504 9349120 9448960 11320832
3704 11320832 9342464 8838656 9609728 9938432 10072576 8890880 10425856 10068480 9696256
3695 9696256 10142208 10149888 9888256 9683968 10523648 12402176 12148736 14790656 15108608 14371328
3685 14371328 14766080 13656064 11505664 10809856 11474944 9462784 9210880 9350656 8726016
3676 8726016 9689600 9717760 8638976 9718784 9410560 9911296 9247744 8827904 9505280
3667 9505280 10193920 10910208 9717760 10522112 9315840 9784832 9361920 9956864 9280000
3658 9280000 9199616 10098688 9103872 11009024 10388480 10085888 10372096 10170880 9807872 8200192
3648 8200192 8166912 7849984 9150464 8854528 7723520 8601600 8004096 8795648 8832512 7513600
3638 7513600 8686592 8117760 7735296 7824896 7858688 8185344 8397312 8845824 8247296 7733248
3628 7733248 8865792 8877056 7651840 8055808 9083904 7837184 8606720 8429056 8911872
3619 8911872 7556096 9040896 8160256 7770624 8643584 9464320 8967680 9616896 9378816
3610 9378816 9391616 9741312 8778752 9022464 8970240 8157696 8852992 8210944 9370112 8941056
3600 8941056 9433088 8941568 9037312 9903104 9778688 8971264 9240064 8361984 9241088 10150912
3590 10150912 8917504 10073088 9633280 9389568 9184768 9085440 9570816 9320448 9662464
3581 9662464 9392640 9889280 10610176 9865728 10435584 9638912 9935360 9876992 9743872 9961472
3571 9961472 10152448 11601920 10383360 10895872 10345984 10037760 10668544 11179520 10222080
3562 10222080 10594816 11352576 10759168 12410880 10717184 11262464 12502528 11160064 11657728
3553 11657728 12269568 11820544 12602880 12582912 10711552 11777024 12292096 12923904 11613696
3544 11613696 12496896 11713024 13459456 12911616 12099072 12307968 12175872 12801536 12794880 13239296
3534 13239296 12800512 13984256 14619648 13387776 12914688 14658048 13127168 14932992 14306304
3525 14306304 15092224 14481408 13659648 13073408 14842368 14538752 13689856 13797888 14103552
3516 14103552 14060032 13659648 15040000 14090240 14105088 14754816 15360000 16019456 16138752 17001984
3506 17001984 18861056 18938368 19314688 19987456 20515840 21343744 21677056 21277184 23025664
3497 23025664 22354944 22749184 24179200 24637440 24958976 25930240 25975808 25527296 27112960
3488 27112960 26552832 28186624 27096576 27969536 29523968 29428736 30235648 31767040 31027200
3479 31027200 32170496 33192960 34162176 35840000 36667904 37422080 38757888 39883264 41432064
3470 41432064 43268096 44008448 45440000 47969792 50343424 51043328 54674432 55616512 58568704
3461 58568704 60950016 64519680 68787200 70057984 74280960 77585920 83503616 87789568
3453 87789568 93128192 101599232 109016064 118038528 128792064 140732928 152264192 164470784
3445 164470784 178820608 194523136 211217408 230892032 253970432 281683968 315782656
3438 315782656 359388672 415756800 489764864 591358976 727710208 895287808 1083495936
3431 1083495936 1249861120 1326140416 1260506112 1079128064 857173504 651618304
3425 651618304 488754688 368476160 280422400 218494464 175163392 142565888 119928320
3418 119928320 100621824 87348736 77869056 67275776 59164160 54257152 50385920 46379520
3410 46379520 43838976 40161792 37932032 34881024 32648704 30331392 27767808 27761664 25191936
3401 25191936 23848448 22797312 21624832 20962816 19650560 19081216 18792960 17117696 15975424
3392 15975424 15615488 14916608 15611904 14469632 13464064 13488640 13370368 12067328 11962368
3383 11962368 11960320 11850752 11296256 10741760 10713088 10463232 10911232 10181632 8936960 8483328
3373 8483328 7555072 6956544 7030784 5836288 7417856 6881792 6644224 6165504 6102016 6040064
3363 6040064 6519808 5934080 6133760 5578240 5606400 5373440 6523392 7199232 7223808 7301632
3353 7301632 8312832 6917632 7810048 9366528 6790144 8469504 8120832 6674432 5838336
3344 5838336 7021568 7075840 6284800 5135872 5483520 5791232 4063232 4342272 4255232
3335 4255232 4395520 4904960 4438016 3806720 5323264 4528128 4576768 4980736 5463552 4062208
3325 4062208 4593664 5062656 4585984 3877376 2786816 3261440 3722752 3930624 3808256
3316 3808256 3671552 2411520 3095552 3145728 2902528 2412032 2809856 3543040 2843136 2325504
3306 2325504 2652160 2708480 2682368 1717248 1704960 3464704 2850816 2726400 1900032 2328576
3296 2328576 2200576 1691648 1222144 2325504 1640960 2713600 1444352 1709056 2352640
3287 2352640 1011712 1919488 2713088 2725376 1631232 2568704 1493504 1899008 2834432
3278 2834432 2065408 3010560 2075136 2380288 2493440 2698240 2909184 3290112 2056192
3269 2056192 2724352 2617344 1712640 3437056 1395712 1457152 1658368 2509312 3066368
3260 3066368 1106432 2255872 2953216 1503744 1937920 2821632 1842176 2481152 2527744
3251 2527744 1641472 2246656 2404864 1570304 2538496 2490368 2563072 2091520 3387904 3234304
3241 3234304 4187136 4394496 5446656 3969024 4824064 5882368 6539264 6051840 4714496
3232 4714496 4939776 3892736 3777536 2642432 2158592 2256384 3077632 2533888 1431040
3223 1431040 1987584 2825216 2695680 2944512 1967104 1434624 2113536 1875968 1656320 1815552
3213 1815552 2304512 2301440 1949184 1914880 1921024 1796096 1846272 2255872 2676224 1979392 2297856
3202 2297856 1971712 2627584 2300416 3609088 3150848 2715648 1867264 3184640 2832896
3193 2832896 2853888 3081728 3970560 3851264 3989504 4410368 3201024 4198400 3864064 3565056
3183 3565056 4120064 4004864 3787264 5106176 5690880 4992000 6167552 5782016 5795840
3174 5795840 6476288 7357440 7080960 7663616 7541248 8183808 8005120 8590336 9773568
3165 9773568 9125376 11514880 11114496 11942912 11883008 13158912 13225472 12938240 13451776 14437376
3155 14437376 14556160 15014912 15757312 16218112 16105984 14979072 14767616 14296064 15556608
3146 15556608 15696896 14817792 14449664 15286784 14748160 14383616 15002112 15944192 14967296
3137 14967296 15552512 14476800 15161856 14709760 16068608 16367104 16656896 16796160 17316864
3128 17316864 17566720 18443264 19885568 19846144 18421248 21419008 21491712 21435392 22036992
3119 22036992 22888448 24100352 25001472 24729088 26456576 27369472 27844096 30451200 29794304
3110 29794304 27824128 24846848 21267456 18332160 14957056 12356608 12259328 8503808
3102 8503808 8322048 7679488 7318016 6821888 6698496 7101952 6516224 6665216 7441408 5625856
3092 5625856 5902848 6518272 5058048 6275584 6648320 6911488 5959680 6979584 5736960
3083 5736960 6433792 6027264 5808640 6260736 6226432 5183488 5017600 4516352 5015040 5433856
3073 5433856 5027840 6072320 6282752 5681664 6061056 6478848 6593024 5006848 6407168
3064 6407168 5264896 5304832 4850688 5821952 4167168 4049920 4794880 4341760 4053504
3055 4053504 3970560 5024768 4986880 4831744 4290560 3718144 3709440 3999744 4895744 4829696
3045 4829696 4707840 4987904 4925440 5020160 4871680 4502528 4667904 3710976 5160448 4950528
3035 4950528 4815360 4146688 3786752 4482048 5343744 5449728 5125120 5523456 5221888 6544384
3025 6544384 6041600 4920320 5677568 6759936 6683136 6722048 7482368 7294976 7271936 8062464
3015 8062464 7180288 9381888 10285568 12165632 15777280 19486208 22684672 19963904 19323392
3006 19323392 21045760 17025024 12255232 8052736 7152640 5529600 5332480 5679616 4993536
2997 4993536 4100608 3803648 4131840 4936192 4023808 3539456 3053568 4916224 3975168
2988 3975168 3402240 4642816 4346368 3182080 4504064 3319808 3232768 3528192 3064832
2979 3064832 3280896 2970112 3471872 3556864 2189312 3686912 4275200 4251648 4852224 4062208
2969 4062208 3742208 3610112 3639296 3197952 3920896 4239360 3370496 3680256 3827200 2395136
2959 2395136 4034048 3449856 4190208 4065280 3355648 4391424 3843072 3510272 4193280
2950 4193280 3069952 4344320 2902016 3667968 3311616 3232768 3731456 2148864 2778112
2941 2778112 3572224 2566144 3496960 3452416 3016192 3266560 4119552 3617792 3442688 3808256
2931 3808256 3299328 3383808 3442176 4465664 3182080 2954240 4032000 2744320 4342272
2922 4342272 3599360 2960896 2758144 2121216 3454464 3885568 3130880 3185664 3557376 3523072
2912 3523072 4474368 4389888 4283392 3588096 2995200 4277248 2775552 4448768 3067392
2903 3067392 3721216 3664896 3843072 3509760 2856448 3784192 3486720 3811328 3793920 3663872
2893 3663872 2658816 3785728 4369408 4401152 3274752 4005376 4428800 4884992 3839488
2884 3839488 3815424 3078144 4107264 4207616 3599360 3773440 3927040 2948608 5328896
2875 5328896 3363328 3772416 4585984 3614208 4460032 4212736 4472832 3418624 4354560
2866 4354560 3412480 4333568 4118016 3906560 3669504 4024832 3897344 4963840 3877376
2857 3877376 4542464 3628544 4293632 4088320 4297728 5372416 3935744 4917760 4009472
2848 4009472 4934656 4549632 4657152 4016640 4035072 4094464 5350400 5081600 4980736 5878272
2838 5878272 6152704 4749312 5111296 3814400 4873216 5208576 5490688 4293632 5452288
2829 5452288 4995072 5185024 5765120 6705152 5959680 5785088 5479424 6871552 5838848
2820 5838848 7506944 7149056 6728192 6909952 7882752 9029120 9806336 10723328 12181504
2811 12181504 12305408 13089792 12654592 14121984 13822464 15771136 15724544 17062400 17527808
2802 17527808 18278912 18322944 18940416 20840448 22261760 24335872 26168832 28167680 31495168
2793 31495168 34804736 37815296 43821568 48761344 39779840 28001792 20309504 14681600
2785 14681600 12413952 10169856 8521216 7305216 7073792 6526976 5971456 6206976 5476864
2776 5476864 6163456 5945856 5784064 4734464 5552128 4954112 5754368 6015488 5184000
2767 5184000 4402176 5264896 4923392 4236288 4544000 5466624 3996160 4186112 4002304
2758 4002304 4492288 4563456 4262912 4490240 3526656 4682240 3766784 5516800 5156864
2749 5156864 4320768 4355584 4871680 3993088 4384768 3865600 3601920 4249600 3119616 3773440
2739 3773440 3910656 3885568 4921856 4558848 3947520 4475904 4401152 4767744 3820032 4812800
2729 4812800 3598848 4213248 4739584 4201984 4366336 4959232 4883456 4432384 5345280 4747264
2719 4747264 6136320 5084672 5446144 6013440 5349888 5975552 6662144 7676416 6674944
2710 6674944 7382528 7796224 8698368 10001920 10821120 13335040 15526912 19718656 28254208
2701 28254208 37830656 44366336 38092288 25399296 18789888 14232576 14537216 14809600
2693 14809600 17693696 21492736 28981248 32687104 25139712 17952256 15956992 14520832
2685 14520832 16308224 20488192 27202048 38077440 43227648 32778752 21233152 15130112
2677 15130112 12941824 14181888 14699008 19176448 25947648 28699648 21804544 14085120
2669 14085120 10259968 8415232 9356800 9254912 12245504 14045696 15318528 11942912
2661 11942912 8206336 5575680 4004864 4455936 3973120 3877888 4259328 3893760 4060672
2652 4060672 3955200 3049472 2769408 3580416 3810816 3856384 2369536 3378176 4456960
2643 4456960 4890112 5810688 6836224 6224896 5173248 5027328 5148672 4376064 4669440
2634 4669440 4826624 4517376 5147136 4087808 3461120 3448320 2753536 2967040 3358720 2109440
2624 2109440 2451456 2324480 2442752 1550336 2206720 2194944 2959360 1900544 2538496 1449472
2614 1449472 2905600 1999872 2192384 2026496 1271808 2050048 2953728 1165824 1885696
2605 1885696 2125312 2446848 2379264 2043392 2993664 1633280 1458176 1795584 1784320 2320896
2595 2320896 2758656 1841664 1550848 2272256 1467392 2155520 1926656 1838592 1188864 2193408
2585 2193408 1978880 529920 2260992 2568704 1778176 1444864 644608 1517568 2139136
2576 2139136 1815040 2278400 1613824 1573888 1973248 2084864 1140736 2238976 2281984 2638336
2566 2638336 1529344 1105408 2274304 1298944 1849344 2397696 1247744 1945600 1872384
2557 1872384 1918976 823296 2516480 1379328 572928 2671104 2160128 1436160 1421824
2548 1421824 1453568 2566656 2288640 1886720 2391552 2485248 1835008 2035712 1987072 2134016
2538 2134016 2159616 2651136 2245632 958976 2936320 3081728 2887168 1974272 2056704 2307584
2528 2307584 2548736 2602496 3289088 3015168 2175488 1124864 2417664 3194368 2764800
2519 2764800 3097600 2011648 2299904 3303424 2931712 3385344 2509824 3335680 2431488
2510 2431488 2542592 3141632 3282432 2629120 3374592 2875904 2347008 3011584 2973184 3411456
2500 3411456 2919424 2105344 2912256 3505152 2801664 2710528 2969600 2733056 3404288 2686976
2490 2686976 3310592 1784832 4174848 3741184 3688960 2962432 3397120 4253184 3556352
2481 3556352 3906560 3886080 4272640 3613184 4238848 3977728 2921472 2812928 3581952 3917824
2471 3917824 4585472 3183104 3618304 3565056 3006464 3531776 2329600 2378752 2925056 3119104
2461 3119104 3159040 3429376 2939392 2572288 3440128 2970624 3363840 1988096 3462144
2452 3462144 3569664 3679744 2988544 3063808 3715072 2594304 2983936 3851264 2853376 2724352
2442 2724352 2889216 2763776 3515904 3322880 2845696 2417664 3261952 3018752 3716096 4469760
2432 4469760 3781120 3951104 4104704 4067840 3056128 3475968 3654656 4150272 4011008 3262464
2422 3262464 4113920 5176320 4887552 5054976 4867072 5116928 4635136 5182976 3541504
2413 3541504 5257728 4294144 4043264 4786176 4319232 4840448 4424192 3356160 4417024
2404 4417024 4046848 4773888 4231680 4238848 4632576 4372992 3310080 3477504 3323392 3811840
2394 3811840 3329536 3866112 4476416 3691008 3195904 4554240 5096960 4901376 5244928
2385 5244928 4958208 5348352 4969472 4461568 5044224 5109760 3873280 4617728 4080640 3599872
2375 3599872 4119552 4126208 5552640 5833216 4986368 4384256 4623872 4207616 4388352 5155328
2365 5155328 4125184 3745280 4673536 5166080 3867136 4944384 3486720 6667776 5056000
2356 5056000 4826112 5295616 4935680 5823488 4942848 4729856 4377600 5266944 5278720 5192704
2346 5192704 5037568 5483008 4414976 5664256 4533248 5301760 5076992 4611584 5225472
2337 5225472 5016576 4958208 4885504 4497920 4643328 4109312 3898368 5342208 5324800 5285376
2327 5285376 4972032 4765696 3932672 5311488 5484544 5636608 5549568 5010432 6004224 6136832
2317 6136832 4662272 4913664 5200896 5085184 4848128 4558848 4702720 4601344 4302848
2308 4302848 3659264 4224000 4918272 4080640 3929600 4146176 4881408 3560960 4129280
2299 4129280 3271168 4210176 4025344 4347904 4402176 3254784 4607488 4099072 3567616
2290 3567616 3460096 4145152 5565440 4029952 4560896 3439104 3718656 3850752 4044288
2281 4044288 3897344 4407808 4167168 4143104 4101632 3940352 4527616 2507776 3572224 3774976
2271 3774976 3505664 3592704 4292096 2952192 3465216 4594176 4203520 3762688 4864512
2262 4864512 4923904 4769280 4328448 3850752 3581440 3349504 4072448 4884992 3361792 3747328
2252 3747328 4188160 4956160 5526016 5137920 3020288 5092352 5257728 5193216 4816896
2243 4816896 5178880 5534208 5403648 5203968 5492224 5383680 5489664 5361664 5645312 6167040
2233 6167040 6298624 6897664 6354432 6827008 5888000 6167040 6727168 6887936 6608384 7711232
2223 7711232 7884288 7352832 7834624 7604224 6901248 6954496 7829504 5945856 7345152
2214 7345152 6451712 7207936 6088192 6507520 6651904 7186432 5836800 7215104 6433280
2205 6433280 6811648 6575104 7457792 6496768 7520256 6957056 7137792 7166464 7069696 7246336
2195 7246336 8019456 6746624 7473664 7081472 6287360 7272448 6423040 7379968 7214592
2186 7214592 6711296 7185920 7166464 5978112 7400448 7012864 6255616 7077376 6713344
2177 6713344 6660608 6163968 6849024 5912576 6300672 7278080 7281664 6154240 7159808 6415360
2167 6415360 7069184 6833664 6469632 6957056 7944192 7537152 7114240 6393344 5313536
2158 5313536 5775872 5852672 6524416 6673408 6179328 5605376 6046720 5827072 5086208 5193216
2148 5193216 5626368 5497344 5229056 5290496 5057536 5229568 5173248 5638144 5943296 5775872
2138 5775872 5311488 6188544 6123008 5971456 5285888 6459904 6198784 6959104 6230528 6765568
2128 6765568 6998528 6474752 6993408 5786112 6006272 6341632 5826048 5878784 6911488
2119 6911488 7327744 6587904 6003712 6779904 8238592 6678528 6366720 7503360 6505984
2110 6505984 5892608 6558720 8058368 8266752 7813120 7874048 7297536 8085504 7391232 8752640
2100 8752640 7531520 7761408 8745984 8360960 7981056 9042944 8453120 8856576 9002496
2091 9002496 8346112 9220608 9620480 10129408 10375168 10356224 9934848 9838080 8919552 9914880
2081 9914880 10908160 10299392 9335296 11128320 9469440 8591872 10625024 9909248 9558528
2072 9558528 10204160 9840640 9333760 9929728 10551296 9112064 9712640 10445824 9620992
2063 9620992 9999360 10206720 10543616 9916928 9638400 10134528 10451968 10569728 9790464 11810304
2053 11810304 11312128 11481600 11759104 10935296 10314240 11039744 11465216 11206656 10642432
2044 10642432 11209728 11539968 10630144 10966016 10767872 10844160 10846208 10770944 11843072 11150848
2034 11150848 10891776 10955264 10843136 12175872 13840384 15981568 21416960 28128256 25719808
2025 25719808 18972160 14990848 11621376 10294784 11021824 8922112 8975360 8974336 9656832
2016 9656832 9456128 9166848 8119296 8325632 9305088 8900096 8316928 8114176 8053248 8360960
2006 8360960 8656896 8591872 8002048 8443392 8173056 7945728 9753088 8708608 8474112
1997 8474112 6957056 8163328 7075328 6741504 6791168 5460480 6643200 6387200 6043136
1988 6043136 5571584 6599680 5761536 6132224 6389760 5993472 6390272 5197312 4727808
1979 4727808 4851712 5359616 5471232 5315072 5945856 5357056 5279232 4416512 4746240 5605888
1969 5605888 4621824 4794880 5416960 5133312 4896768 4730880 4807168 5286912 6443008 5067776
1959 5067776 6285824 4522496 5586944 4633088 5907968 4558848 5665280 5150720 7004672
1950 7004672 5347328 6546944 5846016 5066752 5972992 4941824 5094912 4904960 6581760
1941 6581760 5052928 6344192 5894656 5734912 5618688 6374400 5996032 6900736 5925888
1932 5925888 5733888 6004736 6291968 6827008 5940736 5771264 5189120 6227456 6182912 6809088
1922 6809088 6073856 6199296 6979072 6890496 7175168 7230464 7220736 6263808 7767040 8022528
1912 8022528 6666752 7886336 7598592 7835648 9215488 8013312 7895040 8279552 8349696
1903 8349696 9179136 9689600 10543104 9570304 8389120 8887808 8332800 9608704 8814592
1894 8814592 8555520 10649088 9523200 9698304 9584128 9718784 10507264 9804800 10341376
1885 10341376 10851840 11334144 9907712 11138048 10769408 10913792 10633728 11953664 11897344
1876 11897344 11827200 12421632 12918272 12542976 13128192 13691904 13590528 13694464 14362624 13564416
1866 13564416 13946368 13387776 14475264 12592128 12436992 13346816 12502016 13353472 12729856
1857 12729856 10912256 11576832 10886144 12039168 11770368 11063296 10581504 12256768 11929088
1848 11929088 11940352 11394048 12017152 12371456 11081216 11094016 12623872 11255296 11790336
1839 11790336 11859456 11961856 11631104 11675136 11259904 11912192 12046848 12463616 11251712 11814912
1829 11814912 11278848 10707968 9526784 9769984 9790976 10270720 9779712 9661952 9630720 9325056
1819 9325056 9806336 8542208 9533952 8684032 8734208 8516096 8331776 7744000 8657920 7340032
1809 7340032 7815680 8449536 8114688 7082496 8948224 8109568 7182848 7380992 7209984
1800 7209984 7527936 7639040 8466432 7899136 7112192 7624704 6941696 7109120 7883264 6736384
1790 6736384 7270912 6921216 7499776 6869504 7733760 6455296 7523328 7528960 6532096 7301632
1780 7301632 6319616 7349760 8939520 6602240 6689792 8435200 8599040 8326144 9421824
1771 9421824 7644672 8223744 7837696 7568384 8211456 8337408 9949184 8640000 8773120
1762 8773120 8915968 9487872 9813504 9484288 9235968 9187328 10143744 10787840 10638336 10758144
1752 10758144 10459136 11400704 10622464 11385856 12191744 12237824 12174848 12568576 13064704 13735936
1742 13735936 13387264 13645824 13967360 13448192 14023680 14295040 14066688 13892608 14798336
1733 14798336 14926336 15306752 15119360 16587776 16378368 17647104 17313792 18915840 19236352
1724 19236352 19944448 20983296 21781504 22772224 23990784 25854464 25077248 27301888 27880448
1715 27880448 31113728 30302720 33046528 34854912 35373056 35431424 36688384 38131200 38443008
1706 38443008 39031296 39263232 39783936 41088512 42534400 41969664 44276224 46123520 47184896
1697 47184896 49204224 49523200 53445120 55814656 58423808 61583360 64125952 68985856
1689 68985856 74559488 79853056 88228864 95350272 103182848 110302720 115323392 114763776
1681 114763776 113081344 105057280 96527872 85076992 73690112 62867968 51927552
1674 51927552 43039232 35494912 29715968 25559040 23151616 20137472 17840640 17918976
1666 17918976 16304128 15180288 14347264 13574144 12812800 12253184 12354048 11483648 10681344
1657 10681344 10593792 10146816 9615872 9846784 10456576 8653824 8726528 9318912 8932352 9341952
1647 9341952 8198144 7810048 8314880 7241216 6659072 6643712 6625280 6121984 6754816 5659648
1637 5659648 5465088 6330368 6147072 6561280 5032448 5967360 6383104 5663232 5657600 4678656
1627 4678656 5335040 5618176 4619264 4632576 5195264 4403712 4290048 4213248 4491776 3710464
1617 3710464 5690368 4832768 4385280 3654656 3980288 3960320 4201984 4332544 4414464 4326912
1607 4326912 3154944 3806208 3675648 3582464 3658240 4221440 3887104 2881536 4000256
1598 4000256 3036160 3650560 2876416 3386880 3710464 2171392 3527168 3297280 3857920
1589 3857920 3566592 3030016 2790400 3392000 3677184 2918400 2867200 3125248 4016640 3268608
1579 3268608 4285952 3065856 3307520 3982848 3159552 3587072 4390400 3702784 3053056
1570 3053056 3542016 3086336 3872768 4095488 4162048 2876928 3527680 3670528 3167232 3494912
1560 3494912 3814400 3552768 4720640 4763648 3453952 4009472 5390848 5473792 4618240
1551 4618240 4896256 5419520 4286464 5059584 6451712 5298688 4803584 5437952 5806592
1542 5806592 6422528 6839808 6819328 5804032 7693824 7590400 8168448 7801856 9280512
1533 9280512 10421248 9631744 12018688 12924416 10571264 10574336 10883584 9413120 8991744
1524 8991744 9263616 7975424 9489408 9039872 7859712 8970240 9433600 8232448 9047040
1515 9047040 8911360 8048128 8415232 8094720 7748608 7905280 7611392 8092160 8073728 7262208
1505 7262208 7993856 7574016 8316416 8017920 8026112 8013312 8535040 9033216 9866752 11155968
1495 11155968 10935296 12162560 12736000 12746752 12650496 14030848 13006848 12373504 11809792
1486 11809792 10449920 10323456 9051648 6916096 8223232 8973824 6961664 6839296 7271936
1477 7271936 6171648 6917632 6014976 6745600 6727680 6964224 6123520 7012352 7833088 7132672
1467 7132672 7672320 9344000 10991104 11077120 11178496 11165696 11658752 11392000 9923072
1458 9923072 9071104 8861696 7109632 7060480 6073856 6989312 6053888 4872704 5239296
1449 5239296 4886016 3805184 5205504 3917312 3902464 2329600 3561984 3682304 4023296
1440 4023296 2879488 3401216 3348992 2710016 3469312 2793984 2698752 2449408 2267136 3042304
1430 3042304 2735104 1932288 3320320 2853376 2454528 2714112 2775552 2179072 1950720 2084864
1420 2084864 2797056 2816512 2663936 2806272 2731520 2315776 2228224 3121664 3116032 2664960
1410 2664960 4771328 3993088 3354112 2602496 2990080 3431424 3793408 3790848 3609088 3880448
1400 3880448 2689024 3634688 3786240 3872256 3697664 2910208 2998272 3198464 3634176 3887616
1390 3887616 3278848 3534848 3350016 4062720 3503104 2721280 4053504 4234240 3888640
1381 3888640 3698688 2634752 4590080 4612608 4204032 3592192 3803648 5073920 4639744
1372 4639744 4925952 5250560 4869120 5468160 4744192 4677120 5366784 5316096 5343232 3786752
1362 3786752 3756032 4302336 3758592 3774976 2735616 3525120 2807296 2459136 2169344 970752
1351 1519104 1372672 1053696 1240576 -613376 1750528 1531392 1790464 1567232 1509376 842752
1341 842752 1791488 2288640 1408512 920576 584192 760832 1278976 852992 497664 1091584
1331 1091584 777216 1329664 840704 952832 1245696 1071616 890368 785920 728064 510976
1321 510976 1465344 117248 1649664 884736 984576 644096 1354240 556032 990720 884736
1311 884736 1775616 988672 683008 1084416 598528 1323520 1412608 1055744 1351680 281088
1300 2180608 127488 1538048 549888 376320 483328 1176576 546816 50688 1174016
1291 1174016 659456 351744 1153536 623104 1628160 -83456 722944 493568 333824 277504
1281 277504 1253888 724480 970240 269824 569856 468992 1102336 614400 1122816 801792
1271 801792 767488 655872 873984 214528 288768 897536 526848 748032 790016 832512
1261 832512 764416 1295360 727040 775680 305152 301568 674304 512512 1837056 683008
1250 962560 1464832 1264640 344576 437760 1417728 1221632 1373184 915968 1113088 1250816
1240 1250816 865792 2436608 304640 1291776 257536 791040 901120 503296 881664
1231 881664 549376 1186304 1324032 1868288 1099776 1380864 1682432 1432576 1473024 1123840
1221 1123840 1728000 297984 1762304 1541632 1385984 1086464 688128 212480 405504
1212 405504 555520 978944 526336 884736 1011712 275456 1161728 701440 1016320 1387520
1202 1387520 1556992 1092096 1724416 1158144 725504 570368 -266240 1315328 1363968 1229824
1192 1229824 1294336 570368 743424 1768448 1662976 239616 736768 427008 169984 1369600
1182 1369600 1433088 118784 1717248 1562624 1840640 1617920 545280 1615360 1642496 921088
1172 921088 1278976 788480 192512 1153024 850944 1563648 1440768 1509376 517632 621056
1162 621056 996864 122368 136192 -140288 1426944 265728 1293312 1213952 1626624 1651712
1152 1651712 1524224 964608 468480 1516032 801792 468480 169984 1718272 646144
1142 930816 1446400 922112 1684480 821248 990720 1228800 157184 1103360 1594368 448000
1131 930816 1279488 1262080 1097216 133120 424960 688640 943104 1944064 1857024 1209344
1121 1209344 1662976 1478144 891392 1108992 1336320 1550848 1113088 925696 991232 2406400
1111 2406400 1011200 1733120 1332224 185344 661504 494592 1829888 1815040 2194944
1102 2194944 1077760 2108416 1344000 539648 733184 1217024 1202176 2711040 1692160
1093 1692160 1423872 1705472 540672 1553920 2129408 1654784 1543680 1232384 1761280
1084 1761280 1715712 2278912 1595392 1821696 2848768 3104768 3479552 2894336 2651648 3251200
1074 3251200 3524096 3120640 3784704 3829760 3708928 4862464 4646400 5251072 7049728
1065 7049728 8466944 7736320 7908864 7941632 8003584 7557632 8885760 9718784 10339840 11680768
1055 11680768 11744256 14365184 15700480 19539968 30019584 42291200 59873792 97825280
1047 97825280 133947904 97528320 50107392 28844544 19035136 12527104 9825280 7852032
1039 7852032 6666240 4526080 3941888 2899968 2673664 3659776 3329536 2101248 4565504
1030 4565504 4137472 5374464 4628992 3578368 2916352 2366464 935424 1954816 1630208
1021 1630208 798208 503808 1807360 1795584 993280 1101824 1801216 1529856 158720 1241600
1011 1241600 1054720 634880 -113664 1192960 200704 348160 1498624 218112 1291776
1002 1291776 1480704 1459712 1372160 1203712 263680 -208384 1035264 159232 1448448 1331712
992 1331712 73216 517120 1197056 422912 344064 -186368 734720 -545280 703488 128512
981 943104 879104 983040 -412672 524288 1388544 -326144 -204288 708608 -289792 345088
970 -287744 741888 506368 414208 622080 670208 549888 893440 591360 650240 49664 468992
959 468992 741376 444928 30208 659456 139264 697344 158208 24064 -400384 -731136
949 -731136 562176 291840 1286144 -351232 850432 76288 -182272 176640 72704 369664
939 369664 305664 1064960 417280 391168 511488 870400 918016 1499136 -40448 -148480 -61440
927 431104 1340416 1144832 280064 866304 -369152 -25600 -105984 592384 -856576 464384
916 814080 651776 -865280 311296 -384512 -611840 681984 -685056 795648 -95232 120320
905 204288 286720 -846336 963072 560128 262656 -91648 -80384 -109568 1144320 -473088
894 549376 -9216 -167424 -37376 207872 57856 227328 659456 1105408 1566720 281088 663552
883 663552 320512 893952 1071104 424960 -219136 108032 1004032 813568 -595968 673280
872 -289280 1420800 310272 177664 143360 225792 584704 -222720 664576 1060352 -289280
861 114176 727552 -71680 1533952 -98304 82432 1297920 -311296 -131584 -97792 393216
850 -235520 1101824 432128 1511936 -19456 648192 436736 491008 -370688 101888 691712
840 691712 592384 49152 -327680 209920 -215040 519680 -453632 -843264 445952 -539648
829 1293824 845312 221184 795648 428544 922624 225792 77312 609792 346112 706560
819 706560 27136 763392 321024 -729600 64000 -177664 340992 133632 470528 339456
809 339456 -118784 -58368 -115200 279040 663040 238592 45568 764928 1252352 85504 -249856
797 -125440 17408 511488 548864 228864 634880 852992 -53760 923136 -113664 -512000
787 -512000 113664 478720 -252416 340992 309248 -127488 379392 1216000 418816 237056
777 237056 -140288 172032 296448 871424 1030656 574976 123392 -54272 1082368 293888
766 97280 657920 -652800 521728 437248 105984 -95232 646656 1276416 555520 1369600
756 1369600 1014272 282112 784384 -414720 621056 2083328 1075200 1826304 1458176
747 1458176 647680 481280 865792 1013248 551936 1283584 934400 1127936 1690624 842240
736 1368576 1190912 321536 2199552 1217536 2157056 1900032 1617408 2095616 2012160 1221120
726 1221120 1127936 1844736 941056 1531392 1059328 1052160 10240 633344 1048576 1173504
716 1173504 -331264 638976 -560640 484352 -764416 836096 527360 -404992 -198656 -91136
705 50176 402432 161280 140800 -3584 1038848 501760 -867328 -296448 293888 -627200
694 -754176 102912 792576 -5120 -504320 -135168 260096 -604672 -107520 -931328 -901632
684 -901632 1101824 25600 -686592 -3072 983040 -353792 -737792 287744 -279552 -179712
674 -179712 27136 560640 -564736 -296960 -1078784 189440 474624 209408 891904 738304
664 738304 261120 494080 -195072 185344 361984 -210432 206848 756224 -1190912 -120832
653 768000 928256 -125440 -512000 325632 -10752 543744 362496 585728 -1170432 178688
642 -391680 986112 -363520 -297984 43008 76288 -300544 -81408 -12288 -400896 -367104 321536
630 334336 -264704 -476160 613376 128000 -1242624 -245248 -493568 -475648 358400 163328
619 -445440 -136704 189440 820736 -658432 83968 -585216 44032 282624 1256448 -91136
608 -1442304 -680960 -1272320 588288 -1000448 1419264 123392 -427008 -41472 1347584
598 301568 -39424 231936 -935936 292864 -73216 110592 1068032 469504 638976 512512
588 512512 -301568 446976 1014272 0 -622592 -42496 -638464 -45568 -385024 325632 705024
577 705024 -451584 513024 -720896 419328 -670208 1557504 394752 -503296 87552 872960
567 872960 550912 -830464 645120 -148992 527360 654848 -180224 -693760 -630784 -161792
556 -294400 -448512 915456 115712 233984 278528 -682496 32768 554496 211968 -150528
545 291840 662528 634880 -176640 -725504 502272 -29184 -505344 -5120 62976 -338432 510976
533 -1120256 409088 108032 -401408 -1229824 628736 1035264 -948224 114176 994816 -827904
522 123392 736256 -223232 333824 259584 -317952 -16896 426496 402432 1507328 178176
511 65024 214528 -195072 -484864 -388096 -509952 248832 392192 -674816 -494592 423936
500 178176 215552 -103936 -1174528 -84992 -947712 659968 788480 222720 -409600 -284672
490 -284672 656384 -254464 -407040 -257024 828928 507392 390656 -295424 -485376 -605696
480 -605696 -80896 179712 -559104 328704 176640 -237568 184320 -767488 -412160 -381952
470 -381952 158208 38912 41984 -614400 -90112 68096 58880 278016 384512 -662528 -290304
458 -415744 432640 265216 650240 550912 -341504 509440 595456 70656 -923648 -636928
448 -636928 -164352 409088 30720 54272 -62464 323584 -461312 567296 70656 402432 -1014784
436 -222720 88576 -202752 -480768 -329728 1455104 146944 -145408 226304 -43520 374272
425 250880 657920 731136 1248768 688640 681984 1033728 297984 1128448 853504 987648
415 987648 463872 304128 1591296 628224 1176064 417792 162304 41984 2112512 491520
404 521728 764416 242176 -61440 -691200 211968 -161280 -286720 579072 -135680 607744
393 904704 464384 -356864 621056 285184 1417216 100352 194048 572928 241664 -14848
382 -327168 690176 834048 317952 174592 368640 180224 381440 833536 -641536 -279040
371 509440 -813056 112128 -111616 231424 -48128 -696320 233472 -181760 539136 22016
360 300544 -372736 109568 223744 -152576 -184320 -363008 309760 364032 -452096 -551424
350 -551424 -265728 602112 -119808 -130560 214528 -312832 309760 -647680 651776 -826880
339 300544 509952 -622080 -125952 827392 -269824 294400 423424 380416 -87552 653312
328 -967680 168448 771072 -150528 305664 556544 415744 -168448 332288 1287168 -956928
317 188928 -292864 -571904 -733184 -547840 808960 -833536 -742912 -397824 21504 -454656
306 -653824 -150528 1033216 755200 -459776 599552 -491520 -525312 -528384 764416 -710656
295 241664 1157120 586752 -23040 533504 523776 -203264 -314880 844288 701440 -95232 66048
283 44032 1337856 799744 -165888 195072 -97280 -840192 236544 -464896 -1040896 530432
272 1060352 42496 222208 359424 -161280 -46592 370688 348672 -239616 -161792 177152
261 -228864 850944 -665600 -502784 432640 573952 -529920 -218624 725504 -194560 -357888
251 -357888 -489984 706560 -50688 -146944 539648 400896 827392 98816 -245760 295424
240 -29184 47104 94208 279552 -79872 -129024 1018880 721920 72192 -240640 -587776 1205248
228 -403968 -54272 -709632 -1090048 -586240 1060864 -532992 -286720 -473088 -1255936 -140800
217 394240 -2046976 175104 -245248 -476672 -604160 177664 -670208 -118272 -401408 -294400
207 -294400 -140288 -325120 -47616 48640 495616 -472576 50176 -194048 739328 428544
197 428544 -267776 472576 701440 698368 -421376 -1150464 -691712 -116736 697344 480256
187 480256 -184320 -20480 -506880 110592 190976 658432 -9216 451072 -387072 -49664 -535040
176 -535040 -532480 -818688 -32768 -595456 1106432 135168 411648 339456 -799232 161280
165 540160 -50688 267776 174080 -218624 130560 559104 216576 -49152 -177664 -34816 -443904
154 -443904 108032 606208 486912 808960 -218112 183808 316416 424448 333824 -317952
143 -593920 1144832 135168 325632 40448 322560 301056 -74752 -72704 -259072 -188928 -109568
132 -109568 398848 263168 -305152 -208896 539136 2048 -49152 -788992 78848 -481280 292352
120 173568 -489984 76800 -978432 -221696 -396288 467968 -131072 202752 476160 585728
110 585728 -98816 -1163264 -87552 322560 274944 -606720 -495616 -512512 -248832 -78336 -1137152
99 -1137152 406528 -824832 -49152 271872 17408 536064 580608 344576 -360960 458752
88 -516608 -204288 721408 752128 -464896 -17408 -438272 494592 -106496 220672 -369664
77 498176 1065472 220160 -200704 -831488 -585216 305152 381440 167936 -286208 -177152
67 -177152 455680 358912 105472 179712 489472 -356352 -1285632 -161280 -159744 -685568 -134656
55 -474624 526848 257024 -1454080 -2048 -674816 -204800 634880 -1078272 820736 837120
45 837120 1159168 -890368 266240 775680 -109568 -84992 523264 1085440 -411136 688128
34 -148992 -697344 -143872 130560 784896 -777216 -823296 649216 802304 300544 -237568
23 -1375232 134656 51200 97280 526336 -288256 548864 697344 -1024 -36864 -101376 -707072
12 -707072 -14336 -406016 1316864 -17920 -696832 903168 -474624 -580096 1050624 -126464
1 -341504 215040
##END=
