##TITLE=1309
##JCAMPDX= 6.0         $$ Bruker NMR JCAMP-DX V2.0
##DATA TYPE= NMR SPECTRUM
##DATA CLASS= XYDATA
##ORIGIN= NUTS EXPORT
##OWNER= Administrator
$$ 1.72 TOPSPIN		Version 2.1
$$ 2016-02-23 12:18:40.136 -0800  Administrator@X
$$ Compression mode = diff/dup
##.OBSERVE FREQUENCY= 90.275459
##.OBSERVE NUCLEUS= ^NA
##.ACQUISITION MODE= SIMULTANEOUS (DQD)
##.ACQUISITION SCHEME= undefined
##.AVERAGES= 16
##.DIGITISER RES= 22
##SPECTROMETER/DATA SYSTEM= 
##.PULSE SEQUENCE= zg30
##.SOLVENT NAME= None
##.SHIFT REFERENCE= INTERNAL, None, 1, 14.91976
##AUDIT TRAIL= $$ (NUMBER, WHEN, WHO, WHERE, PROCESS, VERSION, WHAT)
$$ ##TITLE= Audit trail, TOPSPIN		Version 2.1
$$ ##JCAMPDX= 5.01
$$ ##ORIGIN= Bruker BioSpin GmbH
$$ ##OWNER= Administrator
$$ $$ E:/data/jwist/nmr/1309/1/pdata/1/auditp.txt
$$ ##AUDIT TRAIL=  $$ (NUMBER, WHEN, WHO, WHERE, PROCESS, VERSION, WHAT)
(   1,<2016-02-23 08:34:26.480 -0800>,<Administrator>,<X>,<jcamp>,<TOPSPIN 2.1>,
      <fromjdx created from
       E:\data\jwist\nmr\uniandes\1309
       data hash MD5: 8K
       84 F4 9A 5F 9A D8 64 C9 93 D4 6F 61 0D 18 4C AC>)
$$ ##END=
$$ 
$$ $$ hash MD5
$$ $$ 68 F2 6A 3B 9B 70 F7 9A 31 9D E5 BB 9B 28 99 E9
##$RELAX= 
$$ Bruker specific parameters
$$ --------------------------
##$DU= <E:>
##$EXPNO= 1
##$NAME= <1309>
##$PROCNO= 1
##$TYPE= <nmr>
##$USER= <jwist>
##$ACQT0= 0
##$AMP= (0..31)
100 100 100 100 100 100 100 100 100 100 100 100 100 100 100 100 100 100
100 100 100 100 100 100 100 100 100 100 100 100 100 100
##$ANAVPT= 1
##$AQSEQ= 0
##$AQ_mod= 3
##$AUNM= <au_zg>
##$AUTOPOS= <>
##$BF1= 90.275459
##$BF2= 400.02
##$BF3= 400.02
##$BF4= 400.02
##$BF5= 400.02
##$BF6= 400.02
##$BF7= 400.02
##$BF8= 400.02
##$BYTORDA= 0
##$CFDGTYP= 0
##$CFRGTYP= 0
##$CHEMSTR= <none>
##$CNST= (0..63)
1 1 145 1 1 1 1 1 1 1 1 1 1 1 1 1 1 1 1 1 1 1 1 1 1 1 1 1 1 1 1 1 1 1 1
1 1 1 1 1 1 1 1 1 1 1 1 1 1 1 1 1 1 1 1 1 1 1 1 1 1 1 1 1
##$CPDPRG= <>
##$CPDPRG1= <>
##$CPDPRG2= <>
##$CPDPRG3= <>
##$CPDPRG4= <mlev>
##$CPDPRG5= <mlev>
##$CPDPRG6= <mlev>
##$CPDPRG7= <mlev>
##$CPDPRG8= <mlev>
##$CPDPRGB= <>
##$CPDPRGT= <>
##$D= (0..63)
0 1 0 0 0 0 0 0 0 0 0 0 0 0 0 0 0 0 0 0 0 0 0 0 0 0 0 0 0 0 0 0 0 0 0 0
0 0 0 0 0 0 0 0 0 0 0 0 0 0 0 0 0 0 0 0 0 0 0 0 0 0 0 0
##$DATE= 0
##$DBL= (0..7)
120 120 120 120 120 120 120 120
##$DBP= (0..7)
150 150 150 150 150 150 150 150
##$DBP07= 0
##$DBPNAM0= <>
##$DBPNAM1= <>
##$DBPNAM2= <>
##$DBPNAM3= <>
##$DBPNAM4= <>
##$DBPNAM5= <>
##$DBPNAM6= <>
##$DBPNAM7= <>
##$DBPOAL= (0..7)
0.5 0.5 0.5 0.5 0.5 0.5 0.5 0.5
##$DBPOFFS= (0..7)
0 0 0 0 0 0 0 0
##$DE= 6.5
##$DECBNUC= <off>
##$DECIM= 2432
##$DECNUC= <off>
##$DECSTAT= 4
##$DIGMOD= 1
##$DIGTYP= 12
##$DL= (0..7)
0 120 120 120 120 120 120 120
##$DP= (0..7)
150 150 150 150 150 150 150 150
##$DP07= 0
##$DPNAME0= <>
##$DPNAME1= <>
##$DPNAME2= <>
##$DPNAME3= <>
##$DPNAME4= <>
##$DPNAME5= <>
##$DPNAME6= <>
##$DPNAME7= <>
##$DPOAL= (0..7)
0.5 0.5 0.5 0.5 0.5 0.5 0.5 0.5
##$DPOFFS= (0..7)
0 0 0 0 0 0 0 0
##$DQDMODE= 0
##$DR= 22
##$DS= 2
$$ [...]
##$SPOFFS= (0..31)
0 0 0 0 0 0 0 0 0 0 0 0 0 0 0 0 0 0 0 0 0 0 0 0 0 0 0 0 0 0 0 0
##$SUBNAM0= <"">
##$SUBNAM1= <"">
##$SUBNAM2= <"">
##$SUBNAM3= <"">
##$SUBNAM4= <"">
##$SUBNAM5= <"">
##$SUBNAM6= <"">
##$SUBNAM7= <"">
##$SUBNAM8= <"">
##$SUBNAM9= <"">
##$SW= 20.5580556627758
##$SWIBOX= (0..15)
0 0 3 4 0 0 0 0 0 0 0 0 0 0 0 0
##$SW_h= 8223.68421052631
##$SWfinal= 0
##$TD= 65536
##$TD0= 1
##$TE= 300
##$TE2= 300
##$TE3= 300
##$TEG= 300
##$TL= (0..7)
0 120 120 120 120 120 120 120
##$TP= (0..7)
150 150 150 150 150 150 150 150
##$TP07= 0
##$TPNAME0= <>
##$TPNAME1= <>
##$TPNAME2= <>
##$TPNAME3= <>
##$TPNAME4= <>
##$TPNAME5= <>
##$TPNAME6= <>
##$TPNAME7= <>
##$TPOAL= (0..7)
0.5 0.5 0.5 0.5 0.5 0.5 0.5 0.5
##$TPOFFS= (0..7)
0 0 0 0 0 0 0 0
##$TUNHIN= 0
##$TUNHOUT= 0
##$TUNXOUT= 0
##$USERA1= <user>
##$USERA2= <user>
##$USERA3= <user>
##$USERA4= <user>
##$USERA5= <user>
##$V9= 5
##$VALIST= <valist>
##$VCLIST= <CCCCCCCCCCCCCCC>
##$VD= 0
##$VDLIST= <DDDDDDDDDDDDDDD>
##$VPLIST= <PPPPPPPPPPPPPPP>
##$VTLIST= <TTTTTTTTTTTTTTT>
##$WBST= 1024
##$WBSW= 4
##$XGAIN= (0..3)
0 0 0 0
##$XL= 0
##$YL= 0
##$YMAX_a= 1278935552
##$YMIN_a= -1563732.48
##$ZGOPTNS= <>
##$ZL1= 120
##$ZL2= 120
##$ZL3= 120
##$ZL4= 120
##$ABSF1= 10
##$ABSF2= 0
##$ABSG= 5
##$ABSL= 3
##$ALPHA= 0
##$AQORDER= 0
##$ASSFAC= 0
##$ASSFACI= 0
##$ASSFACX= 0
##$ASSWID= 0
##$AUNMP= <proc_1d>
##$AXLEFT= 0
##$AXNAME= <>
##$AXNUC= <off>
##$AXRIGHT= 0
##$AXTYPE= 0
##$AXUNIT= <>
##$AZFE= 0.1
##$AZFW= 0.1
##$BCFW= 1
##$BC_mod= 2
##$BYTORDP= 0
##$COROFFS= 0
##$CY= 15
##$DATMOD= 1
##$DC= 2
##$DFILT= <>
##$DTYPP= 0
##$F1P= 0
##$F2P= 0
##$FCOR= 0.5
##$FTSIZE= 0
##$FT_mod= 4
##$GAMMA= 1
##$GB= 0
##$INTBC= 1
##$INTSCL= 1
##$ISEN= 128
##$LB= 0.3
##$LEV0= 0
##$LPBIN= 0
##$MAXI= 10000
##$MC2= 0
##$MEAN= 0
##$ME_mod= 0
##$MI= 0
##$NCOEF= 0
##$NC_proc= -9
##$NLEV= 6
##$NOISF1= 0
##$NOISF2= 0
##$NSP= 1
##$NTH_PI= 0
##$NZP= 0
##$OFFSET= 14.91976
##$PC= 1
##$PHC0= 0
##$PHC1= 0
##$PH_mod= 0
##$PKNL= yes
##$PPARMOD= 0
##$PPDIAG= 0
##$PPIPTYP= 0
##$PPMPNUM= 2147483647
##$PPRESOL= 1
##$PSCAL= 4
##$PSIGN= 0
##$PYNMP= <proc.py>
##$REVERSE= no
##$SF= 90.2741121318492
##$SI= 8192
##$SIGF1= 0
##$SIGF2= 0
##$SINO= 400
##$SIOLD= 32768
##$SPECTYP= <>
##$SREGLST= <1H.CDCl3>
##$SSB= 0
##$STSI= 0
##$STSR= 0
##$SW_p= 1497.18866228788
##$SYMM= 0
##$S_DEV= 0
##$TDeff= 0
##$TDoff= 0
##$TI= <>
##$TILT= no
##$TM1= 0
##$TM2= 0
##$TOPLEV= 0
##$USERP1= <user>
##$USERP2= <user>
##$USERP3= <user>
##$USERP4= <user>
##$USERP5= <user>
##$WDW= 1
##$XDIM= 8192
##$YMAX_p= 1278935552
##$YMIN_p= -1563648
##$CURPLOT= <PDFCreator>
##$CURPRIN= <$PDFCreator>
##$DFORMAT= <normdp>
##$LAYOUT= <+/1D_H.xwp>
##$LFORMAT= <normlp>
##$PFORMAT= <normpl>
##$SURQMSG= 1
$$ End of Bruker specific parameters
$$ ---------------------------------
##XUNITS= HZ
##YUNITS= ARBITRARY UNITS
##XFACTOR= 0.182762287876938
##YFACTOR= 1
##DELTAX= -0.182762287876938
##NPOINTS= 8192
##FIRSTX= 1497.0059
##FIRSTY= -1237504
##LASTX= 0
##MAXY= 1278935552
##MINY= -1563648
##XYDATA= (X++(Y..Y))
$$ plain form
8191 -1237504 396800 496128 -473600 -228352 239104 -280064 -314368 946688 65536 458240
8181 458240 239104 -898560 -102400 156672 551424 -226304 -424448 306176 -123904 -372224
8171 -372224 56320 820224 -649216 873984 -322560 -376832 -176128 -923136 -18944 12800
8160 278016 45568 604160 1109504 -669696 982016 874496 26624 0 94720 -442880 -472064
8149 -472064 -704000 269824 512000 769024 -93696 684032 -312320 616448 651264 760832
8139 760832 -388096 80384 754688 -769536 -252416 139264 1182720 -472064 1187328 -56832
8128 236544 403968 356864 606208 79360 250880 669184 -33792 660992 330240 859648
8118 859648 -406528 -961024 2261504 635392 -131072 561664 326656 -136704 202240 16384
$$ packed form
8191a237504C96800R9328d73600b28352B39104b80064l4304I46688F5536L92704
8181D58240k19136h98560a02400A56672L94752b26304j98144C06176a23904k48320
8171c72224E6320P63904f49216H73984c22560n4272a76128p47008a8944A2800
8160B78016D5568N58592N05344f69696I82016j07520B6624@I4720d42880k9184
8149d72064k31936B69824K42176K57024i3696F84032c12320F16448L4816J09568
8139G60832c88096H0384O74304g69536b52416A39264J043456d72064A187328e6832
8128B36544J67424m7104K49344G9360J71520M18304c3792F60992C30240N29408
8118H59648d06528n54496B261504F35392a31072E61664k35008a36704B02240A6384
$$ plain form
8107 136704 605696 -41472 215040 775680 829440 199680 -60416 -174080 490496 -191488
8096 -40960 357888 -219648 -369152 323072 410112 1088000 -303104 121344 -232448 -165888
8086 -165888 526336 621056 1144832 1031168 -667648 445952 -720384 -805888 716288 1089024
8076 1089024 893440 385024 473600 -563712 -124416 1298944 793088 345600 451072 626688
8066 626688 -659456 -1024512 853504 389120 351744 421376 520704 -1031168 -353792 223232
8055 -305152 -577536 1121280 41472 243712 743424 919040 3072 585728 487936 422912
8045 422912 -402432 240128 -956416 487424 474624 803328 -348672 -215040 61440 243712
8035 243712 -645632 907264 -532992 -420352 247808 259584 1096192 -93696 120832 567296
$$ packed form
8107A36704M68992d1472B15040N60640N3760A99680f0416j13664D90496a91488
8096d0960C57888b19648j49504C23072Q7040O77888c03104A21344b32448O6560
8086a65888E26336R4720N23776j13664f67648D45952g20384q5504G16288L72736
8076A089024j95584C85024Q8576e63712a24416A298944n05856C45600J05472J75616
8066F26688f59456l65056H53504C89120l7376O9632R9328a031168c53792B23232
8055c05152k72384A121280D1472K02240M99712J75616C072N82656r7792o5024
8045D22912d02432B40128i56416D87424j2800L28704c48672J33632F1440J82272
8035B43712f45632I07264e32992J12640B47808J1776Q36608i3696A20832M46464
$$ plain form
8025 567296 -123392 627200 -86016 136704 -770048 -244224 1579008 117248 79872 -532480
8014 -225792 -292352 244736 189440 -498176 -52224 350720 -104448 260096 582144 477184
8004 477184 -163328 47104 355328 305152 741888 231936 371200 -56320 1214464 349696
7993 -32256 -349184 -242688 1026048 -891904 777728 402432 1137664 545280 -486912 472576
7982 388096 578048 606720 -805376 162816 -329728 719872 -165376 -299520 269824 75776
7971 -83968 710656 27136 1528832 430592 -165888 -560640 166400 590336 -113152 437760
7960 890368 -373248 594944 215552 514048 1062400 -545280 512 689152 401408 276480
7950 276480 1763328 -179712 -193024 1666048 502272 -722944 -509952 138752 193024 1086464
$$ packed form
8025E67296a23392F27200h6016A36704g70048b44224A579008A17248l7376e32480
8014b25792o6560B44736n5296d98176e2224C50720a04448B60096L22048j04960
8004D77184a63328D7104L08224n0176M36736B31936J39264e6320A214464C49696
7993c2256l16928J06496A026048h91904G77728l75296P35232E45280d86912D72576
7982C88096J89952K8672h05376A62816c29728G19872a65376j34144B69824G5776
7971h3968G10656B7136J501696D30592a65888l94752A66400M23936a13152D37760
7960H90368c73248E94944B15552K98496N48352e45280E12O88640k87744j24928
7950B76480J486848a79712j3312A666048E02272g22944K12992A38752N4272Q93440
$$ plain form
7940 1086464 671232 -400896 57344 73728 1254912 -14336 -342528 138240 547328 1122304
7930 1122304 125952 -802304 26624 857600 659456 -13312 144896 -720896 -52224 -116736
7920 -116736 919552 -43008 555008 81920 1202176 140800 301568 -481792 -84480 51712
7909 337920 72704 -31744 1243136 806912 893440 634880 34304 137216 -167936 62976
7898 1237504 -580096 54784 -850432 634368 690688 695808 203264 1210368 22016 -598528
7887 873472 -150016 -540160 -229376 -334336 712192 316928 229888 495616 419840 -845824
7876 34304 428032 -44544 -421888 -167424 -794624 211456 -176128 323584 163840 -534016
7865 324096 172544 91136 623616 600576 198144 -51712 199168 2149888 727040 656896
$$ packed form
7940A086464m15232d00896E7344J6384J181184a4336l28192A38240M09088N74976
7930A122304A25952h02304B6624Q30976j98144a3312A44896g20896e2224o4512
7920a16736I19552d3008E55008H1920J120256A40800J60768d81792h4480E1712
7909C37920G2704c1744A243136m36224Q6528k58560C4304J02912a67936F2976
7898A237504e80096E4784h50432F34368N6320N120B03264J007104B2016e98528
7887H73472a50016l90144b29376j04960G12192C16928q7040K65728p5776h45824
7876C4304L93728d4544l77344a67424o27200B11456a76128C23584j59744e34016
7865C24096j51552q1408N32480k3040A98144e1712A99168J950720G27040p0144
$$ plain form
7855 656896 233984 43520 202240 -156160 239616 361472 -407040 92672 93696 1162752
7845 1162752 306688 -586240 -17408 -456192 379904 -393216 1911296 -224768 844288 -37376
7834 -46592 473600 499200 850944 463872 442368 867840 611328 -223744 1134080 -368128
7823 248832 316416 -1400320 1217536 300544 519680 -126976 1755136 -88576 296960 893952
7813 893952 397824 258048 -218112 -1011712 667136 622080 630784 926208 905728 -113152
7802 548864 151040 1189376 457728 682496 580608 272896 -337920 -164864 189952 -154624
7791 483840 183296 1139200 1096704 4608 -145920 424960 94208 86016 -528384 477696 -106496
7779 593408 -830976 438272 360448 363520 319488 875520 269824 1320960 94720 -763904
$$ packed form
7855F56896B33984D3520J58720a56160B39616J21856d07040I2672J024J069056
7845A162752C06688e86240a7408m38784C79904c93216A911296b24768H44288c7376
7834d6592D73600K5600L51744l87072k1504M25472k56512b23744A134080c68128
7823B48832O7584a400320A217536C00544K19136a26976A755136h8576B96960N96992
7813H93952C97824j39776b18112p93600F67136m5056Q704K95424k0480a13152
7802E48864A51040J038336D57728K24768j01888B72896c37920a64864A89952a54624
7791D83840A83296R55904m2496D608a45920D24960I4208q192e28384D77696a06496
7779E93408h30976D38272p7824L072m4032N56032B69824J051136I4720g63904
$$ plain form
7768 -1161728 889856 285184 603136 649216 -108544 548864 -1563648 587264 1042944 267776
7757 195072 -438272 -403456 1035264 350720 -227328 534016 -46080 107520 636416 -646144
7746 2048 732160 -8704 16896 429568 -1135616 -23040 503296 -321536 -456704 1438720
7735 -322560 491520 -147968 1501696 142848 -145408 60416 1031680 1032704 -3072 223232
7724 525312 -156160 -352256 1037312 856576 83968 252928 827392 1113600 343552 -384000
7713 882176 262144 -223744 653312 -617984 266752 680448 174592 -247296 771072 -224768
7702 816640 897024 1154048 1065472 760320 -539136 1102848 -20992 -188928 693248 1229824
7692 1229824 562176 -1041408 1162240 867328 26112 457728 -90112 485888 566272 -243712
$$ packed form
7768a161728H89856B85184L17952M6080a08544E48864a563648E87264M55680B67776
7757A95072d38272L4816A035264C50720b27328E34016d6080A07520N28896f46144
7746B048P30112h704A6896M12672a135616b3040E03296c21536j35168A438720
7735c22560D91520a47968A501696A42848a45408F0416R71264J024c072B23232
7724E25312a56160j96096A037312j80736H3968J68960N74464K86208C43552c84000
7713H82176B62144b23744F53312f17984B66752M13696A74592b47296G71072b24768
7702H16640Q0384K57024q8576l05152e39136A102848b0992j67936F93248N36576
7692A229824E62176a041408A162240k94912B6112M31616i0112D85888Q0384b43712
$$ plain form
7681 -251392 393216 -91648 -256000 393728 222720 -549376 967168 160256 1377792 810496
7671 810496 212480 686080 -955392 36864 60416 -1232384 498176 -198656 105472 -712704
7660 1606144 250368 80384 -52224 641024 -48128 581632 624128 1078784 62464 62976 1057792
7649 1057792 577536 -182784 138752 56320 -509440 392704 -33280 -349696 97792 33280
7638 -474624 1209344 -294400 -1024 -518656 1302016 -133120 283136 140288 504832 674816
7628 674816 628736 612352 120832 631296 -244736 845312 -1193472 1435136 373760 374272
7618 374272 1008640 456704 672256 -832000 1084928 486400 -143872 23040 -320000 778752
7607 505344 -420352 -256000 -275968 -525312 -812544 122368 600576 4608 1362944 498176
$$ packed form
7681b51392C93216i1648j64352C93728j71008e49376I67168A60256J217536n67296
7671H10496B12480M73600i55392C6864K3552a232384D98176a98656A05472g12704
7660A606144B50368H0384e2224F41024d8128E81632M2496M54656F2464N12R94816
7649A057792m80256a82784A38752E6320e09440C92704c3280l16416I7792C3280
7638d74624A209344b94400a024n17632A302016a33120B83136A40288L64544J69984
7628F74816m6080j6384A20832N10464b44736H45312a193472A435136C73760N12
7618C74272O34368D56704K15552h32000A084928D86400a43872B3040c20000G78752
7607E05344d20352J64352j9968k49344k87232A22368M78208D608J358336D98176
$$ plain form
7596 799232 1062912 80896 439296 882176 446976 497152 832000 641024 253952 -599040
7585 -762880 403968 -370688 363520 -3584 -314368 -58880 626688 -144896 47104 1154560
7575 1154560 -536064 346624 187392 1127936 640512 452608 -514560 337920 471552 -47104
7564 643072 188416 743424 -317952 -259584 -80896 218112 74240 -64000 219648 313344 355840
7553 355840 164864 536064 663040 -546816 650752 -519680 -334336 1492480 -70144 105472
7542 611328 370176 933376 200704 -378880 467456 -370688 578560 488960 -237056 -340992
7532 -340992 919040 881152 894464 34304 -649216 246784 495104 936448 71680 466432
7522 466432 -655360 56320 509440 431104 47616 804864 -129024 -402944 109056 263680
$$ packed form
7596G99232K63680H0896L58400M42880m35200N0176L34848j90976B53952e99040
7585g62880D03968c70688C63520c584l10784e8880F26688a44896D7104J107456
7575A154560e36064C46624j59232R40544m87424j87904e14560C37920J33632d7104
7564F43072A88416N55008c17952N8368h0896B18112G4240f4000B19648R3696M2496
7553C55840A64864L71200J26976e46816F50752e19680J85344A492480g0144A05472
7542F11328k41152N63200B00704c78880D67456c70688E78560q9600b37056j03936
7532c40992I19040l7888J3312C4304f49216B46784K48320M41344G1680L94752
7522D66432f55360E6320M53120p8336D7616P57248a29024k73920A09056J54624
$$ plain form
7512 263680 -612352 512 899072 707584 858112 791552 380416 1036288 775168 219648
7501 -240640 -220160 307200 1102336 -908288 72704 -50688 988672 -526848 -235008 815104
7490 -624128 -425984 679936 742912 -965120 610816 -299008 887296 286208 886784 316416
7479 451584 146944 1062400 865792 -4608 665088 -24576 -352256 702464 -682496 -12288
7468 -99328 439808 903168 184320 832000 175616 -8192 585728 942592 152064 846848
7458 846848 -99840 757760 -2048 -253952 856064 558080 439808 277504 351744 -531456
7447 922624 -202240 848384 374784 263680 540672 1201152 459264 742912 344064 368128
7437 368128 553472 980992 -294912 860672 316416 170496 1357312 27136 975360 1128960
$$ packed form
7512B63680f12352E12Q98560j91488J50528o6560C80416O55872k61120B19648
7501b40640K0480C07200P95136i08288G2704e0688I88672e26848b35008H15104
7490f24128J98144F79936O2976i65120F10816b99008H87296B86208O00576C16416
7479D51584A46944R15456j96608d608F65088b4576l27680G02464f82496a2288
7468i9328D39808M63360A84320O47680A75616h192E85728L56864A52064O94784
7458H46848i9840G57760b048k51904H56064k97984j18272j62304P4240e31456
7447I22624b02240H48384C74784j11104K76992O60480D59264K83648C44064K4064
7437C68128J85344M27520b94912H60672C16416j45920J186816B7136R48224J53600
$$ plain form
7427 1128960 810496 1105920 96768 -222208 524288 302080 492544 582144 1208320 1307136
7417 1307136 693248 614912 -77312 46592 -318464 978944 467968 387072 256000 921600
7407 921600 1124864 -193024 538112 164864 49664 -537600 1192960 -97792 65536 556032
7397 556032 1051136 -80384 840704 172032 379392 655360 1174016 1147904 -892928 200192
7386 45568 -402944 502784 146944 254976 1143808 1031680 48128 295424 765952 619008
7376 619008 -22016 869376 448512 160256 4096 -442880 768512 1436672 77824 -277504
7365 -214016 787456 -396800 100864 -176640 242176 632320 -103936 -73216 819200 1166848
7355 1166848 416768 77824 104960 404992 1666560 1060864 662016 677888 520192 -327680
$$ packed form
7427A128960l18464K95424I6768b22208E24288k22208J90464Q9600O26176R8816
7417A307136o13888p8336g7312D6592c18464I78944D67968q0896j31072O65600
7407I21600K03264a93024E38112A64864D9664e37600A192960i7792F5536M90496
7397E56032M95104h0384H40704A72032K07360K75968N18656k6112h92928B00192
7386D5568d02944E02784A46944J08032Q88832j12128D8128K47296M70528j46944
7376F19008b2016H69376m20864A60256D096d42880G68512O68160G7824b77504
7365b14016G87456c96800A00864a76640B42176L90144a03936L0720H19200L47648
7355A166848D16768G7824K7136L00032J261568o05696l98848J5872j57696c27680
$$ plain form
7344 762880 -695296 367104 879104 -391680 1024000 30720 374784 771072 330240 160768
7333 1286656 888832 -135168 182784 798208 618496 -691712 439808 710144 301056 346112
7323 346112 355328 417280 1309184 1263104 -367104 -64000 -406016 670720 778240 468480 603648
7312 603648 618496 561152 -256000 526848 216576 193024 1141760 64512 336384 145408
7301 322560 -129536 -96768 356352 230400 224768 -13824 -526336 1091584 1547776 -496128
7290 809984 1082368 -451072 -291328 726016 117248 150016 72704 925184 -137216 24064
7279 1056768 20992 300544 182784 1812992 622592 602624 545792 145408 -118784 1536
7268 1288704 888832 623616 1471488 57856 289792 1088000 -655872 301056 -332288 -248832
$$ packed form
7344G62880f95296C67104N12000c91680A024000C0720L44064L96288C30240A60768
7333A286656l97824a35168A82784O15424j79712f91712D39808K70336C01056M5056
7323C46112R216O1952Q91904m6080c67104f4000l42016F70720J07520l09760J35168
7312F03648J4848n7344b56000E26848B16576k3552R48736F4512K71872A45408
7301C22560a29536L2768C56352j25952n632a3824n12512A091584M56192d96128
7290H09984K72384d51072J59744G26016A17248L2768G2704Q52480a37216B4064
7279A056768B0992K79552j17760J630208F22592j9968n6832A45408a18784A536
7268A288704l99872k65216Q47872E7856K31936P98208f55872C01056c32288Q3456
$$ plain form
7258 -248832 494080 -984064 989696 965632 -85504 278528 99328 891392 386048 855552
7248 855552 229888 415744 252928 101888 769024 598528 -178688 -17920 -17920 521728 -147968
7236 -60928 78848 952832 88064 849408 -179200 -529408 353280 1049088 53248 476160
7226 476160 134656 702464 575488 671232 -102400 -608256 1091072 642560 66048 523776
7216 523776 -43008 1240064 934912 95744 837120 -365568 757760 250368 29184 953856
7206 953856 1009664 96256 -122880 -11264 1620480 -501248 877056 -288768 868864 760832
7196 760832 581120 205824 154112 542208 700928 469504 -266240 371200 102912 -541184
7185 44032 -37376 612864 -663552 -371200 1067008 348160 936448 266240 258560 210432
$$ packed form
7258b48832D94080i84064I89696k4064h5504B78528I9328P92064C86048M69504
7248H55552B29888J85856j62816A01888O67136j70496a78688a7920%E21728a47968
7236f0928G8848Q73984H8064P61344a79200l50208C53280O95808E3248M22912
7226D76160A34656N67808j26976R5744a02400n05856A091072m48512F6048M57728
7216E23776d3008A240064l05152I5744P41376c65568G57760B50368B9184R24672
7206I53856N5808I6256a22880a1264A620480e01248H77056b88768H68864j08032
7196G60832j79712B05824n1712L88096J58720k31424b66240C71200A02912e41184
7185D4032c7376F12864f63552K92352A067008C48160N88288B66240p680m8128
$$ plain form
7175 210432 699904 514048 -109568 655360 -157696 271360 1043968 733184 778240 -535552
7164 1085952 -111104 496640 1020928 786944 651264 14336 -68608 259072 1071104 -8192
7153 985088 -32768 -585728 450560 -136704 632320 847360 369664 39936 906752 -861696
7142 695296 -546816 485376 400896 113152 -837120 251392 572416 -460288 710656 -387072
7131 77312 425984 1148416 691712 105472 184320 -81408 833024 1067008 221696 -169472
7120 76288 126464 574976 -185856 1133568 474624 1085952 370688 346624 582656 -450560
7109 -107008 371200 241664 857088 -39424 -256000 638976 641536 827904 -515584 -36864
7098 1088000 775168 729088 23552 201728 -850432 721408 856064 308736 333312 -615424
$$ packed form
7175B10432M89472j85856a09568F55360a57696B71360P72608l10784M5056e35552
7164A085952a11104D96640N24288k33984j35680A4336f8608B59072Q12032h192
7153I85088c2768n52960D50560a36704F32320K15040C69664C9936Q66816h61696
7142F95296e46816D85376q4480A13152h37120B51392L21024d60288G10656c87072
7131G7312L48672P22432m56704A05472P8848h1408H33024K33984B21696a69472
7120G6288N0176M48512a85856A133568D74624O11328C70688k4064K36032d50560
7109a07008C71200j29536O15424c9424k16576F38976K560J86368e15584c6864
7098A088000l12832m6080B3552J78176h50432G21408J34656C08736K4576f15424
$$ plain form
7087 -312320 218112 849920 163328 -68608 155136 561152 784384 920576 841216 -246272
7076 664064 348672 31232 1542144 510464 1838080 521216 592896 290304 1235968 811008
7066 811008 78336 86016 219648 -118272 1616896 -149504 880128 1578496 -284160 4608
7055 427520 1060352 -81408 398336 -475136 175104 987136 329216 -228864 190976 -801792
7044 466944 1549312 316416 186368 611328 -17408 234496 1136640 279552 -734720 1233408
7033 421376 -60416 1151488 290816 -36864 294912 359936 487936 -542208 163840 28160
7022 1316864 278528 651264 508416 268800 1025536 968704 -184320 340480 -308736 633344
7011 1346048 1647616 -425472 -168960 -165888 -523776 571392 311296 776704 285696 879616
$$ packed form
7087c12320B18112O31808A63328f8608A55136M06016K23232J36192p9360b46272
7076F64064l15392C1232J510912E10464J327616E21216P1680B90304R45664m24960
7066H11008G8336P680J33632a18272A616896a49504H80128O98368b84160D608
7055D27520O32832h1408C98336d75136A75104Q12032C29216b28864A90976h01792
7044D66944J082368C16416j30048M24960a7408B34496R02144B79552g34720A233408
7033D21376f0416A151488B90816c6864B94912O5024J28000e42208A63840B8160
7022A316864B78528L72736j42848k39616P56736n6832a84320C40480c08736F33344
7011A346048L01568d25472a68960L072l57888E71392k60096M65408B85696N93920
$$ plain form
7001 879616 848896 775680 590848 950784 -81408 -139776 -149504 819712 -460800 827392 1244160
6990 1244160 568832 962048 75776 208384 187392 751104 851456 232448 1148928 309248
6979 756736 1002496 255488 -514560 260096 -78848 155136 324608 0 -572928 793088 336384
6967 -305664 -20480 1369088 419840 50176 555008 589824 -205824 202240 256000 -73728
6956 697856 361984 1147904 26112 1483776 855040 1172480 408064 -208896 769536 998400
6946 998400 336384 496128 299520 538112 823808 1099776 51712 427520 155136 -132096
6935 1072640 839680 175616 -488448 -48128 -412672 367104 281600 1208320 61952 108544
6925 108544 551936 264192 -414720 202240 365056 723456 149504 1029632 1039872 255488
$$ packed form
7001H79616l0720p3216j84832L59936h1408n8368r728H19712d60800H27392M16768
6990A244160E68832L93216G5776J32608k0992N63712J00352B32448R16480C09248
6979G56736K45760B55488e14560B60096g8848A55136J69472@e72928G93088C36384
6967c05664b0480A369088D19840E0176N04832L4816b05824B02240N3760g3728
6956F97856l35872P85920B6112J457664o28736L17440D08064b08896G69536K28864
6946I98400C36384J59744j96608K38592K85696K75968E1712L75808A55136a32096
6935A072640k32960A75616d88448d8128l64544C67104q5504R26720F1952M6592
6925A08544M43392B64192d14720B02240J62816L58400A49504Q80128J0240B55488
$$ plain form
6914 382976 -142336 122368 784384 -515584 400384 396800 215552 -709632 528384 9216
6903 399360 -7168 1121280 -55808 1189888 1533952 -542208 727040 1029120 694272 1125376
6893 1125376 -337408 -274944 471040 546304 1103360 -217600 309760 625152 577536 -396288
6882 1616384 183808 969728 298496 126464 1084416 952832 397824 404992 307200 53760
6871 -347136 178688 48640 1061376 -226816 248832 -38400 1693184 42496 190464 595968
6861 595968 386048 328704 -241152 424448 602112 973824 -216576 1184256 -375808 666112
6850 670720 258560 1004544 -199680 -355840 -324096 1426432 402432 912896 524288 -131072
6839 -4608 247296 76288 1027072 755200 656896 448512 -152576 504832 -330752 578560
$$ packed form
6914C82976a42336A22368O62016e15584D00384l584j81248g09632E28384I216
6903C99360g168A121280e5808A189888L44064e42208G27040L02080l34848M31104
6893A125376c37408O2464D71040P5264N57056b17600C09760L15392m7616c96288
6882A616384A83808P85920B98496A26464R57952j31584C97824P168r7792E3760
6871c47136A78688D8640J012736b26816B48832c8400A693184D2496J47968M05504
6861E95968k09920n7344b41152D24448J77664L71712b16576A184256c75808F66112
6850F70720B58560P45984a99680j56160L1744A426432D02432N10464l88608a31072
6839d608B47296G6288R50784k71872r8304k08384a52576E04832c30752E78560
$$ plain form
6828 631296 -322048 619520 426496 -540672 437248 861696 178176 378368 1412608 209408
6817 572928 755712 1544192 28160 -625152 645632 -385536 96256 372736 207872 46592
6806 758784 823296 -93696 -747008 -162816 -615936 1182720 676864 444416 849920 854016
6796 854016 695808 -462848 793088 1016832 -207360 322560 325632 467968 1231360 -50176
6785 343040 -344064 1032704 -289792 349184 999424 384512 452608 5632 434176 127488
6774 971776 857088 1008640 707072 526336 557568 232960 1318912 270336 -154624 286208
6763 1296384 1549824 231936 406528 352256 1037824 946176 1061888 422912 730624 1015808
6753 1015808 954368 456192 -116736 1084416 -316928 418304 592384 -482816 348160 73216
$$ packed form
6828F31296c22048F19520j93024e40672D37248M24448A78176K00192J034240B09408
6817E72928J82784P88480B8160f25152F45632c85536I6256K76480j64864D6592
6806G58784O4512i3696o53312a62816m53120A182720n05856k32448M05504M096
6796H54016j58208d62848G93088K23744b07360C22560L072J42336P63392e0176
6785C43040c44064A032704b89792C49184O50240C84512O8096E632M28544A27488
6774I71776j14688J51552l01568j80736L1232B32960J085952B70336a54624B86208
6763A296384K53440B31936J74592n4272O85568r1648J15712D22912L07712K85184
6753A015808o1440D56192a16736A084416c16928D18304J74080d82816C48160G3216
$$ plain form
6742 117248 853504 211968 323072 91648 -245760 -77312 1471488 253952 777216 -738304
6731 507904 894976 217088 -320000 1180160 113152 239104 1104896 301056 445952 785408
6721 785408 1120768 419328 44544 767488 1841152 933376 364032 402432 -920064 458240
6710 345600 1759744 251904 230912 -57856 754688 34816 498176 61440 -1172992 409600
6699 715776 284160 280576 1085952 -19456 622592 753152 833536 1322496 -104448 619520
6688 1107968 822272 184832 127488 630784 481280 1441792 1395712 581632 -21504 79872
6677 382464 -217600 130048 515584 584704 62464 909824 636928 -19456 1123328 1209856
6667 1209856 792576 -617984 68096 1035776 245248 485888 -29184 -204288 958464 585728
$$ packed form
6742A17248P36256B11968J11104I1648b45760g7312A471488B53952N23264g38304
6731E07904L87072B17088c20000A180160A13152J25952Q65792C01056J44896L39456
6721G85408L35360D19328D4544P22944J073664r07776C64032L8400i20064D58240
6710C45600J414144B51904k0992e7856G54688C4816M63360F1440a172992D09600
6699G15776B84160l584Q05376a9456F22592J30560Q0384M88960a04448F19520
6688A107968k85696A84832n7344N03296j49504R60512m6080E81632b1504G9872
6677C82464b17600A30048L85536O9120F2464Q47360k72896a9456A123328Q6528
6667A209856m17280f17984F8096R67680B45248K40640b9184j75104I58464l72736
$$ plain form
6657 585728 277504 367104 51200 1028608 1533952 89600 532480 -98304 236032 -169472
6646 221696 -397824 302080 1013248 1244672 331776 848896 344064 1128960 637952 1264640
6636 1264640 811008 814080 463360 367616 775680 683008 495104 736768 -86528 415744
6625 177664 1302016 988160 -19968 1425920 1956352 244736 640000 1742336 377856
6615 207360 411648 235008 467456 380416 871936 97280 1366528 352768 50176 832512
6605 832512 1522176 657920 7168 203264 -6656 332288 896512 733184 1128448 247808
6594 198656 1616896 246272 231424 -430080 -5120 780288 665600 444416 520704 -168448
6583 758272 958464 244224 288256 314880 838144 968704 227840 -496640 382976 658944
$$ packed form
6657E85728B77504Q9600E1200R77408N05344H9600M42880i8304B36032a69472
6646B21696c97824C02080P11168K31424C31776N17120C44064P84896m91008O26688
6636A264640m53632L072l50720r5744M08064r2672j87904K41664h6528D15744
6625A77664J124352l13856a9968A425920N30432B44736L95264J102336C77856
6615B07360K04288j76640K32448q7040M91520I7280J269248C52768E0176P82336
6605H32512O89664F57920G168J96096f656C32288N64224j63328L95264B47808
6594A98656J418240B46272j4848d30080e120G80288j14688k21184P6288a68448
6583G58272K00192B44224M4032K6624N23264J30560B27840d96640C82976K75968
$$ plain form
6573 658944 288256 226304 1316352 367616 1217024 637440 -162816 715264 2168832 -14336
6562 -144384 820736 748032 889856 -302592 796160 1603072 1036800 448000 285696 1368064
6552 1368064 76288 1015296 1048064 -375808 712704 -403968 -593408 116736 480768 1148928
6542 1148928 -165376 612864 79872 -443392 279040 867328 404480 986624 821760 1995776
6532 1995776 -25600 -482816 709632 21504 790528 1709056 138240 879104 983552 574464
6522 574464 756736 262144 921600 1189376 209408 231936 1350144 1126400 1095168 496640
6511 -327168 227840 410112 638464 1351680 251904 291328 346112 1053696 402944 210944
6501 210944 -560640 1315840 196096 103936 1032704 1747968 -256512 415744 501760 668160
$$ packed form
6573F58944B88256o1952J090048C67616Q49408n79584a62816G15264J453568a4336
6562a44384H20736p2704J41824c02592G96160Q06912n66272D48000j62304J082368
6552A368064G6288R39008L2768c75808G12704d03968j89440A16736L64032O68160
6542A148928a65376F12864G9872d43392B79040N88288D04480N82144j64864J174016
6532A995776b5600m57216G09632B1504P69024R18528A38240P40864J04448m09088
6522E74464J82272B62144O59456K67776B09408K2528J118208k23744l1232D96640
6511c27168B27840J82272K28352P13216B51904L9424N4784P07584D02944j92000
6501B10944e60640A315840A96096r2160R28768P15264b56512D15744Q6016J66400
$$ plain form
6491 668160 154624 845312 -21504 472064 402944 839168 -307200 1003520 479744 -129024
6480 76800 1567744 1027072 261632 342528 983552 489984 1087488 89088 544256 1022464
6470 1022464 726016 1065472 816640 1567744 453632 1300992 -756224 918016 136704 -262144
6459 841216 257536 158720 251904 -73728 514048 112640 708096 240640 -94720 1660928
6448 482304 528896 497664 377344 1180160 -744448 385024 1360384 394752 476160 751104
6438 751104 318976 1252352 -334336 1078784 446464 316928 549376 291328 -508928 783872
6427 893952 -224256 959488 41472 262144 -200704 -844288 825344 481280 -269824 646144
6416 897536 2193408 -92160 740864 1052160 102912 2018304 966144 135168 251392 530944
$$ packed form
6491F68160A54624O90688b1504D72064o9120M36224c07200A003520D79744a29024
6480G6800J490944n40672B61632Q0896O41024D89984N97504H9088M55168M78208
6470A022464k96448L39456k48832P51104D53632Q47360g56224I18016A36704b62144
6459H41216B57536r8816R3184g3728E14048A12640N95456B40640i4720A660928
6448D82304M6592l1232j20320Q02816g44448C85024R75360C94752Q1408K74944
6438G51104C18976R33376c34336A078784D46464j29536K32448k58048e08928G83872
6427H93952b24256I59488D1472K20672b00704o43584H25344l44064b69824F46144
6416H97536J295872i2160G40864L11296A02912J915392I66144A35168J16224K79552
$$ plain form
6406 530944 384000 1751040 561152 296960 927232 523776 352256 927744 634880 1020416
6396 1020416 23552 880640 969728 239104 189440 17920 935936 726016 -211456 763392
6385 193024 507904 415232 726528 28160 227328 -55808 195584 480256 551936 1109504
6375 1109504 26112 -67584 753152 542208 1171456 790528 -240640 1249280 433664 98304
6364 434688 471040 1283072 650240 -481280 1360384 775680 652800 983552 842240 1224192
6354 1224192 386560 -198656 1012224 865792 1154048 -39424 130048 166912 -5632 -450048
6344 -450048 702976 902656 -681984 257024 0 869376 699392 -60928 9216 -691200 360448
6332 -132608 578560 -126976 479744 866816 404480 1181184 -96768 39424 1178112 427008
$$ packed form
6406E30944j46944J367040E61152k64192O30272m03456j71520N75488k92864L85536
6396A020416B3552Q57088Q9088B39104m9664A7920R18016k09920b11456G63392
6385A93024L14880r2672L11296B8160J99168e5808A95584K84672P1680N57568
6375A109504B6112f7584G53152k10944O29248l80928b40640A249280D33664I8304
6364D34688L6352Q12032o32832d81280A360384n84704j22880L30752j41312L81952
6354A224192C86560a98656A012224j46432K88256c9424A30048L6864e632m44416
6344d50048G02976J99680f81984B57024@H69376j69984f0928I216f91200C60448
6332a32608E78560a26976D79744L87072D04480P76704i6768C9424J138688D27008
$$ plain form
6321 1174016 208896 -909824 247296 380928 -225280 207360 1373696 -363520 122368
6311 966656 978944 -207872 1095680 -364544 -564224 -166912 1233408 1435648 915968 557056
6301 557056 492032 800256 -253952 890880 561152 -448512 838144 139776 841728 400384
6290 717312 1320960 -143872 779264 -217088 799232 919040 356352 1094144 133120 -236032
6279 691712 -166400 965632 -12288 947712 677376 1623552 522240 403456 -36352 593920
6268 696320 509952 139776 21504 -546304 1090560 1522688 35840 652800 418304 291328
6258 291328 384000 212480 438272 730624 1317888 1240576 198656 75776 225280 1365504
6248 1365504 -188416 401408 235520 1708544 889344 -26624 -168448 210432 517120 1301504
$$ packed form
6321A174016B08896i09824B47296J33632b25280B07360J166336c63520A22368
6311I66656J2288b07872A095680c64544j99680a66912A233408K02240n19680l58912
6301E57056o5024L08224b53952H90880l29728d48512H38144A39776P01952D00384
6290G17312O03648a43872G79264b17088G99232J19808C56352P37792A33120b36032
6279F91712a66400I65632a2288I47712k70336R46176E22240j18784c6352E93920
6268F96320j86368A39776B1504e46304A090560M32128C5840O16960k34496j26976
6258B91328R2672j71520K25792K92352N87264p7312A98656G5776J49504J140224
6248A365504a88416D01408j65888J473024q19200b6624j41824B10432L06688P84384
$$ plain form
6238 1301504 901120 1045504 95232 -269824 822272 1512448 583168 806400 356864 503296
6228 503296 367616 -545792 877568 1714688 -139776 793600 295936 430080 1047040 1245184
6218 1245184 2104832 777728 548352 -875520 179200 -321024 440320 765440 1013248 637952
6208 637952 702464 -265728 138752 1641472 542208 1526272 688128 34816 973824 -732160
6197 722432 553472 736256 -449024 1257984 780288 340992 1181184 843264 984064 1170944
6187 1170944 513024 872960 720384 455680 658944 1122304 -97792 39936 642560 1350144
6177 1350144 259584 925696 307200 143360 922624 963584 224256 1407488 908800 814080
6167 814080 1028096 -86528 759296 418304 500224 157184 206336 1023488 -536576 455168
$$ packed form
6238A301504m00384J44384I5232b69824H22272O90176E83168K23232C56864J46432
6228E03296j35680e45792H77568Q37120a39776G93600B95936J34144O16960J98144
6218A245184Q59648G77728k29376h75520A79200c21024D40320L25120K47808l75296
6208F37952O4512b65728A38752J502720E42208R84064F88128C4816R39008g32160
6197G22432j68960J82784d49024A257984m77696C40992Q40192l37920J40800J86880
6187A170944E13024L59936j52576k64704K03264M63360i7792C9936O02624P07584
6177A350144B59584O66112C07200A43360P79264M0960B24256J183232m98688r4720
6167H14080K14016h6528G59296l40992Q1920A57184M9152Q17152e36576D55168
$$ plain form
6156 759808 626176 328192 -331264 1086464 162816 -216064 910336 1151488 678912 712704
6146 712704 1254400 1022464 704512 299008 433152 852480 1138688 908800 823808 312320
6135 656384 451072 320000 923136 1138176 190976 1248256 537600 1960960 2808320
6126 2808320 288768 709120 356864 -20992 324096 975360 572928 1079808 955904 948736
6116 948736 1042432 341504 781312 875008 1414656 1357312 613888 388096 552448 209408
6105 722944 97792 108032 1605632 1905152 781824 1104896 928256 807424 1282048 -52736
6094 822784 187904 733184 59392 72192 983552 230912 -374272 66560 106496 579072
6084 579072 613888 1038336 192000 437248 1260032 163328 427008 130048 473088 1222656
$$ packed form
6156G59808j33632k97984c31264A086464A62816b16064I10336K41152m72576L3792
6146G12704N41696k31936l17952B99008J34144M19328K86208k29888q4992C12320
6135F56384k05312j31072O03136K15040A90976J057280E37600J423360Q47360
6126B808320B88768M20352l52256b0992C24096O51264m02432N06880j23904p168
6116I48736R3696C41504M39808R3696N39648n7344F13888k25792J64352B09408
6105G22944I7792J0240J497600K99520G81824L23072j76640j20832M74624e2736
6094H22784A87904N45280E9392J2800R11360B30912c74272F6560L9936M72576
6084E79072L4816M24448A92000K45248Q22784A63328K63680A30048L43040P49568
$$ plain form
6074 1222656 -964096 757248 169984 1150464 79360 561152 -74240 623104 344576 238592
6064 238592 937984 307200 1954304 443904 745984 915456 375296 365568 691200 728576
6054 728576 543744 420352 980480 593920 917504 1573888 574976 53248 852480 799744
6044 799744 -349696 1156608 391680 377856 871424 669696 593408 374784 1156096 1056256
6034 1056256 -67584 369664 694784 1117696 599040 504832 511488 -480768 1729024 142848
6023 1172992 599552 410624 590848 991744 -179712 279040 1161216 857088 -797696 409600
6012 411648 666624 -148480 670720 33280 1546752 1069056 619520 182272 843264 709632
6002 709632 891904 -717824 884224 106496 859648 955904 957440 -204800 44544 453120
$$ packed form
6074A222656i64096G57248A69984R80480G9360M81792g4240F23104k78528j05984
6064B38592O99392C07200J647104D43904L02080J69472C75296r728L25632L7376
6054G28576j84832j23392N60128l86560L23584O56384E74976E3248P99232n2736
6044G99744c49696A156608C91680j3824M93568k01728p6288k18624P81312r9840
6034A056256f7584C69664L25120M22912n18656r4208O656d80768A729024A42848
6023A172992n73440j88928J80224M00896a79712B79040Q82176l04128g97696D09600
6012D11648K54976a48480F70720C3280J513472m77696m49536A82272O60992j33632
6002G09632J82272g17824H84224A06496P53152R6256J536b04800D4544M08576
$$ plain form
5992 453120 -329728 494592 1307648 1131520 -103424 1890816 170496 1482240 724992
5982 -128512 839680 1270272 -91648 785920 1136640 654848 766464 750592 106496 607232
5972 607232 516096 1499136 685568 14336 -233472 509952 1356288 1645056 371712 922112
5962 922112 419328 900608 692736 263168 883712 810496 -208384 -48640 891392 1996800
5952 1996800 635392 351232 572928 979968 77824 239616 244224 657920 -10240 1420800
5941 1387008 271360 -97792 647168 1284608 843264 419840 420352 552448 331264 507392
5931 507392 881152 389632 497664 1010688 5120 625664 715264 303616 -229376 865280
5920 1558016 520192 9216 1317376 1149440 263168 1039360 854016 429056 1680384 1081856
$$ packed form
5992D53120c29728D94592Q13056j76128a03424A890816A70496J311744G24992
5982a28512H39680M30592i1648G85920L50720m81792J11616j5872A06496N00736
5972F07232r1136R83040F85568A4336b33472E09952Q46336K88768C71712N50400
5962I22112D19328M81280k07872B63168O20544p3216b08384d8640H91392J105408
5952A996800F35392k84160K21696M07040G7824J61792M608M13696a0240A420800
5941A387008B71360i7792F47168O37440m41344D19840N12J32096k21184J76128
5931E07392L73760C89632J08032N13024E120O20544Q9600C03616b29376H65280
5920A558016E20192I216J308160j67936B63168P76192j85344m24960J251328n98528
$$ plain form
5910 1081856 409600 892416 142336 865280 960000 1607680 435200 1161728 940032 244736
5899 198144 1247232 1252352 56320 206336 1284096 514560 440832 990720 310272 1972224
5889 1972224 962048 413184 1306624 1582592 528896 243712 428032 679936 1511424 2164224
5879 2164224 1504256 935424 355840 915456 605696 207872 1238016 410624 1137152
5870 1137152 500224 808960 760320 366080 732672 1125376 1483264 1306112 1712640 18432
5859 907264 308224 536576 532992 842240 898560 320512 358912 698880 421888 765952
5849 765952 860160 1676800 1820672 613376 631808 15360 87552 749056 -911872 1235968
5838 856576 1385984 968704 268288 1184256 1196032 -215040 -446464 888832 1444864 997888
$$ packed form
5910A081856D09600M82816A42336P22944R4720O47680D35200P26528k21696B44736
5899A98144J049088N120E6320J50016J077760E14560p3728N49888C10272J661952
5889A972224I62048D13184Q93440K75968E28896B43712J84320K51904Q31488O52800
5879B164224o59968n68832C55840N59616l09760B07872J030144D10624P26528
5870A137152E00224L08736m8640C66080L66592L92704L57888j77152M06528A8432
5859I07264C08224K28352l584L09248N6320C20512L8400L39968k76992L44064
5849G65952R4208Q16640J43872F13376J8432A5360P2192O61504i11872A235968
5838H56576N29408m17280B68288R15968J1776b15040k31424H88832N56032m46976
$$ plain form
5828 997888 515584 814592 565760 -645632 493568 1329664 519168 593920 215040 53760
5817 220160 799232 -306688 372736 1800704 966144 844800 167936 1231872 833024
5808 833024 975872 736256 26112 985600 62976 800256 -62976 917504 151552 313856
5798 313856 -94720 -549888 -113152 363008 318464 1536 171520 337408 397312 429056 674304
5787 674304 1424384 1061888 1048064 658432 58368 1017344 -94720 595456 441856 171008
5776 824832 771072 568320 -58880 828416 484352 1264640 1655296 -27648 1543680 1109504
5766 1109504 1324544 896000 1713152 857088 656384 382464 1400832 587264 799232
5757 799232 796160 1381888 615936 479744 1195520 158208 414208 634880 717312 1225728
$$ packed form
5828I97888m82304K99008k48832f45632D93568Q36096E19168P4752B15040E3760
5817B20160N79072c06688C72736J427968q34560j21344A67936J063936l98848
5808H33024J42848k39616B6112R59488F2976P37280f2976I17504A51552J62304
5798C13856i4720m55168a13152C63008m4544A536J69984J65888N9904L1744K45248
5787F74304P50080l62496j3824l89632E8368R58976i4720E95456j53600A71008
5776H24832n3760k02752e8880H28416l44064P80288L90656b7648A543680m34176
5766A109504K15040m28544Q17152q56064k00704k73920J018368E87264K11968
5757G99232l072N85728F15936j36192P15776A58208K56000K20672Q2432N08416
$$ plain form
5747 1225728 271360 766976 1290240 686080 604672 1509376 521728 1230848 1208832 815616
5737 815616 1069056 978944 959488 889344 1353216 1044480 913408 301056 223232 1159168
5727 1159168 843264 794624 938496 112128 281600 141824 1227264 715776 1425408 -122368
5716 1555968 778240 488448 -485376 339968 915968 976384 1152000 1360384 219648 1447936
5706 1447936 362496 1313280 2045440 1268736 151040 478720 1783296 1238528 581120
5696 1135616 1175552 937472 1067008 573440 1204736 1170432 1458688 566784 465920 1105920
5686 1105920 701440 1268736 1090560 658944 2032640 468480 1825792 229376 774144
5677 774144 849408 1145344 1563136 730624 744960 734720 647168 1039360 1292288 -95744 562176
$$ packed form
5747A225728B71360M95616N23264o04160q1408R04704E21728P09120k2016l93216
5737H15616K53440r0112j9456p0144M63872l08736j31072C01056p7824R35936
5727A159168l15904m8640J43872A12128J69472j39776J085440n11488P09632a22368
5716A555968p77728k89792d85376C39968N76000O0416J75616K08384B19648J228288
5706A447936C62496R50784P32160p76704A51040L27680J304576n44768E81120
5696A135616L9936k38080J29536m93568O31296l4304K88256E66784j00864O40000
5686A105920m04480N67296j78176m31616J373696D68480J357312B29376N44768
5677G74144P5264K95936M17792G30624J4336j0240q7552L92192K52928i5744E62176
$$ plain form
5665 737280 1215488 1268736 137728 2231296 1775104 207872 835072 636416 -744448 159232
5654 42496 458752 680448 486912 1330688 1234432 579072 348672 1151488 672256 1382912
5644 1382912 173568 334336 1437184 224256 793600 1199104 369152 1587712 1689600
5635 1689600 799232 1067520 728576 425472 113152 1147904 776192 605184 1596928
5626 1596928 1269248 1563648 -569344 398848 940544 586240 832000 653312 273920 352768
5616 352768 1069568 874496 939008 841216 363008 1159168 683520 698880 2390528 867328
5605 577536 1188352 393216 687616 -247296 209408 733184 1489920 232960 1372160 329728
5594 147456 336384 321536 547328 261632 1554432 246784 820736 229376 1846272 1247744
$$ packed form
5665G37280M78208N3248A37728K093568m56192B07872O27200j98656g44448A59232
5654D2496M16256K21696j93536Q43776r6256E79072k30400Q02816m79232P10656
5644A382912A73568J60768J102848B24256N69344M05504C69152J218560J01888
5635A689600G99232K68288l38944l03104A13152J034752l71712j71008R91744
5626A596928l27680K94400e69344C98848N41696l54304K45760j78688B73920P8848
5616C52768P16800j95072O4512r7792C63008P96160m75648J5360J691648H67328
5605E77536O10816C93216K94400b47296B09408N23776P56736B32960J139200C29728
5594A47456J88928j4848K25792B61632J292800B46784N73952B29376J616896n98528
$$ plain form
5584 1247744 505344 1203712 711168 -238592 1076224 267776 691712 1380864 925184
5575 925184 -241664 85504 876544 1787904 1486336 1481216 -135680 1254912 1206272 1402368
5565 1402368 1185792 440832 1280512 1329664 714240 487936 467456 562176 3072 787968
5555 787968 2445824 1474048 74240 1202688 614912 1392640 801280 478208 1316864 617472
5544 145920 1936896 100864 1007616 1278464 1420800 677888 989696 1069056 1445376 467968
5533 1349632 1158656 417280 889344 817152 1364992 968192 737280 1081856 1390592 797184
5523 797184 1116160 907264 423936 890880 1016832 956928 59392 727040 624640 1377280
5513 1377280 -32256 531456 671232 2531328 478208 338432 1018880 505344 346112 344064
$$ packed form
5584A247744E05344O98368m92544b38592A076224B67776M23936O89152m55680
5575I25184b41664H5504P91040R11360l01568n120a35680A254912m8640J96096
5565A402368k16576D40832Q39680M9152o15424k26304k0480R4720C072P84896
5555G87968J657856r71776G4240J128448n87776P77728n91360l23072Q38656F17472
5544A45920J790976A00864R06752K70848J42336F77888L11808P9360L76320D67968
5533A349632j90976D17280M72064p2192N47840l96800k30912L44576L08736n93408
5523G97184L18976k08896D23936M66944J25952n9904E9392O67648j02400P52640
5513A377280c2256E31456J39776J860096D78208j39776O80448E05344j59232k048
$$ plain form
5503 344064 811008 793600 1247744 589312 1888768 2069504 1024 578560 744448 903168
5493 903168 1124352 628736 1085952 836608 826368 920576 1632256 1385984 1439744 895488
5483 895488 1189376 1031680 1481216 1401344 1071104 1085440 -617984 972800 231936 1131520
5473 1131520 1740800 -161792 1402880 -169984 569344 815104 1199616 671744 993792
5464 993792 1522176 1079808 776704 1732096 1241088 67584 1415168 912384 1465856 -247808
5453 519168 186368 354816 713216 1278976 645632 1539584 881664 629248 1935872 1309696
5443 1309696 1970176 1015296 1063424 1882112 536576 1677312 1194496 -571392 601088 599552
5433 599552 -185344 1550336 119808 1076736 1619968 107008 1777664 1008128 700416
$$ packed form
5503C44064M66944j7408M54144E89312J299456J80736A024N77536J65888J58720
5493I03168K21184m95616M57216k49344j0240R4208P11680k46272N3760n44256
5483H95488K93888j57696M49536p9872l30240J4336f17984I72800B31936Q99584
5473A131520O09280a61792A402880a69984E69344K45760L84512n27872L22048
5464I93792N28384m42368l03104R55392m91008F7584J347584n02784N53472b47808
5453E19168A86368J68448L58400N65760o33344Q93952o57920k52416J306624o26176
5443A309696O60480r54880M8128Q18688E36576J140736m82816e71392F01088j536
5433E99552a85344A550336A19808R56928N43232A07008J670656p69536l07712
$$ plain form
5424 700416 1300480 906752 1236992 1257984 1387520 412672 -303616 1233920 1744384 1024000
5414 1024000 1553920 791040 -140288 -181760 1256448 2538496 993280 363008 45056 617472
5404 617472 990208 38912 756736 862208 1844224 2744320 941056 1893376 784384 1138688
5394 1138688 934912 948736 310272 1325568 270848 1307136 974336 -60928 1473536
5384 1072640 2029568 1871872 1400320 1190912 1022976 1596416 2344960 1985024 1568256 2005504
5374 2005504 1663488 1180160 1070080 2363392 2573312 2096640 2278912 1878016 2371072
5365 2371072 514048 1058816 2042880 1736192 915456 1612288 1679360 2014208 334336 1579008
5355 1579008 685056 1018880 916992 849408 -383488 551936 1098752 1652736 758784 1347072
$$ packed form
5424G00416O00064l93728L30240K0992J29536D12672c03616A233920N10464p20384
5414A024000N29920p62880a40288m1472A256448J282048I93280C63008D5056N72416
5404F17472L72736C8912P17824J05472R82016R00096I41056R52320G84384L54304
5394A138688k03776J3824C10272J015296B70848J036288l32800f0928A473536
5384A072640R56928j57696m71552k09408j67936N73440P48544l59936m16768M37248
5374B005504l42016m83328j10080J293312K09920m76672J82272m00896M93056
5365B371072E14048N44768R84064l06688q20736O96832O7072L34848C34336J244672
5355A579008F85056L33824j01888o7584c83488E51936N46816N53984G58784N88288
$$ plain form
5345 1347072 969728 1300480 1653248 1175040 923648 1024000 1145344 1777152 985088 485376
5334 1763328 338944 2056192 1107456 696320 -302592 1764864 1221120 1469440 507904
5324 75264 1933824 600576 698368 2307584 996864 1051648 1509888 1560064 997376 636928
5314 636928 1212928 831488 550400 828416 1423360 909312 1130496 265216 1258496 1316864
5304 1316864 904704 -20992 488448 1539072 852992 1630720 1545216 1468416 475648 1260032
5294 1260032 734720 1204736 1297920 13824 1039360 923136 1086976 1624576 870400 945664
5284 945664 1503232 2437120 1141760 832512 685568 1042944 1064448 1247232 -89088 991232
5273 691200 219648 1701376 1763840 1054720 642048 2490368 475648 628224 1395712 -133632
$$ packed form
5345A347072l77344L30752L52768m78208k51392J00352J21344O31808p92064D85376
5334A763328C38944J717248r48736m11136c02592A764864n43744K48320E07904
5324G5264J858560F00576R7792J609216I96864N4784M58240N0176n62688l60448
5314F36928N76000l81440k81088K78016N94944n14048K21184B65216R93280N8368
5304A316864m12160b0992D88448J050624o86080P77728q5504p6800D75648P84384
5294A260032n25312M70016R3184A3824J025536j16224J63840N37600p54176P5264
5284I45664N57568R33888A141760l09248j46944L57376K1504J82784h9088I91232
5273F91200B19648J481728O2464p09120m12672J848320D75648J52576P67488a33632
$$ plain form
5262 1770496 1432064 935936 1583104 1997824 1458176 1092096 442368 1157120 2065408 1298944
5252 1298944 1516032 1870336 921600 1491456 418304 967680 1852928 747520 1715200 843264
5241 2073600 1824768 1245696 1110528 985600 2529792 1757696 1726976 1277952 974336 1488384
5231 1488384 2142208 2365952 1099264 1538560 1220608 1615360 1848320 1742336 1471488
5222 1471488 1353728 327168 1524224 143872 1804800 843776 1938432 1618944 2056192
5213 2056192 2024448 1766400 1743360 1548288 1384448 1862656 2381824 1858048 2177024 1996288
5203 1996288 2385408 2077696 1428992 1925120 1398272 856064 1698304 1678336 1878016 1579520
5193 1579520 2199040 1439744 1545216 1139200 933376 917504 1273344 2165248 1924608 1093632
$$ packed form
5262A770496l38432m96128O47168M14720n39648l66080D42368P14752R08288p66464
5252A298944K17088L54304I21600N69856D18304N49376Q85248G47520R67680H43264
5241B073600k48832n79072j35168j24928J544192p72096l0720m49024l03616N14048
5231A488384O53824K23744A099264M39296l17952L94752K32960j05984k70848
5222A471488j17760C27168J197056A43872J660928H43776J094656l19488M37248
5213B056192l1744k58048k3040j95072j63840M78208N19168n23776L18976j80736
5203A996288L89120l07712o48704M96128n26848n42208Q42240j9968J99680k98496
5193A579520O19520p59296J05472m06016k05824j5872L55840Q91904k40640q30976
$$ plain form
5183 1093632 1470976 867840 1309184 2024448 892928 1690112 720896 508928 1910784
5174 1910784 -365568 1223168 1384448 381952 59904 1958400 2135040 1612288 1183744
5165 1183744 1089024 387584 241664 370688 887808 1458688 -249344 1400320 1596928 739328
5154 704000 1216000 -3072 1437696 1020928 1018880 1162752 716800 206336 1894912 1213952
5144 1213952 1380352 1041408 1277952 699392 972288 1076736 899584 712192 1730048
5135 1730048 1144320 1340416 772096 1052160 940544 2972160 2319360 1172992 1238528
5126 1238528 1830912 1573376 337920 612352 1211392 471040 664576 1007104 649216 1425408
5116 1425408 1411584 1450496 1267200 1316352 522240 1402368 1016320 807936 1077248 1555456
$$ packed form
5183A093632L77344o03136M41344P15264H92928P97184G20896k11968J401856
5174A910784c65568A223168J61280C81952E9904J898496J76640n22752m28544
5165A183744r4720C87584j45920J29024N17120N70880b49344A400320J96608G39328
5154G04000N12000c072A437696m16768k048J43872m45952B06336J688576o80960
5144A213952J66400l38944K36544n78560K72896J04448j77152j87392J017856
5135A730048n85728J96096n68320K80064j11616K031616o52800j146368O5536
5126A238528N92384k57536C37920K74432N99040D71040J93536L42528l57888P76192
5116A425408j3824L8912j83296M9152E22240Q80128l86048k08384K69312M78208
$$ plain form
5106 1555456 2118656 1528320 1613312 1400832 708096 598016 544256 1896960 1604608 2276864
5096 2276864 668160 1085952 1543168 1225216 1275904 1590272 797696 827392 503808 515584
5086 515584 923136 1431552 1411072 1372672 623104 1735680 1721856 643584 1899008 73728
5075 -375296 1018880 268288 133120 1987584 1242112 261632 1814528 740352 1351680
5066 1351680 2130944 1649664 839168 1464320 1859072 1069568 1487872 1859072 1452032 1202176
5056 1202176 1261568 2119680 1634304 1169920 1409536 783872 1265664 817664 1933824 668672
5045 892928 1296384 579072 1864192 1498624 1782784 1506304 679936 1899008 1606144
5036 1606144 788480 1115648 776704 1274880 1161216 1285632 530432 807424 1271808 1613312
$$ packed form
5106A555456N63200n90336Q4992k12480o92736j10080n3760J352704k92352O72256
5096B276864F68160M17792M57216l17952N0688L14368p92576K9696l23584J1776
5086E15584M07552N08416k0480l8400F23104J112576j3824F43584J255424G3728
5075c75296A018880B68288A33120J854464p45472B61632J552896G40352O11328
5066A351680P79264m81280q10496O25152L94752p89504M18304L71200m07040k49856
5056A202176N9392Q58112m85376m64384K39616o25664M81792m48000J116160F68672
5045H92928M03456E79072J285120l65568K84160k76480F79936J219072k92864
5036A606144G88480L27168l38944M98176j13664J24416E30432K76992M64384L41504
$$ plain form
5026 1613312 1162240 828416 1398784 1338368 599040 649728 1597952 2243072 1068032 806912
5016 806912 1066496 652800 1634304 684544 1563648 943616 771072 1527808 1320448 194048
5005 828416 216064 1777152 1282048 2205696 1938432 2417152 1431040 1179136 1206784 1853440
4995 1853440 1519104 1059328 1287168 1748992 1411072 1518080 1515520 -45056 1189376 1416704
4985 1416704 1299456 897024 699904 1193472 1124352 1666560 453120 1260544 2181632 1445376
4975 1445376 1385984 836096 1920000 1523712 1086464 1520128 2164224 2276864 2251776 2139136
4965 2139136 2970624 2890240 3414528 2988544 3452928 3391488 1593856 3422720 1214976
4955 2210304 1779712 1782272 838656 1590272 1330688 931840 1077760 1955328 2421760 1440768
$$ packed form
5026A613312m51072l33824N70368o0416E99040N0688R48224O45120A068032k61120
5016H06912K59584m13696R81504F84544Q79104o20032j72544P56736k07360A94048
5005H28416B16064J561088m95104R23648k67264M78720r86112k51904K7648O46656
4995A853440l34336m59776K27840M61824l37920J07008k560d5056A189376K27328
4985A416704j17248m02432j97120M93568o9120N42208D53120Q07424R21088p36256
4975A445376n9392n49888J083904l96288m37248M33664O44096J12640k5088j12640
4965B139136Q31488q0384N24288m25984M64384o1440A593856J828864A214976
4955B210304m30592K560H38656P51616k59584l98848J45920Q77568M66432r80992
$$ plain form
4945 1440768 1444864 1820160 1218560 2422272 1332224 1626112 1787904 1159168 1590272 1104384
4935 1104384 1938944 1287168 1110528 823808 1986048 2678784 1059840 2115072 488448
4925 1841152 1052672 561664 1868800 2197504 1483264 1942528 868352 2139136 1641472
4916 1641472 1527808 1514496 2456064 906240 441856 1647616 803328 1088512 948224 694272
4906 694272 1398272 1446400 1270272 86528 2054656 1733632 1661952 1999872 1264128 1567232
4896 1567232 1139712 600064 819200 1009664 892928 2278912 291840 1609216 1032704
4887 1032704 1029120 1121280 1046528 1857536 867840 1441792 1450496 1214976 1328640 1313280 1938944
4876 1938944 1534464 1304576 1585152 887296 1414144 1588224 1145856 2331136 2078720
$$ packed form
4945A440768M096L75296o01600J203712j090048K93888J61792o28736M31104m85888
4935A104384Q34560o51776j76640k86720J162240O92736A059840J055232D88448
4925A841152p88480m91008J307136L28704p14240M59264H68352J270784m97664
4916A641472j13664j3312R41568I06240D41856J205760H03328K85184j40288k53952
4906F94272P04000M8128j76128H6528J968128l21024p1680L37920p35744L03104
4896A567232m27520n39648K19136J90464j16736J385984B91840J317376n76512
4887A032704l584R2160p4752Q11008H67840N73952Q704k35520J13664j5360O25664
4876A938944m04480k29888K80576o97856N26848J74080m42368J185280k52416
$$ plain form
4867 2078720 761856 1075712 1462784 1005568 1115648 1628672 999424 1123328 1074176 1824768
4857 1824768 1790976 1450496 1024000 1563136 1319936 1930240 1413632 2259456 1761280 2013696
4847 2013696 1222656 1494016 1317376 1915392 2030592 1943040 954368 2366464 1187328
4838 1187328 2324480 842240 830976 1503744 1249280 2021888 2147328 2189312 2193920 1820672
4828 1820672 2478080 1741312 1874944 2191872 1978880 1487360 1553408 1968640 1561600 1208832
4818 1208832 993792 2317824 1699328 1410048 1170944 1957888 1574912 1889280 2118656
4809 2118656 1061888 1894912 2495488 2040320 1581056 1827328 2047488 1900544 2069504
4800 2069504 1436672 1590272 1102336 2670592 2475008 1501696 1064448 1345024 1417216 1306112
$$ packed form
4867B078720G61856L13856L87072m57216J10080N13024o29248J23904m9152P50592
4857A824768l3792l40480m26496N39136k43200O10304n16608Q45824m98176K52416
4847B013696p91040K71360j76640N98016J15200q7552I54368J412096j179136
4838A187328J137152H42240j1264O72768k54464P72608J25440M1984M608l73248
4828A820672O57408p36768J33632L16928k12992m91520O6048M15232m07040l52768
4818A208832k15040J324032o18496k89280k39104P86944l82976L14368K29376
4809B118656j056768Q33024O00576m55168m59264K46272K20160j46944J68960
4800B069504o32832J53600m87936J568256j95584r73312m37248K80576P2192j11104
$$ plain form
4790 1306112 400896 2095104 1480704 2343424 1951232 1205248 2613248 588288 1661952
4781 1661952 2785280 854016 1685504 1129984 1435136 1213952 1081856 1970176 1604608
4772 1604608 1185280 1769472 1742336 2382336 1062912 1604608 2729984 1903616 2065920
4763 2065920 1743360 1567232 2039296 1676800 2339328 1117184 1521152 1004032 1469440
4754 1469440 1206784 696320 2147840 1389056 735744 1526784 675328 1866752 2466816
4745 2466816 1926144 2593280 1036800 2178560 1560576 2711552 1732608 1490944 2310144
4736 2310144 2024960 2387968 2330624 1658880 1557504 291328 2690560 1895936 2120704 1565184
4726 1565184 2343424 1037312 1800192 1965568 735744 1502208 3013632 1273856 2903552
$$ packed form
4790A306112D00896J694208o14400Q62720l92192p45984J408000E88288J073664
4781A661952J123328H54016Q31488n55520L05152k21184j32096Q88320l65568
4772A604608m19328N84192k7136O40000A062912N41696J125376q26368J62304
4763B065920l22560j76128M72064l62496O62528A117184M03968n17120M65408
4754A469440k62656n10464J451520p58784o53312P91040F75328J191424O00064
4745B466816n40672O67136A036800J141760o17984J150976r78944k41664Q19200
4736B310144k85184L63008n7344o71744j01376B91328K399232p94624K24768n55520
4726A565184P78240A037312P62880J65376G35744P66464J511424A273856J629696
$$ plain form
4717 2903552 1858048 2767872 2808832 3448832 2066944 1930240 3048448 3719168 4556800
4708 4556800 2913280 4857344 5660672 5536768 5514752 4859904 5512704 6642176 5094912
4699 5094912 5626880 4399104 3676672 2760704 2831872 3291648 1725952 2374656 2613760
4690 2613760 1495040 1590272 1161728 2413056 1858048 880128 1741824 995840 1785856
4681 1785856 1469440 1565184 1344000 1233920 651776 917504 546816 1456640 2234368 2444288
4671 2444288 1377280 1335296 956416 1794560 2215424 2352640 2196480 1790976 2667520 975360
4660 1076224 2263552 2023936 2318848 1654784 1966080 1592832 1717760 1280512 2218496
4651 2218496 1371136 1563648 2223104 324608 1651712 2222080 1480704 1585152 1337344
$$ packed form
4717B903552j045504R09824M0960O40000j381888j36704J118208O70720Q37632
4708D556800j643520J944064Q03328j23904k2016o54848O52800J129472j547264
4699E094912N31968j227776p22432r15968P1168M59776j565696O48704K39104
4690B613760j118720R5232m28544J251328n55008H80128Q61696p45984P90016
4681A785856l16416R5744k21184j10080n82144K65728l70688R09824P77728K09920
4671B444288j067008m1984l78880Q38144M20864J37216j56160m05504Q76544I75360
4660A076224J187328k39616K94912o64064L11296l73248J24928m37248R37984
4651B218496q47360J92512O59456C24608J327104N70368p41376J04448k47808
$$ plain form
4642 1337344 2050048 2353152 1255936 1859584 1315840 1215488 788480 2072064 2024448
4633 2024448 1688576 2038784 1605120 2108928 1099776 -324608 1969664 1689088 1846784
4624 1846784 1772032 1714176 1618432 3030016 1363456 2252800 1546240 1588224 2403328 2017280
4614 2017280 1980928 1736192 1607680 1169920 2347008 1529856 1433600 1325568 1300992 2818048
4604 2818048 1886208 2067456 1472000 1220608 2625024 1871360 2172928 1569280 2060288
4595 2060288 871424 1312768 2063360 1709568 1688576 1965568 1074176 1728512 455680 1695232
4585 1695232 1922048 2162176 842240 1955328 1745408 1530368 1423360 1664000 2058240
4576 2058240 1992192 1652736 1875456 1359872 1111552 1460736 1766912 2923008 1688576
$$ packed form
4642A337344P12704L03104j097216O03648n43744j00352m27008J283584m7616
4633B024448l35872L50208m33664N03808j009152c24608A969664k80576J57696
4624A846784p4752n7856r5744J411584A363456Q89344p06560M1984Q15104l86048
4614B017280l6352k44736j28512m37760J177088q17152r6256j08032k4576J517056
4604B818048r31840J81248n95456k51392J404416p53664L01568o03648M91008
4595B060288H71424M41344P50592l53792k0992K76992q91392O54336D55680J239552
4585A695232K26816K40128H42240J113088k09920k15040j07008K40640L94240
4576B058240o6048l39456K22720n15584k48320L49184L06176J156096j234432
$$ plain form
4567 1688576 1888768 1232384 1887744 2125824 3319296 2369536 2447360 1793024 2007552 2598400
4557 2598400 900096 2378240 2255872 2146816 3142144 1950208 1317888 2241536 2298880
4548 2298880 1123840 2328576 2332672 1169408 1614336 2013184 2578432 1530880 2242048
4539 2242048 1259520 2364928 1813504 1817088 2475008 2010624 2085376 1670144 1911808 2933760
4529 2933760 1979904 2547712 1684480 2571776 2655232 2246656 1506816 1717248 1261568 2106368
4519 2106368 2845184 1867776 2845184 1997824 2311168 2886656 2085376 1984000 2823680 2449408
4509 2449408 742400 1912832 1860608 3019264 2231808 3118080 2827264 1639936 928256
4500 928256 2345984 1670144 1181184 1638912 2634752 1886720 2475008 2500096 2505728 2706944
$$ packed form
4567A688576K00192o56384O55360K38080J193472r49760P7824o54336K14528N90848
4557B598400I00096J478144j22368j09056R95328j191936o32320R23648N7344
4548B298880A123840J204736M096j163264M44928L98848N65248j047552P11168
4539B242048r82528J105408n51424L584O57920m64384P4752m15232K41664J021952
4529B933760r53856N67808q63232Q87296Q3456m08576p39840K10432m55680Q44800
4519B106368P38816r77408R77408q47360L13344N75488q01280j01376Q39680l74272
4509B449408G42400J170432n2224J158656p87456Q86272k90816j187328p11680
4500I28256J417728o75840m88960M57728R95840p48032N88288K5088N632K01216
$$ plain form
4490 2706944 2411520 1481216 2188288 1100800 975360 2170368 1414656 2724864 1205760
4480 1332224 1828352 2093568 2406912 998400 1479168 2595328 1998848 1455104 1280000
4471 1280000 1128960 2294272 1589760 1993216 1618432 1953792 1554432 1841664 1937920 1542656
4461 1542656 2903040 2318336 2627072 2165760 2129408 3044352 2989568 1626624 2878976
4452 2878976 1406976 3615744 1985536 3026432 2570240 3095552 3355648 3098624 3311616
4443 3311616 2570240 3120128 3087872 2595328 2457600 3481088 3409408 2682368 2354176 2341376
4433 2341376 2945024 2447360 3281408 3373568 2586112 2363904 2235392 1784832 2756096 2280960
4423 2280960 3382272 2295808 3149312 2820096 1875456 2508288 2536448 2381312 2992640
$$ packed form
4490B706944k95424r30304P07072j087488j25440J195008p55712J310208A205760
4480A332224M96128K65216L13344I98400M80768J116160n96480n43744j75104
4471A280000j51040J165312p04512M03456l74784L35360l99360K87232R6256l95264
4461A542656J360384n84704L08736m61312l6352R14944n4784j362944J252352
4452B878976A406976K208768j630208J040896m56192N25312K60096k57024K12992
4443C311616p41376N49888l2256m92544j37728J023488p1680p27040l28192j2800
4433B341376O03648m97664Q34048R2160p87456k22208j28512m50560R71264m75136
4423B280960J101312j086464Q53504l29216r44640O32832K8160j55136O11328
$$ plain form
4414 2992640 3141632 1886720 2760192 3137536 2186240 3040768 2642432 4036096 2118656
4405 2118656 4768256 3578880 2224640 3795456 4152832 3689984 3850240 3732480 3747328
4396 3747328 3166208 3195392 4065280 2976768 2246144 2682880 2601472 2336768 1866240 3143680
4386 3143680 2756096 2211328 3063808 2268672 1903104 1361920 1847296 1981952 2702848 1610752
4376 1610752 1366016 3024384 2378240 3115520 1297408 2117120 2004480 2580480 742912
4366 1403392 1745408 1797632 2768896 2398208 1312768 1688064 1160704 2577408 2835456
4357 2835456 1910272 2269184 1473024 1800704 2121728 2286592 1606656 2256384 2173952 1569280
4347 1569280 1914880 1536000 1774592 2134528 2094080 2091008 2650624 2920448 1732608 1786880
$$ packed form
4414B992640J48992j254912Q73472L77344r51296Q54528l98336J393664j917440
4405B118656K649600j189376j354240J570816L57376m62848J60256j17760J4848
4396C747328n81120K9184Q69888j088512p30624M36736q1408k64704m70528J277440
4386C143680l87584n44768Q52480p95136l65568n41184M85376J34656P20896j092096
4376A610752k44736J658368o46144P37280A297408Q19712j12640N76000G42912
4366A403392L42016N2224R71264l70688j085440L75296n27360J416704K58048
4357B835456r25184L58912p96160L27680L21024J64864o79936O49728q2432o04672
4347A569280L45600l78880K38592L59936m0448l072N59616K69824j187840N4272
$$ plain form
4337 1786880 2659328 1608192 2453504 2348544 2595328 2662912 2424320 2085888 2661888 1910272
4327 1910272 1333248 2293248 2113536 1911808 2035712 2467840 1921536 2386432 3864576
4318 3864576 2114048 2453504 2272768 2784256 1430016 1935360 2359296 3342336 3446272
4309 3446272 3216384 3404288 3243008 2516992 2902528 3492864 2362368 3057152 3318784
4300 3318784 3520000 3729920 3810816 3116032 3517952 4338176 3422720 3316224 2822656 2222592
4290 2222592 3013120 2776064 2385408 2894336 2685440 3210752 2680832 2418176 2992640 2700288
4280 2700288 2792448 1675264 1778688 1236480 1563136 2886656 2629632 2608128 2492928 1902592
4270 1902592 2542592 2001408 2984960 1922048 2844672 1416704 1418752 2836480 1443328
$$ packed form
4337A786880Q72448j051136Q45312j04960K46784O7584k38592l38432N76000p51616
4327A910272n77024R60000j79712k01728J23904M32128n46304M64896J478144
4318C864576j750528L39456j80736N11488j354240N05344M23936R83040J03936
4309C446272k29888J87904j61280p26016L85536N90336j130496O94784K61632
4300C318784K01216K09920Q0896o94784M01920Q20224r15456j06496m93568o00064
4290B222592P90528k37056l90656N08928k08896N25312n29920k62656N74464k92352
4280B700288R2160j117184J03424n42208L26656J323520k57024k1504j15200n90336
4270A902592O40000n41184R83552j062912R22624A416704K048J417728j393152
$$ plain form
4261 1443328 2088448 1506304 2363904 2555392 1669120 2481152 2957824 2837504 2662400 3343872
4251 3343872 2568192 2913792 3090944 2606592 3485184 3771392 2603008 2850304 2908672 2403840
4241 2403840 3189248 2825216 3876864 2903040 3268608 2828800 2594816 2694656 2890752 3141120
4231 3141120 2678784 1967104 2342400 3097600 1669120 2671104 2257408 1980416 2053632
4222 2053632 2686464 1179136 3079680 2460672 1974272 2638336 3120640 2343424 765440
4212 2563072 2729984 3632640 2002432 3060736 2518528 2268160 3487232 3080704 2605568
4203 2605568 2561024 1718784 3061248 2749440 2760704 1824256 3021312 2165760 3273216
4194 3273216 2896384 3243008 3182592 2612224 3001856 3108352 4000768 4220416 2342400 3254272
$$ packed form
4261A443328O45120n82144Q57600J91488q86272Q12032M76672j20320j75104O81472
4251C343872p75680L45600J77152m84352Q78592K86208j168384K47296N8368n04832
4241B403840P85408l64032J051648r73824L65568m39808k33984R9840J96096K50368
4231C141120m62336p11680L75296P55200j428480J001984m13696k76992P3216
4222B053632O32832A179136J900544o19008m86400O64064M82304p77216G65440
4212B563072J66912R02656j630208J058304n42208k50368J219072m06528m75136
4203B605568m4544q42240J342464l11808J1264r36448J197056q55552J107456
4194C273216l76832L46624o0416n70368L89632J06496Q92416K19648j878016R11872
$$ plain form
4184 3254272 3274240 3176448 2621440 2705920 2570240 1323008 2291712 2512384 2723328 2178048
4174 2178048 2959872 2637824 1716224 2488320 2207744 2679808 2194944 1956864 1865728 1738240
4164 1738240 2924032 2862080 1980928 2901504 2883584 2393600 2602496 2434048 3523584 2529280
4154 2529280 2623488 722432 2254848 2450432 1966080 2521600 2553344 2553344 3288064 2856960 2205184
4143 2205184 2926592 2239488 2674688 3220480 3401728 2702336 2821120 3299328 2627584 2029568
4133 2029568 3166720 2391040 3189760 3537920 1597952 3110912 2573824 2234880 2975232
4124 2975232 3039232 2484736 2427904 2318848 2717184 1924096 2449408 2907136 1742848 2546688
4114 2546688 2417664 1979904 1796096 1657344 2731008 1539584 1934848 2132480 2560512
$$ packed form
4184C254272J9968r7792n55008Q4480j35680j247232R68704K20672K10944n45280
4174B178048P81824l22048r21600P72096k80576M72064m84864k38080r1136j27488
4164A738240J185792o1952q81152R20576j7920m89984K08896j68448J089536r94304
4154B529280R4208G22432J532416J95584m84352N55520L1744%P34720m31104o51776
4143B205184P21408o87104M35200N45792J81248o99392J18784M78208o71744n98016
4133B029568J137152p75680P98720L48160A597952J512960n37088l38944P40352
4124B975232O4000n54496n6832j09056L98336p93088N25312M57728j164288Q03840
4114B546688j29024m37760j83808j38752J073664j191424L95264J97632M28032
$$ plain form
4105 2560512 2968064 1932800 2183680 2934784 2360832 3474944 1561600 2562048 2099200
4096 2099200 8038912 1756160 2522624 1285120 2058752 2523648 2613760 2959360 2673152
4087 2673152 2623488 2842624 2553344 2470912 2022912 2331648 2290688 2574848 2291712 1876480
4077 1876480 2280448 3171328 2027008 1875456 2035200 3974144 2200064 1246720 916480
4068 916480 1964544 1648640 3058176 1510400 2120704 1815552 2175488 2562560 2321408
4059 2321408 2840576 1372160 2119168 2420224 1634816 2374656 2040320 2531328 1649664
4050 1649664 1785344 2456064 911872 2843648 2127872 2567168 2685952 2757632 2447872 2266112
4040 2266112 2382336 2685440 2732032 2002432 1179648 1905152 3006976 2475008 2532864 2868224
$$ packed form
4105B560512M07552j035264K50880P51104n73952J114112A561600J000448m62848
4096B099200N939712A756160P66464j237504P73632M64896R0112L45600k86208
4087B673152m9664K19136k89280q2432m48000L08736m0960K84160k83136m15232
4077A876480M03968Q90880j144320j51552J59744J938944j774080r53344l30240
4068I16480J048064l15904J409536A510400O10304l05152L59936L87072k41152
4059B321408N19168A372160P47008L01056p85408P39840l34336M91008q81664
4050A649664J35680O70720I11872J931776p15776M39296J18784P1680l09760j81760
4040B266112J16224L03104M6592p29600q22784P25504J101824n31968N7856L35360
$$ plain form
4030 2868224 2582528 2535424 1505792 1863168 2655232 2353664 2231808 3503104 2137088
4021 2137088 2241024 1316352 2130432 2833408 2620928 2967040 3332608 2060800 2702848
4012 2702848 2319360 2600448 2486272 2921984 2324480 2265088 2632192 2033664 2977792 2393088
4002 2393088 2338304 2872832 2766848 2889728 2327552 3056640 2252288 3736576 1920000
3993 1920000 1700352 3346944 2731008 2501120 2940416 3595264 2817536 3143168 1988608
3984 1988608 3070976 3537408 2610688 3485184 3166208 3176448 4075008 3976704 4038656 4247552
3974 4247552 3816448 3352576 2576384 3843584 2809856 4442112 4025856 3763200 4248064
3965 4248064 4101632 4366848 4780032 4648960 4499456 4953600 4374528 4843008 5678592 4829696
$$ packed form
4030B868224k85696m7104j029632L57376P92064l01568j21856J271296j366016
4021B137088J03936r24672Q14080P02976k12480L46112L65568j271808O42048
4012B702848l83488K81088j14176M35712n97504n9392L67104n98528R44128n84704
4002B393088n4784N34528j05984J22880n62176P29088q04352J484288j816576
3993A920000k19648J646592o15936k29888M39296O54848p77728L25632j154560
3984A988608J082368M66432r26720Q74496l18976J0240Q98560r8304O1952K08896
3974D247552m31104m63872p76192J267200j033728J632256m16256k62656M84864
3965D248064j46432K65216M13184j31072j49504M54144n79072M68480Q35584q48896
$$ plain form
3955 4829696 4688896 3979776 4809216 4525056 4274688 4060672 3167744 3706368 3758080 2819584
3945 2819584 2716672 2290688 2665472 3565568 3064832 2699776 3217408 3774464 3156480 3198464
3935 3198464 2589184 3424768 2928640 3178496 3839488 3909120 4295168 4365824 2835968 3064320
3925 3064320 2708992 3225088 3134976 2584064 3441664 3566592 2540032 3029504 2719744 3022848
3915 3022848 3677184 3002880 2590208 3496448 2907648 3324928 3223040 2987520 3164160 3322880
3905 3322880 2886656 3623424 3335168 1754624 3125760 4218880 3979264 4076544 3877376
3896 3877376 5005312 5594624 4058624 4119040 4312064 4707328 3729920 4049408 3814912
3887 3814912 4764672 4501504 4235264 4205056 4844032 4198400 3207168 3432960 4208128 3421184
$$ packed form
3955D829696j40800p09120Q29440k84160k50368k14016q92928N38624N1712r38496
3945B819584j02912m25984L74784R00096n00736l65056N17632N57056o17984M1984
3935C198464o09280Q35584m96128K49856O60992O9632L86048P0656j529856K28352
3925C064320l55328N16096r0112n50912Q57600J24928j026560M89472l09760L03104
3915C022848O54336o74304m12672R06240n88800M17280j01888k35520J76640J58720
3905C322880m36224P36768k88256j580544J371136J093120k39616R7280j99168
3896C877376J127936N89312j536000O0416J93024L95264r77408L19488k34496
3887C814912R49760k63168k66240l0208O38976o45632r91232K25792P75168p86944
$$ plain form
3877 3421184 4422144 3676672 5198848 3780608 4622336 3417088 4011520 3960320 2953728
3868 2953728 3697664 2900480 3109888 3490816 1959936 2821632 1716224 3257856 1779712
3859 1779712 1875456 2063872 2037760 2110976 2649088 3110912 2741248 2611200 1683456 3426304
3849 3426304 3256832 2046976 2575360 2173440 2041856 3237888 2192896 2532864 1904640
3840 1904640 2500096 2712576 2156032 2888704 2516992 2513920 2971136 2514944 2985472 3340288
3830 3340288 3487744 3062272 2940416 2926592 2765312 2827776 3268096 2827776 1945600 2347008
3820 2347008 2532352 1901056 3185664 3222528 2502656 2951168 2268160 3022848 2897920 2643968
3810 2643968 2427392 3195904 2660864 3668480 3317248 3654144 3276288 3855360 2821120
$$ packed form
3877C421184J000960p45472J522176j418240Q41728j205248N94432n1200j006592
3868B953728P43936p97184K09408L80928j530880Q61696j105408J541632j478144
3859A779712R5744J88416k6112P3216N38112M61824l69664j30048r27744J742848
3849C426304j69472j209856N28384m01920j31584J196032j044992L39968o28224
3840A904640N95456K12480n56544P32672l71712l072M57216m56192M70528L54816
3830C340288J47456m25472j21856j3824j61280O2464M40320m40320q82176M01408
3820B347008J85344o31296J284608L6864p19872M48512o83008P54688j24928k53952
3810B643968k16576P68512n35040J007616l51232L36896l77856N79072j034240
$$ plain form
3801 2821120 2267136 3025408 3081216 2748416 3497984 2777088 3702272 2825216 2128896 3476992
3791 3476992 2466304 3187712 3587072 3497472 3136000 2450432 2654720 4320768 5180928
3782 5180928 3703808 3751936 3389952 5104128 3365376 3930112 3696640 3623936 2610176
3773 2610176 4573184 3471360 3607040 2949632 2723840 2982912 3336192 2035712 2744320
3764 2744320 3712000 3397632 3640832 3844608 3803136 3828224 3280384 2364416 3669504 2757632
3754 2757632 2999296 4137472 3963904 3736064 3933696 4079616 3289088 4505600 3508736
3745 3508736 3096064 3957248 4387840 4480000 4404224 3591680 3572224 4700672 3890688 5271552
3735 5271552 4259840 4929536 3697664 6307328 4523520 5490176 5619712 6321664 6243328
$$ packed form
3801B821120n53984P58272N5808l32800P49568p20896R25184q77056o96320J348096
3791C476992j010688P21408L99360q9600l61472o85568K04288J666048Q60160
3782E180928j477120M8128l61984J714176j738752N64736k33472p2704j013760
3773B610176J963008j101824J35680o57408k25792K59072L53280j300480P08608
3764B744320R67680l14368K43200K03776m1472K5088n47840r15968J305088r11872
3754B757632K41664J138176j73568k27840J97632J45920p90528J216512r96864
3745C508736m12672Q61184M30592R2160p5776q12544j9456J128448q09984J380864
3735E271552j011712O69696j231872K609664j783808R66656J29536P01952p8336
$$ plain form
3726 6243328 6466560 6808064 6113280 6436864 5867520 7566336 7041536 7112192 6804992 7417344
3716 7417344 7796736 6946304 7512064 7563776 7608832 7963136 8694784 8837120 10240512 10280448
3706 10280448 10744320 9361920 9602560 7293952 5899264 5316608 6280704 5549056 4664320
3697 4664320 3539456 3517440 3799552 4154880 4263936 4058624 4112384 3237888 4301312 3816448
3687 3816448 3374080 2832384 4273664 2734592 3864576 2606080 3234816 2750464 4030976
3678 4030976 3587072 3687424 4252672 3781120 3022336 3738112 3164672 3951104 3910144 2977280
3668 2977280 3813888 2794496 3310080 3429376 2590208 3448320 3397632 4238848 4180480 3537920
3658 3537920 4165120 3416064 4237312 2617344 3948032 3845632 3605504 3015680 4010496
$$ packed form
3726F243328K23232L41504o94784L23584n69344J698816n24800P0656l07200O12352
3716G417344L79392q50432N65760N1712M5056L54304P31648J42336J403392L9936
3706A0280448M63872j382400K40640k308608j394688n82656R64096p31648q84736
3697D664320j124864k2016K82112L55328J09056k05312N3760q74496J063424m84864
3687C816448m42368n41696J441280j539072J129984j258496O28736m84352J280512
3678D030976m43904J00352N65248m71552p58784P15776n73440P86432m0960r32864
3668B977280Q36608j019392N15584J19296q39168Q58112n0688Q41216n8368o42560
3658C537920O27200p49056Q21248j619968J330688j02400k40128n89824R94816
$$ plain form
3649 4010496 4553216 4057600 3437056 3790336 3886592 4024320 3378688 3211776 3458048 5125632
3639 5125632 4285952 3716608 2903040 4400128 3281408 3109888 2710528 4795392 3714048
3630 3714048 2859008 4326400 4122112 3731456 3607552 3877888 2950656 3432448 3199488
3621 3199488 3212288 3855360 4051968 3253248 3013120 3438080 3683328 3854848 4111872 4361216
3611 4361216 4593664 4725248 4350976 3261952 4038656 3294208 3481088 2771968 3633664
3602 3633664 4136448 4074496 4058624 3927552 3344896 3120640 4722176 3227136 4077568 3588096
3592 3588096 3142144 3040768 4037120 3082752 3525120 3692544 4168704 4444160 4328960 4081152
3582 4081152 4078080 3186688 3089408 4587008 4430336 4804096 3169280 4375552 4180480 3321856
$$ packed form
3649D010496N42720m95616o20544L53280R6256J37728o45632j66912K46272J667584
3639E125632q39680n69344q13568J497088j118720j71520l99360K084864j081344
3630C714048q55040J467392k04288l90656j23904K70336r27232M81792k32960
3621C199488J2800O43072J96608p98720k40128M24960K45248J71520K57024K49344
3611D361216K32448J31584l74272j089024P76704p44448J86880p09120Q61696
3602C633664N02784o1952j5872j31072n82656k24256J601536j495040Q50432m89472
3592C588096m45952j01376R96352r54368M42368J67424M76160K75456j15200k47808
3582D081152l072q91392r7280J497600j56672L73760j634816J206272j95072q58624
$$ plain form
3572 3321856 4468224 4169728 4145152 4749312 4507648 4567552 4207104 3395072 4589056 4106240
3562 4106240 4231168 4663296 4291584 4823040 4368896 3502080 3827200 4289536 4348416 4295168
3552 4295168 3994112 4692480 4587520 4266496 3496960 4661760 4890112 5546496 4384256
3543 4384256 4525056 3499520 4040192 4175360 5315072 3759104 5027328 2960384 4902912
3534 4902912 4718592 4288000 4883456 4726272 4412928 5787648 5246464 5612544 6669824
3525 6669824 5514240 4925952 5487104 5613568 5757440 6629888 6525952 5722624 5393920
3516 5393920 5591040 6711296 6952960 5258240 6570496 5700608 6047744 7026176 5746176
3507 5746176 6969856 6043648 6174720 6209536 7133184 7068672 7065600 8483840 8425984 8049152
$$ packed form
3572C321856J146368k98496k4576O04160k41664N9904l60448q12032J193984m82816
3562D106240J24928M32128l71712N31456m54144q66816L25120M62336N8880n3248
3552D295168l01056O98368j04960l21024p69536J164800K28352O56384j162240
3543D384256J40800j025536N40672J35168J139712j555968J268224k066944J942528
3534D902912j84320m30592N95456j57184l13344J374720n41184L66080J057280
3525F669824j155584n88288N61152J26464J43872Q72448j03936q03328l28704
3516E393920J97120J120256K41664j694720J312256q69888L47136R78432j280000
3507E746176J223680r26208J31072L4816R23648o4512l072J418240n7856l76832
$$ plain form
3497 8049152 9438208 10166784 10597376 9360384 11080704 9664000 10478080 9737216 8846848
3488 8846848 10283008 10255872 10127360 10742272 11259904 11723264 12817408 14244864 14123520
3479 14123520 15045632 14965248 14131712 16101888 15877632 16098816 18161152 18158080 19180544
3470 19180544 18612224 19274240 19623424 20987392 22347264 23522816 25234432 26604544 26960896
3461 26960896 27618304 26287104 24699392 26032640 26556416 25933312 26684416 25843712 25339392
3452 25339392 21794304 19438080 17144320 15923200 14240256 13410816 11412480 12300288
3444 12300288 12514816 11189248 11685376 10730496 12228608 11255296 10555392 9972224 10099712
3435 10099712 10070016 10708992 11458048 11475968 11154944 10414080 9783296 10472960 9984512 9134080
$$ packed form
3497H049152J389056P28576M30592j236992J720320j416704Q14080p40864q90368
3488H846848J436160k7136j28512O14912N17632M63360J094144J427456j21344
3479A4123520R22112q0384q33536J970176k24256K21184K062336l072J022464
3470A9180544n68320O62016L49184J363968J359872J175552J711616J370112L56352
3461B6960896O57408j331200j587712J333248N23776o23104P51104q40704n04320
3452B5339392l545088k356224k293760j221120j682944q29440j998336Q87808
3444A2300288K14528j325568M96128r54880J498112r73312o99904n83168J27488
3435A0099712k9696O38976P49056J7920l21024p40864o30784O89664m88448q50432
$$ plain form
3425 9134080 9594368 8976384 8469504 8413184 8527360 8706048 8024576 8609792 8323584 8104960
3415 8104960 7800832 6699520 7375360 8508416 8407552 8428032 7964672 7980544 8376832 8399872
3405 8399872 7966720 7285760 8206336 8018432 6989312 8442880 7910400 7640064 8903680
3396 8903680 7426560 8061952 7756288 8434688 7797760 8315904 8358912 7646208 8294400 7952384
3386 7952384 7502848 8051200 7847424 8400384 9132544 8039936 7623168 8620032 8579584 7340032
3376 7340032 8243200 9320960 9201152 8214528 9805312 7850496 7581184 8354816 7858176
3367 7858176 8306176 7726592 8445952 8540160 8794112 8062464 8566272 9365504 9054208 7219712
3357 7219712 7171072 9294848 7820288 8376320 9257472 9034752 8579072 10096640 9460224
$$ packed form
3425I134080M60288o17984n06880n6320J14176J78688o81472N85216k86208k18624
3415H104960l04128j101312O75840J133056j00864K0480m63360J5872L96288K3040
3405H399872m33152o80960R20576j87904j029120J453568n32480k70336J263616
3396H903680j477120O35392l05664O78400o36928N18144M3008p12704O48192l42016
3386G952384m49536N48352k03776N52960P32160j092608m16768R96864m0448j239552
3376G340032R03168J077760j19808r86624J590784j954816k69312P73632m96640
3367G858176M48000n79584P19360R4208K53952p31648N03808P99232l11296j834496
3357G219712m8640K123776j474560N56032Q81152k22720m55680J517568o36416
$$ plain form
3348 9460224 9666560 8595968 9786880 9054208 9302016 8918016 8997376 9779712 9490432
3339 9490432 8918016 9235968 9195520 8985088 9579008 9857536 8885760 10525184 8510976
3330 8510976 9476096 10485760 10299904 10336768 9852928 10576896 10649088 10363904 10066432 10618880
3320 10618880 10817536 10946560 10886144 11249664 10818048 12305408 11189248 10847232 12662784
3311 12662784 10750976 12136448 11588096 11883520 12011520 11926016 11140608 12133376 12707840
3302 12707840 12057600 11833856 11113472 12588544 12155904 12885504 12858880 12737536 13442560
3293 13442560 12656640 12341248 12877312 13560320 14854144 13895168 14331392 14442496 15348224
3284 15348224 14626816 14794752 16633856 15387648 15353344 15023616 16450048 17310720 16918016
$$ packed form
3348I460224K06336j070592J190912p32672K47808l84000P9360P82336k89280
3339I490432n72416L17952m0448k10432N93920K78528r71776J639424k014208
3330H510976R65120J009664j85856L6864m83840P23968P2192k85184k97472N52448
3320A0618880J98656J29024o0416L63520m31616J487360j116160l42016J815552
3311A2662784j911808J385472n48352K95424J28000q5504p85408R92768N74464
3302A2707840o50240k23744p20384J475072m32640P29600k6624j21344P05024
3293A3442560p85920l15392N36064O83008J293824r58976M36224J11104R05728
3284A5348224p21408J67936J839104j246208l4304l29728J426432Q60672l92704
$$ plain form
3275 16918016 17009664 15956480 16177152 16141312 15758848 16536064 16671232 16582656 18036224 18219520
3265 18219520 18771456 18840064 19382784 20974592 20931584 21762048 23238144 23006720 24921088
3256 24921088 24861696 25411072 27260928 27780608 29087744 29739008 31475200 32982016 34303488
3247 34303488 35446784 36173824 38279168 39912448 41156608 42199552 42894336 45194240
3239 45194240 46443520 49186816 50500096 53917696 56235520 59370496 63553536 65827328
3231 65827328 70514176 74003456 79812096 85075968 90691584 100202496 107479040 116370944
3223 116370944 124625920 134535168 145236480 156525056 168676352 180189696 195426304
3216 195426304 210378240 229080064 249781760 272688128 301152768 336256512 382689280
$$ packed form
3275A6918016R1648j053184K20672l5840l82464P77216J35168q8576J453568J83296
3265A8219520N51936O8608N42720J591808m3008Q30464J476096k31424J914368
3256B4921088n9392N49376J849856N19680J307136O51264J736192J506816J321472
3247C4303488J143296P27040K105344J633280J244160J042944O94784K299904
3239D5194240J249280K743296J313280L417600K317824L134976M183040K273792
3231F5827328M686848L489280N808640N263872N615616R510912P276544Q891904
3223A16370944Q254976R909248J0701312J1288576J2151296J1513344J5236608
3216A95426304J4951936J8701824K0701696K2906368K8464640L5103744M6432768
$$ plain form
3209 382689280 441829888 521454592 625738240 766174208 945448960 1137287680 1269540864
3202 1269540864 1278935552 1135288320 883960320 638437888 459303424 338116608
3196 338116608 259405312 204888576 166310912 140145664 119735296 105199104 93266432
3189 93266432 82758144 74617856 67783168 62648832 58830848 55776256 52416000 49486848
3181 49486848 46776832 43519488 40507392 39470592 36562944 35910656 34168320 31562240
3173 31562240 31243776 29576704 27990528 26390016 24856064 25300480 23714304 22983168 23325184
3164 23325184 21791744 21472768 20133888 20240384 19282944 18057216 17772032 17482752 16873472
3155 16873472 17511424 17102848 15740416 16483840 16397312 14752768 15857152 14883328 14697984
$$ packed form
3209C82689280N9140608P9624704J04283648J40435968J79274752J91838720J32253184
3202A269540864R394688j43647232k51328000k45522432j79134464j21186816
3196C38116608p8711296n4516736l8577664k6165248k0410368j4536192j1932672
3189I3266432j0508288q140288o834688n134336l817984l054592l360256k929152
3181D9486848k710016l257344l012096j036800k907648o52288j742336k606080
3173C1562240l18464j667072j586176j600512j533952M44416j586176p31136L42016
3164B3325184j533440l18976j338880J06496r57440j225728k85184k89280o09280
3155A6873472O37952m08576j362432P43424q6528j644544J104384r73824j85344
$$ plain form
3146 14697984 14440448 14375936 14259200 14313984 14368768 12964352 12546560 11634176 12410368 12683776
3136 12683776 11875328 11942400 11676672 11540480 11697152 11091968 10487296 9402368 9721856
3127 9721856 10142720 10204160 11355136 9890304 10442752 9464832 8698880 9152000 8092672
3118 8092672 8739840 8545280 8229376 8384512 8270848 8896000 9024000 8720896 9201152 8638464
3108 8638464 6959616 7417856 7195648 6121984 5902848 6455808 6258176 6952448 7569408
3099 7569408 6218752 6811136 6120448 5352960 6402560 7006208 6048256 5953536 5966336 6935040
3089 6935040 5968384 5862400 6155264 6771712 5720064 6880256 6373888 6639616 6010368
3080 6010368 4744192 6422016 5940736 5804032 6102528 6627840 4589568 6385664 6126080
$$ packed form
3146A4697984k57536o4512j16736N4784N4784j404416m17792r12384P76192K73408
3136A2683776q08448O7072k65728j36192J56672o05184o04672j084928L19488
3127I721856M20864O1440J150976j464832N52448r77920p65952M53120j059328
3118H092672O47168j94560l15904J55136j13664O25152J28000l03104M80256n62688
3108H638464j678848M58240k22208j073664k19136N52960j97632O94272O16960
3099G569408j350656N92384o90688p67488J049600O03648r57952r4720J2800R68704
3089F935040r66656j05984K92864O16448j051648J160192n06368K65728o29248
3080F010368j266176J677824m81280j36704K98496N25312k038272J796096k59584
$$ plain form
3071 6126080 4876800 5737984 6410240 5624832 5947392 4228608 5394944 5158912 5612544
3062 5612544 5388800 6667776 4674048 5965824 5366272 5889536 4743168 6113280 5120512
3053 5120512 5242880 5985280 4850176 5323776 6348800 6550528 6356480 6950912 7520256
3044 7520256 6270976 5654016 5653504 6490624 5387776 5389312 5588480 5783552 5763584 5010432
3034 5010432 5673472 5711872 4869632 6656000 6510592 5136384 6006784 5579776 5882368
3025 5882368 5444608 5449216 6125056 4758016 6201856 6022656 7020544 6695424 7176192 7826944
3015 7826944 8572928 8934912 9975808 9533440 9742336 9332224 8445440 8460800 7288832
3006 7288832 7946752 7513088 6574080 6437376 7513088 6685696 6710784 6498304 6684160 6787072
$$ packed form
3071F126080j249280Q61184O72256p85408L22560j718784J166336k36032M53632
3062E612544k23744J278976j993728J291776n99552N23264j146368J370112r92768
3053E120512J22368P42400j135104M73600J025024K01728j94048N94432N69344
3044G520256j249280o16960n12Q37120j102848J536J99168J95072j9968p53152
3034E010432O63040L8400q42240J786368j45408j374208Q70400m27008L02592
3025E882368m37760M608O75840j367040J443840j79200R97888l25120M80768O50752
3015G826944P45984L61984J040896m42368K08896m10112q86784J5360j171968
3006G288832O57920m33664r39008j36704J075712q27392K5088k12480J85856J02912
$$ plain form
2996 6787072 7069696 7528448 7208448 7426560 7071744 7635968 7213056 6470144 7428096 7935488
2986 7935488 7712256 7516672 8288256 9159168 9259008 8488448 9450496 9385472 10487296 10480128
2976 10480128 11772416 12022272 11532288 13313536 13549056 14581248 15243264 16188416 17038336
2967 17038336 15985152 16677376 18241536 18983936 18207232 19019264 19239424 19288576 19008512
2958 19008512 20088320 21414400 21755392 21083648 23042048 23760384 23766016 21442560 20798464
2949 20798464 19400192 16990208 15073280 14170624 13265408 12267008 11465216 11564544 12205056
2940 12205056 11897856 11868672 11984896 12134912 13200384 11931648 13195776 12912640 12218880
2931 12218880 12303360 13249024 11832832 12316160 11676672 10729984 11039232 9780224 10372608
$$ packed form
2996F787072K82624M58752l20000K18112l54816N64224m22912p42912R57952N07392
2986G935488k23232j95584P71584Q70912R9840p70560R62048o5024J101824p168
2976A0480128J292288K49856m89984J781248K35520J032192O62016R45152Q49920
2967A7038336j053184O92224J564160P42400p76704Q12032K20160M9152k80064
2958A9008512J079808J326080L40992o71744J958400P18336N632k323456o44096
2949B0798464j398272k409984j916928r02656r05216r98400q01792R9328O40512
2940A2205056l07200k9184J16224J50016J065472j268736J264128k83136o93760
2931A2218880Q4480R45664j416192M83328o39488r46688L09248j259008N92384
$$ plain form
2922 10372608 9742848 9163264 9904128 7585280 7905792 8126976 7777792 7335424 6438912
2913 6438912 5748224 6564352 5844992 6926848 7373312 5638144 5859328 6099456 5719552
2904 5719552 6022144 5691904 5846016 6426624 6019584 7187456 5481472 5321728 6196736
2895 6196736 5708288 6842368 5908480 6026752 5653504 5692928 5437952 5025792 5792256 6249472
2885 6249472 5991424 6873600 5239296 5270016 5465600 5670400 5921280 6740992 5762560 6239744
2875 6239744 6166528 6091776 6723584 5771264 5074432 5054976 5692416 5499392 6248448 5537280
2865 5537280 5988864 6133248 6352384 6841344 6077440 6925824 5112320 5316608 5678592
2856 5678592 4878848 5044224 5894144 4929536 6137344 4914688 5161984 5407232 5885952
$$ packed form
2922A0372608o29760n79584P40864k318848L20512K21184l49184m42368q96512
2913F438912o90688Q16128p19360J081856M46464j735168K21184K40128l79904
2904E719552L02592l30240J54112N80608m07040J167872j705984j59744Q75008
2895F196736m88448J134080r33888J18272l73248L9424k54976m12160P66464M57216
2885F249472k58048Q82176j634304L0720J95584K04800K50880Q19712r78432M77184
2875F239744p3216p4752O31808r52320o96832j9456O37440j93024P49056p11168
2865E537280M51584J44384K19136M88960p63904Q48384j813504K04288L61984
2856E678592p99744J65376Q49920r64608J207808j222656K47296K45248M78720
$$ plain form
2847 5885952 5505024 5726208 5841920 6624768 5187072 5360128 5570560 5934592 6310912
2838 6310912 4827648 5545984 6019584 4781056 5102592 5618688 4520960 5288960 6336512
2829 6336512 4582912 4241408 4537856 5157376 4980224 4973568 4843520 4247552 5558272 6074880
2819 6074880 5061632 4795904 4488192 4239872 5350912 5638656 5516800 4705792 4109312
2810 4109312 4056064 4843008 4808704 5040128 4600832 5888512 5021184 5464064 5933568 6434816
2800 6434816 5769216 6730240 6100992 6494720 7693824 6628352 7454720 7649280 7262208
2791 7262208 8892416 9132032 10528768 13432832 17216000 20241920 22634496 24616960
2783 24616960 20312064 19020288 19495936 13251584 7516672 6112768 4277760 5173248
$$ packed form
2847E885952l80928K21184J15712P82848j437696J73056K10432L64032L76320
2838F310912j483264P18336M73600j238528L21536N16096j097728P68000J047552
2829F336512j753600l41504K96448O19520j77152o656j30048n95968J310720N16608
2819F074880j013248k65728l07712k48320J111040K87744j21856q11008n96480
2810D109312n3248P86944l4304K31424m39296J287680q67328M42880M69504N01248
2800F434816o65600R61024o29248L93728J199104j065472Q26368J94560l87072
2791G262208J630208K39616J396736K904064L783168L025920K392576J982464
2783B4616960m304896j291776M75648o244352n734912j403904j835008Q95488
$$ plain form
2775 5173248 5008896 4624384 3811840 3764736 3457024 4819968 3442176 3748352 3576320
2766 3576320 4722688 3520512 4254208 4392448 3925504 4028928 4220928 4100096 4224000
2757 4224000 3994112 4549632 3907584 3925504 3829248 4495360 4504576 4467200 5746176 5720576
2747 5720576 4026368 4308992 4921344 4904960 4596224 4084736 4513792 4469248 4411392 4266496
2737 4266496 4459008 4591616 5998080 4710912 4822016 4343808 5025280 5540352 5109248
2728 5109248 4760064 4380672 4904960 5767168 4295680 4678144 5526528 5099008 5634048
2719 5634048 7281664 6011392 6486528 7659520 7425024 7199744 7060992 6955520 7358464
2710 7358464 8006656 8671232 7399424 7542784 7646208 8325632 8643072 10174976 10703360
$$ packed form
2775E173248j64352l84512q12544m7104l07712J362944j377792L06176j72032
2766C576320J146368j202176P33696J38240m66944J03424J92000j20832J23904
2757D224000k29888N55520o42048J7920r6256O66112R216l7376J278976k5600
2747E720576j694208K82624O12352j6384l08736n11488M29056m4544n7856j44896
2737D266496J92512J32608J406464j287168J11104m78208O81472N15072m31104
2728E109248l49184l79392N24288Q62208j471488L82464Q48384m27520N35040
2719E634048J647616j270272M75136J172992k34496k25280j38752j05472M02944
2710G358464O48192O64576j271808J43360J03424O79424L17440J531904N28384
$$ plain form
2701 10703360 11821568 13446656 12277760 11001856 10043392 9401856 6952960 7466496 6201344
2692 6201344 6786560 5773312 4940288 5203968 3881984 4836864 5180416 5047296 4650496
2683 4650496 4648448 5449216 4621824 5221376 4427264 4699136 4759040 4224512 4368896 3343360
2673 3343360 3774464 4832256 3871232 4815360 4387328 3869184 4708864 4399104 5369344
2664 5369344 5132800 4631040 4682240 4975104 4506112 4277760 4900864 2552832 5000192
2655 5000192 4419584 4578304 3000832 4905984 3938304 3663360 4731904 3941888 3860480
2646 3860480 3904000 4055552 4102656 4165632 4126720 4635648 3542016 3764736 4192768 4049408
2636 4049408 2785280 3890688 3983872 4280832 4245504 4024320 3483136 3884032 4290048 4503552
$$ packed form
2701A0703360J118208J625088j168896j275904r58464o41536k448896N13536j265152
2692F201344N85216j013248q33024K63680j321984R54880L43552j33120l96800
2683D650496k048Q00768q27392N99552p94112K71872N9904n34528J44384j025536
2673C343360M31104J057792r61024R44128m28032n18144Q39680l09760R70240
2664E369344k36544n01760N1200K92864m68992k28352O23104k348032K447360
2655E000192n80608J58720j577472J905152r67680k74944J068544p90016q1408
2646C860480M3520J51552M7104O2976l8912N08928j093632K22720M28032j43360
2636D049408j264128J105408R3184K96960l5328k21184n41184M00896M06016K13504
$$ plain form
2626 4503552 4842496 3730432 3206144 3401216 4631552 4036096 3164160 5397504 4304384
2617 4304384 3812352 4932608 4498944 4529152 4452864 4065792 2826240 3669504 4325888 3853312
2607 3853312 3187200 2737664 4110336 3459072 3550208 3943936 3627008 4802560 3611648
2598 3611648 3651072 4060672 3275264 3860480 3993088 4961792 4421120 3685376 4733952 4856320
2588 4856320 4518400 4689408 3693568 4749824 4835840 3756544 4294144 4774912 5602304
2579 5602304 4676608 5263360 6981632 5416448 5272576 6918656 7943680 7755264 8694784
2570 8694784 9934848 12545536 18309632 28153344 28527104 34321920 18319360 10247168
2562 10247168 6865920 5635584 4798464 5098496 4301312 3528704 4549120 4777984 3362816
$$ packed form
2626D503552L38944j112064n24288J95072J230336n95456q71936K233344j093120
2617D304384m92032J120256m33664L0208p6288l87072j239552Q43264O56384m72576
2607C853312o66112m49536J372672o51264R1136L93728l16928J175552j190912
2598C611648L9424M09600p85408N85216J32608R68704n40672p35744J048576J22368
2588D856320l37920J71008r95840J056256Q6016j079296N37600M80768Q27392
2579E602304r25696N86752J718272j565184j43872J646080J025024j88416R39520
2570H694784J240064K610688N764096R843712L73760N794816j6002560q072192
2562A0247168l381248j230336q37120L00032p97184p72608J020416K28864j415168
$$ plain form
2553 3362816 3621888 4888064 3633664 3074048 3837952 3702272 3747840 4080128 3767296
2544 3767296 3745280 3172352 4423680 3532800 3987968 3518976 4600320 4010496 3190784
2535 3190784 3027456 3059712 3601408 3923968 3593216 3988480 3793408 3785728 4348416 3440128
2525 3440128 4036096 4352000 2664448 3667456 3249664 2830848 3871744 3039232 3575296
2516 3575296 3538432 2897408 3777536 2352640 3500032 3549696 4516864 3271168 3852288
2507 3852288 4179968 3721728 4068352 4656128 3361280 4416512 4595200 4483072 4284416
2498 4284416 4755456 5214720 5439488 5183488 5777408 5431296 6734848 7411200 7542784
2489 7542784 6779904 8314368 7919616 9188864 8937472 9778688 10969088 12454912 14263296
$$ packed form
2553C362816K59072J266176j254400n59616P63904j35680M5568L32288l12832
2544C767296k2016n72928J251328q90880M55168m68992J081344n89824q19712
2535C190784j63328L2256N41696L22560l30752L95264j95072p680N62688r08288
2525C440128N95968L15904j687552J003008m17792m18816J040896q32512N36064
2516C575296l6864o41024Q80128j424896J147392M9664R67168j245696N81120
2507C852288L27680m58240L46624N87776j294848J055232J78688j12128j98656
2498D284416M71040M59264K24768k56000N93920l46112J303552O76352J31584
2489G542784p62880J534464l94752J269248k51392Q41216J190400J485824J808384
$$ plain form
2480 14263296 15991808 20214784 31616000 42570240 44307456 47490560 28012032 16674816
2472 16674816 15503872 13705216 15646720 19393536 27620864 29710848 34543616 28008448
2464 28008448 18899968 15058432 15682560 18040832 24037376 35131904 40028672 44464640
2456 44464640 36795904 18493952 14215168 13043712 13900800 17432064 24211968 27411456
2448 27411456 31240192 24515072 12486656 9436160 8695296 8617984 10257408 13155328
2440 13155328 15607808 16570368 13912576 7255040 5265408 4981248 3611136 3931648 4197376
2431 4197376 4086272 4422656 4158976 4648960 3814912 4021760 5627392 3999232 4318208
2422 4318208 4561920 4812800 5021184 6147584 7309312 6606848 6553088 7690240 6686208
$$ packed form
2480A4263296J728512M222976J1401216J0954240J737216L183104j9478528j1337216
2472A6674816j170944j798656J941504L746816Q227328K089984M832768o535168
2464B8008448r108480l841536O24128K358272N996544J1094528M896768M435968
2456D4464640p668736j8301952m278784j171456Q57088L531264O779904L199488
2448B7411456L828736o725120j2028416l050496p40864p7312J639424K897920
2440A3155328K452480R62560k657792o657536j989632k84160j370112L20512K65728
2431D197376j11104L36384k63680M89984q34048K06848J605632j628160L18976
2422D318208K43712K50880K08384J126400J161728p02464n3760J137152j004032
$$ plain form
2413 6686208 6499840 5489152 4826112 4268544 5062144 4198912 5404672 4566528 3886592
2404 3886592 3214336 2999808 2820608 3889152 1928704 2043392 2328576 2804736 1934848
2395 1934848 2285568 2797056 1798144 1666048 2331648 2033664 2520576 2329088 2803200 3402240
2385 3402240 2196480 1836032 1831936 1762304 2782720 1878528 1999360 2538496 2460672 2496000
2375 2496000 2302976 3298816 1361408 2767872 1462784 2881536 2712064 2587136 2990080
2366 2990080 2285568 2199040 2654720 2067968 1742848 1923584 1643008 1793536 2140672 2417664
2356 2417664 1880576 2659328 1840128 2094592 2404864 2022400 2055168 2333696 2609152 2765312
2346 2765312 1616896 2229760 3119104 2002944 1665536 1644032 2446848 2233856 1677824
$$ packed form
2413F686208j86368j010688o63040n57568P93600q63232J205760q38144o79936
2404C886592o72256k14528j79200J068544A928704J14688K85184M76160q69888
2395A934848L50720N11488r98912j32096O65600k97984M86912j91488M74112N99040
2385C402240j205760l60448m096o9632J020416r04192J20832N39136p7824L5328
2375B496000j93024R95840A361408J406464j305088J418752j69472j24928M02944
2366B990080p04512q6528M55680n86752l25120J80736k80576J50528L47136K76992
2356B417664n37088P78752q19200K54464L10272l82464L2768K78528K75456J56160
2346B765312j148416O12864Q89344j116160l37408k1504Q02816k12992n56032
$$ plain form
2337 1677824 2441216 625152 2536960 2667520 1707520 2101760 2432512 1808384 2628608
2328 2628608 1840640 1713664 2554368 1434112 1527296 2405376 2498560 2489856 1868800 3393024
2318 3393024 2466816 2171904 2772992 3131392 2870272 1619456 1647104 2171904 3145728 1573376
2308 1573376 3268608 2070528 1349120 3238400 1576960 2468352 948224 2810368 1935872
2299 1935872 1993216 1840128 1907712 1379328 1317888 2771968 2409984 1654784 1522176 1804288
2289 1804288 2059776 1244672 2340352 1930752 1655296 2030592 1489920 1785856 3062784
2280 3062784 1325056 1551872 2652672 2228736 2711552 3193344 3068416 2839552 2380288
2271 2380288 2134016 2410496 1895424 1839616 2356224 2035712 1581568 2100224 2217472 2741760
$$ packed form
2337A677824P63392F25152J911808J30560r60000L94240L30752o24128Q20224
2328B628608p87968j26976Q40704j120256R3184Q78080R3184q704o21056J524224
2318C393024r26208k94912O01088L58400k61120j250816K7648N24800R73824j572352
2308A573376J695232j198080p21408J889280A576960Q91392I48224J862144q74496
2299A935872N7344j53088O7584n28384o1440J454080l61984p55200j32608K82112
2289A804288K55488q15104J095680m09600k75456L75296n40672K95936J276928
2280C062784A325056K26816J100800m23936M82816M81792j24928k28864m59264
2271B380288k46272K76480n15072n5808N16608l20512m54144N18656J17248N24288
$$ plain form
2261 2741760 2221568 1860096 3303424 2906624 2075136 1556992 2660864 3476992 2239488
2252 2239488 3158016 2772992 2759168 1633280 2787328 2115072 2235392 2524160 2846720
2243 2846720 2687488 3841024 2608128 2492928 3094528 2727424 4061696 3007488 3011584
2234 3011584 3379200 3158016 4142080 3943936 4294144 3670528 3630080 4575232 4731904 4853760
2224 4853760 4111360 3716096 3527680 4855296 4812800 4544000 4770816 3620352 3471872
2215 3471872 4504064 3155456 4197376 3984896 3972608 4715008 4639232 4736512 3399680
2206 3399680 4584448 4464640 5045760 3531776 4212224 4520960 4353024 3828224 4202496
2197 4202496 5886464 5301760 6533632 4922880 4962816 5225984 4760576 4980736 4547072
$$ packed form
2261B741760n20192l61472J443328l96800q31488n18144J103872Q16128j237504
2252B239488R18528l85024j3824j125888J154048o72256J20320K88768L22560
2243B846720j59232J153536j232896j15200O01600l67104J334272j054208M096
2234C011584L67616k21184R84064j98144L50208o23616m0448R45152J56672J21856
2224D853760p42400l95264j88416J327616m2496k68800K26816j150464j48480
2215C471872J032192j348608J041920k12480j2288P42400p5776R7280j336832
2206C399680J184768j19808N81120j513984O80448L08736j67936n24800L74272
2197D202496J683968n84704J231872j610752L9936K63168m65408K20160m33664
$$ plain form
2188 4547072 3724288 4966912 3364864 3617792 3801600 2906624 2966016 3571200 3750912
2179 3750912 2989056 3604480 4874752 4584448 3931648 3878400 3792384 3543552 2980864 3890176
2169 3890176 2985472 4329984 3753984 4056064 4307456 3557888 4683776 4020736 4772352
2160 4772352 2904576 3399168 4372992 3735552 3757568 2102272 3471872 3380224 3470848 2754560
2150 2754560 3130368 4077056 3041792 3878912 2220544 3018752 4363776 3073536 3395584
2141 3395584 2204672 2739712 3203072 3360256 3668480 2810880 3270656 3419648 3467776 4486656
2131 4486656 3332608 2967552 4916736 3844096 3881472 3563520 3454464 3372544 5086208
2122 5086208 3265536 4203008 3395584 3703296 4015616 4638720 2820096 3992576 4070400
$$ packed form
2188D547072q22784J242624j602048K52928J83808q94976N9392O05184J79712
2179C750912p61856O15424J270272k90304o52800n3248q6016k48832n62688R09312
2169C890176r04704J344512n76000L02080K51392p49568J125888o63040P51616
2160D772352j867776M94592R73824o37440K2016j655296J369600r1648R0624p16288
2150B754560L75808R46688j035264Q37120j658368P98208J345024j290240L22048
2141C395584j190912N35040M63360J57184L08224q57600M59776J48992M8128J018880
2131D486656j154048l65056J949184j072640L7376l17952j09056q1920J713664
2122E086208j820672R37472q07424L07712L12320O23104j818624J172480P7824
$$ plain form
2113 4070400 2498048 3857408 4512768 4884992 3148800 3827712 4096000 3941888 3001344
2104 3001344 3058688 4181504 4532224 3517440 3259904 4690944 4350464 3570176 3335680
2095 3335680 4206080 4208640 4887040 2906624 3648000 3696128 4188160 3805184 5062144 4069888
2085 4069888 4367360 5348352 4339712 5093376 5208576 4153856 4972544 3864576 4439552
2076 4439552 3993088 4260864 4499456 4638720 3889664 3318272 4751872 4009984 4190720
2067 4190720 3819008 3744256 4469248 4740096 3903488 4470272 4833280 3723776 4729344
2058 4729344 4013568 3464704 3395072 4247040 4608512 3955712 3329024 3887104 3905536 3971072
2048 3971072 3618816 3530240 4751360 2909184 4567552 4341760 3212288 4896256 4884480
$$ packed form
2113D070400j572352J359360O55360L72224j736192O78912K68288j54112r40544
2104C001344N7344J122816L50720j014784k57536J431040l40480p80288k34496
2095C335680Q70400K560O78400j980416P41376M8128M92032l82976J256960r92256
2085D069888K97472R80992j008640P53664J15200j054720Q18688j107968N74976
2076D439552m46464K67776K38592J39264p49056n71392J433600p41888J80736
2067D190720l71712p4752P24992K70848q36608N66784L63008j109504J005568
2058D729344p15776n48864o9632Q51968L61472o52800o26688N58080J8432O5536
2048C971072l52256q8576J221120j842176J658368k25792j129472J683968j1776
$$ plain form
2039 4884480 5353984 4511744 4360192 4290560 5390336 4485632 4029952 4552192 4001280 4741632
2029 4741632 5073408 4752896 3542016 3885056 3949056 4632064 5323264 4712960 5159936 6074368
2019 6074368 5824512 5238784 6111744 5049856 5380096 5444608 6982144 6035456 5865984
2010 5865984 6584832 5624320 6079488 6361088 5807616 6054912 6680064 6796800 8044544
2001 8044544 7387648 7707136 8278016 8484352 8350720 8501760 8177152 7161344 6746112
1992 6746112 7476224 6919680 7562240 6530560 6820352 7372800 7571968 6598656 6519296 7343616
1982 7343616 8144896 7607296 8183808 7614976 8800768 8259584 7563776 8405504 7808000
1973 7808000 7905792 8013824 6650368 7814144 7818752 8011776 8376832 7481856 7188992 8746496
$$ packed form
2039D884480M69504q42240j51552o9632J099776r04704m55680N22240n50912P40352
2029D741632L31776l20512j210880L43040O4000O83008O91200o10304M46976R14432
2019F074368k49856n85728Q72960j061888L30240O4512J537536r46688j69472
2010E865984P18848r60512M55168K81600n53472K47296O25152J16736J247744
2001H044544o56896L19488N70880K06336j33632J51040l24608j015808m15232
1992F746112P30112n56544O42560j031680K89792N52448J99168r73312p9360Q24320
1982G343616Q01280n37600N76512n68832J185792n41184o95808Q41728n97504
1973G808000R7792J08032j363456J163776M608J93024L65056q94976k92864J557504
$$ plain form
1963 8746496 8238592 8563712 8068096 8537088 7149568 8605696 8094208 7317504 6054400
1954 6054400 7095808 6880256 6391296 6560256 6522368 6325248 6141440 6148608 8282624 6473216
1944 6473216 6716416 7628288 7345152 7364608 6378496 6845952 6642176 7805952 6718976
1935 6718976 6221312 7744512 7221760 5954560 6547968 6093824 5341696 4446720 6593024
1926 6593024 5911040 6865408 5495808 4690432 4627456 5516288 5773824 5911040 6280192 6322176
1916 6322176 5921280 5255168 5789696 5304832 5191680 5957632 6518272 6303232 5827584 6887424
1906 6887424 6296064 7408128 7266304 6943232 6376960 7595008 6913536 6205440 6796288
1897 6796288 7116288 8048640 6956544 8046592 6778368 7985152 7370240 8166912 6420992
$$ packed form
1963H746496n07904L25120m95616M68992j387520J456128n11488p76704j263104
1954F054400J041408k15552m88960J68960l7888j97120j83808P168K134016j809408
1944F473216K43200R11872k83136J9456r86112M67456k03776J163776j086976
1935F718976m97664J523200n22752j267200N93408m54144p52128q94976K146304
1926F593024o81984R54368j369600q05376o2976Q88832K57536J37216L69152M1984
1916F322176m00896o66112N34528m84864j13152P65952N60640k15040m75648J059840
1906F887424n91360J112064j41824l23072n66272J218048o81472p08096N90848
1897F796288L20000R32352j092096J090048j268224J206784o14912P96672j745920
$$ plain form
1888 6420992 7331328 7203840 7001088 7276032 7469056 8248832 7013888 8261632 8420864
1879 8420864 8351744 7259648 8527360 7954944 9129984 7985664 9520128 8094720 8499712
1870 8499712 8275968 8990720 8818688 9472512 9975808 10497024 9649664 9697792 9899520 9334272
1860 9334272 10081792 9473024 9874944 9944576 10049024 10417152 9616384 10417664 10563072 9674752
1850 9674752 10503680 10314240 9839616 9496576 10164224 10944512 9375744 9806848 9507840
1841 9507840 9363968 9948672 9317888 10100736 9718272 9912832 9058816 10627072 9414656
1832 9414656 10776576 10522624 9745408 10860544 10688512 9949696 11441152 9491968 10106368
1823 10106368 9699328 11555840 10268160 11054592 10349568 10703360 10083840 10280960 10110464
$$ packed form
1888F420992R10336j27488k02752K74944J93024P79776j234944J247744J59232
1879H420864o9120j092096J267712n72416J175040j144320J534464j425408M04992
1870H499712k23744P14752j72032O53824N03296N21216q47360M8128K01728n65248
1860I334272P47520o08768M01920O9632J04448L68128q00768Q01280J45408q88320
1850I674752Q28928j89440m74624l43040O67648P80288j568768M31104k99008
1841I507840j43872N84704o30784P82848l82464J94560q54016J568256j212416
1832I414656J361920k53952p77216J115136j72032p38816J491456j949184O14400
1823A0106368m07040J856512j287680P86432p05024L53792o19520J97120j70496
$$ plain form
1814 10110464 9994752 10312704 10722816 10573312 9520128 11886592 10924032 11465728 11445248
1805 11445248 12688384 16244736 23780864 23254016 28625408 19446784 11318784 10319360
1797 10319360 9370112 8464896 9351680 8880640 7704576 7175680 7648768 6671360 7435776
1788 7435776 6233600 6304256 5786112 7522304 6598144 7177216 7119360 5890048 6588928
1779 6588928 6864384 6482432 6834176 7368192 5882368 6068224 5729280 7048704 6339584
1770 6339584 6213632 6405632 5937152 7238656 5525504 6616576 6772736 6086656 6841856
1761 6841856 6465024 5718528 6286848 6674944 7475200 5713920 6163456 6449152 7026176
1752 7026176 5745152 6788096 6380032 5933056 6516736 5551616 6359040 5871616 7745024
$$ packed form
1814A0110464j15712L17952M10112j49504j053184K366464r62560N41696k0480
1805A1445248J243136L556352P536128n26848N371392r178624q128000r99424
1797A0319360r49248r05216Q86784m71040j176064n28896M73088r77408P64416
1788G435776j202176P0656n18144J736192r24160N79072n7856j229312O98880
1779F588928K75456l81952L51744N34016j485824J85856l38944J319424p09120
1770F339584j25952J92000m68480J301504j713152J091072J56160o86080P55200
1761F841856l76832p46496N68320L88096Q00256j761280M49536K85696N77024
1752G026176j281024J042944m08064m46976N83680r65120Q07424m87424J873408
$$ plain form
1743 7745024 6770688 7129600 6287360 6924288 7272448 7286272 6990336 7333376 7389184 7081472
1733 7081472 6898176 7253504 7662080 8564736 8727040 7356416 8241664 7717376 8751616
1724 8751616 7000064 8007168 9047040 8393728 8054784 9909760 7912960 8872448 8560128
1715 8560128 9371136 8466944 8472064 8412160 9219584 8701440 7771136 8036864 7927808 7766528
1705 7766528 8026112 7329280 7858176 8284160 8224256 7641088 7728128 7266816 8030208 8527360
1695 8527360 7555584 7845376 8728576 8554496 9276416 8197120 8582144 9449984 9460224 9397248
1685 9397248 9545216 9570304 8867328 9277440 10105344 9827328 10179072 11499008 10180096
1676 10180096 9527808 11063808 10561024 9797632 10072576 11127296 10657792 9649664 11164672
$$ packed form
1743G745024r74336L58912q42240O36928L48160J3824k95936L43040N5808l07712
1733G081472j83296L55328M08576R02656J62304j370624Q85248n24288J034240
1724H751616j751552J007104J039872o53312l38944J854976j996800R59488l12320
1715H560128Q11008r04192N120n9904Q07424n18144r30304K65728j09056j61280
1705G766528K59584o96832N28896M25984n9904n83168Q7040m61312P63392M97152
1695H527360r71776K89792Q83200j74080P21920j079296L85024Q67840J0240o2976
1685I397248J47968K5088p02976M10112Q27904k78016L51744J319936j318912
1676A0180096o52288J536000n02784p63392K74944J054720m69504j008128J515008
$$ plain form
1667 11164672 11675648 10011648 11322880 11611136 11317248 12137472 11883008 12462592 13426688
1658 13426688 12549120 12148736 11720704 12703232 12668416 13133824 13189632 13170688 13608960 13795328
1648 13795328 15280640 14658560 15175680 14215168 15111168 15176192 14637056 14873600 14119424
1639 14119424 13877248 13804032 13264384 13303808 12797440 12136448 12915712 13761536 11618304 12718592
1629 12718592 12202496 12829696 13564416 11537408 12414976 12293632 12571136 12673536 12719616
1620 12719616 11837440 12268032 12462592 12056064 12009984 11953664 11591168 11561984 11916800 12121088
1610 12121088 11828224 11834368 12359168 11527680 11452416 11178496 12397568 11403776 11452416 10915328
1600 10915328 10345472 10014720 10205696 9846272 11431424 9673728 9431552 8877056 8942592
$$ packed form
1667A1164672N10976j664000J311232K88256k93888Q20224k54464N79584R64096
1658A3426688q77568m00384m28032R82528l4816M65408N5808j8944M38272J86368
1648A3795328J485312o22080N17120r60512Q96000O5024n39136K36544p54176
1639A4119424k42176p3216n39648L9424n06368o60992P79264Q45824k143232J100288
1629A2718592n16096O27200P34720k027008Q77568j21344K77504J02400M6080
1620A2719616q82176M30592J94560m06528m6080n6320l62496k9184L54816K04288
1610A2121088k92864O144N24800q31488p5264k73920J219072r93792M8640n37088
1600A0915328n69856l30752J90976l59424J585152j757696k42176n54496O5536
$$ plain form
1591 8942592 9498112 9153536 8571392 9359872 8834048 8773120 8066048 8338432 9056256 7641088
1581 7641088 7640576 8927232 7898624 8464384 8428032 8169472 7948288 8271360 8796672 7970816
1571 7970816 8235008 8506368 8234496 8033280 8136704 7332352 7402496 6886912 8141312 8585728
1561 8585728 8051712 8010240 7488000 7581696 6936576 8344576 7981568 8003072 7650816 8460288
1551 8460288 7223808 7590400 8453120 8644608 7159808 7424000 8617472 8802304 8497152
1542 8497152 8551424 8423424 9096192 9794560 9826304 9990656 9646080 9757696 9627136 10650112
1532 10650112 11497984 11181568 11163136 9778688 11392512 11849216 10885120 12580352 13524480
1523 13524480 12226048 13155328 12542464 13346304 13193728 13118464 12967424 14171648 14580224
$$ packed form
1591H942592N55520l44576n82144P88480n25824o0928p07072K72384P17824j415168
1581G641088n12J286656j028608N65760l6352k58560k21184L23072N25312q25856
1571G970816K64192K71360k71872k01216J03424q04352P0144n15584J254400M44416
1561H585728n34016m1472n22240R3696o45120J408000l63008K1504l52256Q09472
1551H460288j236480L66592Q62720J91488j484800K64192J193472J84832l05152
1542H497152N4272j28000O72768O98368L1744J64352l44576J11616j30560J022976
1532A0650112Q47872l16416j8432j384448J613824M56704r64096J695232R44128
1523A3524480j298432R29280o12864Q03840j52576p5264j51040J204224M08576
$$ plain form
1514 14580224 15181824 14150144 15484928 15441408 15907840 15367168 15841280 16496640 17288704
1505 17288704 18116096 18671104 19326464 19578880 20739072 21193216 22986240 23223296 23849472
1496 23849472 24662528 26931712 27688960 29371904 29383680 32109568 33328128 33766912 35964928
1487 35964928 36618240 38789120 39363584 39905280 41005056 41240064 41370112 43305984 43720192
1478 43720192 45755392 46071808 48348672 49090048 51126784 53222400 56423936 58354176
1470 58354176 61186048 62907392 66081792 71145472 74440704 78784000 84964352 93006336
1462 93006336 99999232 107388928 113523200 118230528 117752832 113809920 107462656 97498624
1454 97498624 86935552 75617792 62791680 52604928 43272704 37550080 31447552 28168704
$$ packed form
1514A4580224O01600j031680J334784m3520M66432n40672M74112O55360P92064
1505A7288704Q27392N55008O55360K52416J160192M54144J793024K37056O26176
1496B3849472Q13056K269184P57248J682944J1776K725888J218560M38784K198016
1487C5964928O53312K170880N74464N41696J099776K35008J30048J935872M14208
1478D3720192K035200L16416K276864P41376K036736K095616L201536J930240
1470E8354176K831872J721344L174400N063680L295232M343296O180352Q041984
1462I3006336O992896P389696O134272M707328m77696l942912o347264r964032
1454I7498624j0563072j1317760j2826112j0186752r332224n722624o102528l278848
$$ plain form
1446 28168704 25507840 22565888 21619200 20679168 18981888 17247232 16708608 16990720 15994368
1437 15994368 15518720 14334464 13945344 14345728 13534208 12725760 12656128 11097600 11756032
1428 11756032 11184128 11193344 10813440 10447360 10791936 10236416 10971136 10352640 8931840 9580544
1418 9580544 10097152 9650176 8941056 8129024 8324608 7893504 8060416 7633920 9475584
1409 9475584 7156736 7475200 6868992 7393280 7729152 6772736 7754752 7238144 6316032
1400 6316032 7310336 7395328 6202368 5854208 5232128 4815360 4674048 6723072 6006784
1391 6006784 5379072 5308416 5488640 6069760 5524480 5318656 6113792 5555712 5563904 5720064
1381 5720064 5073920 4753408 4742144 4602368 4345856 3960320 4898816 4813824 4006400 5504000
$$ packed form
1446B8168704k660864k941952r46688r40032j697280j734656n38624K82112r96352
1437A5994368m75648j184256l89120M00384q11520q08448o9632j558528O58432
1428A1756032n71904R216l79904l66080L44576n55520P34720o18496j420800O48704
1418I580544N16608m46976p09120q12032J95584m31104J66912m26496J841664
1409I475584k318848L18464o06208N24288L35872r56416R82016n16608r22112
1400F316032R94304Q4992j192960l48160o22080m16768j41312K049024p16288
1391F006784o27712p0656J80224N81120n45280k05824P95136n58080Q192J56160
1381E720064o46144l20512j1264j39776k56512l85536R38496q4992q07424J497600
$$ plain form
1371 5504000 4096512 3427840 4053504 5053952 5113856 4776960 4738048 4585984 4942336 4197376
1361 4197376 3965440 4322816 4270080 4616192 5294080 4016128 3484160 5706752 3702272
1352 3702272 5169152 5287936 4577280 5171200 5676032 4423168 3974656 4907008 5088256
1343 5088256 3913728 4655616 5725696 5027328 4843008 4682752 5559808 5577728 4559360
1334 4559360 4825600 5040640 6000640 6274560 6023680 5617152 5411840 7033344 6943232 7630336
1324 7630336 7021568 6877184 6426112 7476736 7009792 7067136 9278464 7489536 7705088
1315 7705088 8098304 8539136 8386048 9061888 10808832 10526720 12166656 13011456 14180864
1306 14180864 13051904 13989376 12567040 11389440 11210752 9772032 10721792 10086400 9955328
$$ packed form
1371E504000j407488o68672O25664J000448N9904l36896l8912j52064L56352p44960
1361D197376k31936L57376n2736L46112O77888j277952n31968K222592k004480
1352C702272J466880J18784p10656N93920N04832j252864m48512R32352J81248
1343E088256j174528P41888J070080o98368j84320j60256Q77056J7920j018368
1334D559360K66240K15040R60000K73920k50880m06528k05312J621504r0112O87104
1324G630336o08768j44384m51072J050624m66944N7344K211328j788928K15552
1315G705088L93216M40832j53088O75840J746944k82112J639936Q44800J169408
1306A4180864j128960R37472j422336j177600j78688j438720R49760o35392j31072
$$ plain form
1297 9955328 9701888 9827840 9219072 9985024 8827392 8640000 9871360 8804352 9224704
1288 9224704 9595904 9120256 8603648 9425920 9014272 9539072 9028608 9083392 9489920 9327104
1278 9327104 9665024 9543168 9714688 10847232 10385920 11508224 13147136 13498880 15320064
1269 15320064 14313472 14296576 14717952 14672896 15784448 13885440 13863424 11667968 10638336
1260 10638336 9522176 9482240 9333760 7507968 9334784 8651264 9314304 9164288 8159744
1251 8159744 8348672 8960000 8194048 7921152 9211392 8330240 9464832 10095104 10361856
1242 10361856 10208768 12501504 12540928 13247488 14059520 12663296 12569088 11795968 11729920 10910208
1232 10910208 9620480 9276416 9032704 8202752 7193088 8324096 7682048 6886912 6838784
$$ packed form
1297I955328k53440J25952o08768P65952j157632j87392J231360j067008M20352
1288I224704L71200m75648n16608Q22272m11648N24800n10464N4784M06528j62816
1278I327104L37920j21856J71520J132544m61312J122304J638912L51744J821184
1269A5320064j006592j6896M21376m5056J111552j899008k2016k195456j029632
1260A0638336j116160l9936j48480j825792J826816o83520O63040j50016j004544
1251H159744J88928O11328p65952k72896J290240q81152J134592O30272K66752
1242A0361856j53088K292736L9424P06560Q12032j396224r4208p73120o6048q19712
1232A0910208j289728l44064k43712q29952j009664J131008o42048p95136m8128
$$ plain form
1223 6838784 6417408 6162944 5951488 6193152 6909440 5308416 6435840 5923328 5650944
1214 5650944 5840896 5916672 5536256 5532160 5251584 4685312 5418496 4696064 5169152 4384256
1204 4384256 4523008 4118528 2777600 3910656 3227648 3393536 2704384 3187200 2869760
1195 2869760 2595840 3258368 4104704 3208704 3478528 2631168 2593280 3606016 2200576
1186 2200576 3582976 2228224 3254784 2444800 3560960 2689024 1921536 3559424 3127808
1177 3127808 2232320 3549696 2541568 2480640 3084800 2670080 2419200 1851904 1702400
1168 1702400 2592768 2395648 2745344 2249216 2165248 2665472 2301952 1820672 1473024 1320960
1158 1320960 1382400 1940992 1757696 1491968 538624 1693184 2021376 2382336 2313216 2636288
$$ packed form
1223F838784m21376k54464k11456K41664P16288j601024J127424n12512k72384
1214E650944J89952P5776l80416m096k80576n66272P33184p22432M73088p84896
1204D384256J38752m04480j340928J133056o83008J65888o89152M82816l17440
1195B869760k73920O62528Q46336q96000K69824q47360l7888J012736j405440
1186B200576J382400j354752J026560q09984J116160q71936p67488J637888m31616
1177C127808q95488J317376j008128o0928O04160m14720k50880n67296j49504
1168A702400Q90368j97120L49696m96128q3968N00224l63520m81280l47648j52064
1158A320960O1440N58592j83296k65728E38624J154560L28192L60960o9120L23072
$$ plain form
1148 2636288 440832 2281984 2252800 1771520 2294784 2270208 1573376 2190336 2735616 1876992
1138 1876992 2394112 247808 2464256 1589248 1729536 1322496 1752576 1807360 1303552 1596928
1128 1596928 1541120 1332224 1361920 730112 2149888 1048576 1878528 1445376 1325568 1987584
1118 1987584 1003520 1213952 2048512 1693696 1597440 1797120 1066496 830976 914432 1420288
1108 1420288 832512 1235968 1673216 1956864 1620992 1049088 2423296 2087424 2012160 2764288
1098 2764288 1435648 1780736 1351168 672256 1498624 2019840 2228736 1117696 1477120
1089 1477120 1610752 1532416 1827840 1302016 795136 1946112 1904640 1445376 860160 883712
1079 883712 1101824 2043904 1682944 1712128 2308096 1666560 1707008 1325568 980992 1963520
$$ packed form
1148B636288D40832J841152k9184m81280N23264k4576o96832O16960N45280q58624
1138A876992N17120B47808K216448q75008J40288m07040M30080N4784n03808K93376
1128A596928n5808k08896K9696o31808J419776A048576Q29952m33152j19808O62016
1118A987584r84064K10432Q34560l54816r6256J99680p30624k35520Q3456N05856
1108A420288n87776M03456M37248K83648l35872n71904J374208l35872p5264P52128
1098B764288j328640L45088m29568F72256Q26368N21216K08896j111040L59424
1089A477120J33632p8336K95424n25824n06880J150976m1472m59264n85216K3552
1079H83712K18112R42080l60960K9184N95968o41536M0448l81440l44576R82528
$$ plain form
1069 1963520 470016 1623552 1802240 1178624 678400 2068992 1956352 1231872 1743872
1060 1743872 1098752 2002944 862208 1227264 1143808 1145344 687616 1201664 750080 1604096
1050 1604096 656384 1386496 1756160 1102848 1318400 716288 1891328 854528 37888 2024960
1040 2024960 667136 2104320 496128 -200704 1247232 908288 -84480 442880 439296 1638400
1030 1638400 145920 1170432 1546752 1147904 336384 1045504 1532928 1936384 1053696
1021 1053696 1248256 -116736 337920 919552 1469952 1999872 642560 1230848 568832 1247232
1011 1247232 902144 1654784 1755648 1189376 1165312 1117696 538624 1593344 671744 1348096
1001 1348096 56832 186880 1131520 1802752 1553408 2179584 841216 1420800 964608 651264
$$ packed form
1069A963520D70016J153536J78688o23616n00224J390592j12640p24480N12000
1060A743872o45120R04192H62208L65056q3456J536m57728N14048m51584Q54016
1050A604096F56384P30112L69664o53312K15552o02112J175040H54528C7888J987072
1040B024960F67136J437184D96128b00704A247232l38944h4480D42880l584J199104
1030A638400A45920J024512L76320l98848C36384P09120M87424M03456q82688
1021A053696J94560a16736C37920N81632N50400N29920F42560N88288E68832O78400
1011A247232l45088P52640J00864n66272k4064m7616E38624J054720F71744O76352
1001A348096E6832J30048R44640O71232k49344O26176H41216N79584m56192l13344
$$ plain form
991 651264 2130432 1506816 1167872 430080 2897408 1333248 2235392 1860096 590336
981 1539072 1165824 1354752 1817600 804864 933376 311808 1212928 2364928 1574912 1654784
971 1654784 877056 1473536 1040384 665088 1450496 1098752 1515008 348672 859136 2095104
961 2095104 1046016 807936 1600000 2217984 1444352 849920 2329600 1836544 1783296 1540608
951 1540608 1920000 1673728 597504 1705472 1291776 -44032 401920 2093568 953344 632832
941 632832 -78848 736768 1421312 433664 458240 955392 670208 631296 749568 960000
931 960000 144384 1454592 1356288 879616 1010176 348160 -387584 747520 1088000 -51200
920 1528320 1022976 708096 799744 -418304 1324544 697344 -74752 546816 1188352 -176640
$$ packed form
991F51264J479168o23616l38944D30080K467328A333248R02144l75296E90336
981A539072l73248J88928M62848H04864J28512C11808R01120J152000p90016P9872
971A654784p77728N96480m33152l75296P85408l51744M16256C48672N10464J235968
961B095104A046016k38080P92064O17984p73632n94432J479680m93056n3248k42688
951A540608L79392k46272E97504J107968m13696d4032D01920J691648I53344l20512
941F32832g8848G36768O84544D33664K4576M97152k85184l8912J18272K10432
931I60000A44384J310208r8304m76672J30560C48160c87584G47520L40480e1200
920A528320n05344l14880R1648d18304A324544o27200g4752E46816O41536a76640
$$ plain form
909 968704 1039360 -474112 534528 1256448 436224 2223104 531968 1687040 463360 650752
899 650752 246272 1192448 879616 290304 668672 1124864 1252352 851456 104448 913408
889 913408 185344 501248 606720 76800 464896 -185344 1118208 1501184 1236992 209408
878 873984 920064 -163328 568320 1350656 157184 236544 657920 1271296 1034240 289280
867 1214976 1648128 446976 1776640 118784 1755648 1709056 578560 291840 2095104
858 2095104 299008 1065472 1422336 1846784 1358848 1205760 1135616 1569280 1141760 2378752
848 2378752 1337344 2084864 2384896 1641472 3188224 3397120 4210688 4543488 4216832
839 4216832 4189184 4241920 4666880 5026816 5657088 4982784 6369280 6050304 7077376 8733696
$$ packed form
909I68704P0656d74112E34528P21920D36224J786880E31968J155072D63360J87392
899F50752B46272R46176l12832B90304L78368M56192J27488m00896A04448Q08960
889I13408A85344L15904J05472G6800L88096a85344A118208L82976k64192B09408
878H73984M6080a63328E68320P82336A57184P9360M21376O13376k37056B89280
867A214976M33152D46976J329664A18784J636864m6592E78560k86720J803264
858B095104B99008P66464L56864M24448m87936j53088p0144M33664m27520J236992
848B378752j041408P47520L00032p43424J546752K08896Q13568L32800l26656
839D216832k7648N2736M24960L59936O30272o74304J386496l18976J027072J656320
$$ plain form
829 8733696 9634816 10583552 14239744 20965376 39653888 56863232 59432960 62228992
821 62228992 18088960 9331200 5872128 4766208 3758080 3154944 2698752 2121728 2474496
812 2474496 2708992 1449472 3002368 2792448 1590272 2467840 2920448 2754560 3176960
803 3176960 1548288 1681408 1382912 1827840 58368 2276864 1220096 1473536 -112640
793 1441280 1965056 1260032 1412608 1182208 481280 1325056 1844224 120320 577536 1168896
783 1168896 812032 1250816 849920 2590208 1196544 331264 683008 1570816 584704
773 2094592 -104448 1369600 756736 420352 -537600 82432 351232 409600 1417728 391680
762 1104384 611840 645632 593408 799744 448512 586752 999936 511488 -645120 677376
$$ packed form
829H733696R01120R48736L656192O725632J8688512J7209344K569728K796032
821F2228992A8088960q757760l459072j105920j008128o03136m56192n77024L52768
812B474496K34496j259520J552896k09920j202176Q77568M52608j65888M22400
803C176960A548288J33120k98496M44928E8368K218496j056768K53440a12640
793A441280N23776p05024J52576k30400D81280Q43776N19168A20320M57216N91360
783A168896l56864M38784m00896J740288A196544C31264L51744Q87808E84704
773B094592a04448A369600o12864l36384e37600H2432K68800N8368J008128C91680
762A104384m92544L3792n2224K06336l51232J38240M13184m88448f45120F77376
$$ plain form
751 397312 134144 426496 -55296 -269824 289792 671232 571904 348160 779776 68608
740 483328 239104 41984 762368 1423872 -404480 1066496 198144 1170432 475136 1479680
730 1479680 677888 183296 444416 -622080 594944 237568 1128960 504832 698880 1164288
720 1164288 136704 838656 1323008 1278464 632320 1597952 899584 46080 1335808 137216
709 -385536 1194496 346112 633856 528896 1224704 387072 1303552 204800 1138176 403968
698 -942080 991232 -280576 584704 -65024 372224 756224 -954368 341504 841728 871936
688 871936 -188928 1571328 723968 583168 275456 1027584 1364480 36352 109568 1020928
678 1020928 808960 797696 327680 1575936 577024 -371200 -146944 -188928 51200 895488
$$ packed form
751C97312A34144K92352e5296k14528B89792L81440r9328k23744M31616F8608
740D83328B39104D1984P20384O61504d04480A066496A98144R72288D75136J004544
730A479680F77888A83296K61120f22080E94944B37568Q91392E04832J94048M65408
720A164288A36704P01952M84352m4544F32320R65632o98368D6080J289728A37216
709c85536A194496C46112K87744j04960O95808C87072R16480B04800R33376D03968
698i42080I91232b80576E84704f5024C72224L84000i54368C41504N00224L0208
688H71936a88928A571328G23968j40800B75456P52128L36896C6352P3216R11360
678A020928k11968j1264C27680J248256E77024c71200a46944m1984E1200Q44288
$$ plain form
668 895488 144896 -776704 -100864 -1029120 850432 -78336 1895424 743424 264192 574464
658 574464 811008 249344 753664 965120 640000 810496 19968 629248 -239616 611840
647 -28672 53248 1227264 351744 -970752 634880 -528896 981504 -427520 702976 765952
637 765952 955392 -332288 -174592 194560 72704 -83968 1220096 613376 264192 -499712
626 1805312 574464 -128000 782336 1232384 98816 -160768 -253952 -78848 599040 -224768
615 258560 776704 -740864 1465344 997376 660992 555520 315392 -808960 325632 636416
605 636416 281600 45568 -1082880 -188928 -701440 1222656 -105984 503296 1082880 435712
594 565760 1152000 459776 446976 1492992 42496 686592 289280 512 525824 964096 619008
$$ packed form
668H95488A44896g76704a00864r28256H50432g8336A895424G43424B64192L10272
658E74464K36544B49344N04320K11456l25120J70496A9968O09280b39616F11840
647b8672E3248J174016C51744i70752F34880e28896I81504d27520G02976O2976
637G65952J89440c32288J57696A94560G2704h3968A220096o06720B64192d99712
626A805312E74464a28000G82336M50048I8816a60768r3184g8848E99040b24768
615B58560N18144g40864A465344m67968l36384j05472k40128h08960C25632L10784
605F36416B81600D5568a082880a88928n12512A222656a05984E03296N79584D35712
594E65760N86240D59776j2800J046016D2496O44096B89280E12N25312M38272l45088
$$ plain form
583 619008 1100800 1284096 1393152 445952 701952 184832 1859584 966656 1093632 615424
573 615424 1536512 340480 991232 -81920 308736 656896 924160 585216 -61952 1204224
562 1159168 232448 335872 711168 806912 -3584 376320 599040 226304 598528 239616
551 429568 -268288 1152000 -376320 721408 62976 702976 -519680 446976 1436672 572928
540 624640 1097728 744960 -635904 846336 364032 936448 14336 813568 1110528 -150528
529 439296 -136192 -398848 144384 3584 306688 -17920 -4608 377856 1690624 536064 479232
518 479232 977408 58368 94720 -1002496 927744 1050112 655360 -94208 208896 734208
508 734208 -275456 837120 1086976 884224 653824 251904 826880 1313280 1172480 -551424
$$ packed form
583F19008M81792J83296J09056D45952K56000A84832J674752q92928J26976m78208
573F15424R21088C40480O50752h1920C08736L48160K67264l38944f1952A204224
562A159168B32448J03424L75296R5744c584C76320K22720B26304L72224B39616
551D29568b68288A152000c76320G21408F2976O40000e19680D46976R89696E72928
540F24640M73088l52768f35904H46336C64032N72416A4336P99232K96960a50528
529D39296a36192k62656A44384C584L03104a7920d608C77856J312768E36064n6832
518D79232M98176E8368L6352a002496I27744J22368l94752i4208B08896N25312
508G34208b75456H37120K49856k02752k30400B51904N74976M86400j40800e51424
$$ plain form
497 1033728 3072 241664 702976 1426432 816128 -350720 211456 1593856 0 800256 612352
486 612352 353792 -80896 464384 -454144 248832 424448 678400 968704 637440 547328
476 547328 809472 9728 1210880 69632 -609792 125440 164864 -71680 1521152 349184
465 255488 1161216 -534528 711680 180224 374272 421376 -816640 1497088 -523264 127488
454 992768 467968 104448 -22528 486400 771584 -632832 465408 -183296 394240 1411072
444 1411072 151040 306176 943616 2016256 620544 1670144 -418816 121856 500224
435 500224 235008 464384 811520 1356288 677888 840704 181760 692736 431104 244224
425 244224 489984 -5120 571904 433152 322048 -24576 399872 740864 -109568 -599552
$$ packed form
497A033728C072K38592M61312P23456o10304c50720B11456J382400@H00256j87904
486F12352k58560h0896D64384d54144B48832J75616K53952K90304l31264r0112
476E47328K62144I728J201152F9632f09792A25440L9424g1680A521152C49184
465B55488R05728e34528G11680A80224J94048M7104h16640A497088e23264A27488
454I92768D67968A04448b2528D86400K85184f32832D65408a83296C94240J016832
444A411072A51040J55136O37440J072640F20544J049600d18816A21856L78368
435E00224B35008K29376L47136N44768F77888J62816A81760N10976k61632j86880
425B44224K45760e120E71904j38752j11104b4576C99872L40992a09568m89984
$$ plain form
415 -599552 597504 -632320 256512 535040 131584 195072 1625600 996864 46080 -434688
404 -355840 709632 141312 848896 244736 325120 -189440 452096 1731584 735744 -77312
393 -121856 346624 -307712 751616 632320 279040 615424 -84480 -381440 51200 -534528
382 128000 358400 -81920 307712 450048 -7680 -581632 811008 284160 921088 538112
372 538112 773632 -271360 416256 495616 496128 394240 663040 1066496 -129024 637440 1270784
361 1270784 -351744 1094144 -257024 410624 668672 561152 1380352 36864 -254464 885248
350 221184 19968 693760 428544 1132544 767488 128512 542720 399872 2560 289280
340 289280 45056 -180224 290304 693760 171008 429056 120320 -181248 609280 -1081856
$$ packed form
415e99552E97504f32320B56512K78528A31584O3488J430528o28736D6080d34688
404c55840G09632A41312P07584B44736Q0384a89440D52096J279488G35744g7312
393a21856C46624c07712G51616j19296B79040L36384h4480k96960E1200e34528
382A28000K30400h1920C07712J42336g680n73952H11008B84160O36928l82976
372E38112K35520b71360D16256P9360N12j01888K68800M03456a29024F37440O33344
361A270784c51744A094144b57024D10624K58048j07520Q19200C6864b54464H85248
350B21184A9968O73792k65216P04000l65056A28512M14208j42848B560K86720
340B89280D5056a80224B90304M03456A71008K58048A20320a81248F09280a081856
$$ plain form
329 -269312 28160 796160 -209408 730624 843264 387584 -49664 404992 74752 -225280
318 348672 744960 -17920 376832 805888 1514496 521216 894976 1051648 741376 138240
307 899072 -383488 153600 -389120 -208384 504320 136192 163328 827392 -379392 167424
296 893440 149504 695808 926208 245248 -384000 554496 -26112 -23552 -225280 724480
285 -98816 368128 829952 -627200 325120 1081856 126464 558592 -144896 516608 200192
274 960000 -375808 223744 812032 -15872 753664 1013248 589824 -418816 118272 272384
264 272384 1297408 583168 583168 394752 1055232 2046464 -89600 -1249792 346624 305152 -307200
252 548864 101888 -666112 249856 483840 367616 717312 -2048 1050624 -502272 578048
$$ packed form
329b69312B8160P68000b09408G30624J12640C87584d9664D04992G4752b25280
318C48672L96288a7920C76832M29056P08608E21216L73760J56672l10272A38240
307H99072c83488A53600c89120J80736E04320A36192K7136O64064c79392A67424
296H93440A49504N46304K30400B45248c84000E54496b6112K560k01728G24480
285i8816C68128M61824f27200C25120P56736A26464M32128a44896E16608B00192
274I60000c75808B23744N88288a5872G53664K59584m23424d18816A18272J54112
264B72384J025024E83168%j88416O60480R91232h9600j160192C46624m1472c07200
252E48864A01888f66112B49856K33984j16224L49696b048A050624e02272E78048
$$ plain form
241 -359936 504320 654848 442368 -77824 -644096 -149504 -564736 -441856 251904 -67072
230 -256000 -195584 -107008 413696 -242688 726016 378368 1240064 374784 -505344 561152
219 650240 -10752 -41984 589312 808448 1092096 -767488 -561664 -549376 331264 838144
209 838144 727040 2048 1084416 -769536 228864 700416 -210944 -329728 -264192 1162752
198 -225792 587776 -396800 -765440 224256 -861696 -66048 1049088 687616 386048 870912
188 870912 -4096 417280 817664 253952 656384 687104 -925696 -248320 278016 1061376
178 1061376 783872 282624 475648 779776 399360 -354304 759296 75264 -51200 -104448
168 -104448 -990720 951296 1055232 -291328 -220160 -190976 186880 693248 -110592 808960
$$ packed form
241c59936E04320J50528k12480g7824n66272a49504m15232J22880B51904f7072
230b56000O0416Q8576D13696b42688G26016l47648Q61696C74784e05344E61152
219F50240a0752l1232E89312K19136K83648g67488K05824J2288C31264N06880
209H38144j11104B048J082368g69536B28864M71552b10944j18784O5536A162752
198b25792E87776c96800l68640B24256h61696f6048A049088l61472l01568M84864
188H70912d096D17280M00384B53952M02432L0720i25696b48320B78016P83360
178A061376k77504B82624J93024L04128l80416c54304G59296G5264e1200n3248
168a04448q86272I51296J03936b91328P1168K9184A86880N06368a10592H08960
$$ plain form
157 106496 58368 522752 -266240 874496 861184 -458240 -727040 219648 344576 100352
146 -228864 1279488 597504 671232 290816 -445952 -93184 194048 214016 794112 682496
136 682496 354816 -1276416 912896 -261632 -685568 720384 638464 -121856 -988160 817664
125 -430592 -170496 -281088 -637440 673792 -815104 591360 -89088 -452096 1279488 -12288
114 440320 -201728 549376 -805376 35840 -580608 139264 257024 1509376 1030656 408064
103 463360 538624 535040 159744 329216 728576 -450048 253440 411648 1314816 178176
92 -390656 851968 623616 407552 -49664 -901120 -260608 210944 345088 85504 350720
82 350720 423936 -999936 200704 96256 37888 124416 269312 711680 862208 721920 220160
$$ packed form
157A06496m8128M64384b66240H74496j3312d58240k68800B19648J24928A00352
146b28864A279488E97504P3728B90816d45952i3184A94048J9968N80096j11616
136F82496l27680a276416I12896b61632m23936G20384q1920a21856q66304H17664
125d30592a70496j10592l56352F73792h15104E91360h9088l63008A279488a2288
114D40320b01728E49376h05376C5840e80608A39264J17760J252352m78720D08064
103D63360P5264l584A59744J69472L99360d50048B53440J58208R03168A78176
92c90656H51968k28352k16064d9664q51456b60608B10944J34144H5504K65216
82C50720P3216i99936B00704I6256C7888Q6528J44896M42368J50528j40288B20160
$$ plain form
70 516608 1042432 -216576 589824 -499712 656384 396288 569856 56320 11776 559616
60 559616 -512 556032 108032 390144 56832 248832 640512 973312 340480 -289792 743424
48 321024 -190464 -366592 1428992 -242176 -52224 -284672 1338368 -964608 -311808 208384
37 564224 287744 157184 -803328 343040 62976 -666624 -824832 25088 340480 328192 172544
26 172544 15360 839168 -712704 915456 1179136 293888 382464 230400 -556032 880640
15 -582656 -644608 -436224 102400 -777216 566784 1178112 -580096 926720 -634368 130048
4 -1129472 71168 225792 1113600 452096
$$ packed form
70E16608N25824b16576E89824d99712F56384k60096J73568E6320A1776N47840
60E59616e12E56032A08032K82112E6832J92000L91680L32800C40480b89792G43424
48C21024a90464j76128A428992b42176e2224k32448A338368i64608c11808B08384
37E64224k76480j30560h03328C43040F2976f66624j58208B5088L15392j2288j55648
26A72544A5360Q23808g12704I15456K63680B93888Q8576j52064e56032H80640
15e82656o1952K08384A02400g77216E66784O11328e80096I26720f34368A30048
4a129472G1168J54624Q87808D52096
##END=
