##TITLE=1310
##JCAMPDX= 6.0         $$ Bruker NMR JCAMP-DX V2.0
##DATA TYPE= NMR SPECTRUM
##DATA CLASS= XYDATA
##ORIGIN= NUTS EXPORT
##OWNER= Administrator
$$ 1.72 TOPSPIN		Version 2.1
$$ 2016-02-23 12:18:57.246 -0800  Administrator@X
$$ Compression mode = diff/dup
##.OBSERVE FREQUENCY= 90.275459
##.ACQUISITION MODE= SIMULTANEOUS (DQD)
##.ACQUISITION SCHEME= undefined
##.AVERAGES= 16
##.DIGITISER RES= 22
##SPECTROMETER/DATA SYSTEM= 
##.PULSE SEQUENCE= zg30
##.SOLVENT NAME= None
##.SHIFT REFERENCE= INTERNAL, None, 1, 14.34461
##AUDIT TRAIL= $$ (NUMBER, WHEN, WHO, WHERE, PROCESS, VERSION, WHAT)
$$ ##TITLE= Audit trail, TOPSPIN		Version 2.1
$$ ##JCAMPDX= 5.01
$$ ##ORIGIN= Bruker BioSpin GmbH
$$ ##OWNER= Administrator
$$ $$ E:/data/jwist/nmr/1310/1/pdata/1/auditp.txt
$$ ##AUDIT TRAIL=  $$ (NUMBER, WHEN, WHO, WHERE, PROCESS, VERSION, WHAT)
(   1,<2016-02-23 08:37:08.777 -0800>,<Administrator>,<X>,<jcamp>,<TOPSPIN 2.1>,
      <fromjdx created from
       E:\data\jwist\nmr\uniandes\1310
       data hash MD5: 8K
       8A 22 D7 54 94 AF 98 B8 7E F7 A8 09 11 31 8B 9A>)
$$ ##END=
$$ 
$$ $$ hash MD5
$$ $$ AB 88 C4 E7 81 F3 2A B7 1A F8 AF BE 54 FF 2E 82
##$RELAX= 
$$ Bruker specific parameters
$$ --------------------------
##$DU= <E:>
##$EXPNO= 1
##$NAME= <1310>
##$PROCNO= 1
##$TYPE= <nmr>
##$USER= <jwist>
##$ACQT0= 0
##$AMP= (0..31)
100 100 100 100 100 100 100 100 100 100 100 100 100 100 100 100 100 100
100 100 100 100 100 100 100 100 100 100 100 100 100 100
##$ANAVPT= 1
##$AQSEQ= 0
##$AQ_mod= 3
##$AUNM= <au_zg>
##$AUTOPOS= <>
##$BF1= 90.275459
##$BF2= 400.02
##$BF3= 400.02
##$BF4= 400.02
##$BF5= 400.02
##$BF6= 400.02
##$BF7= 400.02
##$BF8= 400.02
##$BYTORDA= 0
##$CFDGTYP= 0
##$CFRGTYP= 0
##$CHEMSTR= <none>
##$CNST= (0..63)
1 1 145 1 1 1 1 1 1 1 1 1 1 1 1 1 1 1 1 1 1 1 1 1 1 1 1 1 1 1 1 1 1 1 1
1 1 1 1 1 1 1 1 1 1 1 1 1 1 1 1 1 1 1 1 1 1 1 1 1 1 1 1 1
##$CPDPRG= <>
##$CPDPRG1= <>
##$CPDPRG2= <>
##$CPDPRG3= <>
##$CPDPRG4= <mlev>
##$CPDPRG5= <mlev>
##$CPDPRG6= <mlev>
##$CPDPRG7= <mlev>
##$CPDPRG8= <mlev>
##$CPDPRGB= <>
##$CPDPRGT= <>
##$D= (0..63)
0 1 0 0 0 0 0 0 0 0 0 0 0 0 0 0 0 0 0 0 0 0 0 0 0 0 0 0 0 0 0 0 0 0 0 0
0 0 0 0 0 0 0 0 0 0 0 0 0 0 0 0 0 0 0 0 0 0 0 0 0 0 0 0
##$DATE= 0
##$DBL= (0..7)
120 120 120 120 120 120 120 120
##$DBP= (0..7)
150 150 150 150 150 150 150 150
##$DBP07= 0
##$DBPNAM0= <>
##$DBPNAM1= <>
##$DBPNAM2= <>
##$DBPNAM3= <>
##$DBPNAM4= <>
##$DBPNAM5= <>
##$DBPNAM6= <>
##$DBPNAM7= <>
##$DBPOAL= (0..7)
0.5 0.5 0.5 0.5 0.5 0.5 0.5 0.5
##$DBPOFFS= (0..7)
0 0 0 0 0 0 0 0
##$DE= 6.5
##$DECBNUC= <off>
##$DECIM= 2432
##$DECNUC= <off>
##$DECSTAT= 4
##$DIGMOD= 1
##$DIGTYP= 12
##$DL= (0..7)
0 120 120 120 120 120 120 120
##$DP= (0..7)
150 150 150 150 150 150 150 150
##$DP07= 0
##$DPNAME0= <>
##$DPNAME1= <>
##$DPNAME2= <>
##$DPNAME3= <>
##$DPNAME4= <>
##$DPNAME5= <>
##$DPNAME6= <>
##$DPNAME7= <>
##$DPOAL= (0..7)
0.5 0.5 0.5 0.5 0.5 0.5 0.5 0.5
##$DPOFFS= (0..7)
0 0 0 0 0 0 0 0
##$DQDMODE= 0
##$DR= 22
##$DS= 2
##$DSLIST= <SSSSSSSSSSSSSSS>
$$ [...]
##$SPOFFS= (0..31)
0 0 0 0 0 0 0 0 0 0 0 0 0 0 0 0 0 0 0 0 0 0 0 0 0 0 0 0 0 0 0 0
##$SUBNAM0= <"">
##$SUBNAM1= <"">
##$SUBNAM2= <"">
##$SUBNAM3= <"">
##$SUBNAM4= <"">
##$SUBNAM5= <"">
##$SUBNAM6= <"">
##$SUBNAM7= <"">
##$SUBNAM8= <"">
##$SUBNAM9= <"">
##$SW= 20.5580556627758
##$SWIBOX= (0..15)
0 0 3 4 0 0 0 0 0 0 0 0 0 0 0 0
##$SW_h= 8223.68421052631
##$SWfinal= 0
##$TD= 65536
##$TD0= 1
##$TE= 300
##$TE2= 300
##$TE3= 300
##$TEG= 300
##$TL= (0..7)
0 120 120 120 120 120 120 120
##$TP= (0..7)
150 150 150 150 150 150 150 150
##$TP07= 0
##$TPNAME0= <>
##$TPNAME1= <>
##$TPNAME2= <>
##$TPNAME3= <>
##$TPNAME4= <>
##$TPNAME5= <>
##$TPNAME6= <>
##$TPNAME7= <>
##$TPOAL= (0..7)
0.5 0.5 0.5 0.5 0.5 0.5 0.5 0.5
##$TPOFFS= (0..7)
0 0 0 0 0 0 0 0
##$TUNHIN= 0
##$TUNHOUT= 0
##$TUNXOUT= 0
##$USERA1= <user>
##$USERA2= <user>
##$USERA3= <user>
##$USERA4= <user>
##$USERA5= <user>
##$V9= 5
##$VALIST= <valist>
##$VCLIST= <CCCCCCCCCCCCCCC>
##$VD= 0
##$VDLIST= <DDDDDDDDDDDDDDD>
##$VPLIST= <PPPPPPPPPPPPPPP>
##$VTLIST= <TTTTTTTTTTTTTTT>
##$WBST= 1024
##$WBSW= 4
##$XGAIN= (0..3)
0 0 0 0
##$XL= 0
##$YL= 0
##$YMAX_a= 1533161600
##$YMIN_a= -1655365.632
##$ZGOPTNS= <>
##$ZL1= 120
##$ZL2= 120
##$ZL3= 120
##$ZL4= 120
##$ABSF1= 10
##$ABSF2= 0
##$ABSG= 5
##$ABSL= 3
##$ALPHA= 0
##$AQORDER= 0
##$ASSFAC= 0
##$ASSFACI= 0
##$ASSFACX= 0
##$ASSWID= 0
##$AUNMP= <proc_1d>
##$AXLEFT= 0
##$AXNAME= <>
##$AXNUC= <off>
##$AXRIGHT= 0
##$AXTYPE= 0
##$AXUNIT= <>
##$AZFE= 0.1
##$AZFW= 0.1
##$BCFW= 1
##$BC_mod= 2
##$BYTORDP= 0
##$COROFFS= 0
##$CY= 15
##$DATMOD= 1
##$DC= 2
##$DFILT= <>
##$DTYPP= 0
##$F1P= 0
##$F2P= 0
##$FCOR= 0.5
##$FTSIZE= 0
##$FT_mod= 4
##$GAMMA= 1
##$GB= 0
##$INTBC= 1
##$INTSCL= 1
##$ISEN= 128
##$LB= 0.3
##$LEV0= 0
##$LPBIN= 0
##$MAXI= 10000
##$MC2= 0
##$MEAN= 0
##$ME_mod= 0
##$MI= 0
##$NCOEF= 0
##$NC_proc= -9
##$NLEV= 6
##$NOISF1= 0
##$NOISF2= 0
##$NSP= 1
##$NTH_PI= 0
##$NZP= 0
##$OFFSET= 14.34461
##$PC= 1
##$PHC0= 0
##$PHC1= 0
##$PH_mod= 0
##$PKNL= yes
##$PPARMOD= 0
##$PPDIAG= 0
##$PPIPTYP= 0
##$PPMPNUM= 2147483647
##$PPRESOL= 1
##$PSCAL= 4
##$PSIGN= 0
##$PYNMP= <proc.py>
##$REVERSE= no
##$SF= 90.2741640525625
##$SI= 8192
##$SIGF1= 0
##$SIGF2= 0
##$SINO= 400
##$SIOLD= 32768
##$SPECTYP= <>
##$SREGLST= <1H.CDCl3>
##$SSB= 0
##$STSI= 0
##$STSR= 0
##$SW_p= 1497.18866228788
##$SYMM= 0
##$S_DEV= 0
##$TDeff= 0
##$TDoff= 0
##$TI= <>
##$TILT= no
##$TM1= 0
##$TM2= 0
##$TOPLEV= 0
##$USERP1= <user>
##$USERP2= <user>
##$USERP3= <user>
##$USERP4= <user>
##$USERP5= <user>
##$WDW= 1
##$XDIM= 8192
##$YMAX_p= 1533161472
##$YMIN_p= -1655296
##$CURPLOT= <PDFCreator>
##$CURPRIN= <$PDFCreator>
##$DFORMAT= <normdp>
##$LAYOUT= <+/1D_H.xwp>
##$LFORMAT= <normlp>
##$PFORMAT= <normpl>
##$SURQMSG= 1
$$ End of Bruker specific parameters
$$ ---------------------------------
##XUNITS= HZ
##YUNITS= ARBITRARY UNITS
##XFACTOR= 0.182762287876938
##YFACTOR= 1
##DELTAX= -0.182762287876938
##NPOINTS= 8192
##FIRSTX= 1497.0059
##FIRSTY= -440832
##LASTX= 0
##MAXY= 1533161472
##MINY= -1655296
##XYDATA= (X++(Y..Y))
8191d40832H45824a420800E34016d4032D93056Q6528c5328H28416B96960K54976
$$ -440832 845824 -1420800 534016 -44032 493056 579584 -35328 828416 296960 551936
8181E51936a09568D608a111040e06368M7104A152000a45408l88608f7072G02464
$$ 551936 -109568 4608 -1111040 -506368 -459264 1152000 -145408 -534016 -67072 702464
8170G54176m7104e08928c4816E07392B43200b83136k37056l6352b41664I29280
$$ 754176 707072 -508928 -34816 507392 243200 -283136 -520192 -556544 -241664 929280
8159g37280F53312A90464d7616k66240F33856k11456a032704B07872O62016m19328
$$ -737280 653312 190464 -47616 -313856 633856 422400 -1032704 207872 869888 450560
8149D50560a73056c3280D67456a73568k41152j35168K71360k88256B54976f4512
$$ 450560 -173056 -33280 467456 -173568 -414720 -549888 -278528 -566784 254976 -64512
8138d50048i216l58400m23936B84672o0416e63200K10432B91328d83328a53600
$$ -450048 -9216 -367616 -791552 284672 224256 -563200 -352768 291328 -483328 -153600
8127e94432E98528e55520J22880J99168H05888a43360A67424k2016c03104A68960
$$ -594432 598528 -555520 -432640 -233472 805888 -143360 167424 145408 -303104 168960
8116a31584B39616a16736B71872O97344c82464k49856a52576f6560j28512k65216
$$ -131584 239616 -116736 271872 969216 -382464 -632320 -152576 -66560 -195072 -460288
8106d60288h4992C10272h29952E64224m5568g9360m07040E01760e2224k25792
$$ -460288 -84992 310272 -829952 564224 518656 -79360 -486400 501760 -52224 -278016
8096b78016H15104g08608C59936d60288E30944f48192i3696K4576A1776a85856
$$ -278016 815104 -708608 359936 -460288 530944 -648192 -93696 -69120 11776 -185856
8085G85408a24416r04192G98720A13664g88992c01056j08544A04448f54848E75488
$$ 785408 -124416 -1028608 798720 113664 -788992 -301056 -409600 104448 -654848 575488
8074A74080a65888K4064c4816E12M9152j1264A0752e27360C04128J49504d70016
$$ 174080 -165888 -141824 -34816 512 49664 38400 10752 -527360 304128 453632 -470016
8062A44384o3488b97984h3456C61984n3760L65568f01600G56736A32096J11104
$$ 144384 80896 -297984 -83456 361984 308224 673792 -601600 756736 132096 243200
8052B43200e46304J60768E63200d18816F12352A19808a35168k30400n48352d49024
$$ 243200 -546304 -385536 563200 -418816 612352 119808 -135168 -365568 -913920 -449024
8041a80224o44096B19648a39776m57216A05984g7824L6352F03648g36768a68448
$$ -180224 -824320 219648 -139776 -596992 105984 -77824 -41472 603648 -736768 -168448
8030A266688a152512H62208l95264i00608c31776R1648C4304M01920e56544P9360
$$ 1266688 -1152512 862208 466944 -900608 -331776 -240128 34304 436224 -556544 -477184
8020d77184k69824D37760B4576J77664n8880a247232M16768D33664c7376D36224
$$ -477184 -747008 437760 24576 202240 143360 -1247232 -830464 433664 -37376 436224
8009h35584a72544q44800d0960j120768F25152e94432A297920E36064k11456B7648
$$ -835584 -172544 -1017344 -40960 -1161728 625152 -594432 1297920 536064 324608 27648
7998a22880k51904A176064A85344M34688A15200L17440J74080H1408a94048G80800
$$ -122880 -374784 1176064 185344 620032 115200 432640 606720 81408 -194048 780800
7987e40160D41344O7072d80768C33824j32096e88800C0208a55648k65216C14368
$$ -540160 441344 508416 -480768 333824 201728 -588800 30208 -155648 -420864 314368
7976I9840j5872a81248H90368A24416a18784G94112d23936p73632c4304E16096
$$ 99840 83968 -181248 890368 124416 -118784 794112 -423936 -1197568 -34304 516096
7965e83680B67264g36256i9840A07520b30912H66816k53440c00032l45600E9392
$$ -583680 267264 -736256 -99840 107520 -230912 866816 613376 -300032 -645632 59392
7954e52448m85376G680M83328O30784n40160B76992a174528E32992d41344A38240
$$ -552448 -1037824 7680 491008 1121792 581632 276992 -1174528 532992 -441344 138240
7943h16128J85856F14400J35680b3040D84352c8912C91680j94560c5840F6048
$$ -816128 -630272 614400 750080 -23040 484352 -38912 391680 197120 -35840 66048
7932D89984L63520c78880L0208k94912B06336d7616m53120A91488e43232F78912
$$ 489984 853504 -378880 -348672 -643584 206336 -47616 -500736 191488 -543232 678912
7921e52448E45792f01088b38592A81248J97120c32800j3824D51584H9600b02240
$$ -552448 545792 -601088 -238592 181248 378368 -332800 -346624 451584 89600 -202240
7910a73056C20000d7104k59072F54848c45600E68832A17248a90976f2464F00064
$$ -173056 320000 -47104 -306176 654848 -345600 568832 117248 -190976 -62464 600064
7899B56000b50368o43584F50240B67264h85248K01728A8432K17088J57184a655296
$$ 256000 -250368 -893952 650240 267264 -885248 -683520 18432 235520 392704 -1655296
7888a73568j66400H2432J2800c30752B19648M36736l1232A63840K80576h20224
$$ -173568 -339968 82432 95232 -330752 219648 656384 625152 163840 444416 -820224
7877H51968q0384c63008A6896J30560a113600D08576e01248C25120c4816j333760
$$ 851968 771584 -363008 16896 147456 -1113600 408576 -501248 325120 -34816 -1368576
7867a368576I8816J51552d0448j077760a3312F17984J91488C73760p5776m3520
$$ -1368576 98816 250368 -40448 -1118208 -13312 617984 809472 373760 297984 254464
7857B54464a84832n48864C70688j65888b84160D72064d7104q5504l89632K06848
$$ 254464 -184832 -733696 370688 204800 -284160 472064 -47104 -132608 -522240 -315392
7847c15392o97344b83136a4336o92736H2432e70368m09088d1984j48480B32960
$$ -315392 -1012736 -283136 -14336 -707072 82432 -570368 -979456 -41984 -190464 232960
7836a53088M1984A41312L02592J29024d15744a61280k74432a1264k59072A86880
$$ -153088 -111104 141312 443904 572928 -415744 -161280 -435712 -11264 -270336 186880
7825E94432J01376b1504l57376B35008P88480C08736a53088C34848a0752D13696
$$ 594432 695808 -21504 -378880 235008 1023488 308736 -153088 334848 -10752 413696
7814a355264A163776a13152k3040A89440e03808d8128H8064a89440B85184b68800
$$ -1355264 1163776 -113152 -136192 189440 -503808 -48128 88064 -189440 285184 -268800
7803g16288A45408j3824b58560j133568C65568e12000H6016R19040m22912k03264
$$ -716288 145408 131584 -258560 -1392128 365568 -512000 86016 1005056 582144 378880
7793C78880L43040C59424g49568F10816G1680b31936D59264b07360k04288j85344
$$ 378880 721920 359424 -749568 610816 71680 -231936 459264 -207360 -411648 -596992
7783e96992B54976J52064j84832b09408F42048b42688F51264k23232I3696b5600
$$ -596992 254976 407040 222208 -209408 642048 -242688 651264 428032 93696 -25600
7772C9936d77696D09600a312256b63680k5600o50752A38240E6320f33344b49856
$$ 39936 -477696 409600 -1312256 -263680 -289280 -940032 138240 56320 -633344 -249856
7761g74656J30048F5024f08768I40544h66304a07008n61664A26976j6384a14176
$$ -774656 -644608 65024 -608768 940544 -866304 -107008 -668672 126976 110592 -114176
7750B048d79744j16224b90304k46784E38112B20160M45440e1712j6384A42336
$$ 2048 -479744 -595968 -290304 -537088 538112 220160 665600 -51712 -68096 142336
7739F7072N86752j7408b59584b4064A292288d10112B88768j01376h38656E96480
$$ 67072 653824 636416 -259584 -24064 1292288 -410112 288768 187392 -838656 596480
7728A48992a69984B27840B3040a70496B84672A37728N9392c74784C23584K65728
$$ 148992 -169984 227840 23040 -170496 284672 137728 197120 -374784 323584 589312
7718E89312j43872e8368l45088j08032A49504h11520C06688F5536J26464h70400
$$ 589312 445440 -58368 -403456 -511488 149504 -811520 306688 65536 192000 -870400
7707b21696A94560e72928A59232h58112C57888O00576b36544C31776b0992j409536
$$ -221696 194560 -572928 159232 -858112 357888 958464 -236544 331776 -20992 -1430528
7697a430528C80416a86880j0240j40288D37248L56864F0928J149952A76128a73056
$$ -1430528 380416 -186880 -197120 -337408 437248 794112 60928 1210880 176128 -173056
7686F18496B31936L04640A2800h2944l10784J9968E26848c15904I09312F5024
$$ 618496 231936 536576 12800 -82944 -393728 -373760 526848 -315904 909312 65024
7675g9360C39968i9840n03808B21696n9904f4000E87776O5536k90816l7376J61792
$$ -79360 339968 -99840 -603648 221696 161792 -64000 587776 653312 362496 325120 486912
7664D86912j55136h93440C70176k6624a92000L9936A030656d72576A23392M07552
$$ 486912 331776 -893440 370176 343552 -192000 -152064 1030656 -472576 123392 530944
7654E30944a360384d96128a46432C16416a91488m66432D82816i216B82624a79712
$$ 530944 -1360384 -496128 -146432 316416 -191488 -657920 482816 -9216 282624 -179712
7643E12L33312b01216F23616j00864B12992f08768c2256j42848Q7040k96960a16736
$$ 512 333824 -201216 623616 522752 212992 -608768 -32256 -175104 -88064 -385024 -116736
7631A63328d23936b11456i5744k40128E10464B54464L19488a14688B51904f97344
$$ 163328 -423936 -211456 -95744 -335872 510464 254464 573952 -114688 251904 -697344
7620d06528B67776L91168B72384a82272E62688a96096O7584j72032I09312J90464
$$ -406528 267776 658944 272384 -182272 562688 -196096 -128512 -300544 909312 1099776
7610A099776a53600k96448D79744A5360N0176R10336j49504b81088r1136n20192
$$ 1099776 -153600 -450048 479744 15360 65536 975872 826368 -281088 -372224 -892416
7600h92416G43936A2288a187840A82272c1232n93408A272320A40800P54176@A40288
$$ -892416 743936 12288 -1187840 182272 -31232 -624640 1272320 140800 894976 0 140288
7588e5808k82624k70848H22272d9664B87232h7552j44896C90656c79392J9456
$$ -55808 -338432 -609280 822272 -49664 287232 -87552 -232448 390656 -379392 -359936
7578c59936P6800E06880c21024j60256E0688f18496A41824K70848b07872H9088
$$ -359936 -283136 506880 -321024 -481280 50688 -618496 141824 412672 -207872 89088
7567b55488r81504a74592o83520C36896N50400b88256D51072h29952c37920H99584
$$ -255488 -1236992 -174592 -858112 336896 887296 -288256 451072 -829952 -337920 899584
7556F98368i79968M50048G88992C16928J19296L44064O29248a59232C79904J42848
$$ 698368 -979968 -529920 788992 316928 436224 780288 1409536 -159232 379904 522752
7546E22752a43872E31456g34720q3968C30752j19296c60448a41312d0960E4784
$$ 522752 -143872 531456 -734720 -818688 330752 211456 -360448 -141312 -40960 54784
7535B34496R0112O13376j4848l67616j024d32128D83840b08896B36032L08736
$$ 234496 324608 937984 923136 555520 554496 -432128 483840 -208896 236032 544768
7525E44768N16608B27328P47520A55136K38080Q25856C3280K67264a362944C55840
$$ 544768 1061376 227328 974848 155136 393216 1219072 33280 300544 -1362944 355840
7514A107968l50720l21536A37216h28928c33824B97472E9904c31776A98656a009664
$$ 1107968 757248 435712 137216 -828928 -333824 297472 59904 -331776 198656 -1009664
7503B09920K74944e27360E12b7136D13696K6624A61792b35008B3040B048c59424
$$ 209920 484864 -527360 512 -27136 413696 440320 161792 -235008 23040 2048 -359424
7491A94560H2944A4336g73632p168B80064c91680D80768c63520D76672A65376
$$ 194560 82944 14336 -773632 -780800 280064 -391680 480768 -363520 476672 165376
7480F79936C33824h0384c0208A85344O0928J88416e01248g4240J9968j060352
$$ 679936 333824 -80384 -30208 185344 246272 434688 -501248 -74240 -54272 -1114624
7470a114624A337344a012736G0656c18976F95808L08736D46976j14688c1744q9088
$$ -1114624 1337344 -1012736 70656 -318976 695808 1004544 446976 332288 -31744 -120832
7460a20832l51744k41152a81248B01216d46976B10432e26336K54464H03328g27552
$$ -120832 -472576 -713728 -181248 201216 -446976 210432 -526336 -271872 803328 -727552
7449h18176B2528g08096b06848A176576H7552c71200D38784b51392C68640G0144
$$ -818176 22528 -708096 -206848 1176576 87552 -371200 438784 -251392 368640 70144
7438D18816h29952I27744f95296B14528L08224A21856Q76544b30400l1232j34144
$$ 418816 -829952 927744 -695296 214528 522752 121856 998400 -230400 -261632 -395776
7428c95776A74592b64704f656k62144k21696a29024G77728O04672b69824K9696
$$ -395776 174592 -264704 -6656 -268800 -490496 -129024 777728 1382400 -269824 -240128
7418b40128G52128j48992I728K57536a083904c43552E53472J15200a73056j35168
$$ -240128 752128 603136 9728 267264 -1083904 -343552 553472 668672 -173056 -308224
7408c08224B46784j06496P3728g95648G57248C65568N20704c88096C16928h4480
$$ -308224 246784 140288 214016 -795648 757248 365568 886272 -388096 316928 -84480
7397b15552Q9600c6352m7104F87104b13504A71520m096M3520c67104I15456c99360
$$ -215552 -125952 -36352 -83456 687104 -213504 171520 167424 210944 -367104 915456 -399360
7385I42080A40800o0416d57216a40800E76512j97120j46432F2976a33632b5600
$$ 942080 140800 80384 -457216 -140800 576512 379392 232960 62976 -133632 -25600
7374d69504D13696h12544j84832B13504J90464g88992C14368L2256Q8576M6080
$$ -469504 413696 -812544 -997376 213504 403968 -788992 314368 346624 435200 481280
7364D81280q4992j53088M39808B46272b25280A41824a262080C17952Q3456b61632
$$ 481280 396288 243200 683008 246272 -225280 141824 -1262080 317952 401408 -261632
7353i2160D61312n1712J1264b68800b8160j85344F80960h73984a91488B96960
$$ -92160 461312 409600 420864 -268800 -28160 -213504 680960 -873984 -191488 296960
7342A91488b5600o37952K13504A148928a76640j34656r77920N68832J32608A162240
$$ 191488 -25600 -663552 -450048 1148928 -176640 -311296 -1289216 -720384 -587776 1162240
7331A74592a004032d14720b3040A8944c37408L584l87072J48480b83136B46784
$$ 174592 -1004032 -414720 -23040 18944 -337408 -333824 -720896 -572416 -283136 246784
7320D31104E1200b40640C94240c81440J15712N5808D26496M11136k20160R3184
$$ 431104 51200 -240640 394240 -381440 -265728 -209920 426496 837632 617472 710656
7310G10656K72384B71360c81440D17280C7888c93216J95072n65760b10944C41504
$$ 710656 983040 271360 -381440 417280 37888 -393216 -198144 -763904 -210944 341504
7299I216h4992k67264k25792a60768B78528C9424Q77056a96096H28928a0240A06496
$$ 9216 -84992 -352256 -578048 -160768 278528 39424 916480 -196096 828928 -10240 106496
7287G35744r1648b83136D69504e3248I4720e25824h2432d096B78528f2976I3184
$$ 735744 644096 -283136 469504 -53248 94720 -525824 -82432 -4096 278528 -62976 93184
7275E49888M63360h42752J41312J70496E98016B42176i3696b8672k56000F47168
$$ 549888 1013248 -842752 -701440 -530944 598016 242176 -93696 -28672 -284672 647168
7264C54304a9456E54496B67776e07904B11968a21856n99552a12128G07584A38240
$$ 354304 -19456 554496 267776 -507904 211968 -121856 -721408 -112128 707584 138240
7253c07712E30432j59744d96640I09312c7888n2224F32320A40800L92192e120
$$ -307712 530432 370688 -496640 909312 -37888 -90112 632320 140800 532992 -5120
7242a50528k99520B19136P05024e82656E98528b19136l1744j72544J24416r3696
$$ -150528 -450048 219136 924160 -582656 598528 -219136 -250880 -423424 -299008 -392704
7232c92704j13152H04864d62848H62720b54976D02944b37568B30912b4576B94912
$$ -392704 -505856 804864 -462848 862720 -254976 402944 -237568 230912 -24576 294912
7221h44800C2256e52448D92544D2496c03616i2160D65920r1136J14688j35680
$$ -844800 32256 -552448 492544 42496 -303616 -92160 465920 374784 489472 353792
7211C53792d05504A028096l584f67136C14368M608J35680P42912B14016J19296
$$ 353792 -405504 1028096 1024512 -667136 314368 318976 454656 1197568 214016 333312
7201C33312K83136A46944J69472e38112E73440B01728d33152D00384b04800H07424
$$ 333312 616448 146944 316416 -538112 573440 201728 -433152 400384 -204800 807424
7190a23392N8368G69024B88256A14688C5328M28032B4576K58048R0112f53824
$$ -123392 -65024 769024 288256 114688 35328 463360 24576 282624 372736 -653824
7179d25472D86912L50720n9904a6896p72096A38752g32160e12n98528F144Q44288
$$ -425472 486912 837632 777728 -16896 -788992 138752 -732160 -512 -599040 6144 850432
7168H50432l93728M66432C39456G8336L16928j14688H8576J29536c19488a8432
$$ 850432 456704 923136 339456 78336 395264 280576 88576 218112 -319488 -18432
7157I84064h57600D51072k22208J38240N29408B37568L53280f7072l7376j33120
$$ 984064 -857600 451072 228864 367104 896512 237568 590848 -67072 -104448 -237568
7147b37568A51040L2768J074688i5232A510400e60640G9360J45920N20704L1232
$$ -237568 151040 183808 1258496 -95232 1510400 -560640 79360 225280 745984 777216
7137G77216o656f67648L10784C57376d38272a19296N5808H68352a18784I93792
$$ 777216 770560 -667648 -356864 357376 -438272 -119296 -63488 868352 -118784 993792
7126f4512p20384C55328L09760A36704O656a19296M3008E12512L62496A4336J58208
$$ -64512 -784896 355328 665088 136704 143360 -119296 -76288 512512 875008 14336 172544
7115A72544p168K54464j79712f7072I99424e0176H92928e16608D68480j12128
$$ 172544 165376 419840 240128 -67072 999424 -50176 892928 -516608 468480 356352
7105C56352b54976k5088G680c98336A572864a0240B74432K23232L58400M84864
$$ 356352 -254976 -280064 7680 -398336 1572864 -10240 274432 497664 856064 1340928
7095A340928i25184c36896H07936e32992b45248j33120J56160A7920P13216e72928
$$ 1340928 -925184 -336896 807936 -532992 -245248 -378368 -222208 17920 731136 -572928
7084G33184M49024B75968m4032N80608g65440g5776E08416a2800p78240G87456
$$ 733184 1182208 275968 231936 812544 -765440 -75776 508416 -12800 -791040 787456
7073D08576K31424f29248A166336f72768C45600R08800E27360c55328F66112J83808
$$ 408576 640000 -629248 1166336 -672768 345600 1254400 527360 -355328 666112 849920
7063H49920c67616A14688P19360a66400F80448b08896k65728E09440f81984i7280
$$ 849920 -367616 114688 834048 -166400 680448 -208896 -474624 509440 -681984 -97280
7052E48864A36704J206272m51584c12832G4752a024E74976e84704b22208C84000
$$ 548864 136704 1342976 891392 -312832 74752 -1024 574976 -584704 -222208 384000
7041C56864L93728j54112d71552A52064G680J44896O58432d66944C7376N05344
$$ 356864 750592 596480 -471552 152064 7680 152576 811008 -466944 37376 542720
7031E42720N9904K46272b1504B05824M04992J2800b24768I9840O58432M03968
$$ 542720 602624 848896 -21504 205824 610816 623616 -224768 99840 758272 1162240
7021A162240E18144b68800D80768A30560D8640b35008m65408C2768d93056C58400
$$ 1162240 518144 -268800 480768 130560 48640 -235008 -700416 32768 -493056 358400
7010b51392j08544A28000K2016d13184J75616E32992j99168N98016b87232D0960
$$ -251392 -359936 128000 150016 -413184 -237568 532992 333824 931840 -287232 40960
6999G93088k28864A56672d83328J51040A02400a03424D34688e08928N9904B2528
$$ 793088 564224 156672 -483328 -332288 102400 -103424 434688 -508928 -449024 22528
6988d17792A64864D608a09568n5808j302016H62720A01888m2496f59968E17120
$$ -417792 164864 4608 -109568 -165376 -1467392 862720 101888 59392 -659968 517120
6977F91712e6832k86208D81280N89312e76000H47872b38080G7824M64896d88960
$$ 691712 -56832 -343040 481280 1070592 -576000 847872 -238080 77824 542720 -488960
6966C00544e64736G9872b37568C48672L55328K8160d77696A84320b56000F07232
$$ 300544 -564736 79872 -237568 348672 704000 732160 -477696 184320 -256000 607232
6955c25632q6016D20352J42336c81440G62368j80224e29920F29760c15904k19648
$$ -325632 -411648 420352 562688 -381440 762368 582144 -529920 629760 -315904 -535552
6945e35552G14752A03424B3552J10080j1264b94400d7104A55136c00544G36256
$$ -535552 714752 103424 23552 133632 122368 -294400 -47104 155136 -300544 736256
6934A11104N96480a71008A046016B38592b57024E0176a86368A18784N67296f1440
$$ 111104 707584 -171008 1046016 238592 -257024 50176 -186368 118784 686080 -61440
6923a18272G67488g0144l0208m66944C53280Q6016G8848K91840J81760d13696
$$ -118272 767488 -70144 -100352 -567296 353280 439296 78848 370688 552448 -413696
6912D83840L19488k42176e58080B53952b33984A21344b73408D096N85216B09408
$$ 483840 803328 561152 -558080 253952 -233984 121344 -273408 4096 589312 209408
6901F95808f86592K91840D08576J117696B15040c22560J57696p7824k05312C26144
$$ 695808 -686592 -394752 408576 1526272 215040 -322560 -164864 -242688 -448000 326144
6890a056256M08576a69472D31104g21408q2432A30560b57024p16800a80224B20160
$$ -1056256 -647680 -169472 431104 -721408 -803840 130560 -257024 -973824 -180224 220160
6879e5808l93728E6832M44928c54304B3552d48000A37728J35168c88608P9360
$$ -55808 -449536 56832 501760 -354304 23552 -448000 137728 272896 -388608 -309248
6869c09248G43424A34656C2768B048J52576O29760B41152e32992K34496C44064
$$ -309248 743424 134656 32768 2048 154624 784384 241152 -532992 -298496 344064
6858c65056m4032a9968p53152b51392A286656c84000e1200A11616b45760F34368
$$ -365056 -409088 -19968 -773120 -251392 1286656 -384000 -51200 111616 -245760 634368
6847G75168c50208J17760B30400L98848L32288B5088J015296e10464A39264Q57600
$$ 775168 -350208 -232448 230400 629248 961536 25088 1040384 -510464 139264 996864
6837I96864D52096A12640b97984A05984M18816J65888i4208m27520l01568E45280
$$ 996864 452096 112640 -297984 105984 524800 690688 -94208 -521728 -823296 545280
6826E85216l4816Q01280B19136g5264C48160i00096G97696a93024O8096j111552
$$ 585216 550400 1351680 219136 -75264 348160 -900096 797696 -193024 -124928 -1236480
6816a236480a61792A36704R47200e24288B84672L072F5536K97472L34848L97312
$$ -1236480 -161792 136704 1083904 -524288 284672 287744 65536 363008 697856 1095168
6806A095168g7824F26176J65376j48992e90848M3008H44800B52416b74944F45632
$$ 1095168 -77824 626176 791552 642560 -590848 -547840 844800 252416 -274944 645632
6795b54464J01376j0752A08544A0752Q23296a04960p5776r04192a35168j70496
$$ -254464 -153088 -163840 108544 10752 834048 -104960 -180736 -1084928 -135168 -305664
6785c05664A269760D69504b02240m92032A125888G6800L31776a32096l41504D88960
$$ -305664 1269760 469504 -202240 -694272 1125888 76800 408576 -132096 -473600 488960
6774c38432H26880a76128G73632p6288B48320R60000a79712B22720j03424J325056
$$ -338432 826880 -176128 773632 697344 248320 1208320 -179712 222720 119296 1444352
6764A444352i43104F97856A82272K45760b19648l00032H88320b57024B85184c68128
$$ 1444352 -943104 697856 182272 428032 -219648 -519680 888320 -257024 285184 -368128
6753C10272a074176d62848p2192F56896a20320B86720d46464E02272b83648G06048
$$ 310272 -1074176 -462848 -535040 656896 -120320 286720 -446464 502272 -283648 706048
6742c2256j52064J9456B66752L41504k54976c11808A47968P71072b25792A135616
$$ -32256 -184320 -164864 266752 608256 353280 -311808 147968 919040 -225792 1135616
6731I6256K64192j9456j10080o2464f32832g3728I06752B2528J260544R2160D44928
$$ 96256 360448 340992 230912 168448 -632832 -73728 906752 22528 1283072 1375232 444928
6719C91680g02976e5296C17440N52960b48832Q2432A060352f82496A96096O24640
$$ 391680 -702976 -55296 317440 870400 -248832 -166400 1060352 -682496 196096 820736
6709H20736c39968D65920j67936j5360J36192j44896J37216i67680A290240A02400
$$ 820736 -339968 465920 297984 282624 418816 273920 411136 -967680 1290240 102400
6698C48160i8816I13920g5776C33824h5504C75808C1232a01888E76512k28352
$$ 348160 -98816 913920 -75776 333824 -85504 375808 31232 -101888 576512 348160
6688C48160f91712C25632J78688e84704J61792n44768M70528B25280M02432j68960
$$ 348160 -691712 325632 504320 -584704 -422912 -967680 -497152 225280 627712 458752
6678D58752f43584A63840O19520B04288a22880A230336F11328A12128C4816R33888
$$ 458752 -643584 163840 783360 204288 -122880 1230336 611328 112128 34816 968704
6668I68704B53440m4544K38592B19136J30560I6256M73088n2736J52576k6112
$$ 968704 253440 208896 447488 219136 349696 96256 569344 516608 669184 643072
6658F43072j23904L77856k07872a55136B34496d2496B21696M07040B52928g76704
$$ 643072 519168 897024 689152 -155136 234496 -42496 221696 628736 252928 -776704
6647h09984E9392a91488E84192k60096R4720E4784O09280D7104i6768l89120A3824
$$ -809984 59392 -191488 584192 324096 418816 54784 664064 47104 -96768 -485888 13824
6635E23264O28736C22048J16736E9392b45760j8432A33632R5744a01888m31104
$$ 523264 1152000 322048 438784 59392 -245760 -264192 133632 229376 -101888 -532992
6625e32992c8400B32448f1952B32448O2976j31584K18624g1168k36032G99232
$$ -532992 -38400 232448 -61952 232448 295424 163840 382464 -71168 -307200 799232
6614A74592Q08448d44416G39328A69984M14208J59744A92000N632L94752j40800
$$ 174592 983040 -444416 739328 169984 584192 743936 192000 197632 592384 451584
6604D51584g40864K88768a38752m34688i1136A61792J39776e90336D71040f49216
$$ 451584 -740864 -452096 -138752 -573440 -91136 161792 301568 -590336 471040 -649216
6593D4544M65408L87072c37408a68448k38592C81952m1472L8912J87904j34144
$$ 44544 509952 897024 -337408 -168448 -407040 381952 340480 379392 567296 433152
6583D33152d1984F07232B81600J89440f66624F10304k60096A31584B048J43360
$$ 433152 -41984 607232 281600 471040 -666624 610304 350208 131584 2048 145408
6573A45408o1440N99040N632a37216C88608d63872B54976P68000C76320a75104
$$ 145408 83968 683008 688640 -137216 388608 -463872 254976 1022976 376320 -175104
6562b07360A06496N32480j67424e7856B50368c27680B77504L88096j23392g70560
$$ -207360 106496 638976 471552 -57856 250368 -327680 277504 665600 542208 -770560
6551D60288j01888A73056M80256B20672c33312G33696b01728G52640j20320B54976
$$ 460288 358400 173056 653312 220672 -333312 733696 -201728 752640 632320 254976
6540h8576D85888A78176a087488C63008A36704g10656E9904K41664e79584D43904
$$ -88576 485888 178176 -1087488 363008 136704 -710656 59904 301568 -579584 443904
6529C35360a52576p94624g0656k57024j084928F9120J32096o1440C0208M07040
$$ 335360 -152576 -947200 -70656 -327680 -1412608 69120 201216 139776 30208 437248
6519D37248B17088e50400D53120J13152b02752H52480b88768M5056k85184A051648
$$ 437248 217088 -550400 453120 566272 -202752 852480 -288768 -243712 -528896 1051648
6508E56032k65216P36768H0384Q45824e89824m0448D88960d9152E83168B73920
$$ 556032 290816 1027584 80384 926208 -589824 -630272 488960 -49152 583168 273920
6497a032192A73056m4544f45632A085952C45088P32672C29728f19520F30784Q33024
$$ -1032192 173056 128512 -645632 1085952 345088 1077760 329728 -619520 630784 1463808
6487A463808o38976F6560R06240a45920n12o45120J09568c1232G90528e16096
$$ 1463808 824832 66560 972800 -145920 -146432 -791552 -681984 -31232 790528 -516096
6476f6560B36032K85696j0752K20672b07360I4208a40288j00352F57920d92544
$$ -66560 236032 521728 510976 731648 -207360 94208 -140288 -240640 657920 -492544
6465E120f51776M6080L02080a0240A377280B7136K70848b77504E85728L3280A11616
$$ 5120 -651776 -605696 -303616 -10240 1377280 27136 297984 -277504 585728 619008 111616
6453b72384A421824b28864r1648F14912j28000A14176e120F14912L56352D608
$$ -272384 1421824 -228864 -320512 614912 486912 114176 -5120 614912 971264 4608
6442b29376n24800A99680a30048F09280K5600H5504a47968N1712F02624B68288
$$ -229376 -754176 199680 -130048 609280 634880 85504 -147968 -96256 602624 268288
6431c80928D81792g67488i3184n62176C48160a265152b42688a536C47648A30560
$$ -380928 481792 -767488 -93184 -655360 348160 -1265152 -242688 -1536 347648 130560
6420B21184d65408F20544g3216D88960e52960G1168d60288G30112c06688A46432
$$ 221184 -465408 620544 -73216 488960 -552960 71168 -460288 730112 -306688 146432
6409F26176h02816G98720C85536L37920B44736N82656e38624A97120K00704J57184
$$ 626176 -802816 798720 385536 723456 244736 827392 -538624 197120 397824 555008
6399E55008A21344J77152K48320a38752A10080f00064B04800P68000C66592i26208
$$ 555008 121344 298496 546816 -138752 110080 -600064 204800 972800 366592 -926208
6388h63744a21344E19680L45088b38080C584c69152n27872B8672i2160k60096
$$ -863744 -121344 519680 864768 -238080 3584 -369152 -897024 28672 -92160 -352256
6378c52256J36704A60256c88096H97536B59072a86368k85184F93248d71040a92000
$$ -352256 -215552 160256 -388096 897536 259072 -186368 -471552 693248 -471040 -192000
6367A83808a10592a0752E45280A52576h65792B29376M50560a0752E14560i41568
$$ 183808 -110592 -10752 545280 152576 -865792 229376 679936 -10752 514560 -941568
6356C85536M85376l27680e76000K77504B0480b23744D81280R43104C78880N44256
$$ 385536 870912 543232 -576000 -298496 20480 -223744 481280 1424384 378880 923136
6346I23136C90144b42176B72384M97664a33632p9872a05984A118720E32992K76480
$$ 923136 390144 -242176 272384 770048 -133632 -213504 -105984 1118720 532992 809472
6336H09472l93216m6080j55136K92864j40800B6624d63360a9968H192N13024K4576
$$ 809472 416256 370176 215040 507904 367104 26624 -463360 -19968 8192 521216 545792
6325E45792M30592b66752A243648m11648j68448f92224h0384m75136H70912e3760
$$ 545792 976384 -266752 1243648 832000 663552 -692224 -80384 -555520 870912 -53760
6314F09792j69472c26144j07008D78720O9632j85344N66784K26816a86368C33824
$$ 609792 440320 -326144 -433152 478720 548352 363008 929792 1156608 -186368 333824
6303d60288E65248A19296M93568L72224b71360F88128I7280J63328p8336Q09984
$$ -460288 565248 119296 612864 985088 -271360 688128 97280 260608 182272 992256
6293I92256c61472A004032e1200C99872J25440a73056G25504l34336j90976f14912
$$ 992256 -361472 1004032 -51200 399872 525312 -173056 725504 391168 200192 -614912
6282A266176K55488p26528g96672G87968f70720C06176A1264d25984E1712O07744
$$ 1266176 1521664 795136 -796672 787968 -670720 306176 11264 -425984 51712 659456
6272F59456h4992B60608O27712R0624A26464K78016c10784H3968L90144L61472
$$ 659456 -84992 260608 888320 978944 126464 404480 -310784 83968 474112 835584
6262H35584l42528b11456l58912b9696q97536D61824j74080L87584h62208E65248
$$ 835584 493056 -211456 -570368 -29696 -927232 461824 287744 675328 -862208 565248
6251f98880d1472k93376J7408B62656I8816B8672i32352L12832E13024j2800c35360
$$ -698880 -41472 -334848 -317440 262656 98816 28672 -932352 -619520 513024 500224 -335360
6239e16096J71008K048F99392N90848B55488f33856A91488O11328L46624m45952
$$ -516096 -345088 -343040 699392 1290240 255488 -633856 191488 802816 1149440 703488
6229G03488C44064R216n8368a19296A20832d9152a2800k70848A658880b64192
$$ 703488 344064 353280 294912 -119296 120832 -49152 -12800 -283648 1658880 -264192
6218B55488a78176D39808e91360C08224i0112F62016b47296o1952E17120J64864
$$ 255488 -178176 439808 -591360 308224 -90112 662016 -247296 -309248 517120 681984
6208F81984k11456A23392L00544O34368d45952A142272E24800B35008a55136m4032
$$ 681984 470528 123392 423936 1058304 -445952 1142272 524800 235008 -155136 -199168
6198a99168j03936G40352l30752d80256f2464F32320i0112C01568A20832K88768
$$ -199168 -303104 740352 409600 -480256 -62464 632320 -90112 301568 120832 409600
6188D09600k3552b560D44928f19008F45632d85376G58272l44576Q82688c52768
$$ 409600 386048 -2560 444928 -619008 645632 -485376 758272 413696 1296384 -352768
6177d31104J80224I31840i46688b02240j62816I65632b35520F54848A66912a19296
$$ -431104 -250880 931840 -946688 -202240 -365056 965632 -235520 654848 166912 -119296
6166A41824P54176j80224N38112A74592P68000A76128K61120a76640k52928D92032
$$ 141824 896000 715776 1253888 174592 942592 176128 437248 -176640 -429568 492032
6155E80096I9328J90976a63840I05216j57696I2160J219584b7136B57536p9360
$$ 580096 99328 290304 -163840 905216 747520 92160 1311744 -27136 257536 178176
6145A78176d608B92864A1264K09408L3792j8432f52800K98496E28896r7792b39616
$$ 178176 -4608 292864 11264 220672 254464 236032 -652800 -354304 528896 431104 -239616
6133B18112N75488k92864Q83712A25440R55392C23072c31264a536E83168a25952
$$ 218112 793600 500736 1384448 125440 1080832 323072 -331264 -1536 583168 -125952
6122D65408M02944C2768N120Q40704O32832C39456J654272e25312I14432d0960
$$ 465408 868352 32768 37888 878592 1511424 339456 1993728 -525312 914432 -40960
6111A019904a31072E07904A35168R02656l49184d22400I58464A7920K98496R5232
$$ 1019904 -131072 507904 135168 1037824 688640 -422400 958464 17920 316416 411648
6101D11648k4064P9872j06496O50752c28192F71232k77504A14176M48512M40832
$$ 411648 387584 467456 360960 1011712 -328192 671232 393728 114176 562688 1003520
6091A003520D76160d28032b0992E96992c09760C15392b2528G11168C7376L27168
$$ 1003520 476160 -428032 -20992 596992 -309760 315392 -22528 711168 37376 364544
6081C64544A43360L18464e12j24928d3008l7888A187840d26496B76480L14368
$$ 364544 143360 461824 -512 -125440 -43008 -80896 1187840 -426496 276480 590848
6071E90848A54624f144k71872I48224D61312o5536g9360I83552L5328m87936f45632
$$ 590848 154624 -6144 -278016 948224 461312 395776 -79360 983552 1018880 530944 -645632
6059D99200d33152I45152l50720j00864R3184j32608K15552O63552A2288Q8064
$$ 499200 -433152 945152 594432 493568 586752 454144 669696 1333248 12288 100352
6049A00352a40800A19296d07040J13152C15392L10272j37216g9360D53120J35680
$$ 100352 -140800 119296 -407040 -293888 315392 625664 488448 -79360 453120 588800
6039E88800d36736H98560B62144O40512j07008P45984o09280g45472e2224H7040
$$ 588800 -436736 898560 262144 902656 795648 1541632 932352 -745472 -52224 87040
6028f25152D42368A31584N7856P6288Q80128m07552A95072K53952J80224j59744
$$ -625152 442368 131584 189440 265728 1145856 738304 195072 449024 629248 469504
6018D69504n8880j89440O49728B5088M06016k9696N52448a85856G04512P6800
$$ 469504 410624 221184 870912 25088 431104 401408 953856 -185856 704512 781312
6008G81312h6528a9456H50944d8128O656q64256A980928q22784C63008I0112K4576
$$ 781312 -86528 -19456 850944 -48128 -41472 -905728 1980928 1158144 363008 90112 114688
5997A14688b60608G56224O6560N8880b7136C11296P25504k10944d08064a66912
$$ 114688 -260608 756224 822784 881664 -27136 311296 1036800 825856 -408064 -166912
5986a39264B59584c93728E26336J24928B74432b25792B88256O7072I4720a53600
$$ -139264 259584 -393728 526336 651264 274432 -225792 288256 355328 94720 -153600
5975E36576j85344J040384A43872J132544C05664r2672O17984K02240D51584M96640
$$ 536576 351232 1391616 143872 1276416 305664 212992 830976 1033216 451584 948224
5965I48224L15904c0208A068032k66240C36896j25440f37440G74144E9392a4336
$$ 948224 1264128 -30208 1068032 801792 336896 211456 -637440 774144 59392 -14336
5954f8608H05888e13024D24448Q01280m95104L50208l87584A29024K4064e59104
$$ -68608 805888 -513024 424448 1225728 730624 1080832 693248 129024 153088 -559104
5943B08384Q12032n07904b02240n6320D13184J58720J74592K65216C82464j2800
$$ 208384 1020416 512512 -202240 -258560 413184 571904 746496 1011712 382464 369664
5933C69664K13504l3280A80224L36896N61664a18784k84672j14688C60448b05312
$$ 369664 583168 549888 180224 517120 1078784 -118784 -403456 -518144 360448 -205312
5922F49216A17248R0624m6080O29248A77152b22208B05312P61344k69312c17952
$$ 649216 117248 207872 161792 791040 177152 -222208 205312 966656 697344 -317952
5911C97312A56160P66464g13728C75808j33120P41376k50880j97120G6800c06688
$$ 397312 156160 922624 -713728 375808 242688 984064 733184 536064 76800 -306688
5900C04128e53984G77216k47296l4304L90656Q2432G0656M53120P8848d60800
$$ 304128 -553984 777216 529920 495616 886272 968704 70656 523776 602624 -460800
5889E10464j8432j88928L34336e14560G40352a87392G44448j90976k0992e8368
$$ 510464 492032 303104 637440 -514560 740352 -187392 744448 553472 532480 -58368
5878I94816A02912J020416C67104l4304M09088l21024a105408G5776J032192E45280
$$ 994816 102912 1123328 367104 332800 741888 420864 -1105408 75776 1107968 545280
5867D096a77664A050112e15072C60960e15072C9424K20672N06880C13856O15936
$$ 4096 -177664 1050112 -515072 360960 -515072 39424 260096 766976 313856 929792
5857I29792B54464c83488D63872M85376J536c96800C54816I3696Q60160A92512
$$ 929792 254464 -383488 463872 949248 950784 -396800 354816 93696 953856 192512
5846G18336j61792L90656c05664D68480J01376j98656e30432k47808g168A11616
$$ 718336 556544 947200 -305664 468480 569856 371200 -530432 -778240 -7168 111616
5835A030144b06848A006592b29888F75840B7136L77856A13664Q30976J76640B28352
$$ 1030144 -206848 1006592 -229888 675840 27136 404992 113664 944640 1121280 228352
5824H71424C19488L49696b13504c2256D92544e7344I17504J35168J94560l80416
$$ 871424 319488 669184 -213504 -32256 492544 -57344 917504 1052672 1247232 866816
5814H66816D15232K044416G92576K7136g51104D30080B08896J17760D0960d46976
$$ 866816 415232 2459648 792576 819712 -751104 430080 208896 326656 40960 -446976
5803g7312G51616b51392Q0896D53632e6320D45440J98656L36384B53440Q46336
$$ -77312 751616 -251392 -170496 453632 -56320 445440 644096 980480 253440 1099776
5793A099776m44928j95072A47456P77216P9872a5872j24928A038848m18304K3552
$$ 1099776 654848 459776 147456 924672 1004544 -15872 -140800 1038848 620544 644096
5783F44096B37056Q6528f57920K61632A59232j0240p2192L50720e3760B41664
$$ 644096 237056 323584 -657920 -396288 159232 148992 76800 427520 -53760 241664
5772A026560A95584P58784a41312A191936A13664h8576D16768M22912k88256J266688
$$ 1026560 195584 954368 -141312 1191936 113664 -88576 416768 839680 551424 1818112
5762A818112o63040R1136m90496N06880a4336m7616L0208A201664g99232I53344
$$ 1818112 1155072 1246208 755712 1262592 -14336 -61952 -31744 1201664 -799232 953344
5751I60000D00896K69824P48544d93568A004032j47968k54464A16736N24288L41504
$$ 960000 400896 670720 1419264 -493568 1004032 856064 601600 116736 641024 982528
5741I82528D62848J63840A90464K63680A69984Q45824d66944A9456R64608l47648
$$ 982528 462848 626688 190464 454144 169984 1015808 -466944 19456 984064 636416
5731F36416C3792M36224J774080B92864J56672P40352k07872J11104l23584l31776
$$ 636416 33792 470016 2244096 292864 449536 1189888 982016 1093120 769536 437760
5721D37760c80416E99040B51392a80736A64864k3040J417216I7792P19360F8608
$$ 437760 -380416 599040 251392 -180736 164864 141824 1559040 97792 817152 68608
5710G21920o0928M81280E53984i71776A700352f33344A69984K7136N49888K79040
$$ 721920 660992 1142272 553984 -971776 1700352 -633344 169984 197120 747008 1026048
5700A026048b89792C0208h80128C32800O63552a72544A93024R93280D46976j24416
$$ 1026048 -289792 30208 -880128 332800 996352 -172544 193024 1186304 446976 322560
5690C22560P92064J86368b79552D8640M51072R7792O75840n97504k10944B19136
$$ 322560 1114624 1300992 -279552 48640 499712 597504 1273344 675840 464896 219136
5679E19680B41664P9872R11872a31584C28192M91520l90656j20832k1504E8368
$$ 519680 241664 321536 1233408 -131584 328192 819712 429056 308224 286720 58368
5668C66592K16064P16800n26336b35008I84064k11968M54144K0480k02240C34848
$$ 366592 582656 1299456 773120 -235008 984064 772096 1226240 1246720 1044480 334848
5657A994752r30816C92704N00224a66912D23936J109504J01888p82848K76480
$$ 1994752 1063936 392704 892928 -166912 423936 1533440 1635328 852480 1128960
5648A128960d6592A313280m13184M58240k79040E34528K12992j92000k63680g6800
$$ 1128960 -46592 1313280 900096 1358336 1079296 534528 747520 555520 291840 -76800
5637B0992J168384N5296f40000d9664D29056J444864H4992P10144L08736C01568
$$ 20992 1189376 1244672 -640000 -49664 429056 1873920 84992 795136 1103872 301568
5626B81600M00896g11168H36608i72288G99232a26976A676288A10592L04128M73088
$$ 281600 682496 -711168 836608 -972288 799232 -126976 1676288 110592 414720 887808
5616H87808a30048F38464b91840H15104E6832M73088J89952M50560K18112c11808
$$ 887808 -130048 638464 -291840 815104 56832 529920 719872 1170432 1388544 -311808
5605G01952J8944a36704C33312A38240P45984l8912c1744A374208a72544F93248
$$ 701952 720896 -136704 333312 138240 884224 845312 -31744 1374208 -172544 693248
5594H48896b38592C21536m1984c77856A05984P9872N23776l52768N81120a005568
$$ 848896 -238592 321536 279552 -377856 105984 185856 709632 356864 937984 -1005568
5583I89696A16736P96160k81600l11296K6624M31616D0448Q28928o7072P01952
$$ 989696 116736 912896 631296 320000 346624 778240 40448 869376 802304 1504256
5573A504256F6560P83872j37728b95424D32128a03424H76544k65216K49856k09920
$$ 1504256 66560 850432 712704 -295424 432128 -103424 876544 611328 861184 651264
5563F51264J13664O54336c66080A343488A08032P95648l74272o1952K95936J54624
$$ 651264 764928 1419264 -366080 1343488 108032 903680 529408 467456 763392 918016
5553I18016k07360O20032E87776A55648c32288A612800C59424J61792L29728b00704
$$ 918016 710656 1330688 587776 155648 -332288 1612800 359424 521216 850944 -200704
5542E00224j59232F9632P84896q1408O34368n05344J04960E4272Q03840B41152
$$ 500224 340992 69632 854528 773120 1407488 902144 1007104 54272 858112 241152
5531A008128C38432R28768C50208N05856J03424L38944k12992J91488m72576c19488
$$ 1008128 338432 1267200 350208 856064 959488 1298432 1085440 1276928 804352 -319488
5520D34176Q39680l47648A43872F1952J210880m34176k36032M43904N65248m65920
$$ 434176 1273856 926208 143872 61952 1272832 838656 602624 1046528 1611776 1145856
5510A145856D94592j04448f144I61536j67936j35168Q61184C42528R89696m45952
$$ 1145856 494592 390144 -6144 961536 793600 658432 1519616 342528 1332224 886272
5500H86272B42688L32800M17792N66784J80736n49888k05312m4544n12J254400
$$ 886272 242688 575488 993280 1560064 1740800 1190912 985600 941056 940544 2194944
5490B194944p27552D35712P48544D12672O95808O9120J42336j14176J33632E3760
$$ 2194944 1467392 435712 1184256 412672 1108480 1177600 1319936 1205760 1339392 53760
5479E95456N68320m1472B62656Q18688G8848M72064R03680k0480o96832C28704
$$ 595456 1163776 1122304 262656 1081344 78848 550912 1454592 1434112 737280 328704
5468A015296j0240j73568C07712O21568k61632J041920J45408B46272J88416j79712
$$ 1015296 1005056 831488 307712 929280 667648 1709568 1854976 246272 434688 254976
5458B54976Q96512l14880m06528N72416n00736K64704F5024J124864E41184A32608
$$ 254976 1151488 836608 430080 1002496 501760 766464 65024 1189888 541184 132608
5447C03616J340928c09248F78400n3760j79200P77216k19136C82464a27488D40832
$$ 303616 1644544 -309248 678400 624640 445440 1222656 1003520 382464 -127488 440832
5436C88096J170432B22208J449472q06912c28704D85376A64864C6352P32160P08096
$$ 388096 1558528 222208 1671680 864768 -328704 485376 164864 36352 768512 1476608
5426A476608G12192K34496k24768C43552P58784L79904D73600d14208D91008M46976
$$ 1476608 712192 946688 721920 343552 1102336 1482240 473600 -414208 491008 937984
5416I37984l86560A1264N60128c10784H87808j8432A75104O1440J48480J958400
$$ 937984 551424 11264 571392 -310784 887808 869376 175104 236544 385024 2343424
5406B343424D63872J64864K84672R3184k93888e28896G21408J33120L82976m43392
$$ 2343424 463872 628736 913408 1006592 712704 -528896 721408 854528 1237504 794112
5396G94112L6864K46272M9152j24416L2768D04992d50048A664000p05536d88448
$$ 794112 830976 1077248 1126400 1001984 1034752 404992 -450048 1664000 958464 -488448
5385A158144D47488m3008h68352G36256L63520D89472b70336A219584n10976k96448
$$ 1158144 447488 404480 -868352 736256 1099776 489472 -270336 1219584 708608 412160
5375D12160A62816K51904K18624N25312n59616O33344l50208C34848K74944j55136
$$ 412160 162816 414720 633344 1158656 599040 1232384 882176 334848 609792 454656
5365D54656K96960l14880R40544I5232L31264A68960N45280k94400K5088c0208
$$ 454656 751616 436736 1377280 95232 426496 168960 714240 419840 444928 -30208
5354A41312g5264E70880J93024l12832R32864l17440l77344L80416a17248A414144
$$ 141312 -75264 570880 763904 451072 1383936 1066496 689152 1069568 -117248 1414144
5343I44128l16928J24416c18464G87968L81952b2016H68864L95776C06688R98912
$$ 944128 627200 751616 -318464 787968 1169920 -22016 868864 1264640 306688 1305600
5333A305600B73920M76672K35008m9152j18784O16960g6800A213440d29056B280448
$$ 1305600 273920 750592 985600 936448 817664 1434624 -76800 1213440 -429056 2280448
5322E48352j49504H6016O92224k28352Q05376m77696P7824j64864B26304q4480
$$ 548352 398848 86016 778240 549888 1355264 877568 955392 790528 226304 141824
5312A41824R08800l37920K04288J072640E13024M53120l87584L5840O79936m53120
$$ 141824 1050624 712704 916992 1989632 513024 966144 578560 614400 1294336 841216
5302H41216M27520m51072J1264j40288J9456C06688J89440A51040N80608l60448
$$ 841216 1268736 817664 828928 688640 708096 306688 496128 151040 731648 371200
5292C71200k5088a35680A82272P61344B79552J29536j26976c5328D94592L9424
$$ 371200 346112 -135680 182272 943616 279552 409088 282112 -35328 494592 534016
5282E34016K18624C65568A53088R77408d096A193472n48864A04960O32320N96480
$$ 534016 752640 365568 153088 1130496 -4096 1193472 644608 104960 737280 1333760
5272A333760E21216N67296m63360k26816N05856O5536c18464A555456m92544l82464
$$ 1333760 521216 1088512 625152 398336 904192 969728 -318464 1555456 1062912 680448
5262F80448Q65280p71072k81600a13152A585664o76864j8432j16224K47808K91328
$$ 680448 1545728 774656 493056 -113152 1585664 908800 890368 774144 1021952 1313280
5252A313280m34688L28704k20672L46112I4720J223680k3040k99520J24416q2944
$$ 1313280 878592 1207296 986624 1332736 94720 1318400 1295360 995840 1120256 1037312
5242A037312O58432J94560m89984J410048l21536m0960j058304J026560k56512
$$ 1037312 1695744 1890304 1400320 2810368 2488832 2447872 1389568 2416128 2159616
5233B159616p00928k41152P13728G64928N17120A24416J112064E16096P92576
$$ 2159616 1458688 1217536 1931264 764928 1282048 124416 1236480 516096 1308672
5224A308672l82976J355776n31968C93216R75360D97664Q12032n98016M1984M2496
$$ 1308672 925696 2281472 1749504 393216 1368576 497664 1309696 711680 753664 796160
5214G96160l72224J31072P16288o21056k26816B10432J721856D68480A33120K324480
$$ 796160 423936 555008 1271296 650240 423424 210432 1932288 468480 133120 2457600
5204B457600E56544M7104N3760K89792Q38144H42752c82464H24320B87744b49344
$$ 2457600 556544 603648 657408 947200 1785344 842752 -382464 824320 287744 -249344
5193H09984j14176C9936O94272D4544J183232B30400a97632E96992P86432m3008
$$ 809984 695808 39936 734208 44544 1227776 230400 -197632 596992 1383424 1340416
5183A340416K16576k31424E05856p4752N40672L1232o0928A13152O8096J043968
$$ 1340416 1556992 1325568 505856 431104 971776 1003008 942080 113152 181248 1225216
5173A225216J59232F28224J213952p23456A41824R79968B37568K32960M33152
$$ 1225216 1384448 628224 1842176 1118720 141824 1121792 237568 470528 903680
5164I03680R1648r4208m12160d28032C13856O2464J64352P79264l75296N31456
$$ 903680 995328 901120 488960 -428032 313856 376320 540672 1319936 944640 1476096
5154A476096M83840o9632n55520N73440I28256k55488N45792n39648N43744m91520
$$ 1476096 1959936 1890304 1334784 1908224 928256 672768 1218560 678912 1222656 731136
5144G31136l07712J39264A90464R64096j54112J86880M22912p52640k03776R70240
$$ 731136 423424 562688 190464 1154560 1000448 1187328 1610240 857600 653824 1624064
5134A624064E24288J05984N79584L9424R26720F87104k51392N34016K92352q0896
$$ 1624064 524288 630272 1209856 1249280 2176000 687104 435712 969728 1262080 1181184
5124A181184O56896r17504P14752L66592H83712C23072R49248N95968n12000j28512
$$ 1181184 1838080 920576 1635328 2001920 883712 323072 1272320 1868288 1356288 1227776
5114A227776m7616j43872J24416J29536Q1920E73952J48992O0416P40352o84032
$$ 1227776 1180160 1036288 1160704 1290240 1372160 573952 722944 783360 1523712 839680
5104H39680K9184p8848K36032m65920L9936J115648o63040P19872A73568j6896
$$ 839680 868864 790016 1026048 560128 600064 1715712 1052672 1772544 173568 156672
5094A56672J720832G72608J257984k62656q22272J65888O10816n47328j17248
$$ 156672 1877504 772608 2030592 1767936 945664 1111552 1722368 1175040 1057792
5085A057792j16224J82784K51392P0656k62144J9456Q14592D31616K083328G17824
$$ 1057792 941568 1124352 1375744 1446400 1184256 1203712 2018304 431616 2514944 717824
5074E39648J323520G94112N90848k50368D66944J318912K58048L10784j167872
$$ 539648 1863168 794112 1384960 1134592 466944 1785856 2043904 2354688 1186816
5065A186816M05504k67776E70368Q93952o08256m01408R17504j60768k94912C16928
$$ 1186816 1592320 1324544 570368 1464320 856064 454656 1372160 1211392 916480 316928
5054A225216L46624F18496M46976J371136G98208O2464L11808P09120l17440M9664
$$ 1225216 1571840 618496 1065472 2436608 798208 860672 1172480 1881600 1564160 1613824
5044A613824k88256k22720J43872F22080M84352j05984K53440R7792k47808M56704
$$ 1613824 1325568 1102848 1246720 622080 1106432 1000448 1253888 1351680 1103872 1560576
5034A560576G23456k02240M14720j67936K19648N52960F71744K28352O93760m93568
$$ 1560576 723456 521216 935936 768000 987648 1540608 671744 900096 1593856 1100288
5024A100288J72032m16768j57696J249280I41056P92064B55488Q84736n3248R7280
$$ 1100288 1272320 855552 697856 1947136 941056 1733120 255488 1140224 1086976 1184256
5014A184256m30080J92000N90336J88416K78528H75008R70240k60608j99680F21568
$$ 1184256 754176 946176 1536512 1724928 2003456 875008 1845248 1584640 1384960 621568
5003A057280C3792J223168l48672l29728J819648m22400m01408N78560L11808
$$ 1057280 33792 1256960 908288 578560 2398208 1975808 1574400 2152960 2464768
4994B464768j51552p8336l42016O36928L52768J488384L68128J225216o58944
$$ 2464768 2313216 2234880 1892864 2529792 2882560 4370944 4739072 5964288 5305344
4985E305344j442816J417216J5872j412096p69024M6080q94464K68288q21760
$$ 5305344 3862528 5279744 5295616 3883520 3114496 3160576 2266112 2534400 1712640
4976A712640O56896A143808m11136J9968N12512p6288C30752Q59136j95072m40832
$$ 1712640 2369536 1143808 732672 752640 1265152 1188864 330752 1189888 994816 553984
4966E53984L03104P96160F54848R50272n80096C47648L28192b97984P0144A293312
$$ 553984 857088 1653248 654848 1605120 1025024 347648 675840 -297984 -227840 1293312
4955H26368M72064K29888g5776A63328J423872o66112J765376q44800o35904m82816
$$ 826368 1298432 1528320 -75776 163328 1587200 921088 2686464 1841664 1205760 722944
4945G22944Q93952l11296E96992R13408M53120n18656d1984H89856J27488L81952
$$ 722944 1616896 1305600 596992 1510400 1963520 1444864 -41984 889856 1017344 1399296
4935A399296o52288K08384k63680K57024R5232J37216M02944l69664l39968J077760
$$ 1399296 747008 955392 691712 948736 1043968 1181184 1584128 1214464 874496 1952256
4925A952256q21760l66080J3312J361920E96480P50080l33824D79232R97376R7280
$$ 1952256 1130496 764416 777728 2139648 596480 1346560 1012736 479232 1476608 1573888
4915A573888G12704Q43776b35520G52128j33120N35040j68960l35360N34016K14528
$$ 1573888 712704 1556480 -235520 752128 619008 1154048 985088 649728 1183744 1398272
4905A398272k51904m9664B32960J235456D56704Q24320E79584Q22272n73440k58048
$$ 1398272 1146368 1096704 232960 1468416 456704 1281024 579584 1401856 828416 570368
4895E70368J210368D32128K006016A026048k10944O22080N7344J20320G36768
$$ 570368 1780736 432128 2438144 1026048 815104 1437184 1494528 1614848 736768
4885B28864J563648q04352Q58624F91200q3456J513984H09472J528832F54848
$$ 228864 1792512 988160 1846784 691200 607744 2121728 809472 2338304 654848
4875I29792K19648P54688I03168j33120Q18688m23424F3488J883136p64416j88416
$$ 929792 1149440 1904128 903168 770048 1588736 1165312 63488 1946624 1182208 993792
4865I93792p3216j99680Q3968K25280r9840Q67840n98528L98848k2528o16960
$$ 993792 920576 720896 804864 1030144 930304 1798144 1199616 1598464 1575936 958976
4855I58976M89984r6256K91328m79744m4544l27680J016320j82272N7344o84032
$$ 958976 1448960 1352704 1644032 1164288 1119744 792064 1808384 1626112 1683456 999424
4845I99424K91328C26656J555456k19648m34176O52288M60800A062912R08288
$$ 999424 1290752 326656 1882112 1662464 1228288 1880576 2341376 1062912 1971200
4836A971200L34336n80096P5776m21888J25952J81248j28000N68832r40544o656
$$ 1971200 2305536 1725440 1801216 1379328 1505280 1686528 1558528 2127360 1186816 1180160
4826A180160O5024J081856k21696r0112J28512l98336q48384J574912N9392A207296
$$ 1180160 1245184 2327040 2105344 2015232 2143744 1745408 897024 2471936 2531328 1207296
4815A177600K82112J347072j284608j14688O93760K79040L80416j50528r11872
$$ 1177600 1459712 2806784 1522176 1407488 2101248 2380288 2760704 2610176 1698304
4806A698304L97312m56704Q24320p57248M7616Q75520l92192R4208j063936N94432
$$ 1698304 2095616 1638912 2463232 1705984 1753600 2629120 2236928 2331136 1267200 1861632
4796A861632j14176L45088l03104N42720j132032N19680n18144J040384j35168
$$ 1861632 1747456 2092544 1789440 2332160 1200128 1719808 1201664 2242048 2106880
4787B106880m50560L9936Q2944M50560A041408J972736A131008m38272K381312
$$ 2106880 1656320 1696256 1779200 2229760 1041408 3014144 1131008 692736 3074048
4778C074048G99232M8128Q17664l6352K83648j60768G62368M94080N55520K45248
$$ 3074048 799232 847360 1665024 1628672 1912320 1751552 762368 1256448 1811968 2057216
4768B057216m7616p88480N69344l23072j92000M68992p31648J409536q37120l36896
$$ 2057216 2009600 1221120 1790464 1467392 1275392 1744384 1012736 2422272 1585152 1248256
4758A248256M7104L08736F30272J54112J77664A33632Q16640M8128J081856p40352
$$ 1248256 1295360 1604096 630272 784384 962048 133632 950272 998400 2080256 1339904
4748A339904M6080q4992K20672R75360j058304Q3968D17792J295872p65952D03968
$$ 1339904 1385984 1300992 1521664 2497024 1438720 1522688 417792 1713664 947712 403968
4737G83872R95840L0208o44608K32448J049088j067520Q14080j64352L59936K71872
$$ 783872 1779712 1809920 1165312 1397760 2446848 1379328 2193408 2029056 2388992 2660864
4727B660864L584n39648l52768m64896K58560L13344J24416J10592R0112P97696
$$ 2660864 2664448 2124800 1772032 1307136 1565696 1879040 2003456 2114048 2204160 3001856
4717C001856j245696J766912j118720K46272o24128G61344L44064J017856l18464
$$ 3001856 1756160 3523072 2404352 2650624 2026496 761344 1105408 2123264 1804800
4708A804800R1648l46112N13024n71904R64096m56192p49568N01760O00064M72576
$$ 1804800 1896448 1550336 2063360 1491456 2455552 1999360 1249792 1751552 2351616 2824192
4698B824192r13920J067008j070592m06528P69536M08576m89984K60096n01248
$$ 2824192 1910272 2977280 1906688 1500160 2269696 2678272 2188288 2448384 1947136
4689A947136L00032O32320N50912m66944m52608J115136m01920m83328k52416
$$ 1947136 2247168 2879488 3430400 2963456 2510848 3625984 3224064 2740736 2488320
4680B488320j25440O18496l66592j38752Q24320J30560j370624n46304N3248k13504
$$ 2488320 2362880 2981376 2614784 2476032 3300352 3430912 2060288 1513984 1567232 1353728
4670A353728K01728L584J177088m77184r80480J672192j010688J38240A008128
$$ 1353728 1555456 1559040 2736128 2258944 1278464 2950656 1939968 2078208 1008128
4660B395136p66976l584O41024k94912l97824n80608J497600A151488k15552J030144
$$ 2395136 1628160 1624576 2265600 1970688 1572864 992256 2489856 1151488 935936 1966080
4650A966080J32608M4032r46176R13408o05184l94240Q34560q65792D95104Q81152
$$ 1966080 2098688 2142720 1196544 2109952 1504768 1110528 1945088 1079296 495104 1376256
4640A376256l91680M24448o72256j72544K022400A225216K07360m08064J00352
$$ 1376256 984576 1409024 736768 564224 2586624 1225216 1432576 1024512 1124864
4631A124864M64384j39776C80928N58080M01920R14432j095168j71520J372672
$$ 1124864 1589248 1449472 380928 939008 1340928 2255360 1160192 988672 2361344
4622B361344r93792M50560P9360J99168r9328p81312N23264J90976J29024o73280
$$ 2361344 1367552 1818112 1897472 2096640 1997312 1216000 1739264 1930240 2059264 1385984
4612A385984R0112K53440k02240M51584k30912j67936k30400L96288l56352k12992
$$ 1385984 1476096 1729536 1527296 1978880 1747968 1580032 1349632 1745920 1389568 1176576
4602A176576k82624O02112P13216o50240J590272r39008K16064k46784M97664
$$ 1176576 893952 1496064 2209280 1559040 3149312 2210304 2426368 2179584 2677248
4593B677248J86368j7408J77664n80096k41664K50880Q704p80800N93408O64064
$$ 2677248 2863616 2846208 3023872 2443776 2202112 2452992 2461696 1680896 2274304 2938368
4583B938368j207296J090560j56672o56896K59584P20384m08576p17312K78528
$$ 2938368 1731072 2821632 2664960 2008064 2267648 2988032 2579456 1862144 2140672
4574B140672R10848A388032k93376J147904l86048J9968k36032j69472L30240
$$ 2140672 3051520 1388032 1094656 2242560 1856512 1876480 1640448 1470976 1801216
4565A801216m45440M16768P27552j032192J063424l23072r34912R62048A116672
$$ 1801216 1355776 1772544 2500096 1467904 2531328 2208256 1273344 2235392 1116672
4555A809920p78752N67296j32096n55520L64032J162240j135616R83552o23616
$$ 1809920 1031168 1598464 1466368 910848 1274880 2437120 1301504 2285056 1661440
4546A661440j93024o52288R29280n83168n14048M82304J053184o89664J444352
$$ 1661440 1468416 816128 1745408 1162240 648192 1130496 2183680 1494016 2938368
4537B938368A345024L33824N38624j13152L44064O13376o67136p1168N41696n42208
$$ 2938368 1345024 1678848 2217472 2104320 2448384 3061760 2394624 2323456 2865152 2322944
4527B322944n40160O13888M18304k11456O94784m17792j219584R85600k58560
$$ 2322944 1782784 2396672 2814976 2603520 3298304 2880512 1660928 2646528 2387968
4518B387968L90144K49856k68288K31424m82304p01440J028096N28896p25504
$$ 2387968 2778112 3027968 2759680 2991104 2508800 1807360 2835456 3364352 2638848
4509B638848j68448L13344K38592q99072m59264N92896P41376j250816L53280
$$ 2638848 2470400 2783744 3022336 2123264 1664000 2256896 2998272 1747456 2100736
4500B100736J011200m04480p15264J189376o656m17280K95424k71872r5744O09792
$$ 2100736 3111936 2707456 1992192 3181568 3174912 2757632 3053056 2781184 2685440 3295232
4490C295232K04800K9696m37248k99008Q58624p77728L67616j36704K65216O16960
$$ 3295232 3500032 3529728 3092480 2793472 3652096 2874368 3241984 3105280 3370496 3987456
4480C987456j88416o5536K39104R68192q43776M12160L22048k56512J40800q42240
$$ 3987456 3799040 3733504 3972608 4940800 4097024 4509184 4831232 4574720 4715520 3873280
4470C873280K0992L22048J49504j51040J397248j633792m67968P79264j426944
$$ 3873280 3894272 4216320 4365824 4214784 5612032 3978240 3510272 4289536 2862592
4461B862592J190400m08576P42400j235456m6080J75104M34176K90304j411584
$$ 2862592 4052992 3644416 4386816 3151360 3105280 3280384 3714560 4004864 2593280
4452B593280M62336M48512j440768J132032K2016r15968N69856o08768m14720
$$ 2593280 3055616 3504128 2063360 3195392 3217408 2301440 2871296 2262528 1847808
4443A847808L01056l96800J89440O63040n6320j230848K71872k6112R83552j053184
$$ 1847808 2148864 1752064 1941504 2604544 2548224 1317376 1589248 1563136 2546688 1493504
4433A493504L09248K46784Q36608M29056p90528L68640j362432R97376J374208
$$ 1493504 1802752 2049536 2886144 3315200 2524672 2893312 1530880 2528256 3902464
4424C902464p28576n55008Q62720r40544J41824p61344Q44288L53280o17984k11456
$$ 3902464 3173888 2618880 3481600 2541056 2682880 1921536 2765824 3119104 2501120 2289664
4414B289664j020416J125888O92736p15264l26144p27040Q11520J59744j69984
$$ 2289664 1269248 2395136 3087872 2372608 2046464 1319424 2130944 2290688 2120704
4405B120704l67616Q20736n94432L8400Q54016j282560J617408A488384K301440
$$ 2120704 1753088 2573824 1979392 2017792 2871808 1589248 3206656 1488384 3789824
4396C789824A695744N86752j65888j29024r2672L42016k6624p1680p63392K065408
$$ 3789824 1695744 2282496 2116608 1987584 1894912 2236928 2210304 2138624 1375232 3440640
4386C440640A355776K6112J029632k72896I37984J268736J66912j030656J93536
$$ 3440640 1355776 1381888 2411520 2138624 937984 2206720 2373632 1342976 1536512
4377A536512J44384L55328l6352R32352l45600n60640k4576m3520m51072k81088
$$ 1536512 1680896 2036224 1999872 2932224 2586624 2025984 2001408 1957888 1506816 1225728
4367A225728N91360k85696M65920O0928N85728o45632m93056q9088N89824l2768
$$ 1225728 1817088 1531392 1997312 2058240 2643968 1998336 1505280 1416192 2006016 1973248
4357A973248O74304q96512J273856p52128K76992l54304J9968l73248Q5504Q66304
$$ 1973248 2647552 1751040 3024896 2272768 2549760 2195456 2215424 1842176 1927680 2793984
4347B793984r82016K42176k21696Q8064P25504q36096k81088P59296p1680J50016
$$ 2793984 1811968 2054144 1832448 1920512 2646016 1809920 1528832 2288128 2216448 2366464
4337B366464o8096l54304l73760R41568H49920J030656k4064K93376n40160O53824
$$ 2366464 2298368 1944064 1570304 2511872 849920 1880576 1856512 2149888 1609728 2263552
4327B263552n04832J155584A428992n09440J794048l3280j041408N06880L90656
$$ 2263552 1758720 2914304 1428992 919552 2713600 2680320 1638912 2145792 2536448
4318B536448j68960n50400P50592A204224P95136r26720J637376p17312o8096
$$ 2536448 2367488 1817088 2567680 1204224 1999360 1072640 2710016 1992704 1924608
4309A924608j65888K54464m66432J16224o90176J344512o70720M32640K5600K27840
$$ 1924608 1758720 2013184 1546752 1662976 972800 2317312 1646592 2079232 2104832 2332672
4299B332672P45984p92576L04128k67776K19136j36192q10496m92544J128960
$$ 2332672 3078656 2286080 2590208 2322432 2541568 2405376 1594880 1102336 2231296
4290B231296k49344k41664O27712K06848n38624M63872k82624k12992H03840J146368
$$ 2231296 1981952 1740288 2368000 2574848 2036224 2500096 2217472 2004480 803840 1950208
4280A950208j25952k3040N47328L26656j140224J585152A420288l89632J419264
$$ 1950208 1824256 1801216 2348544 2675200 1534976 3120128 1420288 1030656 2449920
4271B449920p34208O72256m83328M68992m07040L71200P58272j378304J085440
$$ 2449920 1715712 2387968 1904640 2373632 1966592 2337792 3096064 1717760 2803200
4262B803200J47456m56192M97152l40480Q20224A353216R03680K90304P2704P2192
$$ 2803200 2950656 2494464 2991616 2651136 3471360 1353216 2256896 2547200 2619904 2692096
4252B692096O43584j253888O70720K25280O48704l37920M59776O66112r36960
$$ 2692096 3335680 2081792 2752512 2977792 3626496 3288576 3748352 4414464 3477504
4243C477504P17824m21888K38080o27712j049600J19808J405952j370624O54848
$$ 3477504 4195328 3773440 4011520 3383808 2334208 2454016 3859968 2489344 3144192
4234C144192p1680l67616N51424N11488j430016K53440k39104R47200l87584N4272
$$ 3144192 3072512 2704896 3256320 3767808 2337792 2591232 2352128 3299328 2911744 2966016
4224B966016r36448J431040j251840j98656Q19712p34208K85696N06368J81248
$$ 2966016 2029568 3460608 2208768 2010112 2829824 2095616 2381312 2887680 3068928
4215C068928j05472J10080N16096q09984L81952j31072J39776O00064j65376M21888
$$ 3068928 2963456 3073536 3589632 2779648 3161600 3030528 3170304 3770368 3604992 4026880
4205D026880j8944l71200r91232L51744J270272J416192j539584M85376J39776
$$ 4026880 4007936 3636736 2645504 2997248 4267520 5683712 4144128 4629504 4769280
4196D769280O3488n84192r3184j81248j95072J158144o92224L25632J143808p2192
$$ 4769280 4832768 4248576 4155392 3974144 3779072 4937216 4244992 4570624 5714432 5642240
4186E642240j076736M24448N37088R37472k72384Q24320r75872J172992J99168
$$ 5642240 4565504 4989952 5527040 6464512 6192128 7016448 6040576 7213568 7412736
4177G412736k26816J17248k47808l20000j97120N57568J308160l70688l24608
$$ 7412736 7185920 7303168 7055360 6735360 6538240 7095808 8403968 8033280 7708672
4168G708672K23232L20000k00192J94048j54112L95264Q04864n06368J272320
$$ 7708672 7931904 8251904 8051712 8245760 8091648 8486912 9291776 8785408 10057728
4159A0057728M93568J07520R45152l68640R43104M23424K0480m4032r92256N99552
$$ 10057728 10551296 10658816 11603968 11235328 12178432 12601856 12622336 12578304 11586048 12185600
4149A2185600k13504M99712L28192K07872k05824K75456M17280K17088J88416
$$ 12185600 11972096 12471808 12800000 13007872 12802048 13077504 13494784 13711872 13900288
4140A3900288J588224P38816J140736J697280J893888n82656J318400l06176l293696
$$ 13900288 15488512 16227328 17368064 19065344 20959232 20376576 21694976 21388800 18095104
4131A8095104q52480k158592k555392k809344j175040j371648o61504j565184
$$ 18095104 17242624 15084032 12528640 9719296 8544256 7172608 6511104 4945920
4123D945920O54336p02976o47680J006592j92512o56896J47456J4848m68480j174016
$$ 4945920 5600256 4897280 4249600 5256192 5063680 4406784 4554240 4569088 4100608 2926592
4113B926592J090560L92704l73248J04448q28928k23744M4032J488896p91040
$$ 2926592 4017152 4409856 4036608 4141056 3312128 3088384 3132416 4621312 3830272
4104C830272Q6016j681408K373120p49568j106432J037824N02784J03424K431488
$$ 3830272 3916288 2234880 4608000 3858432 2752000 3789824 4292608 4396032 6827520
4095F827520C268096L09760j28000J99680m40832L82976j132032n1712J099776
$$ 6827520 3268096 3577856 3449856 3649536 3208704 3591680 2459648 2407936 3507712
4086C507712k73408o70720J174528n66272l31776N99552m94592n8880J17760J019904
$$ 3507712 3234304 2563584 3738112 3171840 2840064 3439616 2945024 2886144 3003904 4023808
4076D023808j672192N66272N13536j90976j58720N46304J408512p00416p14240
$$ 4023808 2351616 2917888 3431424 3240448 3081728 3628032 5036544 4336128 3621888
4067C621888q23296O89152Q78592j219072M11136n8880p5264N87776k90816m00384
$$ 3621888 2798592 3487744 4366336 3147264 3558400 3499520 3424256 4012032 3721216 3320832
4057C320832p87968J015808r32864P98720k59584J95584o50752M16768L3280m64384
$$ 3320832 2532864 3548672 2615808 3414528 3154944 3350528 2699776 3116544 3149824 2685440
4047B685440J00864l89120m50560J298944p16800j01376r45152R04704O97344
$$ 2685440 2786304 2397184 1946624 3245568 2528768 2427392 1482240 2386944 3084288
4038C084288l4816M83328j176576j89952L92192K31424q4480j32096O96320o38464
$$ 3084288 3049472 3532800 2356224 2166272 2558464 2789888 2705408 2573312 3269632 2631168
4028B631168P82848j032192m20864P57760K7136l29728J03424K58560p63904O85056
$$ 2631168 3414016 2381824 1960960 2718720 2745856 2416128 2519552 2778112 2014208 2699264
4018B699264R6768O42560p17824L68128j319936J660416j137152O84544P04000
$$ 2699264 2796032 3438592 2720768 3088896 1768960 3429376 2292224 2976768 3680768
4009C680768j476096m096J104384j044480P64416Q97024P6800j416192O4512Q27904
$$ 3680768 2204672 2200576 3304960 2260480 3024896 3921920 3998720 2582528 2647040 3474944
3999C474944l48160k86208k20160m57728O48704o41536n23264J485312o41024
$$ 3474944 3126784 2840576 2620416 2162688 2811392 2169856 1646592 3131904 2490880
3990B490880L8400j18784o35904J369088j293312N94432n4784l74784J123328
$$ 2490880 2529280 2410496 1774592 3143680 1850368 2444800 2390016 2015232 3138560
3981C138560n22240J072128q66304J40288q36096j60768P65440l45088R0112k86720
$$ 3138560 2616320 3688448 2822144 2962432 2126336 1965568 2731008 2385920 2476032 2189312
3971B189312O42048n73952M95104O7072N2736j427968K06336J250816Q4992o78400
$$ 2189312 2831360 2257408 2752512 2819584 2872320 1444352 1650688 2901504 2986496 2308096
3961B308096J88416m17792J096192L18464m75648n42720J5872M77696O90176m46976
$$ 2308096 2496512 2078720 3174912 3493376 3017728 2475008 2490880 2968576 3658752 3211776
3951C211776m96640o05184M73088J31584Q25856k28352j122816K36032O00576
$$ 3211776 2715136 2109952 2583040 2714624 3540480 3312128 2189312 2425344 3025920
3942C025920M1984m81280L76832m07040n08928K52928O5536Q01280m74624r48736
$$ 3025920 3067904 2586624 2963456 2556416 2047488 2300416 2365952 3167232 2692608 1743872
3932A743872J614848j59232L88096j573888O36416P680N72928j080832L2256J760768
$$ 1743872 3358720 3199488 3587584 2013696 2650112 2657792 3230720 2149888 2182144 3942912
3922C942912j220608l75808Q11008N87776l30752r34400J425920n10976p91552
$$ 3942912 2722304 2346496 3157504 3745280 3414528 2480128 3906048 3395072 2603520
3913B603520O4000n2224j50528J222656j213952P93600o21056q7552K45248Q88320
$$ 2603520 2667520 2615296 2464768 3687424 2473472 3267072 2646016 2558464 2803712 3692032
3903C692032j335808L79904l76832J316864q98048M93056q43776P22944n4272
$$ 3692032 2356224 2736128 2359296 3676160 2778112 3271168 2427392 3150336 3096064
3894C096064p1680r09824J38240j80736Q46848N55520m77696J1264J000448o50752
$$ 3096064 3024384 2114560 2252800 2072064 2918912 3474432 2996736 3008000 4008448 3357696
3884C357696o14400N37088N56032j31072K38592j012224P24480M09088n11488
$$ 3357696 2743296 3280384 3836416 3705344 3943936 2931712 3656192 4065280 3553792
3875C553792l1232P15776o56896L25632o69184M51584L07200K03264M82816o47680
$$ 3553792 3522560 4238336 3581440 3907072 3237888 3689472 3996672 4199936 4682752 4035072
3865D035072J092096J74080m67968J90464q30464K25280N08928J049088j129472
$$ 4035072 5127168 5301248 4833280 5023744 4193280 4418560 4927488 5976576 4847104
3856D847104%P55712m07552J217024p25504J50016k5600J052672j43872j8944
$$ 4847104 4847104 5602816 5195264 6412288 5686784 5836800 5811200 6863872 6720000 6701056
3846F701056P3216R23136q90880J168384p38816J497600O144Q69376J103872O22080
$$ 6701056 6774272 7697408 6806528 7974912 7236096 8733696 8739840 9609216 10713088 11335168
3836A1335168J232384O21568J037312O88640P86432M38272j15200O91200J105920
$$ 11335168 12567552 13189120 14226432 14915072 15701504 16139776 16024576 16715776 17821696
3827A7821696k91840J287168J113088q14080J489408L67616J510400M0960L88608
$$ 17821696 17529856 18817024 19930112 19116032 20605440 20973056 22483456 22524416 22913024
3818B2913024J482752k08384J880576K66240J342464J170944J784832J428480
$$ 22913024 24395776 24187392 26067968 26334208 27676672 28847616 30632448 32060928
3810C2060928r66144l288576m074496m858368k069504j556480l712000j788928
$$ 32060928 31094784 27806208 23731712 18873344 16803840 15247360 11535360 9746432
3802I746432J0752r96352j412608Q76032j285120J63328N83680k25792j89952
$$ 9746432 9757184 8760832 7348224 8224256 6939136 7102464 7686144 7460352 7270400
3793G270400r00608J191936q15104j10592j54624J71520o68672K09408k44736
$$ 7270400 6369792 7561728 6746624 6636032 6481408 6652928 5984256 6193664 5948928
3784E948928N33504L44064K77504O28736n07904L15392J080320p98720o51264
$$ 5948928 6482432 6826496 7104000 7732736 7224832 7540224 8620544 7821824 7170560
3775G170560P08096r64096K43712j352192N03808O50752L76832K74944r97376
$$ 7170560 7878656 6914560 7158272 5806080 6309888 6960640 7337472 7612416 6615040
3766F615040J262080j44896l57888o06720l43040Q84224j259520n9392J284096
$$ 6615040 7877120 7732224 7374336 6767616 6424576 7308800 6049280 5989888 7273984
3757G273984M56192q01792L56352k88768o656n30432J335808P68000O3488K057728
$$ 7273984 7730176 6928384 7284736 6995968 6989312 6458880 7794688 8562688 8626176 10683904
3747A0683904R28768J68960J127424j941504j686528j525248m47488J93024n01760
$$ 10683904 11612672 11781632 12909056 10967552 9281024 7755776 7308288 7501312 6999552
3738F999552n96480K32448n55008J540096j159680O26176l55328j278976Q73984
$$ 6999552 6403072 6635520 6080512 7620608 6460928 7087104 6731776 5452800 6326784
3729F326784O57920K11968k62144L53280o20032q28416K02240l85536L67104N12000
$$ 6326784 6984704 7196672 6934528 7287808 6667776 5839360 6041600 5656064 6023168 6535168
3719F535168l95264O62016n55520O56896p07072J164800P84896j722880m79744
$$ 6535168 6139904 6801920 6246400 6903296 6196224 7361024 8145920 6423040 5943296
3710E943296N19680j252352j89952N04832K58048q21760L65568O86592j006080
$$ 5943296 6462976 5210624 5020672 5525504 5783552 4961792 5327360 6013952 5007872
3701E007872m25984O6048Q92928n13024J91488N82144j623552J021440k66240
$$ 5007872 4581888 4647936 5540864 5027840 5219328 5801472 4177920 5199360 4933120
3692D933120K32960k5600j111552J382400o5024l49184N64736p14240N20704j470976
$$ 4933120 5166080 5140480 4028928 5411328 5346304 4997120 5561856 4847616 5368320 3897344
3682C897344M77696L34848j62304l47648J465344m61312M21888r47712O04160
$$ 3897344 4375040 4709888 4547584 4199936 5665280 5203968 5625856 4678144 5282304
3673E282304L57376Q9600l33824K02240m51072O51264j048576r6768J290752l86048
$$ 5282304 5639680 5729280 5395456 5597696 5146624 5797888 4749312 4652544 5943296 5557248
3663E557248L7888j448960J90976O85568l75808R03168j340928J269760L2256
$$ 5557248 5595136 4146176 4337152 5022720 4646912 5550080 4209152 5478912 5511168
3654E511168K048j51552j71520N19680q9088m53632J04448J2800k4576o90176
$$ 5511168 5513216 5361664 5190144 5709824 5620736 5167104 5271552 5284352 5259776 4569600
3644D569600R34400k47808O01088P3216k95424k81600k64704J272320p28064k86720
$$ 4569600 5504000 5256192 5857280 5930496 5635072 5353472 5088768 6361088 5633024 5346304
3634E346304Q38656M96128q51456Q62208o71232l25120m39296O25664k38080O34880
$$ 5346304 6184960 6681088 5829632 6691840 6020608 5695488 5256192 5881856 5643776 6278656
3624F278656N25824l09248k3552J321472q06912l00032j415680N71904J380352
$$ 6278656 6804480 6495232 6471680 7793152 6986240 6686208 5270528 5842432 7222784
3615G222784k84672j595392K408960j20832k38592r01120O37952q5504L33824
$$ 7222784 6938112 5342720 7751680 7630848 7392256 6491136 7129088 7043584 7377408
3606G377408q92416O37952n39648L36896r21088J093632j667584K079232O3488
$$ 7377408 6484992 7122944 6583296 6920192 5999104 7092736 5425152 7504384 7567872
3597G567872k28352O77888l00544n86752J07008j13664O53824q36096J135616
$$ 7567872 7339520 8017408 7716864 7130112 7237120 7123456 7777280 6941184 8076800
3588H076800j82272k07872m1472M42880m75136J346560j16736p65440K25792O144
$$ 8076800 7894528 7686656 7645184 8088064 7612928 8959488 8842752 8077312 8303104 8309248
3578H309248j02912q82688J392128L32288m01920l52768J704960p86432J24416
$$ 8309248 8206336 7323648 8715776 9048064 8646144 8293376 9998336 9211904 9336320
3569I336320M44928O02624j77152o88640O98368J61792Q68352O25152r35424n96992
$$ 9336320 9781248 10383872 10206720 9518080 10216448 10378240 11246592 11871744 10936320 10339328
3559A0339328J243648K83648R96352J036800n51424N98016q43776J966080j13152
$$ 10339328 11582976 11866624 12862976 13899776 13348352 13946368 13102592 15068672 14955520
3550A4955520m28032O60992M85888K4064N88800J027584K68288Q06400J243136
$$ 14955520 14527488 15188480 15674368 15698432 16287232 17314816 17583104 18389504 19632640
3541A9632640N5808j15200J553920j61792J534464M83328J026560o73792J432576
$$ 19632640 19688448 19573248 21127168 20965376 22499840 22983168 24009728 23335936 24768512
3532B4768512J103872P14240J670144o9632J570304J341952J568768J957376J756672
$$ 24768512 25872384 26586624 28256768 28187136 29757440 31099392 32668160 34625536 36382208
3523C6382208P26528K791936K396160K934784L143680K233856L860480M001792
$$ 36382208 37108736 39900672 42296832 45231616 48375296 50609152 54469632 58471424
3515E8471424N493760P621120N702144P670784P861248P442432Q328704P830528
$$ 58471424 63965184 71586304 77288448 84959232 92820480 100262912 108591616 116422144
3507A16422144Q391168J0861056R571328J2166656J2361216J5050240J6529408
$$ 116422144 124813312 135674368 145245696 157412352 169773568 184823808 201353216
3500B01353216J9741696K1622784K7070464L2274944L9393280M9615872O5174016
$$ 201353216 221094912 242717696 269788160 302063104 341456384 391072256 456246272
3493D56246272Q9881088J23715584J77232384K38584832K66050560J81450752
$$ 456246272 546127360 669842944 847075328 1085660160 1351710720 1533161472
3487A533161472k3657472k18480128k83930624k48192512j90335488j38036224
$$ 1533161472 1509504000 1291023872 1007093248 758900736 568565248 430529024
3481D30529024r7999360o8009984m8634368l5037696k6804224j8924032j4758400
$$ 430529024 332529664 264519680 215885312 180847616 154043392 135119360 120360960
3474A20360960j2871680r328640r055744p410176n901312m953088m917760l429888
$$ 120360960 107489280 98160640 89104896 81694720 75793408 70840320 65922560 62492672
3466F2492672m255232l204096j382912k710528k328064l150848j846272k160640
$$ 62492672 58237440 55033344 53650432 50939904 48611840 45460992 43614720 41454080
3458D1454080k283520j119232r67680j850880p70048j161216p90528j516032j096704
$$ 41454080 39170560 38051328 37083648 35232768 34462720 33301504 32510976 30994944 29898240
3449B9898240K4064j503744r86112p96160r63072n42208r70752r26720j183232
$$ 29898240 29922304 28418560 27432448 26636288 25673216 25131008 24160256 23233536 22050304
3440B2050304L18976K93888j448960K78016j906176O92224j643520p90016R8304
$$ 22050304 22369280 22663168 21214208 21492224 19586048 20278272 18634752 17844736 17943040
3431A7943040L28704k98496j360384M9664K17088n95968k29376J16736q88832
$$ 17943040 18271744 17973248 16612864 16662528 16879616 16283648 16054272 16171008 15282176
3422A5282176r7792j008128q01792L38432P92576q42752N67808M28032j780736
$$ 15282176 15184384 14176256 13374464 13712896 14505472 13662720 14230528 14658560 12877824
3413A2877824Q50432r78944l88096N632K9184J21344K4064l75296o49728N52960
$$ 12877824 13728256 12749312 12361216 12366848 12396032 12517376 12541440 12166144 11516416 12069376
3403A2069376m61824j13664L32800j280512N73952r99936J376768l53280r02656
$$ 12069376 11607552 11493888 11826688 10546176 11120128 10120192 11496960 11143680 10241024
3394A0241024M06528p68000J6384o20544O25664r55392J038336q83200J028096
$$ 10241024 10647552 9879552 9895936 9275392 9901056 8945664 9984000 9100800 10128896
3385A0128896j161728o25152K87232l05664l4816l79392L68128J1264j46432n91872
$$ 10128896 8967168 8342016 8629248 8323584 8288768 7909376 8277504 8288768 8142336 7550464
3375G550464L49696L20000n68832L72224R2160j447936K46272L72224k77504o6048
$$ 7550464 7900160 8220160 7651328 8023552 8115712 6667776 6914048 7286272 7008768 6942720
3365F942720l01568Q64256j450496Q33024M95616r25184n87264O70720k86720
$$ 6942720 6641152 7505408 6054912 6887936 7383552 6458368 5871104 6541824 6255104
3356F255104n04832L88096Q45824q57600K11968m02944k60096M14720J108992
$$ 6255104 5750272 6138368 6984192 6126592 6338560 5935616 5675520 6090240 7199232
3347G199232j809408P09632n94432J271296j226752m18304N36064j47456m39296
$$ 7199232 5389824 6099456 5505024 6776320 5549568 5131264 5667328 5519872 5080576
3338E080576J453056j009152l65056P43936r34912Q45312M66944O08256j28000
$$ 5080576 6533632 5524480 5159424 5903360 4968448 5813760 6280704 6888960 6760960
3329F760960m8640m97664j89440l88608q32512P15776j133568j1264J047040J84832
$$ 6760960 6712320 6214656 6025216 5636608 4804096 5519872 4386304 4375040 5422080 5606912
3319E606912o22080q90368J43872O98368L51232m7104n7344m97152k65216N0176
$$ 5606912 4984832 4094464 4238336 4936704 5287936 5240832 5183488 4686336 4421120 4471296
3309D471296J153024j910272M66432J298432K32960j378304Q50944n88288M23424
$$ 4471296 5624320 3714048 4180480 5478912 5711872 4333568 5184512 4596224 5019648
3300E019648J127424J814528p0144M06528J536L90656k12992p56224n9392k48832
$$ 5019648 6147072 7961600 7891456 8297984 8299520 8690176 8477184 7720960 7661568 7412736
3290G412736j854464K18112r05728K93888J0752J48480j91488j388032J97120
$$ 7412736 5558272 5776384 4870656 5164544 5175296 5323776 5132288 3744256 3941376
3281C941376O91200m34176M77696o90176J133056K67264j303040p71584k53440
$$ 3941376 4632576 4198400 4676096 3985920 5118976 5386240 4083200 3311616 3058176
3272C058176J922048p24480j05472L7376J251328p58272m01408J79712m24448
$$ 3058176 4980224 4255744 4150272 4187648 5438976 4680704 4279296 4459008 4034560
3263D034560l35872J134080n02272j95072m63872O55360m6592j47456O73280q32000
$$ 4034560 3698688 4832768 4330496 4135424 3671552 4326912 4280320 4132864 4806144 3974144
3253C974144M608J063936M24448m69504O2464k63168n5296M44928r19040N69856
$$ 3974144 3978752 5042688 5467136 4997632 5060096 4796928 4741632 5186560 4267520 4837376
3243D837376o35392J244160P21920j041920M34176J177088l98848o87104J997824
$$ 4837376 4201984 5446144 6168064 5126144 5560320 6737408 6338560 5651456 7649280
3234G649280r75360J157120N79584R728L16928N95456N61152M25472Q5504O15424
$$ 7649280 6673920 7831040 8410624 8420352 8737280 9332736 9893888 10319360 10404864 11020288
3224A1020288m73600L13344P58784J522688o656J264128L32288O5536n33504Q46336
$$ 11020288 10546688 10860032 11618816 13141504 13134848 14398976 14731264 14796800 14263296 15109632
3214A5109632P88480o08256N08928L24608m42368p90528K080768j580544L09760
$$ 15109632 15898112 15289856 15798784 16123392 15681024 14890496 16971264 15390720 15700480
3205A5700480J15712N70880l29216m41344k70336L70688k99520L63008O71744
$$ 15700480 15816192 16387072 16057856 15616512 15346176 15716864 15417344 15780352 16452096
3196A6452096j67936n31456m43392J156608k02752O75328J093632j78688O67648
$$ 16452096 16284160 15752704 15309312 16465920 16263168 16938496 18032128 17853440 18521088
3187A8521088K9184L44064J292800j33632k99008J249280j43872J302016K78528
$$ 18521088 18550272 18894336 20187136 20053504 19754496 21003776 20859904 22161920 22440448
3178B2440448M91008O5536M20864N38112K88768Q77568O07744N55008N05344J251328
$$ 22440448 22931456 22996992 23417856 23955968 24244736 25122304 25730048 26285056 26790400 28041728
3168B8041728N30432K312192K02240k57536q57088j05472m462592l089408k716672
$$ 28041728 28572160 30884352 31086592 30829056 29971968 29866496 25403904 22314496 19597824
3159A9597824k922496k305536j588736L65568j263104j436160m46976q33024J250816
$$ 19597824 16675328 14369792 12781056 13146624 11883520 10447360 10000384 9167360 10418176
3150A0418176m94592k52416r1648J13152r96864k27328K93888k60608L9424k70848
$$ 10418176 9923584 9671168 9579520 9692672 8695808 8468480 8762368 8501760 8541184 8270336
3140H270336n48864m85888N36064L99872j64352l33824P9872r45152p0656L16416
$$ 8270336 7721472 7235584 7771648 8171520 8007168 7673344 7753216 6808064 6737408 7053824
3130G053824J70496O88128P32160j284096J66400M65920K14528r53856j23904
$$ 7053824 7224320 7912448 8644608 7360512 7526912 7992832 8207360 7253504 7129600
3121G129600l22048l49184Q47872n3760j07520j015296p1168M14720q52992M24448
$$ 7129600 6807552 6458368 7306240 7252480 7144960 6129664 6058496 6473216 5620224 6044672
3111F044672J420288j443840J60768K35520J7920j88928j131008J707008M20352
$$ 6044672 7464960 6021120 6181888 6417408 6435328 6246400 5115392 6822400 7242752
3102G242752k54976o41536j99168P8848J369600k092032L09760J200128j573888
$$ 7242752 6987776 6346240 6147072 6225920 7595520 5503488 5813248 7013376 5439488
3093E439488M95616Q49920P6288k83136q192p680R56416J71520j13664L19488
$$ 5439488 5935104 6785024 6861312 6578176 6569984 6562304 7518720 7690240 7576576 7896064
3083G896064k99008J180160r58976Q4480k12480J465856j658880J659392O74816
$$ 7896064 7597056 8777216 7818240 7902720 7690240 9156096 7497216 9156608 9831424
3074I831424M42368J309184R20064L474432N190656M978688k860032j149952K251264
$$ 9831424 10273792 11582976 12503040 15977472 21168128 26146816 23286784 22136832 24388096
3065B4388096k115072p306240l333120l450880m0448r29792o60992N04832o78400
$$ 24388096 22273024 14966784 11633664 8182784 8142336 7212544 6551552 7056384 6377984
3056F377984k06848j52064r4720l99360k51904N99040j111552P04512k17088r48736
$$ 6377984 6171136 6019072 5924352 5524992 5273088 5872128 4760576 5465088 5248000 4299264
3046D299264J123840O62528j968640J058816M24448p16800q8576m41856J033728
$$ 4299264 5423104 6085632 4116992 5175808 5600256 4883456 4794880 4353024 5386752
3037E386752k48320j20832q59648J092608l42016j085952J132544M25472J60768
$$ 5386752 5138432 5017600 4157952 5250560 4908544 3822592 4955136 5380608 5541376
3028E541376k71872p10144L77344k24256R2672m8128K95424p8336j062912J222656
$$ 5541376 5269504 4559360 4936704 4712448 4805120 4756992 5052416 4974080 3911168 5133824
3018E133824R1136o09280m25984P98720n9392k71360N81632n08928L10784p94624
$$ 5133824 5224960 4615680 4189696 4988416 4929024 4657664 5239296 4730368 5041152 4246528
3008D246528k30912R46688O8608j219072N120J5872M94080o59456L79392R14944
$$ 4246528 4015616 4962304 5030912 3811840 3816960 3832832 4326912 3667456 4046848 4961792
2998D961792n09952O0928J90976n16608o19008K231296k250240J383936p60832
$$ 4961792 4451840 4512768 4703744 4187136 3568128 5799424 3549184 4933120 4172288
2989D172288M44416r6768p4240J1264r72800J091584J42848o76352k96960n17632
$$ 4172288 4616704 4519936 4445696 4456960 3484160 4575744 4718592 4042240 3745280 3227648
2979C227648J790976M27008j032192N03808j101312J335808q192n12512N53472
$$ 3227648 5018624 5445632 4413440 4917248 3815936 5151744 5143552 4631040 5184512
2970E184512j79712n94944N72928q1920k88768k35520M70528q76544K08896J694720
$$ 5184512 5004800 4409856 4982784 4900864 4612096 4376576 4847104 3970560 4179456 5874176
2960E874176o45632o95808m4032L30240P1168n24288o9632K35520k00704R57440
$$ 5874176 5228544 4532736 4488704 4818944 4890112 4365824 4296192 4531712 4331008 5288448
2950E288448m48000p23456M25984O78400m19840l57888O9120k61632M21888m58752
$$ 5288448 4840448 4116992 4542976 5221376 4801536 4443648 4512768 4251136 4673024 4214272
2940D214272K53952n47328J246208k23744n63712k44736N76000o81472L1744J211904
$$ 4214272 4468224 3920896 5167104 4943360 4379648 4134912 4710912 4029440 4061184 5273088
2930E273088j609216J959936j710592J620992p33184j26976q45312J015296j15200
$$ 5273088 3663872 5623808 3913216 5534208 4801024 4674048 3828736 4844032 4728832
2921D728832N9904K10432L9936l42016m1984J87392o05184J233408j2288j77664
$$ 4728832 4788736 4999168 5039104 4697088 4655104 4842496 4237312 5470720 5458432 5280768
2911E280768q48896O81472r9328j040384P17312j87392o65088Q71424J106432
$$ 5280768 4431872 5113344 5014016 3973632 4690944 4503552 3838464 4709888 5816320
2902E816320o69184J461760o4000p15776L67616p16288l15904K45248J168384
$$ 5816320 5147136 6608896 6544896 5829120 6196736 5480448 5164544 5409792 6578176
2893F578176j497600p78752%j99168J304064n26848L82464p2704L02592R28256
$$ 6578176 5080576 4301824 4301824 4102656 5406720 4879872 5262336 5189632 5492224 6420480
2883F420480p71072K08896P5264o4000J04448J91488j317376K301952o48192J028608
$$ 6420480 5649408 5858304 5933568 5869568 5974016 6165504 4848128 7150080 6501888 7530496
2873G530496o59968L36896J315840J060864m14208J2800K033664n9904Q81152
$$ 7530496 6870528 7207424 8523264 9584128 9169920 9182720 11216384 11156480 12037632
2864A2037632K26816R78432l37408J276416J589248o11840Q31488J198592L71200
$$ 12037632 12264448 13242880 12905472 14181888 15771136 15159296 15990784 17189376 17560576
2855A7560576R65120J528320L00032O119936R828864J3417984k881024j4068736
$$ 17560576 18525696 20054016 20354048 26473984 36302848 49720832 46839808 32771072
2847C2771072n953536k468352k66752P60320R10336n46304Q16640J84832k759680
$$ 32771072 26817536 24349184 24082432 24842752 25753088 25206784 26023424 26208256 23448576
2838B3448576j880064k985472k405888k887168j672192j451008o14912j749504
$$ 23448576 21568512 18583040 16177152 13289984 11617792 10166784 9551872 7802368
2830G802368J21856J37728j75104p69536K21184j120256m22400R9328K09408k9696
$$ 7802368 7924224 8061952 7886848 7117312 7338496 6218240 5795840 5895168 6104576 6074880
2820F074880o85568O29248n21728r9840O90688j175040N97504J460736r98400
$$ 6074880 5389312 6018560 5496832 5396992 6087680 4912640 5510144 6970880 5972480
2811E972480L67104J44896j242112O11840j164800O33344J39264K16064o85056
$$ 5972480 6339584 6484480 5242368 5854208 4689408 5322752 5462016 5678080 4993024
2802D993024j22880o23104k81088K95936Q94464L91680n57568m34176R72800k58560
$$ 4993024 4870144 4247040 3965952 4261888 5156352 5548032 4990464 4556288 5529088 5270528
2792E270528p21408M02432m38784O68672J536r7792k05824L29728j80224K88768
$$ 5270528 4549120 4951552 4512768 5181440 5182976 5085184 4879360 5209088 5028864 5317632
2782E317632J280000n98528n79584N05344m80256L28704O88640R11360j003520
$$ 5317632 6597632 5999104 5419520 5924864 5444608 5773312 6461952 7373312 6369792
2773F369792r0624J894912m41344M84864M81792j55136k62144J534464R16992
$$ 6369792 6279168 8174080 7732736 8217600 8699392 8544256 8282112 9816576 10733568
2764A0733568J327616L544064P960576J3716480J5544320q033792j6146944q870400
$$ 10733568 12061184 15605248 23565824 37282304 52826624 44792832 28645888 19775488
2756A9775488m154368j473536l71200K018304N672448J0539520P776768j0621952
$$ 19775488 15621120 14147584 13776384 15794688 21467136 32006656 39783424 29161472
2748B9161472q855040l118080k560000J449472J417728R589760J5027200J2535808
$$ 29161472 20306432 17188352 14628352 16077824 17495552 27085312 42112512 54648320
2740E4648320j6763904j4786048n157888l868160N01760K01728O167552Q903680
$$ 54648320 37884416 23098368 17940480 14072320 14574080 14775808 20943360 29847040
2732B9847040P231488r970688j0826240m434432k291200J561600r25696J089024
$$ 29847040 37078528 27107840 16281600 11847168 9555968 11117568 10191872 11280896
2724A1280896O146560L564544n835264m702208j381888k127872n28384j085440
$$ 11280896 17427456 20992000 15156736 10454528 9072640 6944768 6416384 5330944
2716E330944N72928j780736O2976J199104P0656l38432m81280J620480j515008
$$ 5330944 5903872 4123136 4186112 5385216 5455872 5117440 4636160 6256640 4741632
2707D741632L28192J274880j28000n18656M45952O8608K406912j291264L84512
$$ 4741632 5069824 6344704 6216704 5698048 6144000 6212608 8619520 7328256 7712768
2698G712768p97696j223680J085440j072128N25312o96320m01408K5088m07552
$$ 7712768 6915072 5691392 6776832 5704704 6230016 5533696 5132288 5157376 4749824
2689D749824r8816o45120L33824j61792q62720k21696j77152M98176o40000n06880
$$ 4749824 4651008 4005888 4339712 4177920 3315200 3093504 2916352 3414528 2774528 2267648
2679B267648K89792j80736J056768r72288Q29952l76320q39680M46464M47488
$$ 2267648 2557440 2376704 3433472 2461184 3291136 2914816 2075136 2521600 2969088
2670B969088m73088j66400J418752A824768J239040n51424p48032K582528j547776
$$ 2969088 2496000 2329600 3748352 1824768 3063808 2512384 1764352 4346880 2799104
2661B799104P21920k18624m83328l10784N87776q90368M25472N89824o88128m75136
$$ 2799104 3521024 3302400 2819072 2508288 3096064 2205696 2631168 3220992 2532864 2057728
2651B057728J368064q59648O64576m35200L9936K86208M93056q70912M28032j071104
$$ 2057728 3425792 2566144 3230720 2795520 2835456 3121664 3614720 2743808 3171840 2100736
2641B100736k91840N39648K81600K68288n93408N99040r35936N93920K97472j198592
$$ 2100736 1808896 2348544 2630144 2898432 2305024 2904064 1968128 2562048 2859520 1660928
2631A660928O80960K85696N4784L97824o19520O38464K3552n04832p75680M74112
$$ 1660928 2341888 2627584 2682368 3080192 2460672 3099136 3122688 2617856 1842176 2316288
2621B316288P30624l13856M19328o10816A225216J065984K28352m72576K201600
$$ 2316288 3046912 2733056 3152384 2541568 1225216 2291200 2519552 2046976 4248576
2612D248576j299968j118208Q21248k17088o62528L49184M9664J94560k09920
$$ 4248576 2948608 1830400 2651648 2434560 1772032 2121216 2170880 2365440 2155520
2603B155520J397760A679872J181184j35168p95648R50272q28928R13408j85856
$$ 2155520 3553280 1679872 2861056 2725888 1930240 2880512 2051584 2964992 2779136
2594B779136j158144K52416J820672j280512J07008l73760J011200n67296n77024
$$ 2779136 1620992 1873408 3694080 2413568 2520576 2146816 3158016 2590720 2013696
2585B013696O40512j17248m21376O05696N74976r27744R77408m07552j035264
$$ 2013696 2654208 2536960 2115584 2721280 3296256 2368512 3345920 2938368 1903104
2576A903104K45760J311744k51392q704n4784m84352L0720J222656j038848n9904
$$ 1903104 2148864 3460608 3209216 3200512 3145728 2661376 2692096 3914752 2875904 2816000
2566B816000j83296k40128P59296o1440n60128P86432M47488j327104J850368
$$ 2816000 2632704 2392576 3151872 3090432 2530304 3316736 3764224 2437120 4287488
2557D287488M26496j121280J583616j943552M79232k07360j432064J379328j031168
$$ 4287488 4713984 3592704 5176320 3232768 3712000 3504640 2072576 3451904 2420736
2548B420736P33696n01760R45152J15712p63392O68672L39968o51776P72096k39104
$$ 2420736 3154432 2652672 3597824 3713536 2950144 3618816 3958784 3307008 4079104 3840000
2538C840000r48736J501696L0720j14176P24480j822720k14016J289216m93568
$$ 3840000 2891264 4392960 4423680 4309504 5033984 3211264 2997248 4286464 3792896
2529C792896l87072J11616L02080L10272m85888L52256L63520m6080m06016j78688
$$ 3792896 3405824 3517440 3819520 4129792 3643904 3996160 4359680 4313600 3907584 3728896
2519C728896J629184j185792r8304l04128M32128n27872l89632Q07424j754112
$$ 3728896 5358080 4172288 4073984 3769856 4201984 3674112 3284480 4091904 2337792
2510B337792N10464J183232J91488j75616k42176j13664O53312j144832J97120
$$ 2337792 2848256 4031488 4222976 4047360 3805184 3691520 4344832 3200000 3397120
2501C397120R24672k132992J664000j114112J48480K19136J290752j347072J335808
$$ 3397120 4321792 2188800 3852800 2738688 2887168 3106304 4397056 3049984 4385792
2492D385792k7136M05504r94816N49888K92864j74592q09472M35200M4544L64544
$$ 4385792 4358656 4764160 3769344 4319232 4612096 4437504 3628032 4063232 4107776 4472320
2482D472320p99232J030144J57184q4480j4336M63872m10624p39840J579520j263616
$$ 4472320 3673088 4703232 4860416 4775936 4761600 5225472 4814848 4075008 5654528 4390912
2472D390912k06848k45760J173504o68160N7856n47840P24480J23904n84192L83488
$$ 4390912 4184064 3938304 5111808 4443648 4501504 3953664 4678144 4802048 4217856 4601344
2462D601344p30112Q71936l99360q9088j62816J603072p45472q6528Q9088k89280
$$ 4601344 3871232 4743168 4343808 4254720 4091904 5694976 4949504 4862976 4952064 4662784
2452D662784R0624N43232l5840K67776r1648j348096J972224o77888R9840l74784
$$ 4662784 4753408 5296640 5260800 5528576 5436928 4088832 6061056 5383168 5483008 5108224
2442E108224j05984J93024J446400k024448L38432N10976m11648m06016J495040
$$ 5108224 5002240 5195264 6641664 4617216 4955648 5466624 5054976 4648960 6144000
2433F144000j242112m5568P70560j138176J127424m81280Q64256l30240j369088
$$ 6144000 4901888 4856320 5626880 4488704 5616128 5134848 5999104 5668864 4299776
2424D299776o9120J841152m4544j93024o70720L13856j50528K31936M58240p23456
$$ 4299776 4230656 6071808 6027264 5834240 5163520 5477376 5326848 5558784 6017024 5293568
2414E293568q46848K14528J139200j295360J070080L58400K01216p7824p07584
$$ 5293568 4446720 4661248 5800448 4505088 5575168 5933568 6134784 6056960 5349376
2405E349376Q8064K20160p81312M46976O3488L61984l55328k89792J58208P75168
$$ 5349376 5437440 5657600 4876288 5323264 5386752 5748736 5393408 5103616 5261824 6036992
2395F036992r73312N24288l89120n3760r4720J12640K05312P55712p16288K67264
$$ 6036992 5063680 5587968 5198848 5145088 5050368 5163008 5368320 6124032 5407744 5675008
2385E675008n63712j011200J426432J03424k128384O00064p58272O47168N77024
$$ 5675008 5111296 4100096 5526528 5629952 3501568 4101632 3343360 3990528 4567552
2376D567552j50016K42176l61472J103360p35744j129984K06336O65088J26976
$$ 4567552 4417536 4659712 4298240 5401600 4665856 3535872 3742208 4407296 4534272
2367D534272O23104r09824N66784j024512N11488L89120K44224j359360J0240
$$ 4534272 5157376 4247552 4814336 3789824 4301312 4690432 4934656 3575296 3585536
2358C585536N71904L86560o50240n56032P44960p79264O01088j97120J292800
$$ 3585536 4157440 4544000 3893760 3337728 4082688 3303424 3904512 3707392 5000192
2349E000192n12512n01248L15392j8432K79552m32640L37408n96480m94080P44448
$$ 5000192 4487680 3986432 4301824 4283392 4562944 4130304 4467712 3871232 3377152 4121600
2339D121600j173504L07712P18848m53120J363968p38304o70208N61152l92192
$$ 4121600 2948096 3255808 3974656 3521536 4885504 4147200 3476992 4038144 3645952
2330C645952k68800K82112Q8576r49248R21600O97344m38272l37408J006592j603584
$$ 3645952 3377152 3659264 3747840 2798592 3720192 4417536 3979264 3641856 4648448 3044864
2320C044864J030144K74432Q50944J09568j454080O06208M11136r20576k71872
$$ 3044864 4075008 4349440 5200384 5309952 3855872 4462080 4873216 3952640 3680768
2311C680768J74080n9392R55392j516032J084416O26176M52608n88800p1680K01216
$$ 3680768 3854848 3795456 4750848 3234816 4319232 4945408 5398016 4809216 4737536 4938752
2301D938752K45760P12704r76896N14048n87264J185280o41024L53792j168896
$$ 4938752 5184512 5897216 4920320 5434368 4847104 6032384 5391360 5745152 4576256
2292D576256J190400m79232O6048J192960j30560l67616O91712M94080O76864
$$ 4576256 5766656 5287424 5353472 6546432 6415872 6048256 6739968 7234048 7910912
2283G910912n68320R3696p11168J430528q38144P3728m06528p55712n56032K26304
$$ 7910912 7342592 7436288 6725120 8155648 7317504 7391232 6984704 6228992 5672960 5899264
2273E899264O16448m79232j77152R83040q71424P27552Q1408k51392K98496J292800
$$ 5899264 6515712 6036480 5859328 6842368 5970944 6698496 6779904 6528512 6827008 8119808
2263H119808j557504O23616j59744J64864K62656K23232M74624k83136p59296
$$ 8119808 6562304 7185920 7026176 7191040 7453696 7676928 8151552 7868416 7109120
2254G109120L94240p46496r72288J986560n65760l77856M7104N27872p16288Q1408
$$ 7109120 7503360 6756864 5784576 7771136 7205376 6827520 6874624 7402496 6686208 6767616
2244F767616R47200n70368p65440N46816M97664j58208m31616j108992M94080
$$ 6767616 7714816 7144448 6379008 6925824 7423488 7265280 6833664 5724672 6218752
2235F218752n7856J23392J10080l25120J203712l31264m76672N19680o43584K00704
$$ 6218752 6160896 6284288 6394368 6069248 7272960 6941696 6465024 6984704 6341120 6541824
2225F541824L70688n6320m81792K59584P85920j100800P33696J19296m33664l35360
$$ 6541824 6912512 6856192 6374400 6633984 7419904 6319104 7052800 7172096 6738432 6403072
2215F403072l96800l24608P57248j039360L8400L12832K32448o58432l07200P46496
$$ 6403072 6006272 5681664 6438912 5399552 5437952 5750784 5983232 5324800 5017600 5764096
2205E764096m86400N55520o06208Q77056k79552l89632j90464P61344n73440N67296
$$ 5764096 5277696 5833216 5227008 6104064 5824512 5434880 5244416 6005760 5432320 5999616
2195E999616k7648j241600J494016n37600J77664R33376k92864R6768q05376N58080
$$ 5999616 5971968 4730368 6224384 5686784 5864448 6797824 6504960 6601728 5796352 6354432
2185F354432K43200q83200J660416r92256o94784J752576q21248P11168p47008
$$ 6354432 6597632 5714432 7374848 6382592 5687808 7440384 6619136 7330304 6583296
2176F583296L93216r51808J262592o62016n84192N8880K97472J089536j174016
$$ 6583296 6976512 6024704 7287296 6625280 6041088 6099968 6397440 7486976 6312960
2167F312960L60448j172480K177024r02656P37280M98688j338368K8672N70880
$$ 6312960 6673408 5500928 7677952 6775296 7512576 8011264 6672896 6701568 7272448
2158G272448J074688j312768O69696k01216P63392L87072j044480J781760p74656
$$ 7272448 8347136 7034368 7704064 7502848 8266240 8653312 7608832 9390592 8615936
2149H615936j74080N16608J75616J48992L5840J97632l14880r7280k10432J011200
$$ 8615936 8441856 8958464 9134080 9283072 9318912 9516544 9201664 9104384 8893952 9905152
2139I905152m79744M06016j161216J229312n83680j15712l34848N19168Q99584
$$ 9905152 9425408 9831424 8670208 9899520 9315840 9200128 8865280 9384448 10284032
2130A0284032r27232L2768m96640J607680r25184n63200J148928p61344J68960
$$ 10284032 9356800 9389568 8892928 10500608 9575424 9012224 10161152 9399808 9568768
2121I568768O53312j151488N63712m07552Q4992J101824K4064o80960Q20736M10624
$$ 9568768 10222080 9070592 9634304 9226752 9311744 10413568 10437632 9756672 10577408 10988032
2111A0988032j010176J548288j57184J74080p01440K97472j715712K240512o28736
$$ 10988032 9977856 11526144 11368960 11543040 10841600 11139072 9423360 11663872 11035136
2102A1035136l25120O86080N3248k88256j12640J35680J008640j095168N44768
$$ 11035136 10710016 11396096 11449344 11161088 11048448 11184128 12192768 11097600 11642368
2093A1642368l36896O63040p88992J469952J918976L239936P803904J1818496
$$ 11642368 11305472 11968512 11179520 12649472 14568448 17808384 25612288 37430784
2085C7430784q796672r962496l251200k995200j015808j199104j182208J166336
$$ 37430784 28634112 18671616 15420416 12425216 11409408 10210304 9028096 10194432
2077A0194432l83488r13920L9936J236480o76864q47360M66944j8432M08576r82528
$$ 10194432 9810944 8897024 8936960 10173440 9496576 8649216 9116160 9097728 9506304 8523776
2067H523776J62816n54496P20896q54016J530880p31648o88128n78560K10944
$$ 8523776 8686592 8132096 8852992 7998976 9529856 8798208 8110080 7531520 7742464
2058G742464J89440r39520p26016N12j00352L92704m88448l12832j21856j14688
$$ 7742464 7931904 6992384 6266368 6266880 6166528 6559232 6070784 5757952 5636096 5521408
2048E521408R9328m7104L58912J49504j372160J51552l28704J011200L57376r68704
$$ 5521408 5620736 5573632 5932544 6082048 4709888 4861440 4532736 5543936 5901312 4932608
2038D932608Q42752o19008J112064j330688k17600o55872J710592n56032K67264
$$ 4932608 5775360 5156352 6268416 4937728 4720128 4064256 5774848 5218816 5486080
2029E486080n88800N34528n02272J52576j43360J50528R62560J44384j795584
$$ 5486080 4897280 5431808 4929536 5082112 4938752 5089280 6051840 6196224 4400640
2020D400640O82496j7408j230848J750016L37920m30592k00192k66240q9088j41824
$$ 4400640 5083136 5065728 3834880 5584896 5922816 5492224 5292032 5025792 4936704 4794880
2010D794880J323008j591808O55360P94112k96960L86048m04992o01600J050112
$$ 4794880 6117888 4526080 5181440 5975552 5678592 6064640 5659648 5058048 6108160
2001F108160J10592j000960Q67840q704j356288R44640J283072j771008k23744
$$ 6108160 6218752 5217792 6085632 6076928 4720640 5665280 6948352 5177344 4953600
1992D953600Q14592R0624o9632l62496M92544r52832N79072R29280r11872J70496
$$ 4953600 5768192 5858816 5789184 5426688 5919232 4966400 5545472 6474752 5562880 5733376
1982E733376L78368q93440J137152Q5504j39264O2976j8944l6864N54496q61184
$$ 5733376 6111744 5218304 6355456 6440960 6301696 6364672 6345728 6308864 6863360 6002176
1972F002176K55488m65920O88640J153024O77888j81760Q3456j81760J025536
$$ 6002176 6257664 5791744 6480384 7633408 8311296 8129536 8212992 8031232 9056768
1963I056768j342464M67968k3552m52096J160192m30592o11328j59744M28032
$$ 9056768 7714304 8182272 8158720 7706624 8866816 8436224 7824896 7665152 8093184
1954H093184N80096o8096p6800N0688Q95488n22240Q49408K30400q12544P04512
$$ 8093184 8673280 8605184 8528384 8579072 9474560 8952320 9801728 10032128 9219584 9924096
1944I924096L69664O16960l45088l33824K11968j57696k048K42688M7104l25632
$$ 9924096 10293760 10910720 10565632 10231808 10443776 10286080 10284032 10526720 10573824 10248192
1934A0248192K252800q02304Q47360p42912J41312J140736m17280P45472j732608
$$ 10248192 12500992 11698688 12546048 11803136 11944448 13085184 12667904 13413376 11680768
1925A1680768P53664M76160n59616P26528M8640n74976r53344k55488m39808L08224
$$ 11680768 12434432 12910592 12350976 13077504 13126144 12551168 11597824 11342336 10902528 11210752
1915A1210752n67296J197568p73632N15584p30112N44768o63040k40128O17472
$$ 11210752 10643456 11841024 11067392 11582976 10852864 11397632 10734592 10494464 11111936
1906A1111936R216k20672k88256K64704n15072J94560m37248N89824j01888L0208
$$ 11111936 11121152 10900480 10612224 10876928 10361856 10556416 10119168 10708992 10607104 10637312
1896A0637312J95072J41312p21920R2160J05472m20352L61984O79424o88640l87072
$$ 10637312 10832384 10973696 10251776 10343936 10449408 10029056 10391040 11070464 10381824 9994752
1886I994752O48192r99936R6256M74624R65120j545728R07776j209856j508352
$$ 9994752 10642944 9643008 9739264 10213888 11179008 9633280 10541056 9331200 7822848
1877G822848J003520N92384j116160L47648k47296m19840P22944k58048j665024
$$ 7822848 8826368 9418752 8302592 8650240 8402944 7983104 8706048 8448000 6782976
1868F782976J306624m7616L1744j292800R33376n89824O37440j461760Q18176
$$ 6782976 8089600 8041984 8073728 6780928 7714304 7124480 7761920 6300160 7118336
1859G118336R0624o60992J101824j486336M33664N53472o00064L1232K76480k12992
$$ 7118336 7208960 6547968 7649792 6163456 6597120 7150592 6550528 6581760 6858240 6645248
1849F645248o59968O59968M27520p42400N1200N37088J03424j177600k42176R26720
$$ 6645248 5985280 6645248 7072768 6330368 6381568 6918656 7022080 5844480 5602304 6529024
1839F529024k10944K69312M84352N98528r99424N18144n632j263616J188352q40192
$$ 6529024 6318080 6587392 7071744 7670272 6670848 7188992 7183360 5919744 7108096 6267904
1829F267904q7040Q35072K62144J5360q1920M56192R41568q68352R49760o43584
$$ 6267904 6180864 7015936 7278080 7293440 7211520 7667712 8609280 7740928 8690688 8047104
1819H047104O72256q52480N07392O41536o0416M80256n18144L44576p50080K43200
$$ 8047104 8719360 7866880 8374272 9015808 8955392 9435648 8917504 9262080 8512000 8755200
1809H755200R32352Q10496k9184q22272L66592J337344n60128J09056M36224M45440
$$ 8755200 9687552 10498048 10468864 9646592 10013184 11350528 10790400 10899456 11335680 11781120
1799A1781120Q35072j747968K032128R61024j084928P99744j97120K15040k40640
$$ 11781120 12616192 10868224 12900352 13861376 12776448 13576192 13379072 13594112 13353472
1790A3353472P73120M77696J250816m04480N46304R98912J007104M04480K78016
$$ 13353472 14126592 14604288 15855104 15450624 15996928 16995840 18002944 18407424 18685440
1781A8685440R11872Q77568J113600K089984n93408J818112R15968K095104J420800
$$ 18685440 19597312 20474880 21588480 23678464 23085056 24903168 25819136 27914240 29335040
1772B9335040J654272P02976R69216J404416J417216J463296O10304M5568N98016
$$ 29335040 30989312 31692288 32661504 34065920 35483136 36946432 37556736 37602304 38200320
1763C8200320R09824Q91392m71040K502144J141248J083392J813504K553344P80288
$$ 38200320 39110144 40001536 39530496 42032640 43173888 44257280 46070784 48624128 49404416
1754D9404416L064832K661888L055104L453952L379200M115456N366784O062592
$$ 49404416 52469248 55131136 58186240 61640192 65019392 69134848 74501632 80564224
1746H0564224Q350720Q392192R371648O580224K408960l050496n289984q813568
$$ 80564224 88914944 97307136 106678784 113259008 115667968 112617472 107327488 98513920
1738I8513920q941568j0835456j1707392j0234880j0621440n867008o403072l309568
$$ 98513920 89572352 78736896 67029504 56794624 46173184 40306176 33903104 30593536
1730C0593536l689472k831360q40704k385408j024000j567232j560576L28704
$$ 30593536 26904064 24072704 23232000 20846592 19822592 18255360 16694784 17023488
1722A7023488j337856j95072j83296j11616j432064p49056M84864j173504j79712
$$ 17023488 15685632 15490560 15307264 15195648 13763584 13014528 13499392 12325888 12146176
1713A2146176j616384J284608l28192r45152l67616J363456o55360r07776N14560
$$ 12146176 10529792 11814400 11486208 10541056 10173440 11536896 10881536 9973760 10488320
1704A0488320j182208P93088k078208K088448p78752l86048r48736J491968k206208
$$ 10488320 9306112 10099200 8020992 10109440 9330688 8944640 7995904 9487872 7281664
1695G281664R43616J94048q02816o76352Q6016J681920j013760j891840K248192
$$ 7281664 8225280 8419328 7616512 6940160 7026176 8708096 7694336 5802496 8050688
1686H050688n35552j317888K17600R06752k380288J208832M83328o49728L8912
$$ 8050688 7515136 6197248 6414848 7321600 4941312 6150144 6633472 5983744 6022656
1677F022656K41664q91392J376256j828352M74624k76992o55872M43904K12480
$$ 6022656 6264320 5372928 6749184 4920832 5395456 5118464 4462592 4906496 5118976
1668E118976L22048n1712n28384o5536L35360O09280q21248j013248o656J656320
$$ 5118976 5441024 5389312 4860928 4795392 5130752 5740032 4918784 3905536 3898880 5555200
1658E555200j182720r0112N1712l25120Q90880N21216o22080k18624J050112K67264
$$ 5555200 4372480 4282368 4334080 4008960 4899840 5421056 4798976 4580352 5630464 5897728
1648E897728j572864M80768Q7552J66400j11104O82496j278464j08032j105920
$$ 5897728 4324864 4805632 4893184 5059584 4948480 5630976 4352512 4244480 3138560
1639C138560O01600O63040K6624J63328n27872l19488P65952J460736B770432
$$ 3138560 3740160 4403200 4429824 4593152 4065280 3745792 4511744 5972480 2770432
1629C728384J4848N25312O72256K53440O25152j872384M93568l62496J466368
$$ 3728384 3743232 4268544 4940800 5194240 5819392 3947008 4440576 4078080 5544448
1620E544448k67776M1472n61152n6832j7408J48992M44416O95296j31072R51296
$$ 5544448 5276672 5318144 4756992 4700160 4682752 4831744 5276160 5971456 5840384 6791680
1610F791680p58784Q88320m87424J157632q44800l03104Q03328k58048O94784
$$ 6791680 6032896 6921216 6433792 7591424 6746624 6443520 7246848 6988800 7683584
1601G683584n22752Q18688Q76032j303552J113600m26496R05728L40992N57568
$$ 7683584 7160832 7979520 8855552 7552000 8665600 8239104 9144832 9485824 10043392
1592A0043392R40544J158656l11296J053184r34912n60128o73792p67488m92032
$$ 10043392 10983936 12142592 11831296 12884480 11949568 11389440 10715648 9948160 9456128
1583I456128o0416n37600J236992m35200k27328k06336l33824Q63232o65088L26144
$$ 9456128 9395712 8858112 10095104 9659904 9432576 9226240 8892416 9755648 9090560 9416704
1573I416704j081856N29408Q23808o99904p10656M70528l39456M88448j42336
$$ 9416704 8334848 8864256 9688064 8988160 8277504 8748032 8408576 8897024 8754688
1564H754688Q67840p5264q05888K57024J36704L45600L55328N85728R08800K09408
$$ 8754688 9622528 9547264 8741376 8998400 9135104 9480704 9836032 10421760 11330560 11539968
1554A1539968J895936M11136p93088O84544N59616j50016k59072j097728r41568
$$ 11539968 13435904 13847040 13053952 13738496 14298112 14148096 13889024 12791296 11849728
1545A1849728k21696j235968j572864P0144l30752n78560O56896j120768J55136
$$ 11849728 11628032 10392064 8819200 8889344 8558592 7980032 8636928 7516160 7671296
1536G671296L15904j28000o37440R25184j033728Q24320j84832n86240O48192
$$ 7671296 7987200 7859200 7221760 8146944 7113216 7937536 7752704 7166464 7814656
1527G814656M45440J058304m27008J378816N81632j73056n36576j95584L7888
$$ 7814656 8260096 9318400 8891392 10270208 10851840 10678784 10142208 9946624 9984512
1518I984512n61152Q5504n62176j975296K56512l23072o40512k28352J69984r45152
$$ 9984512 9423360 9508864 8946688 6971392 7227904 6904832 6264320 6035968 6205952 5260800
1508E260800M58240n1200l55328j141248J008640n73440J28512J1776l10272k27328
$$ 5260800 5719040 5667840 5312512 4171264 5179904 4606464 4734976 4746752 4436480 4209152
1498D209152J575936j257472j065984J304576j208320l84512J667584J83808j474560
$$ 4209152 5785088 4527616 3461632 4766208 3557888 3173376 4840960 5024768 3550208
1489C550208O0416K96448O6048k37568L7888p49568O63040m21888N83168L072
$$ 3550208 3610624 3907072 3973120 3735552 3773440 3023872 3686912 3265024 3848192 3851264
1479C851264n65760N66272j425408J649152m60800P11680n89824J39776J43360
$$ 3851264 3285504 3851776 2426368 4075520 3614720 4326400 3736576 3876352 4019712
1470D019712k55488K63680j35680r6768L3280n8368O66624n06880N82144Q95488
$$ 4019712 3764224 4027904 3892224 3795456 3828736 3770368 4436992 3930112 4512256 5407744
1460E407744j378816L92192K14016j092608J016832j097728J392128n94432L43040
$$ 5407744 4028928 4421120 4635136 3542528 4559360 3461632 4853760 4259328 4602368
1451D602368q44288R40544K73408N36064j28512q71424K96448P65952j231360
$$ 4602368 3758080 4698624 4972032 5508096 5379584 4508160 4804608 5570560 4339200
1442D339200P33696P4752J178624j253376J2288M65920o81984r55904J479168
$$ 4339200 5072896 5147648 6326272 5072896 5085184 5551104 4869120 3913216 5392384
1433E392384m65920R25184Q29440p51104M45440j075200K26816Q6528k26816m61312
$$ 5392384 4926464 5851648 6681088 5929984 6375424 5300224 5527040 5613568 5386752 4925440
1423D925440K90304j034240r1136N82144m72064j459712J362432M6592j205248
$$ 4925440 5215744 4181504 4090368 4672512 4200448 2740736 4103168 4149760 2944512
1414B944512J667584j451008M11136k08896m05504K18112q75520n88288M74624
$$ 2944512 4612096 3161088 3572224 3363328 2957824 3175936 2300416 1712128 2186752
1405B186752J20320k95424O76864k43200J046016o95808n61152L48672K87232
$$ 2186752 2307072 2011648 2688512 2445312 3491328 2795520 2234368 2583040 2870272
1396B870272p40352M24448o0416L0208L82464m38784j67424O03648q93952o32832
$$ 2870272 2129920 2554368 2493952 2524160 2906624 2467840 2300416 2904064 2010112 1377280
1386A377280O89152q65280P32672O92736r71264k16064o1440M99200N88288j6896
$$ 1377280 2066432 1201152 1933824 2626560 1655296 1439232 1377792 1876992 2465280 2448384
1376B448384q42752M11136n13024N45280o65088J408512p90016K81600o4512n44256
$$ 2448384 1605632 2016768 1503744 2049024 1383936 2792448 2002432 2284032 2219520 1675264
1366A675264k80576K40640J90464l26144m37248L79904K81088l92704K30400l95264
$$ 1675264 1394688 1635328 1825792 1499648 1062400 1442304 1723392 1330688 1561088 1165824
1356A165824K30400R00608j102336N7856l37920j53088Q73472o2464K06848k6624
$$ 1165824 1396224 2296832 1194496 1252352 914432 761344 1634816 1572352 1779200 1752576
1346A752576k29376M11136q18688j41312R05216I34912O27712L16416o78912R39520
$$ 1752576 1523200 1934336 1115648 974336 1879552 934912 1562624 1879040 1200128 2139648
1336B139648q92416J61792m59264J323520j001984J171968q38656C85536N57056
$$ 2139648 1247232 1409024 949760 2273280 1271296 2443264 1604608 385536 942592
1327I42592k52928J624064j114112N28384p25504P22944J071616A208832K90816
$$ 942592 689664 2313728 1199616 1728000 1002496 1725440 2797056 1208832 1499648
1318A499648D45440J443328l05152k19648o72256J226240G61344r3184O22080
$$ 1499648 445440 1888768 1583616 1363968 691712 1917952 761344 668160 1290240
1309A290240E64224L83488K11456j62816J76128P35744N66784H47872P47008m63872
$$ 1290240 564224 947712 1159168 996352 1172480 1908224 2475008 847872 1594880 1131008
1299A131008K74432B62144P94624N48352L39968F74816J000960j43360m16256
$$ 1131008 1405440 262144 1056768 1605120 1945088 674816 1675776 1532416 1116160
1290A116160M49536L13856D97664N27360L41504F23616O34368O02112M20864B22208
$$ 1116160 1565696 1879552 497664 1025024 1366528 623616 1257984 1860096 2280960 222208
1279A116672M70016l90144L94240L23072m58752L96288p58272M73088L91168F99904
$$ 1116672 1586688 1196544 1590784 1913856 1455104 1851392 1093120 1566208 1957376 699904
1268B205184p61344l16416k18112O57920L95776k61120K5088M75648A059840Q65792
$$ 2205184 1443840 1127424 909312 1567232 1963008 1701888 1726976 2202624 1059840 1925632
1258A925632o79936N07392K37568H46848J0240r3184g7824A742848k28864J60768
$$ 1925632 1245696 1753088 1990656 846848 857088 763904 -77824 1742848 1513984 1674752
1248A674752l14368R70240E86752O26688j96608R41056l03616n91872L76320J19808
$$ 1674752 1360384 2330624 586752 1213440 1016832 1957888 1654272 1062400 1438720 1558528
1238A558528k23232F15424J69984J577472p53664k90816J308672A228288N00224
$$ 1558528 1335296 615424 785408 2362880 1609216 1318400 2627072 1228288 1728512
1229A728512n10464j90464K2016O65088l31264A91488R87136k95424a90976A328128
$$ 1728512 1218048 1027584 1049600 1714688 1383424 191488 1178624 883200 -190976 1328128
1218A342976l81440N66272M55680k96448J33120j18784K09920m23424M61824k75968
$$ 1342976 961536 1527808 1983488 1687040 1820160 1701376 1911296 1487872 1949696 1673728
1208A673728F12864O85056J12640F51776J560576q02304n08416k48320K62656
$$ 1673728 612864 1297920 1410560 651776 2212352 1410048 901632 653312 915968
1199I15968N33504m18304B63680L56864J247744n29408k29376M89472o15424l33824
$$ 915968 1449472 1031168 263680 620544 1868288 1338880 1109504 1598976 983552 649728
1189F49728P45984J19296k27840k60096J012224M74112A079808N42720J92000
$$ 649728 1395712 1515008 1287168 1027072 2039296 2513408 1079808 1622528 1814528
1180A814528p98208J7920l06176j536K98496A60768J351680N38624n14560k90816
$$ 1814528 1016320 1034240 728064 726528 1025024 160768 1512448 2051072 1536512 1245696
1170A245696B63680Q39168L57376C01568J155072l18976l64544L75808k54976
$$ 1245696 263680 1102848 1460224 301568 1456640 1137664 773120 1148928 893952
1161H93952M03456k37056o656J320960A006080K12992K70848M40832k46272p43936
$$ 893952 1297408 1060352 1053696 2374656 1006080 1219072 1489920 1930752 1684480 940544
1151I40544O49728J22368K62144N35552j092608P21920m45440D32640J187328
$$ 940544 1590272 1712640 1974784 2510336 1417728 2139648 1694208 432640 1619968
1142A619968N48864m81792j38752J713152j398784q76544J769984N42208j251328
$$ 1619968 2168832 1687040 1548288 3261440 1862656 986112 2756096 3298304 2046976
1133B046976P05024J061888L51744m93568j82784J776128n82144K797568J102848
$$ 2046976 2752000 3813888 4165632 3672064 3489280 5265408 4683264 7480832 8583680
1124H583680m28544j79200L52256j235968J63840R84064K59584k23232K137600
$$ 8583680 8155136 7975936 8328192 7092224 7256064 8240128 8499712 8276480 10414080
1115A0414080J115648J539584K331136J008640L301376N967360K0481536M7486464
$$ 10414080 11529728 13069312 15400448 16409088 19710464 25677824 46159360 93645824
1107I3645824P6827648m7460352E8383360k4196608j1083264n362688m162048
$$ 93645824 170473472 123013120 58383360 34186752 23103488 17740800 13578752
1100A3578752k551296k894848Q51968j595904r32864M17792p11168p48032q1920
$$ 13578752 11027456 8132608 8984576 7388672 6455808 6873600 6162432 5414400 5332480
1091E332480k560J697792O93248n30944j519616r99936j006080O1440j209344
$$ 5332480 5329920 7027712 7720960 7190016 5670400 4670464 3664384 3725824 2516480
1082B516480J273856l36384k87744K99520j094656L53280K07872p97696J231872
$$ 2516480 3790336 3453952 3166208 3465728 2371072 2724352 2932224 2134528 3366400
1073C366400j080320j40800R93792n16096N5296n2736j151488J137152q47872
$$ 3366400 2286080 2145280 3139072 2622976 2678272 2625536 1474048 2611200 1763328
1064A763328M03456K89792m39808O09280I21088J396224J17248q98560K00192
$$ 1763328 2166784 2456576 2016768 2626048 921088 2317312 2434560 1536000 1736192
1055A736192K73408p95136L28192N80096j66912l65056J49504E71904N70880R7280
$$ 1736192 2009600 1214464 1542656 2122752 1955840 1590784 1740288 571904 1142784 1240064
1045A240064J098240l72224p63904K0992J029120l31264n1712m02432P09632r48224
$$ 1240064 2338304 1966080 1202176 1223168 2252288 1921024 1869312 1466880 2176512 1228288
1035A228288j19808M79232j8944k92352M23936p67488N61664O4512o71232L78368
$$ 1228288 1108480 1587712 1568768 1276416 1700352 932864 1494528 1559040 887808 1266176
1025A266176M00896m84864k10944j49504J127936H90880l32800M29056m45440
$$ 1266176 1667072 1182208 971264 821760 1949696 890880 558080 987136 541696
1016E41696j09056J195520l53792L98848J8432K99520H80640B77504N35040Q00256
$$ 541696 432640 1628160 1274368 1673216 1691648 1991168 880640 277504 812544 1612800
1006A612800M1984k87744L0208m86912l67104R8816J315840o96832m80768R59488
$$ 1612800 1654784 1367040 1397248 910336 543232 642048 1957888 1261056 780288 1739776
996A739776G06048R97888h1408I87136K70848D44416J90464P49056j92512l72224
$$ 1739776 706048 1703936 -81408 987136 1257984 444416 634880 1383936 1191424 819200
986H19200M52096m58240B69824M40320B84672K85696i3184H49408L0208M87424
$$ 819200 1271296 813056 269824 710144 284672 570368 -93184 849408 879616 1367040
976A367040F8096J115136n46304N22240l88608O7072L584J262080E51936L09760
$$ 1367040 68096 1183232 636928 1159168 770560 837632 841216 2103296 551936 861696
966H61696k75456P50080n76000p6288k11456K86720O23104K85696o59456K01216
$$ 861696 586240 1336320 760320 684032 472576 759296 1382400 1668096 1008640 1209856
956A209856E70368q0384L68128C16928R48224l93728k40640J61792L22560R2160
$$ 1209856 570368 489984 858112 316928 1265152 871424 630784 792576 1115136 1207296
946A207296H3968N95456J67936K95936j58720j17760J67424K67776D36736Q59648
$$ 1207296 83968 679424 847360 1143296 984576 866816 1034240 1302016 436736 1296384
936A296384E93408J73568B31424N30432B2016Q42752J36704N5296j54112O56896
$$ 1296384 593408 766976 231424 761856 22016 864768 1001472 1056768 902656 1559552
926A559552e65760A045504N632j06496N76000j90976r4720j01888j17248l00032
$$ 1559552 -565760 1045504 1051136 944640 1520640 1329664 1234944 1133056 1015808 715776
916G15776L02592m78208J396224o68160O1952m30080C36384A24416L89632P08608
$$ 715776 1018368 540160 1936384 1268224 1330176 900096 336384 124416 514048 1222656
906A222656m34688B85184J113600o04672n8368l24096A46432J17248M13184k78016
$$ 1222656 787968 285184 1398784 794112 735744 411648 146432 263680 676864 398848
896C98848A94560R73824o0416R8816k69824B75456L97824J81760J96608C98848
$$ 398848 194560 1168384 1107968 1206784 936960 275456 673280 855040 1051648 398848
885A169408E42720j4336a34144D4032J562624F50240R25696C072O62016K6624
$$ 1169408 542720 528384 -134144 44032 1606656 650240 1575936 3072 665088 691712
875F91712C6352M09088J24416J05472l16928P14752c98848E10464M43392M76672
$$ 691712 36352 445440 569856 675328 358400 1073152 -398848 510464 953856 1430528
865A430528m94592C67104P01952l072o2464l62496J32608k33984i728B94912K0992
$$ 1430528 935936 367104 1069056 1065984 1003520 641024 773632 539648 -9728 294912 315904
854C15904h7040F94272o0416b33472A645056m44416C18976L22560K99008M17792
$$ 315904 -87040 694272 633856 -233472 1645056 1200640 318976 641536 940544 1358336
844A358336A35680O99904J47456E632N93408L53280m17280P74656F5024J099264
$$ 1358336 135680 835584 983040 5632 599040 952320 535040 1309696 65024 1164288
834A164288R9840j04960l08736j54624L76832l04128b98496H29952J51552j82784
$$ 1164288 1264128 1159168 850432 695808 1072640 768512 -298496 829952 981504 798720
824G98720R2672O11328K05312p72096R60000L91168I55392r7792N8368K53440
$$ 798720 891392 1502720 1708032 935936 1895936 2287104 955392 857600 915968 1169408
814A169408C46112P18848k60608L32800J169408m44928C95264G1168J772032G68512
$$ 1169408 346112 1064960 804352 1137152 2306560 1861632 395264 71168 1843200 768512
803A790976I6256J205248k9184R3696o07232L38944k62656j73056N50912j2288
$$ 1790976 96256 1301504 1272320 1366016 758784 1097728 835072 662016 1212928 1200640
793A200640M78208L92192H60160O93760j69984M20352n51936J442816o17472J408512
$$ 1200640 1678848 2071040 860160 1553920 1383936 1804288 1252352 2695168 2077696 3486208
783C486208j260032n01760R62048j300480J014272B67776J129472n78048B50880
$$ 3486208 2226176 1724416 2686464 1385984 2400256 267776 1397248 819200 250880
773A059328D83328P36256J0240l33312K70336k67264B80576K58560E2736J184256
$$ 1059328 483328 1219584 1229824 896512 1166848 899584 280576 539136 52736 1236992
763A236992C98336L76832l33312a44896a5872H46336J38240m32640C4816Q72448
$$ 1236992 398336 775168 441856 -144896 -15872 846336 984576 551936 34816 907264
753I07264J79200O53312A51040K29376K42688b41152E39136k67776J042432F656
$$ 907264 1086464 1739776 151040 380416 623104 -241152 539136 271360 1313792 6656
742D50048A32096M48512J76128l48672A28000O91200b66752J16224l22560G52128
$$ 450048 132096 580608 756736 408064 128000 819200 -266752 -150528 -473088 752128
731b40640E76000a42336C98336c0720F05696M80768m49536N50400I9840f52800
$$ -240640 576000 -142336 398336 -30720 605696 1086464 636928 1187328 99840 -652800
720D03968N79072d13696i1648G92576b50880F26688j30048J31584A06496J740800
$$ 403968 983040 -413696 -91648 792576 -250880 626688 496640 628224 106496 1847296
710A847296F4000i2160A46944a32096B21184P0656Q50944e56032I1648J058304
$$ 1847296 64000 -92160 146944 -132096 221184 291840 1142784 -556032 91648 1149952
700A149952D09088P62880B29376a83808D94592j1776F7584a00352f656I70240
$$ 1149952 409088 1171968 229376 -183808 494592 482816 67584 -100352 -6656 970240
689A12128J09056R5744C3792a51552J9456I28256i0624A033728C25632J221632
$$ 112128 221184 316928 33792 -151552 -132096 928256 -90624 1033728 325632 1547264
679A547264o76864c40992I09312l31264J57696G5264f1952D67968j29536g98208
$$ 1547264 870400 -340992 909312 578048 735744 75264 -61952 467968 338432 -798208
668b70336o05696H7552O01600j95072a81760H47360e79072E71392N36576E21728
$$ -270336 -876032 87552 689152 494080 -181760 847360 -579072 571392 1107968 521728
657E91872j8432d52608A86880M95104e120m01920O656A45408L07200r8816M92032
$$ 591872 573440 -452608 186880 681984 -5120 -407040 -400384 145408 452608 353792 845824
646H45824C38944N12512l64544h2432C86048d8128C10784j35168O84032F7072
$$ 845824 338944 851456 486912 -82432 386048 -48128 310784 175616 859648 67072
635D38272M25472A02400k3040J73056h704G04512A21856N06368%k74944J18784
$$ 438272 863744 102400 79360 252416 -8704 704512 121856 628224 628224 353280 472064
624D72064B18624j9456E9392J14688R15456g08096D15232M77696c15904A355776
$$ 472064 218624 199168 59392 174080 1089536 -708096 415232 892928 -315904 1355776
613F42048L38432n9904l44064j40288r2672J87904N96480E40672B63680L9936
$$ 642048 980480 920576 576512 436224 343552 531456 1127936 540672 263680 303616
603C03616e59104L3280A58720n8880L70688A45920K41664J92000O5024c0720D09600
$$ 303616 -559104 -525824 158720 99840 470528 145920 387584 579584 644608 -30720 409600
591c12832G34720d55168A78176a48992k23232A17760K16064K72896m5568o144
$$ -312832 734720 -455168 178176 -148992 -372224 117760 333824 606720 561152 555008
581E55008a77664F27200e04832k17088E05856B4064a041408a26464C88608A46432
$$ 555008 -177664 627200 -504832 -721920 505856 24064 -1041408 -126464 388608 146432
570H11008R728J5360l58400j51552R81504o21568B02240f26688b46272j32608
$$ 811008 820736 836096 477696 326144 1307648 686080 202240 -626688 -246272 -378880
560c78880D41344L39456C35360K87744J1264b26816A63328N96480A47968O74816
$$ -378880 441344 780800 335360 623104 634368 -226816 163328 759808 147968 822784
550H22784m1984b38080F25152d21888A48480P1168N77536E6320h7552B9184d19840
$$ 822784 780800 -238080 625152 -421888 148480 219648 797184 56320 -87552 29184 -419840
538g2192I68704a6896F09792k27840D3520N19168J90464E7344g27552G7312N12000
$$ -72192 968704 -16896 609792 381952 43520 562688 753152 57344 -727552 77312 589312
527E89312k63168a85344A134080D72064i1136E42720K07360P1168a15712D17792
$$ 589312 326144 -185344 1134080 472064 -91136 542720 750080 821248 -115712 417792
516e58592K23232A169920f2976B14528J3312K00192F5024M28032j59232q6528
$$ -558592 -335360 1169920 -62976 214528 227840 428032 65024 493056 333824 247296
506B47296M16768i6256D79232O37440M28544f53824D5056R05728d39296G36256
$$ 247296 664064 -96256 479232 1116672 1545216 -653824 45056 950784 -439296 736256
495B38080M32128G1680M50048e32992D99712f32832E14560f1440A66912Q4480
$$ 238080 670208 71680 521728 -532992 499712 -632832 514560 -61440 166912 251392
485B51392M09088M58240b94912D28544h9600D87424J08032k47808B4576L49184
$$ 251392 660480 1118720 -294912 428544 -89600 487424 595456 347648 24576 373760
475C73760A59232Q9600J086464k38080A03936a51040A50528R75360D30592q3456
$$ 373760 159232 248832 1335296 1097216 103936 -151040 150528 1125888 430592 347136
465C47136N34016j21344j02912k31424J307136N3760J98144H50432K70336k74944
$$ 347136 881152 759808 656896 425472 1732608 1786368 1984512 850432 1120768 845824
455H45824B7648J39264D6592l584M74624F9120L35872R00608A01376K9184a93536
$$ 845824 27648 166912 46592 43008 517632 69120 404992 1305600 101376 130560 -193536
443E27360J05984J44896g49568A73056e22240F92736b57024C76832M5568R8304
$$ 527360 633344 778240 -749568 173056 -522240 692736 -257024 376832 422400 520704
433E20704J70496F0416a31584o26688C52768q2432L13856B15040a004544A19296
$$ 520704 691200 60416 -131584 -758272 352768 270336 584192 215040 -1004544 119296
422d48000p66976A04448d12160A1776e99040K55488F86592b32448A42336R9328
$$ -448000 -1214976 104448 -412160 11776 -599040 -343552 686592 -232448 142336 241664
412B41664P83872g82848A23904J224704c15904n32992L94240E12K18112J39776
$$ 241664 1025536 -782848 123904 1348608 -315904 -848896 -454656 512 218624 358400
402C58400d34176E18656F9120J098240A56672K22208A71008d6592j99168O0928
$$ 358400 -434176 518656 69120 1167360 156672 378880 171008 -46592 -245760 -184832
392a84832a2800o32832G1168O12864j18784J95072k02752c08736A117696E35552
$$ -184832 -12800 -645632 71168 684032 565248 760320 557568 -308736 1117696 535552
381a037312E99040b64704J1776J024B01216c12832D65920A46944K13504J43872
$$ -1037312 599040 -264704 -252928 -251904 201216 -312832 465920 146944 360448 504320
371E04320a7920C08736a172480k6624A244672i8816C24096c68128C96800a24416
$$ 504320 -17920 308736 -1172480 -1199104 1244672 -98816 324096 -368128 396800 -124416
360E09440K07872k26816J270784d11136O2464E49376d40320F23104b12992B72896
$$ 509440 717312 490496 1761280 -411136 -348672 549376 -440320 623104 -212992 272896
349A92000N10464K82624b21184i8816p21408L34336B01728e21216l12320A63328
$$ 192000 702464 985088 -221184 -98816 -820224 -485888 201728 -521216 -833536 163328
338C49184c1744D38272G8848M80768j12640J79712B23744l7376H704K84672a0752
$$ 349184 -31744 438272 78848 559616 446976 626688 223744 186368 8704 293376 -10752
326H47872m9152k94912c22048m17280C75296b76480C70688d8128k37568H28928
$$ 847872 798720 503808 -322048 -739328 375296 -276480 370688 -48128 -285696 828928
315a079808F76864G3728K53440d25984h6016l70176D00384A79712c63008C38432
$$ -1079808 676864 73728 327168 -425984 -86016 -456192 400384 179712 -363008 338432
304d50048E88288f49216J48992B71872R37472m88960i11360b09920P680B50368
$$ -450048 588288 -649216 -500224 271872 1209344 720384 -911360 -209920 -202240 250368
293E17632f00576A89952J46432b24256H01280B048Q84736H0384L31264d46464
$$ 517632 -600576 189952 336384 -224256 801280 2048 886784 80384 411648 -446464
282a10592B13504O656e17120C31264f59968A97632b70848a02912r84576c31264
$$ -110592 213504 220160 -517120 331264 -659968 197632 -270848 -102912 -1087488 -331264
271a226752b96448j48992f6048A035264d1984q55040F44096c45088A083904f74816
$$ -1226752 -296448 -445440 -66048 1035264 -41984 -897024 644096 -345088 1083904 -674816
260h2432A35680f58432D07552f9632E38624h1920A19296M67456j52576P17312
$$ -82432 135680 -658432 407552 -69632 538624 -81920 119296 586752 434176 1151488
250A151488K04800f144C8400J7408O7072d06528D73088e53984K68288Q6528F01600
$$ 1151488 1356288 -6144 38400 55808 122880 -406528 473088 -553984 -285696 -199168 601600
238e39136K29888F60992I216Q0384M75648c28704i8304o656D80768B06336a65376
$$ -539136 -309248 660992 9216 89600 565248 -328704 -98304 -104960 480768 206336 -165376
226b91328A6384J48992b92864A103360J12640e97504J25952b8672l6864k31424
$$ -291328 16384 165376 -292864 1103360 1216000 -597504 -471552 -28672 -65536 -296960
216b96960A329152A13152K18624J58720j98144N9904f6048D89472K29376c14880
$$ -296960 1329152 113152 331776 490496 292352 352256 -66048 489472 718848 -314880
205b95936n12512E46304a053696D5568a21344j38240l6864k0480a02912k96448
$$ -295936 -808448 546304 -1053696 45568 -121344 -259584 -296448 -316928 -102912 -399360
195c99360j08032J42336m43392D35200j85856K6624M096L59936b23232F27712
$$ -399360 -507392 -365056 -808448 435200 249344 275968 280064 640000 -223232 627712
184B99520b06848G22944l12832L76832j99168b4576E6832i76384d47488D3008
$$ 299520 -206848 722944 410112 786944 587776 -24576 56832 -976384 -447488 43008
173g66976a08544B15552h23296H3968a18784B06336K71872B03776e15072A338368
$$ -766976 -108544 215552 -823296 83968 -118784 206336 478208 203776 -515072 1338368
162a458176e02784A37728c22048G37280G8336P94112c08224A72032a55136m74624
$$ -1458176 -502784 137728 -322048 737280 78336 872448 -308224 172032 -155136 -629760
152f29760h4480l09760C33824C584J213952n48352A53600i28256a01376l30240
$$ -629760 -84480 -394240 333824 3584 1217536 669184 153600 -928256 -101376 -431616
142d31616k17088E23264c93728B97472i11360F27200j60768d36736A11616c98336
$$ -431616 -648704 523264 -393728 297472 -911360 627200 466432 -436736 111616 -398336
131e90336C16416a095680C74784b2016F9632a18784F1952J0240a71008A3312b3552
$$ -590336 316416 -1095680 374784 -22016 69632 -118784 61952 72192 -171008 13312 -23552
119A85856F656g6800F49728B81600e87264b44224B3552d98176B5088R82016c67104
$$ 185856 6656 -76800 649728 281600 -587264 -244224 23552 -498176 25088 1007104 -367104
107A02400J19296J25952J69472d76672m55680G3216L19488f76352b43712A39264
$$ 102400 221696 347648 517120 -476672 -932352 73216 392704 -676352 -243712 139264
96b52416a8944A149952e17120a43872C10784F9120c65056D00896G2192K70336
$$ -252416 -18944 1149952 -517120 -143872 310784 69120 -365056 400896 72192 342528
86C42528c09760i0112k29888F46656A15712K51392N3760c64032E7344a206784
$$ 342528 -309760 -90112 -320000 646656 115712 367104 420864 -364032 57344 -1206784
75D98688c11296k08896b30912i2160m02432D14720c06688J28000b2016k18624
$$ 498688 -311296 -520192 -230912 -92160 -494592 414720 -306688 -178688 -22016 -240640
65b40640B99008J72544f79424E10464d52608C75296g74656K57536B26304P25504
$$ -240640 299008 471552 -679424 510464 -452608 375296 -774656 -517120 226304 951808
55I51808c03104E87264A48480F0416g84896E09440a76640k92864J93024j037312
$$ 951808 -303104 587264 148480 60416 -784896 509440 -176640 -469504 -276480 -1313792
45a313792d21376H55552a47456n27360j41312J48480a76128o17472F43584d51072
$$ -1313792 -421376 855552 -147456 -674816 -816128 -667648 -176128 -793600 643584 -451072
34b28864r1136D45440j4848d46976B44224D3520a28512m74624k34496C4304j6384
$$ -228864 -320000 445440 430592 -446976 244224 43520 -128512 -603136 -837632 34304 17920
23A7920L19488f10816B34496a49504l30240B65216d31104B99520J30560E8368
$$ 17920 337408 -610816 234496 -149504 -479744 265216 -431104 299520 430080 58368
12D66944K50880a63328k56000b048G32672H8064L6864h75520M20352R7792J01888
$$ 466944 717824 -163328 -419328 -2048 732672 88064 124928 -875520 -455168 -357376 -255488
1b55488j43872
$$ -255488 -399360
0c99360
$$ -399360
##END=
