##TITLE=1316
##JCAMPDX= 6.0         $$ Bruker NMR JCAMP-DX V2.0
##DATA TYPE= NMR SPECTRUM
##DATA CLASS= XYDATA
##ORIGIN= NUTS EXPORT
##OWNER= Administrator
$$ 1.72 TOPSPIN		Version 2.1
$$ 2016-02-23 12:19:03.730 -0800  Administrator@X
$$ Compression mode = diff/dup
##.OBSERVE FREQUENCY= 90.275459
##.ACQUISITION MODE= SIMULTANEOUS (DQD)
##.ACQUISITION SCHEME= undefined
##.AVERAGES= 16
##.DIGITISER RES= 22
##SPECTROMETER/DATA SYSTEM= 
##.PULSE SEQUENCE= zg30
##.SOLVENT NAME= None
##.SHIFT REFERENCE= INTERNAL, None, 1, 14.48145
##AUDIT TRAIL= $$ (NUMBER, WHEN, WHO, WHERE, PROCESS, VERSION, WHAT)
$$ ##TITLE= Audit trail, TOPSPIN		Version 2.1
$$ ##JCAMPDX= 5.01
$$ ##ORIGIN= Bruker BioSpin GmbH
$$ ##OWNER= Administrator
$$ $$ E:/data/jwist/nmr/1316/1/pdata/1/auditp.txt
$$ ##AUDIT TRAIL=  $$ (NUMBER, WHEN, WHO, WHERE, PROCESS, VERSION, WHAT)
(   1,<2016-02-23 08:38:49.449 -0800>,<Administrator>,<X>,<jcamp>,<TOPSPIN 2.1>,
      <fromjdx created from
       E:\data\jwist\nmr\uniandes\1316
       data hash MD5: 8K
       31 9B 73 52 D8 69 93 54 39 F8 02 57 FD 98 07 C1>)
$$ ##END=
$$ 
$$ $$ hash MD5
$$ $$ DF 14 25 1B CC F5 47 C9 C0 4B A7 F7 E2 3D 5B 30
##$RELAX= 
$$ Bruker specific parameters
$$ --------------------------
##$DU= <E:>
##$EXPNO= 1
##$NAME= <1316>
##$PROCNO= 1
##$TYPE= <nmr>
##$USER= <jwist>
##$ACQT0= 0
##$AMP= (0..31)
100 100 100 100 100 100 100 100 100 100 100 100 100 100 100 100 100 100
100 100 100 100 100 100 100 100 100 100 100 100 100 100
##$ANAVPT= 1
##$AQSEQ= 0
##$AQ_mod= 3
##$AUNM= <au_zg>
##$AUTOPOS= <>
##$BF1= 90.275459
##$BF2= 400.02
##$BF3= 400.02
##$BF4= 400.02
##$BF5= 400.02
##$BF6= 400.02
##$BF7= 400.02
##$BF8= 400.02
##$BYTORDA= 0
##$CFDGTYP= 0
##$CFRGTYP= 0
##$CHEMSTR= <none>
##$CNST= (0..63)
1 1 145 1 1 1 1 1 1 1 1 1 1 1 1 1 1 1 1 1 1 1 1 1 1 1 1 1 1 1 1 1 1 1 1
1 1 1 1 1 1 1 1 1 1 1 1 1 1 1 1 1 1 1 1 1 1 1 1 1 1 1 1 1
##$CPDPRG= <>
##$CPDPRG1= <>
##$CPDPRG2= <>
##$CPDPRG3= <>
##$CPDPRG4= <mlev>
##$CPDPRG5= <mlev>
##$CPDPRG6= <mlev>
##$CPDPRG7= <mlev>
##$CPDPRG8= <mlev>
##$CPDPRGB= <>
##$CPDPRGT= <>
##$D= (0..63)
0 1 0 0 0 0 0 0 0 0 0 0 0 0 0 0 0 0 0 0 0 0 0 0 0 0 0 0 0 0 0 0 0 0 0 0
0 0 0 0 0 0 0 0 0 0 0 0 0 0 0 0 0 0 0 0 0 0 0 0 0 0 0 0
##$DATE= 0
##$DBL= (0..7)
120 120 120 120 120 120 120 120
##$DBP= (0..7)
150 150 150 150 150 150 150 150
##$DBP07= 0
##$DBPNAM0= <>
##$DBPNAM1= <>
##$DBPNAM2= <>
##$DBPNAM3= <>
##$DBPNAM4= <>
##$DBPNAM5= <>
##$DBPNAM6= <>
##$DBPNAM7= <>
##$DBPOAL= (0..7)
0.5 0.5 0.5 0.5 0.5 0.5 0.5 0.5
##$DBPOFFS= (0..7)
0 0 0 0 0 0 0 0
##$DE= 6.5
##$DECBNUC= <off>
##$DECIM= 2432
##$DECNUC= <off>
##$DECSTAT= 4
##$DIGMOD= 1
##$DIGTYP= 12
##$DL= (0..7)
0 120 120 120 120 120 120 120
##$DP= (0..7)
150 150 150 150 150 150 150 150
##$DP07= 0
##$DPNAME0= <>
##$DPNAME1= <>
##$DPNAME2= <>
##$DPNAME3= <>
##$DPNAME4= <>
##$DPNAME5= <>
##$DPNAME6= <>
##$DPNAME7= <>
##$DPOAL= (0..7)
0.5 0.5 0.5 0.5 0.5 0.5 0.5 0.5
##$DPOFFS= (0..7)
0 0 0 0 0 0 0 0
##$DQDMODE= 0
##$DR= 22
##$DS= 2
##$DSLIST= <SSSSSSSSSSSSSSS>
$$ [...]
##$SPOFFS= (0..31)
0 0 0 0 0 0 0 0 0 0 0 0 0 0 0 0 0 0 0 0 0 0 0 0 0 0 0 0 0 0 0 0
##$SUBNAM0= <"">
##$SUBNAM1= <"">
##$SUBNAM2= <"">
##$SUBNAM3= <"">
##$SUBNAM4= <"">
##$SUBNAM5= <"">
##$SUBNAM6= <"">
##$SUBNAM7= <"">
##$SUBNAM8= <"">
##$SUBNAM9= <"">
##$SW= 20.5580556627758
##$SWIBOX= (0..15)
0 0 3 4 0 0 0 0 0 0 0 0 0 0 0 0
##$SW_h= 8223.68421052631
##$SWfinal= 0
##$TD= 65536
##$TD0= 1
##$TE= 300
##$TE2= 300
##$TE3= 300
##$TEG= 300
##$TL= (0..7)
0 120 120 120 120 120 120 120
##$TP= (0..7)
150 150 150 150 150 150 150 150
##$TP07= 0
##$TPNAME0= <>
##$TPNAME1= <>
##$TPNAME2= <>
##$TPNAME3= <>
##$TPNAME4= <>
##$TPNAME5= <>
##$TPNAME6= <>
##$TPNAME7= <>
##$TPOAL= (0..7)
0.5 0.5 0.5 0.5 0.5 0.5 0.5 0.5
##$TPOFFS= (0..7)
0 0 0 0 0 0 0 0
##$TUNHIN= 0
##$TUNHOUT= 0
##$TUNXOUT= 0
##$USERA1= <user>
##$USERA2= <user>
##$USERA3= <user>
##$USERA4= <user>
##$USERA5= <user>
##$V9= 5
##$VALIST= <valist>
##$VCLIST= <CCCCCCCCCCCCCCC>
##$VD= 0
##$VDLIST= <DDDDDDDDDDDDDDD>
##$VPLIST= <PPPPPPPPPPPPPPP>
##$VTLIST= <TTTTTTTTTTTTTTT>
##$WBST= 1024
##$WBSW= 4
##$XGAIN= (0..3)
0 0 0 0
##$XL= 0
##$YL= 0
##$YMAX_a= 1323540736
##$YMIN_a= -3942322.176
##$ZGOPTNS= <>
##$ZL1= 120
##$ZL2= 120
##$ZL3= 120
##$ZL4= 120
##$ABSF1= 10
##$ABSF2= 0
##$ABSG= 5
##$ABSL= 3
##$ALPHA= 0
##$AQORDER= 0
##$ASSFAC= 0
##$ASSFACI= 0
##$ASSFACX= 0
##$ASSWID= 0
##$AUNMP= <proc_1d>
##$AXLEFT= 0
##$AXNAME= <>
##$AXNUC= <off>
##$AXRIGHT= 0
##$AXTYPE= 0
##$AXUNIT= <>
##$AZFE= 0.1
##$AZFW= 0.1
##$BCFW= 1
##$BC_mod= 2
##$BYTORDP= 0
##$COROFFS= 0
##$CY= 15
##$DATMOD= 1
##$DC= 2
##$DFILT= <>
##$DTYPP= 0
##$F1P= 0
##$F2P= 0
##$FCOR= 0.5
##$FTSIZE= 0
##$FT_mod= 4
##$GAMMA= 1
##$GB= 0
##$INTBC= 1
##$INTSCL= 1
##$ISEN= 128
##$LB= 0.3
##$LEV0= 0
##$LPBIN= 0
##$MAXI= 10000
##$MC2= 0
##$MEAN= 0
##$ME_mod= 0
##$MI= 0
##$NCOEF= 0
##$NC_proc= -9
##$NLEV= 6
##$NOISF1= 0
##$NOISF2= 0
##$NSP= 1
##$NTH_PI= 0
##$NZP= 0
##$OFFSET= 14.48145
##$PC= 1
##$PHC0= 0
##$PHC1= 0
##$PH_mod= 0
##$PKNL= yes
##$PPARMOD= 0
##$PPDIAG= 0
##$PPIPTYP= 0
##$PPMPNUM= 2147483647
##$PPRESOL= 1
##$PSCAL= 4
##$PSIGN= 0
##$PYNMP= <proc.py>
##$REVERSE= no
##$SF= 90.2741516994647
##$SI= 8192
##$SIGF1= 0
##$SIGF2= 0
##$SINO= 400
##$SIOLD= 32768
##$SPECTYP= <>
##$SREGLST= <1H.CDCl3>
##$SSB= 0
##$STSI= 0
##$STSR= 0
##$SW_p= 1497.18866228788
##$SYMM= 0
##$S_DEV= 0
##$TDeff= 0
##$TDoff= 0
##$TI= <>
##$TILT= no
##$TM1= 0
##$TM2= 0
##$TOPLEV= 0
##$USERP1= <user>
##$USERP2= <user>
##$USERP3= <user>
##$USERP4= <user>
##$USERP5= <user>
##$WDW= 1
##$XDIM= 8192
##$YMAX_p= 1323540480
##$YMIN_p= -3941888
##$CURPLOT= <PDFCreator>
##$CURPRIN= <$PDFCreator>
##$DFORMAT= <normdp>
##$LAYOUT= <+/1D_H.xwp>
##$LFORMAT= <normlp>
##$PFORMAT= <normpl>
##$SURQMSG= 1
$$ End of Bruker specific parameters
$$ ---------------------------------
##XUNITS= HZ
##YUNITS= ARBITRARY UNITS
##XFACTOR= 0.182762287876938
##YFACTOR= 1
##DELTAX= -0.182762287876938
##NPOINTS= 8192
##FIRSTX= 1497.0059
##FIRSTY= -3941888
##LASTX= 0
##MAXY= 1323540480
##MINY= -3941888
##XYDATA= (X++(Y..Y))
8191 -3941888 178176 -317952 956928 818688 245760 632320 729600 -28672 361984 -541696
8180 -532992 41472 204288 37888 1216000 1028608 -730112 477696 -26624 65024 -254464
8169 147456 743424 393728 524288 357888 -180736 477184 574464 481280 -83456 -199680
8159 -199680 -249856 211968 -224256 526848 739328 119296 245760 298496 1149440 301568
8148 739328 125440 501248 1031168 136192 -224768 1018368 575488 288768 -54272 825856
8137 -83456 643072 101376 117760 1166848 684544 272896 359936 145920 2111488 642048
8126 -100864 236032 442880 -22016 810496 929792 -388096 256000 545280 76800 -229376
8115 671232 784896 491008 385536 642048 1363456 774144 -220160 900096 403968 -215040
8104 773120 1347584 -701440 60928 -308224 -187392 584192 574976 972800 -788480 439808
8093 262656 1236992 822784 221696 -585216 -200192 776704 878080 898048 -89088 409088
8082 772096 -893440 353280 353280 1273344 1404416 668160 978432 144896 743424 1169920 3072
8070 -259584 535040 959488 1853440 448000 464384 1143296 351744 945152 259584 -177664
8059 989696 693760 115712 1063936 1460224 194048 830976 158720 585728 -200704 722944
8048 407040 -626176 624640 422912 46592 513536 1830912 423936 1112576 608256 776192
8038 776192 58368 79360 1523200 -220160 671744 733696 -6656 887296 1014784 37888 765952
8027 765952 505856 659456 749568 960512 1128960 852992 1411584 367104 -7168 329728
8016 555008 821760 1332224 1221632 -366080 770048 559616 1242624 1271296 2121216 67072
8005 622080 604160 -293376 944128 760320 16384 924672 163840 911360 1242624 -265728
7994 711680 854016 -472576 -214016 801280 846848 752128 808448 1776640 707072 747008
7984 747008 375296 655360 1097728 -314368 1303552 1266176 56832 927744 1633792 1283584
7974 1283584 926208 545280 36864 1003520 311808 789504 1917952 786944 82432 391168
7964 391168 153088 60928 -43008 -308224 -243200 -205824 846848 849920 1348096 -643584 1148416
7952 175104 -643072 573952 1379328 667648 -782848 558080 -295936 492032 -132608 932352
7941 237056 1243648 1540608 301568 328704 -546816 730624 2230272 541696 53248 7680
7930 99840 -181760 691200 631808 1344000 1291776 1339392 1220096 290304 1230336 2053120
7920 2053120 1159168 768512 317952 388096 -765440 634368 84992 499200 961536 1741312
7910 1741312 756736 130560 -74752 970752 841728 349184 1103872 -22528 1510400 641536
7899 267776 1420800 1620992 1056768 1036288 932864 1506304 814080 769024 1530368 430592
7888 1905664 336384 939008 -524800 853504 1135616 175616 744448 -226816 506368 635392
7878 635392 1297920 83456 732672 -108032 1228800 1610752 579072 765952 693248 1536512
7868 1536512 406016 598528 434176 1030656 947712 -515584 1275904 841216 1808384 727552
7857 329728 834560 11264 347648 609280 376832 131072 1181184 -381952 1496064 -22528
7846 -443392 138752 1403904 417792 -231936 711680 849408 833024 1157120 240128 758784
7836 758784 728064 754688 577536 569856 359424 -470016 -908288 529920 1094144 278016
7825 1603584 780800 401920 54784 1296384 314880 517120 317440 933888 421376 1835520
7815 1835520 493056 555520 675840 -140800 537600 914944 452096 683520 711168 659456
7805 659456 1081344 1226752 1208832 331776 1143808 331264 727040 863232 195584 204800
7795 204800 960000 1921536 653312 1094656 1089024 817152 1059840 722432 25600 1219072
7785 1219072 1517568 844800 1089024 922624 967680 817664 1029632 -84992 544768 471552
7775 471552 359424 664064 647680 1383424 1899520 -435200 527872 1148928 621056 1268224
7765 1268224 1531904 879616 659968 737792 494080 -534528 1202688 1177088 1894400 1100800
7755 1100800 1064960 2328576 1388032 1344000 735232 932352 513024 1757184 820736 345088
7744 -581120 306688 40960 869888 1484800 148992 119296 642048 1263104 1118720 1463808
7734 1463808 746496 774656 1278464 139776 558080 187904 228864 150016 1077248 692736
7724 692736 502272 137216 238592 1239552 994816 -288256 553984 722944 506880 993280
7714 993280 346624 1439744 859136 62464 -361472 1397248 1540608 807936 725504 -114688
7703 1520128 1583616 773120 471552 1312768 588288 1760256 -243200 1393664 535552
7693 2170880 1713664 1366528 1386496 411136 973312 233984 125440 771072 1477120 705536
7682 679936 1220096 1321984 191488 1651712 1037824 1282560 787968 606720 1144320 653312
7672 653312 1443328 711680 1725440 790528 260096 1489920 704000 207872 712192
7663 712192 1520640 -44544 654336 1689088 169472 1020928 952320 1109504 -206848 892928
7652 1789440 2033664 961024 544768 1297408 625664 1309184 946688 417792 -115200 951296
7641 2294272 1144320 878080 1602048 751616 1021440 992256 426496 1356800 614912 1461248
7631 1461248 872448 1437184 1244672 650240 224768 284160 1295360 589312 712192 1872384
7621 1872384 689664 -141824 1146368 1330176 1107456 1635328 1362432 1154048 953344
7612 953344 1203712 -83968 1001984 1341952 24576 1974784 814080 1552896 1186816 923648
7602 923648 1042432 1309696 867328 407552 800768 761856 1124352 546304 480768 925184
7592 925184 1070592 1231360 1044480 1296896 854016 388096 1367040 1026048 -125440 1015808
7581 1085952 761344 40960 1352704 -152064 1044480 246784 965120 1069568 775168
7572 775168 1422336 2181632 1897472 1831424 1179136 552448 940032 727552 1306112 1534976
7562 1534976 775168 484864 526848 333312 39424 1589760 1018880 18432 178176 1298944
7552 1298944 1125888 1160704 663552 1010688 1010688 995840 2209280 1337856 699904 -82432 1490944
7540 300032 1196032 975360 564224 496128 2000384 -19968 1240064 1394176 1005568 1170944
7530 1170944 458752 2923008 1337856 1034240 484352 1988096 717312 1295872 1573376
7521 1573376 -54784 1165312 824320 557568 620544 1312768 1361408 715776 1561600 1170944
7511 1170944 270336 462848 887296 1792000 1315328 1672704 1805824 2213376 79360 502784
7501 502784 916992 1554944 773120 795648 1234944 368640 301056 993792 338944 981504
7491 981504 733184 1296384 1200640 934400 1700352 728064 1517568 2224640 755200 540672
7481 540672 732672 794112 448512 1151488 754176 1437184 1036800 1366016 1383936 1424896
7471 1424896 879104 837632 777216 897536 294400 2393088 1512960 674304 1327616 1389568
7461 1389568 2328576 314368 275968 1081344 1269248 525824 766464 699904 1540608 1463296
7451 1463296 878592 900096 1278464 1319424 1916928 1920000 593920 1164800 1721856 1342976
7441 1342976 1139200 908800 200192 396800 693760 680448 1402368 880640 1229312 1223168
7431 1223168 1862144 1132032 970752 844288 1090048 531968 769024 1528320 771072 1472000
7421 1472000 1184768 1205760 1172992 1479168 527872 1433600 531968 2297344 513536 1048064
7411 1048064 322048 1966592 704512 19968 692736 1770496 1424896 1392640 473088 -72192
7400 1937920 547328 1418752 1237504 647680 1238016 726016 960512 1472000 832000 1448960
7390 1448960 1182208 1709056 1135616 832000 1828352 759808 1750528 1816064 228864 874496
7380 874496 1010176 756736 1459712 1265152 695296 1162752 1404928 1048576 1532928 980992
7370 980992 2572800 537600 1624064 362496 979968 494080 1349632 351744 1917440
7361 1917440 1898496 835072 1444352 1455616 1125888 1759744 1594368 1666560 459264 1520128
7351 1520128 1377280 1376256 749568 669184 619008 1566720 2302976 1042944 1385984 1993216
7341 1993216 1922048 1585152 1850880 1175552 1013760 614912 1582592 1067008 506368 1093632
7331 1093632 1113600 1459200 2202112 1031680 558592 571904 1136128 1440768 2170880 1462272
7321 1462272 59392 1144320 1327616 293888 1107456 1946112 847360 1669120 -11776 -32256
7311 -32256 628224 947712 425472 1785344 1361408 1520640 722944 1154560 1497600 884736
7301 884736 1079808 1535488 1031680 1384448 1030656 1296896 317440 1145856 870912 1519616
7291 1519616 1067008 2110464 245760 1469440 2089984 1364992 1034240 958976 1271808
7282 1271808 950272 1397760 2622464 459776 1175040 1207296 1928704 1879552 1229824 394752
7271 2377216 1480192 871424 934912 2701824 1510400 2326528 1434112 1471488 821248 764928
7261 764928 322048 1693184 1895424 1576960 1529856 1246720 1184768 272384 1664000 1063936
7251 1063936 1399808 2198016 353280 1662976 503296 1744384 1117184 2491392 1815552
7242 1815552 1407488 933376 500736 2329088 942080 2296832 711680 2392064 1351168
7233 1351168 1455104 987136 1632768 1210368 1747456 881664 1241088 1581568 2695168
7224 2695168 1071104 1756672 617984 648192 834048 952320 438272 630784 1229312 976384
7214 976384 1632768 1460224 1351168 738816 1288704 1484288 2946560 1418752 548864
7204 2010624 1884160 1606656 592384 2191360 715776 1631744 1069056 482304 330240
7195 330240 851456 1827840 1748992 1285632 2039296 -246272 1000448 452096 2382336 984576
7184 1450496 606720 1521152 714240 845824 940544 2021888 789504 1689600 1970176 884736
7173 1910784 1167360 1494016 1303552 1271808 1481216 1848832 1997824 1749504 1660928 1327104
7163 1327104 1419776 1662464 939520 1775104 2099200 1783296 1100288 765952 1419264 1884672
7153 1884672 1646080 976896 1679360 902144 2043392 1250304 1509376 765952 715264 1609728
7143 1609728 1303040 928256 1164288 1737216 1654784 2441728 1635840 2353152 480256 1267200
7133 1267200 1663488 2038272 847872 2395648 1207296 2069504 871424 1659904 1754624
7124 1754624 951808 1697792 1058816 2475520 1815552 1053184 1681408 1823232 830464
7114 1044480 120832 1318912 2257920 1238528 1831424 921088 1247744 1343488 -394752
7104 1375232 1606656 807424 1187840 2739712 1533952 1518080 1273344 1572864 1235968
7095 1235968 1402880 742400 1638912 1691648 1572864 1301504 1724928 1204736 1836032 811008
7084 1097216 2298368 1777664 1762816 358400 770048 1982976 2472448 1615872 1589760 990720
7074 990720 193536 1645056 1822208 1379328 1472512 1342464 1713664 2024960 974336 2534912
7064 2534912 1321984 1816064 2077696 886272 296448 1951232 1583104 1329152 2116608
7055 2116608 1868288 2002432 1711104 686592 1696256 1066496 1739264 1301504 2293248
7046 2293248 819712 1959424 847360 1951744 1305088 1502720 1938944 1767936 1377792
7037 1377792 813568 889856 1348096 1908736 775680 1796608 1132544 1180672 1583616 989184
7027 989184 1735680 1538048 1839104 1659392 1586688 1428992 1329152 1083392 1434624 1359360
7017 1359360 2030080 2212864 1463296 1140224 731648 1500672 2593792 1134080 1874944
7008 1874944 1904128 2041856 919040 557056 840192 1087488 2460672 1246720 2193920
6999 2193920 1700864 1167360 1328640 2467840 2194432 2198528 1282048 1736192 1148928 1387520
6989 1387520 1951744 1886720 1963520 2754048 2048512 1698304 808448 1001472 1083392 1516032
6979 1516032 1968128 705024 2063360 1449984 1418752 1053184 1891840 1288704 1705472 1902080
6969 1902080 1490432 532992 1350144 1870848 1639424 1998336 1030144 1710080 1305600 1274880
6959 1274880 2179584 2194944 1231360 592384 1858048 1578496 1604608 513024 2176512 2317824
6949 2317824 1213440 1583616 1870848 2127360 1702400 2425856 1400832 1630208 1567232
6940 1567232 1241600 1855488 2628608 1046528 1518080 1040896 1307136 1270784 1925120 2332160
6930 2332160 2316800 1642496 690688 839680 1197568 2310656 1227264 1617920 991232
6921 991232 2474496 801280 1427456 797184 1624576 1486848 2165760 1213952 1918976 869888
6910 2250240 914944 1764352 1143296 1228800 2280448 1975808 1552384 1552384 2214912 1790976
6900 1790976 1141760 1394688 1404416 1137152 195584 1646080 1764864 1242624 1517056 2177024
6890 2177024 2472960 1366528 2748928 1856512 1600512 903168 1848320 1297408 1810432
6881 1810432 850432 1938432 2118144 1314304 2053120 1771520 986112 1084928 2386432
6872 2386432 1881600 1549824 475136 2010624 2350080 1532928 1948672 1758720 1593344
6863 1593344 2190848 1537024 991744 1162240 1392128 1367040 983040 496128 1138176 1355264
6853 1355264 2051584 1706496 2281984 2224128 2682368 1708544 2255360 2720256 2182656 931328
6842 1965568 2187776 1757696 2015744 1933312 1368064 2636288 1326592 1702400 1722880 907776
6832 907776 1336832 2121728 670720 1284096 1610752 1707008 1448960 2107904 1253376 1111552
6822 1111552 2197504 1319424 1567232 1691648 1201664 1150464 1271808 1635840 1856000 1890816
6812 1890816 1185792 1494528 1364480 1658880 573952 1467904 1686528 1552896 1498624 2276864
6802 2276864 1703936 2266112 1698816 1600000 1686528 1718272 1775104 2722816 1676288 1785856
6792 1785856 1648128 1614336 1535488 1990656 1762816 1198592 996864 1776128 1325056 1595904
6782 1595904 2056192 1190400 1764864 1318400 2393088 963072 1782272 1432064 2785280
6773 2785280 1722368 2659840 1813504 2003456 2245632 1506304 1564672 1347072 1435648 1696768
6763 1696768 852480 1620480 910336 1590272 2045440 1840640 1549824 1271808 1364480 2661888
6753 2661888 1956864 2235392 1484800 1809408 2259456 793600 1076736 1857024 2198528 2368512
6743 2368512 2165248 1874944 1826816 1373696 2160128 1288704 3117568 1430528 1800192
6734 1800192 949760 1060864 1500672 1913856 2200576 2043904 2140672 2606592 2424320 1397760
6724 1397760 1629696 1014784 1921024 978944 1047552 1678336 1831424 1745920 2271232 1230848
6714 1230848 1261568 1370624 2060800 1307136 1530880 2586624 1037824 1484800 2132480
6705 2132480 2106368 1701376 1872896 1381376 1201664 1477632 1672704 2597888 2514944 1247744
6694 1786368 1040896 2209280 1953792 1969152 1600512 1747456 2329088 471552 2106368
6685 2106368 417792 1310208 2649088 601088 816640 1755136 1942016 888320 2467840
6676 2467840 2219520 1694720 2551808 1426944 1418752 2159616 2017792 1929216 1608704 2135040
6666 2135040 2150912 1003520 1326592 906752 1945088 2697728 1633792 1001984 1773056
6657 1773056 2273280 1748480 1388032 2683904 1324544 2502144 2541056 1245696 3045376
6648 3045376 2008576 2413568 1831936 1390080 2985984 1620480 2190336 2586624 1759232
6639 1759232 2055168 2066944 1547264 2514432 1456640 2295808 1314816 1956864 2297856 1669632
6629 1669632 2258432 1902592 1996800 998400 1358336 1608192 1507328 1154048 1814016 2286080
6619 2286080 1560064 1005568 1291776 2073088 2104832 1273856 1423360 2072064 1628160 2284544
6609 2284544 1382912 1699840 2080768 1797632 1858560 2110464 1726464 1876992 1869824 1163776
6599 1163776 2031104 2253312 2251264 1101824 1848832 2877952 1938432 1921536 2274304 2712576
6589 2712576 1110016 2122752 1139200 2424832 1543680 1686528 2971648 1182720 2500608
6580 2500608 2265088 1011712 1312768 2937344 885760 1669120 1867776 3871744 2119680
6571 2119680 1700864 2323968 1597440 1818112 2068992 2448384 2569728 1262592 1461760
6562 1461760 2183168 2369024 2662912 1892864 2195968 1905152 1961472 1703936 2401280 1598464
6552 1598464 3278848 1709568 2169344 1587200 2072064 1628160 1661440 1649152 2054144 2403328
6542 2403328 1505280 2138112 2220544 1356288 2140160 2672640 1071104 1134080 1812992 2235904
6532 2235904 2726400 1840640 2058752 1914368 2763776 2399232 2879488 2313728 936960 2002432
6522 2002432 2012672 2406912 1892864 2222592 2745344 1884672 2176000 1655296 2671616 2646016
6512 2646016 1784320 2414592 1051136 1961984 1679360 1144832 1380864 2236416 1019904
6502 2224640 1441280 2538496 1043968 2437120 1616384 1997824 2503680 2450944 2393088
6493 2393088 1973760 1984000 1842176 2273280 2747392 3291648 2084352 1647104 2066432 1264640
6483 1264640 1265152 2642432 2451456 1852928 1274368 1537536 1370624 2739712 2850816 2334208
6473 2334208 2004480 2154496 2027520 1953792 2208256 1946624 1778176 2911232 2451968 2725888
6463 2725888 2222592 1515008 1293824 1818112 2905088 1859072 2358784 604672 1966592
6454 1966592 2435072 2544640 2514432 1712640 2082304 2614784 2519040 2434048 906752 1945600
6444 1945600 1901568 2042880 1705984 2203648 2234880 2802176 1506816 2285056 2255872 1808384
6434 1808384 2763264 1324032 847872 2569728 2219520 2585600 1808896 2896896 1445888
6424 1523712 2306560 2235904 1399808 1575424 2233344 2308608 2010624 2040320 2657280 2875904
6414 2875904 1933312 1943552 2545664 2252288 1661440 2325504 2937856 1708032 2417152 2977792
6404 2977792 1859072 1238528 2398208 2353152 2096640 2592256 3509248 1724416 2836992
6395 2836992 1413632 2035712 2265600 2000896 1607168 2852352 2452992 2405376 2127872
6386 2127872 2578944 1102336 1675264 1973248 2277376 1781760 1730560 1970688 2518528 2257408
6376 2257408 2434560 803840 2448896 1985536 1773056 2717184 2093568 1972224 1010688
6367 1010688 2739200 1534976 1249280 2433024 2202624 1441792 2080768 2020864 1918464
6358 1918464 2096128 2221056 2857472 2118144 973824 2426368 1549824 1349632 2198528
6349 2198528 1405440 3234816 1287168 2616320 1043968 1859584 2563584 2315264 2985472
6340 2985472 1899520 1657344 1068544 1668096 1984000 2871296 3251200 2191872 1121792
6331 1121792 1650688 2030080 2535424 1513984 2360320 2612736 2558976 1740800 1887744 1545728
6321 1545728 2651648 2386432 2953216 2660864 1011200 3040768 1364992 1825280 1832960
6312 1832960 2008064 1143296 2455552 2051584 1273344 1947648 1791488 2500608 1508864
6303 1508864 2592768 2845184 2372096 2861568 2061312 1300992 3082752 2686976 2444288
6294 2444288 2003456 1620480 2320384 2409472 1166336 1573376 2662912 3026432 2380800
6285 2380800 1814528 2721280 3776512 2283520 1989120 1164800 2317824 2302464 1398272
6276 1398272 1336832 2093568 1683456 1986560 2058752 2120704 1458688 1709568 2233344 2265088
6266 2265088 1999872 1674752 995840 1336832 1511936 2159616 1133056 1819136 1462784
6257 1462784 2084864 2326528 3058688 2139136 2093056 2073088 2729984 1724416 1778688 1960448
6247 1960448 2364928 2376192 3767296 2610688 2384896 1834496 2192896 1733120 1532928
6238 1532928 2832896 1873920 1452544 2215424 1139712 1583616 1479680 1815552 2326016
6229 2326016 2195456 2391552 3719680 1932288 2372608 2323968 1804800 1895424 1808896 2528768
6219 2528768 3387904 2080768 2874368 1914880 2378240 1090560 2651136 1702912 2833408
6210 2833408 2761728 3331584 1967616 1938432 1686016 1396736 2108416 2527232 2020352 2047488
6200 2047488 2376192 2642944 1762304 2840576 2329088 2903040 2225152 2148864 2465280 1787904
6190 1787904 3402752 1584640 2762752 2401280 1664512 1910784 1354752 2096640 3449856
6181 3449856 1583616 2834432 2042368 1870336 1824256 2312192 1805824 2292224 2760704
6172 2760704 2916864 1909248 2569728 2912768 2278912 2945536 2675200 2731008 2028032 2036736
6162 2036736 2027008 1946112 1670144 2697216 2700800 2528256 2657792 2960384 1606656 2589696
6152 2589696 2436608 2665984 2401792 2056704 1468416 2868736 2224128 2507776 1866752
6143 1866752 2891264 1887232 2619904 1508352 2240512 2332672 1995776 1919488 1830912 2220032
6133 2220032 1442816 2266624 1568768 3869184 2159104 2024448 2126848 2771968 1921024
6124 1921024 3179520 2364416 2190336 2743296 1215488 2336256 2072064 2694656 1377280
6115 1377280 3162624 2812416 2169856 2341888 2728448 898048 2540544 2017280 2318848
6106 2318848 1699840 2706432 2214912 1858560 2294272 2471936 2157568 3276288 2799616
6097 2799616 1875968 2905088 3078656 2259456 2689536 1731584 1851392 2401280 1697280
6088 1697280 2086912 2918400 2445824 2319360 2165760 2504704 2923520 1777664 1692160 2874368
6078 2874368 2558464 2165760 1134080 2315264 2387968 3195904 2747392 1989632 1558016
6069 1558016 2416640 3235328 1754624 2421248 1899520 3118592 2746880 2749440 2036224 2282496
6059 2282496 2349568 2543616 3245568 1852416 1922048 2270208 1324544 1700864 3630592 2640384
6049 2640384 2206208 2231296 3071488 1995776 1686016 2370048 2667520 1728000 1779712 2773504
6039 2773504 2146304 1707520 3061248 2590208 2011136 1772544 2691072 2513920 2892288
6030 2892288 1640448 2030080 1876992 1522176 3378176 2910208 1674752 2784768 1349120
6020 2484736 1446400 2422784 2457088 2523648 2261504 1449472 2837504 2612224 2744320 2337792
6010 2337792 2911744 3703808 3101696 1617408 2002432 3216896 2068992 3176448 2758656
6001 2758656 2838016 2353664 1055744 3122688 3056640 1850880 2064896 3598336 2862592
5992 2862592 2257920 2075136 4026368 793600 1657856 2116608 2206720 2213888 2780160 2205696
5982 2205696 1595904 2782720 2693120 1853952 1742336 3194368 2529792 2659840 2714624 1738752
5972 1738752 2524160 3210752 1877504 2123776 2311168 2440704 2362368 2272768 2160640 2511872
5962 2511872 2247680 2351104 1695232 2915840 2575360 2396160 2578432 2586112 2738176 1194496
5951 3265536 1145344 1605120 2237440 3111424 1970688 2133504 2748928 3235328 2950144
5942 2950144 3152896 2021376 2753536 2471424 3176448 2201088 1910272 1880576 2411008 909824
5931 2302976 1579520 1642496 1418752 1951744 2143232 1566208 1319936 2448896 2302976 1126912
5920 2412544 2078208 2761216 3201536 1624576 3158528 2954240 2138112 2318336 1853440
5911 1853440 3317248 2223616 3559936 1486848 2864128 3061248 3357184 1495552 3419648
5902 3419648 2153472 2753024 3737600 3244032 1858048 2085888 2977280 2459648 2203648
5893 2203648 2929152 3552256 2449920 2585088 1622528 2554880 1475072 1822208 2553344
5884 2553344 2258944 2481664 2554368 2880000 3292160 1967616 2570752 3205120 2398208 1732608
5874 1732608 2505728 2281984 2277376 2985472 2160128 2241536 2725888 2370560 2885120 2077184
5864 2077184 2606592 3254784 3096064 1779200 2464768 2019328 1970176 2131968 1969152 2753536
5854 2753536 2536960 2245632 2476032 2727424 2511360 2960896 2048000 2929664 3114496 3011584
5844 3011584 2024448 2259456 2553856 1830400 2046976 2576384 2113536 2971136 3144192 2445824
5834 2445824 2575872 2476032 2567680 2140672 3233792 3235328 1520640 2144768 851968 2227712
5824 2227712 3222528 3389952 1758208 1876480 2014720 3682304 1814528 3207168 1288704
5814 2622464 3276288 2750464 2718208 2211328 2824704 1367040 2877440 2362880 2104320
5805 2104320 2745856 2966528 2675200 1903104 2893312 2553856 3307008 2872832 3059712 1330176
5794 2912256 2700288 3087360 2551296 2622976 2773504 2416640 2451968 3694592 2687488 1954304
5784 1954304 2131968 2708992 2232832 2587136 2512384 2827776 1991680 2029056 2771456 2838528
5774 2838528 2002944 2695168 2400768 2048000 2626560 2653696 2853376 2257408 1409536 2350080
5764 2350080 3982848 2668032 2691072 2478080 2007040 3215872 2202624 2246144 2870272
5755 2870272 2440704 2241536 3407360 2531840 2570240 2195968 3025920 2630144 2797056 2785792
5745 2785792 1604608 2608640 2697728 2894336 2342912 1985536 2493440 2541056 2598912 3142656
5735 3142656 2739200 1775104 1945600 1873920 2904576 2580992 3082752 3037184 3732992 3251712
5725 3251712 1714688 3290112 2089984 2353664 2568192 3057664 2707968 2599936 3555840
5716 3555840 2047488 1876480 3239936 3183104 2326528 2633728 2981376 1677312 3052544
5707 3052544 2963456 2095616 3172864 2799616 2116608 2590720 2078208 2269184 3049984 2556928
5697 2556928 3131392 1792512 2779136 3239424 2555904 2883584 2483712 1765888 3586560
5688 3586560 2989056 3518464 3025408 3375104 3303424 3071488 1902592 1704448 3313152
5679 3313152 2597376 2750464 2999808 2783232 2727424 3121152 2144768 2726912 3070976 2933248
5669 2933248 3536384 3136000 2245120 2165248 2487808 2458624 2543616 2361856 2481664 2341376
5659 2341376 2135552 2743808 3077120 2021888 1996288 3674112 3695104 2528768 3024384
5650 3024384 3502080 2614272 2094592 2632704 3726848 2931200 1970688 3158016 2446848
5641 2446848 2401792 2686976 2844160 3401728 3523072 3077120 2375680 2628608 2344960 2766336
5631 2766336 1776640 2918912 2297856 2927616 2633216 2964480 3222016 2235392 3635200
5622 3635200 2724864 3157504 2465792 2488832 3073024 3294208 2641920 2074112 2703872 2337792
5612 2337792 2683392 3544576 2512896 2987008 3047936 2927616 3236352 2597376 3618816
5603 3618816 3787776 2802176 3304960 2954240 2733568 3339776 2435584 3595264 3134976
5594 3134976 3439616 4077056 3994624 3047424 3205632 3178496 3113472 3438080 4370432 4619776
5584 4619776 3376640 3441664 3016192 2728960 2895360 3837952 2327552 2465280 1881600
5575 1881600 3065344 2808320 2285056 2158592 2777088 2854400 1875968 1945088 2719744 2509312
5565 2509312 3238912 2189312 2280448 2755072 2444800 2437632 2753536 2891264 2731520 3247616
5555 3247616 2816512 3350016 2612736 3057152 3329536 3522048 2446848 3324416 3026944
5546 3026944 2995200 2756096 2529792 2509312 2263552 2833408 2482688 2663936 1581568 2419712
5536 2419712 2894848 2521088 2250240 2326016 2118656 2281984 2909184 3251712 2957824 3791872
5526 3791872 2418176 3439104 2316288 2606080 2479104 2721280 3251712 3063808 1741312
5517 1741312 3001344 2927616 2328576 2041856 3154944 3004928 2885120 2875904 1973248 2405888
5507 2405888 1696256 3497472 2518016 3055616 2704384 2237952 3770368 3058176 3944448
5498 3944448 2872320 3374592 3844096 2544128 2848256 2401792 4067840 3955200 2973184
5489 2973184 2566144 2569728 2987008 2659328 1780224 2741248 3499520 2989568 3600896 2840576
5479 2840576 2456064 2682880 2981888 2351104 3218944 3233280 4131840 2548736 2834944 3579392
5469 3579392 3299840 3436032 3211776 2346496 3663872 4379648 4009984 1698304 4134400
5460 4134400 4080640 3343360 3404800 2815488 2547200 2659328 3190784 2587648 3035648 3708416
5450 3708416 3092480 3177472 2646016 2341376 3742208 3397120 2838528 3816960 2861568 3011072
5440 3011072 2636288 2889728 3425792 4199424 3719168 4767232 4040192 3059200 3319296
5431 3319296 2360320 3139072 3133952 2669056 3609088 3500032 3470848 3885568 3133440 3501568
5421 3501568 3559936 3744768 4485120 2956288 3897856 3475968 3319296 3724800 3132416 3343360
5411 3343360 3694592 2817536 2604032 2868736 2871808 2876928 3027456 3300864 3337216 3600896
5401 3600896 3324928 3608064 2459648 2505728 2680832 3153408 2991104 3301376 3728384 3678720
5391 3678720 3053568 3255808 2649600 2406400 2519552 3256832 3203584 3114496 2281984 2750464
5381 2750464 3854336 2614784 2256384 2219008 2552832 2095616 3384832 2853376 2180096
5372 2180096 2715648 2416640 3925504 3035136 3440128 2994176 2793984 2795520 3179520 2739200
5362 2739200 3119616 3284992 3186688 2691584 1391104 2764288 2898944 3459072 2931712
5353 2931712 3226112 2339328 2684928 3196928 2862080 2007040 3499520 2279936 3278336
5344 3278336 3324928 2348544 2024960 1985024 2796544 2040320 2313216 3043840 3056640 2684416
5334 2684416 2383360 2951168 2846720 3088896 3458560 3540480 3242496 2991616 3785216 2970112
5324 2970112 2231808 2724352 2939904 2650112 2702848 2829824 3464704 3225088 3338240 3256320
5314 3256320 3281408 2655232 2674688 2826240 2602496 3632128 3208704 2911232 3317760 2879488
5304 2879488 3665920 2731008 2084864 3301376 3403776 2137088 2842624 2592768 2381824
5295 2381824 2670592 3010048 2838016 3248128 2013696 3267072 2525184 3024896 2678272
5286 2678272 3169280 3957760 2996224 2844672 2352640 2899456 3942400 2896896 3731968
5277 3731968 2789376 4593664 3256832 3000832 3145728 3827200 3042304 2726400 3461632
5268 3461632 2217984 3268096 3270656 2400768 3223040 2786304 2715648 2480640 2627584 3090432
5258 3090432 3376640 2636288 3453952 3405824 2827264 1921024 2838016 2291200 2812928 2100736
5248 2100736 3006976 3265536 2991104 3867136 3646464 3621376 3459584 2200576 2460672 3312640
5238 3312640 2329088 3107328 3333120 3314176 3358208 2683904 3592704 2564608 2919424 3966464
5228 3966464 3531264 3477504 2547712 3450368 2818048 3039232 2388480 2769408 2955776 3126784
5218 3126784 1353216 3582464 2967552 3025408 3533312 3308544 3108352 3728384 2754560
5209 2754560 2297856 4274688 2917376 3537408 3124736 3658752 3160064 4032000 3608576
5200 3608576 2972672 3435008 3769856 4263936 3073024 3434496 3739136 3303424 3608064
5191 3608064 2959872 3316224 3281920 3023360 4147712 1950208 2294784 3082240 3693568
5182 3693568 2734080 2539008 2395136 3475968 2981888 3608064 3514368 2748928 3201536 4334592
5172 4334592 4060672 3587584 2768896 3563008 3167744 3601920 4648448 3206656 3676160
5163 3676160 4497408 3423232 4747776 4261376 6064128 5509120 4737536 4698624 2641920
5154 2641920 4110336 4025856 3826688 2812928 2976768 3174400 2673664 2779136 3194880
5145 3194880 2885632 3366400 2609152 3454976 2871296 4728832 3497984 2809344 3637760
5136 3637760 2384384 3068928 3154944 3273216 3445248 2583040 2210304 2895872 3997696
5127 3997696 2707456 2163712 2522112 3224576 3432448 2890240 3052032 3113984 3472384 3076608
5117 3076608 2813952 2898944 2428928 2169856 3765248 3485184 3340800 3573760 2401280
5108 2401280 2811392 3983360 3405824 3349504 4271104 3454464 3197440 2837504 3697152 2663936
5098 2663936 3174400 3526144 3753472 2430464 2356736 3888128 2535936 3122688 4103680
5089 4103680 3509760 2537984 3043328 3106304 3503104 2950656 2324992 4271616 2674688
5080 2674688 2953728 3131392 4322816 3787776 2412544 4156416 2868736 2379264 2483712
5071 2483712 3205120 3809280 2869760 3503104 3263488 3903488 2583040 3059200 3884544
5062 3884544 5234176 3376128 3946496 3367936 3145216 3175936 3286016 3708416 3163136
5053 3163136 2834944 3107328 3272704 3064320 3497472 3893760 3036160 3484672 3210752 4036096
5043 4036096 3479040 3625472 3977728 2753024 3825152 3107840 3204096 3469824 4256256
5034 4256256 3687936 2888192 4255232 4589056 3055616 3518464 3535872 3536896 3970048 3028992
5024 3028992 3331584 2308096 3425792 2820608 3126272 3045376 4222976 2440192 3810304
5015 3810304 3520000 3705344 3395584 3102208 3298816 3280384 3816448 3573248 4135936 3460096
5005 3460096 3895296 3763200 3208192 3387904 3548672 4147712 4329984 3849728 3739136 3262976
4995 3262976 3045376 4872704 4683264 3869184 2606592 3010048 3392512 2992640 4189184
4986 4189184 3024384 2590208 4001280 4870656 3388416 2989568 4001792 3963904 3522560
4977 3522560 3460608 5980672 3268608 3896320 3889152 3417600 3418624 3940352 3200000 2898432
4967 2898432 3283968 3255296 3158016 4323840 3158528 3826688 3264512 4057600 3533312 3909120
4957 3909120 2775552 3278848 3739648 2095104 4017664 3616256 3828224 3783168 4428800
4948 4428800 3435520 3130880 3131392 4098048 4384256 4525568 3776000 3983872 4285952 4220928
4938 4220928 3898880 3860480 4071424 3920896 4359168 4303872 3884032 5444608 4822016 4720128
4928 4720128 5760000 4770304 5320192 5122048 6677504 6034944 6185984 7509504 7749632
4919 7749632 6599168 5650944 6444032 5184512 6136832 4710400 3701248 3779584 3418112
4910 3418112 3445760 2726400 3002368 3201024 3472896 2960896 3504640 3380736 3264000 3069440
4900 3069440 3456000 3664896 2968064 3652096 3548672 3025408 3250688 3214336 2179072 2809856
4890 2809856 3837440 3013632 3326464 3442176 3734016 3864576 4488704 3585024 3044352
4881 3044352 3494400 3421696 3043840 2180608 3203072 2452992 2658304 3224576 3479040 3620864
4871 3620864 3230720 3077120 2550272 3949568 3310080 3496448 3163648 3656704 3823616
4862 3823616 3514368 3697152 2460672 2848768 3788288 3943424 4163584 3055104 2723328
4853 2723328 4243968 3578880 4021760 3676160 3840000 3820032 5555712 3115520 3506176
4844 3506176 3530752 3849216 3569152 3684352 3752960 3901440 3107840 3016704 3482624 3835904
4834 3835904 3882496 4821504 3470848 3226112 4329472 2688512 4016128 4763648 3240960
4825 3240960 4457984 4690944 3495936 3926528 3711488 4593664 3607552 3977728 4815872
4816 4815872 4317696 3620352 4195840 4027904 3676160 3477504 3031040 3838464 3577344 2745344
4806 2745344 3397632 2990080 2509824 3808256 3438080 2710016 3123712 2864640 3361280
4797 3361280 4118016 3564544 3232256 3965952 4077056 3414528 3454464 3597312 4340736 3285504
4787 3285504 3893760 3098112 4576256 4186624 4416000 3596288 3025920 3706368 3230720
4778 3230720 4191232 4204544 3842048 3473408 4599296 5310976 3879424 4310016 3778560
4769 3778560 3796480 4288512 4214784 4816384 4083200 3784704 3600896 4265984 3414528 3997696
4759 3997696 3378688 3559936 4147200 3495424 3374592 2765824 4084736 4886528 3217920
4750 3217920 2947584 4775936 3354112 3904000 4248576 4238336 3415552 4067840 4603904
4741 4603904 4120064 3575808 4687872 3631104 4884992 3371520 3944960 4393472 4065792
4732 4065792 5052416 4112384 3535872 4391936 3845632 4864000 4272640 4251648 4223488 3592704
4722 3592704 3066368 2846208 3296256 4561920 2729984 4984832 3685888 3124224 3922432
4713 3922432 3270656 4259328 3807232 3513856 4703744 4774400 3268608 2870272 3730432
4704 3730432 3981312 2826240 3388416 4002816 3151872 4153344 3140608 4644352 4828672
4695 4828672 3185152 3608064 3441664 3609600 3304960 3198464 3922432 2438144 3183104
4686 3183104 3330048 4417536 3476992 4176896 3866624 2885632 3437568 3228672 4152320
4677 4152320 4612608 4378624 4423168 5177856 4622848 3709440 3590144 4226048 3913216 3748864
4667 3748864 4238848 3892224 3956224 4899328 4198912 3798528 3959808 4925440 4403712 5104640
4657 5104640 5352448 4220416 3757568 4377600 4134400 5117440 4431872 4862976 5167104
4648 5167104 4309504 4209152 3694592 3732480 4193280 4838912 3847168 3136512 2725376 3773952
4638 3773952 4153856 3944960 3535360 4103168 3945984 4450816 3898368 4926976 4436480
4629 4436480 4168704 4563456 5004800 3302912 4971520 3489792 3895296 4028416 5300736
4620 5300736 4013056 4936192 4766208 4440064 5237248 4775424 4682752 4509184 4321792 4771840
4610 4771840 4604928 4127232 3496960 3225600 4732416 3818496 3333632 5116416 4002304
4601 4002304 3100672 4790272 4418048 4099072 4428800 3549184 5136384 4517376 3415040
4592 3415040 3557376 3783168 3673600 4131328 3894784 3029504 4197888 2899968 3801088
4583 3801088 4002816 3450368 5298176 3400192 4374528 3696128 3632640 3016192 2872832
4574 2872832 4256256 4732416 3973120 3723776 2696704 3822080 4523520 2932736 3601408
4565 3601408 3999744 3723776 3576832 3354112 3537920 4388864 3954688 3474944 4484096
4556 4484096 4206592 4653056 3650048 3975168 3329024 4304384 3971584 3858432 4654080
4547 4654080 4254720 3541504 4311552 5419520 3632640 4012032 4685312 4394496 4947968
4538 4947968 3722240 4106752 4707840 4858368 3696640 4508672 5303808 3635200 4773376
4529 4773376 4759040 5609984 3878912 4950528 4688896 5580288 4861440 5200384 5049344
4520 5049344 3826176 4677632 4458496 5527040 5047808 5302272 6076928 4829184 5008896
4511 5008896 3808768 4633600 3591680 4209152 4628992 4950016 3911680 4588544 4944384
4502 4944384 4279296 4134912 3543552 4486656 4949504 4537856 3972608 4344320 3919360 4252672
4492 4252672 3052544 3254784 4291072 3468800 4474880 3524096 4399616 4811264 4393984
4483 4393984 3416576 4214784 3484672 3623424 4305408 4586496 3568128 3706880 3635712 4580352
4473 4580352 5081600 4464640 4916736 3771904 5216256 5234688 5050368 4726784 4605952
4464 4605952 5346304 4251136 4727296 4939776 5064704 4058112 5243392 4847104 4098560
4455 4098560 5082624 5514752 4905984 3628544 4695040 4371968 3755008 5128704 3335680
4446 3335680 3968512 5300736 5322240 4132352 3657216 3826688 3238400 4406272 3902976
4437 3902976 4502528 3905024 4422656 3919360 4550656 3811840 4106240 4486656 4573696 4040704
4427 4040704 4193792 3701760 4354560 4341760 5068288 5702656 4703744 4450816 4829184 4573696
4417 4573696 4483584 3778048 4992000 4233728 4188672 4867072 5744128 4446208 4528128 6451712
4407 6451712 5603840 5835264 6097920 6365696 5514752 6103552 4575744 5230080 3916288
4398 3916288 4166656 4540928 4802560 4088832 4111360 3356160 5570048 4115456 3462656
4389 3462656 3587072 5041664 4038144 5108224 3843072 4840448 4052480 4935168 3520000
4380 3520000 4475392 4642304 4054016 3080192 4897280 3906560 4280320 4637696 4407296
4371 4407296 4128768 4066816 3881984 4323840 4429312 4782080 4489216 5539840 4690944 5410304
4361 5410304 5450240 4290560 4119040 4109824 4914176 4486144 5948928 3995648 3321344 4876288
4351 4876288 4107776 3687936 4442624 4760576 4551168 5804032 4281344 4834816 2984960
4342 2984960 4835840 4953088 4185088 4572160 4862464 5074432 4085248 4538880 4387328
4333 4387328 3939328 4581376 4412928 4717056 4709376 3870720 5036544 4044288 3324928 4658176
4323 4658176 4518400 3211776 3847168 4142080 4551680 4054528 4300288 4592128 3657216
4314 3657216 4518912 4297728 3854848 3697664 4352512 4449792 4562432 4668416 4147200 4302336
4304 4302336 4380672 4412416 3751424 4827648 3867136 5271552 4328448 4370432 3563520 4901376
4294 4901376 4059648 3396096 4946944 4652544 4733952 4992512 4020736 4629504 3310592
4285 3310592 3263488 4540416 3785728 4410368 4201984 4397568 3702272 4284416 4453376 3766272
4275 3766272 3748864 4616192 3280384 5002752 4398592 5450752 4267520 4274176 3857408
4266 3857408 4098048 4865536 5267456 4028416 4548096 4086272 4881408 3914752 4474880
4257 4474880 4490752 5260288 4141056 3255296 4803584 4014080 3736064 4860416 4325376
4248 4325376 5278208 4609024 4628992 4153856 3750912 3660800 4725760 5027840 3762176 4022272
4238 4022272 4532736 5189120 5008384 4188672 3925504 4604928 4952064 4160512 4707840 5422080
4228 5422080 4560384 2989568 5117440 5917696 5686784 5592576 4925952 6016000 5045248
4219 5045248 6478848 5456896 5599744 4441088 5374464 4926464 4085760 5236224 4736000
4210 4736000 5232128 4909568 4781056 5447680 6020608 6683136 5809152 5780480 5723648 5549568
4200 5549568 4790272 6516736 5372416 5267456 4930560 4700672 5710848 4669952 5128192
4191 5128192 5079552 5646336 4814848 4507136 4626432 4229632 4098560 5361152 5766656 5374976
4181 5374976 5575680 5780480 6209024 6428672 6516736 5772800 6009344 5911552 4712448 5614592
4171 5614592 4668416 4713984 5485568 5823488 4673536 4712448 4536832 5640192 5673472 4657664
4161 4657664 5051392 5052928 4772352 3501568 5073920 4676096 5186048 5150720 4522496 5188608
4151 5188608 5233664 3899904 4820480 4516352 5432320 4638720 5339648 6094848 5060096
4142 5060096 5332480 4954624 5481472 4356608 4197376 5796352 5365760 4630528 4174848
4133 4174848 5806080 5674496 4380160 4685824 4632064 5477888 5548544 4947968 5224960 4377600
4123 4377600 4620800 4599808 4586496 5128704 5517312 5264384 4445184 4652544 4964352 5145600
4113 5145600 5254144 5865984 5837824 5663744 5163520 5179392 4849152 5343232 5733888 5386240
4103 5386240 4866048 5245440 5520896 5162496 5359616 5088256 4315136 10120704 5885952
4094 5885952 5992960 5906944 4943360 4862464 5280768 4755968 5015552 4231680 4801024 4803072
4084 4803072 4808192 3782656 3841024 4457472 3951616 4834816 4301824 4810752 5051392 6044672
4074 6044672 4922368 6340608 6220800 4629504 4056576 3871744 4576256 4848128 4565504
4065 4565504 4122112 4681728 4849664 3513344 5656576 5305856 5095424 4481024 4340736
4056 4340736 5116416 5683712 4273152 5747712 5191680 5279232 5733888 5527552 4513280
4047 4513280 4235264 5252608 4029952 4526080 5211136 3858944 4898304 4335616 4977152
4038 4977152 5951488 5166592 6248960 4823040 3936768 4865024 5261824 4590592 4774400
4029 4774400 5634048 5450752 4638208 5907968 5711360 5304832 4843008 5922304 5512704
4020 5512704 5558784 5278208 5452288 5642752 5228544 5745664 4568576 5317120 5096960 5372928
4010 5372928 5546496 6154240 6136320 6350848 5326336 5977600 6053888 6372352 6507008 6149120
4000 6149120 6348288 7205376 7436800 6352384 7304192 6390784 7002624 5662720 6761984
3991 6761984 6947840 6521344 6345728 7104000 6713344 7900160 6760448 6504960 7441408
3982 7441408 7395328 6425088 7271936 7568384 6930432 7278080 7833600 7165952 7250944 7827456
3972 7827456 6927360 7822336 6419968 8185344 7598592 8205312 7516160 7963136 8180736
3963 8180736 7979008 8024576 9145344 8142848 9143808 8906752 8953856 10466304 9102336
3954 9102336 9499136 9008640 9648640 10360320 8702464 10089472 10114560 10024448 10582016 10622976
3944 10622976 12092928 11248640 11965440 12045312 10745856 9711104 9426944 7222272 6553600
3935 6553600 5659648 7449088 6502912 5882880 5288960 4882944 6232064 5834240 6215680
3926 6215680 5835264 5639168 7357440 6044160 6394368 6220800 5540864 6838272 5791232
3917 5791232 6877696 6081536 6226432 6049280 5806592 5654016 5432832 6987776 6762496
3908 6762496 5394944 5654016 5116416 5816320 5659648 4575744 5832192 4462080 6139904
3899 6139904 6110208 5679104 4990976 6101504 7554048 5605888 6483456 7390208 5016576
3890 5016576 5926912 6095872 5987840 4772864 5572096 5925376 6291968 6033408 5681664
3881 5681664 5609472 4754432 6460928 6376448 7485440 6207488 5740544 5791744 5843968 5768192
3871 5768192 5657600 6068736 6468608 6001152 6842880 5975040 6626304 5583360 6093824
3862 6093824 5522944 6498304 6413312 5403648 5993984 5710848 6475776 5978624 6414336 5840896
3852 5840896 6001664 6019584 6346240 6445056 7220224 6091776 6023680 6770688 7011840 6738432
3842 6738432 6210560 7105536 6645760 6358528 5904896 7030784 7664128 5697536 6615552
3833 6615552 7485440 5852672 7287296 6267392 6985728 5815808 6492672 6181888 6672384
3824 6672384 7135744 5266432 6161408 5503488 6624256 6691840 5564928 5137408 6215168
3815 6215168 6639616 5708800 5881856 6945280 7220736 7118336 7524864 6560768 6056960
3806 6056960 7553536 6689792 6158848 6519808 6514688 7347200 5899776 6883840 6321664 6887936
3796 6887936 6746624 6526976 6404608 7068160 7362048 7168000 7347200 7963136 7145472 6793728
3786 6793728 7824384 6273536 6163456 7273984 7563776 6819328 6301696 7287808 5720576
3777 5720576 6724608 7052288 6910976 7727616 7972352 8238080 6964224 7238144 7337984
3768 7337984 7800832 6572544 7839744 7119360 7108096 8553984 7400960 7736832 8052224
3759 8052224 7267328 8203776 8587264 8753152 8103936 8429056 7903744 7680512 8277504 7878656
3749 7878656 7837696 7119360 7446528 6939136 7998464 5983232 8430592 9005568 8509952
3740 8509952 9239040 7801344 9753600 10248192 8960512 10503168 10505728 10995200 11264000
3731 11264000 11457536 10952192 10208256 10556928 11784192 10655744 11270656 12523520 12720128
3722 12720128 12240384 12235776 12521984 14214656 12779520 13307392 14133248 14173184 15234048
3713 15234048 15740928 16256000 16634368 17704960 16691712 17291264 16292352 15907840 17680896
3704 17680896 18327040 19117056 19426816 20057088 21673472 22685184 22889984 22350848 22771712
3695 22771712 24316416 23712256 25156096 25929728 26325504 25629184 27039744 26390016 28593664
3686 28593664 29980160 29922816 30756864 33810944 33958912 35693568 34795008 33193472 27645440
3677 27645440 24839680 19478528 18028032 15276032 14313472 13016576 12528640 12204032 12199936
3668 12199936 11595264 12428800 11427328 12051456 11951616 12197376 11125248 11433472 12198400
3659 12198400 11828224 11990016 10923520 10977280 11102720 11410432 10637824 10264064 10979328
3650 10979328 11266048 11543040 11630592 11424768 11650560 9855488 10320384 9511424 9834496
3641 9834496 8721920 8690176 8721920 9466880 9705472 10262528 8528896 8869888 8279040 9512960
3631 9512960 8524800 9053184 8795136 9748480 9440768 8729600 10131456 9924096 8557568
3622 8557568 8791040 10771968 8305152 9375232 9642496 9263104 8535040 9568768 9445888
3613 9445888 10070528 9224704 9954304 9128448 9104384 8814080 9310720 9389056 9534464 9631744
3603 9631744 8761856 9780224 9587200 8431104 10129920 10371584 10712576 9409536 10327552
3594 10327552 9260032 9774592 10525184 10347008 11079168 10157056 10650624 9851904 10181632
3585 10181632 9624064 9990656 9756160 10898944 9959936 10339328 9881088 10074624 9937920
3576 9937920 10317312 11268096 10525696 10959360 10418688 9985024 11429888 11702272 11202560
3567 11202560 10659328 10964992 10339840 11558400 11122688 10811392 12071936 10972672 11335168
3558 11335168 11414528 10751488 12161536 10806272 10322432 10553344 10934272 10790912 12197376
3549 12197376 12005376 10458112 11787264 11606016 12394496 12388352 10828288 11995648 12191744
3540 12191744 12295168 13020160 13532160 10708480 11986944 13119488 12016128 13344768 13135872
3531 13135872 12834304 12542976 13208064 13178880 12324352 12610560 12913664 13277184 13576704 12694528
3521 12694528 13942784 13411328 13338624 13688320 15033344 15713792 15777280 14924288 16165376
3512 16165376 16963584 15923200 16604672 17088000 16760320 17115136 17891328 17854976 17710080
3503 17710080 18356224 17678848 18971648 19727360 20059648 19066880 20497920 21850624 22027776
3494 22027776 23020544 22934016 23738880 22234624 22432768 21947904 22274560 21841920 22546944
3485 22546944 22395392 22689792 23898112 25165824 25267200 25128960 26204672 26669056 28509184
3476 28509184 28289024 28172800 30018560 30550528 31369728 32456704 33702400 34997760 35662848
3467 35662848 37000192 37023232 40423424 40829440 42103296 44526080 45419008 46183424 46862848
3458 46862848 49142784 51205632 53045248 55453184 56862720 60054528 61016064 64438784
3450 64438784 66493440 70676992 73453568 77264896 81793536 86536704 91347968 96366080
3442 96366080 104472576 112517120 122469376 134781952 146832384 161169408 175833088 190724096
3434 190724096 206678016 225085952 245031936 268136448 294281728 326475264 364635648
3427 364635648 408171008 468824576 547273216 656900096 811396096 1003969024 1197217280
3420 1197217280 1323540480 1317420032 1159556096 911019520 678020096 499075584
3414 499075584 370811392 280717312 216028672 173078528 141806592 120314880 101956608
3407 101956608 90999808 81352704 74880000 66990080 62474752 58247168 54760448 52015616
3399 52015616 48286208 46783488 43724800 41842176 39920640 37565440 36330496 35440128
3391 35440128 33677312 31019520 28697088 29208064 26907648 25856512 25655808 23691776
3383 23691776 22693376 21826560 20801024 21708288 20909056 19237888 18525696 17794560 18029568
3374 18029568 17692672 17514496 16444416 16957440 16912896 16585728 15918080 15633408 15225856
3365 15225856 15786496 14146048 14824960 13756928 14332416 12159488 12804096 12544000 12048384
3356 12048384 12658176 11899904 11430400 12205056 11609600 12057600 10109440 10468864 9442816
3347 9442816 8306176 6930432 6528000 4966912 6369792 8048128 7158784 8602624 8720896
3338 8720896 8302080 9454592 8756224 9336832 7810560 8955392 8002048 8175104 8187392
3329 8187392 9781760 8513536 7998976 8672768 9169920 9168896 9787392 8894976 8882176 9098240
3319 9098240 8258560 8801280 9136128 9758208 8713728 9542144 7397888 7659008 7672320
3310 7672320 6595584 7730688 8903680 7526912 8320000 7492096 7568896 7141888 8381440
3301 8381440 6598656 7583744 6849536 6765568 6108672 7322624 7212544 6106624 5788672
3292 5788672 6535680 6273536 6993920 6019072 5858304 6676992 6433280 6748672 6672896 6156288
3282 6156288 6703616 7888384 5741568 6660608 6916608 6094336 7191040 5111296 5910016
3273 5910016 6170624 5309440 6443008 5268480 6508032 5530112 6725632 6345216 6816768
3264 6816768 6322688 6727168 6369792 5480960 6149632 5271552 6105088 6429696 6384128 5313024
3254 5313024 6510592 5580288 6322176 5584384 5941248 5902336 5869568 6608896 6423552 6574080
3244 6574080 6146048 5613056 6765056 6436352 5947904 7685120 6418944 7750144 7157248
3235 7157248 6754816 8228864 8818688 10458112 11373568 11021312 10612736 11276288 10969600
3226 10969600 10280448 9640448 9773056 8247296 9223168 9043968 8594432 8361984 9283584
3217 9283584 8384000 9654272 8631296 9891328 10371584 10669056 10551296 9857536 9418752
3208 9418752 10295808 10313216 12129792 10705408 11070464 10582528 10464768 11785728 12345856
3199 12345856 12574208 13444096 13556736 13760000 12678656 12879872 13181952 13280256 13809664
3190 13809664 14387200 13932544 13720576 14369280 15077888 14747136 16585216 16246272 16790528
3181 16790528 17236992 17721344 18174464 18927616 20619264 21255680 22185984 22480384 23406592
3172 23406592 23555584 23852544 23430656 26304000 26454016 26336768 27622400 27195392 28211200
3163 28211200 29430272 30019584 31221248 31172608 30910976 31555072 30163968 25801216 22896640
3154 22896640 20868608 19301376 17771008 16482816 14362112 14243328 13402624 13842944 13122048
3145 13122048 13246976 12422144 11748352 12406272 12121600 12598784 12533248 12095488 11092992
3136 11092992 11317760 10123776 12067840 9631744 9290752 8890880 8740352 8702976 7438336
3127 7438336 7402496 7836160 8158208 7231488 6778880 7426560 5945856 7895552 7138816
3118 7138816 7087616 7299072 7016960 7365632 6266368 7314944 6512640 7228416 6317568
3109 6317568 6183936 6919168 5597696 7865856 6028800 6740992 6656000 7070208 6449152
3100 6449152 7392768 6835712 6008320 5700608 6586368 6247424 7762432 7419904 7415808 7577088
3090 7577088 6955008 6502400 5088768 4014592 4429312 4997120 5200384 4322816 4705792
3081 4705792 5093376 5806080 5991424 4961280 5454336 6040064 4157440 6514688 5001728
3072 5001728 5466112 5514752 5428736 4757504 5569024 5280768 5015040 5628416 4809728 5813248
3062 5813248 6476800 6391808 5614592 5008896 5155840 6073344 5222912 5316096 5067264 4790784
3052 4790784 4658688 5548032 5197824 4596224 4542464 5972480 4556800 4191744 6416896
3043 6416896 4540928 4144640 4703232 4478464 5437952 5563904 3966464 5066240 5150720
3034 5150720 5415936 3993600 4326400 4090368 3807232 4652032 4485120 4002816 5577216
3025 5577216 5266432 5207040 4742656 4702208 4888576 5711872 6762496 5584384 6282752 6014464
3015 6014464 6972928 7401472 7770624 7621120 7610368 7013888 8464896 7730688 8923648
3006 8923648 10016256 13207552 16157696 18684928 22742528 21149696 21207552 18942976 17568256
2997 17568256 12453376 8324608 7103488 5074944 4988928 4881920 3816448 5209088 4597760
2988 4597760 4333568 4049920 4371968 3817472 4332032 4584448 4760064 4228608 4843008 4566016
2978 4566016 4711936 5554688 4059136 4133376 4514304 5009920 4850688 4133376 4109824 4671488
2968 4671488 5193216 4103680 3938816 5345792 5106688 5287424 6278656 5229056 5237760
2959 5237760 5484544 4734976 5235200 4647424 3633664 5769728 5227520 5102080 5185536
2950 5185536 5700608 6022656 6086144 4924416 5101056 4847616 5514752 5464064 4132352 4866560
2940 4866560 4439552 4543488 4833792 5234688 5481472 4401152 4506112 5356032 4756480
2931 4756480 4383744 4915712 5386752 5047808 3923456 5515776 4928000 4296192 3922944
2922 3922944 5037056 5055488 5682176 5698560 5223936 5448192 4915712 4982272 4723200 6416896
2912 6416896 5446656 5473280 5926400 6207488 4506112 5988352 5947392 6764032 6706688 6703616
2902 6703616 7602688 7387648 7669760 7944704 8397312 7653376 8064000 8603648 7434240
2893 7434240 6542848 6581760 6012416 5173248 6083584 5354496 5593088 5541376 4937216 4125696
2883 4125696 4872192 5200896 5358592 4600832 5140992 4365824 5363200 5195264 6419968
2874 6419968 4597760 5679104 5390336 5709824 5201920 4851712 5113856 5959168 6201856
2865 6201856 5288448 6496256 4818944 5861888 4943872 5602816 4692480 5939200 5722112
2856 5722112 4838912 5498880 5848576 4432384 5212672 5592576 5839872 5801472 4592640
2847 4592640 4886528 3974144 4952576 5970432 5322240 5554688 3807232 4128256 5559296
2838 5559296 4160000 4386304 4602880 5266944 5395968 5261824 5503488 4588544 6027776
2829 6027776 5310976 5086720 4250112 4732928 6033408 4902400 4038656 4580864 4249088
2820 4249088 5965824 5029888 5231616 5008384 4982784 4997120 4701696 3894784 4450816 6206976
2810 6206976 4753408 4882432 4806144 5267968 4896256 5304832 4681216 4914688 4718080 4486144
2800 4486144 4121600 4546560 5565952 7073280 5850112 6600704 6627328 6910464 6336000
2791 6336000 6973440 7032320 7764480 8925696 9139200 12778496 20163072 26861568 31609344
2782 31609344 28479488 16642048 10360320 8826880 8039936 6583808 5737472 6230528
2774 6230528 4442624 5027840 5414912 4740608 4662784 4592128 4230656 4248576 4723712 5267456
2764 5267456 4328960 5366784 4840960 5076480 4442624 3905024 4977152 5057536 4863488
2755 4863488 4755456 5153280 4112384 3311616 4824576 3815424 4772352 5094912 4751360
2746 4751360 3621376 5393408 5486592 5691392 5665792 4775936 4374528 4091392 4399616 3497472
2736 3497472 3778048 4670464 3550720 2850304 4593152 4526080 3977728 4253696 4695040
2727 4695040 4603904 3826688 4799488 5103616 3833856 5586432 4345856 4903424 4915200
2718 4915200 4455936 4341760 4925952 4269056 4742656 5499392 4973568 4852736 4537344 5382656
2708 5382656 5732352 5577728 5506048 6636032 7713792 7470080 8567808 7999488 9023488
2699 9023488 9482240 10051072 13821440 19316736 29127680 38112256 45479936 39099392 25689600
2690 25689600 17149440 14617600 13545984 14290944 16019456 24537088 27485184 33040384
2682 33040384 27874304 18640896 14662144 13935104 14975488 20377600 31790592 38289408
2674 38289408 43529216 35246592 21693952 16147968 14359040 13993472 16329728 23349760
2666 23349760 26584064 31509504 23911424 15398912 11538944 10112512 10097152 11082240 13840384
2657 13840384 17207808 16372736 14978048 10802176 7375360 6973440 7304704 5721088 4393472
2648 4393472 6051328 6427648 6040064 5839360 5972992 5145600 5567488 6364672 6584320
2639 6584320 7346688 6831616 8243712 8675840 9342976 9111040 9119744 8729088 7814144 7171072
2629 7171072 6582272 6953984 6915584 6432256 5095936 5844992 6526976 5233664 5523456
2620 5523456 4739584 4195328 3792384 3095552 3422720 3200000 3300864 4170240 3178496 3641344
2610 3641344 4078592 3407872 3868672 3006464 3579392 4559872 3254784 3146240 3913728
2601 3913728 4094976 3024384 2898432 3295744 3586048 3224576 3708928 3181056 3457536
2592 3457536 2340864 2959872 3097088 2151424 3332608 3184128 2933248 2038784 3166720
2583 3166720 2824192 3431424 3411456 2797568 2653184 3417088 3291648 2621440 2643456 2285568
2573 2285568 2866688 2828288 3147264 3349504 3272704 3897344 2450432 2950144 3082240 3369984
2563 3369984 2892800 3281920 2963456 2271232 1887232 2989568 2491392 1596416 2840576
2554 2840576 2617344 1947136 2540544 2567168 3830272 2419712 2976256 2939392 1968640 3658240
2544 3658240 2194432 3942912 2902528 2548736 3234816 2015744 3571200 2671616 2900992
2535 2900992 3603968 2473984 2735104 3223040 2347008 3396096 2866176 2558464 3948544
2526 3948544 2495488 2893824 2051072 2223616 3058688 3187712 3671040 2565120 3987968
2517 3987968 2928640 4106752 2624512 2513920 2899456 2362880 2469376 1850880 2417152
2508 2417152 3192832 2840064 2236928 2041856 2236928 2289664 1797120 2955776 3818496 3405312
2498 3405312 2470912 2584064 2929664 3126784 3053056 3377664 2658816 2874880 3056640 2808320
2488 2808320 2107392 3933696 2935808 3151360 3022848 2483200 3060736 3094016 2352128 3964416
2478 3964416 2436096 2332160 3923968 3386880 3803136 3740672 2513408 3611136 3747840
2469 3747840 3592704 3261952 3375616 2952192 4488704 3052032 3271680 3095552 2441216
2460 2441216 3273216 2546688 3300864 3169792 2966528 2822144 4256768 4272640 3800064 3183104
2450 3183104 3203072 3077120 4455424 3721216 4413952 3765760 3936256 4419072 5020672 4351488
2440 4351488 4620288 3580928 3537920 3362304 5619200 5005312 4654592 4301312 4496896
2431 4496896 4434432 6057984 5006848 4734976 3424256 5267456 5646848 5380096 4422144
2422 4422144 5018624 5173248 4536320 4040192 4776448 5447680 5838848 5651968 4704768 5231616
2412 5231616 6490624 5734912 5819392 5565952 5908992 5420544 5969408 5775360 5112320 4854784
2402 4854784 4451840 4094464 4044800 4072960 4357632 4123648 4140032 3734528 4310016 5001728
2392 5001728 4886016 3610624 4601344 4098560 4376064 4480512 3597824 4547072 4419584
2383 4419584 4027904 4919808 3068416 5041664 4592640 3703808 5293056 3405824 4386816
2374 4386816 3713024 5181440 3845632 2868736 3912704 4066304 3975168 3811328 3419648
2365 3419648 2744320 4743680 2885120 4152832 3951104 2909184 3483648 4129280 2924544
2356 2924544 3595776 4331008 3629056 4469248 3220992 3387904 3543552 3180032 3343360
2347 3343360 4405248 3162624 3369984 2487296 3315712 3683328 3761664 3578368 3014656
2338 3014656 4420096 3807232 3423744 3712000 3722752 3480576 2985984 3386880 2904064 3246080
2328 3246080 3246080 3500032 3192832 2785792 3106304 2685440 3544576 1817088 3474432 2635776
2318 2635776 3780608 4261376 3553280 3671552 3729408 2437120 2835968 2428928 4288000
2309 4288000 3623936 3232768 4087808 4395008 4846592 3864064 4359680 3584512 4308480 3913216
2299 3913216 4723200 3220992 3926528 3719680 3697152 4754944 4104192 3430912 2865152
2290 2865152 3448832 3922944 3812352 4068352 4146688 3482112 4087296 4111360 5131776 4589056
2280 4589056 3591680 4120576 4019712 2790400 4228608 3806720 2737152 3307008 4203520
2271 4203520 3664896 3373056 4126720 3639808 3875840 3138048 3895808 2748416 2948096
2262 2948096 3740672 3585536 4233728 3602432 3392512 3980800 4022784 4084736 5191680 4584960
2252 4584960 4636672 5264384 3773440 4877312 4122624 4047872 4513280 4758016 4638208 4895232
2242 4895232 3105792 5280768 5189632 4263424 5908480 3609088 5242880 5324800 5479936
2233 5479936 5850624 4949504 4992512 4705792 4678144 4567552 6176256 6384128 5550080 5262336
2223 5262336 6360576 5984768 6532608 6199296 7262720 7534080 7799296 7828480 7826432 7326208
2213 7326208 8316416 8121856 7851008 7343104 7539712 7836672 6680576 6458368 6449152 7464960
2203 7464960 7159296 7716864 6900224 7283712 6905344 8376320 7806976 7507968 5985792
2194 5985792 7272960 7301120 7414272 6490624 6423552 7192064 6744064 6197760 6508032 6477312
2184 6477312 6921216 6138368 6807040 6624768 5898752 6914048 6369792 7646208 6974464
2175 6974464 6947328 7498240 7060992 7578112 6959104 6591488 6323712 6498816 6630400 7089664
2165 7089664 7409664 6904832 6261760 7665664 5434368 7494144 7201792 6941184 6276096
2156 6276096 6622208 7479296 5064704 6829568 7215104 6226944 5842944 7048192 5517824
2147 5517824 5511168 4881920 5084160 4540416 5228544 5207040 5476864 5836800 5058048 4983296
2137 4983296 6168064 6018048 5862400 4934656 5095424 4756992 5070848 5953536 6036992 5487104
2127 5487104 5037568 5188608 6444544 6078976 6853632 5946880 5694976 5729280 5844992 5518336
2117 5518336 5541376 6531072 7131136 6350336 6766592 6247936 6247424 6835200 5629440 7553024
2107 7553024 6652928 6843392 7182336 7441920 6508032 6354432 6313472 6617600 7488512 6935552
2097 6935552 7390720 7337472 8528384 7198208 7471104 7575040 7852544 8172032 9133056
2088 9133056 8718848 9697792 8371200 9058816 7940096 8252416 8594944 10052608 9086464
2079 9086464 9978368 9577984 10433024 10025472 10030080 9436672 9432064 9545216 9937408 9709568
2069 9709568 8657408 9863680 10006528 10014720 9830400 9981440 8305152 9406464 9788928
2060 9788928 9621504 8783360 8819712 9345536 10046464 8952832 9186304 9735680 10396672 10551296
2050 10551296 10292736 9913856 9783296 10029056 9885696 10331136 11088384 10409984 10065920
2041 10065920 11042304 10436096 10550272 10131968 10838016 9560064 10324480 9590272 10247680
2032 10247680 10122752 9790976 9647104 9488896 9801728 10311168 10078208 9754624 10548224
2023 10548224 12312064 17826304 23655424 26633216 28031488 19408384 13725696 11839488
2015 11839488 12077056 9958400 9805312 7692800 8866304 9656832 8715264 8902656 8231936
2006 8231936 8546304 8288256 7642624 8796160 7420928 7221248 8142848 6974976 7592448
1997 7592448 7179776 7253504 7265280 6890496 6399488 7097344 6222336 7029760 6751232 7667712
1987 7667712 7675392 6937088 6992896 5451776 8960000 6837248 6752768 6857728 6950912 7115264
1977 7115264 7394304 6920704 6572032 7399936 6679552 6915072 7102464 7460864 5387264
1968 5387264 6657536 6481920 6610432 5688832 7885824 8378368 7541248 6367232 6642688
1959 6642688 8355840 6284288 8128000 7582208 8558080 7609856 6952448 7405056 7290880
1950 7290880 7794176 8799744 7685120 8289280 7806976 8210944 8027648 8670208 8524288
1941 8524288 7368192 7588864 8530432 9133568 6954496 8524800 9267200 8261632 7365120
1932 7365120 8187392 7966720 7851008 6926848 7600640 6815744 6541824 6978048 7129600 6596608
1922 6596608 7006720 8020480 7512576 6569472 5760512 7114752 8095232 7339520 6518272
1913 6518272 7390720 7040000 8224256 7665664 7138816 7237120 8014848 7642112 7678976 6998016
1903 6998016 7762944 6977024 7671808 6222336 9087488 7672320 8314368 7794688 7535104
1894 7535104 7678464 8450048 8414208 9058304 9162752 8086016 8053760 8058880 9177088 9726976
1884 9726976 8941056 9381376 10290176 10141184 9370624 9767424 10466816 10540544 11536896 10508288
1874 10508288 10196992 10649600 11138048 10991616 10828288 11309568 11517952 11919872 11437568
1865 11437568 11335168 13265408 12291584 12162560 13123072 12869120 11259392 12780544 12905472
1856 12905472 12247040 12235264 13169664 12641792 13301760 11938304 12506624 14443520 13341184
1847 13341184 12440576 12974592 13262848 12525056 12730880 13272064 12489216 13188096 11280896
1838 11280896 12994048 12614144 12237824 13556736 13414912 11999232 11907584 12556800 13421568
1829 13421568 12744704 11995136 12453888 11810816 12561408 12506624 12714496 12101632 12551168 10909184
1819 10909184 11189248 11990528 12333568 11555328 10181632 11157504 11326464 10704896 10204160
1810 10204160 9968128 10701312 10113536 11189248 9853952 8962560 9815040 8751104 8987136
1801 8987136 8256512 10022400 9100288 9139712 8539648 8495104 8813568 8597504 8731648 9084928
1791 9084928 7413760 7971328 8419328 7637504 6919680 7530496 7113728 7547904 7703040
1782 7703040 7781888 7180800 8536576 7814656 7972864 8230400 6824960 7658496 6176256
1773 6176256 6484480 6410752 7312384 6481408 7172096 6307328 6610432 7422464 6843392 6490112
1763 6490112 7417344 7588864 7094784 7039488 7424000 7458816 7525376 7520256 7952896 7319040
1753 7319040 8143360 7668224 8667136 8491520 7675392 9412608 8329216 8065024 9115648
1744 9115648 9505280 8175104 8746496 9247744 8796160 9074176 8823808 9079808 11089408
1735 11089408 10276864 9919488 10029056 12272128 10232320 10833920 10610176 10810880 11761664
1726 11761664 12265472 11952640 12264960 12682752 13047808 13099008 13599744 15912448 14456320
1717 14456320 14509568 15641600 16707072 18561536 18641408 20703744 20053504 21691904 23683584
1708 23683584 23714816 26287616 26836480 28158976 30005760 31120896 31681536 33186816 32762368
1699 32762368 33907712 35164672 35134976 35397632 36838912 38978048 40348672 41360384 41957888
1690 41957888 45201920 46507008 47541760 51701248 55045632 58118144 61620736 66353664
1682 66353664 71769600 78637056 85689856 96429056 107165184 117264896 125146624 130685952
1674 130685952 128145408 120184320 111830528 98731520 86248448 74589184 65089024 55942144
1666 55942144 49300480 44259840 39522816 35623424 33325568 31305216 30052864 28785664
1658 28785664 27841536 25593856 24388608 24425472 23483392 22126080 21889024 21530624 21208576
1649 21208576 20478464 19750912 18823680 18468864 18462720 17804800 17934848 17778176 16596992 16122368
1639 16122368 17773056 17090048 16754688 14654976 15407104 13684224 13530624 13960192 13112320
1630 13112320 13127680 13102592 12810240 12323840 12912640 12284416 12658688 12405248 12573184 11421696
1620 11421696 11445760 11278336 11514368 11897856 11567104 10592256 10531840 10994176 11537408 11702784
1610 11702784 10597888 9896960 10626560 10525696 9741824 9466368 9793024 9153024 9648640
1601 9648640 9025536 7866880 8732672 8252928 8866816 9149952 8317952 8514048 7803392
1592 7803392 8765952 9138176 8370688 7109632 9647616 8163328 8236032 7370240 8142848
1583 8142848 7876608 7957504 8450560 7583232 8155648 6886400 8330240 7504896 8686080
1574 8686080 7560704 8433664 7497216 7571456 9160192 8150528 7481344 7119360 8183808
1565 8183808 8178176 8666112 6481920 7294976 7758848 7824896 7636992 6890496 7810048 7055872
1555 7055872 6873088 7493120 7757824 8430080 7876608 6608384 7974400 7521280 7590400
1546 7590400 8540160 7794688 7910912 8830976 8403456 8667648 9953280 9228800 7922688
1537 7922688 9876480 8203776 8814080 9712640 9762816 9431040 9759744 9971200 10274816
1528 10274816 10730496 10800128 10864128 12314624 13085696 14328832 14201856 12835840 13499392
1519 13499392 13175808 12741120 11276288 12894208 12217344 12009472 12001792 12421120 12573184
1510 12573184 12402176 12153856 12643328 12484096 11084288 11274240 11952128 11423744 11097600
1501 11097600 11942912 11774976 11796992 11771904 11489792 12055552 11382272 10777088 12020224 13235712
1491 13235712 13610496 13467648 14791168 15672320 15226880 15661056 15707648 18006528 17138176
1482 17138176 17249280 17329152 16584704 16070144 15277568 12577792 12648960 13030400 12965376 11522048
1472 11522048 12118016 11898880 11418624 12346880 11750912 11545088 11121664 11247616 10797568
1463 10797568 11945472 12372480 11758080 11307008 12436992 12730880 12253696 12236288 13010432
1454 13010432 13419008 11889152 13692416 12713984 12553216 13421056 10880512 11860992 11311616
1445 11311616 10798080 10642944 9942528 10468864 9559552 9837056 9491968 9773056 9950720
1436 9950720 9325568 10355200 9138688 8677888 8941568 9776640 9934336 9700864 9361920
1427 9361920 9261056 9263616 9381376 9031168 8744448 8519168 9498624 8415744 7448576 8743424
1417 8743424 6993920 8704512 7325696 8690176 8016384 7008768 7120896 8256000 6793216
1408 6793216 7621120 6247424 7842816 6444032 5386752 5286912 6340608 6331904 6252544
1399 6252544 6445056 5558272 5203968 5272576 7264768 5922304 5471744 5976064 5495296
1390 5495296 5006336 5072896 4577280 5054976 4823552 4779008 4037120 5852672 5131776 3782656
1380 3782656 4630016 6296064 4893696 4672512 3962880 5255680 4976128 5011456 4419584
1371 4419584 3942400 4000256 4874752 5083648 3922432 4126720 5218816 5342720 4838400
1362 4838400 4952064 4569088 5541376 3932672 4643840 4460544 3794432 4691968 4088320
1353 4088320 4677632 4214784 4489216 4315136 3577344 4350464 4352000 4678656 4240384 4442112
1343 4442112 3538432 4692992 3960320 4151808 3558912 4455936 3210240 3886592 3913216
1334 3913216 4119552 4702720 4417536 3364864 4199424 3042304 3582464 4940800 3647488
1325 3647488 2503168 4280832 4154368 4663808 2558464 4478976 3774464 3182592 4253184
1316 4253184 3843584 4143104 4203008 3571712 3976704 3660800 4782080 4304384 4357632 4820992
1306 4820992 3863552 5937664 4291072 4375040 4004352 4528128 5476864 5030912 4976128 4298752
1296 4298752 3184128 2999296 3592192 3704320 3767808 3064320 3804160 2962944 2900480 4560896
1286 4560896 3686912 3426816 3592704 3665920 3876864 3957248 3379712 3555840 3532288 3473408
1276 3473408 3795968 4028928 2821120 2940416 4052480 3351040 2484224 3004928 2826240
1267 2826240 3887104 2990592 3273216 2970112 3372544 3147264 2893824 2510848 3581952
1258 3581952 2535424 3243008 3216896 2582528 3499520 3016192 3238400 3268608 2742272 3119104
1248 3119104 2746880 1190912 2603008 3103744 2137600 2083840 3156480 3420672 3930112
1239 3930112 3386880 2485760 1969152 2131968 2681344 2974720 2278400 4532224 3519488
1230 3519488 3196416 3068928 2887680 2378752 3270656 2291200 2539520 3606016 3419136
1221 3419136 3023872 2981888 2937856 3166208 3049472 2509824 3081728 2677248 2367488 2298368
1211 2298368 1832960 2032128 3294208 3322368 4060672 2216960 3396608 2723328 2522624
1202 2522624 2570752 2163712 3002880 2844672 2291712 2384896 1216000 1584640 2099712 3120128
1192 3120128 2577920 2414080 2258432 2000896 1859072 1772544 1846272 1763840 3300352 2862592
1182 2862592 2769920 2848256 2700288 2417664 2910720 2811904 1960960 1980928 2199040 1809408
1172 1809408 2622464 1106432 1796096 2080256 1872384 1913344 2575360 1411584 2284544
1163 2284544 2289152 2587648 2490880 1384448 2330112 1982464 2198016 1634816 3298816 1853440
1153 1853440 3311104 2366464 2372096 2112000 1659904 1870336 1928192 2885120 2675200 2223616
1143 2223616 2115072 484864 1765376 1931776 1658880 1267200 2223104 1509888 924160
1134 924160 1773568 1477632 1987072 1701376 1008640 1773568 2052096 2144768 1890304 1164288
1124 1164288 1667584 1101824 1454592 1632768 1517568 1495552 1395712 1659904 1994752 1277440
1114 1277440 1945600 1188864 2395648 2115584 928256 -189952 2831872 686080 1679360
1105 1679360 858624 1521664 1025536 2049536 1567232 2100736 553472 1534464 616960
1095 940544 720896 524288 920064 1988608 2612224 863232 913920 2368000 630784 1083392
1085 1083392 1058304 1392128 351232 413696 621056 1133568 559104 621568 632320 -373248
1074 419840 1105408 894976 1271808 1307648 1120768 1613824 950272 597504 893440 729088
1064 729088 64000 621056 645632 1746432 2178560 3098112 5580288 4706816 4361216 3302912
1054 3302912 3913216 4557824 4675072 3828736 5331456 6575616 7516160 8580608 7955968
1045 7955968 7805440 10024960 20229632 57982976 95858688 123490816 136884736 73940480
1037 73940480 43848704 31708160 27208192 21824512 17931264 15351808 12338688 11438592
1029 11438592 10647040 11493376 10175488 10553344 8462336 8978432 9593856 10612224 12122112
1020 12122112 9926144 8551936 8673280 6713856 7007232 6926848 7252480 6763008 6318592
1011 6318592 6012928 5652992 5908480 4926464 4777472 5846016 5392896 5698048 6500864
1002 6500864 4787200 4580352 4741632 5395456 4822016 4966400 4824576 3472896 4924416
993 4924416 4552192 5613056 3624448 4945920 3762176 5590016 3728384 5131776 3890176
984 3890176 4077568 5328896 4302336 3948032 4338176 4867584 3655168 3324928 3793920
975 3793920 4824064 3910144 3220480 3601408 2802176 4136960 4626432 2813440 3064320
966 3064320 2672128 2252288 3441152 2906624 2857472 3966976 3807744 3505152 2198528
957 2198528 2805760 2615808 3786752 2832896 3112448 2983936 4483072 2804736 2778112
948 2778112 2646016 2040320 3331072 3232768 3283968 3425792 4014592 3511808 2839040 2597376
938 2597376 2452480 3006464 3634688 2762240 1989120 2216448 2487808 3417600 2936320 3103744
928 3103744 3353088 3224576 3478016 2371072 2604032 1436160 3170816 3085824 2144256
919 2144256 2574336 2582016 2847232 2299904 2756096 2761728 3467776 2824192 2879488 2106880 3119616
908 3119616 3145216 3049472 1694208 2728448 2991616 2532864 2766336 2649600 3288576 3452416
898 3452416 2260992 1439232 1948672 2431488 1056768 2635776 2715136 2610688 2335744
889 2335744 3650048 1854464 2787840 2054144 2470400 2097152 2762752 3011072 2107904
880 2107904 1626112 1872384 1961984 2277376 2009600 2217472 2108416 2340352 1556992 3311104
870 3311104 2217984 1872384 1741312 1498624 2221056 2418688 2533376 2472960 2412544 2663936
860 2663936 2174464 1540608 2546176 2349568 2202624 1904128 1674752 1839104 2549760 1687040
850 1687040 1713664 2364416 2200576 1617920 2560512 1627136 3448832 2340864 2067456 2102272
840 2102272 2254848 2152448 1386496 1405952 2160128 2080256 2256896 2166272 1710592 1628672
830 1628672 2575360 2109952 1959936 1980928 2033152 951808 1078784 1339392 2328576 2465792
820 2465792 1847808 1815040 1607680 2523136 2422784 2249216 2933248 2597888 1780224 2010112
810 2010112 1946112 1972736 2576896 2066432 1706496 2543616 3020288 2240000 2471424 2825216
800 2825216 1930240 2736128 2823680 3248128 2287104 2516992 3255808 2728448 2011136 1934336
790 1934336 2847744 2769408 2944000 2715648 2673664 3294208 3518464 2671104 2802176 3645952
780 3645952 4360704 3582976 3977728 2837504 3526144 2830848 2262528 2686464 2168320 2592768
770 2592768 812032 2540032 2261504 2126336 2159616 2404352 2107904 2459136 2000384 2331648
760 2331648 1450496 1442816 2344448 2568192 2229248 2285568 3045376 2108416 873472 2712064
750 2712064 1337856 2589696 777216 2120704 1208832 2482176 2825728 1820160 2576384
741 2576384 627200 2122240 1749504 1727488 2252288 1996800 1801216 1686016 1473024 2273280
731 2273280 2124800 2153984 2129408 1369088 2157056 1768960 2128896 1645568 1385984 1912320
721 1912320 901632 2196480 1802240 2002432 2667008 3558912 3145216 1854976 2911232
712 2911232 2708480 2158592 2104832 1839616 2063872 970752 1765888 2632192 2108928 1224704
702 1224704 1914880 1761792 1971712 2200064 1523200 313856 2378240 1874944 2706432 2040832
692 2040832 1523200 2221568 2061824 1435136 1197568 1882624 867328 1316352 2375680 1751552
682 1751552 1990656 1961984 1351680 1820160 1022976 1476096 2214400 1585152 1262080 2327552
672 2327552 1568768 2203136 2071552 2271232 1368064 1270784 858624 660480 2622464 2048000
662 2048000 1753088 2969088 2893312 2463232 2606080 1651712 1876480 1616896 1607680 544256
651 979456 1416704 934400 1110528 -117248 1276928 1517568 1928192 776704 1848832 2063872
641 2063872 1153024 1716224 1271808 887296 1630720 1530880 2191872 1441280 1809408 1602048
631 1602048 1999360 1934336 2109440 1391616 1174016 1723392 1879552 1081856 67072 230912
621 230912 1544192 2435072 1192448 1822208 1893376 1730048 1279488 431104 1313280 1044992
611 1044992 859136 1725952 1356288 1724928 2121728 674816 803840 1509376 929280 697856
601 697856 2128384 1950208 1886208 985088 765440 1304064 1094656 1210880 1996288 1083904
591 1083904 1743872 1941504 1047040 1459712 1151488 1279488 1523200 1334272 1389056 834048
581 834048 992768 1143808 996864 648192 985088 757760 1876480 822272 175104 1989632
571 1989632 901120 1056768 1598976 1609216 1057280 1680896 411136 730624 906752 658944
561 658944 1044480 1404928 791040 497152 1110528 1502720 1605632 -170496 808448 971776
551 971776 1188352 769024 857088 550912 750080 1149952 1577472 907776 616448 1405952
541 1405952 998400 324096 1430528 797696 1455616 1911296 1645568 1796608 361984 1766400
531 1766400 520704 756736 2449408 1382400 356864 1360896 2455552 474624 1006592
522 1006592 2391040 1050112 1641984 2102784 1327104 1567744 1805312 836096 355840
512 1250816 1187328 1580544 1197568 1330176 1230848 784896 648192 1160704 1140736 1178112
502 1178112 1159680 1668608 933888 764416 347136 2286592 1341440 1328128 276992 794112
492 794112 936960 908288 174592 1596928 2285568 1508352 1272832 753664 980480 1883136
482 1883136 1115648 1339904 1876480 33280 2202624 535552 552448 1305600 738816 1106944
472 1106944 1996288 1245696 1469440 288256 1218048 1189888 1218048 1063936 1035264 1027072 1427456
461 1427456 457216 307712 1655808 1659904 217600 681472 1533440 2200576 1665024 1949696
451 1949696 1192448 1259008 1574400 1299456 582144 891392 771584 567808 1604096 1863168
441 1863168 -296960 118784 1048064 1481728 1192960 -754688 95232 1484288 52736 492032
431 492032 2255872 1214976 1614848 1136640 434176 1110528 355840 1015296 1312256 1969152
421 1969152 504320 188416 516608 1831936 1154048 1107968 353792 650240 1197056 1128960
411 1128960 1032192 462848 -55296 1067008 1051136 781824 716800 347136 1412608 134144
400 1394688 1337856 723456 973312 827392 1944064 681472 1548800 395776 1393152 1080320
390 1080320 2059264 833536 1945088 1164800 732672 326144 640512 292352 45056 722944
380 722944 182784 959488 1137152 -10240 624640 1673728 1488896 -45056 891904 1472000
370 1472000 1085952 448512 1762816 614400 30208 176640 1168384 1803776 359424 432128
360 432128 1219072 382464 534528 582656 -72192 656384 531456 1305600 819712 516096
350 516096 412672 723456 509440 937472 49152 1272832 1621504 292864 252416 -98816
339 558080 304128 462848 332800 568832 413696 530432 804864 788992 961536 1632256
329 1632256 1004544 1840640 673792 321536 673280 805888 1406464 -179712 95232 -67072
318 1665024 597504 641024 1147904 753152 -92160 52736 1782272 1002496 590848 -29184
307 1134592 408064 766976 1251840 -262144 793088 1007104 976384 467968 561664 523776
297 523776 77824 1083392 413184 1005056 671744 478208 813568 -40448 461312 -7168
286 1180160 489984 797184 -365568 317440 1613824 -33792 910336 39936 594944 778752
276 778752 -822272 -161792 163840 -2048 1394688 1024512 114176 391680 -5632 1184256
265 1415168 466432 1184256 951808 685568 750592 1615872 1009664 -295424 740864 1313792
255 1313792 -534528 456704 -598528 173056 452096 290304 797696 1183744 662528 885760
245 885760 1283072 619520 786944 1266176 849408 -461824 1123328 537600 -75264 -927744
235 -927744 744960 1021952 621056 30720 774656 729088 758784 666624 434688 259584 111616
223 1083904 1590272 159744 1227264 1306624 708096 184320 740352 -69632 1122816 339968
212 629760 516608 1452032 -101376 -373248 658432 -103424 1577984 1213440 -262656 -288256
202 -288256 833024 -197632 798208 545792 -20480 -293376 512 -38912 703488 573440 209920
190 346624 -421888 -186368 1020416 882176 219136 530944 761344 723456 783872 -292864
179 466944 -249344 1229312 403968 413184 -183296 727552 559104 656384 499200 197120
168 333312 940032 879104 -40448 462336 310272 -101888 150528 124416 1117696 600576
158 600576 1253376 1058304 -163328 1388032 695296 219136 98816 923648 104960 818176
148 818176 437248 -97280 550400 1038848 842752 1439232 -115200 -217600 289792 -976384
137 723968 -92160 2062336 1206272 637440 529408 1024 836096 1533952 903168 654336
127 654336 192000 120320 1118720 -61440 -368128 375296 -963584 468992 518656 -34816 179712
115 478720 848896 138752 -11264 -117760 692224 1012224 -740864 616448 -60416 -112128
105 -112128 846848 359936 193024 745984 956416 547328 790016 166912 699392 330752
94 21504 196096 -968192 1283584 -375808 366080 840704 555008 496128 1065984 725504
84 725504 -141312 62976 -525312 306176 657408 49664 780800 374784 946688 -11264 1536
72 -24576 176640 426496 850944 120832 315904 79872 -4096 667648 -147456 944640 309248
60 -133120 866816 347648 773120 148480 -28160 381440 -470016 760320 194048 894976
50 894976 -190976 -273408 462336 952832 149504 287232 -53248 -815616 268288 -588800
39 -72704 -542720 1135616 44032 965120 0 357888 642560 35328 -351744 -1219584 398336
27 275456 6656 -406528 294400 -51200 -345600 214528 330240 350208 246272 438272 96256
15 -265216 206848 861184 333312 525312 -889344 17920 -529920 -38400 254464 -1083904
4 762368 149504 310784 -1058304 466432
##END=
