##TITLE=1317
##JCAMPDX= 6.0         $$ Bruker NMR JCAMP-DX V2.0
##DATA TYPE= NMR SPECTRUM
##DATA CLASS= XYDATA
##ORIGIN= NUTS EXPORT
##OWNER= Administrator
$$ 1.72 TOPSPIN		Version 2.1
$$ 2016-02-23 12:19:12.996 -0800  Administrator@X
$$ Compression mode = diff/dup
##.OBSERVE FREQUENCY= 90.275459
##.ACQUISITION MODE= SIMULTANEOUS (DQD)
##.ACQUISITION SCHEME= undefined
##.AVERAGES= 16
##.DIGITISER RES= 22
##SPECTROMETER/DATA SYSTEM= 
##.PULSE SEQUENCE= zg30
##.SOLVENT NAME= None
##.SHIFT REFERENCE= INTERNAL, None, 1, 14.66054
##AUDIT TRAIL= $$ (NUMBER, WHEN, WHO, WHERE, PROCESS, VERSION, WHAT)
$$ ##TITLE= Audit trail, TOPSPIN		Version 2.1
$$ ##JCAMPDX= 5.01
$$ ##ORIGIN= Bruker BioSpin GmbH
$$ ##OWNER= Administrator
$$ $$ E:/data/jwist/nmr/1317/1/pdata/1/auditp.txt
$$ ##AUDIT TRAIL=  $$ (NUMBER, WHEN, WHO, WHERE, PROCESS, VERSION, WHAT)
(   1,<2016-02-23 08:43:46.183 -0800>,<Administrator>,<X>,<jcamp>,<TOPSPIN 2.1>,
      <fromjdx created from
       E:\data\jwist\nmr\uniandes\1317
       data hash MD5: 8K
       09 CA D8 C6 BC 31 F6 66 9F 11 92 8D AB 96 D7 67>)
$$ ##END=
$$ 
$$ $$ hash MD5
$$ $$ 24 74 E2 8C 69 CB 1D 79 89 0D FA 95 20 3F 35 6A
##$RELAX= 
$$ Bruker specific parameters
$$ --------------------------
##$DU= <E:>
##$EXPNO= 1
##$NAME= <1317>
##$PROCNO= 1
##$TYPE= <nmr>
##$USER= <jwist>
##$ACQT0= 0
##$AMP= (0..31)
100 100 100 100 100 100 100 100 100 100 100 100 100 100 100 100 100 100
100 100 100 100 100 100 100 100 100 100 100 100 100 100
##$ANAVPT= 1
##$AQSEQ= 0
##$AQ_mod= 3
##$AUNM= <au_zg>
##$AUTOPOS= <>
##$BF1= 90.275459
##$BF2= 400.02
##$BF3= 400.02
##$BF4= 400.02
##$BF5= 400.02
##$BF6= 400.02
##$BF7= 400.02
##$BF8= 400.02
##$BYTORDA= 0
##$CFDGTYP= 0
##$CFRGTYP= 0
##$CHEMSTR= <none>
##$CNST= (0..63)
1 1 145 1 1 1 1 1 1 1 1 1 1 1 1 1 1 1 1 1 1 1 1 1 1 1 1 1 1 1 1 1 1 1 1
1 1 1 1 1 1 1 1 1 1 1 1 1 1 1 1 1 1 1 1 1 1 1 1 1 1 1 1 1
##$CPDPRG= <>
##$CPDPRG1= <>
##$CPDPRG2= <>
##$CPDPRG3= <>
##$CPDPRG4= <mlev>
##$CPDPRG5= <mlev>
##$CPDPRG6= <mlev>
##$CPDPRG7= <mlev>
##$CPDPRG8= <mlev>
##$CPDPRGB= <>
##$CPDPRGT= <>
##$D= (0..63)
0 1 0 0 0 0 0 0 0 0 0 0 0 0 0 0 0 0 0 0 0 0 0 0 0 0 0 0 0 0 0 0 0 0 0 0
0 0 0 0 0 0 0 0 0 0 0 0 0 0 0 0 0 0 0 0 0 0 0 0 0 0 0 0
##$DATE= 0
##$DBL= (0..7)
120 120 120 120 120 120 120 120
##$DBP= (0..7)
150 150 150 150 150 150 150 150
##$DBP07= 0
##$DBPNAM0= <>
##$DBPNAM1= <>
##$DBPNAM2= <>
##$DBPNAM3= <>
##$DBPNAM4= <>
##$DBPNAM5= <>
##$DBPNAM6= <>
##$DBPNAM7= <>
##$DBPOAL= (0..7)
0.5 0.5 0.5 0.5 0.5 0.5 0.5 0.5
##$DBPOFFS= (0..7)
0 0 0 0 0 0 0 0
##$DE= 6.5
##$DECBNUC= <off>
##$DECIM= 2432
##$DECNUC= <off>
##$DECSTAT= 4
##$DIGMOD= 1
##$DIGTYP= 12
##$DL= (0..7)
0 120 120 120 120 120 120 120
##$DP= (0..7)
150 150 150 150 150 150 150 150
##$DP07= 0
##$DPNAME0= <>
##$DPNAME1= <>
##$DPNAME2= <>
##$DPNAME3= <>
##$DPNAME4= <>
##$DPNAME5= <>
##$DPNAME6= <>
##$DPNAME7= <>
##$DPOAL= (0..7)
0.5 0.5 0.5 0.5 0.5 0.5 0.5 0.5
##$DPOFFS= (0..7)
0 0 0 0 0 0 0 0
##$DQDMODE= 0
##$DR= 22
##$DS= 2
##$DSLIST= <SSSSSSSSSSSSSSS>
$$ [...]
##$SPOFFS= (0..31)
0 0 0 0 0 0 0 0 0 0 0 0 0 0 0 0 0 0 0 0 0 0 0 0 0 0 0 0 0 0 0 0
##$SUBNAM0= <"">
##$SUBNAM1= <"">
##$SUBNAM2= <"">
##$SUBNAM3= <"">
##$SUBNAM4= <"">
##$SUBNAM5= <"">
##$SUBNAM6= <"">
##$SUBNAM7= <"">
##$SUBNAM8= <"">
##$SUBNAM9= <"">
##$SW= 20.5580556627758
##$SWIBOX= (0..15)
0 0 3 4 0 0 0 0 0 0 0 0 0 0 0 0
##$SW_h= 8223.68421052631
##$SWfinal= 0
##$TD= 65536
##$TD0= 1
##$TE= 300
##$TE2= 300
##$TE3= 300
##$TEG= 300
##$TL= (0..7)
0 120 120 120 120 120 120 120
##$TP= (0..7)
150 150 150 150 150 150 150 150
##$TP07= 0
##$TPNAME0= <>
##$TPNAME1= <>
##$TPNAME2= <>
##$TPNAME3= <>
##$TPNAME4= <>
##$TPNAME5= <>
##$TPNAME6= <>
##$TPNAME7= <>
##$TPOAL= (0..7)
0.5 0.5 0.5 0.5 0.5 0.5 0.5 0.5
##$TPOFFS= (0..7)
0 0 0 0 0 0 0 0
##$TUNHIN= 0
##$TUNHOUT= 0
##$TUNXOUT= 0
##$USERA1= <user>
##$USERA2= <user>
##$USERA3= <user>
##$USERA4= <user>
##$USERA5= <user>
##$V9= 5
##$VALIST= <valist>
##$VCLIST= <CCCCCCCCCCCCCCC>
##$VD= 0
##$VDLIST= <DDDDDDDDDDDDDDD>
##$VPLIST= <PPPPPPPPPPPPPPP>
##$VTLIST= <TTTTTTTTTTTTTTT>
##$WBST= 1024
##$WBSW= 4
##$XGAIN= (0..3)
0 0 0 0
##$XL= 0
##$YL= 0
##$YMAX_a= 1414818816
##$YMIN_a= -1831186.432
##$ZGOPTNS= <>
##$ZL1= 120
##$ZL2= 120
##$ZL3= 120
##$ZL4= 120
##$ABSF1= 10
##$ABSF2= 0
##$ABSG= 5
##$ABSL= 3
##$ALPHA= 0
##$AQORDER= 0
##$ASSFAC= 0
##$ASSFACI= 0
##$ASSFACX= 0
##$ASSWID= 0
##$AUNMP= <proc_1d>
##$AXLEFT= 0
##$AXNAME= <>
##$AXNUC= <off>
##$AXRIGHT= 0
##$AXTYPE= 0
##$AXUNIT= <>
##$AZFE= 0.1
##$AZFW= 0.1
##$BCFW= 1
##$BC_mod= 2
##$BYTORDP= 0
##$COROFFS= 0
##$CY= 15
##$DATMOD= 1
##$DC= 2
##$DFILT= <>
##$DTYPP= 0
##$F1P= 0
##$F2P= 0
##$FCOR= 0.5
##$FTSIZE= 0
##$FT_mod= 4
##$GAMMA= 1
##$GB= 0
##$INTBC= 1
##$INTSCL= 1
##$ISEN= 128
##$LB= 0.3
##$LEV0= 0
##$LPBIN= 0
##$MAXI= 10000
##$MC2= 0
##$MEAN= 0
##$ME_mod= 0
##$MI= 0
##$NCOEF= 0
##$NC_proc= -9
##$NLEV= 6
##$NOISF1= 0
##$NOISF2= 0
##$NSP= 1
##$NTH_PI= 0
##$NZP= 0
##$OFFSET= 14.66054
##$PC= 1
##$PHC0= 0
##$PHC1= 0
##$PH_mod= 0
##$PKNL= yes
##$PPARMOD= 0
##$PPDIAG= 0
##$PPIPTYP= 0
##$PPMPNUM= 2147483647
##$PPRESOL= 1
##$PSCAL= 4
##$PSIGN= 0
##$PYNMP= <proc.py>
##$REVERSE= no
##$SF= 90.2741355321144
##$SI= 8192
##$SIGF1= 0
##$SIGF2= 0
##$SINO= 400
##$SIOLD= 32768
##$SPECTYP= <>
##$SREGLST= <1H.CDCl3>
##$SSB= 0
##$STSI= 0
##$STSR= 0
##$SW_p= 1497.18866228788
##$SYMM= 0
##$S_DEV= 0
##$TDeff= 0
##$TDoff= 0
##$TI= <>
##$TILT= no
##$TM1= 0
##$TM2= 0
##$TOPLEV= 0
##$USERP1= <user>
##$USERP2= <user>
##$USERP3= <user>
##$USERP4= <user>
##$USERP5= <user>
##$WDW= 1
##$XDIM= 8192
##$YMAX_p= 1414818816
##$YMIN_p= -1830912
##$CURPLOT= <PDFCreator>
##$CURPRIN= <$PDFCreator>
##$DFORMAT= <normdp>
##$LAYOUT= <+/1D_H.xwp>
##$LFORMAT= <normlp>
##$PFORMAT= <normpl>
##$SURQMSG= 1
$$ End of Bruker specific parameters
$$ ---------------------------------
##XUNITS= HZ
##YUNITS= ARBITRARY UNITS
##XFACTOR= 0.182762287876938
##YFACTOR= 1
##DELTAX= -0.182762287876938
##NPOINTS= 8192
##FIRSTX= 1497.0059
##FIRSTY= -831488
##LASTX= 0
##MAXY= 1414818816
##MINY= -1830912
##XYDATA= (X++(Y..Y))
$$ plain form
8191 -831488 -19456 119808 4096 -213504 535040 812544 685568 108032 -663552 -306688
8180 823808 -384000 456704 -592896 -524800 183296 -56320 -406016 -347136 -436224 -201216
8169 -182272 871424 182784 -474624 289280 785920 5632 -35840 -20992 463872 -628224
8158 398848 505856 698880 -434688 39936 -168960 -401408 -1217536 106496 -318464 474112
8147 -77312 158208 301056 -163328 108032 599040 597504 -178688 -956928 160768 -1259008
8136 -374784 522752 -227840 556544 45056 -252416 -458240 -63488 -400384 1060352 -590848
8125 -91648 -626176 -731136 95232 340992 -928768 -14336 -43520 312320 25088 -387584 -347136
8114 -347136 -1767936 112640 -742400 -250368 233472 -364032 14848 98816 -730624 -534016
$$ packed form
8191h31488a9456A19808D096b13504E35040K77504j26976A08032f63552c06688
8180H23808c84000D56704e92896O8096A83296e6320l49696N8880q9088b01216
8169a82272H71424A82784d74624B89280M96640E632c5840J4848D63872f28224
8158C98848J07008J93024d34688C9936a68960k32448q16128A06496c18464D74112
8147g7312A58208J42848a63328A08032M91008j536a78688p78240A60768a259008
8136c74784E22752b27840E56544D5056b52416k05824f3488l36896A060352e90848
8125i1648n34528j04960I5232K45760i28768a4336k9184C12320B5088c87584M0448
8114c47136j420800A12640g42400b50368B33472c64032A4848Q3968g30624J96608
$$ plain form
8104 -534016 -390656 617984 824832 -449024 -1061888 -437248 -324608 267264 -264704 417792
8093 532992 765440 -219648 134144 184320 573952 610304 -439296 260608 554496 365568
8083 365568 369664 -1085952 476672 404480 316416 133120 559104 94208 -261120 633856
8072 6144 181760 -26624 349696 -373248 1306112 920064 168448 304128 -525312 -118272
8061 696320 200704 -107520 69120 864256 208896 -34816 -353792 -496128 509440 -67072
8050 -376320 -431104 -307200 -227328 442368 -533504 -36352 -174080 60416 868352 -315392
8039 569344 -261120 -1536 384000 -285696 -429568 -416256 -251904 551424 -265728 311296
8028 205824 -192512 310272 -1063424 -441856 -426496 -907264 388608 -153088 323072 284672
$$ packed form
8104e34016J43360F17984K06848d49024o12864d37248J12640B67264b64704D17792
8093E32992K32448b19648A34144N0176L89632L6352d39296B60608K93888j88928
8083C65568M096a085952D76672p2192q8064A33120M25984I4208b61120F33856
8072F144J75616b6624C49696c73248A306112l86048A68448J35680e25312a18272
8061F96320B00704a07520F9120P95136B08896c4816l18976j42336E09440f7072
8050c76320n4784J23904P9872D42368e33504c6352j37728F0416Q07936c15392
8039E69344b61120a536C84000b85696j43872J3312J64352E51424b65728C11296
8028B05824a92512C10272a063424d41856J5360m80768C88608a53088C23072l8400
$$ plain form
8018 284672 734208 -200192 -386048 -746496 -272384 436736 -173568 1407488 208384 324096
8008 324096 -179200 418816 313344 467456 -300032 464896 -909824 -347136 -435200 857600
7997 -117248 176128 337920 870912 620032 624128 156672 748032 296448 268288 -565248
7986 487424 -297984 280064 532992 -58880 -419328 -299520 30208 -25088 -776704 231936
7975 -501248 -842240 411648 132096 -401920 1024 -408064 302080 -258560 -272896 745472
7964 579584 -93184 1210880 -30720 588288 407040 151040 -372224 -60416 -282624 -485888
7954 -485888 -250368 240640 278528 -96768 -1034752 -3584 -341504 1642496 996352 976384
7944 976384 55296 32256 -423936 513024 -596480 -16384 131072 -609792 -676352 -286720
$$ packed form
8018B84672M49536b00192j85856l60448b72384D36736a73568A407488B08384J15712
8008C24096a79200D18816j05472J54112c00032D64896i09824c47136q8064H57600
7997a17248A76128J61792N32992k50880M096A56672N91360B96448k8160e65248
7986D87424b97984B80064K52928e8880l60448J19808C0208b5088p51616B31936
7975e01248l40992D11648A32096d01920A024d08064C02080b58560j4336G45472
7964E79584i3184A210880c0720E88288j81248A51040c72224f0416k22208k03264
7954d85888K35520B40640L7888i6768r37984c584l37920A642496o46144j9968
7944I76384E5296k3040d23936E13024e96480a6384A31072f09792o6560b86720
$$ plain form
7933 108544 -771072 -48640 777216 206848 -77312 -37888 -207872 -403968 538624 922624
7923 922624 -412160 484864 172032 -159744 -312320 248832 -877568 877568 365568 172544
7912 -379392 -40448 -1508352 363008 252928 -293376 453632 -567296 727552 585728 -26624
7901 349696 25600 328704 -967680 832512 -506880 -603648 748032 -263168 728064 203264
7890 -711168 -755200 583680 134656 -287232 848384 235520 -343552 -355840 -53248 -340992
7880 -340992 100352 -239616 -398336 750592 -525824 273920 -253952 295424 1069056 -681984
7869 41472 13824 -620544 -509952 -444416 -12800 73216 -912384 333824 850432 1060352 -801280
7857 898048 -451072 -94208 320000 -306176 275456 993280 -66048 169472 -564736 -115200
$$ packed form
7933A08544g71072d8640G77216B06848g7312c7888j69984j96096E38624L84000
7923I22624d12160D84864A72032a59744j52576B48832h77568H77568C65568A72544
7912c79392d0448j467904C63008j10080b93376D53632e67296G27552j41824b6624
7901C49696B5600L03104i67680H32512e06880r6768G48032b63168G28064B03264
7890g11168m4032E83680A34656b87232H48384B35520c43552j2288e3248k87744
7880c40992A00352b39616j58720G50592e25824B73920b53952B95424P73632f81984
7869D1472A3824f20544J10592O5536a2800G3216i12384C33824N16608K09920h01280
7857H98048d51072i4208C20000c06176B75456P17824f6048A69472e64736a15200
$$ plain form
7846 17920 -440320 245248 1456640 318976 -1286656 25088 -567808 336384 225792 462848
7836 462848 -402432 320000 156672 671232 482304 102400 78848 1029632 219648 -56320
7825 435712 326656 63488 84992 1462784 245760 846848 -497664 340992 -121344 -823808
7815 -823808 -542208 178688 10752 358400 -361984 691200 -90112 573952 1536 -156160
7804 145408 -470528 6144 -1101312 -143872 111104 -499200 -105984 258560 -505856 -1026560
7794 -1026560 -346112 233472 148992 -327168 1253376 -351232 195584 -29696 -41984 -237056
7784 -237056 425472 -1342976 393728 -158208 -391680 313856 -883200 43520 -324096 -66048
7773 -142336 611328 418304 279040 189952 41984 596992 467456 -86016 -554496 -87552
$$ packed form
7846A7920d40320B45248J211392C18976a286656B5088e67808C36384j10592K37056
7836D62848d02432C20000A56672N14560j88928A02400k3552R50784B19648e6320
7825D35712j09056F3488K1504J377792B45760O01088d97664C40992a21344p02464
7815h23808K81600A78688A0752L47648c61984F91200i0112E73952A536a56160
7804A45408d70528F144a101312a43872A11104d99200a05984B58560e05856n20704
7794a026560c46112B33472q4480c27168A253376c51232A95584b9696j2288j95072
7784b37056D25472a342976C93728a58208k33472C13856h83200D3520c24096f6048
7773a42336F11328j93024j39264q9088D1984N55008j29536h6016m68480h7552
$$ plain form
7762 -446976 368640 95744 188416 681984 -210944 704512 -539648 -381440 21504 32768
7752 32768 -237056 1235456 -209920 976896 -169984 554496 -161792 -783872 74752 -407552
7741 -445952 108032 672256 469504 50688 808448 133120 770048 -94208 -244736 -506368
7731 -506368 112128 -273920 -150016 18432 581120 46592 364544 357888 713728 939008
7721 939008 -94208 45056 -24064 393728 834048 393728 617984 -70656 -589312 268288
7710 -1417216 -360960 -41984 -271872 440832 1074176 -459776 -27136 -17920 -146432 -143360 88064
7698 221184 -19456 -713728 -194560 -305664 202752 173056 128512 -267264 -28160 -301568
7688 -301568 -344576 -369152 683520 661504 179712 637440 395264 307712 966656 358912
$$ packed form
7762d46976C68640I5744R2672M93568b10944G04512e39648J58208B1504J1264
7752C2768b37056A235456b09920I76896a69984E54496a61792o22080G4752d07552
7741d45952A08032N64224k02752E0688P57760A33120O36928i4208j50528k61632
7731e06368A12128b73920J23904A8432N62688D6592L17952o656L55840K25280
7721I39008i4208D5056b4064C93728M40320C93728K24256g0656n18656B68288
7710a417216c60960d1984k29888D40832O33344d59776b7136R216j28512L072H8064
7698B21184a9456o94272a94560j11104B02752k9696m4544b67264b8160k73408
7688c01568m3008k4576F83520k2016A79712M57728k42176q7552O58944C58912
$$ plain form
7677 -182272 -390656 -727040 -626176 99840 -374784 613888 182784 52736 334336 -128000
7666 -271872 -741888 -35840 -833024 724480 -442880 -124416 -239104 -217088 -134656 -69632
7656 -69632 -555008 -564736 397824 1090048 -68096 296960 -489472 -208896 551424 -489472
7645 -535552 -269312 657920 -1263104 -621056 -425984 -534528 140800 424448 57344 730624
7635 730624 564224 -761856 382976 657408 -292352 -331264 567296 257024 335360 -182784
7624 -298496 202240 564736 -666112 -698880 -304640 -131072 534528 -435712 216576 -568320
7613 -433664 192512 914432 72192 161280 1651200 415232 -280576 -493056 767488 -79360
7602 -836608 259584 -502272 290816 -783872 -137216 -386048 303104 1208832 -512 479232
$$ packed form
7677a82272k08384l36384J00864I9840c74784F13888A82784E2736K81600a28000
7666b71872m70016c5840p97184G24480d42880a24416j14688K2016Q2432O5024
7656f9632m85376r728C97824O92224f8096B96960d89472b08896E51424d89472
7645e35552K66240F57920a263104f21056J95072j08544A40800K83648E7344O73280
7635G30624j66400g61856C82976K74432b92352l8912E67296B57024P8336a82784
7624b98496B02240L62496f66112l2768c04640a31072E34528d35712B16576e68320
7613d33664A92512P21920G2192Q9088J489920D15232b80576k12480G67488g9360
7602h36608B59584e02272B90816g83872a37216k48832C03104R05728e12D79232
$$ plain form
7591 705024 -337408 267776 242688 412160 812544 115200 356864 145920 -392192 965632
7580 930304 758784 548864 1096192 0 -23552 402432 968192 166400 165376 77312 220160
7569 220160 430080 -359936 375808 598528 474624 409600 65024 269824 415232 -174080
7558 -528896 -7168 413696 -284672 465920 -194048 -28160 367616 498688 -259584 631296
7547 134656 -134144 219136 -683008 501248 253952 -308224 -242176 518656 860160 1332736
7537 1332736 -233472 -331264 1098752 -142848 -215040 -296960 803328 -440832 569856 -1549824
7526 -681472 252928 -394752 -30208 -22528 207872 -805888 309760 212480 180736 730112 1145344
7515 1145344 95232 -285696 491008 857600 -214528 -75776 77824 854528 -40960 638976
$$ packed form
7591G05024c37408B67776k5088J69472M00384A15200K41664A45920c92192I65632
7580I30304j71520k09920N47328@b3552D02432N65760A66400j024G7312J42848
7569B20160K09920c59936C75808K22720j23904o5024F5024K04800J45408a74080
7558e28896g168D13696b84672D65920a94048b8160C67616J31072b59584F31296
7547A34656a34144B19136f83008E01248k47296c08224O6048E18656L41504M72576
7537A332736b33472r7792A098752a42848p2192q1920H03328d40832E69856a549824
7526f81472B52928c94752c0208P680B07872h05888C09760r7280l1744N49376M15232
7515A145344I5232b85696D91008L66592b14528g5776G7824P76704d0960F38976
$$ plain form
7504 795648 -555008 -1171456 -329728 -742912 370688 -102912 919040 -607744 -690688 329216
7493 718848 -28672 195584 253440 -274944 232960 1031680 251392 654848 238080 -142848
7482 643072 72192 886272 -354816 133632 -464384 -545792 491520 -502272 -112640 564224
7471 68608 1495552 -388096 -508416 708608 912896 -282624 -101376 -427008 -113152 893952
7460 392192 729600 -453632 658432 361472 448000 357888 -610304 966144 161280 518656
7450 518656 -348672 369152 491008 -434176 535552 -75264 569856 -356864 -372736 -252928
7440 -252928 352768 -74752 1437696 688128 816128 67584 729088 314368 -725504 -290304
7429 1088512 544256 -615424 470528 -148480 -105984 1317376 -401920 739328 1224704 -4608
$$ packed form
7504G95648e55008o16448c29728m13184C70688a02912I19040f07744q2944C29216
7493G18848b8672A95584N7856b74944B32960P98720B51392M03456B38080a42848
7482F43072G2192Q14080c54816A33632d64384q1408D91520e02272a12640E64224
7471F8608J426944c88096j20320G08608K04288b82624a01376l25632a13152H93952
7460C92192L37408d53632F58432k96960Q6528r0112f10304I66144A61280L57376
7450E18656c48672C69152J21856d34176E35552g5264E69856c56864j5872J19808
7440b52928C52768g4752A437696F88128J28000F7584O61504C14368g25504b90304
7429A088512E44256f15424D70528a48480M2496A317376d01920G39328M85376d608
$$ plain form
7418 1481216 787456 518656 -894976 97792 -22528 617984 350208 31744 417792 130048
7407 894976 501248 1075200 -92672 1163776 -208896 787456 370176 -456704 1285120 1165312
7397 1165312 103936 410112 -338432 44032 -41472 593408 1677312 7168 285184 336384
7387 336384 45056 5120 -664064 -113152 73216 183296 -8192 -4096 169472 49152 274944
7376 274944 -55296 829440 1283584 -641536 -382976 425472 -311808 914944 -485888 210432
7365 -512 263680 -1063424 337920 -399872 -335872 668160 -526848 1205760 -600576 22016
7354 -587264 -746496 -1290240 216576 168448 -165376 689664 -360448 973312 1141760 814080
7344 814080 -417792 1348096 369152 697344 -24576 -41472 412160 225280 61440 511488
$$ packed form
7418A481216o93760k68800h94976I7792b2528F17984k67776C1744L86048A30048
7407H94976l93728N73952i2672A163776b08896G87456C70176d56704A285120j19808
7397A165312A03936L06176c38432D4032d1472E93408J083904G168K78016N1200
7387C36384D5056E120f64064a13152G3216J10080h192d096A69472D9152K25792
7376B74944e5296H29440M54144f41536K58560D25472c11808I14944d85888B10432
7365e12B63680a063424C37920c99872O4000F68160e26848A205760f00576B2016
7354e87264j59232n43744B16576m8128a65376F89664c60448I73312J68448l27680
7344H14080d17792A348096C69152L28192b4576j6896D12160j86880F1440M50048
$$ plain form
7334 511488 154112 -866304 -208384 -555008 631808 -941568 1033728 347136 1132032 782848
7324 782848 1400832 999936 1182208 -215040 -45568 338944 128512 641024 261120 868864
7314 868864 -1278464 114688 372736 479232 -821248 832000 -134656 93184 483328 454144
7304 454144 -78336 138240 1361408 358912 505344 108032 374272 340480 410112 -635392
7293 766464 282112 340480 -296448 324096 814080 -608256 -16384 -265728 659456 -151040
7282 426496 501760 1089024 322048 -246784 -88064 -668160 -242176 -137216 25088 1216000
7272 1216000 -333312 793600 -232448 -858112 487936 417280 534016 -232960 -402944 -252928
7262 -252928 -181760 -262144 72704 -1018880 -36864 -406016 501248 -201728 -856576 882688
$$ packed form
7334E11488A54112h66304b08384l46624F31808i41568A033728C47136P84896l49184
7324G82848O17984m00896J82272b15040d5568C38944A28512N12512B61120O07744
7314H68864a278464A14688K58048J06496h21248H32000a34656I3184L90144k9184
7304D54144g8336A38240J223168C58912J46432A08032K66240l3792O9632f35392
7293G66464B82112N8368b96448C24096M89984f08256a6384k49344F59456a51040
7282D26496P5264N87264C22048b46784h8064n80096b42176J04960B5088J190912
7272A216000c33312G93600b32448o25664D87936p0656J16736b32960j69984J50016
7262b52928P1168q0384G2704a018880c6864l69152E01248b01728o54848H82688
$$ plain form
7251 553984 449536 -520704 -13312 708608 181248 1218048 124928 514048 513024 157184
7240 891392 471552 -123904 179712 -202240 267264 -645120 -63488 458240 -196096 172544
7229 -223232 347648 180736 53760 117760 618496 827904 -228352 -745472 1131520 515072
7218 430592 -170496 599040 674304 -848384 527872 -221696 54784 136192 478208 471552 1341440
7207 1341440 -800768 -154112 -1006592 238080 159232 760832 264192 1190400 1178112 -81408
7196 -182784 671744 860672 989696 184832 -241152 -346624 -675328 553472 455168 788992
7186 788992 143360 -212992 670208 369152 -386048 -147968 547840 644096 -4608 374272
7175 1169408 409088 507904 394752 174592 444928 39424 613888 302592 123392 -560640
$$ packed form
7251E53984j04448e20704a3312G08608A81248J036800A24928L89120j024A57184
7240H91392m19840a23904A79712b02240B67264f45120f3488D58240a96096A72544
7229b23232C47648j66912E3760O4000N00736K09408b28352n17120A131520E15072
7218D30592a70496E99040P5264h48384E27872b21696E4784Q1408L42016o656Q69888
7207A341440h00768a54112q52480B38080p8848O01600B64192R26208j2288h1408
7196a82784F71744J88928J29024A84832b41152j05472l28704E53472r8304L33824
7186G88992A43360b12992F70208l01056c86048a47968E47840R6256d608C74272
7175A169408D09088R8816j13152A74592K70336C9424N74464C02592A23392e60640
$$ plain form
7164 959488 467968 76288 158208 1106432 1423872 483328 294400 663552 -432128 25600
7153 -88064 59904 1164288 -371712 -101376 -87552 834560 510976 258560 465920 -101888
7142 505856 123392 995328 -121344 161792 -288256 594432 -475648 211456 387072 628736
7132 628736 -238080 142336 -147456 627200 562176 155136 577024 133120 145920 -356352
7121 241664 -172032 429568 -869888 -484352 865280 314368 168448 -696832 559616 343040
7111 343040 25600 -670208 -579072 -305152 169984 -610304 -332288 4608 264704 330240 -11776
7099 -82944 478208 330752 -109056 -277504 48128 767488 994304 -82944 771584 -935936
7088 1198080 349696 876544 596480 1078784 -354816 -172544 607232 14336 107520 -110080
$$ packed form
7164I59488D67968G6288Q1920R48224L17440D83328j88928L69152d32128B5600
7153h8064E9904J104384c71712a01376J3824H34560l23584k52416K07360a01888
7142E05856A23392Q71936a21344A61792b88256E94432d75648B11456J75616K41664
7132F28736b38080A42336a47456F27200o5024A55136M21888A33120J2800c56352
7121B41664a72032D29568h69888L85536H65280C14368j45920f96832E59616k16576
7111C43040B5600f70208R1136K73920A69984f10304K78016D608K60096O5536a1776
7099h2944D78208j47456a09056j68448D8128P19360K26816h2944G71584i35936
7088A198080C49696N26848k80064M82304c54816a72544F07232A4336R3184a10080
$$ plain form
7077 -1165824 369664 380416 -768512 500224 -881664 -103424 -108032 -448512 -109568 -444416
7067 -444416 918016 155648 -258048 -158720 303616 -668672 -484352 148992 529920 895488
7057 895488 -375296 996352 17920 640512 615424 -176128 -764928 296960 -578560 1527296
7046 80896 137216 492032 109056 450560 102912 -153088 189440 769536 -121344 1112576
7035 1758720 839680 173568 427520 563200 2048 -161792 33280 190464 778240 -378368
7024 -150016 651776 -313344 -866816 -457216 41984 173568 698880 142336 1010176 738304
7014 738304 192000 701440 1188352 489984 300544 -264192 833024 -841216 1233920 305664
7003 46592 -310272 648192 -131072 1202688 -290816 -132608 250880 241664 -18944 575488
$$ packed form
7077a165824C69664J0752g68512E00224h81664a03424m608l40480a09568l34848
7067d44416I18016A55648b58048R9328C03616f68672J84320A48992L80928L65568
7057H95488c75296I96352A7920O22592k5088a76128n88800B96960e78560A527296
7046H0896N6320L54816A09056L41504A02912a53088A89440N80096a21344A112576
7035A758720H39680A73568K53952J35680B048a61792C3280J57184N87776c78368
7024a50016F51776c13344n53472M09600D1984J31584N25312A42336Q67840k71872
7014G38304A92000N09440M86912D89984j89440b64192H33024h41216A233920C05664
7003D6592c10272F48192a31072A202688b90816a32608B50880r216a8944E75488
$$ plain form
6992 932352 667136 315392 1337856 262656 283648 380928 911872 128000 449024 -70656
6981 294400 82432 1367552 -1050624 431104 359936 569856 394240 438784 1035776 79360
6970 320000 519168 579072 78336 -656896 378368 -524288 204800 203776 -279552 197120
6959 -457216 -116224 -396288 449536 382464 788480 287232 -50688 -125952 49152 -124928
6948 647168 -505344 652288 1138176 236032 491008 391680 -760832 -138752 -987136 690176
6937 -66048 160256 278016 1447424 143360 629760 1278976 606208 -52736 510464 70656
6926 -307712 900096 1021952 408576 61440 571392 8704 279552 526336 143872 513024
6916 513024 -66048 732672 30720 588800 -985600 752128 1019904 -669184 -526336 1060352
$$ packed form
6992I32352k65216C15392J022464B62656K0992R7280N30944A28000L21024g0656
6981B94400H2432J285120a050624D31104p1168K09920j75616M4544N96992G9360
6970C20000J99168N9904G8336f56896C78368e24288B04800j024b79552A97120
6959d57216a16224k80064D49536o7072M06016B87232e0688p5264D9152a24928
6948F47168e05344F52288M85888B36032K54976r9328g60832a38752q48384F90176
6937f6048A60256J17760J169408A43360M86400O49216F06208e2736E10464G0656
6926c07712I00096J21856D08576F1440N09952H704K70848K46784A43872L69152
6916E13024f6048G32672C0720N58080i85600G52128K67776f69184J42848A060352
$$ plain form
6905 143872 -41984 687616 601088 227840 -840192 744448 458240 737792 1060352 161792
6894 347648 835072 573440 -254976 -199168 141312 1687040 -88064 615424 -77824 563712
6883 384512 293376 737792 235008 977920 270848 -239104 -109056 471040 718848 1657856
6873 1657856 192000 -465920 421376 -494080 365056 424448 -860672 281088 89088 480768
6863 480768 35840 -39936 441344 24064 493568 480768 1235968 -27136 676864 687616 448000
6852 448000 579584 877568 68608 458240 431616 591872 751616 -289280 -350208 716800
6841 1085440 898560 552448 13312 -16384 -157696 215552 -242176 -198144 31232 105984
6831 105984 879104 517120 -48128 617472 -716800 -123392 859136 242176 781312 169984
$$ packed form
6905A43872d1984F87616q6528B27840h40192G44448k86208K79552L22560A61792
6894C47648M87424k61632b54976N5808A41312J545728h8064F15424g7824E63712
6883C84512r1136M44416B35008P42912B70848b39104a09056D71040K47808R39008
6873A657856A92000d65920D21376d94080C65056N9392h60672B81088H9088L91680
6863D80768C5840c9936D41344B4064M69504j2800P55200b7136F76864J0752k39616
6852D48000J31584K97984F8608L89632k6624J60256J59744b89280o0928G16800
6841A085440j86880l46112A3312a6384j41312B15552b42176M4032C1232P4752
6831A05984P73120l61984d8128F17472g16800a23392H59136B42176N39136A69984
$$ plain form
6820 -32256 -177664 967168 1201152 527872 262656 -320512 656384 49152 120320 316928
6810 316928 436224 -519168 871936 259072 727040 348160 664576 -177664 542208 663552
6800 663552 198656 175104 1092608 238080 448512 546816 -610816 448000 835584 617984
6790 617984 -20992 -77824 451584 659456 339456 -226816 -112640 -227840 -392192 1006592
6779 1018880 246272 -164352 -29184 226304 226304 577536 646144 567296 -44032 -561664 696832
6767 438272 -525824 185344 -424960 528384 755712 -558080 74240 -249344 821760 170496
6756 -151040 1498624 1194496 -1024000 1041408 -76800 1131008 -433664 945152 721920
6747 721920 619520 253440 417792 -12288 -135168 616960 -277504 683008 722944 743936
$$ packed form
6820c2256j45408I67168K33984E27872B62656c20512F56384D9152P1168J96608
6810C16928J19296e19168H71936B59072M67968C48160L16416a77664E42208J21344
6800F63552A98656k3552R17504B38080K10432R8304f10816D48000L87584k17600
6790F17984b0992n6832D51584K07872l20000b26816a12640j15200j64352A006592
6779A018880B46272a64352b9184B26304%L51232O8608p8848d4032n17632F96832
6767D38272e25824A85344d24960E28384K27328e58080G4240b49344H21760A70496
6756a51040A498624l04128a024000A041408g6800A131008d33664I45152k23232
6747G21920j02400B53440J64352a2288j22880F16960b77504F83008L9936K0992
$$ plain form
6737 743936 -168960 -868352 261120 782336 288768 -300032 181760 48640 29696 74240
6727 74240 -600064 941056 -56832 -49664 -262656 227840 842752 -37376 905216 780288 193536
6715 119296 1160704 263680 -545792 410112 140800 -118272 206336 -328192 -911872 16896
6704 1267712 566784 230400 65024 819712 466944 231424 361472 237568 -627712 209920
6693 721920 107520 -554496 114688 995840 363520 -227840 66048 -117760 1137664 1082368
6683 1082368 968192 -910336 -562176 -1536 101888 1406976 -163840 -261120 -103936 192512
6672 325632 632832 882688 1656320 217600 338944 389632 340480 1281536 1633792 -10752
6661 747008 -86528 495104 -955392 117248 1004544 87552 120320 572416 -80896 -59904 -163840
$$ packed form
6737G43936a68960o99392B61120N21216B88768c00032A81760D8640j8944M4544
6727G4240f00064I41056e6832P168k12992B27840O14912c7376I05216j24928A93536
6715A19296J041408B63680e45792D10112A40800a18272B06336c28192n83680A6896
6704A267712E66784B30400F5024P54688l52768B31424J30048j23904f27712B09920
6693G21920A07520e54496A14688Q81152C63520b27840F6048a17760A137664n5296
6683A082368j14176i10336L48160a536A01888J305088a63840r7280a03936A92512
6672C25632L07200K49856P73632B17600J21344N0688m9152R41056L52256a0752
6661G47008h6528D95104i55392A17248Q87296H7552L2768M52096h0896K0992j03936
$$ plain form
6650 -163840 582144 155136 950784 792576 1314816 557056 983552 586240 860160 945664
6640 945664 180736 1293824 -81920 519680 603136 436224 274432 -187392 -40448 572416
6629 541696 -222720 112640 799232 -41984 329728 547840 1265664 579072 730624 93184
6618 648192 681984 952320 907264 117248 186368 -111104 -565760 190464 168448 -510976
6607 -49152 874496 958464 849408 697856 614400 365568 -144384 -116224 431104 83968 1321472
6596 1321472 922112 -280576 230912 450048 -156672 729600 184832 -586752 366080 -30720
6585 -333824 -164352 -705024 401408 -99840 462848 320512 1289728 143360 1327616 1409024
6575 1409024 872960 -580096 850944 -177152 241664 315904 820224 1056768 170496 641024
$$ packed form
6650a63840E82144A55136P95648j58208N22240E57056M26496l97312K73920Q5504
6640I45664A80736J113088h1920E19680Q3456j66912j61792a87392d0448E72416
6629E41696b22720A12640O86592d1984C29728K18112P17824E79072J51552I3184
6618F48192L3792K70336m5056A17248O9120a11104m54656A90464k2016e10976
6607d9152H74496Q3968j09056j51552q3456k48832a44384K8160D31104H3968J237504
6596A321472l99360b80576B30912K19136a56672G29600A84832e86752C66080c0720
6585c33824a64352n40672D01408i9840D62848j42336R69216A43360J184256Q1408
6575A409024n36064e80096H50944a77152B41664P4240N04320K36544A70496M70528
$$ plain form
6565 641024 -189952 631808 214528 -290304 -403456 576512 349184 -316928 -3072 1146880
6554 -351744 159744 467456 570880 -1197568 -291840 -935424 899072 647680 -722944 -500736
6544 -500736 525312 353280 667648 -912896 885760 638976 533504 -382976 995328 62976
6533 180224 178176 667136 -119296 853504 -136192 -236032 238080 542720 535040 940032 566784
6522 566784 53248 -1056256 518656 470016 -470528 1448448 787968 -436224 679936 163840
6511 310784 -201728 62976 295936 630272 -117760 924160 148480 318464 -15872 66048
6500 -170496 13824 1481216 799232 544256 235008 -53760 -68096 215552 959488 199168
6489 110592 -147456 637440 636928 127488 853504 847360 1757696 308736 -287744 -230400 90624
$$ packed form
6565F41024a89952F31808B14528b90304j13152E76512k27328c16928c072A146880
6554c51744A59744L07712J03424a197568b91840o43584H99072k51392g22944K22208
6544e00736E25312j72032L14368i12896H85760k46784j05472c82976I95328F2976
6533A80224k048M88960a19296H53504a36192r9840B38080L04640p680M04992l73248
6522E66784E3248a056256E18656m8640d70528A448448o60480d36224F79936A63840
6511C10784b01728F2976K32960L34336a17760I24160A48480J69984a5872F6048
6500a70496A3824J467392o81984k54976B35008e3760j4336B15552P43936A99168
6489A10592a47456F37440n12A27488P26016o144R10336C08736b87744N7344I0624
$$ plain form
6477 -55808 142848 30720 -1175552 1391616 -235008 -621568 815616 851456 165888 385536
6467 385536 178688 1133568 198656 460800 1291776 786432 261120 431616 648192 490496
6457 490496 163840 549888 356352 318464 -510464 304640 110080 1019904 345088 514560
6447 514560 -102912 331776 -186368 224256 216064 -773632 1771520 43008 315904 733184
6437 733184 -452096 -335872 -13312 363008 282112 -711680 -19968 368128 174080 455168
6427 455168 595456 187392 1128960 914432 106496 946688 413184 371200 -666112 373248
6416 902656 141312 -495104 588800 575488 -895488 936960 958976 1014272 94208 642048
6406 642048 902656 695808 444928 204288 700416 517120 1387008 183296 87040 1002496
$$ packed form
6477e5808A42848C0720a175552A391616b35008l86560H15616L5840A65888K19648
6467C85536A78688R54880A98656K62144Q30976n05344B61120J70496K16576j57696
6457D90496A63840L86048j93536l7888e10464C04640A10080R09824C45088J69472
6447E14560a02912C31776a86368B24256q192g73632A771520D3008K72896M17280
6437G33184d52096J16224a3312C63008q0896g11680a9968C68128A74080K81088
6427D55168J40288A87392R41568k14528A06496Q40192D13184m1984f66112C73248
6416I02656A41312d95104E88800j3312h95488I36960K2016N5296I4208N47840
6406F42048K60608k06848k50880B04288M96128j83296Q69888A83296H7040R15456
$$ plain form
6396 1002496 -525312 17408 652288 117760 828928 793600 35840 44032 701440 -33792 32768
6384 1056768 538112 43008 438784 -273408 -44032 352768 596992 1488384 145408 844288
6374 844288 1383936 421888 -566784 -214016 780288 905216 487936 869376 1027584 117248
6363 1402880 82944 950784 1462784 870400 605696 -295424 -27648 121856 582144 1056256
6353 1056256 -342528 147968 837120 1000448 975872 -249344 509952 148992 353792 523776
6343 523776 467456 579584 -434176 -202752 -213504 993280 -586752 -643584 -83456 295424
6332 296960 -147968 2048 1168896 729088 161792 1275392 273408 -798720 592384 424448
6322 424448 1409536 57856 280064 583680 857600 -214016 -438784 53760 -571392 -49152
$$ packed form
6396A002496e25312A7408O34880A17760P11168l5328C5840Q192O57408c3792C2768
6384A056768n18656D3008L95776b73408d4032C52768K44224Q91392A45408O98880
6374H44288N39648D21888e66784b14016G80288J24928m17280L81440J58208A17248
6363A402880H2944Q67840N12000n92384k64704b95424b7648A21856M60288M74112
6353A056256c42528A47968O89152J63328k4576b49344E09952A48992K04800J69984
6343E23776n6320J12128d34176b02752j0752I93280e86752n6832h3456B95424
6332B96960a47968B048J166848m39808A61792J113600B73408g98720E92384j67936
6322D24448R85088E7856K22208L03616K73920b14016k24768E3760e71392d9152
$$ plain form
6311 495616 321536 -47104 -252416 524288 269312 955904 -473088 781312 12800 288768
6301 288768 840704 69120 -891392 959488 75264 486400 -96768 144384 758272 -865280
6290 1317888 303104 -91136 1015808 600576 716800 53248 138240 621568 957440 -26112
6279 23552 -107520 262656 -188416 748544 279040 -173568 946176 758784 335360 364544
6269 364544 414208 -5120 851456 1295360 -39936 -24576 477696 320000 747520 177152 -194048
6257 227840 492544 906752 506368 495616 348672 697344 921600 661504 -361984 538624
6246 338944 723968 727040 800256 1057280 205312 442880 -512 326656 -790528 99840 81920
6235 81920 -40960 -384000 415232 847360 438272 608768 223744 219136 500736 -124928
$$ packed form
6311D95616j74080d7104k05312E24288k54976O86592d73088G81312A2800K75968
6301B88768N51936F9120h91392I59488G5264M11136i6768A44384O13888h65280
6290A317888C03104i1136A015808m15232J16224E3248Q4992M83328L35872b6112
6279B3552a07520B62656a88416G48544B79040a73568I46176j87392C35360K9184
6269C64544M9664e120H51456M43904c9936J5360D77696j57696M27520A77152a94048
6257B27840K64704M14208m00384j0752j46944L48672K24256k60096c61984E38624
6246C38944L85024L072P3216K57024B05312K37568e12C26656g90528I9840j7920
6235H1920d0960l43040D15232M32128m09088J70496B23744m608K81600a24928
$$ plain form
6224 430080 325632 -141312 70144 -1536 197120 697344 90624 555008 1355776 276992
6213 -21504 462336 -39936 449536 1321472 855040 1054208 216576 138752 735744 148480
6202 1417216 900096 349696 1364992 770560 -241664 890368 358400 1077248 1286144
6193 1286144 335872 508928 169984 699392 -8192 996352 129536 505856 24064 864768
6183 864768 132096 491008 718848 -22016 598016 526336 -302592 1231872 235008 -204800
6172 157184 1152512 -582656 1287168 306688 568832 -65536 -122880 642560 271360 328192
6162 328192 1346048 126464 523776 1579008 1063424 1259008 65536 -290816 30720 254976
6152 254976 1063936 -540160 741888 556544 -59904 226304 -318976 1583616 969728 928768
$$ packed form
6224D30080j04448a41312G0144a536A97120N00224I0624M64384Q00768B76992
6213b1504D62336c9936D49536Q71936m66432J99168B16576p7824N96992A48480
6202A417216n17120C49696J015296n94432b41664H90368C58400P18848K08896
6193A286144C35872J73056A69984N29408h192I96352A29536L76320B4064Q40704
6183H64768A32096L58912K27840b2016E98016p1680c02592A231872B35008b04800
6172A57184R95328e82656A287168C06688K62144f5536n7344F42560B71360N6832
6162C28192J017856A26464L97312J055232n15584J95584F5536b90816C0720K24256
6152B54976Q08960e40160G41888j85344e9904B26304c18976A583616o13888m0960
$$ plain form
6142 928768 -1013760 664576 474112 395264 296960 1278976 513536 208896 535040 605184
6132 605184 1622528 315904 -91136 487424 701440 176128 1433088 820736 1400832 -796160
6121 -501248 207360 -525824 878592 -17408 727552 79872 1212416 797184 254464 -481792
6110 363520 537600 662528 1067008 339456 1071616 356352 -900096 -3584 403968 -126976
6099 779776 -429056 383488 1199616 1165824 479232 321536 759296 526848 555008 635904
6089 635904 1043456 453120 770048 24064 -300544 766976 384512 533504 848896 154624
6078 992256 1591296 -336896 795136 990720 747520 407040 1482240 484864 519680 579584
6068 579584 703488 229376 1591808 -544768 1042944 935936 -882688 608768 596992 -1176576
$$ packed form
6142I28768a013760F64576j90464p8848r8304R82016E13536B08896L26144P0144
6132F05184J017344C15904i1136D87424K14016A76128J256960o12352N80096g96160
6121e01248B07360e25824H78592a7408G27552G9872J132544m15232B54464d81792
6110C63520J74080J24928M04480C39456P32160C56352i00096c584D03968a26976
6099G79776d29056C83488Q16128l3792D79232j57696M37760k32448K8160Q0896
6089F35904M07552D53120L16928B4064c00544G66976l82464J48992L15392A54624
6078I92256N99040c36896G95136J95584k43200l40480J075200D84864L4816N9904
6068E79584J23904B29376J362432e44768A042944j07008h82688F08768j1776a176576
$$ plain form
6057 141312 274944 400896 820224 832512 -202752 338432 64000 780288 -537088 411136
6046 -65536 -410112 324608 470016 -568832 717824 412160 815104 630784 408576 1047552
6036 1047552 520704 1189888 987136 -31232 655360 139776 718848 1261056 119808 912896
6026 912896 691712 -303104 1036800 203776 1045504 177152 805888 414720 302080 1295360
6016 1295360 399360 1191936 -268800 1056256 -229376 520704 226816 1027072 -107008
6006 1522176 -9728 122880 -236032 -81408 481280 95232 355328 999424 312832 136192
5995 -498176 -60416 -123904 955392 556544 842240 514048 999424 517120 223232 998912
5985 998912 38912 405504 -11776 1187328 -75776 448000 40960 560128 866816 55296
$$ packed form
6057A41312J33632J25952M19328J2288b02752C38432F4000P16288e37088D11136
6046f5536l44576C24608J45408e68832G17824l05664M02944j84320k22208O38976
6036A047552E20704O69184k02752c1232F55360A39776N79072N42208A19808P93088
6026I12896k21184c03104A036800B03776Q41728A77152O28736l91168j12640R93280
6016A295360C99360P92576b68800A056256b29376E20704B26816Q00256a07008
6006A522176i728A22880b36032h1408D81280I5232K60096O44096C12832A36192
5995d98176f0416o3488I55392l98848K85696l28192M85376m82304B23232P75680
5985I98912C8912L66592a1776A187328g5776D48000D0960N19168L06688E5296
$$ plain form
5974 192512 0 -52224 522240 1254912 368128 84480 1605632 -65536 -101888 546816 511488
5963 511488 495616 286208 683008 -157696 -293376 312832 -526336 70144 1535488 416256
5952 791040 544768 217600 -205312 1158656 624128 838656 480256 639488 291840 870912
5942 870912 1162240 173568 -282112 1959936 133632 -153600 368640 28672 250368 1490944
5932 1490944 -311808 493568 1245696 731648 1313280 388608 436736 470528 524288 -224256
5921 156672 -62976 1270784 91136 1187840 962560 240640 -450560 1272832 572928 676352
5911 676352 449536 1413120 538624 1295360 98816 814592 579072 1387520 363520 780288
5901 780288 1098240 755200 1240576 1273344 -473600 192512 593408 -987136 1035776 376320
$$ packed form
5974A92512@e2224E22240P32672C68128H4480J521152f5536l6352E46816l5328
5963E11488j5872k09408L96800a57696j35680C12832e26336G0144J465344D16256
5952G91040k46272B17600b05312A158656n34528K14528l58400J59232B91840N79072
5942H70912K91328A73568b82112A959936A33632a53600C68640B8672K21696J240576
5932A490944c11808D93568P52128n14048N81632C88608M8128L3792N3760b24256
5921A56672f2976A270784I1136J096704k25280B40640d50560A272832E72928J03424
5911F76352k26816R63584E38624P56736I8816P15776k35520Q08448C63520M16768
5901G80288L17952l43040M85376L2768d73600A92512M00896i87136A035776C76320
$$ plain form
5890 -266240 463360 434176 1027584 1124864 -103424 1121792 -333824 771072 0 668160 212480
5878 193024 588288 -284160 739840 1027584 677888 473088 605184 1323520 240640 323072
5868 323072 1039360 1425408 605696 1470464 495104 998912 902144 130048 834560 300032
5857 428032 929792 1111040 434688 982528 -259584 324608 914944 456704 -45056 2046464
5846 1018880 5632 -182272 1415168 242688 433152 873984 354816 742400 342528 -27136
5835 1108992 -140800 158208 416768 295936 314880 810496 536576 382976 581120 544768
5825 544768 123904 1601024 1160704 808448 1046528 482816 1122816 411648 858112 1008640
5815 1008640 1185280 552960 763904 1242112 1345536 -176128 1118208 199168 -302592
$$ packed form
5890b66240D63360k9184N93408R7280a03424A121792c33824G71072@F68160B12480
5878A93024L95264b84160G39840K87744l49696k04800J32096P18336B40640Q2432
5868C23072P16288L86048F05696Q64768D95104N03808r6768A30048P04512C00032
5857D28032N01760J81248D34688N47840b59584C24608N90336D56704d5056B046464
5846A018880E632a82272A415168B42688J90464M40832C54816L87584C42528b7136
5835A108992a40800A58208K58560j20832J8944M95616k73920j53600J98144l6352
5825E44768A23904J477120m40320l52256K38080D82816O40000D11648M46464J50528
5815A008640J76640E52960K10944M78208J03424a76128A118208A99168c02592
$$ plain form
5805 325632 -359424 545280 54784 1006080 902144 1070080 364544 821248 967168 -663040
5794 131584 199680 810496 1141760 46592 1293824 474112 1047552 407040 998912 1748992
5784 1748992 1245184 -273408 695808 -64512 126976 976384 429056 403456 813056 134656
5773 367104 762368 1075200 113152 126976 105984 463360 133632 1051136 722944 -175616
5762 1346048 134144 598528 350208 2397184 1104896 1498112 909312 686592 983552
5753 983552 130048 1614336 650240 414208 445952 628736 343552 -325120 1409536 863232
5743 863232 401408 -730112 1394688 970752 764416 585216 548864 1218560 266752 479744
5733 479744 -130048 497152 145920 1063424 951296 856576 376320 540672 198656 62976
$$ packed form
5805C25632c59424E45280E4784R51296j03936J67936C64544M56704J45920f63040
5794A31584O8096O10816L31264D6592J247232D74112N73440D07040N91872P50080
5784A748992n03808b73408F95808f4512A26976Q49408D29056k5600M09600A34656
5773C67104L95264L12832A13152J3824k0992L57376A33632R17504l28192a75616
5762A346048A34144M64384k48320K046976A104896L93216n88800k22720K96960
5753I83552A30048J484288F50240k36032L1744J82784k85184c25120A409536n46304
5743H63232D01408g30112A394688m23936k06336j79200l6352O69696B66752K12992
5733D79744a30048D97152A45920R17504j12128r4720C76320J64352A98656F2976
$$ plain form
5722 413184 1608192 649728 590336 1498112 734720 652288 292864 2560 -158720 689152
5711 406016 690688 981504 280576 -110592 807424 251392 483840 502784 1183232 368640
5700 686592 283136 -243712 309760 745472 1134080 842240 501248 -255488 635392 678912
5690 678912 1425408 533504 378368 896512 551424 355840 700928 859136 944640 378880
5679 461312 793600 886784 380928 606208 565248 353792 1713152 413184 156160 812032
5669 812032 584704 1504256 829440 -604672 511488 369152 687616 561152 535552 955392
5659 955392 1187840 1082368 2108416 1341440 1400832 1037312 -4608 693248 923136 502784
5649 502784 954368 658944 670208 1263616 253440 1152512 1509888 398336 924160 963072
$$ packed form
5722D13184J195008F49728n9392R07776G34720q2432B92864B560a58720F89152
5711D06016K84672K90816B80576a10592H07424B51392K32448J8944O80448C68640
5700F86592B83136b43712C09760M35712L88608k91840l40992b55488F35392M3520
5690F78912P46496E33504j55136N18144l45088j95584L45088J58208Q5504C78880
5679D61312L32288R3184C80928K25280m0960k11456J359360D13184A56160O55872
5669H12032k27328R19552o74816f04672E11488j42336L18464j26464k5600M19840
5659I55392K32448j05472J026048p66976N9392l63520d608F93248K29888m20352
5649E02784M51584k95424J1264N93408B53440Q99072L57376C98336N25824L8912
$$ plain form
5639 963072 476160 442880 103936 1020928 1848832 594944 1261056 834560 -508416 779264
5628 961536 174592 632832 46592 222208 1100288 284672 580096 83456 694272 1804800
5618 1804800 2251264 471552 1333760 1257984 -121344 -33280 1007104 1267200 1200640 992256
5608 992256 560640 1654784 660992 332288 539136 184320 78848 966144 1128960 879616
5598 879616 -73216 2560 -257536 333824 499712 1319936 731648 145408 986624 1159680
5588 1159680 -91136 1306112 997888 657920 246784 916992 1276416 1160192 264192 825856
5578 825856 537088 963072 1071104 170496 558080 598016 573952 879616 762880 275456
5567 918016 929280 1042944 888832 -319488 274432 964608 1043968 894464 266752 1498624
$$ packed form
5639I63072D76160l3280A03936R16992Q27904E94944O66112m26496e08416G79264
5628I61536A74592M58240D6592J75616Q78080B84672K95424H3456O10816J110528
5618A804800M46464D71552Q62208p5776a21344c3280A007104K60096o6560k08384
5608I92256m31616J094144F60992l28704K06848A84320G8848Q87296J62816k49344
5598H79616g3216B560b57536C33824J65888Q20224n88288A45408Q41216J73056
5588A159680i1136A306112l08224l39968B46784O70208L59424j16224B64192N61664
5578H25856k88768M25984J08032A70496L87584L9936k4064L05664j16736B75456
5567I18016J1264J13664j54112c19488B74432O90176P9360j49504B66752J231872
$$ plain form
5557 1498624 693248 622592 438784 122368 1273856 504320 883200 264704 1205760 601088
5546 1749504 -342016 1167360 775680 548352 1411072 824832 510976 413184 847872 1672704
5536 1672704 -579072 560640 827392 581632 2080256 369152 667648 1887744 696832
5526 845312 130560 552448 769024 -316416 407040 1574400 1036288 440320 801280 1252864
5516 1252864 368640 364032 955392 283648 2004480 -80896 2543104 1191424 1943552 1817600
5506 1817600 1147904 2077696 1605632 1803776 1556992 1876480 1177600 1030656 1266176 1715712
5496 1715712 2656256 1021440 2268672 2015232 1232896 1310208 713216 1026560 415744
5486 893440 1602048 860160 914944 750080 1077248 1271808 1154560 0 1560064 1037824 923648
$$ packed form
5557A498624F93248p0656j83808A22368J151488E04320L78880B64704R41056F01088
5546A749504c42016A167360l91680k27328Q62720n86240l13856r7792M34688Q24832
5536A672704e79072E60640K66752k45760J498624C69152K98496J220096F96832
5526H45312A30560M21888K16576c16416D07040J167360n38112D40320L60960M51584
5516A252864C68640m608N91360B83648J720832h0896B543104A191424P52128j25952
5506A817600o69696R29792m72064J98144k46784L19488o98880j46944K35520M49536
5496A715712R40544A021440J247232k53440p82336P7312n96992L13344D15744
5486H93440P08608p41888N4784j64864L27168J94560j17248@A560064n22240j14176
$$ plain form
5475 923648 39936 1302016 1357824 1756672 756736 -383488 564736 1271808 1134080 16896
5464 80896 232960 572928 -38400 1011712 499200 1355776 772096 511488 72704 131072
5454 131072 1209856 517120 747008 1256448 502272 614400 2006016 1052160 548864
5445 548864 592384 1591296 1716224 1092096 1156608 1285632 656384 726528 936960 939008 1281536
5434 1281536 1383424 923648 826368 876032 606208 372224 337920 699392 1415168 824832
5424 824832 553472 546816 817152 1669120 932864 415232 933376 1832960 2001408 1013760
5414 1013760 894464 2075136 470528 1476096 804864 279040 1425920 1167872 866304
5405 866304 339968 756736 588800 1262080 932864 1636864 407552 1471488 1135104 278528
$$ packed form
5475I23648C9936J262080N5808L98848G56736c83488E64736P07072j37728A6896
5464H0896J52064L39968c8400A011712D99200Q56576n83680k60608G2704N8368
5454A31072J078784E17120K29888N09440E02272J12128J391616r53856n03296
5445E48864M3520R98912J24928o24128O4512J29024o29248P0144K10432K048L42528
5434A281536J01888m59776r7280M9664k69824k33984l4304L61472P15776n90336
5424H24832k71360o656K70336Q51968p36256D15232N18144Q99584J68448r87648
5414A013760j19296J180672D70528J005568o71232B79040J146880k58048l01568
5405H66304C39968M16768j67936O73280l29216P04000D07552J063936l36384B78528
$$ plain form
5394 363520 1351680 1039872 1361920 623104 498688 1980928 -132608 1973248 1846272
5385 1846272 698368 1539072 1405440 849920 1287680 1093632 177152 873984 2119168
5376 2119168 650752 1210880 1203712 1575424 976896 2102784 1698304 1657856 1741312 1479168
5366 1479168 760320 1238528 1295872 1019392 1484800 630784 797184 1494016 348160 924672
5356 924672 599040 1122816 1265664 1384448 831488 1581056 2376704 1736704 1591808 1164288
5346 1164288 775680 1686528 2764288 1866240 1884160 1266688 1491456 1163776 1997824 1384960
5336 1384960 1715712 1845760 2050560 773120 1586688 2526720 2211840 1885184 1701376 2554880
5326 2554880 2301952 529920 1583104 1500160 640512 1449472 1272320 787456 1012736 2024960
$$ packed form
5394C63520R88160l11808L22048F23104j24416J482240a32608A973248j26976
5385A846272F98368Q40704j33632n55520M37760j94048A77152O96832J245184
5376B119168F50752N60128p168L71712n98528J125888m04480m0448Q3456k62144
5366A479168p18848M78208N7344k76480M65408F30784J66400O96832C48160N76512
5356I24672l25632N23776J42848J18784n52960P49568P95648o40000j44896m27520
5346A164288l88608R10848J077760q98048J7920o17472K24768l27680Q34048o12864
5336A384960L30752J30048K04800G73120Q13568R40032l14880l26656j83808Q53504
5326B554880k52928E29920J053184q2944F40512Q08960j77152m84864K25280J012224
$$ plain form
5316 2024960 1583104 947712 576512 1638400 1504256 2084864 741888 1839104 1217024
5307 1217024 954368 1239552 1019392 1574912 1479168 868864 -59904 1230336 1070080 616960
5297 616960 506368 1409536 405504 773632 1286656 586240 1508864 739328 269824 966144
5287 966144 -157696 572416 922112 1507840 1519616 327168 1050112 999424 1190400 762368
5277 762368 933888 36352 653824 357888 780800 -190464 759296 1332736 1032192 551424
5267 551424 1352704 -78336 355328 1063424 430592 1674240 1512448 1950208 2534400 1622528
5257 1622528 1115648 1167872 1044480 1638912 1868288 1305088 745472 1231360 753152 652800
5247 652800 -481280 1462272 935936 1221120 861696 1232896 1570816 723968 1434624 977408
$$ packed form
5316B024960m41856o35392l71200J061888j34144N80608G41888J097216o22080
5307A217024k62656K85184k20160N55520r5744o10304e9904A230336j60256m53120
5297F16960j10592R03168D05504L68128N13024E86240R22624G39328B69824O96320
5287I66144a57696E72416L49696N85728J1776C27168P22944n0688J90976m28032
5277G62368J71520C6352O17472k95936M22912a90464G59296N73440l00544m80768
5267E51424Q01280g8336C55328P08096D30592J243648j61792M37760N84192r11872
5257A622528n06880N2224j23392N94432K29376n63200n59616M85888m78208j00352
5247F52800d81280A462272n26336K85184l59424L71200L37920G23968P10656m57216
$$ plain form
5237 977408 2314752 1421824 313344 1068544 1375232 1273856 1491968 -248320 842752 271872
5226 739840 1297408 153088 1316352 743936 -387072 409088 814592 269824 1836032
5217 1836032 224256 1211904 1098240 379904 616448 1071616 -144384 668672 1740288
5208 1740288 1953792 891392 97280 638976 1386496 2234368 1216000 664576 1316352 93184
5197 -41984 507904 -192000 1221120 857088 520704 1338368 780288 1539584 1309696 630272
5186 562688 677376 1401344 849408 741888 1128960 1398784 1098752 1296896 1556480 969216
5176 969216 384512 1021440 1917440 1128448 -344064 2077184 1633792 1713664 659968 537088
5166 537088 1202176 1038336 438272 1435136 1261568 438272 1287680 695808 1040384 1561088
$$ packed form
5237I77408J337344q92928C13344P55200L06688j01376K18112b48320H42752B71872
5226G39840N57568A53088J163264n72416c87072D09088M05504B69824J566208
5217A836032B24256R87648j13664C79904K36544M55168a44384F68672J071616
5208A740288K13504H91392I7280N41696P47520Q47872j018368n51424O51776I3184
5197d1984E07904a92000A221120l64032l36384Q17664n58080P59296k29888F30272
5186E62688J14688P23968n51936j07520L87072K69824l00032J98144K59584n87264
5176I69216C84512O36928Q96000p88992c44064B077184m43392P9872F59968j22880
5166E37088O65088j63840D38272R96864j73568D38272Q49408n91872L44576N20704
$$ plain form
5156 1561088 883712 684544 740352 863232 1507328 140800 422912 855552 622592 -31232
5145 1487872 1166848 1012224 247808 1296896 1327616 140800 634368 1387520 916480 -48128
5134 577536 1350144 2007040 634368 395264 820224 661504 873472 1205760 1065472 284160
5123 780288 801792 382976 398848 657920 -183296 1103872 1114624 875008 2297344 834048
5112 1226752 900608 1822720 2458112 1317376 2195456 1460224 1196032 2158592 1332736
5103 1332736 909312 1356288 2465280 628224 1714176 1438720 1856512 1660928 1439744
5094 1439744 557568 1567232 2064896 1926144 981504 1512960 1555456 539136 2356224
5085 2356224 2027008 2270720 2404352 3799552 2515968 2837504 2676736 2917376 2534912
$$ packed form
5156A561088o77376j99168N5808J22880O44096A40800K82112M32640k32960c1232
5145A487872l21024j54624B47808J049088L0720A40800M93568P53152m71040d8128
5134E77536P72608O56896F34368k39104M24960j58720K11968L32288j40288B84160
5123G80288K1504C82976J5872K59072a83296A103872J0752k39616J422336H34048
5112A226752l26144R22112O35392j140736Q78080p35232k64192R62560q25856
5103A332736m23424M46976J108992F28224J085952k75456M17792j95584k21184
5094A439744E57568J009664M97664j38752r44640N31456M2496E39136J817088
5085B356224l29216K43712J33632J395200j283584L21536j60768K40640l82464
$$ plain form
5076 2534912 1664512 1406976 2112000 1430016 605184 1432576 1505280 1484288 696832 1830912
5066 1830912 792064 1012224 629248 1346048 960512 1698816 1563136 1133056 1022464 1422336
5056 1422336 520704 606720 386560 704512 1373184 251904 1624576 1631744 591872 920576
5046 920576 785920 529920 1596928 576512 987136 604160 2571776 1972736 476160
5036 806912 478208 1098752 678400 1557504 427008 1232384 481792 1743360 888832 969728
5026 969728 775168 1192960 716800 1081856 1651200 1510400 266752 1240576 1262592 535040
5015 1672704 1759744 1090560 219136 611840 958464 1007616 1900032 771584 1114112 857600
5005 857600 1244160 727552 1179136 -163840 395264 684544 1426432 96256 1274880 1626624
$$ packed form
5076B534912q70400k57536P05024o81984F05184Q27392P2704k0992F96832J134080
5066A830912G92064K20160l82976P16800l85536P38304j35680m30080j10592L99872
5056A422336E20704Q6016k20160L17952O68672B51904J372672P168E91872L28704
5046I20576j34656k56000J067008E76512M10624l82976J967616n99040D76160
5036H06912l28704O20544m20352Q79104D27008Q05376D81792J261568q54528Q0896
5026I69728j94560M17792m76160L65056N69344j40800B66752R73824K2016E35040
5015A672704Q7040o69184B19136L92704L46624M9152Q92416G71584L42528k56512
5005H57600L86560n16608M51584a63840C95264K89280P41888I6256J178624L51744
$$ plain form
4995 1626624 2181120 1470976 75776 1020928 1447424 934912 1050624 1147392 2113536 472064
4984 1905664 940032 244736 1431040 639488 1686528 975360 719872 849408 2034688
4975 2034688 1388544 2053632 1803776 1208832 1057792 957952 1404928 755200 1072128 1192960
4965 1192960 1262592 1016320 1702912 1319424 1292800 1408000 537088 1967104 1200640 1416704
4955 1416704 1236480 966144 1878016 1007616 1007616 1630720 851456 397824 1417728 919552
4945 919552 845824 864256 1829888 1908736 2196992 1198080 1192448 1525760 1343488 1484800 2091008
4934 2091008 1372160 2121216 1838592 651264 781312 2129920 1393664 1335296 1304576 2235904
4924 2235904 2191360 2276864 2311168 806400 2473472 389632 1052672 1323520 1692672 1715200
$$ packed form
4995A626624N54496p10144G5776R45152M26496n12512J15712R6768R66144D72064
4984A905664I40032B44736J186304F39488J047040p11168k55488J29536J185280
4975B034688o46144O65088k49856n94944j51040r9840M46976o49728L16928J20832
4965A192960O9632k46272O86592l83488k6624J15200E37088J430016p66464K16064
4955A416704j80224k70336R11872q70400%O23104p79264C97824J019904m98176
4945I19552p3728J8432R65632P8848K88256r98912n632L33312j82272J41312O06208
4934B091008p18848P49056k82624F51264J30048J348608p36256n8368l0720R31328
4924B235904m4544Q5504L4304H06400J667072C89632O63040K70848L69152K2528
$$ plain form
4914 1715200 1789440 1898496 1529856 836096 1136640 1327616 1085440 1180672 1637376 1719296
4904 1719296 1485824 2358784 1214976 1086976 1289728 1750016 2607104 2019328 1528320
4895 1528320 1264128 1010176 1628160 1442304 239104 1626624 1633792 1931264 1710080 1068032
4885 1068032 1337344 2074624 1642496 1243648 1649664 1309184 1998336 1029632 1345024 1267200
4875 1267200 1190912 1121792 1807872 1064448 892416 1997824 1396736 493056 1842688 1011712
4865 1011712 1875456 2173952 1523200 1547776 722944 1533952 611328 1781760 1829888 1589760
4855 1589760 1789440 2114048 1764864 1897984 2329088 1732608 2211840 1845248 2987520
4846 2987520 1153536 2818048 1875968 2268160 2939904 2636288 3679232 2539520 3373056
$$ packed form
4914A715200P4240J09056l68640o93760L00544J90976k42176R5232M56704Q1920
4904A719296k33472Q72960j143808j28000K02752M60288Q57088n87776m91008
4895A528320k64192k53952O17984j85856B39104J387520P168K97472k21184o42048
4885A068032K69312P37280m32128l98848M06016l40480O89152r68704L15392p7824
4875A267200p6288o9120O86080p43424j72032J105408o01088D93056J349632q30976
4865A011712Q63744K98496o50752K4576G22944Q11008F11328J170432M8128k40128
4855A589760J99680L24608l49184J33120M31104n96480M79232l66592J142272
4846B987520A153536J664512r42080L92192O71744l03616J042944j139712Q33536
$$ plain form
4837 3373056 3067904 3089920 3972608 4170240 4976128 5411840 5915136 5885440 6862336 4552192
4827 4552192 5520896 4150272 4532736 3221504 2871808 2553856 2300416 2069504 1187328
4818 1187328 1582592 142336 2128896 725504 1755136 1430528 1667072 947712 1668096
4809 1668096 1436160 1289728 1573376 1733632 1486848 1120768 2048512 1779712 716288 1502208
4799 1502208 1285120 1829888 799744 1885696 1806336 1117184 2300416 1369088 1743360
4790 1743360 1914368 864256 632832 978944 2053120 925184 1073152 1946624 579584
4780 1244672 660992 1651200 1403392 1865216 1315840 1857536 2266112 1466880 1203200 1409024
4770 1409024 1441792 1971712 620544 1429504 749568 2193920 2189312 3313152 1744384 2286080
$$ packed form
4837C373056l05152K2016Q82688J97632Q05888M35712N03296k9696R76896k310144
4827D552192R68704j370624L82464j311232l49696l17952k53440k30912q82176
4818A187328L95264A42336J986560G25504J029632l24608K36544p19360P20384
4809A668096k31936j46432K83648J60256k46784l66080R27744k68800G16288P85920
4799A502208k17088N44768G99744J085952p9360o89152J183232r31328L74272
4790A743360J71008H64256k31424L46112J074176I25184J47968Q73472E79584
4780A244672n83680R90208k47808M61824n49376N41696M08576p99232k63680K05824
4770A409024L2768N29920F20544Q08960o79936J444352m608J123840j568768N41696
$$ plain form
4760 2286080 2828800 1543680 651776 997376 1360384 1100800 2141696 2155008 1284096
4751 1284096 1311744 2300928 2798080 1853440 1085440 1862656 2565120 2646016 2418688 1492992
4741 1492992 3088384 1153024 1474560 2127872 1978368 1720320 886784 1231360 2086400
4732 2086400 1723392 3140608 2427904 1167360 2594816 1261568 847872 1777664 1710592
4723 1710592 2981888 1853440 1556480 2277888 1350144 1854464 2105344 1537536 2068992
4714 2068992 2146816 989184 2012672 2170368 1430016 1524224 1348096 1600512 1544704 1796608
4704 1796608 588800 1924608 1738752 1611776 994816 1614336 1149440 1462784 1291264
4695 1291264 1739264 2402304 1951232 1156608 1078272 1353728 959488 1584128 2499072 1872384
$$ packed form
4760B286080N42720j285120F51776L45600L63008k59584J040896J3312q70912
4751A284096K7648R89184M97152r44640p68000P77216P02464Q0896k27328r25696
4741A492992J595392A153024L21536O53312j49504k58048q33536L44576Q55040
4732B086400l63008J417216p12704A167360J427456A261568m13696R29792o7072
4723A710592J271296j128448k96960P21408r27744N04320K50880n67808N31456
4714B068992P7824I89184J023488J57696p40352R4208j76128K52416n5808K51904
4704A796608E88800J335808j85856j26976o16960O19520m64896L13344j71520
4695A291264M48000O63040m51072p94624p8336K75456l94240O24640R14944o26688
$$ plain form
4685 1872384 2311680 2287616 778240 1158656 3202560 1935360 1402880 2335232 2397184 2990080
4675 2990080 2638848 2544640 2016768 1715200 1526784 2799104 1630720 1755648 2036224
4666 2036224 2057728 1592832 870400 2856448 2015744 2469888 2145792 2711040 1113600
4656 2014208 1387008 2258432 2049536 2263040 1797632 1861632 3422720 2602496 3432960 2789376
4646 2789376 2764288 2691584 2821632 2501120 2595328 2473984 1051648 2328576 2110464 2380288
4636 2380288 2447360 2640896 2173952 1973760 2820608 1564672 2460672 2160640 2032640 2344960
4626 2344960 3368448 1431552 1872896 2424832 2536448 1831936 2198528 2079744 2501632
4617 2501632 2404352 2542080 2301952 1949696 2332672 1421312 2168320 1505792 2841600 1271296
$$ packed form
4685A872384M39296k4064G78240L80416K043904j267200n32480R32352O1952N92896
4675B990080l51232r4208n27872l01568j88416J272320j168384J24928K80576
4666B036224K1504m64896p22432J986048q40704M54144l24096N65248A113600
4656B014208o27200Q71424k08896K13504m65408O4000J561088q20224Q30464o43584
4646B789376k5088p2704J30048l20512R4208j21344A051648J276928k18112K69824
4636B380288O7072J93536m66944k00192Q46848j255936Q96000l00032j28000L12320
4626B344960J023488A431552M41344N51936J11616p04512L66592j18784M21888
4617B501632r7280J37728k40128l52256L82976r11360P47008o62528J335808A271296
$$ plain form
4606 2449408 2891264 2448384 1848832 3132928 2150400 2298368 1377792 1349120 1516544 2403840
4596 2403840 1951744 1333248 1440256 1820672 1727488 1818112 1610752 1923584 2199040 1923584
4586 1923584 1821696 810496 2217984 2592256 2403328 3082240 2572288 1942016 1796608
4577 1796608 2754048 1606656 3113984 2344960 2829824 3098112 3365888 2226688 2160640
4568 2160640 2243072 2291200 1808896 2904576 2494976 2770944 2710528 2342912 2649600 2039296
4558 2039296 2656256 1573376 1660928 2848256 2259968 3010048 2456576 2020352 1642496
4549 1642496 2134528 2270208 2478080 2226688 1732608 2053632 2624000 1960448 2127872 2624512
4539 2624512 1154560 1341440 3272192 1822720 3061248 2877952 3395584 2016256 3006976
$$ packed form
4606B449408M41856m42880n99552J284096r82528J47968r20576k8672J67424Q87296
4596B403840m52096o18496J07008L80416r3184R0624k07360L12832K75456k75456
4586A923584j01888H10496J407488L74272j88928O78912n09952o30272j45408
4577A796608R57440j147392J507328p69024M84864K68288K67776j139200o6048
4568B160640Q2432M8128m82304J095680m09600K75968o0416l67616L06688o10304
4558B039296O16960j082880Q7552J187328n88288P50080n53472m36224l77856
4549A642496M92032J35680K07872k51392m94080L21024N70368o63552J67424M96640
4539B624512A154560J86880J930752j449472J238528j83296N17632j379328R90720
$$ plain form
4530 3006976 3616768 3550208 3149824 2605056 3356160 2852864 2660864 2683392 2031104 2436608
4520 2436608 1463808 2164224 2009088 1222144 1954816 2561536 1824768 1816064 250368 1844224
4510 1844224 2655744 2243584 2578944 1289216 2659328 2644480 2611712 2435584 1390592
4501 1390592 2936320 2615296 2211328 2015232 2310656 2322944 1692160 1622016 2307072 1884672
4491 1884672 1819136 2108928 2355200 1622528 1867264 1484288 2121216 2114560 1784832 2902528
4481 2902528 852992 1823744 2167296 2739200 1911808 2507776 1781248 2091520 2067456 2212864
4471 2212864 1745408 1118208 2262528 1942016 2124288 1857024 1975296 2208768 2204160 1798144
4461 1798144 1613824 2647040 2551296 1583104 2299904 2862080 2010624 1885184 3335168
$$ packed form
4530C006976O09792o6560m00384n44768P51104n03296j92000K2528o52288M05504
4520B436608r72800P00416j55136p86944P32672O06720p36768q704B50368J593856
4510A844224Q11520m12160L35360A289216J370112j4848l2768j76128j044992
4501A390592J545728l21024m03968j96096K95424J2288o30784p0144O85056m22400
4491A884672o5536K89792K46272p32672K44736l82976O36928o656l29728J117696
4481B902528H52992R70752L43552N71904q27392N95968p26528L10272k4064J45408
4471B212864m67456o27200J144320l20512J82272k67264J18272K33472m608m06016
4461A798144j84320J033216r5744r68192P16800N62176q51456j25440J449984
$$ plain form
4452 3335168 2810880 3350528 2479104 1608704 3101696 3212288 3443200 3266048 2750464
4443 2750464 3135488 2689024 2507776 4036096 2732032 3001856 3943424 4201472 3999744
4434 3999744 3593728 3776512 3231232 3027456 3673088 3781120 3986944 3219968 4017152 3519488
4424 3519488 3822592 2808320 2842112 2484224 2622976 3837440 2757120 2534912 2597888
4415 2597888 2351616 3148288 3133952 2768384 2523648 3102208 2819072 2595328 3144704 2192384
4405 2192384 2361344 2916352 2482176 3320832 2950656 2894336 2488320 2952192 1420800 2881024
4395 2881024 2228736 1792000 2907136 2781184 2551296 2822144 1520128 1506816 2171904
4386 2171904 2330624 3013632 3505152 3335168 2802176 3681792 2376192 2313728 1935360 3271680
$$ packed form
4452C335168n24288N39648q71424q70400J492992J10592K30912j77152n15584
4443B750464L85024m46464j81248J528320j304064K69824R41568K58048k01728
4434C999744m06016J82784n45280k03776O45632J08032K05824p66976P97184m97664
4424C519488L03104j014272L3792l57888J38752J214464j080320k22208O2976
4415B597888k46272P96672j4336l65568k44736N78560k83136k23744N49376r52320
4405B192384J68960N55008m34176Q38656l70176n6320m06016M63872A420800J460224
4395B881024o52288m36736J115136j25952k29888K70848j302016j3312O65088
4386B171904J58720O83008M91520j69984n32992Q79616j305600o2464l78368J336320
$$ plain form
4376 3271680 3049984 3572736 3201024 2480640 3746816 2962432 3784704 3802112 4774400 3254784
4366 3254784 3675648 2036736 3378176 3713024 2965504 2735616 2544640 2895360 2984448
4357 2984448 2628608 2624000 3370496 2119168 2557440 2233856 2697728 2711040 2253824 2332160
4347 2332160 1888768 2705408 2706944 2035712 2873344 2913792 3036672 2700800 2251264 3171328
4337 3171328 1976832 2615808 2775040 3284480 2198528 3110400 3189248 2830336 1665024
4328 1665024 2825216 2640384 1996800 2299392 2716672 2703872 3298816 3548160 3914752 3719168
4318 3719168 3082240 3888640 3113984 3236352 3798016 4398080 3791360 3505152 2873856 1468416
4308 1468416 1769472 2258944 3036672 1476096 2623488 2838528 2956288 1497088 2515968
$$ packed form
4376C271680k21696N22752l71712p20384J266176p84384Q22272J7408R72288j519616
4366C254784M20864j638912J341440L34848p47520k29888j90976L50720Q9088
4357B984448l55840m608P46496j251328M38272l23584M63872J3312m57216P8336
4347B332160m43392Q16640J536o71232Q37632M0448J22880l35872m49536R20064
4337C171328j194496O38976J59232N09440j085952R11872P8848l58912j165312
4328A665024J160192j84832o43584L02592M17280j2800N94944K49344L66592j95584
4318C719168o36928Q06400p74656J22368N61664O00064o06720k86208o31296j405440
4308A468416L01056M89472P77728A476096J147392K15040J17760j459200J018880
$$ plain form
4299 2515968 3059712 2849792 2139136 3177984 2780672 2406912 3254272 3906560 2653696
4290 2653696 2926080 2247680 2361856 3052544 2229248 1899008 2338304 3387904 3309056 2857472
4280 2857472 2106368 2521600 2636800 2929664 3339776 2348544 3943936 3561984 3319296
4271 3319296 3915776 3216384 2141696 4378624 2741248 3528704 4372992 1987584 2127872
4262 2127872 2607616 2966528 3146752 2152448 2350592 1903104 2985472 1964032 3661312
4253 3661312 2469888 3287040 2219008 2599424 1871872 2514432 2359296 2077696 2412032
4244 2412032 2529792 2598400 1916928 3112448 2248704 2296320 2677760 2668032 3310080 2665472
4234 2665472 3698688 2837504 1714176 1879040 2485760 2299392 2409472 2282496 2697216
$$ packed form
4299B515968N43744k09920p10656J038848l97312l73760Q47360O52288j252864
4290B653696K72384o78400J14176O90688q23296l30240M39296J049600p8848m51584
4280B857472p51104M15232J15200K92864M10112r91232J595392l81952k42688
4271C319296N96480o99392j074688K236928j637376P87456Q44288A987584J40288
4262B127872M79744L58912J80224r94304J98144m47488J082368j021440J697280
4253C661312j191424Q17152j068032L80416p27552O42560j55136k81600L34336
4244B412032J17760O8608o81472J195520q63744M7616L81440r728O42048o44608
4234B665472J033216q61184j123328J64864O06720j86368J10080j26976M14720
$$ plain form
4225 2697216 3245056 3005440 2501120 3261952 2106880 3284480 2805248 1842688 1758208
4216 1758208 2909184 3150336 1284608 3287552 3711488 2784256 2548736 2860032 1679872
4207 1679872 2831872 1987584 1813504 2699264 3361280 2876928 1807360 3142656 2141696
4198 2141696 3249152 2176512 1587200 2241536 2272768 2978304 3166720 2755072 2068992
4189 2068992 3693568 2655232 1720832 2027008 1944064 2014720 2267648 3303936 3655680
4180 3655680 3798528 3016704 2888192 2619904 3144192 3786752 3409920 2639360 2802688 1887232
4170 1887232 3142656 3299840 1723904 1872896 2732032 2882048 3059200 1986560 3403776
4161 3403776 3604992 2801664 2662912 3709440 2852352 3603968 2597376 3875840 2477568
$$ packed form
4225B697216N47840k39616n04320P60832j155072J177600m79232r62560q4480
4216A758208J150976K41152A284608K002944M23936r27232k35520L11296j180160
4207A679872J152000q44288j74080Q85760O62016m84352j069568J335296j000960
4198B141696J107456j072640n89312O54336L1232P05536J88416m11648o86080
4189B068992J624576j038336r34400L06176q2944P0656K52928J036288L51744
4180C655680J42848p81824j28512k68288N24288O42560l76832p70560J63328r15456
4170A887232J255424J57184j575936J48992Q59136J50016J77152j072640J417216
4161C403776K01216q03328j38752J046528q57088P51616j006592J278464j398272
$$ plain form
4152 2477568 3403776 3300864 3414016 2624000 2850816 3793920 3737600 3905536 2171904 3274240
4142 3274240 2754048 3071488 3799552 4557312 3017728 2893824 4147200 4143616 3897856 4897280
4132 4897280 3432960 5750272 4232704 3894272 4213760 3448320 4287488 4114432 3877376
4123 3877376 3549696 3567616 3782144 4144640 3721216 3691008 4692480 4398592 4742656 3784704
4113 3784704 3405824 3476992 4497920 4339712 5050880 5198336 4682240 4182528 3810304 3142144
4103 3142144 3271680 3522560 4023808 4006400 3964928 3106816 4852224 6404608 4632576
4094 4632576 4247040 3713024 3719680 4078080 4207616 3429888 2779648 3978240 3960320 4133376
4084 4133376 4190720 3786752 3811328 4111872 4164096 3988480 3236864 4000256 3587072 4025856
$$ packed form
4152B477568R26208j02912J13152p90016K26816R43104n6320J67936j733632J102336
4142C274240n20192L17440P28064P57760j539584j23904J253376l584k45760R99424
4132D897280j464320K317312j517568l38432L19488p65440Q39168j73056k37056
4123C877376l27680J7920K14528L62496m23424l0208J001472k93888L44064r57952
4113C784704l78880P1168J020928j58208P11168J47456n16096m99712l72224o68160
4103C142144J29536K50880N01248j7408m1472q58112J745408J552384j772032
4094D632576l85536n34016O656L58400J29536p77728o50240J198592j7920J73056
4084D133376N7344m03968K4576L00544N2224j75616p51616P63392m13184M38784
$$ plain form
4074 4025856 3448320 3263488 1929728 3513856 2583552 3241984 3357696 4596736 2904064
4065 2904064 3191296 3565568 4573696 2658816 3682816 2865664 3600384 2135552 3763712
4056 3763712 3863552 3598848 4112896 3996672 3364864 2437632 3208192 3938816 3458560 3221504
4046 3221504 3525632 3948032 2933248 2000896 3570176 4075520 3148288 3018240 3240448
4037 3240448 3348480 3162624 2647552 2945024 2899456 3773440 3033088 3818496 3427328 3651584
4027 3651584 4110848 3489280 3135488 4525568 3336704 3931136 3138560 4846592 4103680
4018 4103680 4144640 3822080 4594688 3467776 4178944 3500544 3948032 4015104 3853824 3340800
4008 3340800 3071488 3311616 3575808 3214848 4046336 2893824 3624960 3994112 2866176
$$ packed form
4074D025856n77536j84832j333760J584128r30304O58432J15712J239040j692672
4065B904064K87232L74272J008128j914880J024000q17152P34720j464832J628160
4056C763712R9840k64704N14048j16224o31808r27232P70560P30624m80256k37056
4046C221504L04128M22400j014784r32352J569280N05344r27232j30048K22208
4037C240448J08032j85856n15072K97472m5568Q73984p40352P85408l91168K24256
4027C651584M59264o21568l53792J390080j188864N94432p92576J708032p42912
4018D103680M0960l22560P72608j126912P11168o78400M47488O7072j61280n13024
4008C340800k69312K40128K64192l60960Q31488j152512P31136L69152j127936
$$ plain form
3999 2866176 2926080 3956224 2845696 3523072 3461632 2123264 2015232 2809344 2673664
3990 2673664 2466304 2744832 3314688 3921920 2471936 2760704 3521536 3768320 2786304
3981 2786304 4288000 2648064 3842560 3567616 2816512 2884608 2406912 3569152 2811392
3972 2811392 2845184 2956288 2831360 3207680 3359232 3235840 3135488 3140608 3336192 3378688
3962 3378688 2449920 2954752 3142144 3513344 3420160 3846144 3287552 3709952 3123712 2906112
3952 2906112 3233792 3173376 3224064 3244032 3059712 4183040 4255232 3833856 3356672 3457024
3942 3457024 2590720 3194368 3694080 3076608 3882496 3686400 4052992 4063232 3479040 3551232
3932 3551232 4333568 4169216 2982912 4337152 4631040 4488704 4567040 4490752 4182528 3265024
$$ packed form
3999B866176N9904J030144j110528O77376o1440j338368j08032P94112j35680
3990B673664k07360K78528N69856O07232j449984K88768P60832K46784r82016
3981B786304J501696j639936J194496k74944p51104O8096m77696J162240p57760
3972B811392L3792J11104j24928L76320J51552j23392j00352N120J95584M2496
3962C378688r28768N04832J87392L71200r3184M25984n58592M22400n86240k17600
3952B906112L27680o0416N0688J9968j84320J123328P2192m21376m77184J00352
3942C457024q66304O03648M99712o17472Q05888j96096L66592J0240n84192P2192
3932C551232P82336j64352j186304J354240K93888j42336P8336p6288l08224r17504
$$ plain form
3922 3265024 4503040 5136384 5596160 4664832 5414400 5405184 5259776 5645824 7041024 5507584
3912 5507584 5480960 5471744 7203328 6076928 5373952 6891520 5489152 6531072 7000576
3903 7000576 6532096 6587392 6388224 7515648 7079936 6876160 7376384 5936128 7174144
3894 7174144 7542784 7047168 7124480 7612416 6379520 6951424 6782976 7570432 7467008 7041024
3884 7041024 8023552 8652288 8252928 8286720 8454144 7917568 9353216 9893376 8270336
3875 8270336 9513984 9085440 9579008 9845248 9330688 9906176 10316288 10392576 10847232 9683968
3865 9683968 9648128 11061760 12063744 10902016 11606016 11338240 12604416 11738624 12992000
3856 12992000 12128256 14607360 15694336 15656448 17244160 14395904 14818304 14442496 12313088
$$ packed form
3922C265024J238016O33344M59776r31328P49568r216j45408L86048J395200j533440
3912E507584k6624r216J731584j126400p02976J517568j402368J041920M69504
3903G000576m68480N5296j99168J127424m35712k03776N00224j440256J238016
3894G174144L68640m95616P7312M87936j232896N71904j68448P87456j03424m25984
3884G041024R82528O28736l99360L3792J67424n36576J435648N40160j623040
3875H270336J243648m28544M93568K66240n14560N75488M10112P6288M54656j163264
3865I683968l5840J413632J001984j161728P04000k67776J266176q65792J253376
3856A2992000q63744K479104J086976l7888J587712k848256M22400l75808k129408
$$ plain form
3847 12313088 10715648 9532416 7738368 6641152 6416384 5599232 5326336 5445120 5603840
3838 5603840 4797440 4927488 3929600 4748288 4353024 4370432 5121536 4379648 4355584 4386304
3828 4386304 4506624 5166080 3751936 3985408 4276736 5033472 3554304 4811776 5538304
3819 5538304 4661760 3734528 5519360 4041728 3534336 4920832 4091904 3086848 3227648
3810 3227648 3670528 3069440 4289024 4630528 3735552 3521536 4542976 3672064 3763200
3801 3763200 4284928 4422656 4140544 4151808 4272128 5314560 4624896 4013056 4877312 3533312
3791 3533312 2945536 5084672 4101120 3666944 5126144 4837376 3926528 4941312 5220864
3782 5220864 4428800 4227072 3961856 4335104 4562944 4909056 4049920 4944384 4383232 4611584
$$ packed form
3847A2313088j597440j183232j794048j097216k24768q17152k72896J18784J58720
3838E603840q06400J30048r97888Q18688l95264J7408P51104p41888k4064L0720
3828D386304J20320O59456j414144K33472K91328P56736j479168J257472P26528
3819E538304q76544r27232J784832j477632n07392J386496q28928j005056J40800
3810C227648M42880o01088J219584L41504q94976k14016J021440q70912R1136
3801C763200N21728J37728k82112J1264J20320J042432o89664o11840Q64256j344000
3791C533312n87776K139136r83552m34176J459200k88768r10848J014784K79552
3782E220864p92064k01728k65216L73248K27840L46112q59136Q94464n61152K28352
$$ plain form
3772 4611584 5029376 5063680 3836928 3033088 4956160 4178432 4829184 4741632 4779520 4527616
3762 4527616 4343808 4785664 4179968 4356096 4974080 4904960 4746240 4920320 4541952 4717056
3752 4717056 4336640 4767744 4073984 4379648 3998720 3783680 4798976 4100096 4971008
3743 4971008 3829248 5304320 4373504 3940352 4683264 5222912 4498432 4696576 4418560
3734 4418560 5340160 5078016 3916800 3692544 4883456 5313024 3693056 4011008 4346880
3725 4346880 4834304 4200960 4492288 5693952 4729856 4237824 4915712 4961792 4334080 4679680
3715 4679680 4987904 4125696 5756416 5161472 5053440 5680128 4769792 5141504 5896704
3706 5896704 5035008 4174336 3888640 5739008 4350464 4780032 4189184 5757952 4923904
$$ packed form
3772D611584M17792L4304j226752q03840J923072p77728O50752q7552L7888k51904
3762D527616j83808M41856o05696J76128O17984o9120j58720J74080l78368J75104
3752D717056l80416M31104o93760L05664l80928k15040J015296o98880Q70912
3743D971008j141760J475072r30816m33152P42912N39648p24480J98144k78016
3734D418560R21600k62144j161216k24256J190912M29568j619968L17952L35872
3725D346880M87424o33344K91328J201664r64096m92032O77888M6080o27712L45600
3715D679680L08224q62208J630720n94944j08032O26688r10336L71712P55200
3706E896704q61696q60672k85696J850368j388544M29568n90848J568768q34048
$$ plain form
3697 4923904 5280256 4910592 5328384 5169152 5749248 5358080 5468160 5919744 5268480 4943872
3687 4943872 5827584 4945920 4536832 5269504 6439936 5902848 5910528 6046720 5390848 5641216
3677 5641216 5044736 6729728 5632000 4967936 5723136 5901824 7299072 6910464 6710784
3668 6710784 6324224 6247424 6818304 5456384 5807104 6057472 6114304 4997632 3951616
3659 3951616 4595200 5272576 5116928 5394432 6515200 6338048 7244288 7008256 6999040 7404544
3649 7404544 7347200 7874048 7456768 8436736 8945664 8460288 9776128 9003008 7707136
3640 7707136 8773632 9829888 8957952 9985536 10106368 9592832 9956864 10265600 11220992
3631 11220992 10212864 11329536 11128320 11590144 12039168 13514240 13886976 13918720 14327296
$$ packed form
3697D923904L56352l69664M17792j59232N80096l91168J10080M51584o51264l24608
3687D943872Q83712q81664m09088P32672J170432n37088P680J36192o55872K50368
3677E641216n96480J684992j097728o64064P55200J78688J397248l88608j99680
3668F710784l86560p6800N70880j361920L50720K50368N6832j116672j046016
3659C951616O43584O77376j55648K77504J120768j77152R06240k36032r216M05504
3649G404544n7344N26848m17280R79968N08928m85376J315840p73120j295872
3640G707136J066496J056256q71936J027584J20832n13536L64032L08736R55392
3631A1220992j008128J116672k01216M61824M49024J475072L72736L1744M08576
$$ plain form
3622 14327296 16202240 16138752 16730624 17503232 18152448 18277376 19365888 19085824 19232256
3613 19232256 19448320 21947904 22382592 23112192 23029760 23797248 23448064 25464832 24800768
3604 24800768 25886720 26509824 27334656 28896256 28444672 29528064 29807616 31698944 32374272
3595 32374272 34577920 35899392 37811200 37712896 35356160 33757696 30665728 25467392
3587 25467392 21643776 18635776 15577600 14637056 13651968 12560896 11990016 11875840 11795456
3578 11795456 11332608 10309632 10294784 10544640 10777088 10194944 10637824 10439680 10404352 10097152
3568 10097152 9721344 8974848 9470464 9044992 9165312 10542080 9568256 9097216 9732608
3559 9732608 11002880 10052608 10571264 10311168 8805376 8484352 8282624 8618496 8024576
$$ packed form
3622A4327296J874944o3488N91872P72608O49216J24928J088512k80064J46432
3613A9232256K16064K499584M34688P29600q2432P67488l49184K016768o64064
3604B4800768J085952O23104Q24832J561600m51584J083392K79552J891328O75328
3595C2374272K203648J321472J911808r8304k356736j598464l091968n198336
3587B5467392l823616l008000l058176r40544r85088j091072n70880j14176q0384
3578A1795456m62848j022976j4848K49856K32448n82144M42880j98144l5328l07200
3568A0097152l75808p46496M95616m25472J20320J376768r73824m71040O35392
3559I732608J270272r50272N18656k60096j505792l21024k01728L35872n93920
$$ plain form
3550 8024576 7714304 7387136 7671296 8010240 7562240 8922112 7513088 7296512 8017920
3541 8017920 7575040 7740416 8358912 7777792 7407104 7434752 8467968 7789568 7435776 7756800
3531 7756800 7789056 9007104 7878656 8647680 8951808 7459840 8675328 8204288 8252416
3522 8252416 8391168 8280064 8269312 8211968 8720384 7835136 7956992 7810048 7836160 7942656
3512 7942656 8071680 8280576 8830464 8415744 8229888 7629312 7156224 7950848 7989248 9034240
3502 9034240 9209344 9186816 8370688 10021888 7746048 8729088 8911360 7482368 9130496
3493 9130496 8859648 8142848 8594432 9048064 8565760 8716288 9178624 7909888 8370688
3484 8370688 8544768 9344512 9300992 9125376 8741888 9184768 9087488 8876544 8951296 9457152
$$ packed form
3550H024576l10272l27168K84160L38944m48000J359872j409024k16576P21408
3541H017920m42880J65376O18496n81120l70688K7648J033216o78400l53792L21024
3531G756800L2256J218048j128448P69024L04128j491968J215488m71040M8128
3522H252416J38752j11104j0752n7344N08416q85248J21856j46944K6112J06496
3512G942656J29024K08896N49888m14720j85856o00576m73088P94624L8400J044992
3502I034240J75104k2528q16128J651200k275840R83040J82272j428992J648128
3493I130496k70848p16800M51584M53632m82304J50528M62336j268736M60800
3484H370688J74080P99744m3520j75616l83488M42880r7280k10944P4752N05856
$$ plain form
3474 9457152 10021376 9294336 9695232 9242624 10171392 9897472 10342912 9764352 10202112 10013696
3464 10013696 11218944 10623488 11185152 11571200 10738176 11876352 11606016 11071488 10802176
3455 10802176 12261376 12082688 12230656 12292608 11460608 12079616 11591680 11639296 11494400 11172864
3445 11172864 12371456 11431936 11882496 11319296 12355072 13331968 13239296 12680192 13158400
3436 13158400 12471808 13448192 12904448 13750272 13898752 13389824 14426112 14246400 13884928
3427 13884928 13841920 13716992 15686144 15476736 15623168 15033856 16159744 15145472 16541696
3418 16541696 15960576 17187840 17126912 18415104 17311232 16927744 17678336 16673792 16200704
3409 16200704 15503360 16955904 16069120 16302080 16461312 16745984 16779776 17857536 17287680
$$ packed form
3474I457152N64224p27040M00896m52608R28768k73920M45440n78560M37760j88416
3464A0013696J205248n95456N61664L86048q33024J138176k70336n34528k69312
3455A0802176J459200j78688J47968O1952q32000O19008m87936M7616j44896l21536
3445A1172864J198592r39520M50560n63200J035776R76896r2672n59104M78208
3436A3158400o86592R76384n43744Q45824J48480n08928J036288j79712l61472
3427A3884928m3008j24928J969152k09408J46432n89312J125888j014272J396224
3418A6541696n81120J227264o0928J288192j103872l83488P50592j004544m73088
3409A6200704o97344J452544q86784K32960J59232K84672L3792J077760n69856
$$ plain form
3400 17287680 17745408 18065408 17506304 18266624 18461696 19224576 20464128 20663808 21210112
3391 21210112 22352896 22166528 22637056 23960576 24599040 25558016 27031552 27761664 28232704
3382 28232704 28525568 30236160 31732224 32140800 34320384 35512832 36274176 39590400 40224768
3373 40224768 42534912 44622848 45666304 48032256 51136000 53710848 56390144 59151872
3365 59151872 64050176 68114944 71662080 76698624 82515456 89079808 96300544 104696320
3357 104696320 113236480 121033728 130138624 138684416 149378048 158850048 172077568 182173184
3349 182173184 194801664 208333824 224494592 242926592 262329856 287769600 315665920
3342 315665920 352953856 396957696 454064128 528506368 635412480 777216512 958267392
$$ packed form
3400A7287680M57728L20000n59104P60320J95072P62880J239552J99680N46304
3391B1210112J142784j86368M70528J323520O38464R58976J473536P30112M71040
3382B8232704K92864J710592J496064M08576K179584J192448P61344L316224O34368
3373D0224768K310144K087936J043456K365952L103744K574848K679296K761728
3365E9151872M898304M064768L547136N036544N816832O564352P220736Q395776
3357A04696320Q540160P797248R104896Q545792J0693632R472000J3227520J0095616
3349A82173184J2628480J3532160J6160768J8432000J9403264K5439744K7896320
3342C15665920L7287936M4003840N7106432P4442240J06906112J41804032J81050880
$$ plain form
3335 958267392 1163035648 1340086784 1414818816 1330667520 1120777216 878782976 670820864
3328 670820864 509249024 391130112 303932928 238409216 192558080 158308864 133735936
3321 133735936 114908672 99624960 89347072 79975936 73146880 66644480 61572608 56544256
3313 56544256 51913728 48341504 46639104 43427840 39643136 38913024 36164608 35611136
3305 35611136 33193472 32417792 32133120 30575104 28966400 28040192 27188224 26654720 26007552
3296 26007552 24901120 23696384 22519296 22924800 21864960 21412864 20046336 19957248 20135936
3287 20135936 19494912 19274240 18354176 18787328 18421760 18466816 18302976 17774592 16697344
3278 16697344 16743936 16172544 15911424 15986688 16010752 15745024 15533056 13828096 13724160 14985728
$$ packed form
3335I58267392K04768256J77051136P4732032q4151296k09890304k41994240k07962112
3328F70820864j61571840j18118912q7197184o5523712m5851136l4249216k4572928
3321A33735936j8827264j5283712j0277888r371136o829056o502400n071872n028352
3313E6544256m630528l572224j702400l211264l784704p30112k748416n53472
3305C5611136k417664p75680k84672j558016j608704r26208q51968n33504o47168
3296B6007552j106432j204736j177088M05504j059840m52096j366528q9088J78688
3287B0135936o41024k20672r20064M33152l65568M5056j63840n28384j077248
3278A6697344M6592n71392k61120P5264K4064k65728k11968j704960j03936J261568
$$ plain form
3268 14985728 13501440 12492800 11654144 12073472 11337216 11925504 11650048 11231744 11443200
3259 11443200 10518016 9405952 8317440 8250880 8723968 7431168 7270912 6668800 5748224
3250 5748224 6581248 6145536 7032320 7196160 6508032 6434304 5804544 5527040 6646272 5741568
3240 5741568 7078912 6011904 5466112 5702656 6093312 5529600 5445632 6473216 6098944
3231 6098944 5536256 6658560 6802432 4992512 4957184 5989376 5084672 6758400 4882944
3222 4882944 4949504 5798912 4242944 4751872 4844544 4296704 4900352 3955712 3793920 4447232
3212 4447232 4386304 3868672 4593152 4941312 4729856 4121600 4551680 4966912 3434496 4390912
3202 4390912 4676096 4503040 4665856 4337664 4182528 5062144 4882432 4281856 5905920
$$ packed form
3268A4985728j484288j008640q38656M19328p36256N88288k75456m18304K11456
3259A1443200r25184j112064j088512o6560M73088j292800j60256o02112r20576
3250E748224Q33024m35712Q86784J63840o88128p3728o29760k77504J119232r04704
3240E741568J337344j067008n45792K36544L90656n63712q3968J027584l74272
3231F098944n62688J122304J43872j809920l5328J032192r04704J673728j875456
3222D882944O6560Q49408j555968N08928R2672n47840O03648r44640j61792O53312
3212D447232o0928n17632P24480L48160k11456o08256M30080M15232j532416R56416
3202D390912K85184j73056J62816l28192j55136Q79616j79712o00576J624064
$$ plain form
3193 5905920 4561920 4136448 5345792 4461056 4617728 4239360 4235776 4255744 4150272 4721664
3183 4721664 4686336 4319744 4732928 4659712 4863488 4584960 4419584 5527040 4819968 4327424
3173 4327424 5600256 5238272 5725696 5217792 4441088 5285888 4599296 6103552 5263872
3164 5263872 4483072 4491776 4163584 4813312 5129728 4580864 4728320 4603904 5030912 6579200
3154 6579200 5511680 5711872 5788160 5536768 6400512 6635520 7588864 8548864 8093184 10373120
3144 10373120 10047488 10928128 12706816 13486080 13619200 13365760 13769728 12485120 11594752
3135 11594752 11296768 10716672 11358208 12045312 11677184 11587584 12258304 10237952 11072512
3126 11072512 11847168 12602880 12805632 13522944 12223488 12205568 13024768 13567488 12484096
$$ packed form
3193E905920j344000m25472J209344q84736J56672l78368l584J9968j05472N71392
3183D721664l5328l66592M13184p3216K03776k78528j65376J107456p07072m92544
3173D327424J272832l61984M87424n07904p76704Q44800o86592J504256q39680
3164E263872p80800Q704l28192O49728L16416n48864J47456j24416M27008J548288
3154F579200j067520K00192P6288k51392Q63744K35008R53344R60000m55680K279936
3144A0373120l25632Q80640J778688P79264J33120k53440M03968j284608q90368
3135A1594752k97984n80096O41536O87104l68128q9600O70720k020352Q34560
3126A1072512P74656P55712K02752P17312j299456j7920Q19200N42720j083392
$$ plain form
3117 12484096 12331008 14080000 12919296 14451712 14194688 15222272 14988800 14955520 15160832
3108 15160832 15880192 16300032 15879680 16347648 18572288 17972224 17382912 19250688 20794368
3099 20794368 20497408 22167552 23698432 23488512 23522816 25074176 26383872 25850880 26509312
3090 26509312 27975168 27522560 27983360 27426816 29044736 29887488 29781504 31264256 31107584
3081 31107584 31561728 33420288 32894464 34408448 35514880 35779584 36964352 37959168 36765184
3072 36765184 35015680 30742016 27576832 23396352 20970496 17996288 15458304 14351872
3064 14351872 13392384 11162112 12092416 11926016 10508288 11748864 11369472 11095552 10109440
3055 10109440 10295808 9853440 9947648 9573888 9674752 10098176 10270208 9187328 8118272
$$ packed form
3117A2484096j53088J748992j160704J532416k57024J027584k33472l3280K05312
3108A5160832P19360M19840m20352M67968K224640o00064n89312J867776J543680
3099B0794368k96960J670144J530880k09920L4304J551360J309696n32992O58432
3090B6509312J465856m52608M60800n56544J617920Q42752j05984J482752j56672
3081C1107584M54144J858560n25824J513984J106432K64704J184768R94816j193984
3072C6765184j749504m273664l165184m180480k425856k974208k537984j106432
3064A4351872r59488k230272R30304j66400j417728J240576l79392k73920r86112
3055A0109440J86368m42368R4208l73760J00864M23424J72032j082880j069056
$$ plain form
3046 8118272 8444416 8313344 6715904 6602752 7048704 6499840 6478848 7351296 5875712
3037 5875712 6391808 5415936 6144512 6560768 5429760 5416448 5527040 5866496 5587968 5052416
3027 5052416 5046272 6421504 5922816 5385216 4942848 6038016 5456896 5353472 6372864
3018 6372864 5488128 6179840 5737472 4601344 6156288 5674496 6108160 5710848 5871104
3009 5871104 5557760 7285760 6788608 6399488 7253504 4564992 5393408 4593664 4448768
3000 4448768 4071936 4118528 3971584 4160000 4728320 4182016 3482112 4107264 3858432 4680704
2990 4680704 3993088 4273152 3540480 4064256 4851200 4796928 5026304 4055552 5266944 4471296
2980 4471296 4823040 4687360 4454400 5515776 4618240 4845568 4350464 5582848 5764096
$$ packed form
3046H118272L26144j31072j597440j13152M45952n48864k0992Q72448j475584
3037E875712N16096r75872P28576M16256j131008j3312J10592L39456k78528n35552
3027E052416o144J375232m98688n37600m42368J095168n81120j03424J019392
3018F372864q84736O91712m42368j136128J554944m81792M33664l97312J60256
3009E871104l13344J728000m97152l89120Q54016k688512Q28416p99744j44896
3000D448768l76832M6592j46944J88416N68320n46304o99904O25152k48832Q22272
2990D680704o87616K80064p32672N23776P86944n4272K29376r70752J211392p95648
2980D471296L51744j35680k32960J061376q97536K27328m95104J232384J81248
$$ plain form
2971 5764096 5101568 6034944 4508160 4308480 4402688 4466688 4503552 4645888 4755968 5578240
2961 5578240 4060160 4638208 4079616 5399040 4884992 3940352 4908032 4153856 4770816
2952 4770816 3711488 4854272 4340736 3926528 3914752 4609536 3449856 4353536 2893824
2943 2893824 3073024 4338176 4275200 4335616 3566080 4641280 3492352 4111360 4775936
2934 4775936 5263360 4935680 5712896 4556800 5357056 4706816 4940288 5898752 6191616
2925 6191616 5938688 6297088 6844416 7603200 7591424 7987712 8761344 9850368 10682368 13164032
2915 13164032 15971840 20639232 24725504 22920192 20071424 20577280 19085824 11832832
2907 11832832 7909376 7136256 5324288 5197824 5173248 4391424 4661760 4567552 4635648 5332480
$$ packed form
2971E764096o62528R33376j526784j99680R4208O4000L6864J42336J10080Q22272
2961E578240j518080N78048n58592J319424n14048r44640R67680p54176O16960
2952D770816j059328J142784n13536m14208j1776O94784j159680R03680j459712
2943B893824J79200J265152o2976O0416p69536J075200j148928O19008O64576
2934D775936M87424l27680P77216j156096Q00256o50240K33472R58464K92864
2925F191616k52928L58400N47328P58784j1776L96288P73632J089024Q32000K481664
2915A3164032K807808M667392M086272j805312k848768N05856j491456p252992
2907A1832832l923456p73120j811968j26464k4576p81824K70336r4208O8096O96832
$$ plain form
2897 5332480 4554240 4764672 4901888 4723712 4920832 4149760 3982848 4205568 4088320 4803584
2887 4803584 3658240 4526592 4407808 3842560 4369408 3542528 4317696 5236224 4942336
2878 4942336 5674496 5217280 6168576 5651456 6285824 6511104 5442560 5563904 5210624
2869 5210624 5239808 5511168 5520896 4637696 5394432 5664256 5145088 5692928 4996608 5245440
2859 5245440 4378112 4854272 5716992 5694976 5551104 5563392 6588928 5481472 4514816 5022208
2849 5022208 6014464 5475840 5658624 5730816 6123520 6573056 5358592 6000640 5612032 5730816
2839 5730816 6717440 6243840 5700608 7482368 6864384 6658048 6429184 5930496 6664704
2830 6664704 6256128 4786688 5775360 6681600 7439360 6357504 6446080 7299072 7763968
$$ packed form
2897E332480p78240K10432J37216j78176J97120p71072j66912K22720j17248P15264
2887D803584j145344Q68352j18784n65248N26848q26880P75168R18528k93888
2878D942336P32160m57216R51296n17120O34368K25280j068544J21344l53280
2869E210624K9184K71360R728q83200P56736K69824n19168N47840o96320K48832
2859E245440q67328M76160Q62720k2016j43872J2288J025536j107456r66656N07392
2849E022208R92256n38624J82784P2192L92704M49536j214464O42048l88608J18784
2839E730816R86624m73600n43232J781760o17984k06336k28864m98688P34208
2830F664704m08576j469440R88672R06240P57760j081856Q8576Q52992M64896
$$ plain form
2821 7763968 7553024 8773120 8549376 8656896 10143744 11296256 11621376 13053440 12573184
2812 12573184 11693568 11630592 10229248 9644032 8932864 7697920 7009792 7427584 6339584
2803 6339584 5625344 6146048 5638656 5109248 6630400 4883968 4622848 4710912 6390272
2794 6390272 5721088 5004800 5257216 5344256 4861440 4957696 5244416 5840384 5591040 4449792
2784 4449792 5384704 4918784 4956160 4172800 3951104 4469248 4699648 4082176 4959232 4001280
2774 4001280 3894784 5158400 4695552 4645888 4727808 4552192 5495296 4073984 4124672 3670528
2764 3670528 4688896 4576256 4880384 4681216 4642816 4495872 4532224 4043776 3913728 4858368
2754 4858368 4340224 4973568 5187584 5007360 4713984 4297728 4157440 4321280 5483008
$$ packed form
2821G763968k10944J220096k23744J07520J486848J152512L25120J432064m80256
2812A2573184q79616o2976j401344n85216p11168j234944o88128M17792j088000
2803F339584p14240N20704n07392n29408J521152j746432k61120Q8064J679360
2794F390272o69184p16288K52416Q7040m82816R6256K86720N95968k49344j141248
2784D449792R34912m65920L7376p83360k21696N18144K30400o17472Q77056r57952
2774D001280j06496J263616m62848m9664Q1920j75616R43104j421312N0688m54144
2764C670528J018368j12640L04128j99168l8400j46944L6352m88448j30048R44640
2754D858368n18144O33344K14016j80224k93376m16256j40288J63840J161728
$$ plain form
2745 5483008 5075456 5228544 6173696 4612608 4132864 4865536 3586560 3679744 3938304
2736 3938304 4859392 4101632 4084224 4269056 3827200 4546048 4765184 4952064 4871168 4332544
2726 4332544 3898368 4874240 4093440 4426240 4946432 4127232 5100032 5359104 4538368 5636096
2716 5636096 5503488 5352960 4819968 3470848 5053440 3495936 5287424 6003200 4472320
2707 4472320 5797888 5901312 6852096 6245376 6678016 6343168 6596608 8249856 9378816
2698 9378816 10151936 15256064 21044224 25905664 33514496 29931520 17006592 11325440
2690 11325440 8299008 7336960 6275584 5270528 4282880 3879936 4128256 4015616 3780096
2681 3780096 3258368 3957760 4012032 3600384 3243520 2471936 4049408 3735552 4317184 3273728
$$ packed form
2745E483008m07552J53088R45152j561088m79744P32672j278976R3184K58560
2736C938304R21088p57760j7408J84832m41856P18848K19136J86880q0896n38624
2726D332544m34176R75872p80800L32800N20192q19200R72800K59072q20736J097728
2716E636096j32608j50528n32992j349120J582592j557504J791488P15776j530880
2707D472320J325568J03424R50784o06720M32640l34848K53440J653248J128960
2698I378816P73120N104128N788160M861440P608832l582976j2924928n681152
2690A1325440l026432r62048j061376j005056r87648m02944K48320j12640k35520
2681C780096n21728O99392N4272m11648l56864p71584J577472l13856N81632j043456
$$ plain form
2671 3273728 4311552 4213248 4229120 4206592 4195840 3890688 3186688 3333120 2260480 4046336
2661 4046336 3462144 3329536 3773952 3312128 3964416 4300288 4623872 5114368 4620800 4608000
2651 4608000 3384832 3259392 3179520 3432448 4018688 3188224 2817024 3885568 3352576
2642 3352576 4785152 4018688 3113472 3806720 3591168 3944448 3935232 3624448 3707904 4753920
2632 4753920 4048896 4560896 3926016 3830272 4625408 4847104 5040640 4421120 5716480 5254656
2622 5254656 6011392 5182976 6537216 5663744 5161472 6561280 6834176 7489024 7090176
2613 7090176 8088576 8947200 10616832 10669568 13046272 16276992 22842880 30780928 38626816
2604 38626816 49400832 40381440 26155008 18963456 15451136 14728704 16553472 19447296
$$ packed form
2671C273728J037824r8304J5872k2528j0752l05152p04000J46432j072640J785856
2661D046336n84192j32608M44416m61824O52288L35872L23584M90496m93568j2800
2651D608000j223168j25440p9872K52928N86240q30464l71200J068544n32992
2642C352576J432576p66464r05216O93248k15552L53280r216l10784Q3456J046016
2632D753920p05024N12000o34880r5744P95136K21696J93536o19520J295360m61824
2622E254656P56736q28416J354240q73472n02272J399808K72896O54848l98848
2613G090176R98400Q58624J669632N2736K376704L230720O565888P938048P845888
2604C8626816J0774016r019392j4226432p191552l512320p22432J824768K893824
$$ plain form
2596 19447296 23083008 29056512 33200640 24324608 17556992 16251392 16228352 18426368
2588 18426368 24050688 30291456 35686400 43140096 29581312 19604992 15558656 13464064
2580 13464064 15469056 18421248 21127168 25629184 29818880 20513280 13688320 10285568
2572 10285568 9598464 10087424 11333632 11478528 13890560 16359936 12303872 7824896 6987776
2563 6987776 5271552 5357056 4103680 4981248 5815296 5314560 4704768 4943360 4611584
2554 4611584 4593664 4859904 6001152 5066240 5598208 5743616 5050368 5956608 6032384 6432256
2544 6432256 6725632 6059520 5621248 5131264 4851200 3947520 5159936 5074432 4559360 4429824
2534 4429824 4539904 4238848 2881024 3609088 3743232 2704896 2907136 2811904 3074048
$$ packed form
2596A9447296L635712N973504M144128q876032o767616j305600k3040K198016
2588A8426368N624320O240768N394944P453696j3558784r976320m046336k094592
2580A3464064K004992K952192K705920M502016M189696r305600o824960l402752
2572A0285568o87104M88960J246208J44896K412032K469376m056064m478976q37120
2563F987776j716224Q5504j253376Q77568Q34048n00736o09792K38592l31776
2554D611584j7920K66240J141248r34912N31968J45408o93248R06240P5776L99872
2544F432256K93376o66112m38272m89984k80064r03680J212416q5504n15072j29536
2534D429824J10080l01056j357824P28064J34144j038336K02240r5232K62144
$$ plain form
2525 3074048 2379264 3036160 2810368 3583488 1410048 2233856 1521664 2837504 2415104
2516 2415104 2991104 2258944 2560000 2551296 2463232 1609728 1291264 1874432 1563648 2130944
2506 2130944 2136064 1914368 2752000 2416640 2067456 1921536 2946560 2506752 755712 2299392
2496 2299392 1638400 2905600 1768448 1776128 2055680 1998848 2257408 1338368 2545152 2313216
2486 2313216 2037760 2045952 1254912 2447360 2657792 3199488 1690624 2878976 1655296
2477 1655296 1667072 1921024 975360 1809920 2278400 2495488 2744320 1743872 2913280
2468 2913280 2105344 2212352 1641984 2963456 1670656 2467328 2364928 2882560 2082816
2459 2082816 2946048 2152960 2511360 1829376 2567168 2104320 1565696 2510848 2731520 2682368
$$ packed form
2525C074048o94784O56896k25792P73120A410048Q23808p12192J315840m22400
2516B415104N76000p32160L01056q704q8064q53504l18464N83168l10784N67296
2506B130944N120k21696Q37632l35360l49184j45920J025024m39808G55712J543680
2496B299392o60992J267200j137152P680K79552n6832K58560r19040J206784k31936
2486B313216k75456Q192p91040J192448K10432N41696j508864J188352j223680
2477A655296J1776K53952r45664Q34560M68480K17088K48832j000448J169408
2468B913280q07936J07008n70368J321472j292800P96672j02400N17632p99744
2459B082816Q63232p93088L58400o81984P37792m62848n38624R45152K20672m9152
$$ plain form
2449 2682368 2311680 2427904 2933248 3167744 1151488 2365440 2522624 2136576 3538432
2440 3538432 2087936 1457152 2837504 2320896 2926080 3171840 2566144 1542656 2820608
2431 2820608 1108992 3061248 2086912 2161664 2756096 1911296 2450432 1246720 2828288
2422 2828288 3353600 2084352 2520064 1500160 2101248 1484800 2676736 1777664 2913280
2413 2913280 2313728 1369600 3389440 2855936 1915904 2902016 3281408 2367488 3257856
2404 3257856 2332160 2335744 2067968 2272256 2390528 3156992 2957824 2180608 2767360 2548224
2394 2548224 2142208 2717696 1751040 3114496 3300352 2476544 2609152 3300352 3467264
2385 3467264 2608128 2270720 2216960 2888192 2545152 3685376 3381248 2350080 2722816
$$ packed form
2449B682368l70688J16224N05344K34496A151488J213952J57184l86048J401856
2440C538432j450496o30784J380352n16608O05184K45760o05696j023488J277952
2431B820608A108992J952256r74336P4752N94432q44800N39136j203712J581568
2422B828288N25312j269248M35712j019904O01088o16448J191936q99072J135616
2413B913280n99552r44128K019840n33504r40032R86112L79392r13920Q90368
2404C257856r25696L584k67776K04288J18272P66464j99168p77216N86752k19136
2394B548224m06016N75488r66656J363456J85856q23808J32608O91200J66912
2385C467264q59136l37408n3760O71232l43040J140224l04128j031168L72736
$$ plain form
2376 2722816 2565632 2222080 3799040 3147264 3125760 3448320 3033600 2754560 4102656
2367 4102656 2866176 3067904 3696640 3965952 2319360 4697088 4144640 3194368 4482048
2358 4482048 4287488 4501504 3250176 3777536 3919360 5669376 4383744 4165120 3693568
2349 3693568 4421632 4706816 4182528 3091456 4910592 3874816 5042688 4050432 4523520
2340 4523520 3572224 4891648 2699776 3773440 4666368 3793408 4741120 4128256 3896832
2331 3896832 4685824 5198848 4210176 4316672 5083648 4642816 4871680 5125120 5199360 5782528
2321 5782528 4888576 6249472 4804608 4738560 3891712 4581888 4823552 3940864 3549696
2312 3549696 3404800 3775488 3952640 4114432 4242432 4346368 4267520 3797504 3909120 4016128
$$ packed form
2376B722816j57184l43552J576960o51776k1504L22560m14720k79040J348096
2367D102656j236480K01728O28736K69312j646592K377728n52448r50272J287680
2358D482048j94560K14016j251328N27360J41824J750016j285632k18624m71552
2349C693568P28064K85184n24288j091072J819136j035776J167872r92256M73088
2340D523520r51296J319424k191872J073664Q92928q72960R47712o12864k31424
2331C896832P88992N13024r88672J06496P66976m40832K28864K53440P4240N83168
2321E782528q93952J360896j444864o6048q46848O90176K41664q82688l91168
2312C549696j44896L70688J77152J61792J28000J03936p8848m70016J11616J07008
$$ plain form
2302 4016128 4184576 3865600 3474432 3887104 3480576 3792384 4120576 4319744 4264448 2793472
2292 2793472 4033536 3424768 4007936 4011520 3724288 4076032 3264000 2834432 2376192 3244032
2282 3244032 3552768 4177408 3576832 3566592 3403776 3539968 3116032 3492864 2748928 3693056
2272 3693056 3600896 3083776 2700288 2146304 3481088 3549184 2328576 2945536 2009600 2280960
2262 2280960 3603456 3701760 2193920 4179456 2561024 3996672 3594752 3701248 3742208
2253 3742208 2915840 3879424 2497024 3966976 2747904 3232256 3417600 3261952 3248128
2244 3248128 3395584 2855936 3733504 3848704 2067968 3409408 2918912 3030016 3774464
2235 3774464 4085760 2803200 4256256 2833920 2649088 2304512 3053056 2870272 3448320
$$ packed form
2302D016128J68448l18976l91168M12672m06528L11808L28192J99168n5296j470976
2292B793472J240064o08768N83168L584k87232L51744q12032m29568m58240Q67840
2282C244032L08736O24640o00576j0240j62816J36192m23936L76832p43936R44128
2272C693056r2160n17120l83488n53984J334784O8096j220608O16960r35936K71360
2262B280960J322496R8304j507840J985536j618432J435648m01920J06496M0960
2253C742208q26368R63584j382400J469952j219072M84352J85344j55648j3824
2244C248128J47456n39648Q77568J15200j780736J341440m90496J11104P44448
2235C774464L11296j282560J453056j422336j84832l44576P48544j82784N78048
$$ plain form
2226 3448320 3248128 3264512 3619840 3875328 3570176 3643904 3236352 3706368 3512832 3934208
2216 3934208 3315200 4441088 4279296 4478976 3348480 3871744 3753472 3563008 3235840
2207 3235840 3771392 3645952 2912768 2799616 3534848 4096512 3728384 3116032 3186688 3575808
2197 3575808 2900480 3188736 3801600 3612160 2745344 3816960 3133952 4047360 4129792 3595264
2187 3595264 3531264 4264448 3173376 3848192 4860416 3879936 3351552 3657728 4302848
2178 4302848 3869696 3985408 4360704 4871168 4381184 4122112 4310016 4174336 4360704 4188160
2168 4188160 4844032 5013504 3851776 4791808 4784640 4571136 4596224 4940800 4692480 4965888
2158 4965888 5019648 4481024 4907008 4589568 4760576 5514752 4682240 5343232 5535744 4829696
$$ packed form
2226C448320k00192J6384L55328K55488l05152P3728m07552M70016j93536M21376
2216C934208o19008J125888j61792J99680j130496N23264j18272j90464l27168
2207C235840N35552j25440p33184j13152P35232N61664l68128o12352P0656L89120
2197C575808o75328K88256O12864j89440q66816J071616o83008R13408Q2432n34528
2187C595264o4000P33184j091072O74816J012224r80480n28384L06176O45120
2178D302848m33152J15712L75296N10464m89984k59072J87904j35680J86368j72544
2168D188160O55872J69472j161728R40032p168k13504K5088L44576k48320K73408
2158D965888N3760n38624M25984l17440J71008P54176q32512O60992J92512p06048
$$ plain form
2148 4829696 5179904 5177344 5785088 6134784 5847552 6415872 5387776 6517248 6658048 5819392
2138 5819392 6043648 7128064 5856768 6911488 5843968 6107136 7504384 7214592 7411200
2129 7411200 7626752 8071168 8478720 7841280 8450048 7932416 7938048 7788032 8391168 7865856
2119 7865856 6782464 6885888 7360000 8398848 7343104 7012864 7448576 7841280 7351808
2110 7351808 8095744 7039488 7395840 7092224 8239104 6946304 7887360 7332352 6794752
2101 6794752 7350784 7254016 6710784 6804992 6248448 6959616 7666688 6407680 6529024 7944192
2091 7944192 6999040 6956544 7816704 6430720 6217728 6968832 5737472 6561280 6965248
2082 6965248 6043136 6752256 6921216 5585920 5800960 6651904 6853120 7265280 7058944
$$ packed form
2148D829696L50208k560O07744L49696k87232N68320j028096J129472J40800q38656
2138E819392K24256J084416j271296J054720j067520K63168J397248k89792J96608
2129G411200K15552M44416M07552o37440O08768n17632N632j50016O03136n25312
2119G865856j083392J03424M74112J038848j055744l30240M35712L92704m89472
2110G351808P43936j056256L56352l03616J146880j292800R41056n55008n37600
2101F794752N56032r6768n43232R4208n56544P11168P07072j259008J21344J415168
2091G944192r45152m2496Q60160j385984k12992P51104j231360Q23808M03968
2082F965248r22112P09120J68960j335296K15040Q50944K01216M12160k06336
$$ plain form
2073 7058944 6435328 6921216 6345216 6400000 6663680 7208448 7462912 6163456 5898752 5848576
2063 5848576 5668352 6679552 6687744 5226496 5326336 5676032 6405632 6665728 5792768 5946880
2053 5946880 4640256 4408320 4903936 4857856 4596224 4274176 5182976 5479424 5649920 5737984
2043 5737984 5522432 5470720 5777920 6198784 4867584 6791680 5809152 5769728 5280768 6358016
2033 6358016 6587904 6704640 6315008 5614592 5693952 5896704 6854144 5810688 6201856 6828544
2023 6828544 7147008 6959616 7187968 6595584 7251968 6629888 5799424 6809600 6945280
2014 6945280 6861312 6598656 6239744 7619072 6807552 7199744 7682048 8123392 7895040 7815168
2004 7815168 8105984 8507392 8962560 8064000 8769024 8444928 7570944 9806848 7635456
$$ packed form
2073G058944o23616M85888n76000N4784K63680N44768K54464j299456k64704n0176
2063E848576j80224J011200Q192j461248R9840L49696P29600K60096q72960J54112
2053E946880j306624k31936M95616m6080k61632l22048R08800K96448J70496Q8064
2043E737984k15552n1712L07200M20864j331200J924096r82528l9424m88960J077248
2033F358016K29888J16736l89632p00416P9360K02752R57440j043456L91168O26688
2023F828544L18464j87392K28352n92384O56384o22080q30464J010176J35680
2014F945280q3968k62656l58912J379328q11520L92192M82304M41344k28352p9872
2004G815168K90816M01408M55168q98560P05024l24096q73984K235904k171392
$$ plain form
1995 7635456 10464256 8813056 9460224 9095680 9140736 9985024 9674752 9733632 9940992 9256960
1985 9256960 9170944 10849280 10040320 8506368 9687040 9682944 10034688 9458176 10624000
1976 10624000 9169920 9960960 10376704 10609152 10290688 9822720 10037248 9430528 10044928
1967 10044928 8757248 9828864 9439232 9534976 9715712 9860096 9821184 8898560 9682432
1958 9682432 9349632 10890240 10456064 10508800 9793024 9745408 10887168 10269184 10396160 11982848
1948 11982848 10628608 10912256 10957824 9548288 10804224 9197056 10396672 9848832 9477632
1939 9477632 10050560 10597376 10138624 10835968 12754944 12912128 16191488 19458560 23002112
1930 23002112 27610112 19240960 14233600 10706432 9017856 9334784 8430592 8930304 7748096
$$ packed form
1995G635456K828800j651200O47168l64544M5056Q44288l10272N8880K07360o84032
1985I256960q6016J678336q08960j533952J180672m096L51744n76512J165824
1976A0624000j454080P91040M15744K32448l18464m67968K14528o06720O14400
1967A0044928j287680J071616l89632R5744J80736J44384l8912r22624P83872
1958I682432l32800J540608m34176N2736p15776m7616J141760o17984J26976J586688
1948A1982848j354240K83648M5568j409536J255936j607168J199616n47840l71200
1939I477632N72928N46816m58752O97344J918976J57184L279360L267072L543552
1930B3002112M608000q369152n007360l527168j688576L16928r04192M99712j182208
$$ plain form
1921 7748096 8384000 8487936 7349760 8803840 8080384 7482880 7803904 7718912 7767552 7804928
1911 7804928 6257664 7017984 7046144 7157248 6286848 6631936 7466496 6441984 6874112
1902 6874112 6780416 6253568 6479872 6824960 6037504 7324672 7487488 6894592 6565376 7322624
1892 7322624 6572032 6300672 6653440 6519808 7316992 7057408 7581696 6991360 6147584 7332352
1882 7332352 6774272 6243328 7361024 7280640 6403584 6853120 7192064 6366720 6986752 7014400
1872 7014400 6856704 8451072 7198720 7855104 6085120 8184832 7890432 8482816 7530496
1863 7530496 8165376 7839744 8488960 7717376 6926848 7407104 7802880 8333312 7577088 7835648
1853 7835648 7953920 9048064 8521216 8330752 8648192 8612864 9361408 8276992 8419840
$$ packed form
1921G748096O35904J03936j138176J454080p23456n97504L21024q4992M8640L7376
1911G804928j547264P60320K8160J11104q70400L45088Q34560j024512M32128
1902F874112r3696n26848K26304L45088p87456J287168J62816n92896l29216P57248
1892G322624p50592k71360L52768j33632P97184k59584N24288n90336q43776J184768
1882G332352n58080n30944J117696q0384q77056M49536L38944q25344O20032K7648
1872G014400j57696J594368j252352O56384j769984K099712k94400N92384r52320
1863G530496O34880l25632O49216p71584p90528M80256L95776N30432p56224K58560
1853G835648J18272J094144n26848j90464L17440l5328P48544j084416J42848
$$ plain form
1844 8419840 8164352 8651264 8437248 7343104 8066560 7155712 6537728 6350848 6951424
1835 6951424 7001600 5591552 6832128 6373376 6709760 6348288 5709312 7548928 7246848
1826 7246848 6723072 6568448 6660608 7164416 8254976 6935552 6335488 6862848 7267840
1817 7267840 6737920 7971328 6383616 7810048 7312896 7558144 8545792 7640576 8371712
1808 8371712 8619008 8723456 7857664 8847872 7963136 8521216 9058304 8811008 9166336 8719872
1798 8719872 9472512 9839616 9079808 9216512 9424384 9044480 10348544 10186240 10397696
1789 10397696 11165184 9821184 11478528 10560000 10473472 11087360 11553280 11424256 11338752
1780 11338752 11000320 11450368 11890688 11965440 11993088 12082688 13357568 14152704 12935680 12599808
$$ packed form
1844H419840k55488M86912k14016j094144P23456r10848o17984j86880O00576
1835F951424N0176j410048J240576m58752L36384l61472o38976J839616l02080
1826G246848n23776j54624R2160N03808J090560j319424o00064N27360M04992
1817G267840n29920J233408j587712J426432m97152K45248R87648r05216P31136
1808H371712K47296J04448q65792R90208q84736N58080N37088k47296L55328m46464
1798H719872P52640L67104p59808J36704K07872l79904J304064j62304K11456
1789A0397696P67488j344000J657344r18528q6528O13888M65920j29024q5504
1780A1338752l38432M50048M40320P4752K7648Q9600J274880P95136j217024l35872
$$ plain form
1770 12599808 13068288 13122048 13440000 12021248 12938752 12928512 12732928 11954688 12687360 12390912
1760 12390912 11850240 11860480 12123136 13480448 11322368 11984384 12551680 11825664 11951104
1751 11951104 11542528 12620288 11382784 11408384 11716096 10725376 11401216 11766272 11515904
1742 11515904 11658752 12073472 11188736 11884032 12129792 11692544 11516928 11163648 12274176
1733 12274176 11355136 10982400 10873344 11869696 10516992 11624960 11458048 9923584 10097664
1724 10097664 10265088 10049536 10699264 8958976 11317248 9125888 9978368 8754176 9452544
1715 9452544 9210368 9479680 9364992 9109504 8877056 8887808 9190912 9391104 8922112 9659904
1705 9659904 8453120 7979520 7307776 8628224 8315904 7754240 7978496 7388160 7737856
$$ packed form
1770A2599808M68480N3760L17952j418752R17504j0240j95584p78240P32672k96448
1760A2390912n40672J0240K62656J357312k158080O62016N67296p26016J25440
1751A1951104m08576J077760j237504K5600L07712r90720O75840L65056k50368
1742A1515904J42848M14720q84736O95296K45760m37248j75616l53280J110528
1733A2274176r19040l72736j09056R96352j352704J107968j66912j534464J74080
1724A0097664J67424k15552O49728j740288K358272k191360Q52480j224192O98368
1715I452544k42176K69312j14688k55488k32448J0752L03104K00192m68992P37792
1705I659904j206784m73600o71744J320448l12320n61664K24256n90336L49696
$$ plain form
1696 7737856 7611904 7498752 7049216 7227904 8144896 7444992 7818240 8677376 8054272 7877120
1686 7877120 6551552 7539200 7411200 7110656 7529984 8597504 7425536 6846976 7684608
1677 7684608 8510976 7749120 8500224 8953856 8542208 8680960 8785408 9110528 8714240 8236032
1667 8236032 9005056 7973888 8149504 9255936 10237952 9487360 10160128 8706048 9843712
1658 9843712 9722880 10073088 9893888 9531392 10807296 10526208 11420160 11793920 11550720
1649 11550720 10958336 11345920 11922944 12082688 12190720 12697600 13335040 13321728 12083712
1640 12083712 13267456 14148096 14024192 15040512 14837760 16011264 16045056 15902720 16545792
1631 16545792 17468928 17426944 18926080 18863616 20264448 20779520 20812800 22469120 25041408
$$ packed form
1696G737856j25952j13152m49536J78688R16992o99904L73248Q59136o23104j77152
1686G877120j325568R87648j28000l00544M19328J067520j171968n78560Q37632
1677G684608Q26368p61856P51104M53632m11648J38752J04448L25120l96288m78208
1667H236032P69024j031168J75616J106432R82016p50592O72768j454080J137664
1658I843712j20832L50208j79200l62496J275904k81088Q93952L73760k43200
1649A1550720n92384L87584N77024J59744J08032N06880O37440j3312j238016
1640A2083712J183744Q80640j23904J016320k02752J173504L3792j42336O43072
1631A6545792R23136m1984J499136o2464J400832N15072L3280J656320K572288
$$ plain form
1622 25041408 24590336 25653760 28237312 28566528 30160384 31881728 33488896 33512960 35768320
1613 35768320 36827648 37480960 39901184 40152576 39758848 40665088 42363904 43238912 44096512
1604 44096512 45501952 45894656 47695872 49229312 50521600 54062592 56698880 59838976
1596 59838976 61854208 65112576 68983296 74130944 80782336 87896576 95611904 103972352
1588 103972352 110200320 116505088 116446208 112407040 103960576 92941312 81762816 69303808
1580 69303808 57119232 49199104 41065472 34577408 29827072 26008064 23304192 21372416
1572 21372416 18867712 18116096 16301056 15687168 15248384 14673920 13335040 12834304 12073472
1563 12073472 13879808 12647424 10348032 10885120 10071552 11248640 10186240 10442240 11048448
$$ packed form
1622B5041408m51072J063424K583552L29216J593856J721344J607168K4064K255360
1613C5768320J059328O53312K420224K51392l93728R06240J698816Q75008Q57600
1604D4096512J405440L92704J801216J533440J292288L540992K636288L140096
1596E9838976K015232L258368L870720N147648O651392P114240P715328Q360448
1588A03972352O227968O304768n8880m039168q446464j1019264j1178496j2459008
1580F9303808j2184576p920128q133632o488064m750336l819008k703872j931776
1572B1372416k504704p51616j815040o13888m38784n74464j338880n00736p60832
1563A2073472J806336j232384k299392N37088q13568J177088j062400K56000O06208
$$ plain form
1554 11048448 9210880 9382912 9347584 9974272 8419840 9161216 9703424 9072128 8259584
1545 8259584 7241728 7995392 7702016 8163328 6597632 8186368 7528448 8100864 5648896
1536 5648896 6758400 7350272 6217216 5958656 6998528 6812672 6532608 6423552 6084608
1527 6084608 6120960 6493184 6040576 5208576 6127104 5276160 6195200 6188032 5711872 5577216
1517 5577216 4909056 5508096 5437952 4480512 6543360 6296576 4893696 3913216 4840960
1508 4840960 3677696 4200960 5811200 3970560 3090432 3798016 3429376 3905536 3259904
1499 3259904 3631104 4374016 4943872 3892224 4374528 3932672 4271104 4283904 4156928 3681280
1489 3681280 4678656 3545600 3717120 4220416 4721152 4498432 4734976 4373504 4579328
$$ packed form
1554A1048448j837568J72032l5328O26688j554432P41376N42208o31296q12544
1545H259584j017856P53664k93376M61312j565696J588736o57920N72416k451968
1536E648896J109504N91872j133056k58560J039872j85856k80064j09056l38944
1527F084608L6352L72224m52608q32000R18528q50944R19040p168m76160j34656
1517E577216o68160N99040p0144r57440K062848k46784j402880r80480R27744
1508D840960j163264N23264J610240j840640q80128P07584l68640M76160o45632
1499C259904L71200P42912N69856j051648M82304m41856L38432J2800j26976m75648
1489C681280R97376j133056J71520N03296N00736k22720K36544l61472K05824
$$ plain form
1480 4579328 3935744 4475392 4042240 4372480 3805184 4241920 4687872 4241408 3825152 4419584
1470 4419584 5623296 4185088 4622848 4267520 3845632 4851200 4323328 4923392 4150272
1461 4150272 4253696 6099456 5060608 6117888 4574208 5100032 6546944 5933056 5869056
1452 5869056 6748160 5915136 6812160 6872064 6330880 7365632 6144512 7155200 6486528
1443 6486528 7541248 6822400 8227328 7324672 8027136 9125376 9009664 10939392 11003392
1434 11003392 11037696 10424320 10347008 10220544 9437184 8821248 10252288 9276416 9668608 8518144
1424 8518144 8501760 9445376 9488384 9373184 8702464 9261568 9366528 9715200 9086976 8708096
1414 8708096 8875008 7923712 9416704 9225728 9774592 7769600 9018880 8146944 9852416
$$ packed form
1480D579328o43584N39648m33152L30240n67296M36736M45952m46464m16256N94432
1470D419584J203712j438208M37760l55328m21888J005568n27872O00064p73120
1461D150272J03424J845760j038848J057280j543680N25824J446912o13888o4000
1452E869056Q79104q33024Q97024N9904n41184J034752j221120J010688o68672
1443F486528J054720p18848J404928r02656P02464J098240j15712J929728O4000
1434A1003392L4304o13376p7312j26464p83360o15936J431040r75872L92192j150464
1424H518144j6384R43616M3008j15200o70720N59104J04960L48672o28224l78880
1414H708096J66912r51296J492992j90976N48864k004992J249280q71936J705472
$$ plain form
1405 9852416 8527360 9802240 9035264 10451456 11426304 11999744 12057600 13770752 14371328
1396 14371328 13947392 14363648 13779456 14529024 13467648 13238272 11083776 9882624 9946624
1387 9946624 9249280 8841216 7563776 8502272 7922688 9058816 8321536 8384512 7828992
1378 7828992 8154112 7826432 8490496 8427520 8031744 8248320 8011776 8703488 9044480 9743872
1368 9743872 8073216 10184704 9925120 8911360 9736704 8905728 9469952 9315328 7878656
1359 7878656 9295872 7667712 7415296 8330240 7029760 8017408 7765504 7402496 5799424
1350 5799424 6396416 5796352 5888000 6347776 5198336 6184448 5410816 5388288 6860288 5622272
1340 5622272 5415424 5081600 6417408 5556736 5482496 4987904 5540864 5245440 4974080 5684736
$$ packed form
1405I852416j325056J274880p66976J416192R74848N73440N7856J713152O00576
1396A4371328m23936M16256n84192P49568j061376k29376k154496j201152O4000
1387I946624o97344m08064j277440R38496n79584J136128p37280O2976n55520
1378G828992L25120l27680O64064o2976l95776K16576k36544O91712L40992O99392
1368I743872j670656K111488k59584j013760Q25344q30976N64224j54624j436672
1359G878656J417216j628160k52416R14944j300480R87648k51904l63008j603072
1350E799424N96992o00064R1648M59776j149440R86112p73632k2528J472000j238016
1340E622272k06848l33824J335808q60672p4240m94592N52960k95424k71360P10656
$$ plain form
1330 5684736 5833216 5440512 4836352 3779072 4589056 4340224 4007936 4018176 4465152 3201024
1320 3201024 3366912 2451968 3526144 2032640 3092480 2448384 2203648 1971200 2082304
1311 2082304 1831424 2868736 1768960 2541568 2954240 2747392 2277376 2165248 1894400
1302 1894400 2148352 1162752 2738176 2159104 1539584 1723392 1133056 1035264 744448 1439232
1292 1439232 995328 1624064 727040 1422848 529920 1956352 755200 1196032 1217536 1051136
1282 1051136 1000448 807424 1722880 351232 1737216 1914880 1136128 1104896 1960448 1382400
1272 1382400 1515520 1262080 1416192 1053696 1601536 2247680 1332224 773632 1061888 692224
1262 692224 1085440 1662464 1480704 465920 737280 110592 -22528 766976 292864 1081856
$$ packed form
1330E684736J48480l92704o04160j057280Q09984k48832l32288J0240M46976j264128
1320C201024J65888r14944J074176j493504J059840o44096k44736k32448J11104
1311B082304k50880J037312j099776P72608M12672k06848m70016j12128k70848
1302A894400K53952r85600J575424n79072o19520J83808n90336r7792k90816O94784
1292A439232m43904O28736G27040O95808E29920J426432G55200M40832K1504j66400
1282A051136n0688j93024R15456C51232J385984J77664p78752l1232Q55552n78048
1272A382400J33120k53440J54112l62496N47840O46144r15456n58592K88256l69664
1262F92224L93216N77024j81760D65920K71360A10592b2528G66976B92864P88992
$$ plain form
1252 1081856 1238528 1201152 965632 2373632 694784 440832 1437184 1435136 1716736 525312
1241 898560 1836032 456704 360448 1604608 1414144 382976 974336 527872 538112 943616
1231 943616 1355264 1175552 2097664 2038784 1357312 1603584 1027584 1334784 2193408 1912832
1221 1912832 1181696 1273856 2873856 3130880 669184 956416 1534464 2940416 1595904
1212 1595904 3181056 2734592 2953728 2303488 2263040 1302016 2188800 1909760 1687040 1556992
1202 1556992 2130944 1692672 2075648 1288704 880128 658944 792064 888832 1023488 1615872
1192 1615872 344576 1067520 1594368 784896 646656 606208 1307136 568832 220160 1165312
1182 1165312 1185280 1009664 1509888 1796096 811520 194048 1364480 839168 331264 637952
$$ packed form
1252A081856J56672l7376k35520J408000F94784k53952R96352k048K81600E25312
1241H98560R37472D56704r6256J244160j90464C82976N91360m46464J0240M05504
1231I43616M11648j79712R22112n8880o81472K46272n76000L07200Q58624k80576
1221A912832p31136R2160J600000K57024F69184K87232N78048J405952j344512
1212A595904J585152m46464K19136o50240m0448r61024Q86784k79040k22720j30048
1202A556992N73952m38272L82976p86944m08576k21184J33120R6768J34656N92384
1192A615872C44576P22944N26848G84896j38240m0448P00928E68832B20160R45152
1182A165312J9968j75616N00224K86208H11520A94048J170432n25312C31264L06688
$$ plain form
1172 637952 429056 1593856 -41472 1096192 1048064 1283584 698368 1423872 1416704 1066496
1162 1066496 740864 687616 232448 520704 544256 1968128 306688 1049600 436224 553984
1152 553984 -41984 683520 726016 1210368 310784 -122368 507904 1014784 97280 1180160
1142 1180160 4608 1156096 308224 1260032 1311232 1109504 1391616 1000960 1219584 1110528
1132 1110528 387072 959488 1053696 1068032 712704 551424 323584 344064 743936 580608
1122 580608 1180160 934400 785408 468480 833024 1584640 242688 2231808 1087488
1112 874496 638976 799232 948736 652800 171008 347136 294912 630784 662016 569344
1102 569344 1086976 425984 481792 1286144 722432 1814528 99840 671744 710656 381440
$$ packed form
1172F37952k08896J164800d1472A096192m8128K35520n85216P25504p168l50208
1162A066496l25632n3248B32448K88256K3552J423872C06688P42912D36224J17760
1152E53984d1984F83520M2496M84352C10784a22368E07904N06880I7280J082880
1142A180160D608J151488C08224R51808N1200k01728K82112l90656K18624j09056
1132A110528C87072N72416R4208J4336l55328j61280k27840K0480L99872j63328
1122E80608N99552k45760j48992l16928L64544P51616B42688J989120A087488
1112H74496k35520J60256J49504k95936A71008J76128n2224L35872L1232r2672
1102E69344N17632D25984N5808Q04352n63712J092096I9840N71904L8912l29216
$$ plain form
1092 381440 1385472 206848 -455168 1607168 1150464 231936 844800 977408 299008
1082 1473536 1381376 1403392 795136 974336 550400 1254400 1142784 1776128 655360 826880
1072 826880 350720 1433088 46080 997376 1185792 1187328 469504 124416 1427456 230912
1061 1448960 1019904 1434112 1285632 175104 1536512 502784 -121344 -168960 1340416
1051 665600 608768 977920 1568768 345088 66560 253952 526336 987648 -420864 460288
1040 693760 632320 475648 203776 83968 1229824 572928 158720 173056 1580032 1048576
1030 1048576 -11776 1406976 217088 1688064 357888 -66048 496640 803840 -154112 706560
1019 -177664 552960 327168 309248 1894400 2398208 367616 246784 -477696 -88576 1120256
$$ packed form
1092C81440J004032B06848d55168A607168m56704B31936O12864J32608B99008
1082A473536r2160K2016o08256J79200m23936P04000j11616O33344F55360J71520
1072H26880C50720J082368D6080R51296J88416J536D69504A24416J303040B30912
1061A448960m29056M14208j48480A75104J361408E02784a21344m7616A340416
1051F65600n6832L69152N90848C45088F6560J87392K72384M61312d20864D60288
1040F93760o1440j56672B03776H3968J145856E72928A58720J4336J406976n31456
1030A048576a1776A406976B17088J470976C57888f6048D96640L07200a54112G06560
1019a77664E52960k25792j7920J585152N03808C67616j20832d77696h8576A120256
$$ plain form
1008 -143360 838656 870400 92160 1465856 665600 3072 955392 -14336 1092096 417792
997 -123392 1051136 1528320 860672 422400 894464 1227776 1626624 2209280 1305088 561664
986 1901568 737280 1022976 1269248 1714176 2620416 2273792 2522112 2449408 2221056 3426304
976 3426304 4200448 4926976 4508672 4096000 5737984 6478848 7257600 7941120 8375296 7939072
966 7939072 7998464 8480256 8402944 8929280 7971328 10607616 11681792 13207552 15231488
957 15231488 16296960 22512128 31689216 48183296 75026944 89564160 145267712 104287744
949 104287744 49103360 29548032 18826240 14492160 11530752 8129536 5347328 4156928
941 4156928 4276736 3344384 2450432 2832384 2788864 3133952 4400640 4689408 5628928 4367872
$$ packed form
1008a43360H38656L1744I2160J373696F65600C072R52320a4336A092096D17792
997a23392A051136M77184o67648D22400M72064L33312L98848N82656r04192E61664
986A901568G37280K85696K46272M44928R06240l46624K48320p2704k28352J205248
976C426304P74144P26528m18304m12672J641984P40864P78752O83520M34176m36224
966G939072N9392M81792p7312N26336r57952K636288J074176J525760K023936
957A5231488J065472O215168R177088J6494080K6843648J4537216N5703552m0979968
949A04287744D9103360j9555328j0721792m334080k961408l401216k782208j190400
941D156928J19808r32352q93952L81952m3520L45088J266688K88768R39520j261056
$$ plain form
931 4367872 3672576 2430976 2407936 1720832 2007552 1466368 1830400 1091072 1689600 1673216
921 1673216 1086464 1366016 1298944 841728 915968 1022976 1004032 995328 1776640 324608 220160
910 220160 1005056 812544 893440 954368 799232 1641984 140288 373760 961536 1694720
900 1694720 1230336 1088000 115712 593920 653312 1671168 936448 78848 1146880 935936
890 935936 -346112 879616 483328 1330176 738304 925184 910848 741376 769536 769024 1284608
879 1284608 604672 766464 1162752 1243648 2048 1527808 772608 476160 144896 1093632
869 1093632 96256 834048 1387008 -411136 -524288 247808 -174592 -35840 1306624 447488
858 263168 954368 -82944 983040 1055232 -1030656 -497664 256000 491520 524800 -663552
$$ packed form
931D367872o95296j241600k3040o87104K86720n41184L64032p39328N98528j6384
921A673216n86752K79552o7072m57216P4240J07008j8944q704P81312C24608j04448
910B20160P84896j92512Q0896O0928j55136Q42752A40288K33472N87776P33184
900A694720m64384j42336A15712M78208N9392J017856p34720G8848J068032k10944
890I35936c46112H79616l96288Q46848n91872J86880j4336j69472K8160n12N15584
879A284608F04672J61792L96288Q0896B048J525760p55200k96448A44896R48736
869A093632I6256P37792N52960d11136j13152B47808a74592c5840A306624D47488
858B63168O91200h2944I83040P2192a030656d97664B56000K35520L3280f63552
$$ plain form
847 70144 739840 233472 334848 285696 -287744 115712 503296 570880 -128512 636928
836 -1000448 89600 -39936 8192 1235456 125440 299008 -267776 159232 1241088 23040
825 40448 -431616 -486400 135680 969728 537600 280576 106496 1080320 939520 -473600
814 195584 1585664 487936 1116160 -113152 1076736 194560 415232 761344 -221696 -360960
804 -360960 548864 23552 574976 136704 -911872 -67072 -47616 -256000 1058304 99328
793 1120768 -862208 -572928 94720 86528 -838144 318976 387584 -384000 225280 -524288
782 -116736 -809472 207872 226304 -559616 300544 634368 548352 547328 -11776 -454656 -120832
770 807424 -1108992 -715776 36864 227328 -440320 0 -250880 312320 -507392 346624 -436224
$$ packed form
847G0144O69696B33472J01376m9152b87744A15712L87584O7584a28512F36928
836a000448H9600c9936H192J227264A25440J73568b67776A59232J081856B3040
825D0448d31616n4784A35680Q34048m32128k57024A06496R73824j40800d73600
814A95584J390080D87936O28224a13152A076736A94560K20672L46112b21696j39264
804c60960E48864B3552N51424A36704i11872f7072J9456k08384A058304I9328
793A120768h62208K89280I4720q192h38144C18976O8608c84000B25280e24288
782a16736o92736B07872J8432e59616C00544L33824q6016j024a1776m42880a20832
770H07424a108992L93216C6864J90464d40320@b50880C12320e07392C46624d36224
$$ plain form
758 -9728 -416256 -164352 -414208 15360 -11264 480768 399872 322048 20480 393216 480256
747 480256 71680 12288 403968 -30720 528384 372224 -370688 488448 -870400 -309248
736 138752 1244672 386560 469504 996864 1333248 888320 -266752 1412608 691712 811008
726 811008 -61952 480256 1518080 150016 453120 879616 1506304 -160256 1598976 1223680
716 1223680 810496 790016 912896 351232 1268224 118784 1242624 1593856 297984 772608
706 772608 417792 287232 330752 1884672 785408 1379328 143872 1540608 2370048 826368
695 2196992 1098752 1882112 993280 1048576 2076672 1047040 1239552 1779200 -655360
685 443392 61440 382464 556032 87552 385024 -122880 -112640 -139264 92672 261632 -80896
$$ packed form
758i728m06528a64352k49856A5360a1264D80768q0896p7824B0480L72736Q7040
747D80256G1680A2288L91680c0720E28384j56160c70688D88448h70400c09248
736A38752J105920C86560Q2944N27360L36384m44928b66752A412608F91712J19296
726H11008f1952D80256J037824A50016L03104M26496O26688a60256A598976l75296
716A223680m13184k0480J22880C51232R16992A18784J123840L51232B97984M74624
706G72608l54816j30560M3520J553920G85408N93920A43872J396736Q29440H26368
695B196992j098240P83360q88832N5296J028096j029632J92512N39648f55360
685D43392F1440L21024J73568H7552K97472a22880J0240k6624I2672J68960h0896
$$ plain form
673 -628736 -498176 -422912 -612352 -154112 635904 517632 -245760 -233984 105984 -187904
662 993792 -231936 -101888 -118784 -500224 -693248 -143872 -240640 188928 -635904 692736
651 652800 780800 -105472 256512 -54784 457216 -620032 972800 933888 -66560 -1229312
641 -1229312 -251392 -126976 -815616 -223744 -616448 380928 -497664 -906240 308224 -322048
630 1047040 98304 133120 257024 450560 750592 1330176 -497152 1310720 713216 307200
619 -386560 18944 22016 -623616 -572928 -426496 -465920 -221696 -252928 584704 -702464 -376832
608 -376832 -64512 486912 379392 553984 -765952 -521728 680960 -1749504 -64512 236032
597 -3072 -388608 107008 432128 -166400 -316416 -1536 -818688 1291776 686080 244224
$$ packed form
673f28736J30560P5264j89440a54112F35904j18272b45760J1776A05984a87904
662I93792b31936a01888j6896l81440j93024a43872r6768A88928f35904F92736
651F52800J28000a05472B56512e4784D57216f20032I72800l8912f6560j162752
641a229312b51392J24416o88640b23744l92704C80928d97664m08576C08224c22048
630A047040I8304L4816J23904J93536L00032N79584d97152A310720n97504C07200
619c86560A8944L072f23616N0688J46432l9424b21696l1232E84704g02464L25632
608c76832f4512D86912j07520J74592g65952K44224F80960a749504f4512B36032
597c072l85536A07008L25120a66400j50016a536q17152A291776o05696B44224
$$ plain form
586 -261120 -730112 -461312 -191488 450560 102912 -13824 -1071104 -359424 -1830912 -111616
575 445952 -55808 -536576 721920 142848 520192 99840 -1217024 -276480 -413696 -155648
564 1068544 469504 245248 -328704 -442368 673792 -761856 110080 658944 -549376 -447488
554 -447488 -216064 283136 -943104 -65024 -209408 -280064 1004544 -698880 -521216 -1401856
544 -1401856 -1043968 -394752 -19968 -642048 600576 -715264 -860160 212992 -746496 984576
533 -69632 -425984 14336 1105408 -151552 24576 664576 -175616 -903680 139776 -139776
522 -146432 579072 -78336 -435200 -72192 1014272 -3072 -167424 -231424 263680 -276480 -934912
511 -934912 -598528 -62976 100352 -1575936 536064 342528 -52736 -1050624 245760 556544
$$ packed form
586b61120m68992K68800a91488D50560A02912a3824j057280c59424j471488a11616
575D45952e5808m80768G21920A42848L77344I9840a217024b76480j37216a55648
564A068544D69504k24256c28704j13664F73792g61856A10080N48864e49376J01888
554d47488b16064B83136i43104f5024j44384p0656A004544f98880J77664q80640
544a401856L57888c94752a9968o22080F00576g15264j44896B12992g46496I84576
533f9632l56352A4336J091072a51552B4576O40000a75616p28064A39776a39776
522a46432E79072g8336l56864g2192A014272c072j64352o4000B63680b76480o58432
511i34912L36384f2976A00352a575936E36064j93536e2736r97888B45760L10784
$$ plain form
501 556544 -104960 -802816 -38400 -696320 -152064 -199168 -666624 130048 179200 -809472
490 56320 -321024 -428032 -215552 -433664 -373248 633856 20480 -279552 203776 -927232
479 -2560 -768000 -93696 -46080 84992 -470528 -652288 -432640 811008 263680 -722432 -290304
467 -778240 627712 -622592 611840 -1120256 -81920 -545280 -395264 -888832 266240 347136
457 347136 -739328 -414720 -470016 101888 -411648 -101376 -401408 -436224 -80896 285184
446 32256 109056 -1236992 500224 -162304 -412672 -82432 -123392 -668160 915968 957440 -83968
434 -579584 311808 -196096 717824 641536 557056 1199104 -243200 -868352 -125440 307200
423 -777728 -172544 -803840 400896 595456 -39936 218624 -428032 638464 -1081856 -668160
$$ packed form
501E56544a04960o97856c8400o57920a52064m7104m67456A30048M9152h09472
490E6320c21024j07008K12480k18112O0416F33856B0480b79552B03776i27232
479b560p65440i3696d6080H4992d70528j81760K19648H11008B63680g22432b90304
467g78240F27712f22592F11840a120256h1920m63360J50016m93568B66240Q0896
457C47136g39328L24608n5296A01888d11648a01376l00032l4816h0896B85184
446C2256P6800a236992E00224a62304k50368h2432m0960n44768I15968M1472h3968
434e79584C11808a96096G17824p6288q4480O42048b43200o25152a25440C07200
423g77728a72544o31296D00896J94560c9936B18624d28032F38464a081856M13696
$$ plain form
413 -668160 -1780224 -518656 -109568 478720 -67584 -620544 88576 -663552 -414208 27136
402 -724480 -621568 -772608 78848 -563712 -581632 -901120 -492544 100864 43520 -166400
391 -492032 89600 -217600 -270848 -1360896 580608 -145920 78336 -80896 646656 -992768
380 -180736 -227840 -637952 -1030656 342016 -822272 -104448 -1248768 -524288 -834048 -905728
370 -905728 -239104 -254464 125952 -124928 1519616 -1138176 -476672 243712 -1302016 82432
359 -924672 -590848 317440 -411136 1463296 466944 724480 -1398784 -599552 863232 -595456
348 -893952 -576000 -940544 -379392 -879104 -155136 -166400 142848 -502784 381440 -427008
337 -10752 -356352 294912 552448 -485888 -1157120 78848 -423424 -1828352 -605184 -437760
$$ packed form
413f68160j112064e18656a09568D78720f7584n52960H8576f63552K49344B7136
402g24480J02912j51040G8848e63712j7920l19488M08576A00864D3520a66400
391d92032H9600b17600n3248j090048E80608a45920G8336h0896F46656i92768
380a80736m7104m10112l92704C42016h22272a04448j144320e24288l09760p1680
370i05728b39104j5360A25952a24928A519616a138176d76672B43712a302016H2432
359i24672L33824C17440d11136A463296D66944K57536a398784e99552H63232e95456
348h93952L17952l64544c79392m99712a55136j1264A42848e02784C81440d27008
337a0752l45600B94912K57536d85888o71232G8848d23424j404928f05184J67424
$$ plain form
327 -437760 223744 337408 -79360 -407040 -143872 -66560 -219136 107008 -1186816 -184832
316 97792 -390656 55296 197120 -342016 380928 -207872 -376320 -349696 -153600 -141824 -194560
305 -194560 82944 852480 -670720 27648 35840 -153088 -159232 235008 -537088 -292864 -796672
294 -796672 -542208 708608 -564224 57856 110592 -923136 443904 -676864 -860160 -532992
284 -532992 -314880 658432 142336 -1733120 -584192 -293888 42496 -595968 344064 62464
273 12288 -521216 -893440 -322560 -986624 -979456 421376 -688640 -225792 -412672 -57856 -454656
262 -454656 -117760 74752 -409600 -600576 788992 420864 230912 -1120768 -919552 -434176
251 -384000 -459776 -182272 220160 -394752 557056 -80384 -69632 -545792 475136 406528 608768
$$ packed form
327d37760B23744J13664g9360l27680a43872f6560j52576A07008a186816a84832
316I7792c90656E5296J41824c42016C80928b07872j68448K6624a53600J1776n2736
305a94560H2944P69536f70720B7648Q192a53088o144B35008e37088K44224n03808
294g96672K54464G08608e64224E7856N2736i23136D43904f76864j83296L27168
284e32992K18112F58432A42336a733120e84192K90304D2496e95968C44064F2464
273A2288e21216l72224c22560o64064P168D21376f88640b25792j86880e7856l96800
262d54656a17760G4752d09600j90976G88992l68128j89952a120768K01216d34176
251c84000p5776a82272B20160c94752E57056h0384J0752m76160D75136o8608K02240
$$ plain form
240 608768 -34304 -536064 597504 -541696 528896 -626688 -112640 512000 -335360 -492032
230 -492032 -426496 160256 782336 -483328 -870400 -71168 -146432 -16896 54784 -492544 40448
218 -892416 181760 -71168 -1344512 -489472 1010688 -601600 619520 315904 365056 340480
208 340480 150016 446464 -421376 -189440 -321536 -1259008 660992 -825856 -768512 327680
197 -1146368 -653824 -201216 -583680 -1387520 -1472000 493568 -598016 357888 -376320 -297984
187 -297984 -795648 -498688 -441856 -453632 -408576 -194048 394240 -961536 -1242624 -309248
176 309760 -325120 -264192 -701952 -807936 160256 -712192 -113152 -509440 460288 -531456
165 112128 -246272 -3584 540160 -609792 18432 -241152 -874496 -242176 -197120 183808 556032
$$ packed form
240F08768c4304n01760E97504e41696E28896f26688a12640E12000c35360j56672
230d92032O5536A60256O22080d83328l87072g1168p5264a6896E4784d92544D0448
218h92416A81760g1168j273344d89472A010688f01600F19520l03616M9152k4576
208C40480A50016K96448d21376a89440j32096r37472F60992h25856N7344C27680
197a146368M92544b01216l82464q03840q4480D93568e98016C57888c76320P8336
187b97984m97664K96960N6832j1776M5056a94048C94240i61536k81088c09248
176C09760c25120O0928m37760j05984A60256g12192a13152l96288D60288e31456
165A12128b46272c584E40160f09792A8432b41152o33344b42176M5056A83808L72224
$$ plain form
154 556032 -538112 75776 -708608 -962048 338944 -382464 -489472 -151040 -204800 36864
143 342528 -146944 -412160 -591872 -1106944 -615424 19456 95232 913408 1015808 -206336
132 120320 70144 -2048 680960 -1077760 -394752 -264704 19456 -1673728 378368 -296448
121 -790528 98816 13312 337408 345600 918016 -372736 -428544 -241664 -766976 -466432 -968192
110 -968192 -495616 126976 -600576 -1576448 -506880 171008 -81408 272384 124416 -682496
99 82944 519680 -80896 -750080 -777216 596992 -944128 -809984 89600 -322048 -903680 386048
87 622080 -470528 -6656 368640 -1287680 -208384 31744 -1078784 -328192 160256 304640
77 304640 -257536 -1031168 -120832 -619008 -940032 2048 -82432 911360 -328192 32256 -436736
$$ packed form
154E56032e38112G5776g08608k53440C38944c82464j07008a51040n3760C6864
143C42528a46944k65216j79712n15072M91520A9456P5776Q18176J02400b06336
132A20320n0176b048F80960a077760c94752J30048A9456a673728C78368b96448
121g90528I8816A3312L24096Q192N72416c72736n5808J86880n25312L00544n01760
110i68192M72576A26976f00576r75872e06880A71008h1408B72384A24416f82496
99H2944M36736h0896o69184k7136E96992i44128J34144H9600c22048n81632C86048
87F22080d70528f656C68640a287680b08384C1744a078784c28192A60256J44384
77C04640b57536p73632a20832m98176l21024B048h2432I11360c28192C2256d36736
$$ plain form
65 -604160 240640 -1064960 162304 -620544 -1413120 131072 -1054720 95232 -197632 -116224
55 -116224 -1174016 -436224 -390144 -984576 784896 -1453056 -130560 46080 -678912 -463872
45 -463872 -776704 -751104 -781824 -153600 282112 -212992 -284160 -443392 403968 256512 -720896
33 -438272 -131072 -940032 -765952 -297472 270336 -907264 -124928 -205824 -699904 -1302016
23 -1302016 -642048 -302592 -491520 641536 -260096 -578048 -151552 68096 15872 -398336
12 646144 -766464 -536576 574464 205312 406016 -420352 642048 -304128 35328 -272384
1 265728 -173056
$$ packed form
65f04160B40640a064960A62304f20544p92576A31072a054720I5232a97632Q1408
55a16224j057792d36224M6080n94432G84896a453056a30560D6080f78912K15040
45d63872l12832K5600l0720a53600B82112b12992p1168j59232D03968j47456g20896
33d38272a31072q08960J74080b97472B70336i07264a24928q0896m94080o02112
23a302016f42048c02592j88928F41536b60096l17952a51552F8096A5872c98336
12F46144g66464K29888E74464B05312K00704d20352F42048c04128C5328b72384
1B65728a73056
##END=
