##TITLE=1318
##JCAMPDX= 6.0         $$ Bruker NMR JCAMP-DX V2.0
##DATA TYPE= NMR SPECTRUM
##DATA CLASS= XYDATA
##ORIGIN= NUTS EXPORT
##OWNER= Administrator
$$ 1.72 TOPSPIN		Version 2.1
$$ 2016-02-23 12:19:21.402 -0800  Administrator@X
$$ Compression mode = diff/dup
##.OBSERVE FREQUENCY= 90.275459
##.ACQUISITION MODE= SIMULTANEOUS (DQD)
##.ACQUISITION SCHEME= undefined
##.AVERAGES= 16
##.DIGITISER RES= 22
##SPECTROMETER/DATA SYSTEM= 
##.PULSE SEQUENCE= zg30
##.SOLVENT NAME= None
##.SHIFT REFERENCE= INTERNAL, None, 1, 14.68834
##AUDIT TRAIL= $$ (NUMBER, WHEN, WHO, WHERE, PROCESS, VERSION, WHAT)
$$ ##TITLE= Audit trail, TOPSPIN		Version 2.1
$$ ##JCAMPDX= 5.01
$$ ##ORIGIN= Bruker BioSpin GmbH
$$ ##OWNER= Administrator
$$ $$ E:/data/jwist/nmr/1318/1/pdata/1/auditp.txt
$$ ##AUDIT TRAIL=  $$ (NUMBER, WHEN, WHO, WHERE, PROCESS, VERSION, WHAT)
(   1,<2016-02-23 08:48:26.566 -0800>,<Administrator>,<X>,<jcamp>,<TOPSPIN 2.1>,
      <fromjdx created from
       E:\data\jwist\nmr\uniandes\1318
       data hash MD5: 8K
       FB F2 EB EC 6D 09 10 50 0A 26 27 62 E9 F9 6E 71>)
$$ ##END=
$$ 
$$ $$ hash MD5
$$ $$ 72 37 8A 4F B2 64 C5 77 DB A2 84 A6 A3 12 DF F7
##$RELAX= 
$$ Bruker specific parameters
$$ --------------------------
##$DU= <E:>
##$EXPNO= 1
##$NAME= <1318>
##$PROCNO= 1
##$TYPE= <nmr>
##$USER= <jwist>
##$ACQT0= 0
##$AMP= (0..31)
100 100 100 100 100 100 100 100 100 100 100 100 100 100 100 100 100 100
100 100 100 100 100 100 100 100 100 100 100 100 100 100
##$ANAVPT= 1
##$AQSEQ= 0
##$AQ_mod= 3
##$AUNM= <au_zg>
##$AUTOPOS= <>
##$BF1= 90.275459
##$BF2= 400.02
##$BF3= 400.02
##$BF4= 400.02
##$BF5= 400.02
##$BF6= 400.02
##$BF7= 400.02
##$BF8= 400.02
##$BYTORDA= 0
##$CFDGTYP= 0
##$CFRGTYP= 0
##$CHEMSTR= <none>
##$CNST= (0..63)
1 1 145 1 1 1 1 1 1 1 1 1 1 1 1 1 1 1 1 1 1 1 1 1 1 1 1 1 1 1 1 1 1 1 1
1 1 1 1 1 1 1 1 1 1 1 1 1 1 1 1 1 1 1 1 1 1 1 1 1 1 1 1 1
##$CPDPRG= <>
##$CPDPRG1= <>
##$CPDPRG2= <>
##$CPDPRG3= <>
##$CPDPRG4= <mlev>
##$CPDPRG5= <mlev>
##$CPDPRG6= <mlev>
##$CPDPRG7= <mlev>
##$CPDPRG8= <mlev>
##$CPDPRGB= <>
##$CPDPRGT= <>
##$D= (0..63)
0 1 0 0 0 0 0 0 0 0 0 0 0 0 0 0 0 0 0 0 0 0 0 0 0 0 0 0 0 0 0 0 0 0 0 0
0 0 0 0 0 0 0 0 0 0 0 0 0 0 0 0 0 0 0 0 0 0 0 0 0 0 0 0
##$DATE= 0
##$DBL= (0..7)
120 120 120 120 120 120 120 120
##$DBP= (0..7)
150 150 150 150 150 150 150 150
##$DBP07= 0
##$DBPNAM0= <>
##$DBPNAM1= <>
##$DBPNAM2= <>
##$DBPNAM3= <>
##$DBPNAM4= <>
##$DBPNAM5= <>
##$DBPNAM6= <>
##$DBPNAM7= <>
##$DBPOAL= (0..7)
0.5 0.5 0.5 0.5 0.5 0.5 0.5 0.5
##$DBPOFFS= (0..7)
0 0 0 0 0 0 0 0
##$DE= 6.5
##$DECBNUC= <off>
##$DECIM= 2432
##$DECNUC= <off>
##$DECSTAT= 4
##$DIGMOD= 1
##$DIGTYP= 12
##$DL= (0..7)
0 120 120 120 120 120 120 120
##$DP= (0..7)
150 150 150 150 150 150 150 150
##$DP07= 0
##$DPNAME0= <>
##$DPNAME1= <>
##$DPNAME2= <>
##$DPNAME3= <>
##$DPNAME4= <>
##$DPNAME5= <>
##$DPNAME6= <>
##$DPNAME7= <>
##$DPOAL= (0..7)
0.5 0.5 0.5 0.5 0.5 0.5 0.5 0.5
##$DPOFFS= (0..7)
0 0 0 0 0 0 0 0
##$DQDMODE= 0
##$DR= 22
##$DS= 2
##$DSLIST= <SSSSSSSSSSSSSSS>
$$ [...]
##$SPOFFS= (0..31)
0 0 0 0 0 0 0 0 0 0 0 0 0 0 0 0 0 0 0 0 0 0 0 0 0 0 0 0 0 0 0 0
##$SUBNAM0= <"">
##$SUBNAM1= <"">
##$SUBNAM2= <"">
##$SUBNAM3= <"">
##$SUBNAM4= <"">
##$SUBNAM5= <"">
##$SUBNAM6= <"">
##$SUBNAM7= <"">
##$SUBNAM8= <"">
##$SUBNAM9= <"">
##$SW= 20.5580556627758
##$SWIBOX= (0..15)
0 0 3 4 0 0 0 0 0 0 0 0 0 0 0 0
##$SW_h= 8223.68421052631
##$SWfinal= 0
##$TD= 65536
##$TD0= 1
##$TE= 300
##$TE2= 300
##$TE3= 300
##$TEG= 300
##$TL= (0..7)
0 120 120 120 120 120 120 120
##$TP= (0..7)
150 150 150 150 150 150 150 150
##$TP07= 0
##$TPNAME0= <>
##$TPNAME1= <>
##$TPNAME2= <>
##$TPNAME3= <>
##$TPNAME4= <>
##$TPNAME5= <>
##$TPNAME6= <>
##$TPNAME7= <>
##$TPOAL= (0..7)
0.5 0.5 0.5 0.5 0.5 0.5 0.5 0.5
##$TPOFFS= (0..7)
0 0 0 0 0 0 0 0
##$TUNHIN= 0
##$TUNHOUT= 0
##$TUNXOUT= 0
##$USERA1= <user>
##$USERA2= <user>
##$USERA3= <user>
##$USERA4= <user>
##$USERA5= <user>
##$V9= 5
##$VALIST= <valist>
##$VCLIST= <CCCCCCCCCCCCCCC>
##$VD= 0
##$VDLIST= <DDDDDDDDDDDDDDD>
##$VPLIST= <PPPPPPPPPPPPPPP>
##$VTLIST= <TTTTTTTTTTTTTTT>
##$WBST= 1024
##$WBSW= 4
##$XGAIN= (0..3)
0 0 0 0
##$XL= 0
##$YL= 0
##$YMAX_a= 1173522048
##$YMIN_a= -1397369.344
##$ZGOPTNS= <>
##$ZL1= 120
##$ZL2= 120
##$ZL3= 120
##$ZL4= 120
##$ABSF1= 10
##$ABSF2= 0
##$ABSG= 5
##$ABSL= 3
##$ALPHA= 0
##$AQORDER= 0
##$ASSFAC= 0
##$ASSFACI= 0
##$ASSFACX= 0
##$ASSWID= 0
##$AUNMP= <proc_1d>
##$AXLEFT= 0
##$AXNAME= <>
##$AXNUC= <off>
##$AXRIGHT= 0
##$AXTYPE= 0
##$AXUNIT= <>
##$AZFE= 0.1
##$AZFW= 0.1
##$BCFW= 1
##$BC_mod= 2
##$BYTORDP= 0
##$COROFFS= 0
##$CY= 15
##$DATMOD= 1
##$DC= 2
##$DFILT= <>
##$DTYPP= 0
##$F1P= 0
##$F2P= 0
##$FCOR= 0.5
##$FTSIZE= 0
##$FT_mod= 4
##$GAMMA= 1
##$GB= 0
##$INTBC= 1
##$INTSCL= 1
##$ISEN= 128
##$LB= 0.3
##$LEV0= 0
##$LPBIN= 0
##$MAXI= 10000
##$MC2= 0
##$MEAN= 0
##$ME_mod= 0
##$MI= 0
##$NCOEF= 0
##$NC_proc= -9
##$NLEV= 6
##$NOISF1= 0
##$NOISF2= 0
##$NSP= 1
##$NTH_PI= 0
##$NZP= 0
##$OFFSET= 14.68834
##$PC= 1
##$PHC0= 0
##$PHC1= 0
##$PH_mod= 0
##$PKNL= yes
##$PPARMOD= 0
##$PPDIAG= 0
##$PPIPTYP= 0
##$PPMPNUM= 2147483647
##$PPRESOL= 1
##$PSCAL= 4
##$PSIGN= 0
##$PYNMP= <proc.py>
##$REVERSE= no
##$SF= 90.2741330231684
##$SI= 8192
##$SIGF1= 0
##$SIGF2= 0
##$SINO= 400
##$SIOLD= 32768
##$SPECTYP= <>
##$SREGLST= <1H.CDCl3>
##$SSB= 0
##$STSI= 0
##$STSR= 0
##$SW_p= 1497.18866228788
##$SYMM= 0
##$S_DEV= 0
##$TDeff= 0
##$TDoff= 0
##$TI= <>
##$TILT= no
##$TM1= 0
##$TM2= 0
##$TOPLEV= 0
##$USERP1= <user>
##$USERP2= <user>
##$USERP3= <user>
##$USERP4= <user>
##$USERP5= <user>
##$WDW= 1
##$XDIM= 8192
##$YMAX_p= 1173521920
##$YMIN_p= -1397248
##$CURPLOT= <PDFCreator>
##$CURPRIN= <$PDFCreator>
##$DFORMAT= <normdp>
##$LAYOUT= <+/1D_H.xwp>
##$LFORMAT= <normlp>
##$PFORMAT= <normpl>
##$SURQMSG= 1
$$ End of Bruker specific parameters
$$ ---------------------------------
##XUNITS= HZ
##YUNITS= ARBITRARY UNITS
##XFACTOR= 0.182762287876938
##YFACTOR= 1
##DELTAX= -0.182762287876938
##NPOINTS= 8192
##FIRSTX= 1497.0059
##FIRSTY= -1397248
##LASTX= 0
##MAXY= 1173521920
##MINY= -1397248
##XYDATA= (X++(Y..Y))
$$ plain form
8191 -1397248 136704 353280 -849920 -487424 246784 -112128 -201728 193024 499712 715776
8181 715776 198656 371712 188416 -122368 278016 -340992 -46592 -316416 395264 231424
8171 231424 -631296 -1293824 -281088 77824 529408 -921600 394752 -585728 64000 -563712
8160 179200 -71680 1042432 -321024 13824 301056 86528 247808 428544 138752 -241664
8149 466944 1110016 -201216 -144896 579584 758784 400384 -150528 254976 795136 -21504
8138 -817152 1393664 162816 -992256 14848 318976 243200 502272 700416 996352 235520
8127 -50176 -610304 -28672 -24064 -66048 -346624 -150528 817152 -50688 798720 151040 -679936
8115 181248 128512 -183808 -156672 -1090560 -44032 -1157632 -52224 57344 444928 353792 1262080
$$ packed form
8191a397248A36704K16576h49920L62496B46784a12128q9600A93024L06688K16064
8181G15776A98656J73056j83296a22368B78016c40992d6592k69824C95264j63840
8171B31424f31296o62528b81088G7824M51584i21600C94752e85728F4000e63712
8160A79200g1680A042432c21024A3824K87232H6528J61280J80736A38752b41664
8149D66944O43072b01216N6320E79584J79200l58400a50528B54976N40160b1504
8138h17152A393664A62816i92256A4848L04128p5776K59072J98144K95936B35520
8127e0176n60128b8672M608m1984k80576a50528H17152e0688G98720A51040f79936
8115A81248n2736a83808K7136r33888d4032j113600e2224E7344L87584r1136R08288
$$ plain form
8104 1262080 1231360 -839680 -510464 -738304 105472 452608 171520 196608 196608 53760 582656
8093 582656 190464 -233472 189952 -514560 266752 -235008 1223680 332288 -414720 -470528
8083 -470528 569344 437248 -243712 -929280 492544 734208 -259584 -77312 133120 421888
8073 421888 -443904 841728 741888 -70656 42496 244224 -522240 -593920 629760 -285184
8062 907264 -225792 1042432 -110080 -464384 169472 -169472 -249856 -299008 826880 -18432
8051 1132032 323584 -701952 384512 1536 638464 -35840 1269760 50688 1050112 -182272
8040 -306176 -15360 329216 442880 186368 157696 -142848 1101824 531968 1209856 -446464
8029 302080 657920 280576 -386048 636928 852480 -860160 -125440 265728 -347648 670208
$$ packed form
8104A262080l0720h39680L29216k27840A05472L47136A71520K5088%E3760N28896
8093E82656A90464b33472A89952e14560B66752b35008A223680C32288d14720n5808
8083d70528E69344j32096b43712o85568D92544K41664b59584g7312A33120K88768
8073D21888d43904H41728r9840g0656D2496K01728e22240p1680F29760b85184
8062I07264b25792A042432a10080l54304A69472a69472q0384m9152H26880a8432
8051A132032C23584g01952C84512A536O36928c5840A269760E0688R99424a82272
8040c06176a5360C29216J13664A86368k8672a42848A101824E31968O77888d46464
8029C02080L55840B80576c86048F36928K15552h60160a25440B65728c47648F70208
$$ plain form
8018 339456 -218624 529920 -43008 169984 1437184 -300032 -765440 621056 -172544 -837632
8008 -837632 142848 -566784 467968 313344 -187392 248832 -248832 -862208 548864 -705024
7997 480256 17920 -338432 -68608 112640 61440 722432 81408 -310784 564224 605184 -168448
7985 -1077760 1177088 -350720 349696 123392 186880 -50688 -68096 630272 609792 345600
7975 345600 -5632 536576 1431552 -223232 -376832 -177152 344064 -170496 222720 -444416
7964 949248 898048 408064 9728 362496 832512 918016 668672 1093120 1314816 218624
7953 -512000 155648 1092608 904704 -57344 478208 621568 -375808 -130048 -113664 -192512
7943 -192512 -106496 -138752 448512 438272 73728 -206848 473600 232960 -371712 381440
$$ packed form
8018C39456b18624E29920d3008A69984J267200c00032m65408F21056a72544o65088
8008h37632A42848e66784D67968j54624a87392B48832b48832o13376E48864g05024
7997D80256A7920c38432f8608A12640n1200O60992H1408c10784E64224M0960a68448
7985a077760A177088c50720C49696A23392O3488e0688j7408F30272k0480k64192
7975C45600e632E36576Q94976b23232j53600a77152C44064a70496B22720d44416
7964I49248n1200D08064I728L52768M70016Q5504k49344M24448K21696B18624
7953e12000A55648R36960j87904e7344D78208J43360c75808a30048J6384p8848
7943a92512Q6016l2256D48512j0240G3728b06848D73600B32960c71712C81440
$$ plain form
7932 161792 -108544 1292800 198144 181760 -106496 -94720 -286720 38912 -135680 152064
7921 377344 422400 348672 -103936 -150528 586752 461824 -110080 1029120 290816 -689664
7910 1203712 747520 -17408 482304 171520 262656 626176 1013760 230912 -417280 -25088
7899 242176 -271872 -159232 -490496 524288 440832 834048 65536 -160256 312320 564736
7889 564736 190464 -51200 -313856 228864 -672768 -128000 -384512 -1396736 272896 456704
7879 456704 47104 1199616 145920 553472 1478656 1156096 -183296 -330240 535552 385024
7869 385024 820736 -76288 133632 301568 -357888 1190912 875520 -57344 -196096 622080
7858 944640 -316928 569344 196608 -502784 128512 -309248 1456640 356864 -222208 491008
$$ packed form
7932A61792a08544A292800A98144j6384a06496J1776j92000C8912a35680A52064
7921C77344M5056p3728a03936m6592E86752j24928a10080A029120B90816f89664
7910A203712m56192a7408D82304A71520R1136L63520L87584B30912d17280b5088
7899B42176b71872J12640l31264E24288q3456L93216F5536a60256C12320K52416
7889E64736A90464e1200k62656B28864f72768a28000k56512j012224B72896J83808
7879D56704D7104J152512A45920M07552R25184l22560a83296j46944E35552j50528
7869C85024M35712g6288A33632J67936c57888A190912l15392e7344j38752F22080
7858I44640c16928E69344A96608e02784A28512c09248A456640C56864b22208D91008
$$ plain form
7847 969728 410624 -649728 65536 640512 787968 -652800 459264 626176 427520 107008
7836 -132608 409088 274944 644608 645120 420864 155136 67072 208896 -232448 402432
7825 1511424 6144 -738816 904192 -497152 432640 -1163776 -182272 736256 89600 711168
7815 711168 264192 1304064 -367104 -1059328 364032 17408 -134656 845312 328192 211456
7805 211456 245760 612352 112128 -552960 587264 807424 -311808 -119808 122880 -728576
7794 501760 -528384 -579072 269312 -139264 215040 158720 -478720 -260608 -408064 237056
7783 -200192 -240128 -35840 -247296 -417280 -203264 388096 1044480 533504 226816 149504
7773 149504 860160 970240 -551424 283648 -239616 971264 -144384 -72704 511488 -744960
$$ packed form
7847I69728D10624f49728F5536N74976J47456f52800D59264J66912j98656A07008
7836a32608D09088j34144L69664N12k24256A55136F7072J41824b32448D02432
7825A511424F144g38816I04192d97152D32640a163776a82272G36256H9600O21568
7815G11168B64192J039872c67104o92224C64032A7408a34656H45312C28192j16736
7805B11456L4304L66592A12128e52960E87264K20160c11808a19808A22880g28576
7794E01760e28384n0688B69312a39264B15040n6320d78720K18112j47456B37056
7783b00192l9936c5840k11456j69984b03264C88096O56384n10976B26816p7312
7773A49504P10656J10080e51424B83648b39616I71264a44384P1680E11488g44960
$$ plain form
7762 328704 -361472 -256512 -295936 134144 860672 -224768 -602112 547328 1012736 121344
7751 550912 923136 -358400 -241664 522752 730112 459776 59904 1073152 1271808 -118784
7740 811520 -312832 253440 -29696 -226304 521728 448000 135168 -284160 113664 -432640
7729 49664 607232 -353792 370688 706560 -60928 -335872 693760 -360960 -982528 149504
7718 -320512 -899072 1374720 372736 1651200 -519168 -710144 656896 947200 -349184
7708 -35840 376832 555008 -450560 -260096 -272896 358912 377344 1606656 -208384 337920
7697 256512 -43008 360960 571392 -266240 -412672 38912 397824 -72192 -337408 1316864
7686 775168 312832 -42496 -699392 -130560 1191936 473600 468992 615936 140800 389120
$$ packed form
7762C28704c61472J04960l9424A34144P26528b24768l77344E47328M65408A21344
7751E50912L72224c58400J16736E22752K07360k70336E9904J013248J98656a18784
7740H11520c12832B53440b9696j96608E21728p3728A35168b84160A13664d32640
7729D9664N57568c53792C70688L35872f0928k74944F93760c60960o21568A49504
7718c20512n78560A374720C72736J278464e19168j90976F56896K90304c49184
7708c5840C76832J78176d50560J90464j2800C58912J8432J229312b08384C37920
7697B56512d3008C60960K10432b66240j46432C8912L58912g2192k65216A316864
7686G75168C12832d2496o56896a30560A191936D73600m608J46944A40800K48320
$$ plain form
7676 389120 -43008 -172544 109056 -555520 -249344 -377344 281088 856576 159744 1024
7665 -214016 -179712 655360 588288 204288 263680 542720 539136 -15360 -75264 -282624 482304
7653 321024 -68096 -271360 81920 45056 -222208 -150016 334848 -64512 1292288 -209408
7642 863232 243200 134144 -39424 381952 313344 551936 10752 119296 -782336 221184
7631 -179200 133120 796672 1082880 -1027072 120320 -15360 -678400 277504 906240 358912
7620 231424 1275392 298496 -87040 -21504 -310784 -372224 -90624 -516608 504320 1287168
7610 1287168 632832 -15872 489472 360448 1168384 973824 29184 524288 -623104 753152
7599 384000 418816 61952 313344 1124352 1464832 -53248 138752 333312 827904 92672
$$ packed form
7676C89120d3008j29536A09056e55520b49344j28000B81088N75488A59744A024
7665b14016L4304F55360o7072B04288N9392K79040l584a5360n9904k07360D82304
7653C21024f8096k03264H1920l6864b22208P2192C34848f4512A292288b09408
7642H63232B43200j09056c9424C81952o8608K38592A0752J08544g82336B21184
7631a79200A33120O63552K86208a027072A20320a5360o63040B77504O28736C58912
7620B31424J043968B98496h7040b1504k89280o1440i0624m25984E04320P82848
7610A287168F32832a5872D89472j29024Q07936j94560B9184M95104f23104G53152
7599C84000L4816F1952K51392Q11008L40480e3248A38752J94560M94592I2672
$$ plain form
7588 679424 -682496 611328 -225280 708608 1260032 1207808 576000 -435200 480256 487936
7578 487936 -91648 -59392 381440 -117248 786432 212992 595968 67584 488960 -151552
7567 -201216 647168 -515072 878592 -517632 1282048 699392 470016 -82944 229888 638464
7557 638464 -735232 279040 249344 1383424 -166912 370176 444416 443392 -55296 100352
7546 -99328 142848 76288 250880 186368 222720 -81408 737280 37888 147456 1167872 -312832
7534 -1017344 318464 480768 -342528 269824 -45568 -172544 14336 424448 440832 -316928
7523 -734720 308736 -751616 928256 1398784 571904 717312 -379904 199168 647168 -13312
7512 -286208 -416768 936448 -99328 571904 570880 -376320 570880 297472 -12800 598528
$$ packed form
7588F79424f82496F11328b25280G08608N51424n2224E76000d35200D80256P680
7578D87936i1648L2256C81440a17248G86432B12992L82976F7584M21376a51552
7567b01216F47168e15072H78592e17632A282048n82656k29376h2944B29888M08576
7557F38464g35232B79040k9696J134080a66912C70176P4240j024e5296A00352
7546i9328A42848o6560J74592o4512L6352h1408G37280C7888J09568J020416c12832
7534a017344C18464J62304c42528B69824d5568j26976A4336M10112J6384c16928
7523g34720C08736g51616I28256M70528E71904J45408c79904A99168M48000a3312
7512b86208j30560I36448i9328E71904j024c76320E70880k73408a2800E98528
$$ plain form
7501 -615936 429568 766464 396800 -46080 411136 906240 -91648 500736 -520192 -193024
7490 689152 -198656 -93696 832512 -569344 595968 612352 453120 190976 -332288 473600
7479 -489472 -197632 751104 -570368 566784 -442880 -240128 -117760 131072 647680 230912
7468 -89600 -233472 -68608 -36864 329728 900096 508416 551936 851968 851968 498176 1335808
7457 1335808 -189952 483840 929792 865280 76288 -399872 216064 816128 962048 1100288
7447 1100288 -22528 -805376 771584 657408 130560 1064960 -471552 255488 893952 -142336
7436 822784 555520 -223232 1095680 940544 -554496 132608 -406016 650752 1204736 -27136
7425 197120 165376 1780736 -924672 272384 793088 -390144 14336 580608 695296 -96768
$$ packed form
7501f15936D29568L36896l69664d6080D11136M95104i1648E00736e20192a93024
7490F89152a98656i3696H32512e69344E95968J6384j59232A90976c32288D73600
7479d89472a97632G51104e70368E66784d42880K02752a17760A31072N16608B30912
7468h9600j43872f8608L1744C29728N70368l91680M3520L00032%l53792Q37632
7457A335808a89952D83840M45952o4512G6288c99872B16064O00064J45920J38240
7447A100288b2528p82848G71584j14176A30560R34400d71552B55488O38464a42336
7436H22784k67264b23232A095680j55136e54496A32608d06016F50752N53984b7136
7425A97120l1744J615360i24672B72384N20704c90144A4336N66272J14688i6768
$$ plain form
7414 817664 -145920 -577536 750592 -321024 1195008 526848 709120 413696 -31744 -82944
7404 -82944 872448 512 1100288 262144 456192 776704 -189440 196096 459264 527872
7394 527872 292864 -367104 56320 -455680 76800 369152 444928 -214528 87552 -26112 321024
7382 439296 628224 515584 -216064 392704 1270784 704000 -322048 649216 30720 595968
7372 595968 1240064 -123392 1192960 389120 -140288 -30720 1078272 -629248 657920 2560
7361 772608 -66048 881664 -568832 729088 -179712 708096 -177664 165376 220672 -102912
7350 954368 824832 601600 480768 942592 -78336 870400 569856 510464 -432640 663040
7339 -97280 -395776 -477696 525824 1149440 68096 148480 850944 359424 -523264 336384
$$ packed form
7414H17664a45920m31616G50592c21024A195008E26848J82272k95424c1744n1200
7404h2944H72448E12J099776B62144J94048L20512a89440A96096K63168O8608
7394E27872k35008c67104E6320d55680G6800K92352P5776b14528H7552b6112C21024
7382D39296J88928j12640b16064C92704Q78080n66784c22048F49216C0720N65248
7372E95968O44096a23392A192960C89120a40288c0720A078272f29248F57920B560
7361G72608f6048H81664e68832G29088a79712G08096a77664A65376N5296a02912
7350I54368j29536k23232j20832M61824g8336H70400l00544n9392d32640F63040
7339i7280k98496q1920E25824O23616F8096Q0384P02464C59424e23264C36384
$$ plain form
7328 -416256 541184 46592 -8704 408064 331776 427520 660480 814080 -463872 977920 264704
7316 79360 911360 1643008 1166336 770560 -608768 1045504 1056256 635392 -54784 1128960
7305 77824 802304 1265664 1028096 495104 -465408 257024 817664 559104 543744 850432
7295 850432 1620992 743424 29184 -191488 77312 649216 -265216 881152 250368 1353728
7285 1353728 715776 -520192 290816 -317440 179200 727552 -4608 -51200 142336 177664
7275 177664 1318912 -146944 263168 -332288 -46080 332288 773120 113152 169472 584704
7265 584704 377856 1230848 337920 177152 914432 647168 665600 -223232 -197120 216576
7254 443904 685568 524800 1306624 -515072 -90624 -422912 -228864 3072 1049600 63488
$$ packed form
7328d16256E41184D6592h704D08064p6288R5744K32960J53600d63872I77920B64704
7316G9360Q32000P31648m76672l95776f08768A045504J0752m20864e4784A128960
7305G7824P24480M63360k37568D95104d65408B57024N60640k58560j5360L06688
7295H50432P70560G43424B9184a91488G7312N71904b65216H81152B50368J103360
7285A353728o37952e20192B90816c17440A79200N48352d608m6592A42336L5328
7275A77664J141248a46944B63168c32288d6080C32288M40832A13152N6320M15232
7265E84704k06848Q52992C37920j60768P37280k67264J8432b23232K6112B16576
7254D43904K41664j60768P81824e15072i0624l32288J94048C072J046528F3488
$$ plain form
7243 173568 160256 -247808 -174592 595456 29696 689664 1240064 996352 1298944 796160
7233 796160 -512 -787968 -422912 -160768 425984 304128 30720 2004992 -309760 345088
7222 -182272 138240 581120 990720 883200 206848 932352 -635392 250880 201216 553472
7212 553472 160768 778752 124416 478208 -284160 64000 1056768 123904 478208 502784
7202 502784 897024 74752 -36352 -62464 -785408 783360 1259520 434688 304128 -586752
7191 957952 309760 179712 926720 786432 541184 819200 208896 351232 559104 326656
7181 326656 1499648 -65024 422912 -69632 881152 1067520 150528 444928 -120320 1492480
7170 347136 266240 366592 198144 803328 1167360 94208 -451584 -402432 138240 599040
$$ packed form
7243A73568j3312b47808P3216E95456B9696O59968N50400k43712L02592n02784
7233G96160e12p87456L65056a60768D25984j21856C0720J974272c09760C45088
7222a82272A38240M42880M09600j07520B06848P25504f35392B50880m9664L52256
7212E53472A60768O17984A24416L53792b84160F4000R92768A23904L54304K4576
7202E02784L94240G4752c6352k6112p22944G83360M76160D34688j30560e86752
7191I57952C09760j30048P47008j40288k45248K78016B08896J42336K07872k32448
7181C26656J172992f5024D22912f9632H81152J86368A50528K94400a20320A492480
7170C47136q0896J00352j68448O05184L64032I4208d51584M9152A38240M60800
$$ plain form
7160 599040 493568 1461760 3584 869376 601088 -308736 626176 1561088 -577536 1638912
7149 -224256 67072 573952 434176 598528 274944 765952 -438784 760320 1615360 656384
7138 411648 1117184 980992 534016 -241664 -297472 439808 -148992 702464 519168 191488
7127 -504832 250368 47104 522240 1099264 417280 867840 244224 1310208 209920 -567808
7116 542720 840192 -70656 1520640 -106496 121344 512000 399872 682496 448512 940544
7106 940544 -82944 395776 23040 -50688 812544 2071040 621568 -221184 -719360 -125440
7095 431104 18944 -371712 322048 894464 101888 904192 378880 851968 302592 66560
7084 850944 948736 110592 -189952 497664 656896 72192 -184320 354816 545280 788992
$$ packed form
7160E99040j05472R68192C584Q65792k68288c08736F26176R34912e77536A638912
7149b24256F7072N06880j39776J64352B74944M91008d38784G60320Q55040F56384
7138D11648P05536j36192m46976b41664n5808D39808a48992G02464j83296A91488
7127e04832B50368D7104M75136N77024D17280M50560B44224J065984B09920e67808
7116E42720K97472g0656A520640a06496A21344L90656j12128K82624k33984M92032
7106I40544h2944C95776B3040e0688H12544J258496F21568b21184m98176a25440
7095D31104A8944c71712C22048N72416A01888Q02304C78880M73088C02592F6560
7084H50944R7792A10592a89952D97664J59232G2192a84320C54816J90464K43712
$$ plain form
7074 788992 630784 688128 172032 592896 1096704 820224 470528 48128 288768 -450048
7063 366592 304640 -197632 -507904 692224 133632 555520 339456 1102848 -99328 735744
7052 -879104 483840 113152 -16384 388096 541696 401408 165888 -516608 284672 -172032
7041 718848 -68608 696320 656384 448512 1146368 -145408 1066496 -239616 -36352 -24576
7031 -24576 -82432 -1376256 605696 740864 -107520 975872 1061376 444928 -10240 333824
7020 340992 -13824 525312 40448 1158656 613888 455680 356352 844800 218112 440320
7010 440320 987136 -122880 344064 -43008 -458752 1046528 735744 37376 413184 626688
7000 626688 343040 698368 51200 912384 -136192 269312 437760 479232 869376 -444416
$$ packed form
7074G88992j58208N7344A72032M20864N03808k76480l49696D8128K40640d50048
7063C66592o1952a97632l10272F92224A33632M21888k16064P63392i9328G35744
7052h79104D83840A13152a6384C88096J53600j40288A65888e16608B84672a72032
7041G18848f8608F96320l9936k07872O97856a45408A066496b39616c6352J1776
7031b4576n7856j293824F05696J35168a07520I75872Q5504D44928a0240C33824
7020C40992a3824E25312D0448J118208n44768j58208r9328M88448B18112K22208
7010D40320N46816a22880C44064d3008m15744A046528l10784C7376L75808K13504
7000F26688k83648L55328E1200Q61184a36192B69312J68448M1472L90144d44416
$$ plain form
6989 -467456 309248 712704 1438720 324096 626688 785920 -340992 1423360 935424 -336384
6978 1597440 1064448 -1024 759808 -143872 504832 654848 780288 -305152 -433152 -65536
6967 371712 579584 618496 359936 -35840 -66560 660480 796160 482816 -165888 271872
6956 249344 -299008 809984 1191936 654336 577536 379392 289792 -450560 -259072 178688
6945 772096 1391616 -233472 538112 -513024 312320 210432 -320000 309760 787968 734720
6935 734720 -49152 252416 1057792 650752 126976 308224 17408 684544 258048 -249344
6924 -114176 345600 -178688 538112 1156096 -77312 1548288 798720 901120 224256 -180736
6913 1028608 236544 353792 1040896 -137216 527360 -236544 -709120 42496 1758208 -425984
$$ packed form
6989d67456C09248M03456P26016C24096L02592J59232c40992A423360m87936c36384
6978A597440n32992a024G59808a43872E04832J50016J25440c05152j28000f5536
6967C71712K07872L8912k58560c5840l0720F60480J35680l13344a65888B71872
6956B49344b99008H09984L81952n37600p6800j98144q9600d50560J91488A78688
6945G72096O19520b33472E38112e13024C12320j01888c20000C09760M78208n3248
6935G34720d9152B52416Q05376m07040A26976J81248A7408O67136B58048b49344
6924a14176C45600a78688E38112O17984g7312A548288p49568J02400B24256a80736
6913A028608B36544J17248O87104a37216E27360b36544m72576D2496J715712d25984
$$ plain form
6902 1094656 347136 -609280 552960 -33792 -49152 464896 131072 791040 652800 767488
6892 767488 -254976 -11776 261120 964608 -44544 -32768 326144 816128 877568 612864
6882 612864 99328 579584 355328 332288 263168 1543680 -228864 87552 -40448 139776
6871 834560 82432 1278976 444928 116736 -230912 993792 1253888 -436736 515584 308736
6861 308736 -400384 5120 108544 197632 1082880 579584 852480 322048 982528 -487936
6850 364544 -605184 437760 527872 1012224 453632 579584 -57856 659456 -604160 1051136
6839 572416 464384 390656 -480256 164864 169472 562688 58368 1252352 1675776 1274880
6829 1274880 27648 1246720 576000 -326656 1294336 1268224 663552 559616 212480 278016
$$ packed form
6902A094656C47136f09280E52960c3792j5360D64896A31072O59968j38240J14688
6892G67488b54976a1776B61120P03488d4544J1776C26144M89984O1440k64704
6882F12864I9328M80256k24256k3040o9120J280512b28864H7552d0448A39776
6871H34560H2432J196544D44928A16736b30912I93792K60096d36736E15584k06848
6861C08736d00384E120J03424Q9088Q85248n03296K72896C22048O60480d87936
6850C64544f05184D37760R0112M84352D53632J25952e7856F59456f04160A051136
6839E72416j08032p3728d80256A64864M608L93216E8368J193984M23424m00896
6829A274880B7648J219072E76000c26656A294336k6112o04672j03936B12480O5536
$$ plain form
6819 278016 1178624 633856 124416 134144 -488448 609792 -493568 659968 1067008 109568
6808 219648 616448 792064 -535040 -193024 1317888 380928 -58880 339456 654336 -301056
6797 245248 472576 787968 869888 520704 563712 -270848 463360 -33280 654848 4608 1315328
6786 1315328 552448 378880 784896 55296 435712 200192 1265152 448512 -245248 284672
6775 80896 309760 481792 427520 -527872 117248 854016 177664 604672 371200 1724928
6765 1724928 379904 307200 861184 909824 813568 83456 295424 90112 456704 1034752
6755 1034752 904192 94208 742912 361472 -16384 186368 272896 711680 -304128 175104
6744 1402368 310272 711680 559104 808448 409600 -200704 591360 794112 -604672 583168
$$ packed form
6819B78016R00608n44768A24416R728d88448F09792d93568F59968M07040A09568
6808B19648L96800J75616e35040a93024A317888C80928e8880C39456L14880c01056
6797B45248K27328L15392Q1920l49184M3008b70848D63360c3280F54848D608J310720
6786A315328E52448j73568M06016E5296L80416B00192J064960D48512b45248B84672
6775H0896K28864J72032n4272e27872A17248P36768A77664M27008k33472J353728
6765A724928C79904p2704N53984M8640r6256H3456K11968I0112L66592N78048
6755A034752j30560I4208O48704C61472a6384A86368Q6528M38784c04128A75104
6744A402368C10272M01408j52576K49344l98848b00704E91360K02752f04672E83168
$$ plain form
6733 553472 843264 29696 51712 -274944 -147968 -491520 1045504 -616448 529408 602112
6723 602112 669184 276480 -392192 -816128 491008 -49152 -138752 163840 1142272 -353280
6712 329216 -405504 -77824 -220160 474624 901632 359936 408576 192000 562176 718848
6702 718848 -61952 611840 122880 -25088 -306176 437248 9728 -1254912 -170496 982016
6691 299008 -243712 260096 -221696 611328 -564736 261120 -822272 -931840 -785408 1203200
6680 747008 563712 86016 491008 396288 -949248 505344 336384 227840 269312 473600
6670 473600 -209920 722432 1091072 1461760 704000 -235520 900608 -1210368 1223680
6660 909824 1610752 249344 1152000 1197568 -243712 88064 187904 687104 651264 166912
$$ packed form
6733E53472K89792B9696K2016b74944J26976l43552A045504f16448E29408P2704
6723F02112O7072B76480c92192m23936D91008d9152q9600A63840R78432c53280
6712C29216d05504g7824j42336D74624M27008C59936M8640A92000L70176J56672
6702G18848f1952F11840A22880b5088k81088D37248I728a254912a70496I82016
6691B99008b43712B60096b21696F11328e64736B61120h22272j09568J46432A203200
6680G47008j83296H6016M04992r4720i49248E05344j68960j08544M1472K04288
6670D73600b09920G22432L68640L70688G04000b35520I00608a210368A223680
6660I09824P00928B49344R02656M5568b43712H8064R9840M99200l5840A66912
$$ plain form
6649 400896 1956864 1052160 1112064 -95232 -306688 1196544 -998400 -467968 1084416 -859136
6638 838144 -79872 290304 1104896 -138752 1587712 480256 -22016 994304 1199104 322048
6627 878080 -59392 -118272 1011200 663040 942592 -240640 1151488 -225792 452096 399872
6617 399872 231936 -587264 438784 612352 -221184 1243648 -93696 -232448 736256 -91648
6606 532992 564736 256000 1418752 240640 -13312 -195072 328192 -226304 -226816 -677376
6596 -677376 -538112 968704 -290304 328192 -186368 894976 298496 28160 219136 236544
6586 236544 1044480 901120 -347136 510976 654848 376832 1010176 744448 465920 970240
6576 970240 66560 1281536 989696 710656 608768 1096192 1239040 -193536 -177664 1038848
$$ packed form
6649D00896J555968r04704N9904i5232k11456A196544i98400d67968A084416h59136
6638H38144g9872B90304Q14592a38752A587712D80256b2016I94304K04800C22048
6627H78080e9392n8880A011200l48160K79552b40640A151488b25792D52096n2224
6617C99872j67936e87264D38784J73568b21184A243648i3696j38752G36256i1648
6606E32992L1744B56000J162752B40640a3312j81760C28192b26304n12m50560
6596f77376J39264I68704b90304C28192a86368H94976B98496B8160J90976J7408
6586B36544Q07936j43360c47136E10976J43872k78016O33344k65728k78528N04320
6576I70240F6560J214976k91840k79040j01888M87424J42848a93536J5872A038848
$$ plain form
6565 -640512 -838144 43008 604160 1836032 647168 653312 49664 853504 1357312 737280
6555 737280 3072 667136 815616 598016 -220672 452096 1216512 1128960 189952 -1009664
6544 662016 -264704 237568 645632 316928 107520 367616 1681920 595456 184832 159232
6534 159232 957440 930816 1070592 924672 317952 726528 1382912 807424 979968 1218560
6524 1218560 -289280 239104 -197632 -25088 605696 -1024 410112 295424 -290304 944128
6513 844800 1105408 847360 163328 1260544 -486400 379904 -63488 -236544 -246784 896512
6502 701440 249856 710144 800768 -155136 685568 479744 776192 -255488 431616 1675776
6492 1675776 1098752 33792 677888 -1536 812544 -745472 643584 616960 1414656 1690624
$$ packed form
6565f40512j97632D3008N61152J231872F47168O144D9664Q03840N03808o20032
6555G37280C072O64064J48480k17600b20672D52096P64416q7552A89952a009664
6544F62016b64704B37568M08064C16928A07520K60096J314304E95456A84832k5600
6534A59232P98208k6624J39776j45920C17952M08576O56384n75488J72544K38592
6524A218560b89280B39104a97632b5088F05696a024D10112j14688b90304I44128
6513H44800K60608k58048A63328J097216d86400C79904f3488j73056j0240H96512
6502G01440B49856M60288R0624a55136F85568k05824K96448b55488D31616J244160
6492A675776n77024C3792O44096a536H12544g45472F43584k6624P97696K75968
$$ plain form
6482 1690624 391168 -534016 825344 458240 354304 497664 492032 416768 -320000 -509440
6472 -509440 599040 1351168 588288 160256 509952 462336 401920 239616 719872 512512
6462 512512 -305664 -13312 924160 846336 630784 -135168 884736 1116672 219136 11264
6451 998912 313344 464384 193024 -71168 943104 233472 -45568 632832 -1190912 263680
6440 1411072 100864 1036800 1066496 249344 632832 407040 518656 138752 914944 455680
6429 831488 1104896 512000 292352 372736 1507328 690176 557568 234496 644096 192512
6418 516096 1779200 588288 1243136 254464 620032 333824 99328 15872 -226304 -8704
6407 339456 67072 1020928 -535040 630784 352256 997376 1204224 706560 529920 499712
$$ packed form
6482A690624C91168e34016H25344l67104j03936J43360n632p5264c20000j89440
6472e09440E99040P52128E88288A60256L49696m7616o0416j62304M80256k07360
6462E12512c05664a3312I24160p7824k15552a35168H84736K31936B19136A1264
6451I98912C13344J51040A93024g1168I43104B33472d5568F32832a190912B63680
6440A411072A00864R35936K9696B49344L83488k25792J11616A38752P76192D55680
6429H31488K73408E12000k19648Q0384J134592F90176j32608B34496M09600A92512
6418E16096J263104E88288O54848B54464L65568k86208I9328A5872b26304h704
6407C39456F7072R53856e35040F30784k78528O45120K06848m97664j76640l0208
$$ plain form
6397 499712 889344 -562176 213504 942080 264704 304640 786432 819712 36352 -623104
6386 369152 853504 111104 1250304 161280 803328 917504 1084416 1134592 742400 -2560
6375 483328 591872 526848 944128 -954880 -240640 707584 987648 284672 382976 105984
6364 272384 958976 530944 5632 880128 -126976 1644544 246272 222720 -359424 1255936
6353 331776 818688 868864 797696 1292288 376832 775680 668160 514560 739328 22528
6342 -361472 137728 -153088 -187904 649728 -326144 450560 424448 678400 -138240 277504
6331 484352 14336 863744 808960 574464 1397248 1347584 672256 814592 -68608 974336
6320 1160192 875520 500736 -443904 547840 597504 1380864 -126464 634880 390656 524288
$$ packed form
6397D99712L89632e62176B13504P28576B64704L9936M81792L3280C6352f23104
6386C69152M84352A11104J139200A61280O42048J14176J66912N0176l92192b560
6375D83328J08544o5024M17280i54880b40640G07584K80064B84672R8304A05984
6364B72384O86592m28032E632Q74496a26976A644544B46272k3552c59424A255936
6353C31776M86912N0176p1168M94592C76832L98848j07520j53600K24768B2528
6342c61472A37728a53088l4816F49728c26144D50560k6112K53952a38240B77504
6331D84352A4336Q49408n4784k34496Q22784m9664F72256J42336f8608I74336
6320A160192k84672l74784d43904E47840M9664P83360a26464F34880k44224J33632
$$ plain form
6310 524288 -55808 900096 66560 1065472 875008 757248 254976 251904 852480 974336
6300 974336 1231872 848896 952320 70656 676352 414208 587264 -163840 -61952 880640
6289 993280 604160 212992 987136 1013248 1064960 421376 318464 1428480 242176 403456
6279 403456 55296 290816 721920 1000960 873472 670720 946688 431104 943104 453632
6268 -416768 70656 854528 1179648 551936 434176 917504 1085440 875520 989696 715776
6258 715776 1595904 -238592 1048576 151552 287232 1073664 1435136 690176 552960 1063424
6248 1063424 1097728 972288 1212928 500736 419328 895488 202240 51200 1051648 458752
6237 505344 -188416 -716288 1144320 719360 620032 703488 -256512 454144 227328 461312
$$ packed form
6310E24288e5808I00096F6560R98912j90464j17760B54976l072O00576J21856
6300I74336K57536l82976J03424G0656O05696k62144J73056a63840f1952H80640
6289I93280l89120B12992P74144K6112N1712D21376j02912J110016B42176J61280
6279D03456E5296K35520M31104K79040j27488k02752K75968D31104N12000D53632
6268d16768G0656P83872L25120E51936j17760M83328J67936k09920J14176k73920
6258G15776Q80128b38592A048576A51552J35680P86432L61472F90176j37216N10464
6248A063424L4304j25440K40640E00736q1408M76160B02240E1200J000448D58752
6237E05344a88416n27872A144320m24960r9328Q3456b56512D54144k26816K33984
$$ plain form
6227 461312 336896 1033728 652288 -154624 1182720 274944 45056 38400 -648704 993792
6216 1088512 747008 253440 786944 65024 -479232 180224 -321536 1056768 999424 1047040
6206 1047040 430592 -59392 1967616 17920 67584 1603584 1197568 1289728 134144 662528
6196 662528 -289792 224256 720896 372224 338944 994304 87040 815616 421888 562176
6186 562176 131584 434176 -238592 1536512 174080 43520 1024000 139776 594944 1511936
6176 1511936 412160 552448 504320 29184 868352 -18432 1795072 252416 1339392 1584640
6166 1584640 221696 512000 527872 297472 -30208 568832 454656 880128 102400 107520
6156 107520 -347136 548352 1094144 1504256 841728 1935360 1048576 1471488 450048 6144
$$ packed form
6227D61312j24416O96832l81440a54624A182720B74944D5056o656f48704I93792
6216A088512l41504B53440N33504F5024d79232A80224c21536A056768n7344M7616
6206A047040D30592e9392A967616A7920M9664J536000m06016R2160A34144N28384
6196F62528b89792B24256M96640l48672l3280O55360H7040P28576l93728J40288
6186E62176A31584L02592b38592A536512A74080D3520R80480A39776M55168R16992
6176A511936D12160J40288m8128B9184Q39168a8432A795072B52416J086976K45248
6166A584640B21696K90304J5872k30400c0208E68832j14176M25472A02400N120
6156A07520c47136E48352N45792M10112o62528J093632q86784M22912D50048F144
$$ plain form
6145 234496 1033728 194560 850432 1637376 -897536 1350656 581120 81920 915968 138240
6134 -228352 97280 39424 762368 374784 209408 1130496 -586752 -19968 198656 246784
6124 246784 1019904 143872 191488 -66048 1746432 1171456 962048 -405504 516608 407040
6114 407040 250880 -601088 908800 276480 492544 1066496 745472 780288 1148416 452096
6103 374272 598528 356864 1482240 943616 722432 672256 807936 896000 20480 1133568
6093 1133568 777216 741376 361472 801280 -542720 306176 567808 80896 309248 513024
6083 513024 907776 119296 -347648 823296 317440 1247744 988160 1254912 -93184 768000
6072 1079296 637440 434176 1918464 724480 399360 185344 783872 2184192 1366528
$$ packed form
6145B34496P99232A94560O55872P86944h97536A350656E81120H1920Q34048A38240
6134b28352I7280C9424P22944C74784j65376R21088e86752a9968A98656M8128
6124B46784P73120A43872M7616f6048A746432n74976k09408d05504E16608j09568
6114D07040j56160f01088I08800B76480K16064N73952l21024L4816L68128D52096
6103C74272K24256k41664J125376n38624k21184n0176J35680Q8064B0480J113088
6093A133568l56352l5840C61472M39808e42720C06176K61632H0896K28352K03776
6083E13024L94752A19296c47648H23296C17440R30304k59584K66752i3184G68000
6072A079296m41856k03264J484288G24480l25120A85344N98528J400320q17664
$$ plain form
6063 1366528 811520 832000 1413120 549376 424960 386560 884224 -343552 567808 449024
6053 449024 94720 3072 1459200 1117184 275968 1271808 -61440 860672 927232 7168 480256
6042 480256 941056 739840 1537024 1017856 -102400 1018880 376832 1211904 -468480 410624
6031 756736 381440 1659904 474624 1040896 1004544 1222656 -49152 1235968 712704 -4096
6020 476672 933888 75776 1011712 520192 464896 1639936 1482752 8704 1707008 -495616
6009 1221632 725504 523776 474624 -205824 1568256 1109504 -189440 846336 1436672 623616
5998 846336 338944 1721344 181248 1228288 482816 638976 1145856 619008 120832
5988 225792 1441280 14336 1063936 1125888 353280 797696 231424 596480 795648 350720
$$ packed form
6063A366528n55008K0480N81120E49376j24416l8400M97664c43552E67808j18784
6053D49024I4720C072J456128l42016B75968R95840f1440H60672O6560G168M73088
6042D80256M60800k01216P97184n19168a02400A018880C76832Q35072d68480D10624
6031G56736l75296J278464D74624N66272l6352K18112d9152A235968n23264d096
6020D76672M57216G5776R35936m91520n5296J175040j57184H704J698304d95616
6009A221632m96128k01728m9152b05824A568256m58752a89440H46336N90336F23616
5998H46336C38944J382400A81248J047040D82816J56160N06880n26848A20832
5988B25792J215488A4336J049600O1952C53280M44416B31424L65056J99168C50720
$$ plain form
5977 582656 158208 1207808 545280 -469504 448512 1114624 649728 708608 713728 251392
5966 746496 953856 352768 675328 1332736 877056 1407488 6656 -687616 1060864 1691648
5956 1691648 1116672 599552 677888 952832 664064 791040 676864 1060352 1601024 121856
5945 246272 798208 395776 1455616 606720 217088 1384960 1525760 807936 400384
5935 217600 127488 802304 1409024 1882112 1122304 1262080 560128 265216 510464 -527360
5924 676864 1021952 581632 574976 1006080 815104 1267200 1603072 -343040 1305600 1073664
5914 1073664 450048 1621504 96768 1195520 612352 552960 892416 290816 435712 1606144
5904 1606144 1434112 1371648 -598016 444928 70656 1009664 -48128 672256 -228864 -166400
$$ packed form
5977E82656A58208J049600E45280d69504D48512O66112m64896N8880N120B51392
5966G46496K07360C52768L22560O57408m55680N30432F656f87616A060864O30784
5956A691648n74976n17120P8336K74944k88768J26976j14176L83488N40672A21856
5945B46272N51936C95776J059840F06720B17088J167872J40800p17824D00384
5935B17600r0112O74816O06720M73088p59808J39776E60128B65216K45248e27360
5924F76864L45088m40320o656M31104j90976M52096L35872c43040A305600k31936
5914A073664D50048J171456I6768J098752n83168n9392L39456B90816J44896J170432
5904A606144j72032o2464e98016D44928G0656R39008d8128F72256b28864O2464
$$ plain form
5894 -166400 1103360 626176 137728 -309248 608256 1094656 1183744 142336 1555456 990720
5884 990720 1205248 213504 -366592 176640 1712128 428544 886272 1492480 59904 1060864
5874 1060864 729600 171008 1722368 513536 1244160 1091584 544256 -105984 1072128
5864 1447424 961024 1563648 1368576 553472 657920 242688 1518592 695808 495616
5855 495616 1118208 982528 728576 1180672 863232 1039360 1491456 1327104 350720 812032
5845 812032 1017856 444928 1085952 -112640 813568 158208 1179648 766976 956928 1408512
5835 1408512 572416 1102336 1558528 1528320 645120 646656 960512 875520 1068544 32768
5824 1249792 1080320 -343040 280064 374272 785920 370688 727552 384000 1098752 707072
$$ packed form
5894a66400A103360m77184A37728c09248F08256M86400Q9088A42336J413120n64736
5884I90720K14528B13504c66592A76640J535488D28544M57728O06208E9904J000960
5874A060864l31264A71008J551360E13536P30624j52576E44256a05984A072128
5864A447424m86400O02624j95072E53472J04448B42688J275904F95808k00192
5855D95616O22592j35680k53952M52096l17440J76128M52096j64352C50720M61312
5845H12032K05824D44928O41024a12640H13568A58208J021440m12672J89952M51584
5835A408512E72416N29920M56192l0208F45120J536L13856q4992J93024C2768
5824A249792j69472c43040B80064R4208M11648C70688L56864l43552P14752l91680
$$ plain form
5814 707072 451584 654336 1923584 647680 517632 -31744 821248 -272384 1071616 -203776
5803 1214976 72192 1350656 431104 603136 1509888 1225728 1069568 714752 898048 919040
5793 919040 941568 633344 290816 1267712 817152 606208 1232384 215552 43008 702976
5783 702976 827392 856064 1288704 1550336 629760 301568 1744896 1135616 1150976 730624
5773 730624 323584 818176 313344 1361408 1629184 1019392 1666048 2058240 59392 1243136
5763 1243136 796672 1015808 352256 1261056 926720 695296 390144 138240 715776 1115648
5753 1115648 -42496 -279040 -408064 1197056 293888 518144 605184 635904 1292800 698880
5743 698880 689664 492544 -362496 776704 941056 1404416 1664512 901632 54784 -563200
$$ packed form
5814G07072k55488K02752J269248F47680j30048c1744H21248b72384A071616b03776
5803A214976G2192J278464D31104J72032R06752k84160j56160l54816J83296K0992
5793I19040K2528l08224B90816R76896m50560k10944O26176B15552D3008O59968
5783G02976J24416K8672M32640K61632F29760C01568J443328o09280J5360m20352
5773G30624C23584M94592C13344J048064K67776o09792O46656L92192E9392J183744
5763A243136m46464K19136C52256R08800l34336k31424l05152A38240N77536L99872
5753A115648d2496k36544j29024A197056B93888K24256Q7040L0720O56896n93920
5743F98880r216j97120c62496G76704J64352M63360K60096p62880E4784e63200
$$ plain form
5732 1783808 225280 1329152 1875456 604160 1258496 295936 453632 809472 404992
5723 404992 1787392 640512 915968 1347584 700416 1304576 932864 1196544 1778176 640000
5712 1605120 1217024 791552 358400 203264 218112 1216000 1015296 1601536 1131008 638464
5702 638464 1289216 288256 1855488 1096704 1306112 683520 1067520 122368 877568 578048
5692 578048 965632 226816 -721920 378880 2091520 772608 601088 1264640 484864 19968
5681 882176 1649664 1435136 1530368 -58880 771584 529408 322560 547328 1610752 336896
5670 1456640 539136 491008 1699840 554496 905216 1089024 91648 -83456 1408512 375296
5659 200704 1517568 930304 839680 1479168 741376 1402880 436736 872448 1949184 1018368
$$ packed form
5732A783808B25280J103872N46304F04160O54336B95936J57696L55840m04480
5723D04992J382400F40512K75456M31616o47168O04160l71712K63680N81632F40000
5712A605120l88096m25472C58400j55136J4848R97888k00704N86240m70528m92544
5702F38464O50752B88256J567232p58784K09408o22592L84000A22368P55200k99520
5692E78048L87584B26816g21920C78880J712640G72608j71520O63552D84864A9968
5681H82176P67488k14528R5232e8880G71584k42176k06848K24768J063424C36896
5670A456640E39136m8128J208832E54496L50720J83808I1648h3456A408512C75296
5659B00704J316864n87264r0624O39488p37792O61504D36736M35712J076736r30816
$$ plain form
5649 1018368 987136 1534464 705536 438784 1530880 -340992 532992 164352 764928 1373696
5639 1373696 523264 323072 1039360 -67072 159232 -37376 2464768 1009152 971264 660992
5629 660992 815616 1991680 723968 -261120 1179648 800768 1607680 1603072 1283072 381952
5618 410112 1571328 328704 1090048 229888 1447936 544768 1665536 934400 484352
5609 484352 1180160 1319936 616448 1035776 570880 1288704 1491456 569344 1338880 929280
5599 929280 133120 664064 589312 1114112 445952 546816 606208 893952 516096 1043456
5589 1043456 -300032 859136 679936 1285120 1070592 1070592 -348672 1196544 271360 301056
5579 301056 -782336 779776 1463296 1285632 531456 1166848 582656 1648640 1602048 392704
$$ packed form
5649A018368l1232N47328G05536k66752J092096c40992E32992A64352O00576O08768
5639A373696E23264k00192P16288f7072A59232c7376B464768A009152l7888l10272
5629F60992J54624J176064G23968b61120A179648l78880Q06912m608l20000C81952
5618D10112J161216C28704P61344B29888J218048E44768J120768p31136m50048
5609D84352O95808J39776F16448M19328m64896P17824K02752E69344P69536m09600
5599I29280A33120N30944p4752N24800D45952J00864N9392K87744l77856N27360
5589A043456c00032H59136j79200O05184k14528%c48672A196544B71360K9696
5579C01056g82336G79776O83520j77664E31456O35392E82656J065984m6592C92704
$$ plain form
5568 2421760 420864 926208 1444352 882688 988672 1250816 -166912 1783808 1617408
5559 1617408 353792 1487360 241664 1221632 848896 -145408 217088 1391104 1328128
5550 1328128 -29184 538112 583168 278016 -210432 1996288 1212928 1043456 1428992 287744
5539 1108480 1707008 -173056 660480 862208 1268736 871936 1159168 1732608 1115648 823808
5529 823808 1300992 -80896 904704 657920 897024 -116224 1359872 239616 850432 -147968
5518 1008128 1300480 1037824 1594368 936960 -1028608 1026560 1401344 700928 631296
5509 631296 449536 1732608 1395712 1437184 389120 2196480 1551872 1142784 332288 857600
5499 857600 1690112 1483264 654336 997888 1446912 1226240 2552832 1333248 1447936
$$ packed form
5568B421760D20864N05344N18144n61664J05984K62144a66912A783808j66400
5559A617408C53792J133568B41664R79968l72736a45408B17088J174016o2976
5550A328128b9184E38112M5056B78016b10432A996288p83360j69472L85536B87744
5539A108480N98528a73056F60480K01728M06528l96800K87232N73440o16960k91840
5529H23808M77184h0896I04704k46784K39104a16224A359872B39616O10816a47968
5518A008128K92352k62656N56544o57408a028608A026560L74784p00416o9632
5509F31296j81760J283072l36896M1472C89120J807360o44608m09088C32288N25312
5499H57600Q32512k06848F54336L43552M49024k20672J326592j219584J14688
$$ plain form
5490 1447936 1421824 1175040 2906624 1982464 1634304 1015296 1692160 2137600 2215424 844800
5479 792064 1617920 863232 2799616 1731072 619520 1484800 79360 431104 1401856 387072
5468 -37888 445440 604672 1329664 1357824 1248256 521728 1375232 1314816 1143808 1770496
5458 1770496 1057280 190464 454656 394240 729600 1387520 460800 720384 1213952 901632
5448 901632 893952 506880 1406976 1228800 1644544 449024 -484352 699392 1577984 69632
5437 1684480 541696 1602048 279552 737280 1742336 841728 1129984 741888 967168
5428 967168 978944 876032 825344 1374720 334848 419840 748032 825344 1427968 862208
5418 862208 1352704 946688 915456 378880 226816 -180224 987136 976384 1530368 884224
$$ packed form
5490A447936k6112k46784J731584r24160l48160o19008O76864M45440P7824H44800
5479G92064Q25856p54688J936384j068544F19520Q65280G9360L51744R70752C87072
5468c7888D45440J59232P24992K8160j09568E21728Q53504o0416j71008O26688
5458A770496p13216A90464K64192o0416L35360O57920D60800K59584M93568l12320
5448I01632p680l87072R00096j78176M15744D49024d84352F99392Q78592F9632
5437A684480E41696J060352B79552M57728J005056H41728K88256l88096K25280
5428I67168J1776j02912n0688N49376C34848Q4992L28192P7312O02624n65760
5418H62208M90496m06016l1232C78880j52064a80224I87136j0752N53984o46144
$$ plain form
5408 884224 184320 1076736 1030656 1055232 1009664 1613824 -394240 466432 -377856 2236416
5397 1318912 1860096 1312256 715776 389120 1327616 931328 250880 1501696 1298944
5388 1298944 1064960 1524736 2326016 1013248 1511424 565760 1839616 967680 624640
5379 624640 208384 601088 712192 1085440 515072 1250304 906752 2048000 1773056 1599488
5369 1599488 1513984 1454080 2093056 830976 2040320 1312256 1027584 1980416 1317888 1539072
5359 1539072 1091072 1140224 1661440 1274880 1312768 1498624 1675776 1850880 1188864 1987584
5349 1987584 1313280 783872 2191360 1197568 1598464 1802752 410624 1536512 686080
5339 1362944 1656320 2152960 1443328 331264 2131968 2291200 2668544 596992 1961472
$$ packed form
5408H84224A84320Q92416m6080K4576m5568O04160c94240D66432c77856B236416
5397A318912N41184n47840n96480l26656R38496l96288B50880J250816k02752
5388A298944k33984M59776Q01280A013248M98176E65760J273856q71936l43040
5379F24640B08384L92704J11104L73248E15072P35232l43552J141248k74944j73568
5369A599488q5504n9904O38976H30976J209344p28064k84672R52832o62528K21184
5359A539072m48000M9152N21216l86560L7888J85856J77152J75104o62016P98720
5349A987584o74304n29408J407488r93792M00896K04288D10624J125888F86080
5339A362944K93376M96640p09632C31264J800704J59232L77344E96992J364480
$$ plain form
5330 1961472 1225728 782848 1449984 1943040 1997312 438784 2153472 1413632 1046528 2349056
5320 2349056 1424896 1887744 2177536 2827776 1784832 1799680 1317888 1386496 1475072 861184
5310 861184 1699840 1165824 388096 1396736 1988096 1278976 1633280 2232832 952320 2125312
5300 2125312 2435072 1967616 1402880 1114112 806400 343552 806400 1606656 2062336 1614848
5290 1614848 425472 1348608 1204224 1397760 271360 1935872 177664 1363456 328192
5280 273408 -597504 902144 1587200 1303040 1116160 -207872 970240 1605120 307712 847872
5270 847872 971776 1637376 1738240 1370624 2292224 1585664 1403392 1794560 978944 1601024
5260 1601024 804864 1138176 1027584 1177088 1579520 -291328 1403904 1213440 615936
$$ packed form
5330A961472p35744m42880O67136M93056N4272D38784J714688p39840l67104J302528
5320B349056r24160M62848K89792O50240j042944J4848m81792O8608Q8576o13888
5310H61184Q38656n34016C88096J008640N91360p09120L54304N99552I52320J172992
5300B125312L09760m67456n64736k88768l07712C43552M62848Q00256M55680m47488
5290A614848D25472R23136j44384J93536B71360J664512A77664J185792C28192
5280B73408e97504I02144O85056k84160j86880b07872I70240O34880C07712N40160
5270H47872J23904O65600J00864l67616R21600p06560j82272L91168q15616O22080
5260A601024p96160L33312j10592J49504M02432b91328A403904j90464n97504
$$ plain form
5251 615936 976896 2374144 1185792 568320 455168 866304 582144 1573888 1013760
5242 1013760 1542656 498176 892416 1327104 1648640 332288 855552 1387520 974848 595456
5232 595456 1712128 615424 1347584 1193472 1184256 762368 529920 947200 1408000 638976
5221 1324032 162304 457728 1015296 1546240 988160 1093632 429056 1520640 1193472
5212 1193472 1363456 1721344 1030656 566272 2010624 286208 821248 979456 419840
5202 492544 633344 886272 1600512 538624 1041920 2836992 1954816 884736 657408 644608
5192 644608 182784 689664 1207808 1188864 1424896 1005056 794624 511488 1418240 2001408
5182 2001408 1543168 1024512 1031168 1039360 1102848 1065984 1582592 392192 1560576 2364928
$$ packed form
5251F15936L60960J397248A185792E68320j13152M11136k84160R91744n60128
5242A013760N28896D98176L94240M34688L21536C32288N23264N31968m12672l79392
5232E95456J116672F15424P32160j54112r216m21888k32448M17280M60800F38976
5221A324032A62304K95424N57568N30944n58080J05472D29056J091584l27168
5212A193472J69984L57888o90688m64384J444352B86208N35040J58208D19840
5202D92544J40800K52928P14240E38624N03296J795072q82176H84736k27328j2800
5192F44608A82784N06880N18144j8944K36032m19840k10432k83136R06752N83168
5182B001408m58240n18656O656Q192O3488l6864N16608C92192J168384Q04352
$$ plain form
5172 2364928 1519104 1121280 702976 1901056 948736 1355264 1497600 2186240 100864
5162 1060352 657408 1155584 1672704 1518080 1289728 1223680 696320 1309184 1718272 1337344
5152 1337344 630784 1107968 1443840 1091072 1269760 1447936 1204224 968192 671744 507392
5142 507392 1288704 1255936 1106944 194560 1177088 1665024 1309184 1602560 1363968 764416
5132 764416 1038336 1073152 732160 1998848 823808 1743872 971776 2243072 1784320 1264128
5122 1264128 530944 1124864 1449984 1071616 2086400 2351104 1262592 684032 1896960
5113 1896960 1570304 1425408 1129984 758272 1578496 1630208 1359360 1716736 1235456 1920000
5103 1920000 1357312 1332736 2450944 1462784 934400 1098240 2190336 939008 1674240
$$ packed form
5172B364928q45824l97824m18304J198080I48736M06528J42336O88640A00864
5162A060352m02944M98176N17120j54624k28352o6048n27360O12864M09088l80928
5152A337344F30784M77184L35872l52768J78688J78176k43712k36032k96448j64352
5142E07392P81312l2768j48992A94560R82528M87936l55840K93376k38592n99552
5132G64416K73920L4816l40992J266688H23808R20064p72096J271296m58752n20192
5122A264128E30944N93920L25120l78368J014784K64704j088512n78560J212928
5113A896960l26656j44896k95424l71712Q20224N1712k70848L57376m81280O84544
5103A920000n62688k4576J118208r88160n28384J63840J092096I39008P35232
$$ plain form
5094 1674240 1724928 1840640 1231872 2083840 1402368 1127936 1030144 1249792 1346560 962560
5084 962560 2057216 1289728 720384 1648640 246784 2364928 1056256 2191360 929792
5074 1836544 2677248 1574400 2432000 1739776 3028480 1703936 2586624 2667520 2874368
5065 2874368 3023872 3086848 3377664 3486208 3805184 2521600 2927616 1068544 2571264
5056 2571264 1659392 1009664 1117696 1870336 1645056 1955328 2152960 1443328 1527296 1153024
5046 1153024 1959424 991744 525312 832000 2040832 2120704 2333184 1289728 286208
5036 1382400 1528320 1894400 1771520 1841664 280064 2230784 1681408 1709056 2439168 1776128
5026 1776128 -177664 2168832 10752 1313792 2099200 1571840 755712 1626624 1768960
$$ packed form
5094A674240N0688J15712o08768Q51968o81472k74432r7792K19648R6768l84000
5084I62560J094656p67488n69344R28256B46784K118144A056256J135104I29792
5074A836544Q40704j102848Q57600o92224J288704j324544Q82688Q0896K06848
5065B874368J49504O2976K90816J08544L18976j283584M06016A068544J502720
5056B571264r11872o49728J08032P52640k25280L10272J97632p09632Q3968l74272
5046A153024Q06400r67680m66432L06688J208832P9872K12480j043456B86208
5036A382400J45920L66080j22880P0144B80064J950720n49376K7648P30112o63040
5026A776128a77664B168832A0752J303040P85408n27360G55712Q70912J42336
$$ plain form
5017 1768960 1847296 2249216 1324544 51200 475648 1515520 1277440 1405440 1310208 1235968
5007 1235968 1598464 1599488 1810432 893440 1230336 1029632 859136 1656832 910848 1120768
4997 1120768 1658368 1243648 1314816 829440 585728 757248 1666048 2290688 1295360 1436160
4987 1436160 1401856 996864 1285632 840192 2298880 1255936 1676800 2268672 1175552
4978 1175552 1829376 2469888 679936 1970176 974336 557568 711680 1207808 1143296 1111552
4968 1111552 2248704 1859584 1288704 1370112 757248 2109952 1391104 962560 2600448
4959 2600448 1918464 2327040 1525248 2383872 2208256 2084864 1370112 2001408 720896 2097152
4949 2097152 700416 2159616 2400768 1318912 365568 2120704 1658368 2770944 1784320
$$ packed form
5017A768960P8336M01920r24672E1200M24448J039872k38080J28000r5232p4240
5007A235968L62496J024K10944H93440L36896k00704j70496P97696p45984K09920
4997A120768N37600m14720P1168m85376k43712J71520R08800O24640r95328J40800
4987A436160l4304m04992K88768m45440J458688j042944M20864N91872j093120
4978A175552O53824O40512F79936J290240I74336m16768J54112M96128o4512l1744
4968A111552J137152l89120n70880Q1408o12864J352704p18848m28544J637888
4959B600448o81984M08576q01792Q58624j75616j23392p14752O31296G20896J376256
4949B097152G00416J459200K41152j081856C65568J755136m62336J112576r86624
$$ plain form
4940 1784320 1294336 1478656 1011712 80384 1238528 2642432 2483712 1565696 1827328
4931 1827328 1991680 2375680 1861632 1910272 2368512 2184704 3144192 1506304 2236928 2748416
4921 2748416 1960448 1791488 1081344 2252800 1452544 2034176 1776640 2496000 1698304
4912 1698304 2409984 1925632 2526720 2532352 2558464 1650176 841216 860672 1326080 2151936
4902 2151936 1106944 1320960 1887232 2128384 2084352 1896448 1059840 2127360 2102272 2191872
4892 2191872 1144320 322560 1095168 2049536 1713664 1614848 1949696 1440768 49152 1425920
4882 1425920 1153536 2620416 2239488 2175488 1067520 1147392 2741248 1958912 1699840
4873 1699840 1807872 1523712 1890304 1887744 2121216 1997312 2359296 1293824 1475072 822272
$$ packed form
4940A784320m89984J84320m66944H0384J158144J403904j58720r18016K61632
4931A827328J64352L84000n14048M8640M58240j83808R59488A506304P30624N11488
4921B748416p87968j68960p10144J171456q00256N81632k57536P19360p97696
4912A698304P11680m84352O01088N632K6112r08288q08960J9456M65408Q25856
4902B151936j044992K14016N66272K41152m4032j87904q36608J067520k5088Q9600
4892B191872j047552C22560P72608R54368l35872r8816L34848n08928D9152J376768
4882A425920k72384J466880l80928o4000A067520P9872J593856p82336k59072
4873A699840J08032k84160L66592k560K33472j23904L61984j065472J81248o52800
$$ plain form
4863 822272 1358336 1799168 2251776 1991680 2245120 1337856 1620480 1598464 1063936 2978816
4853 2978816 1822208 2098176 2106880 1210368 2008576 1756672 1444352 2229760 1034240 1711104
4843 1711104 1734144 2647552 1817088 1291264 1675264 1641472 1808384 2539008 1745920 1705984
4833 1705984 3595264 2692096 2802688 2414592 2405376 2559488 2276352 2100736 3639808 3173888
4823 3173888 2727936 4574720 4541440 5727232 6282752 5620224 6151168 4782080 5224960
4814 5224960 4710912 4187648 3142656 4913152 3936256 2011648 1864704 2067456 2390016
4805 2390016 1661440 1548800 735744 1185792 2160128 1227264 1793536 2009088 2224128 1854464
4795 1854464 2704896 2356736 1355264 1377280 1982464 2660864 727040 1064960 1183232 1273856
$$ packed form
4863H22272N36064M40832M52608k60096K53440r07264K82624k2016n34528J914880
4853B978816j156608K75968Q704q96512P98208k51904l12320P85408A034240O76864
4843A711104K3040R13408q30464n25824L84000l3792J66912P30624p93088l9936
4833A705984J889280r03168J10592l88096r216J54112k83136j75616J539072m65920
4823C173888m45952J846784l3280J185792N55520o62528N30944j369088M42880
4814E224960n14048n23264j044992J770496r76896j924608j46944K02752L22560
4805B390016p28576j12640G35744M50048R74336r32864N66272K15552K15040l69664
4795A854464Q50432l48160j001472K2016O05184O78400G27040L37920J18272R0624
$$ plain form
4785 1273856 1237504 1678848 1901568 1676800 1783296 1776128 1704448 2226176 1522176 1387008
4775 1387008 2116608 1852416 1911808 988160 2268160 1561088 2420736 1908736 1402368 2101248
4765 2101248 1844224 1196032 1926656 1492480 2361344 1505280 1444864 1038336 2564096 498688
4754 1521152 1569792 1926656 1957888 2839552 2325504 2938880 2038272 1721856 2958336 2272256
4744 2272256 1829376 1294848 2546688 2728960 2499584 1720832 1833472 1694208 707584
4734 2362880 1765888 1931264 2593280 2472448 2993152 2310656 1213440 2006528 1243136
4725 1243136 1852928 1621504 1436160 2437120 1865216 2231296 1982464 1456640 2201088
4716 2201088 1209344 1548800 1178624 1850368 1725952 2406400 2231296 974848 1488896 1835008
$$ packed form
4785A273856l6352M41344K22720k24768J06496p168p1680N21728p04000j35168
4775A387008P29600k64192N9392r23648J280000p07072Q59648n12000n06368O98880
4765B101248k57024o48192P30624m34176Q68864q56064o0416m06528J525760D98688
4754A521152M8640L56864L1232Q81664n14048O13376r00608l16416J236480o86080
4744B272256m42880n34528J251840J82272k29376p78752J12640j39264G07584
4734B362880n96992J65376O62016j20832N20704o82496j097216P93088p63392
4725A243136O09792k31424j85344J000960n71904L66080k48832n25824P44448
4716B201088r91744L39456l70176O71744j24416O80448j75104I74848N14048L46112
$$ plain form
4706 1835008 1783296 2980864 2647552 1662464 1443840 2149888 2718208 2676224 2474496 1946624
4696 1946624 1170944 3013632 2224640 1850880 2566656 2158592 1598976 2309632 2224640 1335296
4686 1335296 2357760 2073088 992256 1196544 795648 1579008 1567232 1930752 1975808 2294272
4676 2294272 1992192 1787392 1715712 2302464 1431040 2891264 2299392 3526656 2813440
4667 2813440 1963008 1895936 2329600 2085376 2049024 1889792 2320384 2556416 1608192 2192896
4657 2192896 2144256 1966080 2137600 1675776 1684992 2981376 2482176 3422720 2049024 2311680
4647 2311680 1905152 1563136 2671616 2947584 1243136 1459200 2369024 1545216 2465792
4638 2465792 2054144 2447872 1799680 2960384 2803200 2298880 2666496 1959936 2724352
$$ packed form
4706A835008n1712J197568l33312r85088k18624P06048N68320m1984k01728n27872
4696A946624p75680J842688p88992l73760P15776m08064n59616P10656q4992q89344
4686A335296J022464k84672I92256K04288m00896P83360j1776L63520M5056L18464
4676B294272l02080k04800p1680N86752q71424J460224n91872J227264p13216
4667B813440q50432o7072M33664k44224l6352j59232M30592K36032r48224N84704
4657B192896m8640j78176J71520m61824R216J296384m99200R40544j373696K62656
4647B311680m06528l42016J108480K75968A243136K16064R09824q23808R20576
4638B465792m11648L93728o48192J160704j57184n04320L67616p06560P64416
$$ plain form
4629 2724352 2030080 2121728 2300928 2134016 2458624 1840128 2198528 1782784 2207232 2719232
4619 2719232 2160128 1667072 1966592 1222144 1271296 1943552 1683456 2392576 953856 2612736
4609 2612736 2040320 2761216 2797568 2131456 1697280 3176960 715776 2106880 2721792
4600 2721792 1560064 1899008 1880064 2011136 1464320 2188288 1779712 989184 2397184
4591 2397184 2470912 3053568 2465280 3010560 2043392 1725952 2633728 2355712 1495552 2762240
4581 2762240 2162176 2582016 1679360 1718272 3264512 2085888 2535936 2978304 3348480
4572 3348480 1741312 3087872 2872832 2256384 2338816 2165248 3236864 3163648 3477504
4563 3477504 4045824 2306048 3807232 2963456 3520000 4036096 3450368 2471936 3657728
$$ packed form
4629B724352o94272R1648J79200j66912L24608o18496L58400m15744M24448N12000
4619B719232n59104m93056K99520p44448M9152O72256k60096P09120I53856J658880
4609B612736n72416P20896L6352o66112m34176J479680G15776J391104O14912
4600B721792j161728L38944j8944J31072n46816P23968m08576p90528J408000
4591B397184P3728N82656n88288N45280r67168l17440R07776k78016q60160J266688
4581B762240o00064M19840r02656L8912J546240j178624M50048M42368L70176
4572C348480j607168J346560k15040o16448Q2432j73568J071616p3216L13856
4563C477504N68320j739776J501184q43776N56544N16096n85728r78432J185792
$$ plain form
4554 3657728 4052480 3243008 2351104 2882048 4344832 3558400 2960384 3535360 2994176
4545 2994176 2810368 2215424 2829312 2672640 2432512 2368000 2577920 2476544 3044864 2980352
4535 2980352 3130368 2546176 2556416 2941952 2296832 1709056 2415616 3494400 2491904
4526 2491904 3035648 2450432 2141184 3840512 3914240 3324416 3441152 4098048 3179008 4001792
4516 4001792 3508224 3014656 3784704 3638784 2538496 3330048 3103232 3163136 2590208 3154432
4506 3154432 4447232 2764800 3501568 2699264 1790464 2372096 2326528 2828800 2321920
4497 2321920 2083840 2248704 1627136 2313728 2174976 2487296 1630208 2545152 1600000 2139136
4487 2139136 2323456 2777600 3360256 2190848 2122240 3369984 1808384 2222592 3054080
$$ packed form
4554C657728L94752q09472q91904N30944J462784p86432n98016N74976n41184
4545B994176j83808n94944O13888j56672k40128o4512K09920j01376N68320o4512
4535B980352J50016n84192J0240L85536o45120n87776P06560J078784j002496
4526B491904N43744n85216l09248J699328P3728n89824J16736O56896r19040Q22784
4516D001792m93568m93568P70048j45920j100288P91552k26816N9904n72928N64224
4506C154432J292800j682432P36768q02304r08800N81632m5568N02272n06880
4497B321920k38080J64864o21568O86592j38752L12320q57088R14944r45152N39136
4487B139136J84320M54144N82656j169408o8608J247744j561600M14208Q31488
$$ plain form
4478 3054080 2488832 1755136 2375680 2541056 3095040 1563648 1149440 2649088 3339776
4469 3339776 3805696 2307072 1924096 2076672 2398720 2044928 2268672 2624512 2852352
4460 2852352 3448320 2603520 2767360 2754048 1753088 3171328 3058176 2448384 3373568
4451 3373568 2648064 3149312 3289088 2686464 2743296 2307072 3492352 2726912 2891264 3468800
4441 3468800 2183168 3042304 3249152 3573248 2354176 3118080 4153856 3240960 4237824
4432 4237824 2892288 3000832 3198464 3175424 2845696 3571200 4740096 3354112 3509248
4423 3509248 4350464 3747328 3987456 4556288 4048384 3722240 3664896 3563520 4488704 3493376
4413 3493376 4567552 4052480 3462144 3416576 3248128 3371520 4107776 2462720 2970624
$$ packed form
4478C054080n65248p33696O20544J65376N53984j531392m14208J499648O90688
4469C339776M65920j498624l82976J52576L22048l53792K23744L55840K27840
4460B852352N95968q44800J63840j3312j000960J418240j13152o09792R25184
4451C373568p25504N01248J39776o02624N6832m36224J185280p65440J64352N77536
4441C468800j285632Q59136K06848L24096j219072P63904J035776r12896R96864
4432D237824j345536J08544J97632k3040l29728P25504J168896j385984J55136
4423C509248Q41216o03136K40128N68832n07904l26144n7344j01376R25184r95328
4413C493376J074176n15072n90336m5568j68448J23392P36256j645056N07904
$$ plain form
4404 2970624 3194368 3206144 3529728 3505664 3133440 3107840 2906624 2508800 3562496 2951680
4394 2951680 3576832 2507776 3043840 2352640 3004416 3781632 2477568 2975744 2189312
4385 2189312 2163200 2629120 2135552 2652160 3517440 2931200 1590272 2254336 3227648 3076096
4375 3076096 2875904 3471360 1711616 2399232 2695680 3369472 2624512 2129920 3335168
4366 3335168 2830848 3269632 2689536 2880000 3345408 4059648 3337728 4244480 3064320
4357 3064320 3756544 3534336 3321856 3261952 3330048 2885120 2973696 1197568 3093504 2702848
4347 2702848 2168320 2176512 3045376 2910720 2823680 2379776 3162112 3519488 2108928 1724928
4337 1724928 3006464 2081792 3347456 2106880 1987584 2496000 2533888 2430976 2620928
$$ packed form
4404B970624K23744J1776L23584k4064l72224k5600k01216l97824J053696o10816
4394B951680O25152j069056N36064o91200O51776P77216j304064M98176p86432
4385B189312k6112M65920m93568N16608Q65280n86240j340928O64064R73312j51552
4375C076096k00192N95456A711616O87616K96448O73792p44960m94592J205248
4366C335168n04320M38784n80096J90464M65408P14240p21920R06752j180160
4357C064320O92224k22208k12480n9904O8096m44928Q8576A197568J895936l90656
4347B702848n34528Q192Q68864j34656q7040m43904P82336L57376j410560l84000
4337A724928J281536r24672J265664j240576j19296N08416L7888j02912J89952
$$ plain form
4328 2620928 1357312 2145792 2998272 2970624 4131328 3935232 2766848 3390976 1950208
4319 1950208 3776000 3506176 3220480 2109952 3109376 3452416 2918400 4093952 3176960
4310 3176960 3451392 3411456 3974144 3995136 3794944 3940352 3983872 3589120 4012544 4634112
4300 4634112 4365312 3796480 3508736 4248576 2311168 3210240 3266560 3652096 3151872 4423168
4290 4423168 3573248 2942976 2781184 2766336 2441216 4004352 3895296 2415104 2588160
4281 2588160 3057664 4271616 3642368 3194368 3411968 2426880 4016640 2549760 3286016
4272 3286016 3492864 2577920 3636736 4223488 3008512 3518464 4296192 3864064 3263488
4263 3263488 3799552 4648960 3532288 3408384 4160512 3933696 3412480 4228096 4566016
$$ packed form
4328B620928j263616P88480Q52480k7648J160704j96096j168384O24128j440768
4319A950208J825792k69824k85696j110528R99424L43040n34016J175552r16992
4310C176960K74432l9936N62688K0992k00192J45408M3520l94752M23424O21568
4300D634112k68800n68832k87744P39840j937408Q99072N6320L85536n00224J271296
4290D423168q49920o30272j61792j4848l25120J563136j09056j480192J73056
4281B588160M69504J213952o29248m48000K17600r85088J589760j466880P36256
4272C286016K06848r14944J058816N86752j214976N09952P77728m32128o00576
4263C263488N36064Q49408j116672j23904P52128k26816n21216Q15616L37920
$$ plain form
4254 4566016 4419584 4162560 4335104 3602432 3567616 3468288 3890176 4703744 4084736 4425728
4244 4425728 4402688 2574336 3793408 3848704 3564544 3487744 4107776 2628096 3317760 3268096
4234 3268096 3146752 3472384 2662400 2720256 3352576 3274240 3204096 2503680 3129856 3028992
4224 3028992 3568128 3706880 3650048 3639296 4333056 3474432 2833408 2823168 2344448 3025920
4214 3025920 2957824 2701824 3146240 3094016 3219456 3502080 2043392 2722304 3355136 2609664
4204 2609664 4538880 2995712 3453440 3456000 3637760 2763776 2856960 2792960 4648960 2897920
4194 2897920 3731456 2558464 3817472 3121664 3438080 3364352 3144192 3612160 3046400
4185 3046400 3326464 3295232 3330048 4373504 3059712 3786240 3528192 3119104 1630208
$$ packed form
4254D566016j46432k57024J72544p32672l4816r9328M21888Q13568o19008L40992
4244D425728k3040j828352J219072N5296k84160p6800O20032j479680O89664m9664
4234C268096j21344L25632q09984N7856O32320p8336p0144p00416O26176j00864
4224C028992N39136J38752n6832j0752O93760q58624o41024j0240m78720O81472
4214C025920o8096k56000M44416n2224J25440K82624j458688O78912O32832p45472
4204B609664J929216j543168M57728K560J81760q73984R3184o4000J856000j751040
4194B897920Q33536j172992J259008o95808L16416p3728k20160M67968n65760
4185C046400K80064l1232L4816J043456j313792P26528k58048m09088j488896
$$ plain form
4176 1630208 2767872 4541952 3590656 4483584 2689536 3151360 3864064 3330560 3374592
4167 3374592 4107264 4104192 3213824 4487680 4186112 3692032 3888128 2838016 3744768 4073472
4157 4073472 4579840 4717056 3007488 2660352 3849728 3072000 3956736 3295744 4561920
4148 4561920 4510720 3576320 3692032 4470784 3462144 3726848 4078592 2910208 2710528
4139 2710528 3723776 4021248 3983872 3491840 3798528 3472896 3160576 2220032 2565120 3342336
4129 3342336 3381760 3063808 3142144 3953152 3631104 4238848 3195392 2815488 2813440 2953728
4119 2953728 4168704 3233792 4051968 3855872 3839488 2912768 3148800 3355136 3438080 2460672
4109 2460672 3248640 4099072 3024896 3871744 3297280 2802176 2896384 3614720 3333120 2898944
$$ packed form
4176A630208J137664J774080r51296Q92928j794048M61824P12704n33504M4032
4167C374592P32672l072q90368J273856l01568m94080J96096j050112R06752L28704
4157D073472N06368J37216j709568l47136J189376p77728Q84736o60992J266176
4148D561920n1200r34400J15712P78752j008640K64704L51744j168384j99680
4139B710528J013248K97472l7376m92032L06688l25632l12320r40544L45088P77216
4129C342336L9424l17952P8336Q11008l22048O07744j043456l79904k048J40288
4119B953728J214976r34912Q18176j96096j6384r26720K36032K06336Q2944r77408
4109B460672P87968Q50432j074176Q46848n74464m95104R4208P18336k81600m34176
$$ plain form
4099 2898944 3507712 3384320 2176000 10121728 3576320 3127808 3359232 3483136 2927104
4090 2927104 3369472 4420608 3522560 3215360 3342848 4114944 4686336 3585024 3826176
4081 3826176 3826688 4737024 3004928 3548672 4798464 4331520 3260928 4201984 3811328 4369920
4071 4369920 4214784 3819008 5016576 5211136 5222912 3668480 4239360 4316160 3792896 3632128
4061 3632128 3918336 4305920 3339776 3596288 3565568 3853312 2742784 3368960 3030528 3223552
4051 3223552 3409920 4589568 5068800 3785728 4175872 4407808 3330560 4562944 3467776
4042 3467776 2660864 3991552 4256256 3520000 3088896 3905024 3034624 4621312 3742720
4033 3742720 3476480 3508736 4825088 4271104 4020224 3582464 3635200 3691520 3508736 4252160
$$ packed form
4099B898944O08768j23392j208320P945728C576320m48512K31424J23904n56032
4090B927104M42368J051136q98048l07200J27488P72096N71392j101312K41152
4081C826176N12R10336j732096N43744J249792m66944j070592R41056l90656N58592
4071D369920j55136l95776J197568J94560J1776j554432N70880P6800n23264j60768
4061C632128K86208L87584r66144K56512l0720K87744j110528O26176l38432J93024
4051C223552J86368J179648M79232j283072L90144K31936j077248J232384j095168
4042C467776q06912J330688K64704p36256m31104Q16128q70400J586688q78592
4033C742720k66240L2256J316352n53984k50880m37760N2736N6320j82784P43424
$$ plain form
4023 4252160 3581440 4076032 2909184 3128320 3897344 3356160 3686400 3614720 4743168
4014 4743168 3849216 4204032 4720128 4717056 3942400 4960256 4355072 5033984 3941376 4331520
4004 4331520 4589568 4803072 5592576 4654080 4430336 5264896 4540416 4858368 4798464 4824576
3994 4824576 4897792 5525504 3727360 4581888 6410752 5834240 6559744 6529536 6180352 6618624
3984 6618624 5597696 5521408 5960192 5594624 3899392 4231168 4545024 4854272 4542976
3975 4542976 4636160 5337600 5660672 5690880 4887040 4833792 5161472 5716480 6041088 4294144
3965 4294144 4980224 5699584 5921280 5768192 5445632 5698560 7335424 5811200 6102016
3956 6102016 6228992 6671872 7357952 7092736 7052800 6861824 7988736 7028736 7624704 7415808
$$ packed form
4023D252160o70720M94592j166848K19136P69024n41184L30240p1680J128448
4014D743168q93952L54816N16096l072p74656J017856o05184O78912j092608L90144
4004D331520K58048K13504P89504r38496k23744Q34560p24480L17952n9904K6112
3994D824576P3216O27712j798144Q54528J828864n76512P25504l0208l49184M38272
3984F618624j020928p6288M38784l65568j695232L31776L13856L09248l11296
3975D542976R3184P01440L23072L0208q03840n3248L27680N55008L24608j746944
3965D294144O86080P19360K21696j53088l22560K52928J636864j524224K90816
3956F102016J26976M42880O86080k65216l9936j90976J126912r60000N95968k08896
$$ plain form
3946 7415808 9248256 8332288 8558080 8164864 9114624 10535424 9303040 10469888 9956352
3937 9956352 11399680 11976704 11926528 12601344 13452800 12163584 12488192 12283904 11292672
3928 11292672 10721280 9830912 7988224 7758848 6901248 8073216 6103552 7289856 5893120
3919 5893120 6889472 6700544 6334976 6475776 5801472 6760448 7533056 6105088 6673920
3910 6673920 6262272 7793152 6832128 6691840 6759936 6337024 7808000 8030720 7213056
3901 7213056 6571008 7343104 7900160 8305152 7749120 8174592 7374848 9450496 9064448
3892 9064448 8787456 8908288 8934912 8959488 8559104 8886272 8783872 8911360 8336896 9503744
3882 9503744 8951808 8616448 8928256 9966592 9099776 8791040 8407040 9683968 9728000
$$ packed form
3946G415808J832448r15968K25792l93216R49760J420800j232384J166848n13536
3937I956352J443328N77024n0176O74816Q51456j289216L24608k04288r91232
3928A1292672n71392q90368j842688k29376q57600J171968j969664J186304j396736
3919E893120R96352j88928l65568J40800o74304R58976P72608j427968N68832
3910F673920m11648J530880r61024j40288O8096m22912J470976K22720q17664
3901G213056o42048P72096N57056M04992n56032M25472p99744K075648l86048
3892I064448k76992J20832K6624K4576m00384L27168j02400J27488n74464J166848
3882I503744n51936l35360L11808J038336q66816l08736l84000J276928M4032
$$ plain form
3873 9728000 9908736 10762752 11462656 12218368 12256768 12205056 11053568 10448896 9424896 9810944
3863 9810944 8748032 7245824 6263296 7437312 5814272 5084160 5685248 5591040 4651008
3854 4651008 5912064 4959232 4435456 4838912 3736576 4703232 5662720 4368896 4201984
3845 4201984 4825088 4893184 5051904 5121024 5283328 4930048 4907008 5010432 5292544 4668416
3835 4668416 4673024 4543488 4534784 3563008 3766784 4420096 3906560 4054016 3498496 4008960
3825 4008960 3855872 3751936 4627968 3951616 2916352 3591168 3517952 4418048 4069888 4016640
3815 4016640 4087808 5274112 4329984 3690496 4164096 4747264 4463616 3745280 4340736 4572672
3805 4572672 4592128 4699136 3591168 4871680 3799040 4190720 4428288 3889152 3730432
$$ packed form
3873I728000J80736Q54016O99904P55712L8400n1712j151488o04672j024000L86048
3863I810944j062912j502208r82528J174016j623040p30112O01088r4208r40032
3854D651008J261056r52832n23776M03456j102336R66656R59488j293824j66912
3845D201984O23104O8096J58720O9120J62304l53280k3040J03424K82112o24128
3835D668416M608j29536q704r71776K03776O53312n13536J47456n55520N10464
3825D008960j53088j03936Q76032o76352j035264O74816p3216R00096l48160n3248
3815D016640P1168J186304r44128o39488M73600N83168k83648p18336N95456K31936
3805D572672J9456J07008j107968J280512j072640L91680K37568n39136j58720
$$ plain form
3796 3730432 4269056 3695616 4743680 4525568 4117504 4534784 4077056 4111872 3857920 4316672
3786 4316672 2400256 3848192 4314624 4446720 4239872 4274688 4174336 3871232 3365376
3777 3365376 4167680 3905536 2883072 4471808 4371456 3374592 4064768 4449792 3226624
3768 3226624 3405824 4006400 3966976 4073472 3752960 3916288 3700736 4634112 4946944 3981824
3758 3981824 4303872 3774464 3535360 4078592 4196864 4132352 3927040 4314624 5392896 4166656
3748 4166656 4617216 4051456 5188608 5085184 3858944 4545536 4284928 5296640 3831296
3739 3831296 3834880 5480448 5034496 4402688 4940800 4703744 5084160 3851264 3965952 4904960
3729 4904960 5054976 4106240 3906048 3891712 4760576 4294656 3738112 3961344 4587520 4541440
$$ packed form
3796C730432N38624n73440J048064k18112m08064M17280m57728L4816k53952M58752
3786D316672j916416J447936M66432J32096k06848L4816j00352l03104n05856
3777C365376Q02304k62144j022464J588736j00352r96864O90176L85024j223168
3768C226624J79200O00576l9424J06496l20512J63328k15552R33376L12832r65120
3758C981824L22048n29408k39104N43232J18272o4512k05312L87584J078272j226240
3748D166656M50560n65760J137152j03424j226240O86592k60608J011712j465344
3739C831296L584J645568m45952o31808N38112k37056L80416j232896J14688R39008
3729D904960J50016r48736k00192j4336Q68864m65920n56544K23232O26176m6080
$$ plain form
3719 4541440 4860416 4126208 4696576 4833792 4926976 3723776 4529152 4511744 5226496 5373952
3709 5373952 4299776 5389312 4345344 4158464 4421632 5836288 3671552 4109824 5950464
3700 5950464 4349952 4410880 5328384 4888576 5012480 5377024 4627968 5859840 4371456
3691 4371456 5489664 5286400 4207616 5215232 5443584 5094400 5305344 5350912 4615680
3682 4615680 4822528 5563392 5469696 6003712 5500928 4915712 6185472 6034944 5685760 6145536
3672 6145536 6684672 5748224 5285376 6204928 7074816 7332352 6977536 5667840 6929408
3663 6929408 7255040 6409216 7209984 7783424 7197696 8347136 7757312 8472576 8130560
3654 8130560 9062400 8714240 10235904 9975808 10621952 11422720 11180032 11359744 11991552
$$ packed form
3719D541440L18976p34208N70368J37216R3184j203200Q05376j7408P14752J47456
3709E373952j074176J089536j043968j86880K63168J414656k164736M38272J840640
3700E950464j600512O0928R17504m39808J23904L64544p49056J231872j488384
3691D371456J118208k03264j078784J007616K28352l49184K10944M5568p35232
3682D615680K06848P40864r3696N34016n02784n85216J269760j50528l49184M59776
3672F145536N39136r36448m62848R19552Q69888K57536l54816j309696J261568
3663F929408L25632q45824Q00768N73440n85728J149440n89824P15264l42016
3654H130560R31840l48160J521664k60096O46144Q00768k42688J79712O31808
$$ plain form
3645 11991552 13731840 12830208 13302272 12868608 14102016 15622656 15021568 14704128 15842816
3636 15842816 16555008 16958464 16700928 19132928 18259456 20290560 20938752 21991424 22865408
3627 22865408 24051712 22185472 21805056 20154368 17757696 16233472 16187392 15571456 15391744
3618 15391744 15493120 14443520 14879744 14384640 14595584 15287808 15945728 16675328 15705088
3609 15705088 16831488 17773568 18138624 17088512 18277888 17672192 17400320 18203136 18485248
3600 18485248 18873856 18615296 20843008 21365760 20861952 19999744 17474048 16798720 15206912
3591 15206912 14614528 11982848 12153856 10951680 9886720 9751552 9785344 9672704 10967552
3582 10967552 9878016 11464192 12442624 13858304 13639168 13972992 13923328 13453824 11960832
$$ packed form
3645A1991552J740288r01632M72064m33664J233408J520640o01088l17440J138688
3636A5842816P12192M03456k57536K432000q73472K031104O48192J052672Q73984
3627B2865408J186304j866240l80416j650688k396672j524224m6080o15936j79712
3618A5391744J01376j049600M36224m95104K10944O92224O57920P29600r70240
3609A5705088J126400R42080L65056j050112J189376o05696k71872Q02816K82112
3600A8485248L88608k58560K227712N22752n03808q62208k525696o75328j591808
3591A5206912n92384k631680J71008j202176j064960j35168L3792j12640J294848
3582A0967552j089536J586176R78432J415680k19136L33824m9664m69504j492992
$$ plain form
3573 11960832 10206720 9321984 9816064 8335872 7562752 8519680 8378880 7694336 8027136
3564 8027136 8764928 7938560 8845824 9498624 8844288 9121792 9341440 8141824 9604096
3555 9604096 8950784 8785408 7310336 7946752 8527360 7032320 8176128 9302016 10151936
3546 10151936 9273856 9406976 9257472 8913920 8551936 7254528 7609856 7624192 6963712
3537 6963712 8162816 7316480 5543424 6465024 7415296 6614016 6179840 7396352 5683200
3528 5683200 6240768 6428672 6123520 7055360 6553088 7028736 7143424 7232000 6876672 7729664
3518 7729664 6585856 7866880 7291904 7853056 8355840 6865408 7457280 7405056 6929408
3509 6929408 7467008 8609792 7341056 7588864 7145984 7992320 6223360 7183360 7809536
$$ packed form
3573A1960832j754112q84736M94080j480192p73120R56928j40800o84544L32800
3564H027136P37792q26368R07264O52800o54336K77504K19648j199616J462272
3555I604096o53312j65376j475072O36416N80608j495040J143808J125888Q49920
3546A0151936q78080J33120j49504l43552l61984j297408L55328J4336o60480
3537F963712J199104q46336j773056R21600R50272q01280m34176J216512j713152
3528E683200N57568J87904l05152R31840n02272M75648J14688Q8576l55328Q52992
3518G729664j143808J281024n74976N61152N02784j490432N91872n2224m75648
3509F929408N37600J142784j268736K47808m42880Q46336j768960R60000O26176
$$ plain form
3500 7809536 7224320 7251456 6846976 6526976 7991808 7716352 8155648 7475200 7726080 7835136
3490 7835136 7905792 7683072 7967744 8503808 8595456 7729152 7310848 7749120 8201216 6802432
3480 6802432 8280064 6860288 7177728 6739456 6453760 7400960 7186944 7581184 6716416
3471 6716416 7852544 8004096 7451136 8076800 7918592 8018432 8963584 8457728 8369152 7634432
3461 7634432 9522688 7621120 7961088 8096256 9558528 9630208 8607744 8899072 8806912
3452 8806912 9080832 8898048 9060352 9689088 10239488 9495040 10362368 9822208 10151424 9159680
3442 9159680 9655808 10069504 9783296 9832960 10725888 10019840 10895872 10247168 10653184 11403776
3432 11403776 10268160 10681856 11082240 11254784 11076096 11952640 10890752 10067456 10025984
$$ packed form
3500G809536n85216K7136m04480l20000J464832k75456M39296o80448K50880J09056
3490G835136P0656k22720K84672N36064R1648q66304m18304M38272M52096j398784
3480F802432J477632j419776L17440m38272k85696R47200k14016L94240q64768
3471F716416J136128J51552n52960O25664j58208R9840R45152n05856q8576p34720
3461G634432J888256j901568L39968J35168J462272P1680j022464K91328r2160
3452H806912K73920j82784J62304O28736N50400p44448Q67328n40160L29216r91744
3442I159680M96128M13696k86208M9664Q92928p06048Q76032o48704M06016P50592
3432A1403776j135616M13696M00384J72544j78688Q76544j061888q23296m1472
$$ plain form
3423 10025984 10744320 10736128 11076608 12533760 10377216 11652096 11368448 10872320 12128768
3414 12128768 12262912 12597760 12060160 12566528 12756480 12855808 12904448 13884928 12980224 13683200
3404 13683200 13355520 12962304 13264896 12214784 12105216 12785664 12289536 12193280 12940800
3395 12940800 12436992 13091328 14013952 14658560 15008256 14948352 15947776 16705024 17069056 17083392
3385 17083392 17518080 18262528 18675200 19382784 20167680 19920896 19744256 20493824 20347392
3376 20347392 22103040 22389248 23692800 23965184 25732096 26115584 27069440 27110400 28513792
3367 28513792 29902848 30143488 31074304 33044992 33197056 35093504 36432384 37778944 38718464
3358 38718464 41416704 43143168 45537792 46959616 49551360 51918848 56001024 59826688
$$ packed form
3423A0025984P18336q192L40480J457152k156544J274880k83648m96128J256448
3414A2128768J34144L34848n37600N06368J89952R9328M8640R80480r04704P02976
3404A3683200l27680l93216L02592j050112j09568O80448m96128r6256P47520
3395A2940800n03808O54336R22624O44608L49696n9904R99424P57248L64032J4336
3385A7083392M34688P44448M12672P07584P84896k46784j76640P49568j46432
3376B0347392J755648K86208J303552K72384J766912L83488R53856M0960J403392
3367B8513792J389056K40640R30816J970688J52064J896448J338880J346560R39520
3358C8718464K698240J726464K394624J421824K591744K367488M082176L825664
$$ plain form
3350 59826688 64408064 68774400 74859008 80035328 86908416 96212480 104729088 112269824
3342 112269824 120854016 128962048 136815104 148166656 159769600 173332992 189209600
3335 189209600 207044608 227736064 255655424 288498176 332043264 387982336 462680576
3328 462680576 564205568 697055744 852776960 992993792 1091708416 1154957824 1173521920
3321 1173521920 1090977280 904564224 689095168 506497536 373455872 280701952
3315 280701952 216341504 169627136 137900032 114603008 98782720 85767680 75909632
3308 75909632 66716160 60590080 54608896 49840640 46171136 42226688 39619072 36648960
3300 36648960 34672128 31973888 30126592 27260416 26535424 24874496 25171968 23508480
$$ packed form
3350E9826688M581376M366336O084608N176320O873088R304064Q516608P540736
3342A12269824Q584192Q108032P853056J1351552J1602944J3563392J5876608
3335A89209600J7835008K0691456K7919360L2842752M3545088N5939072P4698240
3328D62680576J01524992J32850176J55721216J40216832R8714624O3249408J8564096
3321A173521920q2544640j86413056k15469056j82597632j33041664r2753920
3315B80701952o4360448m6714368l1727104k3297024j5820288j3015040r858048
3308G5909632r193472o126080n981184m768256l669504l944448k607616k970112
3300C6648960j976832k698240j847296k866176p24992j660928K97472j663488
$$ plain form
3292 23508480 22070272 21461504 22016512 20296192 19601920 17876992 19334656 17700864 17387008
3283 17387008 16395776 16130048 15325696 15511040 14488064 15141888 13725184 14846976 13634560
3274 13634560 13442048 13079552 11779584 11330048 11752448 11119616 12153856 11443712 11538944
3265 11538944 10344960 11616256 10279424 9873408 10153984 10746880 11261952 10368000 11046912
3256 11046912 9895424 9162752 9397760 8759808 9771520 8192000 9144832 9338368 9506816
3247 9506816 9208832 9308672 9762304 8346112 8859648 5753856 6482944 7112192 6009344
3238 6009344 7035904 5612032 5650432 5514240 5678592 6118912 5297664 4795392 5172736
3229 5172736 5259776 5849600 4957696 4288512 5140992 5181952 5523456 4499456 4634624 4848640
$$ packed form
3292B3508480j438208o08768N55008j720320o94272j724928J457664j633792l13856
3283A7387008r91232k65728q04352J85344j022976O53824j416704J121792j212416
3274A3634560j92512l62496j299968m49536M22400o32832J034240p10144R5232
3265A1538944j193984J271296j336832m06016K80576N92896N15072q93952O78912
3256A1046912j151488p32672K35008o37952J011712j579520R52832J93536J68448
3247I506816k97984R9840M53632j416192N13536l105792P29088O29248j102848
3238F009344J026560j423872L8400j36192J64352M40320q21248n02272L77344
3229E172736Q7040N89824q91904o69184Q52480M0960L41504j024000J35168K14016
$$ plain form
3219 4848640 4909568 4980224 5066240 5036032 4425216 4505088 3785216 4155392 4083712 5028864 4608512
3208 4608512 4516864 4133376 3633664 3997184 3909120 3971072 2673152 3723264 3603968 4261888
3198 4261888 5133824 5301248 4243456 3312640 4942336 4776448 3947008 3358720 5144576
3189 5144576 4081664 4204544 4194816 4489728 5536256 4279296 4743680 4205568 4695552
3180 4695552 4471296 4069888 4367360 4554240 4567040 4492288 3907584 5018112 4438528 4278272
3170 4278272 4608512 6144512 4700160 4644864 3938816 4849664 4317696 4679680 3879936
3161 3879936 2722816 3838976 4209664 3601408 4899840 3365376 3538944 2967040 3575808
3152 3575808 2843136 3477504 3333632 3780096 4212224 3089408 3887104 4230144 4725760
$$ packed form
3219D848640O0928P0656Q6016l0208o10816P9872p19872L70176p1680R45152m20352
3208D608512r1648l83488m99712L63520q8064O1952j297920J050112j19296O57920
3198D261888Q71936J67424j057792r30816J629696j65888q29440n88288J785856
3189E144576j062912J22880r728K94912J046528j256960M64384n38112M89984
3180D695552k24256m01408K97472J86880J2800p4752n84704J110528n79584j60256
3170D278272L30240J536000j444352n5296p06048R10848n31968L61984p99744
3161C879936j157120J116160L70688o08256J298432j534464J73568n71904O08768
3152C575808p32672O34368j43872M46464M32128j122816P97696L43040M95616
$$ plain form
3143 4725760 3394048 3554816 3535360 3620864 3284992 2700288 3965952 4063744 4120064 5177344
3133 5177344 4225024 5827584 6481920 6553088 7545344 8212992 8076800 8234496 8074752 6569472
3123 6569472 6910976 5812736 5038592 5125632 4837888 4557312 4118016 4121600 4072960 4766720
3113 4766720 4611584 4204544 4622848 5100032 5121024 4982272 5285888 5257216 4952576 5722112
3103 5722112 5150720 6146048 5662720 5971456 6341120 6103040 5952000 6690304 6360064 7165440
3093 7165440 7505408 7602176 6865408 6659072 7621632 7662080 7208448 7793152 8497664 8760832
3083 8760832 9148416 9361408 9812992 10207232 10965504 10053120 12032512 11534848 10997248
3074 10997248 10535936 11464192 13113344 12680192 13728256 13919232 13971456 14167040 14966272
$$ packed form
3143D725760j331712J60768j9456Q5504l35872n84704J265664R7792N6320J057280
3133E177344r52320J602560O54336P1168R92256O67648j36192J57696j59744j505280
3123F569472L41504j098240p74144Q7040k87744k80576m39296L584m8640O93760
3113D766720j55136m07040M18304M77184K0992j38752L03616k8672l04640P69536
3103E722112n71392R95328m83328L08736L69664k38080j51040P38304l30240Q05376
3093G165440L39968R6768p36768k06336R62560M0448m53632N84704P04512K63168
3083H760832L87584K12992M51584L94240P58272r12384J979392m97664n37600
3074A0997248m61312R28256J649152m33152J048064J90976N2224J95584P99232
$$ plain form
3065 14966272 15340544 15683584 15666176 15725056 16673792 17186304 17510912 18770432 19290624 19884544
3055 19884544 21037056 22818304 22203904 23495680 24063488 24429568 24487936 24327168 24280576
3046 24280576 22447104 22675968 20990976 19961344 19770368 18563584 16832000 17169408 17214464
3037 17214464 16222208 17639936 16635392 17963520 16864256 17102336 17859072 16961536 16692224
3028 16692224 16111616 16634880 17004032 17796096 17071616 18199040 16910848 16889856 16699392
3019 16699392 17028096 17206784 15792640 15956992 14270464 13069312 12637696 11310080 10248704
3010 10248704 9750016 9027584 8597504 6651904 8410624 8795136 7852032 6943232 6238208
3001 6238208 6881792 7115776 6372864 7153152 5947904 6962688 5669376 5321216 6292480
$$ packed form
3065A4966272L74272L43040j7408N8880R48736N12512L24608J259520N20192N93920
3055A9884544J152512J781248o14400J291776N67808L66080N8368j60768m6592
3046B4280576j833472K28864j684992j029632j90976j206784j731584L37408M5056
3037A7214464r92256J417728j004544J328128j099264K38080P56736q97536k69312
3028A6692224n80608N23264L69152P92064p24480J127424j288192k0992j90464
3019A6699392L28704J78688j414144J64352j686528j201152m31616j327616j061376
3010A0248704m98688p22432m30080j945600J758720L84512r43104r08800p05024
3001F238208O43584K33984p42912P80288j205248J014784j293312l48160R71264
$$ plain form
2992 6292480 6894592 5472768 6252032 5768704 5767168 5747200 6562816 5973504 6269952 5634048
2982 5634048 7229952 6368768 7048192 6309376 6029824 6116352 6616064 6321152 6043136 6503936
2972 6503936 5188096 6070784 5422080 6370304 5632512 6230528 5874176 6837248 5985792
2963 5985792 6325760 5745664 7227904 5998592 6472704 5692928 6094336 7056896 6216704
2954 6216704 6067712 6409728 5901824 4868096 5753856 5673984 6101504 5490688 5232640 4880384
2944 4880384 5407232 4841472 5043200 4601344 4984832 5348864 4824576 5056000 5965824 4226048
2934 4226048 5013504 4828160 4819456 4686336 4757504 5980672 4603392 4576256 5492224 6425088
2924 6425088 4553728 6566912 4553728 5646848 5401600 6012928 6142976 6253568 6915072
$$ packed form
2992F292480O02112j421824P79264m83328j536j9968Q15616n89312K96448o35904
2982E634048J595904q61184O79424p38816k79552Q6528M99712k94912k78016M60800
2972F503936j315840Q82688o48704R48224p37792N98016l56352R63072q51456
2963E985792L39968n80096J482240j229312M74112p79776M01408R62560q40192
2954F216704j48992L42016n07904j033728Q85760p9872M27520o10816k58048l52256
2944D880384N26848n65760K01728m41856L83488L64032n24288K31424R09824j739776
2934D226048P87456j85344q704j33120P1168J223168j377280k7136R15968R32864
2924F425088j871360K013184k013184J093120k45248O11328J30048J10592O61504
$$ plain form
2915 6915072 5646848 6550528 5832704 6643200 7332864 7453184 8243200 8748544 8457728
2906 8457728 8823808 10423808 10053632 11979264 16220160 21073920 22703616 25724416 23394816
2897 23394816 22363648 22246400 15944192 10124800 8492544 6554624 5825536 5692928 5362688
2888 5362688 5637120 4869632 5076992 5814272 5243392 5146112 5572096 4325376 5286912 5027328
2878 5027328 5528064 5539328 4306432 5102592 4209152 4759040 4715008 3926016 3965440 3824128
2868 3824128 3674624 5041152 4841472 5342208 4731904 4946944 4724224 6195200 5156352
2859 5156352 5479424 4590592 5060608 4539904 3802624 5452288 4897280 4732928 4315648
2850 4315648 4250112 4858880 4808192 4926976 3597312 4288000 3412480 4484608 4532224 4785664
$$ packed form
2915F915072j268224R03680p17824Q10496O89664J20320P90016N05344k90816
2906H457728L66080J600000l70176J925632M240896M853760J629696L020800k329600
2897B3394816j031168j17248o302208n819392j632256j937920p29088j32608l30240
2888E362688K74432p67488K07360P37280n70880r7280M25984j246720R61536k59584
2878E027328N00736J1264j232896P96160q93440N49888m4032p88992L9424j41312
2868C824128j49504J366528j99680N00736o10304K15040k22720J470976j038848
2859E156352L23072q88832M70016n20704p37280J649664n55008j64352m17280
2850D315648o5536O08768n0688J18784j329664O90688q75520J072128M7616K53440
$$ plain form
2840 4785664 4353536 3468800 3486208 3828224 4903424 4278272 6124032 4085248 4915712
2831 4915712 4994560 4694528 4966912 4296192 6221824 5462528 4150784 4678144 4518912
2822 4518912 5299712 5873152 3211264 4783104 4820992 4883456 4390400 4445696 4537344 4571648
2812 4571648 5019136 4145152 5068288 4882944 5547520 5103616 5338624 6098432 6334976 6047744
2802 6047744 6128640 7474176 7104000 7366656 7693824 7502336 7476224 8977408 8174592 8856064
2792 8856064 8442368 8855552 9506304 9806848 9609216 10716160 10066944 10577408 11691520
2783 11691520 11644928 11968000 12522496 13051392 13010944 13058048 13354496 12732416 12417536 11621376
2773 11621376 11709440 10032640 10886656 9112064 9978368 7483904 8594432 8504320 7590400
$$ packed form
2840D785664m32128q84736J7408L42016J075200o25152J845760k038784Q30464
2831D915712P8848l00032K72384o70720J925632p59296j311744N27360j59232
2822D518912P80800N73440k661888J571840L7888O2464m93056N5296R1648L4304
2812D571648M47488q73984R23136j85344O64576m43904K35008P59808K36544k87232
2802F047744Q0896J345536l70176K62656L27168j91488k6112J501184q02816O81472
2792H856064m13696M13184O50752L00544j97632J106944o49216N10464J114112
2783A1691520m6592L23072N54496N28896m0448M7104K96448o22080l14880p96160
2773A1621376Q8064j676800Q54016j774592Q66304k494464J110528r0112r13920
$$ plain form
2764 7590400 6863872 7353344 6810624 7115264 7132672 6822400 6872064 6476288 6691328 7162368
2754 7162368 6437376 6326272 5755392 6707712 6605824 7636480 6145024 5869568 6049792
2745 6049792 6104064 6180864 6632960 7595008 7075328 6939136 7870976 6740992 7612416 7981056
2735 7981056 8196608 9263104 10778112 9160192 9358848 10302976 10309632 10454528 11059200
2726 11059200 9993216 10045952 10312704 11707904 10752512 11116032 11452928 11784704 11506176
2717 11506176 12168704 12070400 11636224 13094400 12490240 13248512 12149248 11397120 10244608
2708 10244608 10869248 9668096 8799232 9189376 7651840 7586816 6850048 7112704 5698048
2699 5698048 5016064 6135808 5565952 5859840 5340160 6061056 6547456 7579648 6434304
$$ packed form
2764G590400p26528M89472n42720L04640J7408l10272M9664l95776K15040M71040
2754G162368p24992j11104n70880R52320j01888J030656j491456k75456J80224
2745F049792N4272P6800M52096R62048n19680j36192R31840j129984Q71424L68640
2735G981056K15552J066496J515008j617920J98656R44128O656J44896O04672
2726A1059200j065984N2736K66752J395200r55392L63520L36896L31776k78528
2717A1506176O62528r8304m34176J458176o04160P58272j099264p52128j152512
2708A0244608O24640j201152q68864L90144j537536o5024p36768K62656j414656
2699E698048o81984J119744n69856K93888n19680P20896M86400J032192j145344
$$ plain form
2690 6434304 6498816 7783424 6280704 9058304 8094208 9346560 11525120 16270336 26092032
2681 26092032 31279104 36099072 26876416 15052288 10457600 8071680 6739456 6532608
2673 6532608 6036992 5016064 5530624 5012480 4974080 5009408 3243520 4182016 4619264 3329024
2663 3329024 4412416 2962432 3322368 4960256 3642368 3683328 4344832 3986944 4636160
2654 4636160 4768768 3913728 4266496 3536896 2976768 3796480 3446784 3910656 4578816 3837952
2644 3837952 3843072 4597248 4274688 3830272 4600320 4604416 4316672 3897344 3671040 4115968
2634 4115968 4141568 3998720 4477440 3774464 4223488 4473344 3524096 3320832 3564544 4173824
2624 4173824 3689984 3412992 4230656 5058560 4829184 3689984 5248000 4411392 4199424
$$ packed form
2690F434304O4512J284608j502720K777600r64096J252352K178560M745216R821696
2681B6092032N187072M819968r222656j1824128m594688k385920j332224k06848
2673F532608m95616j020928N14560n18144l8400L5328j765888R38496M37248j290240
2663C329024J083392j449984L59936J637888j317888M0960O61504l57888O49216
2654D636160J32608q55040L52768p29600n60128Q19712l49696M63872O68160p40864
2644C837952N120P54176l22560m44416P70048M096k87744m19328k26304M44928
2634D115968K5600j42848M78720p02976M49024K49856r49248k03264K43712O09280
2624D173824m83840k76992Q17664Q27904k29376j139200J558016q36608k11968
$$ plain form
2615 4199424 4375040 3673600 5916672 4843520 5059584 5919744 5555712 6219776 6656512
2606 6656512 6062592 6849024 6766592 6390784 7751168 8010240 9004032 7707648 8228864
2597 8228864 9055232 11694080 13215744 16405504 24123392 36563456 42606080 50647040
2589 50647040 34010112 21457920 15895552 14140928 13686272 14970880 21638656 27253760
2581 27253760 30928896 29850112 18589696 13681664 13114880 15277056 18023424 27629056
2573 27629056 36098048 39929344 39748096 21822464 15387648 13131776 13033472 14336000
2565 14336000 19576320 24960000 26784768 26995712 14904832 9826304 8561152 9291776
2557 9291776 8727040 11121152 13529088 14855680 15069696 9114624 5455872 5734400 3476992
$$ packed form
2615D199424J75616p01440K243072j073152K16064Q60160l64032O64064M36736
2606F656512n93920P86432q2432l75808J360384K59072R93792j296384N21216
2597H228864Q26368K638848J521664L189760P717888J2440064O042624Q040960
2589E0647040j6636928j2552192n562368j754624m54656J284608O667776N615104
2581B7253760L675136j078784j1260416m908032n66784K162176K746368R605632
2573B7629056Q468992L831296j81248j7925632o434816k255872r8304J302528
2565A4336000N240320N383680J824768K10944j2090880n078528j265152P30624
2557I291776n64736K394112K407936J326592K14016n955072l658752K78528k257408
$$ plain form
2548 3476992 4700160 5061632 3852288 3784192 3784704 4280320 4127744 4659200 4922368 4632576
2538 4632576 4623872 4460544 4530688 5020672 5317632 6109184 5830656 7140352 6131712 6755840
2528 6755840 6239232 6493184 5489664 5155328 6138880 6009856 6183936 4945920 4997120
2519 4997120 4432896 5264896 4185088 4281344 2805248 4486656 4007936 3251712 3824128
2510 3824128 2492416 2925568 3621376 3724800 3746816 3766272 3545600 4436992 2864640 2899456
2500 2899456 3196928 3150848 3373568 3727872 2287616 3020288 2147840 2094592 1506304 2359296
2490 2359296 1978368 1992192 2135040 2942464 3063296 1533952 2429440 1960960 2991616
2481 2991616 1961472 2351104 2844160 3017728 2142208 2080768 2584064 3214336 1400832
$$ packed form
2548C476992J223168L61472j209344o8096N12M95616j52576N31456K63168k89792
2538D632576q704j63328P0144M89984K96960P91552k78528J309696j008640O24128
2528F755840n16608K53952j003520l34336R83552j29024J74080j238016N1200
2519D997120n64224Q32000j079808R6256j476096J681408m78720p56224N72416
2510C824128j331712M33152O95808J03424K2016J9456k20672Q91392j572352L4816
2500B899456K97472m6080K22720L54304j440256P32672q72448n3248n88288Q52992
2490B359296l80928J3824J42848Q07424J20832j529344Q95488m68480J030656
2481B991616j030144L89632M93056J73568q75520o1440N03296O30272A400832
$$ plain form
2471 2096128 1915904 3859456 2068480 2912768 2800640 2918912 2520064 2373120 2347008
2462 2347008 3042304 2859520 3004928 2942976 1605632 2991616 1736704 2406912 2287616
2453 2287616 2328064 2446848 2204672 2526208 2518528 1856000 1950720 1780224 3060224 3571712
2443 3571712 2483200 3467776 1900032 2767872 2860544 2762752 2855424 2886656 2909184 2154496
2433 2154496 3220480 3353088 2593792 2831360 3294720 2761728 2981376 3650048 3453952
2424 3453952 3931136 3393536 3373568 2746368 2811392 2665472 2806272 2242048 2903040 3261952
2414 3261952 3348992 1809920 2941952 3902976 3084288 1982464 3409920 3037696 2473472
2405 2473472 3258880 2733568 1772544 2947584 3255296 2736640 2875392 2314752 2930688
$$ packed form
2471B096128j80224J943552j790976Q44288j12128J18272l98848j46944k6112
2462B347008O95296j82784J45408o1952j337344J385984j254912O70208j19296
2453B287616M0448J18784k42176L21536p680o62528R4720j70496J280000N11488
2443C571712j088512R84576j567744Q67840R2672r7792R2672L1232K2528p54688
2433B154496J065984J32608p59296K37568M63360n32992K19648O68672j96096
2424C453952M77184n37600j9968o27200O5024j45920J40800n64224O60992L58912
2414C261952Q7040j539072J132032R61024q18688j101824J427456l72224n64224
2405B473472P85408n25312r61024J175040L07712n18656J38752n60640O15936
$$ plain form
2396 2930688 2402816 2580480 1455616 2184704 2776064 2275328 3063296 2201088 2296320 2886656
2386 2886656 3050496 3175424 3147776 1854976 2962432 2005504 2378752 2320896 3075584 1900544
2376 1900544 3332096 2150400 1267712 2303488 2963456 3588096 2342400 2285568 2701312
2367 2701312 2689536 1897472 2317824 2811392 3031552 3904512 2153472 2634752 3342848 3059200
2357 3059200 2940416 3157504 3249152 2696704 3816960 3276800 3129344 3116032 3347968 3102208
2347 3102208 3576832 2729984 3079680 2747392 3725312 3698688 2786304 3998208 4432384 3259392
2337 3259392 3670528 5271040 4473856 3227136 3648512 3243008 4050432 3528704 3730432
2328 3730432 3645952 4445696 3662336 4748800 3834368 3102720 4382720 4407808 3936256 6106624
$$ packed form
2396B930688n27872J77664j124864P29088N91360n00736P87968q62208R5232N90336
2386B886656J63840J24928k7648j292800J107456r56928L73248n7856P54688j175040
2376A900544J431552j181696q82688J035776O59968O24640j245696n6832M15744
2367B701312j1776p92064M20352M93568K20160Q72960j751040M81280P08096k83648
2357C059200j18784K17088R1648n52448J120256n40160j47456j3312K31936k45760
2347C102208M74624q46848L49696l32288R77920k6624r12384J211904M34176j172992
2337C259392M11136J600512p97184j246720M21376m05504Q07424n21728K01728
2328C730432q4480P99744p83360J086464r14432p31648J280000K5088m71552K170368
$$ plain form
2318 6106624 4183040 5396992 4856832 5577728 4623872 5151744 5007360 5750272 5609984
2309 5609984 5507072 5638144 5992448 5732352 4519424 5362688 5643776 4862976 5810688
2300 5810688 4801536 5019136 4596224 4822528 4877824 5314560 4874240 4645376 5835776
2291 5835776 5798912 4768256 5364736 4762112 6081024 5427712 4057600 5680128 5356032
2282 5356032 4782080 4321792 5458944 4382208 3987968 4145664 4459520 4422144 5050880
2273 5050880 4482560 3920384 4434944 4412416 3825664 4392448 4320256 3475968 3792384 4709888
2263 4709888 3831808 3884032 3515392 4228608 4490240 5117952 3972608 4316160 3497472 4324864
2253 4324864 4119040 4183552 3909632 4169728 4769280 3553792 4372992 4082176 4002304 3065856
$$ packed form
2318F106624j923584J213952n40160P20896r53856N27872j44384P42912j40288
2309E609984j02912J31072L54304k60096j212928Q43264K81088p80800R47712
2300E810688j009152K17600m22912K26304N5296M36736m40320k28864J190400
2291E835776l6864j030656N96480o02624J318912o53312j370112J622528l24096
2282E356032n73952m60288J137152j076736l94240J57696L13856l7376O28736
2273E050880n68320n62176N14560k2528n86752N66784p2192q44288L16416R17504
2263D709888q78080N2224l68640P13216K61632O27712j145344L43552q18688Q27392
2253D324864k05824O4512k73920K60096N99552j215488Q19200k90816p9872r36448
$$ plain form
2243 3065856 4535808 3548672 4250624 3645952 3532800 4688896 4943360 4723200 4471808
2234 4471808 4089344 4701696 4414976 4718080 4170752 5061120 3509760 4123136 3747328
2225 3747328 4033536 5539840 3799040 4078080 5099520 3719168 4361728 3948032 3499008
2216 3499008 3649024 3088896 3230208 5321728 4313600 4177408 4524544 4832256 3941888
2207 3941888 5214720 5119488 3851776 4766720 4727296 4001792 6038016 5129216 5748736
2198 5748736 6042112 5666816 6492160 5232128 4839936 4448256 5780480 4957696 5240832
2189 5240832 5263872 4380672 5475840 4114944 4935680 5428224 5788672 5639680 5307904
2180 5307904 5856768 5149696 5048832 5904896 5408256 5152768 5146624 5649408 4389376 5586944
$$ packed form
2243C065856J469952r87136P01952o04672j13152J156096K54464k20160k51392
2234D471808l82464O12352k86720L03104n47328Q90368j551360O13376l75808
2225C747328K86208J506304j740800K79040J021440j380352O42560m13696m49024
2216C499008J50016n60128J41312K091520j008128j36192L47136L07712q90368
2207C941888J272832r5232j267712R14944l9424p25504K036224r08800O19520
2198E748736K93376l75296Q25344j260032l92192l91680J332224q22784K83136
2189E240832K3040q83200J095168j360896Q20736M92544L60448j48992l31776
2180E307904N48864p07072j00864Q56064m96640k55488o144N02784j260032J197568
$$ plain form
2170 5586944 4313088 4831744 3935232 3984896 5374976 4219392 4592128 3852800 4069376
2161 4069376 4865536 3845120 5134336 4479488 5085696 3920896 5411328 5451776 5463552
2152 5463552 5109248 5795328 5443584 5170176 5606912 4448768 5702144 4953600 5005824
2143 5005824 5010944 4553728 6330880 5266944 5791232 4997632 5724160 6903808 5773824
2134 5773824 6425600 6140416 6801408 6591488 6272000 6617088 7582720 6398976 6453248 7228928
2124 7228928 6756864 7503872 7526912 7006208 6433792 6383616 7819776 7762432 7276544 7538176
2114 7538176 8148992 8503296 8226816 7055360 7596544 7008768 6470656 6729728 7199744
2105 7199744 5760000 7093760 6517248 5873152 7922688 7054848 7297024 7328256 7019008
$$ packed form
2170E586944j273856N18656q96512M9664J390080j155584L72736p39328K16576
2161D069376P96160j020416J289216o54848O06208j164800J490432M0448J1776
2152E463552l54304O86080l51744k73408M36736j158144J253376p48544N2224
2143E005824N120m57216J777152j063936N24288p93600P26528J179648j129984
2134E773824O51776k85184O60992k09920l19488L45088R65632j183744N4272P75680
2124G228928m72064P47008K3040n20704n72416n0176J436160n7344m85888K61632
2114G538176O10816L54304k76480j171456N41184n87776n38112K59072M70016
2105G199744j439744J333760n76512o44096K049536q67840K42176L1232l09248
$$ plain form
2096 7019008 6906880 7023104 7773184 6759424 8096768 6480896 7760896 7367680 7290880
2087 7290880 7109120 6919168 6988800 7323648 6552064 6936576 6818304 7001088 6564352 6451712
2077 6451712 7509504 7311360 7102464 6923776 5669376 7299072 7197184 6023168 7228928
2068 7228928 6500352 6021632 5735936 6541824 7252992 5575680 6447104 5420544 6250496
2059 6250496 6743552 6806016 5749248 6861824 7433216 6370816 7365632 6373376 7275008
2050 7275008 7075840 6725120 6565376 6195200 7237632 5934080 5706752 6315008 4737536
2041 4737536 5104128 5913088 5914112 6100480 5664256 6245888 5496320 5688320 5472256 5799936
2031 5799936 5107200 5608960 6168576 5306880 6548480 4926464 6091776 6374912 6649856
$$ packed form
2096G019008j12128J16224P50080j013760J337344j615872J280000l93216p6800
2087G290880j81760j89952O9632L34848p71584L84512j18272J82784m36736j12640
2077F451712J057792j98144k08896j78688j254400J629696j01888j174016J205760
2068G228928p28576m78720k85696Q05888P11168j677312Q71424j026560Q29952
2059F250496M93056O2464j056768J112576N71392j062400R94816r92256R01632
2050G275008j99168l50720j59744l70176J042432j303552k27328O08256j577472
2041D737536L66592Q08960J024J86368m36224N81632p49568J92000k16064L27680
2031E799936o92736N01760N59616q61696J241600j622016J165312K83136K74944
$$ plain form
2022 6649856 6590976 6458368 5917696 6385152 6134272 6636544 6404096 6205440 7284224 6305280
2012 6305280 6394880 6918656 6742528 7195136 7623168 7146496 6829568 8045056 7033344
2003 7033344 7348736 5996032 7242752 6577664 7525888 7824384 6541824 8144384 7687168
1994 7687168 7780352 7433728 7662592 8495104 8329728 8336896 7566848 9426944 8254976 8684544
1984 8684544 8600576 8413184 9265664 9895936 9859072 10130944 10292224 9597952 11172864 10638848
1974 10638848 10184192 9687040 10164224 10528768 9462784 10850816 9843712 10670592 9857024
1965 9857024 9439232 9128960 10549760 9048576 10141696 10480640 9212416 9823744 9524224
1956 9524224 9815552 10430464 9641472 8580608 9553920 10064384 9160704 10395136 9261568
$$ packed form
2022F649856n8880j32608n40672M67456k50880N02272k32448j98656J078784r78944
2012F305280Q9600N23776j76128M52608M28032m76672l16928J215488j011712
2003G033344L15392j352704J246720o65088R48224K98496j282560J602560m57216
1994G687168R3184l46624K28864Q32512j65376P168p70048J860096j171968M29568
1984H684544q3968j87392Q52480O30272l6864K71872J61280o94272J574912n34016
1974A0638848m54656m97152M77184L64544j065984J388032j007104Q26880q13568
1965I857024m17792l10272J420800j501184J093120L38944j268224O11328k99520
1956I524224K91328O14912p88992j060864R73312N10464r03680J234432j133568
$$ plain form
1947 9261568 9399296 10601984 9236480 10255360 10713600 9948160 10817536 11047424 11057152
1938 11057152 10622976 11275776 11265024 10178048 10319872 10900992 10617344 10523648 10510336 10136576
1928 10136576 10513408 10427904 10157056 10479616 10864128 10968064 11138560 13166592 15215104
1919 15215104 22000128 27053056 29880320 25905152 15457280 12344320 10619392 10033664
1911 10033664 9233408 8257536 8411648 8527360 8630784 7115264 8206848 9096192 8312320
1902 8312320 8391168 7410176 8210944 7510016 7167488 7510528 7535616 7601152 7050240 8386560
1892 8386560 7078912 7599616 7711744 7313408 8668160 8051200 7142912 7305216 7701504
1883 7701504 6667264 8186880 6896128 6459904 8312320 6861824 8352256 7302656
$$ packed form
1947I261568J37728J202688j365504J018880M58240p65440Q69376K29888R728
1938A1057152m34176O52800j0752j086976J41824N81120k83648r3696j3312l73760
1928A0136576L76832q5504k70848L22560L84512J03936J70496K028032K048512
1919A5215104O785024N052928K827264l975168j0447872l112960j724928n85728
1911A0033664q00256r75872J54112J15712J03424j515520J091584Q89344p83872
1902H312320P8848r80992Q00768p00928l42528L43040K5088O5536n50912J336320
1892H386560j307648N20704J12128l98336J354752o16960r08288J62304L96288
1883G701504j034240J519616j290752m36224J852416j450496J490432j049600
$$ plain form
1875 7302656 7199744 6737920 7921664 7733248 7812608 7358976 6600192 7010816 7479808 6709760
1865 6709760 7155712 6517248 6107136 6608896 6026752 7139328 6388736 6291456 6600704 6629376
1855 6629376 6504448 6297600 6016000 6178304 6883840 6653952 7124992 6433792 6077440 6464000
1845 6464000 6001152 5994496 5918208 6309376 6307328 5562880 7249920 6439424 5302272 5914624
1835 5914624 6590976 5816320 5571584 6168064 6788096 6263808 5994496 7240192 5047296
1826 5047296 5612032 5220864 5854208 6610944 5478912 6410240 6408192 5232128 5978112 6520832
1816 6520832 5614080 5988352 6755840 6835712 5527040 6678528 6369280 6488064 7095808
1807 7095808 6167040 7290880 7058432 7331328 7469056 7823360 6928896 7668224 7630336 7920128
$$ packed form
1875G302656j02912m61824J183744j88416P9360m53632p58784M10624M68992p70048
1865F709760M45952o38464m10112N01760n82144J112576p50592r7280L09248K8672
1855F629376j24928k06848k81600J62304P05536k29888M71040o91200l56352L86560
1845F464000m62848o656p6288L91168k048p44448J687040q10496j137152O12352
1835E914624O76352p74656k44736N96480O20032n24288k69312J245696k192896
1826E047296N64736l91168O33344P56736j132032R31328k048j176064P45984N42720
1816F520832r06752L74272P67488P9872j308672J151488l09248J18784O07744
1807G095808r28768J123840k32448K72896J37728L54304q94464P39328l7888K89792
$$ plain form
1797 7920128 7860736 8122368 7808000 8591872 7798272 9094656 8564736 8991744 8368128 8926720
1787 8926720 8843264 7976960 9465344 9466880 9166848 9612800 9551360 9733120 9428992 10022400
1777 10022400 10069504 9945088 11009024 11143680 10048000 9515008 10156032 10810880 10784256
1768 10784256 10890240 10506752 11587584 11639808 12133376 10530304 12801536 14090752 11877888
1759 11877888 13086208 12028416 12457472 12142080 11755520 12744192 12723712 11737088 11730944 11881984
1749 11881984 11181056 12485120 11238400 11225600 11095552 10858496 10857472 11067392 10458112 11203584
1739 11203584 9753088 11012608 11420672 10869248 10624512 10618880 11784192 10832896 10721792
1730 10721792 11677184 11793920 10426880 10626048 10788352 10848256 9979904 11221504 10322432
$$ packed form
1797G920128n9392K61632l14368P83872p93600J296384n29920M27008o23616N58592
1787H926720q3456q66304J488384J536l00032M45952o1440J81760l04128N93408
1777A0022400M7104j24416J063936J34656j095680n32992O41024O54848k6624
1768A0784256J05984l83488J080832N2224M93568j603072K271232J289216k212864
1759A1877888J208320j057792M29056l15392l86560R88672k0480r86624o144J51040
1749A1881984p00928J304064j246720j2800j30048k37056j024K09920o09280P45472
1739A1203584j450496J259520M08064n51424k44736n632J165312r51296j11104
1730A0721792R55392J16736j367040J99168J62304N9904q68352J241600q99072
$$ plain form
1721 10322432 10333184 10907648 9319424 10120192 10728960 10016768 10302464 9339904 9958912
1712 9958912 9564672 9867776 9355776 9614848 9091072 8469504 8356864 8460800 9025024 7516672
1702 7516672 8793088 8095744 7994368 8398848 7538688 7259648 7934464 8425472 7455232
1693 7455232 7812608 7300608 7880192 7298560 7678976 7826944 7132160 7025664 8102912
1684 8102912 6932992 6980096 7568896 6829056 6777344 6560256 6470656 7211520 7699456 6311424
1674 6311424 6834176 6664704 7907328 7219712 7303680 6381056 7566336 6944768 6721024
1665 6721024 6365696 6660608 7755264 6897152 7441408 7462400 7556096 7612416 8962048 7740416
1655 7740416 8611328 8994304 9034240 9587712 9654272 8671744 7600128 9799680 8847360 8665600
$$ packed form
1721A0322432J0752N74464j588224Q00768O08768p12192K85696r62560O19008
1712I958912l94240L03104n12000K59072n23776o21568j12640J03936N64224j508352
1702G516672J276416o97344j01376M04480q60160k79040O74816M91008r70240
1693G455232L57376n12000N79584n81632L80416J47968o94784j06496J077248
1684H102912j169920M7104N88800p39840n1712k17088q9600P40864M87936j388032
1674F311424N22752j69472J242624o87616Q3968r22624J185280o21568k23744
1665F721024l55328K94912J094656q58112N44256K0992R3696N6320J349632j221632
1655G740416Q70912L82976L9936N53472O6560r82528j071616K199552r52320j81760
$$ plain form
1645 8665600 9325056 9069568 9484800 9547776 9489408 10248704 10155008 11034624 11788800 11719680
1635 11719680 10976768 11455488 11669504 12382720 12341248 12811776 11560960 13476352 13265408
1626 13265408 14074880 12972544 13671424 13910016 14768128 15254016 15005184 15802880 16889344
1617 16889344 17918976 18456064 19038720 18695168 20038656 21067264 23114240 23682560 23902720
1608 23902720 25012224 26917376 28173312 29352960 30621696 31565312 33391616 34383872
1600 34383872 35372544 36546048 37073408 38185984 37315072 39084032 39631872 41114112 41514496
1591 41514496 42400768 43923968 44429312 46225408 48276992 49889280 51249664 55079936
1583 55079936 57303040 60820480 64867328 69056512 75617280 81936384 89651712 96326656
$$ packed form
1645H665600O59456k55488M15232O2976n8368P59296r3696Q79616P54176o9120
1635A1719680p42912M78720K14016P13216m1472M70528j250816J915392k10944
1626A3265408Q09472j102336O98880K38592Q58112M85888k48832P97696J086464
1617A6889344J029632N37088N82656l43552J343488J028608K046976N68320K20160
1608B3902720J109504J905152J255936J179648J268736R43616J826304R92256
1600C4383872R88672J173504N27360J112576q70912J768960N47840J482240M00384
1591D1514496Q86272J523200N05344J796096K051584J612288J360384L830272
1583E5079936K223104L517440M046848M189184O560768O319104P715328O674944
$$ plain form
1575 96326656 104369152 109965824 111634944 108854272 103634944 94170624 83934208 74415104
1567 74415104 62761984 53512704 44488704 36626944 30590464 26827264 23699456 20805632
1559 20805632 19730432 18046464 16975872 15259648 15349760 14155776 12442112 11955200 12532736
1550 12532736 12354048 12166144 12081664 11446272 10845696 10744320 9708544 10180096 10074112
1541 10074112 8736768 9414144 10107392 8421376 8568832 9160704 8050176 8659968 7762432
1532 7762432 6470144 7251456 7215616 7298048 7063040 7166464 6866944 7766016 6543360 7118848
1522 7118848 5715456 6262272 6397440 6385152 6129152 5956096 5713408 6653952 6145536 4666368
1512 4666368 6114816 5476352 5077504 5586944 5873664 5857280 4979200 6118400 5341184
$$ packed form
1575I6326656Q042496N596672J669120k780672n219328r464320j0236416r519104
1567G4415104j1653120r249280r024000p861760o036480l763200l127808k893824
1559B0805632j075200j683968j070592j716224R0112j193984j713664m86912N77536
1550A2532736j78688j87904q4480o35392o00576j01376j035776M71552j05984
1541A0074112j337344O77376O93248j686016J47456N91872j110528O09792q97536
1532G762432j292288P81312l5840Q2432k35008J03424k99520Q99072j222656N75488
1522G118848j403392N46816J35168j2288k56000j73056k42688R40544n08416j479168
1512D666368J448448o38464l98848N09440K86720j6384q78080J139200p77216
$$ plain form
1503 5341184 4910592 6206464 4723712 6178816 4302336 5123584 4167168 4155392 5005312
1494 5005312 3206656 4433920 4771328 5310464 5297152 4439040 5117952 4628480 3974656
1485 3974656 4286464 3083776 3906048 4280832 3980288 5090304 3634176 4547072 3940864
1476 3940864 4274176 4021248 2887168 3705856 4167168 2701312 4027392 2778112 3138560
1467 3138560 3589120 3946496 3168768 4370944 3463168 3800576 4254720 3972608 3846656
1458 3846656 4472320 3564032 4093440 3838464 3779584 3660288 3802624 3648000 4371968 3843072
1448 3843072 5499392 5653504 4313088 4701184 5091840 5425152 5491712 5351936 6197760
1439 6197760 6482944 6832128 5676544 6810624 6524928 7087616 7049216 7181824 6842880
$$ packed form
1503E341184m30592J295872j482752J455104j876480Q21248r56416j1776Q49920
1494E005312j798656J227264L37408N39136j3312q58112O78912m89472o53824
1485C974656L11808j202688Q22272L74784l00544J110016j456128R12896o06208
1476C940864L33312k52928j134080Q18688M61312j465856J326080j249280L60448
1467C138560M50560L57376p77728J202176r07776L37408M54144k82112j25952
1458C846656O25664r08288N29408k54976n8880j19296J42336j54624P23968n28896
1448C843072J656320J54112j340416L88096L90656L33312O6560j39776Q45824
1439F197760K85184L49184j155584J134080k85696N62688l8400J32608l38944
$$ plain form
1430 6842880 8215040 7975936 8251904 8118784 7940096 10479104 10061824 11747840 12780544
1421 12780544 13291520 13191680 11437056 11419136 9814016 10285056 9195520 9365504 8686080
1412 8686080 8815104 9131520 8971776 8040448 9217536 8834048 8771072 8456704 8807936 8263168
1402 8263168 7458304 8167424 8069120 8556032 8219648 7354880 8865792 8524288 8031744 8123904
1392 8123904 8750592 9245184 9278976 9506816 9546240 11133440 11891200 12692480 12178432 13114880
1382 13114880 14050816 14297600 13964800 13431296 12747776 11016192 9655808 8938496 8384512
1373 8384512 6947840 8307200 7099904 6399488 6839808 8142848 6612480 6832640 6835200
1364 6835200 7071744 7589376 6416896 6721536 7122944 8673792 7058944 8074752 8707072
$$ packed form
1430F842880J372160k39104K75968j33120j78688K539008m17280J686016J032704
1421A2780544N10976r9840j754624j7920j605120M71040j089536J69984o79424
1412H686080J29024L16416j59744r31328J177088l83488o2976l14368L51232n44768
1402H263168q04864P09120r8304M86912l36384q64768J510912l41504m92544R2160
1392H123904O26688M94592L3792K27840L9424J587200P57760Q01280n14048R36448
1382A3114880R35936K46784l32800n33504o83520j731584j360384p17312n53984
1373H384512j436672J359360j207296p00416M40320J303040j530368K20160K560
1364F835200K36544N17632j172480L04640M01408J550848j614848J015808O32320
$$ plain form
1355 8707072 9617408 9417216 8902144 9895936 9496064 9304064 9075712 8292864 8084480 6658048
1345 6658048 7376896 6644224 6534656 6837760 6839296 5273088 5159936 5502976 5956096 4512768
1335 4512768 4609024 4688896 4416000 4306432 4998144 4086272 3823616 4345344 4598272 4873216
1325 4873216 3929600 4123648 4218368 3475456 3906560 4539392 4332032 3681280 3139584 2922496
1315 2922496 2988032 4100096 2315264 3641344 3866112 3501056 4710912 4505600 4036096
1306 4036096 3910656 3666432 4594688 4616192 4613120 5080064 4773888 4996608 3791872 4383232
1296 4383232 3829248 4465152 3463168 4782592 4733440 3803648 3535872 3860992 4995584
1287 4995584 2406912 3675136 3738624 2904576 3236864 3618816 2289664 4020736 2131968
$$ packed form
1355H707072R10336k00192n15072R93792l99872j92000k28352p82848k08384j426432
1345F658048P18848p32672j09568L03104J536j566208j13152L43040M53120j443328
1335D512768R6256P9872k72896j09568O91712r11872k62656N21728K52928K74944
1325D873216r43616J94048R4720p42912M31104O32832k07360o50752n41696k17088
1315B922496O5536J112064j784832J326080K24768l65056J209856k05312m69504
1306D036096j25440k44224R28256K1504l072M66944l06176K22720j204736N91360
1296D383232n53984O35904j001984J319424m9152r29792k67776L25120J134592
1287D995584B406912J268224O3488q34048L32288L81952j329152J731072j888768
$$ plain form
1278 2131968 3087872 3111424 2983936 2318336 3668480 4320256 3050496 4539392 3544576
1269 3544576 2007040 2820096 3134976 3737088 2836480 2958336 2258432 3209728 3399168
1260 3399168 2758144 2275840 2123264 2231296 2146816 1829888 1919488 2286080 2908672 2886656
1250 2886656 3456000 2675712 1809408 1652736 1224192 2107392 2859520 2029568 2352640 2753536
1240 2753536 2163200 1984000 2221568 2753536 1157120 2411520 2402816 2566656 2418688 2925056
1230 2925056 1336320 1782784 2194432 1203200 2004992 2485760 2282496 1336320 1794048
1221 1794048 1289728 1631744 1084928 1131520 2566656 2394624 1585664 1730048 1483776 1890304
1211 1890304 2105344 2231808 783872 2993152 1355264 1894912 1671168 1574400 1958912
$$ packed form
1278B131968R55904K3552j27488o65600J350144O51776j269760J488896r94816
1269C544576j537536Q13056L14880O02112r00608J21856o99904R51296J89440
1260C399168o41024m82304j52576J08032q4480l16928Q9600L66592O22592k2016
1250B886656N69344p80288q66304j56672m28544Q83200P52128q29952L23072M00896
1240B753536n90336j79200K37568N31968A157120J254400q704J63840j47968N06368
1230B925056A336320M46464M11648r91232Q01792M80768k03264r46176M57728
1221A794048n04320L42016n46816M6592J435136j72032q08960J44384k46272M06528
1211A890304K15040J26464G83872K209280A355264N39648k23744r6768L84512
$$ plain form
1202 1958912 1180160 1718784 1111552 1249792 1433600 1188864 2592256 696320 619520 1956352
1192 1956352 430080 2579968 651776 898048 1216512 -41472 1593856 728576 -182784
1182 447488 2118656 1308672 1011712 960512 1631744 1046528 2402816 1724416 1584640 1336320
1172 1336320 1253888 525824 793088 1326592 264704 1338368 1446912 631808 1367040 1178112
1162 1178112 1623040 486912 1353728 100864 903680 1067520 288256 662528 2376704
1153 2376704 934912 1135104 1371136 658432 1928192 1869312 306176 1172480 1723904 -145920
1142 1653760 1228800 1815040 1535488 1405952 816128 1801216 1052160 1993728 1553408 1226752
1132 1226752 1124864 1329664 431104 1830400 2049536 1317888 1036288 665088 1124352
$$ packed form
1202A958912p78752N38624o07232J38240J83808k44736J403392F96320p6800J336832
1192A956352D30080K149888F51776K46272L18464d1472A593856G28576a82784
1182D47488J671168q09984k96960n1200O71232n85216J356288o78400j39776k48320
1172A336320q2432E25824K67264N33504B64704J073664J08544F31808P35232j88928
1162A178112M44928D86912Q66816A00864Q02816J63840B88256L74272J714176
1153B376704I34912K00192K36032F58432J269760n8880C06176Q66304N51424a45920
1142A653760m24960N86240k79552j29536n89824R85088p49056R41568m40320l26656
1132A226752j01888K04800D31104J399296K19136p31648k81600l71200M59264
$$ plain form
1123 1124352 1461248 1898496 1631744 553472 1289216 1433088 1227264 1278976 2174464 1743872
1113 1743872 1410560 456704 1622016 2032640 170496 260608 574976 1195520 1085440 399872
1102 1541120 1393152 2214912 760832 1380352 1989632 1269760 1726464 1217536 1917952 2406912
1092 2406912 1278976 1322496 1057792 1153536 1527296 1093632 1114112 2155520 2208256 1311744
1082 1311744 1074688 770048 1327104 1152512 1949696 1134080 1789952 1566208 585728 892928
1072 892928 1170944 1890816 1249792 1322496 1149440 2336768 1179648 922624 1065984 1049088
1062 1049088 827392 1110016 655872 2008064 1207296 905216 1389568 1854464 1609216
1053 1609216 1691648 1195520 1300992 2046976 2477568 925184 1200128 1956864 1862656 1677824
$$ packed form
1123A124352L36896M37248k66752E53472P35744J43872k05824N1712Q95488m30592
1113A743872l33312D56704J165312M10624A70496R0112L14368O20544j10080C99872
1102A541120j47968Q21760G60832O19520O09280p19872M56704n08928P00416M88960
1092B406912j127936M3520k64704R5744L73760m33664K0480J041408N2736q96512
1082A311744k37056l04640N57056j74592P97184q15616O55872k23744E85728L07200
1072H92928K78016P19872o41024P2704j73056J187328j157120k57024J43360j6896
1062A049088k21696K82624m54144J352192q00768l02080M84352M64896k45248
1053A609216Q2432m96128J05472P45984M30592I25184K74944P56736r4208j84832
$$ plain form
1043 1677824 2135040 1473024 999936 1321472 1738752 2030080 2683392 1220608 2639872
1034 2639872 2141696 2109440 1438208 2635776 2301440 1654272 2031104 2056192 1313280 1801216
1024 1801216 1216000 2228224 1772032 2779648 1455616 795136 1160192 2025984 2299904
1015 2299904 2165760 499200 972288 823296 1601536 1378816 786944 1449472 1370624 1516544
1005 1516544 1511936 978944 1928192 1944064 445440 622080 819712 1257472 1694208 2422272
995 2422272 1349120 1015296 897024 1782272 2458112 2316288 1848832 458240 1269248 1439232
985 1439232 1704448 2040832 2501632 2892288 1200128 774144 1278976 3023360 2836992
976 2836992 3285504 1773056 2823168 2117120 2458624 2501632 1932800 2586624 3217920 3206144
$$ packed form
1043A677824M57216o62016m73088L21536M17280K91328O53312A220608J419264
1034B639872m98176l2256o71232J197568l34336o47168L76832K5088p42912M87936
1024A801216n85216J012224m56192J007616j324032o60480L65056Q65792K73920
1015B299904j34144D99200M73088j48992P78240k22720n91872O62528p8848J45920
1005A516544m608n32992R49248J5872D45440J76640J97632M37760M36736P28064
995B422272j073152l33824j18272Q85248O75840j41824m67456D58240Q11008J69984
985A439232K65216L36384M60800L90656A200128m25984N04832J744384j86368
976B836992M48512j512448J050112p06048L41504M3008n68832O53824O31296j1776
$$ plain form
966 3206144 2977792 3154432 3706368 3325440 3586560 3567616 4938240 5622272 6530048 6909440
956 6909440 8257024 7826944 6965248 6495232 6574080 8313344 6634496 8289280 8756224
947 8756224 9136640 10665984 11814400 13863936 17470976 23502336 31619072 65246720
939 65246720 104357376 102842368 138867200 51295232 30209536 18115072 12511232 10402304
931 10402304 7021568 5978112 5149696 5552640 2964992 4373504 3101184 3791360 5138432
922 5138432 3945984 4522496 4379136 5324800 4452864 2381824 3039744 2305536 884224
912 1567232 1731584 1414144 1245696 466432 1849856 775680 1791488 724480 2132480
903 2132480 2347520 2113536 1440768 1046528 1946624 1384960 1820160 1650176 1579520 1424896
$$ packed form
966C206144k28352J76640N51936l80928K61120j8944J370624O84032R07776L79392
956F909440J347584m30080q61696m70016P8848J739264j678848J654784M66944
947H756224L80416J529344J148416K049536L607040O031360Q116736L3627648
939F5246720L9110656j515008L6024832E1295232k1085696j2094464n603840k108928
931A0402304l380736j043456q28416M02944k587648J408512j272320O90176J347072
922E138432j192448N76512j43360R45664q71936k071040O57920p34208H84224
912A567232J64352l17440j68448D66432J383424G75680J015808G24480J408000
903B132480K15040k33984o72768l94240R00096n61664M35200j69984p0656j54624
$$ plain form
893 1424896 374272 1188864 2556928 509440 628736 982016 172544 802304 1257472 1345024
883 1345024 914944 1377280 1129984 1315840 773632 649216 891392 1276416 1278464 1039360
873 1039360 1218048 1145344 409088 907776 1453568 454144 991232 274432 656384 1221120
863 1221120 1160192 196608 590848 477696 118272 323584 -25088 946176 33792 825344
853 825344 598016 158208 988160 73216 662016 -468480 817152 659968 471552 934912
843 934912 620544 1248256 467456 -92160 2024960 517632 1196032 53248 -192512 1010688
832 1551360 372736 420352 203776 843776 -309760 491520 -219136 1373184 944128 553472
822 553472 1599488 -110080 -181760 848896 1624064 576000 93696 1034752 167424 486912
$$ packed form
893A424896C74272Q14592J368064E09440J19296L53280A72544O29760M55168Q7552
883A345024m30080M62336k47296J85856n42208j24416K42176L85024K048k39104
873A039360J78688p2704D09088M98688N45792D54144N37088B74432L81952N64736
863A221120o0928A96608L94240j13152A18272K05312b5088I46176C3792P91552
853H25344k27328A58208Q29952G3216N88800d68480H17152j57184j88416M63360
843I34912l14368O27712D67456i2160B024960E17632O78400E3248a92512A010688
832A551360C72736M7616B03776O40000c09760D91520b19136A373184m29056l90656
822E53472J046016a10080p1680H48896P75168E76000I3696R41056A67424L19488
$$ plain form
812 486912 240640 1334272 1782784 1243136 669184 1768960 1059328 814080 1321472 1058816
802 1058816 704512 -503808 1746944 827392 864256 -469504 262144 453120 462848 100864
791 534528 569856 714752 1287168 367104 879104 -121856 624640 786944 1034752 487424
780 982528 358400 478208 663040 108544 273408 180736 675840 -93696 894464 574464
770 574464 283136 505856 809984 1000960 740352 603136 662528 -781312 504832 590848
760 590848 384512 491008 317952 139264 -1536 819200 789504 584704 -659456 -1141248
750 -1141248 1164288 855040 632832 648704 701440 309760 816640 612352 526848 707072
740 707072 -7680 -146432 -211456 894464 760832 -301568 389120 517632 144384 948736
$$ packed form
812D86912B40640J093632M48512n39648n73952J099776p09632k45248N07392k62656
802A058816l54304e03808A746944H27392L6864d69504B62144J90976R728A00864
791E34528L5328J44896N72416C67104N12000a21856F24640J62304K47808D87424
780I82528C58400J19808J84832A08544J64864r2672M95104i3696H94464l20000
770E74464B83136K22720L04128J90976k60608j37216N9392g81312E04832Q6016
760E90848k06336J06496j73056A39264a536H19200k9696k04800f59456m81792
750a141248A164288l09248k22208J5872N2736C09760N06880k04288q5504J80224
740G07072g680j38752o5024H94464j33632c01568C89120J28512A44384Q04352
$$ plain form
730 948736 541696 70144 832000 103936 -61952 -287232 -411648 103936 802816 920576
720 920576 717824 1652736 188416 1032192 69120 353280 115200 417280 1228288 588800
709 445952 580608 -125440 1090560 687616 435712 440832 216576 247296 454656 1455104
699 1455104 979456 1222656 1073152 185344 1178624 -146944 437760 233984 641024 421888
689 421888 638976 1175040 249344 755200 1251328 372736 1482752 523776 1811968 1135104
679 1135104 968704 1112064 645120 804352 570880 986624 194560 1288704 1529856 1438720
669 1438720 993280 1413120 1122816 2149376 1769984 1627648 2534912 346624 830976 1034752
659 1034752 1252352 1209344 1012224 -61952 979456 1077248 818176 619520 895488 1268224
$$ packed form
730I48736m07040G0144P61856A03936f1952k25280j24416A03936O98880J17760
720I20576k02752R34912A88416Q43776F9120K84160A15200L02080Q11008E88800
709D45952J34656a25440A090560m02944k51904N120B16576L0720K07360J000448
699A455104m75648K43200j49504A85344R93280a46944D37760k03776M07040k19136
689D21888K17088N36064B49344N05856M96128C72736J110016E23776J288192o76864
679A135104j66400J43360m66944J59232k33472M15744A94560J094144K41152r1136
669A438720m45440M19840k90304J026560l79392j42336R07264C46624M84352K03776
659A034752K17600m3008j97120f1952I79456R7792k59072j98656K75968L72736
$$ plain form
649 1268224 1740800 786944 1150464 328192 353792 770560 1225728 1487872 1356288 844800
639 844800 2217472 1333760 1234944 1369088 1270784 848384 966144 1286656 1338368 780800
629 780800 321024 769024 61952 611840 508416 762368 1390080 1346560 646656 451072
619 451072 -247808 1870336 902144 -113664 635392 469504 1793024 156672 139776 998400
609 998400 502784 630272 1581056 1151488 -1066496 571904 -477696 1010176 -223232 62976
598 1120768 254464 76288 -105472 174592 -67584 167936 -843264 656384 705024 300032
587 479232 687616 41984 83456 917504 -132608 379904 95744 526848 697344 967168
577 967168 -218624 356352 816128 20992 760320 -122880 -240640 581632 -1307136 801280
$$ packed form
649A268224M72576G86944L63520C28192K5600M16768M55168K62144j31584n11488
639H44800J372672q83712r8816J34144r8304m22400J17760L20512N1712n57568
629G80800C21024M48000F1952N49888j03424K53952O27712m3520F46656j95584
619D51072b47808A870336I02144a13664F35392j65888J323520A56672j6896Q58624
609I98400m95616J27488R50784m29568a066496E71904d77696A010176b23232F2976
598A120768B54464G6288a05472A74592f7584A67936h43264F56384M8640C00032
587D79232K08384D1984M1472Q34048a32608C79904I5744M31104J70496K69824
577I67168b18624C56352M59776B0992P39328a22880j17760E81632a307136H01280
$$ plain form
566 -105984 1055232 1209344 246784 -241152 1844736 -174080 -373248 846336 567808 668160
556 668160 8704 661504 228352 684544 381440 -13312 212480 -120320 227328 1265664
546 1265664 1932288 475648 -251392 913920 270848 188416 170496 471552 1593856 -11776
535 215552 683520 478720 248320 485888 324608 777216 -775168 -574976 399872 360448
525 360448 -11776 -636928 97280 297984 -158208 636928 593408 1187840 716288 779776 498688
514 498688 -111104 251392 -4096 -119296 60416 764416 1165824 271872 443392 -348672
503 170496 279040 563712 -151040 84992 -374272 863744 812544 869888 145408 -714752
492 609280 142848 1517056 -334336 -237056 -635392 181760 186880 1079808 133120 -631296
$$ packed form
566a05984A055232J54112B46784b41152A844736a74080j99168H46336k78528J00352
556F68160H704O52800B28352M56192l03104a3312B12480a20320B27328J038336
546A265664O66624D75648b51392I13920B70848q2432j7920L01056J122304a1776
535B15552M67968k04800k30400K37568j61280M52608g75168K00192C99872l9424
525C60448a1776o25152I7280K00704a58208F36928m3520N94432m71552O3488k81088
514D98688a11104B51392d096j15200F0416P04000M01408B71872J71520c48672
503A70496J08544K84672a51040H4992c74272H63744n1200N7344A45408g14752
492F09280A42848J374208c34336R7280l98336A81760N120Q92928A33120f31296
$$ plain form
481 211968 612352 190976 -556544 974848 -1214464 -1046016 503808 733184 499712 -443904
470 644608 -94208 1028096 653312 572416 -123392 676864 686080 32768 751616 -1349632
459 404480 -466432 307712 420352 885760 825344 594944 803328 -185344 541184 -533504
448 -104960 51712 -41984 16384 392192 64512 -445440 385024 795648 1042944 -537600 517632
436 753664 -202752 995328 45568 -178688 1233408 416768 227328 -147456 359424 14848
425 803840 -602112 75264 -561664 -254464 -567808 289792 980480 235520 288256 -284672
414 996352 -218112 496640 592896 -29184 -214016 1988608 756224 448512 1258496 209920
403 1001984 464896 869888 743424 83968 -419328 914432 690688 -151040 110080 744960
$$ packed form
481B11968M00384A90976e56544I74848a214464J68448E03808K29376k33472d43904
470F44608i4208A028096l74784q0896a23392F76864R216C2768P18848a349632
459D04480d66432C07712J12640M65408o0416k30400K08384a85344E41184e33504
448a04960E1712d1984A6384L75808F4512d45440C85024M10624K47296e37600E17632
436G53664b02752I95328D5568a78688A233408D16768j89440a47456C59424A4848
425H03840f02112G5264e61664b54464l13344B89792O90688B35520N2736b84672
414I96352b18112D96640R6256b9184j84832A988608G56224l07712Q09984B09920
403A001984D64896M04992j26464H3968d19328I14432k23744a51040A10080O34880
$$ plain form
393 744960 1561600 12288 669184 83456 357376 -502272 161792 756224 627200 -181760
382 -95744 1204224 -697344 235520 -519168 1462784 217088 -1043968 532992 243200 536576
372 536576 1149952 -165888 277504 445440 -907776 86016 -252928 147456 136704 423936
362 423936 53760 849408 588288 -545792 -619008 618496 -29184 139264 1548800 407040
351 1046528 256000 -572416 865792 -334848 526848 937472 65536 214016 1078784 112640
340 1008640 181760 94208 241152 1032704 16384 683008 657408 -185856 1204224 -480256
329 344576 443904 502272 1027072 551936 1216000 1335808 245248 434688 -107520 2048 139776
318 139776 544256 -750592 -441856 -100352 -508928 761856 940032 -29184 277504 -5632
$$ packed form
393G44960Q16640A2288O56896H3456K73920e02272A61792N94432j29024a81760
382i5744A204224f97344B35520e19168A462784B17088a043968E32992B43200K93376
372E36576O13376a65888B77504J67936i07776H6016b52928A47456j0752K87232
362D23936E3760P95648k61120e45792p3216F18496b9184A39264J409536D07040
351A046528B56000e72416H65792c34848E26848M10624F5536J48480Q64768A12640
340A008640A81760q7552J46944P91552A6384O66624k5600a85856A204224d80256
329C44576R9328N8368N24800m75136O64064J19808B45248J89440a07520B048J37728
318A39776M04480g50592L08736a00352m08576G61856J78176b9184B77504e632
$$ plain form
307 551936 423424 548864 16384 1077248 -84992 -627200 431616 476672 182272 103936
297 103936 -28160 219136 -434176 461824 5632 476672 -142848 582656 267776 -927232
286 780800 113152 -160768 98304 734208 397824 96256 176640 679424 -811520 66560 1085440
275 1085440 -1042944 -1104896 -510976 -164864 -561664 -68608 -328192 -17920 -11264 -462848
265 -462848 -317440 660480 10240 -200704 294912 237568 117248 701952 149504 -773632
254 -556032 688128 795648 761856 -808960 -152064 -658432 261632 705024 -775168 504832
243 327168 356864 -245760 -676352 958464 -432128 -389120 -13312 2048 259072 1411072 1480704
232 1480704 695808 -305664 61952 1140736 -69120 786944 157696 -23040 656384 1024
$$ packed form
307E51936j28512J25440A6384J060864h4992n42208D31616M5056A82272p8336
297A03936b8160B19136d34176D61824E632M71040a42848E82656B67776i27232
286G80800A13152a60768I8304O35904l36384I6256Q0384N02784h11520F6560J018880
275A085440a042944o1952e10976a64864l96800f8608k59584a7920O656m51584
265d62848J45408F60480A0240b00704B94912n7344A17248N84704A49504g73632
254e56032F88128J07520l3792h08960a52064n06368B61632M43392g75168E04832
243C27168K9696b45760m30592I58464d32128M3008a3312B048K57024J152000O9632
232A480704F95808c05664F1952J078784f9120G86944A57696b3040F56384A024
$$ plain form
221 -574976 361472 209408 351232 276480 287232 -881664 852992 432640 -251392 871424
210 1536 509952 -606720 317952 -203264 674816 72192 1222656 487936 906752 1078784
200 1078784 272896 1092608 24064 46592 345600 729600 74752 -968192 375808 -35328
189 462848 473088 889344 -448000 -941568 509952 109568 -1176576 -354816 -648704 127488
178 238080 1333248 37888 74752 46592 240640 373248 735232 66560 23040 462336 -183808
166 177664 163328 669696 581632 -183808 -79872 32256 310784 -215552 558592 186880 566272
155 566272 -38912 916480 -97280 95232 219136 626176 -477696 -56320 371712 -151552 -604160
144 -604160 -39936 1280512 382976 198144 354304 993280 -771584 308736 489472 60416
$$ packed form
221e74976C61472j52064J41824p4752J0752h81664H52992m20352b51392H71424
210A536N08416f06720C17952b03264F74816G2192J150464D87936M18816J72032
200A078784B72896Q19712B4064K2528K99008L84000G4752i68192C75808c5328
189D62848J0240M16256d48000m93568E09952A09568a176576c54816k93888A27488
178B38080J095168C7888L6864k8160J94048J32608L61984F6560B3040M39296a83808
166A77664j4336N06368q8064a83808g9872C2256K78528b15552E58592A86880L79392
155E66272c8912I16480i7280I5232J23904M07040d77696e6320C71712a51552m52608
144f04160c9936A280512C82976j84832J56160O38976g71584C08736J80736F0416
$$ plain form
133 -453120 860672 586752 277504 -263680 -187904 293376 642560 273408 -261120 -93184
122 140288 556544 548864 -50688 1070592 -614912 828416 -105984 481280 -832512 217600
111 -49152 256512 303616 347648 -698880 -344064 886272 215552 365056 -436736 103936
100 -1041408 876032 -139776 -235520 -76288 802304 203776 506880 -932864 511488 52736
89 504320 163840 161280 -1008128 -494080 -156672 684032 -220160 -189952 529408 -531456
78 649728 -8704 -643072 1505280 730112 -266240 727552 1398272 -354816 106496 948224
68 948224 70656 -395776 -184320 858112 175616 -719872 -804352 -193536 254464 408576
58 408576 506368 10240 -97280 1089536 67072 629248 256512 1507840 479232 1241088
$$ packed form
133d53120H60672k73920B77504b63680P5776B93376L49184B73408b61120i3184
122A40288M16256p680e0688A070592f14912H28416a05984D81280h32512B17600
111d9152B56512M7104M4032f98880c44064H86272B15552J49504d36736A03936
100a041408H76032a39776r5744g6288H02304B03776L03104i32864E11488E2736
89E04320A63840k560a008128d94080a56672F84032b20160L0208E29408e31456
78F49728h704o34368A505280G30112b66240G27552O70720c54816A06496Q41728
68I48224G0656c95776a84320H58112A75616g19872q4480a93536B54464J54112
58D08576R7792A0240i7280A089536F7072N62176B56512J251328D79232P61856
$$ plain form
48 1241088 945664 -167424 -56320 -628224 -286720 477184 238080 88064 54272 291840
38 291840 44032 876544 453120 -696320 -389632 439296 546304 600064 720384 186880
27 158208 -1042944 -184832 -225280 -189440 1254912 -161792 -128512 451584 -497152 286208
16 -89600 441856 -439808 110592 -104960 562688 -661504 -249344 -220160 859648 523776
6 523776 -227328 551936 -1249280 777216 -651264 -37376
$$ packed form
48A241088k95424a67424e6320n71904b86720D77184B38080H8064l3792K37568
38B91840D4032Q32512m23424f96320L06688D39296J07008N3760J20320A86880
27A58208a042944a84832m0448L5840A254912a61792L3280D51584d97152B86208
16h9600D41856d39808A10592a04960E62688f61504b49344K9184H59648l35872
6E23776b27328E51936a249280G77216f51264c7376
##END=
