##TITLE=1319
##JCAMPDX= 6.0         $$ Bruker NMR JCAMP-DX V2.0
##DATA TYPE= NMR SPECTRUM
##DATA CLASS= XYDATA
##ORIGIN= NUTS EXPORT
##OWNER= Administrator
$$ 1.72 TOPSPIN		Version 2.1
$$ 2016-02-23 12:19:30.418 -0800  Administrator@X
$$ Compression mode = diff/dup
##.OBSERVE FREQUENCY= 90.275459
##.ACQUISITION MODE= SIMULTANEOUS (DQD)
##.ACQUISITION SCHEME= undefined
##.AVERAGES= 16
##.DIGITISER RES= 22
##SPECTROMETER/DATA SYSTEM= 
##.PULSE SEQUENCE= zg30
##.SOLVENT NAME= None
##.SHIFT REFERENCE= INTERNAL, None, 1, 14.50384
##AUDIT TRAIL= $$ (NUMBER, WHEN, WHO, WHERE, PROCESS, VERSION, WHAT)
$$ ##TITLE= Audit trail, TOPSPIN		Version 2.1
$$ ##JCAMPDX= 5.01
$$ ##ORIGIN= Bruker BioSpin GmbH
$$ ##OWNER= Administrator
$$ $$ E:/data/jwist/nmr/1319/1/pdata/1/auditp.txt
$$ ##AUDIT TRAIL=  $$ (NUMBER, WHEN, WHO, WHERE, PROCESS, VERSION, WHAT)
(   1,<2016-02-23 08:50:01.428 -0800>,<Administrator>,<X>,<jcamp>,<TOPSPIN 2.1>,
      <fromjdx created from
       E:\data\jwist\nmr\uniandes\1319
       data hash MD5: 8K
       6B 8A 7C 71 71 3C 7E A0 82 80 81 10 1F 21 7A BB>)
$$ ##END=
$$ 
$$ $$ hash MD5
$$ $$ AF EB 8F 1C 0C F8 02 97 55 8F B7 C5 CB E3 FD C3
##$RELAX= 
$$ Bruker specific parameters
$$ --------------------------
##$DU= <E:>
##$EXPNO= 1
##$NAME= <1319>
##$PROCNO= 1
##$TYPE= <nmr>
##$USER= <jwist>
##$ACQT0= 0
##$AMP= (0..31)
100 100 100 100 100 100 100 100 100 100 100 100 100 100 100 100 100 100
100 100 100 100 100 100 100 100 100 100 100 100 100 100
##$ANAVPT= 1
##$AQSEQ= 0
##$AQ_mod= 3
##$AUNM= <au_zg>
##$AUTOPOS= <>
##$BF1= 90.275459
##$BF2= 400.02
##$BF3= 400.02
##$BF4= 400.02
##$BF5= 400.02
##$BF6= 400.02
##$BF7= 400.02
##$BF8= 400.02
##$BYTORDA= 0
##$CFDGTYP= 0
##$CFRGTYP= 0
##$CHEMSTR= <none>
##$CNST= (0..63)
1 1 145 1 1 1 1 1 1 1 1 1 1 1 1 1 1 1 1 1 1 1 1 1 1 1 1 1 1 1 1 1 1 1 1
1 1 1 1 1 1 1 1 1 1 1 1 1 1 1 1 1 1 1 1 1 1 1 1 1 1 1 1 1
##$CPDPRG= <>
##$CPDPRG1= <>
##$CPDPRG2= <>
##$CPDPRG3= <>
##$CPDPRG4= <mlev>
##$CPDPRG5= <mlev>
##$CPDPRG6= <mlev>
##$CPDPRG7= <mlev>
##$CPDPRG8= <mlev>
##$CPDPRGB= <>
##$CPDPRGT= <>
##$D= (0..63)
0 1 0 0 0 0 0 0 0 0 0 0 0 0 0 0 0 0 0 0 0 0 0 0 0 0 0 0 0 0 0 0 0 0 0 0
0 0 0 0 0 0 0 0 0 0 0 0 0 0 0 0 0 0 0 0 0 0 0 0 0 0 0 0
##$DATE= 0
##$DBL= (0..7)
120 120 120 120 120 120 120 120
##$DBP= (0..7)
150 150 150 150 150 150 150 150
##$DBP07= 0
##$DBPNAM0= <>
##$DBPNAM1= <>
##$DBPNAM2= <>
##$DBPNAM3= <>
##$DBPNAM4= <>
##$DBPNAM5= <>
##$DBPNAM6= <>
##$DBPNAM7= <>
##$DBPOAL= (0..7)
0.5 0.5 0.5 0.5 0.5 0.5 0.5 0.5
##$DBPOFFS= (0..7)
0 0 0 0 0 0 0 0
##$DE= 6.5
##$DECBNUC= <off>
##$DECIM= 2432
##$DECNUC= <off>
##$DECSTAT= 4
##$DIGMOD= 1
##$DIGTYP= 12
##$DL= (0..7)
0 120 120 120 120 120 120 120
##$DP= (0..7)
150 150 150 150 150 150 150 150
##$DP07= 0
##$DPNAME0= <>
##$DPNAME1= <>
##$DPNAME2= <>
##$DPNAME3= <>
##$DPNAME4= <>
##$DPNAME5= <>
##$DPNAME6= <>
##$DPNAME7= <>
##$DPOAL= (0..7)
0.5 0.5 0.5 0.5 0.5 0.5 0.5 0.5
##$DPOFFS= (0..7)
0 0 0 0 0 0 0 0
##$DQDMODE= 0
##$DR= 22
##$DS= 2
##$DSLIST= <SSSSSSSSSSSSSSS>
$$ [...]
##$SPOFFS= (0..31)
0 0 0 0 0 0 0 0 0 0 0 0 0 0 0 0 0 0 0 0 0 0 0 0 0 0 0 0 0 0 0 0
##$SUBNAM0= <"">
##$SUBNAM1= <"">
##$SUBNAM2= <"">
##$SUBNAM3= <"">
##$SUBNAM4= <"">
##$SUBNAM5= <"">
##$SUBNAM6= <"">
##$SUBNAM7= <"">
##$SUBNAM8= <"">
##$SUBNAM9= <"">
##$SW= 20.5580556627758
##$SWIBOX= (0..15)
0 0 3 4 0 0 0 0 0 0 0 0 0 0 0 0
##$SW_h= 8223.68421052631
##$SWfinal= 0
##$TD= 65536
##$TD0= 1
##$TE= 300
##$TE2= 300
##$TE3= 300
##$TEG= 300
##$TL= (0..7)
0 120 120 120 120 120 120 120
##$TP= (0..7)
150 150 150 150 150 150 150 150
##$TP07= 0
##$TPNAME0= <>
##$TPNAME1= <>
##$TPNAME2= <>
##$TPNAME3= <>
##$TPNAME4= <>
##$TPNAME5= <>
##$TPNAME6= <>
##$TPNAME7= <>
##$TPOAL= (0..7)
0.5 0.5 0.5 0.5 0.5 0.5 0.5 0.5
##$TPOFFS= (0..7)
0 0 0 0 0 0 0 0
##$TUNHIN= 0
##$TUNHOUT= 0
##$TUNXOUT= 0
##$USERA1= <user>
##$USERA2= <user>
##$USERA3= <user>
##$USERA4= <user>
##$USERA5= <user>
##$V9= 5
##$VALIST= <valist>
##$VCLIST= <CCCCCCCCCCCCCCC>
##$VD= 0
##$VDLIST= <DDDDDDDDDDDDDDD>
##$VPLIST= <PPPPPPPPPPPPPPP>
##$VTLIST= <TTTTTTTTTTTTTTT>
##$WBST= 1024
##$WBSW= 4
##$XGAIN= (0..3)
0 0 0 0
##$XL= 0
##$YL= 0
##$YMAX_a= 1274621696
##$YMIN_a= -1395739.648
##$ZGOPTNS= <>
##$ZL1= 120
##$ZL2= 120
##$ZL3= 120
##$ZL4= 120
##$ABSF1= 10
##$ABSF2= 0
##$ABSG= 5
##$ABSL= 3
##$ALPHA= 0
##$AQORDER= 0
##$ASSFAC= 0
##$ASSFACI= 0
##$ASSFACX= 0
##$ASSWID= 0
##$AUNMP= <proc_1d>
##$AXLEFT= 0
##$AXNAME= <>
##$AXNUC= <off>
##$AXRIGHT= 0
##$AXTYPE= 0
##$AXUNIT= <>
##$AZFE= 0.1
##$AZFW= 0.1
##$BCFW= 1
##$BC_mod= 2
##$BYTORDP= 0
##$COROFFS= 0
##$CY= 15
##$DATMOD= 1
##$DC= 2
##$DFILT= <>
##$DTYPP= 0
##$F1P= 0
##$F2P= 0
##$FCOR= 0.5
##$FTSIZE= 0
##$FT_mod= 4
##$GAMMA= 1
##$GB= 0
##$INTBC= 1
##$INTSCL= 1
##$ISEN= 128
##$LB= 0.3
##$LEV0= 0
##$LPBIN= 0
##$MAXI= 10000
##$MC2= 0
##$MEAN= 0
##$ME_mod= 0
##$MI= 0
##$NCOEF= 0
##$NC_proc= -9
##$NLEV= 6
##$NOISF1= 0
##$NOISF2= 0
##$NSP= 1
##$NTH_PI= 0
##$NZP= 0
##$OFFSET= 14.50384
##$PC= 1
##$PHC0= 0
##$PHC1= 0
##$PH_mod= 0
##$PKNL= yes
##$PPARMOD= 0
##$PPDIAG= 0
##$PPIPTYP= 0
##$PPMPNUM= 2147483647
##$PPRESOL= 1
##$PSCAL= 4
##$PSIGN= 0
##$PYNMP= <proc.py>
##$REVERSE= no
##$SF= 90.2741496781366
##$SI= 8192
##$SIGF1= 0
##$SIGF2= 0
##$SINO= 400
##$SIOLD= 32768
##$SPECTYP= <>
##$SREGLST= <1H.CDCl3>
##$SSB= 0
##$STSI= 0
##$STSR= 0
##$SW_p= 1497.18866228788
##$SYMM= 0
##$S_DEV= 0
##$TDeff= 0
##$TDoff= 0
##$TI= <>
##$TILT= no
##$TM1= 0
##$TM2= 0
##$TOPLEV= 0
##$USERP1= <user>
##$USERP2= <user>
##$USERP3= <user>
##$USERP4= <user>
##$USERP5= <user>
##$WDW= 1
##$XDIM= 8192
##$YMAX_p= 1274621440
##$YMIN_p= -1395712
##$CURPLOT= <PDFCreator>
##$CURPRIN= <$PDFCreator>
##$DFORMAT= <normdp>
##$LAYOUT= <+/1D_H.xwp>
##$LFORMAT= <normlp>
##$PFORMAT= <normpl>
##$SURQMSG= 1
$$ End of Bruker specific parameters
$$ ---------------------------------
##XUNITS= HZ
##YUNITS= ARBITRARY UNITS
##XFACTOR= 0.182762287876938
##YFACTOR= 1
##DELTAX= -0.182762287876938
##NPOINTS= 8192
##FIRSTX= 1497.0059
##FIRSTY= -579584
##LASTX= 0
##MAXY= 1274621440
##MINY= -1395712
##XYDATA= (X++(Y..Y))
8191e79584D4032M66944J50528b62656D99200g0656G6288f02624l24096M38784
8181d87936F2464c59424A30048M81280J00864c00032R1648E47328a77152j096192
8171a273344e05856A18784d0960j083392g1168G7312a033728K98496a38752n13536
8161f52288j95072l7376I67168i21600H3968d15232H1920K00192a88416q42240
8151a030656b49856H6016m0960b63168C18464O3488K48320R8304L46112C42528
8140G9872O50752B45760A05984J05984h18688G86432l73248B00192L84000a0240
8129G58272a77664C35360j38240M59264b54464n1712A45408J5872d93056b07872
8118B37568d99712B58560B0992f89664L4816B7648J8944L61472k4064b5088G37280
$$ y = [-579584, 44032, 510976, 661504, -262656, 499200, -70656, 76288, -602624, -926720, -487936, 62464, -359424, 130048, 611328, 712192, -300032, -208384, 547328, -177152, -1273344, -505856, 118784, -40960, -1124352, -71168, 77312, -1033728, -735232, -138752, -652288, -847360, -884736, 967168, -921600, 83968, -415232, 81920, 282112, -188416, -1030656, -249856, 86016, 45056, -263168, 318464, 381952, 630272, 728576, 1074688, 342528, 79872, 730624, 245760, 105984, 211968, -818688, 786432, 413184, 200192, 584192, -10240, 758272, -177664, 335360, 197120, 656384, -254464, -306176, 145408, 161280, -493056, -207872, 237568, -499712, 258560, 20992, -689664, -654848, 27648, 46592, 408064, 384000, -25088, 737280]
8106g62880b27840B63680a17248B91328a39776o31808g6800B22720c66592k60608
8096f27200l45088A46944a67424p51616A62816E2736d31104C40992h87296b42688
8085b69312k74432K16064D73088h75520c25632j8432B94400a024j03424l2256
8075a36704A24416b89792E91872d10624B81088c66592a75616L072C04128J63328
8065D67456h4480D64384A32096b84672C07200a86880k36032B63168h18176A69472
8054a16736k97472J96608F10816e55008a04448E14048e49888a48992H67840C95776
8043A050112c09760D21888b87744A60256d85376I31328A2288g18848G6800J349632
8033A426432a059328A05472g45472J64352b46272o3488h2432n7856E46304b54976
$$ y = [-762880, -227840, 263680, -117248, 291328, -139776, -771584, -76800, 222720, -366592, -627200, -972288, 146944, -167424, -919040, 162816, 52736, -431104, 340992, -887296, -242688, -269312, -543744, -327680, 473088, -875520, -325632, -344064, 294400, -1024, -104448, -136704, 124416, -289792, 591872, -410624, 281088, -366592, -175616, -172544, 304128, 467456, -84480, 464384, 132096, -284672, 307200, -186880, -422912, 263168, -818176, 169472, -116736, -414208, -217600, 610816, -555008, -104448, 514048, -549888, -148992, 867840, 395776, 1050112, -309760, 421888, -287744, 160256, -485376, 931328, 12288, -718848, 76800, 1426432, -1059328, 105472, -745472, -581120, -246272, -309760, -82432, -140288, 546304, -254976]
8022e78560D7616P76192A00352K48832A63840j8432O87104h40192a04960G98208
8011G10656j89952g88480A45408d13184D01408f98368C91680R2672h02816p7312
8001h80128F66112b38080j15712p09632K48320B560i88672D56192j71008c72224
7990g58272C40992J05472J333248B18112L77344k32448h92928p4752L1744b95936
7979d23936j64864b74944L6352F1952M10112A43872a76128n1712b8672p23456
7969g52128H38144d83840k88256g3728E10464b33472O1440l14368o8096J12640
7959d41856C75296O82496a016832c44576m06016a3824r8304m91008J29024l89120
7949h63232B63168d95616a1776A015296e2736D12672d43392B48832p4240F9120
$$ y = [-578560, 47616, 823808, 100352, 349184, 163840, 145408, 832512, -840192, -104960, 798208, 710656, 520704, -788480, 145408, -413184, 401408, -698368, 391680, 484352, -802816, -880128, 666112, -238080, -353792, -1063424, -815104, 2560, -988672, 456192, 285184, -372224, -758272, 340992, 446464, 1779712, 218112, 595456, 363008, -892928, -967680, -935936, -295936, -423936, -588800, -274944, -238592, 61952, 472064, 143872, -176128, -227840, -28672, -752128, 838144, -483840, -772096, -73728, 510464, -233472, -172032, -486400, -554496, -441856, 375296, 1057792, -1016832, -344576, -750592, -13824, -112128, -603136, -474112, -863232, 263168, -495616, -11776, 1015296, -52736, 412672, -443392, 248832, 174592, 69120]
7938I6256a90976D06016A30560f69184r6768B24256L17440B38080K92864a99168
7927C1744J024e78560f8608C48160@b99008A043456d11648E76000B69824e88288
7915a004544i0112F98880d81280A30048A7408b28864I65632m28544f15424A7408
7904a77152D08064d93568j85344c9424p18336A76640J95584l4304M03968B29376
7893a08544k54976a15712k86720F56896A64352J52576c03616m13184m3008b62144
7882F17984d25472I728i34912B92352q6016e04832K51392G36768l30752J50528
7872E56544O06208a31584l37920I9840a249792c28192B54464e92896B84160a78688
7861h9088l00544I216J03936R3696L78880a000960A096704C34848a22368l56864
$$ y = [96256, -190976, 406016, 130560, -669184, -765952, 224256, 541696, 238080, 530944, -199168, 31744, 32768, -578560, -68608, 348160, 0, -299008, 1043456, -411648, 576000, 269824, -588288, -1004544, -90112, 698880, -481280, 130048, 17408, -228864, 965632, 537088, -615424, 17408, -177152, 408064, -493568, -678912, -39424, -757760, 176640, 372224, 337920, 741888, 229376, -108544, -363520, -115712, -402432, 656896, 164352, 316928, -303616, -716800, -759808, -262144, 617984, -425472, 9728, -934912, 292352, 206336, -504832, -253440, 736768, 406016, 556544, 1162752, -131584, -469504, 99840, -1249792, -328192, 254464, -592896, 284160, -178688, -89088, -389632, 9216, 113152, 206848, 585728, -1000960, 1096704, 334848, -122368, -479232]
7851d79232C75808B3552b96448a34656L5840o56896L44576A030656a04960j38752
7841b43712G14752g51616C20000N6320g0144k85696f4000j35680i9840D54144
7830A85856b17600B66240e81632D73088H6528c74272B70336a2288A30048c36896
7819B95936J29536c77856J08032O9632I30816k79552e04320k49856b63168I97888
7808I98400h39168J51552D15232b99520k74944K78016B39616h57600A96608f8096
7797c65056C76320b46272n120C584b24768N4784G80288c31264J4848A22368h52480
7785B76992b99008j88416C44064I4720b69824I77408b63168Q8064E10976j13152
7775C97824b74944k08384h1920D39296a14176l4816E57568m3008P680B46272J77664
$$ y = [-479232, 375808, 23552, -296448, -134656, -98816, -755712, -411136, 1030656, -104960, -243712, 714752, -751616, 320000, 376320, -70144, -355840, -64000, -199680, -99840, 454144, 185856, -217600, 266240, -581632, 473088, 86528, -374272, 270336, -12288, 130048, -336896, 295936, 425472, -377856, -269824, -200192, 930816, 651264, -504320, -754176, -263168, 997888, 998400, -839168, -687616, 415232, -299520, -574464, -296448, 239616, -857600, 196608, -68096, -365056, 376320, -246272, -251392, 3584, -224768, -169984, 780288, -331264, -316416, 122368, -852480, 276992, -299008, -487424, 344064, 94720, -269824, 977408, -263168, -175104, 510976, 397824, -274944, -483328, -81920, 439296, -114176, -148992, 557568, 514560, 522240, 246272, 423936]
7764D23936j78176O41536J9968k41152a97120A02400b46272H4992J82784d44416
7753A013248N0688f06208D37760A17760b54976A64864L3280N12512A19296b30400
7742B09920f71744H3456e23776D61824h192l46624F41024N9904b4576B8672K30400
7731B59072L86048k86208a22880j88416r96864D42368e25312A54624J41824I216
7720A121792C8400a00352E0688Q37632c44064J3824A05472K92864A15712K76480
7710C92192h8576m16768C59424A71520a1264C91680h3968n96480g0144j278976
7700a349120e2736k94400A87392L7888h17664C36896a027584a62304k09920n5296
7690d27520J36192C01056o8608O24640i45664a34656l40992J12128I02144g3728
$$ y = [423936, 245760, 887296, 907264, 666112, -197120, 102400, -246272, 84992, 267776, -444416, 1013248, 1063936, -606208, 437760, 117760, -254976, 164864, 198144, 710656, 119296, -230400, 209920, -671744, 83456, -523776, 461824, -8192, -354816, 641024, 700928, -24576, 28672, 259072, 645120, 358912, -122880, -311296, -1308160, 442368, -525312, 154624, 296448, 9216, 1121792, 38400, -100352, 50688, 888320, -344064, -330240, 105472, 398336, 115712, 392192, -88576, -505344, 359424, 171520, -11264, 391680, -83968, -680448, -70144, -1349120, -52736, -347136, 187392, 225280, -817664, 336896, -1027584, -162304, -372224, -427520, -291328, 301056, 232448, 857088, -945664, -134656, -475648, -363520, 902144, -73728]
7679G11680b1504H63744N76512n15584f37952C63520K92352A4336N7344P3728
7669A45408J40800C7888Q13568A17248M50560H3456J283584C99360A38752a21344
7658A146880D38784f89664D00384d19328H0384i27744h4480j73056f3488G40864
7647G5776f12864A03424e20704N4784C32800c21536H1920A7920f98368G0144Q5504
7636A55648C8400L01568d42368E48864c97312g9872A072128c55328G80288J52064
7626I32352a65376C54304c7888j59744G49056e8368a6384m42880C46624N94944
7616I41568f27712l00544C99872h89856b8672C7888d52096F84544M42880e56032
7605G26528l56352A47968F6560f29248A63840b27328J06496A25952N64736a50528
$$ y = [711680, -21504, 863744, 1440256, 924672, -637952, 363520, 655872, 14336, 71680, 145408, 286208, 37888, 851456, 117248, 567808, 83456, 1367040, 399360, 138752, -121344, 1146880, 438784, -689664, 400384, -419328, 80384, -927744, -84480, -257536, -63488, 740864, 75776, -612864, 103424, -520704, -465920, 332800, -321536, 81920, 17920, -698368, 70144, 155648, 38400, 339968, -442368, 548864, -397312, -79872, 1072128, -355328, 780288, 932352, -165376, 354304, -37888, -197632, 749056, -58368, -16384, -459264, 346624, 941568, -627712, -928256, 399872, -889856, -28672, 37888, -452096, 684544, 1127424, -556032, 726528, 370176, 147968, 66560, -629248, 163840, -227328, -120832, 125952, 690688, -150528]
7594G1168L34848c54304L584B73408%K47808a7920B72896h7040E12N32480q9600
7582D43392b62656A36192d78208H21760d21376E09952a55136l37920J3824A212928
7571F99392q9088h00256N9904K19136G81824C29216e14560B74944K87232k10432
7561C51744L92704H0896e0176D03968j03936N03808e11488a94048A9968d34688
7550C18464a3824G68512k11456g15264D6080Q63744j00352b70848I35936A28512
7539D89984h60672A49504N77024e09440i7792D14208l2256i23136D3008b17088
7528d00896r1648j16736G55200j54624O2976e40160o20544L46624h7040B00192
7517d97152D77184e120F7072R6256a025536d16768A021952m30080e36576F05184
$$ y = [71168, 406016, -354304, -350720, 273408, 273408, 521216, -17920, 272896, -87040, 512, 532992, 443392, -262656, 136192, -478208, 821760, -421376, 509952, -155136, -493056, -479232, 1212928, 699392, 610304, -800256, -740352, -521216, 781824, 329216, -514560, 274944, 562176, 351744, 744448, 80896, -50176, 403968, 300032, 803840, -511488, -194048, 19968, -434688, 318464, -13824, 768512, 557056, -715264, 46080, 909824, 809472, -270848, 935936, 128512, 489984, -860672, 149504, 726528, -509440, -97792, 414208, 381952, -923136, 43008, -217088, -400896, -492544, -609280, 755200, 600576, 663552, -540160, -1160704, -814080, -87040, 200192, -497152, 477184, -5120, 67072, 163328, -1025536, -416768, 1021952, 591872, -536576, 605184]
7506c39456D97152j53088L59424K3040e16608b53952k27328G66976C72736c45088
7495d00896I21600C93728I4720Q40192F6560b14528F16448N25824B01216J69472
7485C70688A03936a051136c64032j58208F59968a90464A21856K1504J68960P12704
7475A025024M09088E83168N18656C27168L63520J64864l0208f88128F81472a31072
7464A63328d34688G23968c23584E35040A8944Q42752B90304K24256L01056d3520
7453H57600A80224Q34048a47456E46304k71360b22208A82784e14560E06880j18784
7443C88096O77376e65760d9152I07264a100288D72576A64352e17632B6112J74080
7433B00192b41152E39136k35008C7888c35360k50880K33472p88992b8672o47168
$$ y = [-339456, 497152, 344064, 703488, 726528, -516608, -253952, -481280, 766976, 372736, -345088, -400896, 921600, 393728, 94720, 934912, 66560, -214528, 616448, 1142272, 201216, 370688, 103936, -1051136, -364032, -522240, 659968, -190464, 121856, 143360, 312320, 1025024, 1434112, 583168, 1101824, 327168, 690688, 855552, 825344, -688128, 681472, -131072, 163328, -434688, 723968, -323584, 535040, 18944, 861696, 290304, 514560, 815616, -43520, 857600, 180224, 1014272, -147456, 546304, 274944, -222208, 182784, -514560, 506880, 388096, 1065472, -565760, -49152, 907264, -1100288, 472576, 164352, -517632, 26112, 200192, -241152, 539136, 304128, 37888, -335360, -586240, -352768, -1141760, -28672, -675840]
7423f75840K69312F94272R4720A24928J323520C10784f3488E29408j66400j68960
7413A94048O09792d51072D57216A71520a77152C34336a50528j17248D94080J21856
7403F15936L76320e99552o43072b47808b6112F80448k96448L19488c64544a12640
7392a66400H0896M39808J69984A25440g96672C96800a92512B28352B7648a54112
7381D08064a78176j23904J4336D06528c28192A542144c60960G06048c40992j08544
7371d49536K21184C21024Q5504a78176G5264N26848A42336Q14592m47488A61280
7360A078784f12352D12160I1648A1264O1440N68320j84320a83808F8608J77664
7350B46272N20192k58560j18272O0416A2800K71872c75296E26848a225728F30272
$$ y = [-675840, -406528, 694272, 788992, 124928, 1448448, 310784, -63488, 529408, 363008, 194048, 803840, -451072, 457216, 171520, -177152, 334336, -150528, -267776, 494080, 615936, 992256, -599552, -1242624, -247808, -26112, 680448, 384000, 703488, -364544, -112640, -166400, 80896, 520704, 690688, 125440, -796672, 396800, -192512, 228352, 27648, -154112, 408064, -178176, -302080, -287744, 406528, -328192, 1542144, -360960, 706048, -340992, -449536, -228352, 321024, 406528, -178176, 75264, 602112, 142336, 956928, 509440, 161280, 1078784, -612352, 412160, 91648, 11264, 72704, 641024, 456704, -183808, 68608, 246272, 766464, 507904, 389632, 450048, 12800, 284672, -375296, 526848, -1225728, 630272]
7339E42208e01248J20320F20032a2800n5296j34144G27040j44896j13152b27840
7328F24128g83360H19200J44896A41312Q3456g77728a44384p60320F11328A05984
7317E23264a1264H45312C64544Q49920m47488c3280H97536B15040d10624E04320
7306H70400A52576c16416E64224P9360M1984A02400N9904J45920o7072b21184
7295C26656I3184P19360O144e1200o62016n06880C14368e51424A45408P77728
7285I23136d24960j87904A59232c98848G61856i216C05152j48992J050112e120
7274e07904I5744c94752j69472F03648c2768q1408A89952q0896Q0384b36544a1776
7262F53312k98496e61664d096q30464j0752A6896J35680K59072a72032D78208
$$ y = [542208, -501248, -380928, 620032, -12800, -68096, -202240, 727040, 582144, 468992, -227840, 624128, -783360, 819200, 964096, 141312, 224768, -777728, -144384, -904704, 611328, 105984, 523264, -11264, 845312, 364544, 1214464, 766976, -33280, 897536, 215040, -410624, 504320, 870400, 152576, -316416, 564224, 643584, 685568, 102400, 162304, 308224, 241152, -221184, 326656, 93184, 812544, 818688, -51200, -713216, -1220096, 314368, -551424, 145408, 923136, -424960, -612864, 159232, -398848, 761856, -9216, 305152, 156160, 1206272, -5120, -507904, 95744, -394752, -564224, 603648, -32768, -114176, 189952, 109056, 189440, -236544, -11776, 653312, 354816, -561664, -4096, -834560, -845312, 16896, 152576, 411648, -172032, 478208]
7251I06752K04288C18976o5536K13504F4000L92704J51040B52928R56416a90976
7240e35040F05184g94624F85568k76992f56896A198592a67424A089536b40640
7230C76320O8096J37216I3696J4336b86720E20704j35168r3184J57184A82784
7219f7584m3520C90144L21536f80448a9456C88608J36704P00416b68288p57760
7209a026048D52608J96096f71232G40352B53440a46432C5840b97984J7408a08032
7198E9392M56704L39968c17952B70848J09568i38496b76992B4576j024L86560
7188D10112a5360C52768b49856O1440D4544b96960E14560A75104N27360A30048
7177B03776r0112N02272A29536J19808g23456A137664B95424L92704A81248R08288
$$ y = [906752, 1111040, 318976, 253440, 466944, 64000, 456704, 607744, 252928, 1209344, -190976, -535040, 605184, -794624, 685568, 408576, -656896, 1198592, -167424, 1089536, -240640, 376320, 444416, 581632, 93696, 108032, -286720, 520704, 385536, 292352, 449536, 182784, -67584, -111104, 390144, 711680, -680448, -19456, 388608, 525312, 1225728, -268288, -1026048, 452608, 648704, -671232, 740352, 253440, -146432, 35840, -297984, -280576, -108032, 59392, 516096, 856064, -317952, 270848, 380416, -938496, -276992, 24576, 23552, 410112, -15360, 352768, -249856, -188416, 44544, -296960, 514560, 175104, 702464, 130048, 203776, 113664, 615936, 129536, 249344, -723456, 1137664, 295424, 688128, 181248, 1089536]
7167A089536g680n5808g680G42400C15392L04640C8400J013248A19808c3280r9328
7156a32608F68672e4784H19200R6256c4816n3760C27680g60832L50720c4304D05504
7144D09600j59232J50016i728A097216d55168B27840N04320A25440K69312L50208
7134G44960B28864m9152J16224p2192P1680b20160A63840J78176a17248D33152
7123F27712o3488A7408d99200E26336N92384n51424A87904O35392C99872K6624
7113D26496j77664G5264i6768A138176g79776F16960K82624I6768h98048E33504
7102b01216B22208c89120A81248N64224C40992J34144J120256C36896K79040P71072
7092A387008j42848b12992l31776A16736N73952d05504B94912L68128h42240A443840
$$ y = [1089536, -7680, -63488, -7680, 742400, 315392, 620032, 38400, 1051648, 119808, -33280, -132608, 668672, -54784, 819200, 915456, -34816, -88576, 327680, -760832, -410112, -34304, 405504, 409600, 250368, 400384, -9728, 1097216, -455168, 227840, 732160, 125440, 394752, 744960, 228864, 179712, 295936, 223744, 295424, -220160, 163840, 342016, -117248, 433152, 627712, 564224, 17408, -499200, 526336, 1118720, 567296, 187904, 823296, 399872, 426496, 248832, 75264, -96768, 1138176, -779776, 616960, 899584, 96768, -898048, 533504, -201216, 222208, -389120, 181248, 745472, 340992, 475136, 1595392, 336896, 615936, 1387008, 1244160, -212992, -544768, 116736, 690688, -405504, 294912, 663040, -842240, 1443840]
7081D51584A63840J6384Q90368K36032g0656C15904J93536L81440f6560p91552
7071h58112a28512E27872j77152J77664L53280b58560e7344E88288p1168f656
7060D74112L0208B12480a12128A32608k8672e37088B21696M49024j38752a5360
7049B07872a059840D41344j01888a01376n12J2800I6768J5872A9456M33152a3824
7037C90656c87072F14912A536J971712a07008C48160R68192m99200e4272m13184
7027d67456k52416F29248i35424H51968B14016I9328d59776K11968G55200J96096
7017I51296k02752k94912N77536a83808n27872L03616F20032K63168l0720j63328
7007F89152J33120j48992I3696a82272A3824J069056D07552R73824C52768L87584
$$ y = [451584, 163840, 180224, 1070592, 1306624, -70656, 315904, 509440, 890880, -66560, -858112, -128512, 527872, 350720, 528384, 881664, -258560, -57344, 588288, 517120, -6656, 474112, 504320, 212480, -112128, 132608, 103936, -537088, 221696, 670720, 531968, -15360, 207872, -1059840, 441344, 339456, -101376, -101888, -89088, 96768, 112640, 19456, 452608, -13824, 390656, -387072, 614912, 1536, 1973248, -107008, 348160, 1316352, 817152, -54272, -467456, -719872, 629248, -935424, 851968, 214016, 99328, -459776, -247808, 755200, 951296, 748544, 453632, 1031168, -183808, -711680, -408064, 620032, 883200, 852480, 689152, 822272, 673280, 93696, -182272, 13824, 1082880, 407552, 1381376, 352768, 740352]
6997G40352B70848c52768H3968K52928a02400C39968c16416I89696C584J186816
6987A190400m17792a80224A228288l8400e07904a51552C34848N19168B99520R53344
6977A252864a53088I60512C20512J167360g6800k2528A207808D20864l0720J65888
6967E56032A12640J468928G05024M34176l84512N74976C58400r6256K81088M85376
6957A028608a26976H59136B72384J230848i15456D59776a57184B56000O43584
6948H99584e60640F78400B80576J29024j09056g10656@A046016a91488I20064
6937A06496f4512B36544i55392d16768A76640M02944A40800L04640h88832I04704
6926D91520Q67328a21856G57760r3184k5600L30752b87744B97472K73920L30752
$$ y = [740352, 270848, -352768, 83968, 336896, -102400, 339968, -316416, 989696, 3584, 1190400, 772608, -180224, 1228288, 1189888, -507904, -151552, 334848, 854016, 299520, 1252864, -153088, 960512, 320512, 1487872, -76800, -99328, 1207808, 420864, 390144, 556032, 112640, 1581568, 705024, 1139200, 754688, 1329664, 358400, 262144, 543232, 1028608, -126976, 859136, 272384, 1503232, -915456, 459776, -157184, 256000, 899584, -560640, 678400, 280576, 409600, 300544, -710656, 0, 1046016, -191488, 920064, 106496, -64512, 236544, -955392, -416768, 176640, 579584, 140800, 445440, -888832, 904704, 491520, 1358848, -121856, 757760, 664576, 638976, 969728, -287744, 297472, 571392, 902144]
6916I02144e51936C5840Q52480C29728B9184N11488K05312A97632R84064l12320
6906H69376a72544q1920m8128A78688B0480c88096I79456J03424e120p2704l7888
6895a15712G14240b93376A109504c52256E02784B23744p168N45792B41664J76128
6885D17792O656k1504k3040D9664K79040q8576M51072a084928a21344j29024B22720
6873C80416P56736C66080a31072k35008B3040c56864F87104K72896b10944A237504
6862A451008m75136d86912E02784J87904b49344F64064H8064M64384f656p4752
6852h1408p5776C21536p4752n2736M27008K22208K8672f72256c08224O9632E18656
6840E06368j95072N1712K44224A39776L60448L72224k33984m9152b25792I83040
$$ y = [902144, -551936, 35840, 888320, 329728, 29184, 540672, 745984, 197632, 1181696, 869376, -172544, -254464, -302592, 178688, 20480, -388096, 979456, 1082880, -5120, -77824, -115712, 714240, -293376, 1109504, -352256, 502784, 223744, 216576, 762368, 241664, 417792, 424448, 402944, 379904, 49664, 328704, 240128, 691200, -1084928, -121344, -250368, 222720, 380416, 1137152, 366080, -131072, -366080, 23040, -356864, 687104, 960000, -210944, 1237504, 1451008, 975872, -486912, 502784, 690688, -249344, 664064, 88064, 552448, -6656, -81408, -157184, 321536, 246784, 194048, 621056, 843264, 871936, -672256, -308224, -238592, 518656, 506368, 311296, 363008, 607232, 139776, 500224, 872448, 638464, 589312, -225792, 983040]
6829c3792E63200E4784M36736e35040B54976N52448q6528B72896J33120j1776
6819C94240N5296K50880e53472B11456d20352G41888j91488k32448F0928a70496
6808C6864M96128k28352c7888r2160C00032J69472I9840J105408C42016O9632
6798D11648K90304C31776E120N5808a74592A334272A15200b048C09760Q75520
6788A185280m78720R8304I4720K31424J190400j11104o10304J52576D18816K86208
6778G05024Q34560f9120l0208A67936Q8576c47136E71392J242624m92544b40640
6767D81792J69984J30560d91520A106944p0656C60448A38752L40992A75104b52928
6756G10656M05504E46304A23904k8160K23744J82784b01728A21344J24416q8576
$$ y = [-33792, 563200, 54784, 491520, -535040, 254976, 807424, 720896, 272896, 406016, 394240, 449536, 700416, -553472, 211456, -420352, 741888, 550400, 317952, 60928, -170496, 36864, 532992, 304640, -37888, -130048, 300032, 469504, 99840, 1205248, 342016, 411648, 701952, 331776, 5120, 60928, -174592, 1334272, 115200, -2048, 309760, 1185280, 706560, 804864, 94720, 326144, 1516544, 1405440, 795136, 947712, 418816, 705024, 1539584, -69120, -99328, 167936, 256512, -347136, 571392, 1814016, 1321472, -240640, 481792, 651776, 782336, -491520, 1106944, 1036288, 360448, 138752, 479744, 175104, -252928, 710656, 1116160, 546304, 123904, 95744, 319488, 502272, -201728, 121344, 245760, 157184]
6746A57184d52096I9840L56352J52064k46784J026560Q0896g5264D94592A88928
6735E83168b47296D10112M88960d5568G05536c25632n5808E75488a18272J9456
6725i8816j15712E28896r0112b57024A068544k40640B29376J16736M22912k27840
6715E41184J76640k87232A19296c8912H73984A73056J45920N14048Q16640g168
6704A051136G7312N7856c86560k62144B64704M63872k37568a59744o6048C87584
6693F95808J2800b6112A67936g2192B54464M67968a59232A61792N68320B60608
6682i5232j58208G57760C12320L20000K37568D30592B07360R56928A86880M57216
6672F44096i43104G96160d29568A310208l50208A33120K06336p7824N28896C4304
$$ y = [157184, -452096, 99840, 456192, 608256, 361472, 1388032, 1468928, -75264, 494592, 188928, 583168, -247296, 410112, 899072, -45568, 705536, -325632, -381440, 575488, -118272, -98816, -214528, 528896, 438784, -257024, 1068544, 827904, 229376, 346112, 769024, 541184, 717824, 430592, 119296, -38912, 873984, 173056, 318976, 833024, 1649664, -7168, 1051136, 77312, 135168, -386560, -648704, 264704, 728576, 491008, -159744, -225792, 387584, 695808, 708608, -26112, 167936, -72192, 254464, 722432, -159232, 161792, 730112, 260608, -95232, -253440, 757760, 312320, 632320, 869888, 430592, 207360, 1164288, 186880, 644096, -943104, 796160, -429568, 1310208, 960000, 133120, 339456, 261632, 790528, 34304]
6661c12832C31776K98496j38752M89472n8368D7616L4816O43072a202688E57568
6650C94752N97504G9872M69504A18272a56160N4272A122816o0416C09760J28000
6640D37760j72032R70752e61664C88608A00352K00192J32096M45440J22368a46944
6629b35008C33312Q55552I728h1920n53984a62816B03776O05696K0992k60096
6619E70368M33152k3040g29600A85856O53312k5088a82784j74592G79264B84160
6608A180672m90496j50528P39840C48672K24768R74336G27040a53088B39616p4752
6598A64864b21696I27744A59744L68640j20320A53088L35360A20832N30944k48320
6588D03456o4000j41824E4784Q56576m19328D5056O72768A16736d7104G43936
$$ y = [-312832, 331776, 630272, 491520, 980992, 922624, 47616, 82432, 725504, -1202688, 557568, 394752, 992256, 79872, 549376, 118272, -156160, -101888, 1122816, 1062400, 309760, 437760, 265728, 1236480, -561664, 388608, 100352, 300544, 432640, 878080, 1000448, -146944, -235008, 333312, 1188864, 9728, -81920, -635904, -162816, 203776, 809472, 830464, 570368, 1003520, 980480, -729600, 185856, 839168, 814080, -182784, -357376, 779264, 284160, 1180672, 690176, 539648, 1279488, 348672, 573440, 1547776, 727040, -153088, 239616, 164864, -221696, 927744, 159744, 528384, 408064, 153088, 488448, 120832, 651776, 403456, 339456, 197632, 54784, 911360, 492032, 45056, 717824, 116736, -47104, 743936]
6577g18336G98720J80224m66944a47968G81824A73056c47648A577472D23424a59232
6566G15776M84352l01568l47136Q42752C56864C072J19808J28512b01728F53312
6555C91168J70496N91872B93888J022976l11296l43552P75168C33824J343488
6546A677312G83360b92352A027584A16224O76864k6112j4848A96096O4000j08544
6536A51552N25312n3248J248256B55488P55200c42016E36576r2160J145856b48320
6525c40992A7408d03968C31264f7072G93088J60256b17600P6288G42400J044480
6515A786880c50208D31616a317888A54624K24256K53952A47968K05824q0384f4512
6504A410560B02240Q17152j77152b70336G53664J8944a97120C64032K31936M5056
$$ y = [-718336, 798720, 978944, 512000, -147968, 781824, 173056, -347648, 1577472, 423424, -159232, 715776, 1200128, 898560, 551424, 1394176, 356864, 3072, 122880, 251392, -201728, 653312, 391168, 561664, 1153536, 293888, 1316864, 1005568, 662016, 1437184, 333824, 1677312, 783360, -292352, 1027584, 116224, 793088, 766976, 752128, 196096, 260096, 151552, 676864, 623616, 1871872, 255488, 1010688, -342016, 536576, 444416, 1590272, -248320, -340992, 17408, -403968, 331264, -67072, 793088, 953344, -217600, -141312, 742400, 1786880, -350208, 431616, -1317888, 154624, 378880, 632832, 147968, 353792, 273408, -64512, 1410560, 202240, 1019392, 842240, -270336, 753664, 772608, -197120, 364032, 595968, 641024]
6494F41024B76480K17600J59232L00032l07200P1680k26816J63840k34496a053184
6483c95776R216O8096D33152d66432F27712a81760H87808B00192O38464b23744
6472I25184d49536F4512a088000b26816B62656n5296J108480E10464d1984k85696
6462c27680B14016L95264I4208f61504H44288P41376i3696n40672F24640m8128
6452E76512j39264P7312b8672I1648R05728C91168C5840b75456I45152A34144
6441I26720a000448i216G07072L05664D83840c4304A055744N8368C27680P08608
6431A036288a66912B93376J74080N66784C73760L79392K93376k90816C9936P28064
6421G68000b91840G70560B06336O07744f28224J2800A140736k79040K58048m49536
$$ y = [641024, 276480, 494080, 653312, 953344, 646144, 717824, 491008, 654848, 420352, -1053184, -395776, -386560, -318464, 433152, -466432, 627712, -181760, 887808, 200192, 838656, -223744, 925184, -449536, 64512, -1088000, -226816, 262656, 207360, 1315840, 510464, -41984, -327680, 214016, 609280, 94208, -661504, 844288, 1585664, -93696, -634368, 624640, 576512, 437248, 514560, -28672, 91648, 997376, 391168, 35840, -275456, 945152, 134144, 926720, -1000448, -9216, 707072, 1012736, 483840, -34304, 1055744, 1114112, 327680, 1036288, -166912, 293376, 467456, 1034240, 373760, 753152, 1046528, 755712, 39936, 768000, -291840, 770560, 206336, 814080, -628224, -615424, 1140736, 861696, 1119744, 670208]
6411F70208j61280R47712g4240C20000J309184G09632K60608D09088M50560J42848
6401A002496D90496J96096O10816c0208C82464G6800J62304Q32512D31104J456128
6391A887232I43616B63168Q46848E23776N12512l32800l00032K82112C16416A30048
6380d01920F35904k84672a259008I05216C14368M13696H192J813504q15104c14368
6369E68320O0416J12128J26976B64704A24928N98528b04800A266688n16608N79072
6359A329152o63040N89824A8944R63072R3696k33984h60672G25504a22880C50720
6348B36544R98400D35200A00864L16416L60960k0480M50560B76480H6016K08384
6338B94400N37600n0176C42016Q9088K93376a25440A693184p32672C59424O98880
$$ y = [670208, 508928, 1456640, -74240, 320000, 1629184, 709632, 970240, 409088, 859648, 1002496, 490496, 686592, 1297408, -30208, 382464, 76800, 239104, 1071616, 431104, 1887232, 943616, 263168, 1110016, 523776, 1036288, 703488, 403456, 685568, 316416, 130048, -401920, 635904, 351232, -1259008, 905216, 314368, 728064, 8192, 1821696, 1006592, -314368, 568320, 628736, 740864, 867840, 264704, 124928, 723456, -204800, 1266688, 750080, 1329152, 666112, 1255936, 18944, 982016, 1075712, 841728, -860672, 725504, -122880, 350720, 236544, 1234944, 435200, 100864, 417280, 778240, 757760, 1208320, 276480, 86016, 294400, 832000, 781824, 342016, 431104, 724480, -125440, 1693184, 960512, 359424, 1058304]
6328A058304B04800M74112B72384P06048C20000N4784Q78592E82144R18016o47680
6318H52480r9328j11104J61280L60960m33664J13152O43072B60608c53280B70336
6307C48160j61792M64896L44576H6016L24096J39776n8880P57248C09248N37088
6297H46336P3216P61344F06208k58560F2976c03104k47808G93088k85696j74592
6287C32800D096M03968N14048M08576D98176d35200B21696R13408a23392F18496
6276E10976P29600k93888D35200K23232L99360M8640j67424C55328e85216F28224
6265E19168O34880c33312E26848k46272K69312A03424J603584J66912b92352N2224
6255b40128b0480E40672K97984j59232d8128r69216i9840G90016k76480J165824
$$ y = [1058304, 204800, 678912, 272384, 978432, 320000, 374784, 1253376, 582144, 1500160, 852480, 753152, 642048, 803328, 1164288, 730624, 843776, 1486848, 260608, -353280, 270336, 348160, 186368, 651264, 995840, 86016, 410112, 549888, 491008, 1248256, 309248, 846336, 919552, 1680896, 606208, 347648, 62976, -303104, -550912, 793088, 507392, 332800, 4096, 408064, 922112, 1330688, 498176, -435200, 221696, 1135104, -123392, 618496, 510976, 1240576, 946688, 435200, 658432, 1057792, 1106432, 939008, 355328, -585216, 628224, 519168, 1154048, -333312, 526848, 280576, 549888, 103424, 1707008, 1873920, -292352, -240128, -20480, 540672, 838656, 679424, -48128, -1017344, -99840, 790016, 513536, 1679360]
6245A679360E9904N61664P01440l21536m99200J34144Q36096f91200H20224j06496
6235G13728N13536B50880Q72960J63328m97664k18112P45984A16224O50752K76992
6225A043968q9600B51392b96448G24992C28704M51072j78176i9840C48160K84672
6215F32832L00544j19296K44224f59456B16064O45120k46272J214976F27712k25792
6205D01920K41152O44096J86880M02432a60256G71584B87232H5504R24160j74592
6195H35072H704J87904M40832l18464k4576a18272D20352q4992J07008N01248
6185I43616g0144A743872A04448L27168N07904C59936K72896l06176O41024L0208
6175I97888k04800l584j76640A42336N82656M10112B57536L37920k60608J131520
$$ y = [1679360, 59904, 621568, 1323008, 1001472, 502272, 636416, 1472512, -691200, 820224, 713728, 1227264, 250880, 1123840, 1287168, 789504, 571392, 1317376, 116224, 766976, 1043968, 954368, 251392, -296448, 724992, 328704, 779776, 601600, -99840, 348160, 632832, 933376, 814080, 1058304, -659456, 216064, 861184, 614912, 1829888, 627712, 401920, 643072, 1287168, 1474048, 1876480, -160256, 771584, 287232, 85504, 1009664, 835072, 8704, 196608, 637440, 318976, 294400, -118272, 420352, 335360, 442368, 943616, -70144, 1743872, 104448, 431616, 939520, 359936, 632832, 326656, 967680, 997888, 793088, 789504, 612864, 142336, 724992, 1135104, 257536, 595456, 334848, 1466368]
6165A466368F46144j84832P57760b15040D71552A35168R4720P34720M8128k0480
6155I92256A31584J220608e3248D86400N40672l94752a1264A47968J83296M58240
6145G89504J76128m45952J16224M0448L94240l93728B5600O93760B12480J226240
6135A438720B23744K52416J94560j56160J83296P2192M95616k7648B56512L20000
6125E76512h24320B80064d31616g7312E08928O27200l36384K05824E7344J108480
6115A165824c02592C59424b4576H45824J55648k47808k38080c48160G22944L71200
6105A094144K23744E76512k82624J381888k43712o93248e47328D39296d68992
6095G38304A92512e5808D84352M13184D30592C7888J053184k29888J41824D07552
$$ y = [1466368, 646144, 461312, 1219072, -215040, 471552, 135168, 229888, 964608, 1012736, 992256, 131584, 1352192, -53248, 486400, 1027072, 632320, -11264, 147968, 331264, 789504, 965632, 519680, 635904, 676352, 1070592, 676864, 25600, 719360, 212480, 1438720, 223744, 476160, 670720, 514560, 697856, 770048, 1265664, 1238016, 256512, 576512, -824320, 280064, -431616, -77312, 508928, 1136128, 799744, 1005568, 57344, 1165824, -302592, 359424, -24576, 845824, 1001472, 753664, 515584, -348160, 722944, 1094144, 1317888, 576512, 293888, 1675776, 1432064, 738816, -547328, 439296, -468992, 738304, 192512, -55808, 484352, 897536, 430592, 37888, 1091072, 861184, 1003008, 407552]
6084b09920A374208m15232l584Q5504L2256k60608J26976Q44288B42176K50880
6074D93056Q85248C39968a02912A021440D78720N54496k0480K24256k6624J61280
6064A371648K90304D03456L07712a76128H4480P10656L29728B86208J97120J301504
6054A784832h4480F01088k39104O96832m21376N76000M91520m34688D80768k21184
6044B59584J020416E94944k43712K18112N57056l77856h98048B28864R62048m39296
6034G51616O36416M17280q98048B10944P66976R3696a77152F16448Q07424C95264
6023B33472e18656B27328N20192C70176b04288n92384H85248c3280D50560N73440
6013A024000c0208G11680B56512R0624N24800L60448C57888L13344J29536J6384
$$ y = [-209920, 1374208, 958976, 955392, 1040896, 1073152, 812544, 939520, 1783808, 242176, 493056, 1378304, 339968, -102912, 1021440, 478720, 1033216, 1012736, 1236992, 1210368, 1371648, 1661952, 403456, 711168, -176128, 84480, 795136, 1124864, 286208, 483328, 1784832, -84480, 601088, 361984, 1058816, 637440, 1213440, 1704960, 1270272, 480768, 259584, 1280000, 594944, 351232, 569344, 1126400, 748544, -898048, 228864, 1190912, 751616, 1388032, 1805312, 907264, 210944, 977920, 1071616, -177152, 616448, 1423872, 395264, 233472, -518656, 227328, 747520, 370176, -204288, -796672, 885248, -33280, 450560, 1024000, -30208, 711680, 256512, 347136, 871936, 1232384, 357888, 671232, 800768, 817152]
6003H17152l75296O09280j54624L01056E85728K64192j28000J36704k15040N26848
5993A170432E78048D8640J78176Q46848H7552J034752b26816j33120A19296M0960
5983A60256a43360I31328C84512A48480J339904e01760E57568b9696B93888J81760
5973D75648A30560M66944N05856j41312l85536Q41728c55328F00064k18112K84672
5963F66624B32960J021440j20320i7280G79776C584K3552J62304R60000n2736
5953A096704j11104j61792M50560l46112r0624r7280P9360R55904F33856L01568
5943I35424L50208A18784P21920B11968J114112F45632o0416M608L94752N69344
5933A553920B96960Q64768L30752E55008k3040O17984m92032A42848N44768B12480
$$ y = [817152, 441856, 1051136, 896512, 1197568, 585728, 849920, 721920, 858624, 643584, 1170432, 578048, 48640, 226816, 1073664, 87552, 1122304, -226816, -359936, 119296, 160256, -143360, 931328, 384512, 148480, 1488384, -501760, 557568, -29696, 293888, 475648, 130560, 597504, 1103360, 962048, 576512, 1418240, -355328, 600064, 381952, 666624, 232960, 1254400, 1134080, -97280, 779776, 3584, 27136, 189440, 1149440, 1096704, 985600, 823808, 1274368, 928256, 837632, 740352, 819712, 1775616, 633856, 935424, 1285632, 118784, 840704, 211968, 1326080, 645632, 585216, 589824, 984576, 1553920, 296960, 1161728, 1492480, 555008, 531968, 1149952, 657920, 142848, 687616, 212480]
5922E59104P58784n66784k43712J014272o08256K75968l7888O8608j24928m72064
5912F23104m8128B10432Q05376j06496m32640N14560B22720a50528D49536Q16128
5902A265664N632A74592J783808H48896L26144l95776o1952m7104J97632N76512
5892A444352n13536K19648k14016D50560O50752L78368A54624M07552O55872A66912
5881G88992J598464m29568o14912o32832j25952k3040a78688F75328J262592j06496
5871A831424q17664L7376D61824J536Q14592C7376K045440b91840A113600q0896
5861A032704M07552e84192B76992J270272P3216F11840Q26880E03808Q53504l38432
5851A018880L67616j19808K7136n36064J35680k21184g0144A79200J127424B31936
$$ y = [559104, 1317888, 751104, 507392, 1521664, 913408, 1189376, 1151488, 1220096, 1095168, 623104, 574976, 210432, 1015808, 909312, 476672, 991232, 222720, -150528, 449536, 1265664, 1271296, 174592, 1958400, 848896, 1175040, 779264, 717312, 670208, 867840, 1444352, 930816, 1150464, 936448, 450560, 1101312, 1479680, 154624, 562176, 1218048, 166912, 788992, 2387456, 1957888, 1342976, 710144, 584192, 561152, -178688, 675328, 1937920, 1831424, 1013760, 1051136, 461824, 463360, 1277952, 37376, 2082816, -291840, 1113600, 1032704, 1440256, -584192, 276992, 1547264, 1620480, 611840, 1438720, 503808, 1357312, 1018880, 1386496, 1266688, 1293824, 757760, 893440, 672256, -70144, 179200, 1306624, 231936]
5840F54336C05664K91840Q01792n89824A24928N08416M16768C01056O30272J50528
5830A081856j89440B19648L70688P5264L14880j7408c34336I80480K40128L22048
5820A542656N16096B88256K95424J026560p53664K49856n17632o7072G0656J21344
5810A92000d75136B50880O88128k42688k76992M86912l97824j50528K58560A75104
5799I43104P54176C03104P78752D4032J100800M65408n24288L9424A09568J176064
5789A285632l22048J90976J13152n80608P21920F20544K30400L98848j67936j55136
5779I26720B96448J224192F82496P8336O05184m67968M42880H7552M75136J215488
5769A778176q75008d7104A130496m49024J014784n70368k41152C96800j26464
$$ y = [654336, 305664, 597504, 1399296, 809472, 124928, 633344, 1050112, 301056, 931328, 1081856, 892416, 219648, 590336, 665600, 980480, 963072, -334336, 980480, 1220608, 1542656, 2058752, 288256, 583680, 1610240, 856576, 1106432, 588800, 521728, 70656, 192000, -475136, 250880, 939008, 696320, 419328, 906240, 508416, 357888, 616448, 175104, 943104, 1697280, 303104, 1081856, 44032, 1144832, 1610240, 1085952, 1125376, 109568, 1285632, 963584, 1154560, 1267712, 687104, 1409024, 620544, 850944, 1249792, 1081856, 926720, 296448, 1520640, 682496, 760832, 1366016, 898048, 1340928, 87552, 562688, 1778176, 903168, -47104, 1130496, 681472, 1696256, 1125888, 884736, 396800, 270336]
5760B70336G4240O56896J03424j04960R61024E82656M50560L24608b51392A672704
5749C05152J414144n50912I728a76640G75680N5296K41664B51392J018880K4064
5739A294336l91168l40480M86912n632L61472d97152D22400J024512J00864G28064
5728H00768M03456B26816M87424L15904J329664j094144R2160b84672I26720B79552
5717G59808j13664J37216J199104m76160F12352j08544P84896E64224j81760K37568
5707F20032P28064n92896a60768A063424o8608k98496K9184M12672D16768K71360
5697F88128B89792O16960P13216n05856q7552C96800F5024N54496B28352J035776
5687A264128j98144j14176J260032E83168J50016j47968J197568o28736M23424
$$ y = [270336, 74240, 731136, 834560, 729600, 1690624, 582656, 1033216, 1357824, -251392, 1672704, 305152, 1719296, 1168384, 9728, -176640, 775680, 830976, 1072640, 251392, 1270272, 1294336, 903168, 562688, 1049600, 1043968, 1405440, -497152, 422400, 1446912, 1547776, 728064, 800768, 1204224, 226816, 714240, 1030144, 2359808, 1265664, 1357824, -284672, 926720, 279552, 759808, 646144, 783360, 1982464, 1506304, 612352, 503808, 1288704, 564224, 382464, 620032, 1348096, 755200, -160768, 1063424, 994816, 696320, 725504, 1138176, 416768, 688128, 289792, 906752, 1619968, 1114112, 1026560, 396800, 65024, 619520, 228352, 1264128, 1065984, 951808, 2211840, 583168, 733184, 585216, 1782784, 1154048, 1577472]
5678A577472k65728A4336J267712M18304q2944D18304j48992N17120J50016M70528
5668A406976n13024c19488C73760M90496K55488k90816l99360L71712J127424
5659A928704q73472J105920H07936N76512J48992n77536A50016b35008C30752
5649A433600k15040o06720K62656J51552l84512J185280q92416K04800n63712
5640E75488P42912D86400L84000C82464j59744J630208K27328j030656k36032
5631H13568Q68352M608j58208j01376m60288D12160P98208k96448m03456L19488
5621H29952K58560J5360K77504C48672N20192M37760B74944M57728R79968A60768
5610A210880K11456l58912M9664P64416L94752j022464m64384P72096k5600J68448
$$ y = [1577472, 1311744, 14336, 1282048, 1700352, 1617408, 418304, 269312, 786432, 936448, 1406976, 893952, -319488, 373760, 864256, 1119744, 828928, 429568, 801280, 1928704, 1055232, 2161152, 807936, 1384448, 1533440, 955904, 150016, -235008, 330752, 1433600, 1218560, 611840, 874496, 1026048, 641536, 1826816, 934400, 1139200, 575488, 1318400, 486400, 870400, 382464, 222720, 1852928, 2080256, 1049600, 813568, 1681920, 1686528, 1528320, 1426944, 966656, 412160, 1210368, 913920, 510464, 829952, 1088512, 1103872, 1381376, 348672, 868864, 1306624, 274944, 732672, 1712640, 160768, 1210880, 1422336, 1063424, 1113088, 1877504, 2272256, 1249792, 785408, 1557504, 1531904, 1700352]
5600A700352j05472G61856O68160O7584o83008K81600M54656G56736O62016n66272
5590H52480C48672J520640O5536j99168K69824D19328J91488Q16128m35712K95936
5580A287168R00096H92928j00352J229312j55648M73600n47328m45952k88256
5571A058304L49184n46816B00192J575424j46944P43424j141248O72768H52992
5561A163264L69152D04992M67968K5600J34144m92032j12640J006592A85856J714176
5551A900032H72960B49344P49056P26016p37792C15904K81088N39136M36736E23776
5540A467904L91680E51936l4304N5808J447936H36608M12672k88768P20896N45280
5530B226688n72928n96992R44128B70848M09600J91488b01216A44896J071104
$$ y = [1700352, 1594880, 761856, 1430016, 1497600, 814592, 1096192, 1550848, 756736, 1418752, 852480, 348672, 1869312, 1934848, 1735680, 2005504, 419328, 610816, 1426944, 991232, 1287168, 2187264, 892928, 792576, 2021888, 1866240, 2339840, 1792512, 1346560, 1058304, 1407488, 860672, 200192, 1775616, 1628672, 2372096, 1230848, 1903616, 852992, 1163264, 1532416, 404992, 872960, 898560, 1032704, 540672, 428032, 1434624, 185856, 1900032, 872960, 249344, 998400, 1724416, 986624, 315904, 596992, 1136128, 1572864, 523776, 1467904, 1859584, 551936, 517632, 573440, 2021376, 836608, 1249280, 960512, 1681408, 2226688, 1653760, 1056768, 2000896, 270848, 680448, 871936, -201216, 144896, 1216000]
5521A216000Q88320j30048q95488q3968N86240j20320D70016O75840J64352k51392
5511A058816N06368B7136K430464G64928k07360K07360B96960M98176L20512k43712
5501H71936L44064O76864I29280M81280n17632N2224j536J24416m28032J214464
5491A854464D71040R33376l22560n7856K25792m92544P18848l46112D08064L80928
5481G88992k77504K68800Q8064Q45312p4240j78688K80576o27712O38976k68288
5471A484288J26976n42720j93536R23136p11680J40288K43200J78176L94240j99168
5461A843200j64352K52928q11008j83296N08416j72032j17760K05312J32096j05984
5451A387520L81440H66304J274880j79712n76512L14368q16640N82144K22720
$$ y = [1216000, 2104320, 1974272, 1078784, 994816, 1581056, 1460736, 470016, 1145856, 1310208, 1058816, 1565184, 27136, 2457600, 764928, 557568, 764928, 296960, 795136, 1115648, 871936, 1216000, 1892864, 929280, 1410560, 892928, 945152, 943616, 1068032, 640000, 1854464, 471040, 1404416, 1081856, 1024000, 1249792, 757248, 1476096, 1129984, 408064, 788992, 511488, 780288, 868352, 1713664, 1639424, 1460736, 1741312, 1113600, 1752576, 1484288, 1611264, 1068544, 875008, 1798144, 1086464, 1226752, 1469952, 1648128, 2042368, 1843200, 1678848, 1931776, 1120768, 937472, 1445888, 1273856, 1156096, 1361408, 1493504, 1387520, 1768960, 866304, 2141184, 1961472, 1384960, 1699328, 882688, 1464832, 1687552]
5442A687552K97984m43904m03456m81792J24928R47712G13216K44224J155072
5433B112512p55200n56544J171456G06560Q81664k81600L072k14528l11296P08608
5423A492480N77536m8640l5840l77344j66912M24448K74432N41184j275904j18272
5413A287168J470464A033728R91232L1744k24256o77888K51392J20320K560P62368
5403B291200n15584q27392K101248A213440M31616j62304k27840J270272I80480
5393B210816j047040n06880J091072M09600A049088J31072L90144M54144F40000
5383A331200L34336o80448M11136n08928R18528K5600G41376K89280C63008R5232
5373D58240N27360k88256K56000m27520Q61184k44224J60256D73088L90656M37760
$$ y = [1687552, 1985536, 1541632, 1138176, 656384, 781312, 1729024, 713216, 957440, 2112512, 1357312, 800768, 1972224, 706560, 1588224, 1306624, 1309696, 1095168, 783872, 1492480, 2070016, 2021376, 1985536, 1608192, 1441280, 1865728, 2140160, 2681344, 1405440, 1287168, 2757632, 1033728, 2024960, 2056704, 1832448, 1154560, 1405952, 1526272, 1528832, 2291200, 1775616, 948224, 3049472, 1213440, 1645056, 1482752, 1254912, 2525184, 980480, 2210816, 1163776, 656896, 1747968, 2157568, 1049088, 1180160, 1570304, 2024448, 640000, 1331200, 1665536, 985088, 1396224, 887296, 1805824, 1831424, 741376, 1030656, 363008, 458240, 985600, 697344, 953344, 525824, 1387008, 1142784, 1303040, 473088, 863744, 1301504]
5363A301504l78880J47456r2672M49536H0896J122304C97312J753088C10272R16992
5353A227264J6896E90336J39264j9968M7104P34720L93216r34912j58208K13504
5343A005056D7104K128896o28224G28576j80224J688576G88480K39616R65120
5334A993216A67424R91232N32992M43904j003520j93536A92000J244160j81760
5325A254400D96128O76864n25824O87104K56000G24992J162240m62848l82976
5316A041408M23936J67936j19296Q3456k78016j89952L32800N63200r70240j78176
5306H77056J86880j76640C97312L76320L47648Q73984E02272J286144o25664Q45824
5296B008576q32512K23744J93024k06336j03424L62496n59104L17952n80608J529344
$$ y = [1301504, 922624, 1070080, 977408, 1426944, 80896, 1203200, 397312, 2150400, 310272, 1227264, 1244160, 590336, 729600, 709632, 756736, 1491456, 1884672, 949760, 791552, 1005056, 47104, 2176000, 1547776, 728576, 548352, 2236928, 788480, 1028096, 1993216, 167424, 1158656, 1691648, 2135552, 1132032, 938496, 192000, 1436160, 1254400, 496128, 1172992, 647168, 1334272, 1590272, 724992, 1887232, 1424384, 1041408, 1465344, 1633280, 1513984, 1597440, 1319424, 1129472, 1462272, 2025472, 1055232, 877056, 1063936, 887296, 397312, 773632, 1121280, 1995264, 502272, 1788416, 1162752, 2008576, 1176064, 1399808, 1592832, 1386496, 1283072, 1645568, 1086464, 1404416, 823808, 2353152]
5286B353152p36768G85408k96960J208320n93920N30944k97472n64224P26016
5277A498112j69984K35008F27200P44960J08544E74464M82816k36032J72544P82848
5267A776640j26464G20384P81824F98368J317376m77184P88480E69856P93600
5258A363456O68672l29728n41696J36704N20192K80576o38464K07872j30560N28384
5248B065408n02272k26304L78368m23424k0992G7824J424384J43872N34016F83520
5237A774080p76704K20160M84352C00544R62560F06208O84032J75616K00704K02752
5227A869312C03104J157120J35680l49696K11456J92000m88960R08800r80480
5218A089024K17088J56160K2016l38944j67936N44768F70208J250304o07744j26464
$$ y = [2353152, 1616384, 785408, 488448, 1696768, 1102848, 1633792, 1336320, 772096, 1498112, 1328128, 1563136, 627200, 1372160, 1480704, 574464, 1057280, 821248, 993792, 1776640, 1650176, 720384, 1502208, 698368, 2015744, 1538560, 2327040, 569856, 1363456, 2032128, 1702400, 1160704, 1297408, 1817600, 2098176, 1459712, 1667584, 1537024, 2065408, 1563136, 1336832, 1715200, 1291776, 1270784, 77824, 1502208, 1646080, 2180096, 683520, 1774080, 997376, 1217536, 1701888, 300544, 1263104, 606208, 1290240, 1465856, 1666560, 1869312, 303104, 1460224, 1595904, 1246208, 1457664, 1649664, 1160704, 2069504, 1089024, 1306112, 1462272, 1484288, 1145344, 977408, 1522176, 670208, 1920512, 1312768, 1186304]
5208A186304m04480M30080B71360O25152O46656L01056l49696o70208C4816J309184
5198A344000M36224M51072q58112l11296M71552l6864L14880L88096r68704O2976
5188A293824N18656j67424G83872J264128F92736K03264J57184R37472o40000
5179A350656K41664F48704J447936p15776P20384k32960m55168k4576P63392q62720
5169A289216k82624J012224r728m46976J26976k59072J433600A322496J016832
5160B339328o90688j39776M65408N12j45408J672192k15552l99360n8880N65760
5150C393536M94592o61504K42688j272832J3312H61184J219072r84064R52832
5141B049024o97856k70336N72416n45280J308160A168384Q71424J26976m76672
$$ y = [1186304, 781824, 1211904, 271360, 896512, 1543168, 1844224, 1494528, 824320, 34816, 1344000, 1780224, 2231296, 1373184, 1061888, 1533440, 1496576, 1811456, 2199552, 1230848, 1293824, 1812480, 1645056, 783872, 2048000, 692736, 896000, 1053184, 1990656, 1350656, 1592320, 648704, 2096640, 1380864, 2101248, 1868288, 1413120, 1388544, 2151936, 1289216, 1006592, 2018816, 2009088, 1562112, 1689088, 1430016, 2863616, 1322496, 2339328, 1648640, 1508864, 1974272, 1974784, 1829376, 3501568, 3286016, 2886656, 2827776, 3393536, 3888128, 3226624, 3469312, 2196480, 2209792, 861184, 2080256, 1096192, 2049024, 1351168, 1080832, 1653248, 1107968, 2416128, 1168384, 2039808, 2166784, 1690112]
5132A690112G11680Q31488G70560J441792r23648n17632P72096l97824K29888
5123A375232P89504l8912p93600o42048J55648Q37120j84320m50560l1744J071616
5113B087936l69664l24096K42688m70016L28192K08384G02976l39456J121280
5104A484800l24608K64704J35168m59264J83808M6592P5776M2496L26656n56032
5094A220096k81600J079296q20736N75488j41312k58048j15200B78016R05728
5085A183744P79264o12864k6112P44960I40544N68832G07072R06240m29056L32288
5075A516544P89504A125376J158144o65088o34880l1744K11456j52576k32960
5066G77728J741824H56064R02656k75968n6832l74272J229312m07040q0896m42880
$$ y = [1690112, 711680, 1543168, 770560, 2212352, 1288704, 771072, 1543168, 1145344, 1375232, 2164736, 2125824, 1332224, 690176, 845824, 1682944, 1498624, 1048064, 1016320, 2087936, 1718272, 1394176, 1636864, 1166848, 1495040, 1703424, 702976, 363520, 1484800, 1160192, 1424896, 1560064, 1100800, 1284608, 1331200, 1406976, 1449472, 1776128, 1220096, 938496, 2017792, 1197056, 1772544, 1631232, 1373184, 1257984, 278016, 1183744, 1963008, 1350144, 1324032, 2068992, 940544, 1509376, 707072, 1613312, 1184256, 1516544, 2306048, 1125376, 2283520, 1618432, 983552, 951808, 1163264, 1010688, 777728, 2519552, 856064, 1758720, 1482752, 1425920, 1051648, 2280960, 1873920, 1793024, 1350144]
5056A350144N09952L28192l76832n61152P21408j01376n81632j26464E72928J159168
5046A732096M66432o94784N75488k46784R7280Q59136j164800K53952r6256L4304
5036A816064q0384J4848p25504J906176p18336l77344J83808J99680o26688M69504
5026B061824k72384m5056J424384A133056O22592k07360K07872k10432P14240
5017B259968L7376m54656O0416o51776J204736k49856j23392O14400I82016O77888
5007A659904a07520A128448R66656l44064P96672p77216M06016K18112l66592
4998B028032l09760P2704E49376O2976J739264p93088N70368j84320j12128O03136
4988B435584n03296N7344A92512K615296I60000P53664L98336n37600K56512F75840
$$ y = [1350144, 1860096, 2188288, 1811456, 1250304, 1971712, 1870336, 1288704, 1162240, 572928, 1732096, 2198528, 1503744, 2079232, 1832448, 1929728, 2788864, 1624064, 1878016, 1781760, 1816064, 1735680, 1750528, 1025024, 2931200, 2212864, 1835520, 2019328, 2219008, 1592320, 2061824, 1789440, 1744384, 3168768, 1133056, 1755648, 1548288, 1756160, 1545728, 2259968, 2297344, 1842688, 1903104, 1251328, 2456064, 2206208, 2082816, 2697216, 982016, 1659904, -107520, 1128448, 2095104, 1751040, 2547712, 1770496, 2176512, 2394624, 2028032, 1718272, 1790976, 549376, 612352, 2351616, 1558528, 2128896, 1944576, 1832448, 2435584, 1932288, 1989632, 192512, 2807808, 960000, 1713664, 2112000, 1574400, 1830912, 675840]
4977B174464m93568N43744J91488p82848K90816Q5504P5776q34048P20896I50784
4966A900032r4208j12128P08608I02656L74272k5088J58208M66432r00608Q69888
4956A845760o05184J283072l97824M27520j164288l78368J337344r28256N81632
4947B001408Q9088p49056J77664j2800M16768o95296J565184o76864m55680N52960
4937B213376K98496n17120I62048J165824k22208j14176l09760J005056k73408
4928B213376J029632H54528J862656m39296P52640r78944p45984R83040l20512
4919A968128K1504J24928M79232Q51968l01568Q40704j021952K787328p93088
4910D957184L59936j38752p89504J831424j576448j68448J66912j531392J36192
$$ y = [2174464, 1680896, 2224640, 2416128, 1633280, 1924096, 2009600, 2085376, 1251328, 1972224, 950784, 1900032, 1805824, 1693696, 2402304, 902656, 1276928, 1251840, 1410048, 1876480, 975872, 1845760, 1240576, 2523648, 2125824, 2553344, 1389056, 1010688, 2348032, 1419776, 2001408, 2090496, 1341440, 1519104, 1506304, 1923072, 1227776, 2792960, 2116096, 1660416, 2213376, 2511872, 1994752, 962048, 2127872, 1905664, 1791488, 1481728, 2486784, 2213376, 3243008, 854528, 2717184, 2277888, 3030528, 2051584, 1305600, 2288640, 1968128, 1989632, 2114560, 2593792, 3445760, 3144192, 3984896, 2962944, 5750272, 4957184, 5317120, 5178368, 4388864, 6220288, 4643840, 4475392, 4642304, 3110912, 3247104]
4901C247104j18272q1920K80064o48704o8608m54144m64896m68480R19552l36384
4891A805312o23104J344512r07776n4784K2528J52064J87904l12832M11136l77344
4881A647616M1984j96608L17440j30048m02944J006592P92064n69856H35584J824256
4871B659840j167872P54176I85600N06880K80064o92224n20192J267712D96640
4861B177024r33376N61664O36416j157120M36736p82336J131520K77504o96832
4852A651200D82304J233408K60096P95648j302528K96448j32608P93600j108480
4843A317888Q21760L53792q41216L13856N7856J33120j6384M1984r44128K84160
4833A522688L53792K59584j8944M26496q17664m7104M35712k08896K5088n24288
$$ y = [3247104, 3128832, 3046912, 3326976, 2678272, 2609664, 2155520, 1690624, 1222144, 2141696, 1805312, 1182208, 2526720, 1618944, 1564160, 1586688, 1738752, 1926656, 1613824, 2024960, 1647616, 1689600, 1492992, 1810432, 1680384, 1277440, 2284032, 3076096, 2506240, 835584, 2659840, 1491968, 2246144, 985600, 1492480, 1772544, 1080320, 560128, 1827840, 496640, 2177024, 1243648, 1805312, 2441728, 1284608, 1721344, 939008, 2070528, 2348032, 1651200, 482304, 1715712, 1975808, 2771456, 1468928, 1765376, 1632768, 2426368, 1317888, 2139648, 2493440, 1652224, 1966080, 2023936, 2157056, 2140672, 2182656, 1238528, 1522688, 1876480, 2136064, 2117120, 2543616, 1725952, 1678848, 2114560, 1905664, 1930752, 1406464]
4823A406464J388544n05344k74944L47648m01920M71552J14688n51424k01728
4814A793536K93376P2192K560L70176m23936j009664J633280r91232J278464o49216
4804B369536l14880l08736L41504E24800P95136J427456j134080Q11520p64416
4795A660416p51104J340928J82784l73248n43744R89696I69728J058304M35712
4786B463744A146368Q80128n06880K06848Q45824j41312K45248k1504N0176m78720
4776B226176O8608r85088R18528M96128q67840G65440J820672A144320O86080
4767A830400O16448o12352B52928K025472k77504M09088j45408J75104K05824
4758B645504K82112q66304R76896k28864q8576k84160l03104M29568q09984J243136
$$ y = [1406464, 2795008, 2289664, 2014720, 2362368, 1960448, 2432000, 2546688, 1995264, 1793536, 2086912, 2159104, 2161664, 2531840, 2107904, 1098240, 2731520, 1740288, 3018752, 2369536, 2054656, 1745920, 2087424, 524800, 1319936, 2747392, 1613312, 2424832, 1660416, 909312, 2250240, 2433024, 2059776, 1516032, 2505728, 969728, 2028032, 2463744, 1146368, 2026496, 1519616, 1726464, 2572288, 2430976, 2676224, 2654720, 2704896, 2226176, 2294784, 1309696, 2228224, 2724352, 1856512, 765440, 2586112, 1144320, 1830400, 2446848, 1834496, 252928, 2278400, 2000896, 2409984, 2264576, 2439680, 2645504, 2927616, 2061312, 3038208, 2809344, 2720768, 2436608, 2133504, 2563072, 1753088, 2996224]
4748B996224l09760J17248l24096P0144Q09984j254400o89152J844736l29728
4739B931200A246720J124864q30464P79776L42528k85696M5056o63552P89504
4730B548736J94048k23232p81312J352192k96960o19008L52256r216R71776r37472
4720B551808K61632j65376N09952j331200K57024M3008P77216r33376M98176M13696
4710B882560J8944j034752J73568J106944m04480l34848k44736O87616r69216
4701A881600L88096J163264k95936o94784M608j127936J664512p17824M87424
4692B753024j67936k45248j56160L30752q97024N99552L96800q5504j18784j39264
4682B270208L08224N21216M07552j640448J337856k83136m70528A174016J971712
$$ y = [2996224, 2686464, 2803712, 2479616, 2549760, 3359744, 2105344, 1416192, 3260928, 2931200, 1246720, 2371584, 1541120, 2320896, 2663424, 2377728, 2422784, 1759232, 2548736, 2742784, 2519552, 1738240, 3090432, 2793472, 2174464, 2526720, 2517504, 3489280, 2551808, 2813440, 2648064, 3158016, 1826816, 2083840, 2126848, 2904064, 1970688, 2468864, 2882560, 2901504, 1866752, 2040320, 3147264, 2742784, 2407936, 2163200, 2850816, 1881600, 2269696, 3432960, 3137024, 2442240, 2446848, 1318912, 2983424, 2265600, 2753024, 2585088, 2339840, 2183680, 2514432, 1617408, 2216960, 2613760, 2528256, 2409472, 2270208, 2578432, 3099648, 3507200, 1866752, 3204608, 2921472, 2450944, 1174016, 3145728]
4673C145728j112576N2736Q78080k16576j234432J475072N88288n06880K11968
4664C281408o12352n27872M15744M6080p08096J012224j175040J150464m42880
4655B439680L09760A353216J387008J04960o1952J260032j195520N85216P72608
4646D205568j063936K65216o70208n79072J28512J40288J324544n6832m66432
4637C227648j5872J73056l24096n62176n65760K99520N91872L06176j031168O09280
4627B708480j215488P72608L16928L95264j108992N89824L91168m77696J16224
4618B488320M33664M07552l38432r0112J089024q54016j50528N41184K5088r53344
4608B598400M3008L58912J369088j439744M04992L94240j003520m92032L75808
$$ y = [3145728, 2033152, 2085888, 2963968, 2747392, 1512960, 2988032, 3576320, 3069440, 3281408, 2669056, 2141184, 2556928, 2603008, 1894912, 2907136, 1732096, 2882560, 2439680, 2749440, 1353216, 2740224, 2845184, 2783232, 4043264, 2847744, 3432960, 4205568, 3141632, 3406848, 2736640, 2157568, 2286080, 2426368, 3750912, 3694080, 3227648, 3211776, 3384832, 3060736, 2498560, 1932800, 2232320, 2824192, 3130368, 2099200, 2708480, 1492992, 2265600, 2582528, 2977792, 1868800, 2458624, 2849792, 2372096, 2488320, 2921984, 3329536, 2991104, 2900992, 3990016, 3136000, 2985472, 3526656, 3551744, 2598400, 2641408, 3000320, 4369408, 2929664, 3334656, 3728896, 2725376, 2233344, 2609152]
4599B609152J5872R24160k46272n07904N54496P9872n08928j282048K100736A804288
4588B454016j64864R28256j100800r9328J85856R90720o5536p52640m08576Q7040
4578B054144j59232J252864A426432J095168n63712Q70400J86880r5744q38144
4569B081280M98688r65120l22048K6624J807360o27712p06560J138176Q8576l18976
4559B700288n82144M23424q5504L31264j08544L59424p38816P27040j495040J763840
4549C295232j154048K8160J281024j339392L14368p4240n03808J01888J361408
4540C310592l05152o27200J004032m25984K64192o53312j6384N7344r2160K00704
4530B716672l97312J140224k80064j435136J80224J198592m35712L68128l4816
$$ y = [2609152, 2625024, 3549184, 3302912, 2795008, 3349504, 3429376, 2920448, 1638400, 3739136, 1804288, 2454016, 2289152, 3217408, 2116608, 2017280, 2203136, 3193856, 3128320, 2375680, 1967104, 2054144, 1894912, 3147776, 1426432, 2521600, 1957888, 2828288, 3015168, 2919424, 2081280, 2579968, 1614848, 1292800, 1319424, 3126784, 2499072, 1792512, 2930688, 3019264, 2700288, 2118144, 2541568, 2456064, 2787328, 2678784, 3038208, 2299392, 3026432, 1531392, 3295232, 2141184, 2169344, 3450368, 2110976, 2425344, 2351104, 1847296, 1949184, 3310592, 3005440, 2378240, 3382272, 2956288, 3220480, 2567168, 2550784, 2608128, 2515968, 2716672, 2319360, 3459584, 3179520, 1744384, 1924608, 3123200, 2687488, 3055616, 3020800]
4521C020800O71744k01216O50240q09984k13504J088512m28544m79232l36896
4512B961920M53632k35008P76704k15552j623552J945600q16128Q58112q09472
4503C296256J6384O04160m91520n38112M6592Q04864m34176l63008K19648J23904
4493C284992m79744k36032K30400P26016O656l23072p4752o02112J541632j802240
4483B271744K76480L50720l64032O47680j077248N96480o09280N67296o3488K81600
4473B877952m99200L3280o41024P44448q57088R97376M44928q02304J134592n62176
4463B870784r75360P35232P18336n05856O33856l8912j122304k17088N55008o3488
4453B590208M35200p16800J086976q03328Q42240j046528J363456J02400r42080
$$ y = [3020800, 3692544, 3491328, 4141568, 3331584, 3118080, 4206592, 3778048, 3298816, 2961920, 3415552, 3180544, 3957248, 3741696, 2118144, 4063744, 3247616, 4105728, 3296256, 3312640, 3916800, 3425280, 2887168, 2933760, 3738624, 3304448, 2941440, 3161088, 3284992, 2805248, 2569216, 2799616, 3525632, 3532288, 3209216, 3134464, 2532352, 4073984, 2271744, 2548224, 2898944, 2534912, 3182592, 2105344, 2701824, 2092544, 2659840, 2596352, 2877952, 2378752, 2412032, 1771008, 2515456, 1658368, 2655744, 3100672, 2298368, 3432960, 2870784, 1895424, 2630656, 3348992, 2843136, 3476992, 3438080, 2315776, 2098688, 2653696, 2590208, 3025408, 2308608, 3395584, 2592256, 3434496, 2387968, 3751424, 3853824, 2911744]
4444B911744p9360N21728q3968j72032J92512N66784k6112q78080m71040k68288
4434B213888P82848Q85248j456640M50048K11968N2224p6800M78208k04800p35232
4424B600960J86368J288192q56576K03264p77216L07200l74272n632K66240p680
4414B830848n79072K00704J382912r11360k57024K22208O31808o60480R61024
4405C821568p98208Q32000n57568l0720M34176M8128j07520O33344n96480N24800
4395D203520n22240J62816J192448k91840k71872P02976r67168M70528j073664
4386C605504k35008o33856J287680n40672l89632N29920q66304p0144J178112
4377C865600N98016r67680Q88832q80128O24640M51584j021440J98656N41184
$$ y = [2911744, 2832384, 3354112, 3270144, 3098112, 3290624, 3857408, 3831296, 2953216, 2482176, 2213888, 2996736, 3881984, 2425344, 2875392, 3087360, 3139584, 3062784, 3540992, 3336192, 2600960, 2787328, 4075520, 3218944, 3422208, 2644992, 2952192, 2577920, 2572288, 2838528, 2830848, 2251776, 2452480, 3835392, 2924032, 2667008, 2889216, 3521024, 2860544, 3821568, 3023360, 3855360, 3297792, 3267072, 3701248, 3749376, 3641856, 4275200, 3678720, 4203520, 3681280, 3844096, 5036544, 4744704, 4472832, 5175808, 4208640, 4679168, 3605504, 3370496, 2736640, 4024320, 3483648, 3094016, 3623936, 2757632, 2687488, 3865600, 4463616, 3495936, 4384768, 3504640, 4129280, 4580864, 3559424, 3758080, 4299264]
4368D299264J95072k06336K21696j370112J030144n22752Q81152L8400Q72960
4359E439488q17664Q17152j323520n50400M09088J07008K86720O8608M61312j98656
4349D699136k44224o4000j62304p04512J378304j572352J024N1200l66080J046528
4339D062720m19840j23904P23968j581056O63040k84160O05696o95296J386496
4330D337664m41344J33120n22752l5840m24448L51744O53312j7920m81792J3824
4320C565568P4240l9936J37728o72256J125888K4576p14752p45984K20672J09056
4310C084800P08096j079296R82528N88800j360384M86912l21536J08032m70528
4301B727424J438720r56416J00352Q94976q22272j242624J013760m66432J625088
$$ y = [4299264, 4494336, 4288000, 4509696, 3139584, 4169728, 3646976, 4528128, 4566528, 5439488, 4621824, 5438976, 4115456, 3565056, 3974144, 4081152, 4367872, 4436480, 4897792, 4699136, 4454912, 4390912, 4228608, 3524096, 4902400, 3330048, 3331072, 3382272, 3016192, 4062720, 3642880, 3518976, 4242944, 2661888, 3324928, 3040768, 3646464, 2951168, 4337664, 3896320, 4029440, 3506688, 3470848, 3046400, 3398144, 4051456, 4033536, 3551744, 3565568, 3639808, 3599872, 3737600, 3065344, 4191232, 4215808, 3501056, 2755072, 2975744, 3084800, 3792896, 2713600, 3696128, 4284928, 2924544, 3411456, 3089920, 3197952, 2727424, 4166144, 3209728, 3310080, 4205056, 3382784, 2140160, 3153920, 2687488, 4312576]
4292D312576j040896J85856o20544N49888J73056r4720m0960p31136j8944J446400
4282D120576j056768L70176K8160o1440K93888j31584j441280J440768p90016
4273B772480R63584p64928O13888r43104Q68352q13056N86752k06336k46784O35904
4263C466752j31584m76160j80224J003008r2160J02912o42048M97664l16416J51552
4253C383296j021952Q78592J12640o15424N08416P51616j060352J36192l17440
4244B755584l39456K56512Q32000K41664j846784K038272q06400L21536r74848
4235B478080j016320J919488q32000r216K138624A704960N05856M77184P53664
4226C441664j022464P96160l23584J95072Q7040R14432o86080K63680j143808
$$ y = [4312576, 3271680, 3457536, 2836992, 3386880, 3559936, 3465216, 3424256, 2693120, 2674176, 4120576, 3063808, 3433984, 3462144, 3400704, 3694592, 3563008, 2121728, 3562496, 2772480, 3736064, 2971136, 3585024, 2641920, 3510272, 2697216, 3283968, 3077632, 2830848, 3466752, 3335168, 2859008, 2678784, 3681792, 3589632, 3692544, 3050496, 3548160, 3231744, 3383296, 2361344, 3239936, 3352576, 2737152, 3245568, 3997184, 2936832, 3073024, 2755584, 2416128, 2672640, 3504640, 3746304, 1899520, 3937792, 3131392, 3452928, 2478080, 1461760, 3381248, 2549248, 2540032, 4678656, 1704960, 2210816, 2688000, 3441664, 2419200, 3215360, 2891776, 3086848, 3173888, 4088320, 3402240, 3665920, 2522112]
4217B522112O7072r5232J924608j172992p44960O25664J398272n10464p26528
4208C287552o4000O26176j043456R57440J1264p60832L59936L8400l36896l2256
4198C043328N71904q03840M12160N50400n50400L93216o39488K55488j26464o52288
4188B454016J729536k88256k43712M5056N90848n91360L02080q7552r2672N41184
4178D359168l89120j68448n10976O67648k43200J37216l90656J491968N66784
4169E520384p98208p20384J09056J605632j342976Q35072q39680J184768j119232
4160D434432k07360n2736N98528o28736P69024o89664J003008j186816L74272
4151D413952k1504k9696l4816j156096O68672M20864q97024M80768k40640L32288
$$ y = [2522112, 2589184, 2493952, 4418560, 3245568, 2500608, 3126272, 4524544, 4014080, 3287552, 3223552, 3849728, 2806272, 3763712, 3774976, 3014144, 3374080, 3412480, 3075584, 3043328, 3615232, 2811392, 3223552, 3773952, 3223552, 3616768, 2977280, 3232768, 3106304, 2454016, 4183552, 3895296, 3651584, 3696640, 4287488, 3696128, 3998208, 3910656, 3817984, 4359168, 3970048, 3801600, 3290624, 3958272, 3715072, 3852288, 3461632, 4953600, 5520384, 4722176, 4001792, 4110848, 5716480, 4373504, 5208576, 4368896, 5553664, 4434432, 4227072, 4174336, 4772864, 4144128, 4913152, 4223488, 5226496, 4039680, 4413952, 4392448, 4362752, 4327936, 3171840, 3840512, 4261376, 3364352, 3845120, 3604480, 3936768]
4141C936768J605120q24320j574400J457664o00064P13216r20064J438720k39616
4132D993024r30816J43872j50016J33120L26656J86880p80288M67968k35520M42368
4122D597248n46304O28736n13024M75648j010176M49024J6896Q35072j010688
4113C922432J55136n12512J141760L57888o35392j45920R66656j611776K53440
4104C891712R19552j56672M33152l51232J007104J77152p79264M12160N919232
4095A1472896m571136j087488R79968N34016p79776L76832m32128M17792J127936
4086H038912o36928J80736k07872N51424O54848J0240j108992K39104o92224Q96000
4076G925248K45248J41824J052672k232320K93888n94944J372672P88992j237504
$$ y = [3936768, 5541888, 4717568, 3143168, 4600832, 4000768, 4713984, 3793920, 5232640, 4993024, 4062208, 4206080, 4056064, 4189184, 4515840, 4702720, 3922432, 4390400, 4154880, 4597248, 4050944, 4679680, 4166656, 4642304, 3632128, 4081152, 4098048, 4933120, 3922432, 4077568, 3565056, 4706816, 5064704, 4429312, 4283392, 5250048, 3638272, 3891712, 4811264, 4654592, 5087744, 4736512, 5743616, 5920768, 5141504, 5553664, 11472896, 6901760, 5814272, 6794240, 7328256, 6548480, 6925312, 6493184, 6910976, 8038912, 7401984, 7582720, 7374848, 7926272, 8581120, 8591360, 7482368, 7721472, 7029248, 7925248, 8170496, 8312320, 9364992, 7132672, 7426560, 6831616, 8204288, 8993280, 7755776]
4067G755776R99936j366016K54464P77216P64928m26496Q15616M64896n70880
4058I469440J070592q21760R32352J121792p64416P73120j9968J93536N84192
4049A2538880K60608O38976J42848m64384Q1408R68704L99872K04288J422336
4040A6193536R91232J840640J40288j217024p49568m147200j801216j980416k280960
4031F989312Q91392k042368m76160n2736k50368L00032j272832J035264J018880
4022F140416j751552Q28416N56032j639424J052672j639936O15936M35200j65376
4013D432384o08768N81632K19648q3456O81984j64352o01600L86560j461760O14400
4003C996672N53472J22880l84512O64576J32608j016320J03424L36896N18656
$$ y = [7755776, 8755712, 7389696, 7644160, 8421376, 9186304, 8759808, 9575424, 10040320, 9469440, 10540032, 9718272, 10650624, 11772416, 11008000, 11781120, 11761152, 11954688, 12538880, 12799488, 13438464, 13581312, 13116928, 13198336, 14167040, 14566912, 14771200, 16193536, 17184768, 19025408, 19165696, 17948672, 17199104, 13051904, 11250688, 9270272, 6989312, 7880704, 5838336, 5362176, 5309440, 5059072, 5359104, 4086272, 5121536, 6140416, 4388864, 5217280, 5773312, 4133888, 5186560, 3546624, 4162560, 4597760, 4432384, 3823616, 4405248, 4624896, 4541440, 5223424, 5059072, 4457472, 4844032, 3382272, 3996672, 4550144, 4673024, 4288512, 4953088, 5085696, 4069376, 4172800, 4509696, 5028352]
3994E028352l71712K11968o80448N1712M69504k26304J46944K18624J101824n26336
3984E424128o48704P79776M61312p72096n02272O26176j354752R70240j484288
3975C499520J325568p35744j25440O67136n78560j030144R03168K88768K65216
3966D479488l12832J36704l6864o74816L34848N68320j2288L60960o48704r9840
3956D094976O69184j8944o89664p1168m7104r6768O08256K4576m64896N91360
3946D599808m81280K05312K06336k36544k05312p8848J207808j472512O74816
3937D419584K25792p13216N66784q38656L48160J383424q64256k47808o23104
3928C656704J086976j461760J72032J082368o66624Q63744o70720J24928N22752
$$ y = [5028352, 4656640, 4868608, 4188160, 4239872, 4709376, 4483072, 4630016, 4848640, 5950464, 5424128, 4775424, 5555200, 6016512, 5244416, 4742144, 5368320, 4013568, 4983808, 3499520, 4825088, 4089344, 3963904, 4631040, 4052480, 3022336, 3925504, 4214272, 4479488, 4166656, 4303360, 4266496, 3591680, 3926528, 4494848, 4482560, 4843520, 4194816, 4094976, 4764160, 4745216, 4055552, 3984384, 3937280, 3840512, 4448768, 4473344, 4008448, 4599808, 4118528, 4323840, 4530176, 4293632, 4088320, 4009472, 5217280, 3744768, 4419584, 4645376, 3932160, 4498944, 3660288, 4008448, 5391872, 4527616, 4279808, 3656704, 4743680, 3281920, 3453952, 4536320, 3869696, 4733440, 4062720, 4187648, 4710400]
3919D710400o83008r88672P2192J008640k89792m54656N63712O72768J29536j094656
3909C646464M28544O7584J300480j199616k56000o19520J302016j27488k38592
3900D303872K95424Q43776j490432N18656k04800K56000o36928L15392p62880
3891C438080R16480m88448R0112Q30464q92928n2736J55136j26464J89952j96608
3881C863040k03264L43040P5264l74784L64032p55200P22944J11616N41184k20672
3871D467200N80096l5328r34400K68288O03648o52800K68288J30560j658368K211328
3861E248512n60640j086976J668608k57024m96640n02784M608K87744Q90368q59136
3851D336640L83488o81984N32992p18848J025024m03968L18976l92704P2192J71520
$$ y = [4710400, 4027392, 3038720, 3110912, 4119552, 3829760, 3375104, 3938816, 4611584, 4741120, 3646464, 4075008, 4142592, 5443072, 4243456, 3987456, 3367936, 4669952, 4542464, 4303872, 4599296, 5443072, 3952640, 4471296, 4266496, 4522496, 3885568, 4200960, 3438080, 4354560, 3866112, 3956224, 4786688, 3893760, 3841024, 3996160, 3869696, 4059648, 3863040, 3659776, 4002816, 4078080, 3703296, 4067328, 3312128, 4035072, 4146688, 4687872, 4467200, 5047296, 5011968, 4077568, 4345856, 4949504, 4296704, 4564992, 4695552, 3037184, 5248512, 4687872, 3600896, 5269504, 5012480, 4515840, 4013056, 4017664, 4305408, 5195776, 4336640, 4720128, 4038144, 4571136, 3852288, 4877312, 4473344, 4792320, 4399616, 4471808, 4643328]
3841D643328j64864l53792R95840O0928q61184J056256j147904J5360O63040m24960
3831D482048O09792O39488J64864j49504j108992l96288q0896O41536l89632o01088
3821C811328R19552k7136O49216l10272n64736K93376m90496m15232K49856J060864
3811E176320n91360K278912k362880K27328M47488q23296M71040J01888R37472
3802E862912j184768L99360J85344q9600l34336Q31488j36192n80096N19168l40992
3792E132288Q20224l47648N45280J018880j920512P68512J184768j982976J332736
3783F551552j441792J098752r5232L52768P54688q69376o67648J747968k66240
3774G165440j188864O07232J59232L61472K19648O11328P7312l61984J079808
$$ y = [4643328, 4478464, 4124672, 5120512, 5181440, 4320256, 5376512, 4228608, 4243968, 4907008, 4482048, 5091840, 5731328, 5896192, 5746688, 4637696, 4241408, 4160512, 4802048, 4412416, 3811328, 4730880, 4703744, 5352960, 5042688, 4477952, 4771328, 4280832, 3865600, 4115456, 5176320, 4584960, 6863872, 4500992, 4728320, 5175808, 4352512, 4823552, 4925440, 5862912, 4678144, 5077504, 5262848, 5173248, 4838912, 5670400, 5534208, 4954112, 5473280, 5132288, 5952512, 5604864, 6150144, 7169024, 5248512, 6017024, 7201792, 5218816, 6551552, 5109760, 6208512, 6113280, 6466048, 7220736, 6351360, 5683712, 7431680, 7165440, 5976576, 6583808, 6743040, 7104512, 7324160, 7935488, 8012800, 7650816, 8730624]
3765H730624j060864L57376j76128L70688N60640J56672Q3968n33504J136128
3756I625600k97984K17088J272320o92224K18112j35168K33472J826304m48000
3747A1819520J361920M30080J972224Q79104M93568J270272O18496P27040L26144
3738A9898368P14752J876992p34208L22560J196032J872384o14400L50208J208832
3729B6091520l9424J678336R70240M93056m8128r18528k827264n477376k306048
3720A7616384l064832o62528o14912k478592j59744M54144q00256l61984l38432
3711I589248j058304J81760R92768j756160J098240P84384m42880l77344J57184
3702I168896J09056m6080N08416M01408N73440j358336K64192o67648K73920o2464
$$ y = [8730624, 7669760, 8027136, 7851008, 8221696, 8782336, 8939008, 9022976, 8489472, 9625600, 9327616, 9544704, 10817024, 10124800, 10342912, 10207744, 10441216, 12267520, 11819520, 13181440, 13611520, 15583744, 16462848, 16956416, 18226688, 18845184, 19572224, 19898368, 20613120, 22490112, 21755904, 22078464, 23274496, 25146880, 24532480, 24882688, 26091520, 26052096, 27730432, 28700672, 29193728, 29145600, 28227072, 25399808, 19922432, 17616384, 14551552, 13889024, 13274112, 10795520, 10635776, 11089920, 10289664, 9927680, 9589248, 8530944, 8712704, 9705472, 7949312, 9047552, 9831936, 9389056, 9011712, 9168896, 9277952, 9231872, 9740288, 10141696, 10715136, 9356800, 9620992, 8953344, 9227264, 9164800]
3692I164800L16416q20224L50208P25504n96480L17952n6832j61280k54464J92512
3682I178112k44224M70528M59264N16096l79904j740288J678848p37792L82976
3673I583616l45088J693184Q192J564672P68512J037824j01888m67968k777600
3664A0963456p75168j313280J026048j338368p72608Q76032j74592n88288J383936
3655I287168n18656p64928O64064l29728J342464n41696q8064O39488Q4480k33472
3645I541120m34688q26880n85216Q29952l58400R5744Q87296k57536Q88320M78208
3635A0257920k60096m89984j9968n06880k72384o2976M4544r40032j332224P39328
3625G157248L87072M12160r82528J247232n44256L45088j091072R96352m34688
$$ y = [9164800, 9481216, 8660992, 9011200, 9736704, 9140224, 9458176, 9401344, 9240064, 8985600, 9178112, 8933888, 9404416, 9863680, 10379776, 9999872, 8259584, 9938432, 9200640, 9583616, 9238528, 10931712, 10939904, 12504576, 13273088, 14310912, 14209024, 13741056, 10963456, 10188288, 8875008, 9901056, 8562688, 7790080, 8666112, 8491520, 7903232, 9287168, 8768512, 8003584, 8667648, 8337920, 9680384, 9138688, 9050624, 9690112, 9774592, 9541120, 9106432, 8279552, 7694336, 8524288, 8165888, 8261632, 9148928, 8891392, 9779712, 10257920, 9997824, 9507840, 9487872, 8980992, 8708608, 8645632, 8690176, 7750144, 6417920, 7157248, 7544320, 7956480, 6973952, 8221184, 7676928, 8022016, 6930944, 7927296, 7492608]
3616G492608J69472J435648j560064O53824M98688k30400o99904O38976p88480
3607G610368O69696O31296j408000N88288k9696O23616k19136K09920n86240j18784
3597G971328J29536q07936J745408m31104o57920J509376q27904l45600p65440
3588G519744P32672J389056j132544R39008k14528o66112P97696q21760J015808
3579I559040o00576n3760P7824O16448k94400o21056O71232n82656P65952n71392
3569H966656J93536O42048j397760L60448L54304j76640L24096q08960M33152
3560H890880J247744j209344L78368o89664N14560K60608P05536N09952k8160
3551A0580480j366528P84896l39968J440256p56736p67488J536O83520L63008
$$ y = [7492608, 7662080, 9097728, 7537664, 8191488, 8690176, 8459776, 7759872, 8398848, 7610368, 8280064, 8911360, 7503360, 8091648, 8061952, 8685568, 8466432, 8676352, 8090112, 7971328, 8100864, 7292928, 9038336, 8607232, 7949312, 9458688, 8630784, 8285184, 7519744, 8252416, 9641472, 8508928, 9447936, 9233408, 8567296, 9364992, 8543232, 9559040, 8958464, 8904704, 8982528, 9598976, 9304576, 8683520, 9354752, 8772096, 9538048, 8966656, 9160192, 9802240, 8404480, 8764928, 9119232, 8942592, 9266688, 8457728, 8890880, 10138624, 8929280, 9307648, 8617984, 9132544, 9393152, 10098688, 10608640, 10580480, 9213952, 9998848, 9658880, 11099136, 10342400, 9574912, 9576448, 10259968, 10622976]
3542A0622976M5568p87968J108480R05216p37280m86912O05184n92896R9840M25984
3532A1208192j583616J188864Q704q26880K125312l47136r04192J188864j66912
3523A1891200j2288k20672L78880m39296K92864J17248P21408k91328n66272R26720
3513A2798464N21216O1952k58048L54304l86048L69664O07744j346048J992704
3504A4715904q00256L63008l23072J37728L39456K60096Q82688K00192l25632
3495A5450112O67648M62848l60960K96960P50592o22592r28256Q35584r60512
3486A5591424J236480Q40192Q66304k01728O1952J01888J27488J649152o30272
3477A9642880Q19200J94560N44256P32672R39520O90688L5328m12160M95616J138176
$$ y = [10622976, 10668544, 9880576, 10989056, 11894272, 11156992, 10670080, 11275264, 10682368, 10782208, 11208192, 9624576, 10813440, 10822144, 9995264, 12120576, 11773440, 10869248, 12058112, 11891200, 11878912, 11658240, 12037120, 11597824, 11890688, 12007936, 12729344, 12438016, 11871744, 12798464, 13319680, 13381632, 13123584, 13477888, 13091840, 13461504, 14069248, 12723200, 14715904, 13915648, 14278656, 13955584, 14093312, 14432768, 14692864, 15575552, 15775744, 15450112, 16117760, 16580608, 16219648, 16516608, 17267200, 16644608, 15716352, 16551936, 15591424, 16827904, 17668096, 18534400, 18332672, 18394624, 18496512, 18624000, 20273152, 19642880, 20462080, 20656640, 21200896, 21933568, 22873088, 23563776, 23599104, 23186944, 23682560, 24820736]
3467B4820736K72384J225728M51072P68512O76352R9328J214464N63712J675776
3458C1768064J581568K61120J239552M35712J614848R728J966592K665984J168896
3449D2712064O82496J282560K025984K656256K418688J217536K365952M52096
3441E5813632M259328L246592K907648M203008N208064M482048N912576O559232
3433I2592128O858240O963200J1342336R631744J0570240J1059712J2749312J4275584
3425A76042496J5312384J6442368J7990144K3153152K5672704L3215488M0122368
3418C47951104N4473216P3780224J03260672J48314112K02818048K20049920J23974144
3411A274621440p4632704k29901824k52635648k01299456j45738240r8977280
$$ y = [24820736, 25093120, 26318848, 26769920, 27538432, 28214784, 28314112, 29528576, 30092288, 31768064, 33349632, 33610752, 34850304, 35286016, 36900864, 36910592, 38877184, 41543168, 42712064, 43394560, 44677120, 46703104, 49359360, 51778048, 52995584, 55361536, 55813632, 60072960, 63319552, 66227200, 70430208, 75638272, 80120320, 86032896, 92592128, 99450368, 106413568, 117755904, 127387648, 137957888, 149017600, 161766912, 176042496, 191354880, 207797248, 225787392, 248940544, 274613248, 307828736, 347951104, 402424320, 476204544, 579465216, 727779328, 930597376, 1150647296, 1274621440, 1199988736, 970086912, 717451264, 516151808, 370413568, 271436288]
3405B71436288o4766464m3891712l1320576k3005696j6248832j4121984r724928
3398F8356096q930816p324672o334464l989504m473856m089856l328000m011008
3390B5873920j446400j756672j868800j469440p51104q05376r89696j793536M76672
3381A5469568l06176j302528l18464q19712j463808K02240M12160n30432k91328
3372A1051520j515520m21888L29216j170432M8640j179648n09952j50528K057216
3363H538624p58784n31456j263616O52288l0720n68832M11136j346560J082368
3354F184448M21888j092096j86880j90976j54624K43712J74592m90496n54496
3345D355072J047552o06208p16800l76832O8096n41696R32352J48992K54976l8912
$$ y = [271436288, 206669824, 162778112, 131457536, 108451840, 92203008, 78081024, 68356096, 59425280, 52100608, 45766144, 41776640, 37302784, 33212928, 29884928, 25873920, 24427520, 22670848, 20802048, 19332608, 18581504, 17776128, 16786432, 14992896, 15469568, 15163392, 13860864, 13542400, 12722688, 11258880, 11461120, 11873280, 11342848, 11051520, 9536000, 9114112, 9443328, 8272896, 8321536, 7141888, 6631936, 6481408, 8538624, 7779840, 7248384, 5984768, 6637056, 6606336, 6037504, 6448640, 5102080, 6184448, 6606336, 5514240, 5327360, 5136384, 4981760, 5225472, 5400064, 4909568, 4355072, 5402624, 4796416, 4079616, 3702784, 3770880, 3229184, 4161536, 4310528, 4565504, 4526592]
3335D526592k72896K95936r24672m33664j82272m37760O42560R216Q7040A495040
3324C549184l29728n120P50080p82848k5600m78720J046016o69184m19840k42176
3314B392064J254400j639936J84320O83008L18464k57536K83648J13152M52608
3305C784192j460736J163264j300992J430016r63072k93888J89440k79040P54688
3296C023872L39968j584640M91008j36192L98336n72928N02272l0208J11616n96992
3286A946112K47808o79936m30592L78368J035776q79104L70176K15552k33984
3277A970176P680n27872J03936L66592N39648K61632A205760L35360Q14592j005568
3267A350144J380864p08608I01120J260032M41856m67968k4064n82144l10784
$$ y = [4526592, 4253696, 4549632, 3624960, 3191296, 3009024, 2571264, 3213824, 3223040, 3310080, 1495040, 3549184, 3219456, 3214336, 3964416, 3181568, 3155968, 2677248, 3723264, 3054080, 2634240, 2392064, 3646464, 2006528, 2190848, 2873856, 3192320, 2934784, 3218432, 3331584, 3784192, 2323456, 3486720, 2185728, 3615744, 2652672, 2358784, 2548224, 2269184, 3023872, 3363840, 1779200, 2270208, 2134016, 2532352, 1959424, 2461696, 2431488, 2543104, 1946112, 2193920, 1513984, 1083392, 1461760, 2497536, 1618432, 1988608, 2204160, 1970176, 1977856, 1449984, 1553920, 1920512, 2460160, 2721792, 1205760, 1541120, 2355712, 1350144, 2731008, 2022400, 901120, 2161152, 2603008, 2135040, 2110976, 1528832, 1218048]
3258A218048J104384M76672r15968G57248J010688k39616J020928j2288j21856
3249B415104n73440K35008k50880M7616k81600l07712P43424J98656o4000m93056
3239A669120L79392o1440L26656p60832J011200p55712m00384P25504l42528P56736
3229B547712Q1408j040896P80800l59936P36256J096704o16448J04960J288192
3220D618752Q87808J18784O66112p72096l1232l11296M8640j02400j977344J189888
3210D335616j473024j92000o26688L79392l31264K53952r8816j19808J07008M40320
3200B674688M10112j155072O1952J40800Q40704j445888j74080R728L59424M23936
3190B146304O47680r31840J118720o77888k31424O70208n24288Q36608R61536
$$ y = [1218048, 2322432, 2799104, 1883136, 757248, 1767936, 1528320, 2549248, 2536960, 2415104, 1841664, 2076672, 1825792, 1873408, 1591808, 1284096, 2027520, 2226176, 2162176, 1669120, 2048512, 1987072, 2313728, 1552896, 2564096, 1808384, 1408000, 2133504, 1790976, 2547712, 2629120, 1588224, 2369024, 2009088, 2745344, 3842048, 3225600, 3330560, 4618752, 5506560, 5625344, 6291456, 5519360, 5488128, 5176832, 5225472, 5123072, 3145728, 4335616, 2862592, 2670592, 2043904, 2423296, 2092032, 2345984, 2247168, 2127360, 2234368, 2674688, 3084800, 1929728, 1991680, 2132480, 2973184, 1527296, 1353216, 1362944, 1722368, 2146304, 2793984, 1862144, 2980864, 2302976, 2071552, 2741760, 2217472, 3054080, 4015616]
3181D015616q12032A524224J193472A242624K693632j144832m13184J050624Q6016
3172C514880L39968m50560P52128j234432J169408J141248n65248N53472K65728
3163E486592M45440J66400j700352J821696Q15616M25472l2768P94112n64736
3154G657472O93248o09792J473536p68512J675776l0208R47200l13856J090560
3145A1815424K99008p6800J076736o23104L43552N85728m1472m86912J203712
3136A4095872o7072J555968o53312j58720L71200j26976L4816q85760L34336L79904
3126A4880256N23776N67296L072m59264j859072K013696M2496N16096N12512m72576
3116A6268288L91680n4784M31104j51040K100736j196032R90208Q25344o87616
$$ y = [4015616, 3203584, 1524224, 2717696, 1242624, 3936256, 2791424, 2378240, 3428864, 3514880, 3854848, 3404288, 4156416, 2921984, 4091392, 5232640, 4667392, 5220864, 5486592, 5932032, 6098432, 4398080, 6219776, 7035392, 7460864, 7428096, 8222208, 7657472, 8350720, 7740928, 9214464, 8445952, 10121728, 10091520, 11038720, 10724864, 11815424, 12114432, 12037632, 13114368, 12491264, 12834816, 13420544, 13379072, 12892160, 14095872, 14028800, 15584768, 14931456, 14772736, 15143936, 15016960, 15051776, 14166016, 14500352, 14880256, 15404032, 15971328, 15974400, 15515136, 13656064, 15669760, 15712256, 16228352, 16740864, 16268288, 16659968, 16605184, 17036288, 16885248, 18985984, 17789952, 18780160, 19605504, 18917888]
3107A8917888Q53504j32096J237504N75488J08544P26016O29248L85024m25472
3098B2875648j281536m43392k255872j938432k840064k777600n30432j967104
3090H841216J46944p06048j834496l46624l54816K57024O17472p48544J17248
3081E989376J03936m85376J41312o13888P1168M53632j95584k048r7280l47648
3071E017600J177600j089024O11840k81600p57760L07712k83648K09920K18624
3062E131264n9904p77728R0624J410048l24608r84576o04160K059776j729024
3053D211712J326080N69344p76704o22080O73792M40320k011136N73952L39456
3044D724736k95936k41664N17120o24640K62656j90464j59232M75648j114624
$$ y = [18917888, 19771392, 19639296, 20876800, 21452288, 21560832, 22286848, 22916096, 23301120, 22875648, 21594112, 21150720, 18894848, 16956416, 14116352, 11338752, 10808320, 8841216, 8988160, 8282112, 6447616, 6100992, 5746176, 6003200, 6620672, 5872128, 5989376, 6093312, 5607936, 5749248, 5135360, 5206528, 5660160, 5464576, 5462528, 5365248, 5017600, 6195200, 5106176, 5718016, 5436416, 4678656, 4986368, 4702720, 4912640, 5131264, 5071360, 4293632, 4384256, 5794304, 5469696, 4485120, 3880960, 5940736, 4211712, 5537792, 6107136, 5330432, 4708352, 5382144, 5822464, 3811328, 4385280, 4724736, 4428800, 4187136, 4704256, 4079616, 4342272, 4151808, 3992576, 4468224, 3353600]
3035C353600K166272j320448k96960l81952j47968L77856L33312R27744J35680
3026E147136j422336P22432O16448j355776L65056o90688k93888J204224M98176
3017D790784o31808n07904L07200K78528Q59136l69152J167360n52448j256960
3008D084736K040832J97120j16736q27392J257472j41312Q57600l27168K37568
2999G262720p77216J719296j024512J042944P97696O85568J977856M451840O548992
2990B2685184j866752k286080K308608j462272m691456m275712l275264j228800
2982E907456o07232n55008m32640K56512n9904P4240j62304M95616r19040L95776
2972D393472l23584r49248Q73472M12160j205248L17440l88608P0656M60800j114112
$$ y = [3353600, 5519872, 4199424, 3902464, 3520512, 3372544, 3750400, 4083712, 5011456, 5147136, 3724800, 4447232, 5063680, 3707904, 4072960, 3382272, 3088384, 4292608, 4790784, 4158976, 3651072, 3958272, 4236800, 5095936, 4726784, 5894144, 5341696, 4084736, 6125568, 6322688, 6205952, 5378560, 6636032, 6494720, 7352320, 7025152, 7262720, 6485504, 8204800, 7180288, 8223232, 9020928, 9706496, 11684352, 16136192, 22685184, 20818432, 18532352, 20840960, 19378688, 14687232, 10411520, 7136256, 5907456, 5300224, 4745216, 4312576, 4569088, 4509184, 4583424, 4421120, 4916736, 3997696, 4393472, 4069888, 3120640, 3994112, 4406272, 3201024, 3518464, 3129856, 3200512, 3661312, 2547200]
2962B547200J917952j425920K88256K96960K52928m23424L072K14528J010688
2953D682240k19648j061888R34400M28544q75520k31424n8368J15712J70496k50368
2943C634176p81312P3216O87616L13344p77728J024k2016J102848j632256J211904
2933C810816q9088J94560m73600L52768p55712l0208K66752l5328J98656M37248
2923C876864j212928J521664o39488p75168J382400o0416q63744J163264j388032
2914C004416J119744j209856J28000R41568J97632j888256J336832J04448j67936
2905C566592o83520Q09984n77024M00896K04800J47968j337344J114624n22752
2896C124224L27168m80768O88640l63520Q66304M8640q63232O19008p16288L20512
$$ y = [2547200, 4465152, 3039232, 3327488, 3624448, 3877376, 3453952, 3457024, 3671552, 4682240, 4462592, 3400704, 4335104, 4763648, 3888128, 3656704, 3598336, 3714048, 3884544, 3634176, 2852864, 2926080, 3613696, 3927040, 3149312, 3150336, 3128320, 4231168, 2598912, 3810816, 3721728, 3916288, 3442688, 3795456, 3039744, 3009536, 3276288, 3240960, 3439616, 3876864, 2663936, 4185600, 3546112, 2770944, 4153344, 4092928, 3229184, 4392448, 3004416, 4124160, 2914304, 3042304, 3983872, 4181504, 2293248, 3630080, 3734528, 3566592, 2883072, 3693056, 3116032, 3516928, 3721728, 3869696, 2532352, 3646976, 3124224, 3451392, 2970624, 3659264, 3295744, 4162048, 4210688, 3347456, 3966464, 3250176, 3570688]
2886C570688N91872j60768k32448n8368j59744O55360q34048P13216j50528j231872
2876B703360J259008k27840J2288M22912k28352n9904m96128N79584J46432n97504
2866C513856N30944k8160o77376k80576J059840o55360K40640N23264m14720J22880
2856C935232q7040N4272L10784k16064R87136j284608K10944M80768Q85248L16928
2846E593600q71936j654272M37248p28576J485312n42720L04128j83808N39648
2837D378624J96608N74976j615872N85216L99360O65088j118208K00704R7280
2828D363776M25984P7312j333248J915904j061888J539072k54976m38784k36544
2819D996608J006592r83040L18976K91840j97120R30816L9424k73920j75104J069056
$$ y = [3570688, 4162560, 4001792, 3769344, 3710976, 3551232, 4206592, 3372544, 4085760, 3935232, 2703360, 3962368, 3734528, 3746816, 4169728, 3941376, 3881472, 3385344, 3964928, 4111360, 3513856, 4044800, 4016640, 3339264, 3058688, 4118528, 3463168, 3703808, 4227072, 3812352, 3935232, 3848192, 3902464, 4213248, 3997184, 4984320, 3699712, 3910656, 4391424, 5276672, 5593600, 4721664, 3067392, 3504640, 2776064, 4261376, 3718656, 4022784, 3838976, 4378624, 4575232, 5150208, 3534336, 4119552, 4518912, 5184000, 4065792, 4266496, 4363776, 4789760, 4867072, 3533824, 5449728, 4387840, 5926912, 5671936, 5233152, 4996608, 6003200, 5020160, 5339136, 5630976, 5433856, 6364672, 6404096, 6130176, 5955072, 7024128]
2809G024128O28736O23616K59072J729024O64064M40320o69184J426432M92032
2800A2618240N04832l27168j30560R35424L77856k15040J04448J085440k65728
2791A4687744J358336O74816Q9088K092032k68800K674176L74272r00096j490944
2782A9290624j511424k579456j924608l24608k431488n12J573888q04864L335168
2773A4622720M391424J1020288P236096j1551232r795584n267968k505728p95136
2765G354880r69216p65440r9840Q7040p76192K05312j202688L19488J78688n23776
2755C808256k85184j03424J031168m88960L01056k08384j010176J776128o32832
2746D187648j17760p83872Q26368Q1408q95488O35904k51904o06720O74304L0208
$$ y = [7024128, 7652864, 8276480, 8535552, 10264576, 10928640, 11368960, 10699776, 12126208, 12618240, 13123072, 12795904, 12665344, 13600768, 13978624, 13763584, 13868032, 14953472, 14687744, 16046080, 16720896, 16809984, 18902016, 18633216, 21307392, 21681664, 20781568, 19290624, 17779200, 15199744, 13275136, 12950528, 10519040, 10518528, 12092416, 11287552, 14622720, 19014144, 30034432, 37270528, 25719296, 15923712, 10655744, 8150016, 7354880, 6385664, 5620224, 5520384, 5607424, 4831232, 5036544, 3833856, 4153344, 4332032, 3808256, 3523072, 3419648, 4450816, 3961856, 4262912, 4054528, 3044352, 4820480, 4187648, 4069888, 3286016, 4112384, 4193792, 3298304, 3934208, 3682304, 3075584, 3749888, 3780096]
2736C780096j392640R29280M63360M20864o83520K400768k005504m08576O86592
2727D190720r25184k56512n76000J940992j172480Q63232q48896L78368p6800
2718C517440J155584k019840K064896K15552q10496p92576O2976O87104k48320
2709C832320O35392Q1920j301504J046016M59264j080320K961408j221632q01280
2700D611584P86944j00352O79936J41312m71552J51040N94944k02752J255424
2691G446528L53280J005056k62144P44448J369600J36704J816064L449856J0789888
2682B6849280J4746112L661824j2383232j0644992q558592n60640j669632J530368
2674A2970496J480192P306240R920512m666368p662592l703296k816512j028096
$$ y = [3780096, 2387456, 3316736, 3780096, 4200960, 3517440, 5918208, 3912704, 3504128, 4190720, 3265536, 3009024, 2433024, 4374016, 3201536, 4064768, 3215872, 3594240, 3517440, 4673024, 2653184, 4718080, 4933632, 4123136, 3330560, 3393536, 4080640, 3832320, 4467712, 4549632, 3248128, 4294144, 4753408, 3673088, 6634496, 5412864, 4611584, 5398528, 5298176, 5978112, 6119424, 5647872, 5798912, 6393856, 6191104, 7446528, 7799808, 8804864, 8542720, 9287168, 10656768, 10793472, 12609536, 16059392, 26849280, 41595392, 45257216, 32873984, 22228992, 13670400, 13109760, 11440128, 12970496, 14450688, 21756928, 31677440, 27011072, 19348480, 15645184, 12828672, 11800576]
2666A1800576J481728M308992P698432J6019456n108736j2359168q532992l907072
2658A1401216j119232Q42240K384384M567040R565184j780224j0329088n192704
2650A0338816k310144j664000K11456J475072J303552O153216k392064m402176
2642H713728l301376j301504o73280J40288K3552L38944j284608P77728K09408
2633C642880q87296L46112Q4992n68320L65568P9872N68832M15744J35680J444864
2623E628928l88608P25504N69856j487360n72928l13344M11648j105408k27328
2614C240960M19840K560N18144m88448k86208j50016m38272M88448j113088j035776
2604A158144P29088m87424O85568p77216J0240M68992o4512K80576O76864A230848
$$ y = [11800576, 13282304, 17591296, 25289728, 41309184, 36200448, 23841280, 15308288, 11401216, 10281984, 11124224, 13508608, 18075648, 27640832, 25860608, 15531520, 10338816, 8028672, 6364672, 6576128, 8051200, 9354752, 15507968, 13115904, 8713728, 5412352, 4110848, 3437568, 3577856, 3601408, 3940352, 2655744, 3433472, 3642880, 2755584, 3101696, 3186688, 2618368, 2983936, 3063808, 3632640, 4048384, 4184064, 5628928, 5240320, 5965824, 6535680, 5048320, 4475392, 4162048, 4573696, 3468288, 3240960, 3660800, 3663360, 4181504, 3693056, 3406848, 3256832, 2818560, 3307008, 2193920, 1158144, 1887232, 1399808, 2085376, 1308160, 1318400, 1787392, 1722880, 2003456, 2680320, 1230848]
2593A361408N02272L72736q03840l68128R57952m8640j09056o20544M02432P53664
2583B400256q27904M76160L30240l65056n99552j60256J310720q38144G40864
2573B267136m41856p62368M91008M71040m75136K01728N54496o36928n85216l584
2563A080320J201152q23808P49568r49248Q13056k52928L78880o07744M7104K40128
2553A876480m12160l91680O55872L6352J4848H25856J577984o86080l55840O80448
2543B042368p81824p680Q52992J36704A075712K93376O55360J72032R7792p56224
2533A538048k75968J16224O13376O72768q41216j70496R13920K44736j108480
2524A702912J213952o86080q12544L85536Q26368m31104n8880J175552r34912
$$ y = [1361408, 1863680, 2236416, 1432576, 1064448, 2022400, 1973760, 1864704, 1244160, 1646592, 2400256, 1572352, 2048512, 2378752, 2013696, 1414144, 1253888, 2564608, 1726464, 740864, 2267136, 1825280, 1062912, 1553920, 2024960, 1549824, 1751552, 2306048, 1669120, 1083904, 1080320, 2281472, 1457664, 2207232, 1257984, 2071040, 1818112, 2196992, 1589248, 1636352, 1876480, 1464320, 1072640, 1728512, 1764864, 1779712, 825856, 2403840, 1717760, 1361920, 2042368, 1260544, 1252864, 2105856, 2242560, 1075712, 1369088, 2024448, 2196480, 2294272, 1538048, 1262080, 1378304, 1991680, 2664448, 1823232, 1652736, 2566656, 2811392, 1702912, 2916864, 2230784, 1418240, 1803776, 2630144, 2199040, 2140160, 3315712, 2380800]
2515B380800o36416J433088l45088K45248j90976j59232A136128Q34048j50016
2506A820160N93920q94976k86720J130496l47648L95264l76320K66752j0240Q25856
2496C116544l24096n28384N10464k80064L46624J41312L77344k5600o7584n68320
2486B698240Q15616n51936q02304J348608o40512K57024J92512q30976Q88832
2477C375104l36896N76000N8368m52096k86208N55008j34656j090048O63040L85536
2467C313152n8368m35712j81248p30624Q71424K1504J30560m17280n94432N87776
2457B506752p22432K83136P75168M87936j108480n2224k06336L84000q56064L90144
2447A881600r0112P00416L64032p31648j86880P99232L44064L4816J13664n33504
$$ y = [2380800, 1744384, 3177472, 2832384, 3077632, 2886656, 2727424, 1136128, 1970176, 1820160, 2414080, 1519104, 1232384, 2362880, 2015232, 2410496, 2034176, 2300928, 2290688, 3116544, 2792448, 2264064, 2774528, 2494464, 2841088, 2982400, 3359744, 3334144, 3266560, 2698240, 3513856, 2961920, 2159616, 3508224, 2867712, 3124736, 3317248, 2486272, 3375104, 3038208, 3614208, 3672576, 3220480, 2934272, 3489280, 3354624, 2264576, 2927616, 3313152, 3254784, 2819072, 2637824, 1907200, 2778624, 2800128, 2930688, 2513408, 1918976, 2506752, 1784320, 2067456, 2842624, 3330560, 2222080, 2169856, 1963520, 2347520, 1491456, 1881600, 1791488, 2491904, 2855936, 2124288, 1937408, 2736640, 3080704, 3115520, 3229184, 2695680]
2437B695680k72384J88416k7136J762816j119744K32960j02400K70336m02944
2428C225600K00192j11616k38080l1744j092608J402368Q1920J105408j256448
2419C284992O90688p64928J16736l24096M76160l17440L7888R14432j76128j097728
2409B840576R89696R79456j476096Q39168l10784j47456J299456r89184J028608
2400E053440j23904p73120J084416m6080m00896p09120J179648q77568J80224
2391D567040j071616R42080r7792K64704r02144J091584j060864o8096J7920J737728
2381E420544j678336n85728Q83712K74944Q14592k28352j98656r10336Q2944O6048
2371C941376N35040M89472m92544j73568q95488J028608K37056O79424q70912
$$ y = [2695680, 2423296, 2611712, 2584576, 4347392, 3227648, 3460608, 3358208, 3628544, 3225600, 3425792, 3314176, 3076096, 3044352, 1951744, 3354112, 3436032, 4541440, 3284992, 3975680, 3210752, 3327488, 3003392, 3479552, 3162112, 3200000, 4114432, 3938304, 2840576, 3830272, 4809728, 3333632, 4172800, 3862016, 3714560, 5014016, 4024832, 5053440, 4929536, 4156416, 5240832, 5194752, 4793856, 4084736, 5264384, 4386816, 4567040, 3495424, 4437504, 4339712, 4604416, 3702272, 4793856, 3732992, 3664896, 3682816, 5420544, 3742208, 3156480, 4040192, 4315136, 5129728, 4901376, 4702720, 3792384, 3875328, 3941376, 4476416, 4965888, 4473344, 4299776, 3404288, 4432896, 4669952, 5349376, 4478464]
2362D478464M54144p09632R6768Q44800k033664J076736q77056J73568P94112
2353D298240q73984K36032M79744J6384j01888k1504M52608q44800P43936j349120
2343C035648P09120N87776l4816j133056J148928J58720l86560N19680k52928
2334D352512r45152J457152j469440R72288m11648K41664k45248k88768R22624
2325D585984L52256n68320n03808K04288M31616p64416Q42240j07008L14880r10848
2315C876864N70368K25792j70496q74496O6560P31136l15392k42176R1648K58048
2305D217856M37248L54816j428480J227264J54112l44576q29952K71872M65408
2296D525568j1264N03296o55872K16064L43040K16064L24096j472000J224192
$$ y = [4478464, 4932608, 4222976, 4319744, 5164544, 3130880, 4207616, 3330560, 3504128, 4298240, 3424256, 3660288, 4140032, 4156416, 4054528, 4033024, 4485632, 3640832, 4384768, 3035648, 3744768, 4332544, 4297728, 3164672, 4313600, 4472320, 4085760, 4605440, 4352512, 3407360, 4864512, 3395072, 4367360, 3955712, 4197376, 3952128, 3663360, 4585984, 4938240, 4369920, 3866112, 4070400, 4502016, 3737600, 4579840, 4472832, 4787712, 3876864, 4447232, 4673024, 4502528, 3628032, 3694592, 4425728, 4110336, 3868160, 3959808, 4217856, 4655104, 5009920, 3581440, 4808704, 4962816, 4618240, 3788288, 4060160, 4525568, 4514304, 5017600, 4361728, 4577792, 4920832, 5136896, 5460992, 3988992, 5213184]
2287E213184n71904R1136n15072Q72448o00064n22240q48896R87136L3792m54144
2277C685376M22400j81760J89952j333248Q77056N66272j425408M62336M46976
2268C709952K37568n19680J179136q07424m20864M85888L69152k30912r55392
2259C047424K97472K67264l27168N78048K25792p60832o41536P56224N32992l46624
2249C629056J84832m42368P03488q99072l43552N90336O92224o37440k07872J362944
2239D632576l82464R44640q91904j238016J831424j355776P57248M42368J68448
2230D908544K13504n66272m62848K24768P9360Q21248J30560o91200p1680M32640
2220E018624J56672N5808J74080N63712j62816p0144M21888r72288j3312J045504
$$ y = [5213184, 4641280, 4732416, 4217344, 5089792, 4489728, 3967488, 3118592, 4105728, 4139520, 3685376, 4107776, 3926016, 4115968, 2782720, 3659776, 4226048, 2800640, 3262976, 3709952, 3947520, 3427840, 4606976, 3799552, 3378688, 3864576, 4233728, 4002816, 3047424, 3344896, 3612160, 3284992, 3863040, 4088832, 3328000, 2686464, 3442688, 3975680, 3629056, 3813888, 3371520, 4075008, 3175936, 2832384, 3422720, 4114944, 3477504, 3269632, 4632576, 4250112, 5194752, 4302848, 3064832, 4896256, 3540480, 4297728, 4740096, 4908544, 5122048, 4555776, 4092928, 4317696, 4397056, 5218304, 5348864, 4657664, 4585984, 5018624, 5175296, 5231104, 5405184, 5968896, 5806080, 5735936, 6157824, 5185536, 5172224, 6217728]
2210F217728n53984m02944P58272J108992j843200J849344n10976K4064J01888
2201F749184p17312N47328j16736j77664o23616N80096K57024m8128J69472j535488
2191E084160K110976r72800Q192J34656n42208M14208Q42752n11488R33376k32960
2181G268864p00928J609216l76832q17152m04480Q78080j078784J018880n90336
2172F806528m30080J03936j81760j91488J07008Q66304j289728J213440j113088
2163E891072J003008o10304o16960J625088j201152L09248q26880j72032n67808
2154D833280J837056l60960l49696J187840j99680l06688n62688O54336p82336
2145E950464N74464O66112j178624K60608j256960J161216j82272o64064J178112
$$ y = [6217728, 5663744, 5260800, 6019072, 7128064, 5284864, 7134208, 6623232, 6647296, 6749184, 6031872, 6579200, 6462464, 6284800, 5661184, 6241280, 6498304, 6450176, 6619648, 5084160, 7195136, 6222336, 6230528, 6365184, 5822976, 6237184, 7079936, 6568448, 7501824, 7268864, 6567936, 8177152, 7800320, 6983168, 6578688, 7456768, 6377984, 7396864, 6806528, 6376448, 6480384, 6298624, 6107136, 6214144, 7080448, 5790720, 7004160, 5891072, 6894080, 6283776, 5666816, 7291904, 6090752, 6400000, 5573120, 5401088, 4833280, 6670336, 6309376, 5959680, 7147520, 6947840, 6641152, 6078464, 6732800, 5950464, 6524928, 7191040, 6012416, 6273024, 5016064, 6177280, 5995008, 5330944, 6509056]
2136F509056j426432N67808q02816O38976K00192j43360n79072m6592r2672K47296
2126E072384n84192K82624N13024O52288k24768L2768j81760j95584j90464n81120
2116D595200Q28416p77216J449472L40992k72896r89696P5776m69504J388032
2107F168576K3040j008128M04992O31296O61504k202624J924608r32864J62816
2098E833216k14016j33632J078784M14720k76480q56064L67104M79232k46272
2089F446592P96672q06400J149440p76704l46624Q45312n2224J33632J74080R3184
2079G656960J042944k091008J741824q96512P70560M5056n92384P35232Q65792
2070I278464p15264O77376N02784p7312p73120Q59136l47136J73056O6560M5568
$$ y = [6509056, 5082624, 5650432, 4847616, 5486592, 5686784, 5543424, 4964352, 4917760, 4825088, 5072384, 4488192, 4770816, 5283840, 5936128, 5711360, 5744128, 5562368, 5366784, 5176320, 4595200, 5423616, 4646400, 6095872, 6436864, 6163968, 5174272, 5250048, 4780544, 6168576, 6191616, 5183488, 5588480, 6219776, 6881280, 4678656, 6603264, 5670400, 5833216, 5619200, 5485568, 6564352, 6979072, 6702592, 5846528, 6213632, 6692864, 6446592, 7243264, 6436864, 7586304, 6809600, 6462976, 7308288, 7256064, 7389696, 7563776, 7656960, 8699904, 6608896, 8350720, 7454208, 8224768, 8269824, 7677440, 8412672, 9278464, 8563200, 9240576, 9743360, 9666048, 8892928, 9752064, 9404928, 9577984, 9644544, 9690112]
2060I690112l60448Q65280j295872j50016K87232K56000q61184J748992j171968
2051I008128P36256q16128M79744R5744J28512m38272K26816J79712O62016n19680
2041I742848j585152J046528o1440n0688L23584R15968j67936o90176J256448
2032A0729984r77408j53600J03424K63680J17760o22080J54112M15744j50016
2023I881600J24928n84704O80448p00928k67776J603584j08544r13920N39136
2014A0253824L76832l48672J329664J374720M069888O679552Q125952p639040
2006B4222720p335936m758016k351616j13152j184256R6256l2768m04992j364480
1997F773760Q64256L96288J56672l25632n81120j7408P73120r37984j0240J217536
$$ y = [9690112, 9329664, 10194944, 8899072, 8749056, 9036288, 9292288, 8431104, 10180096, 9008128, 9744384, 8928256, 9408000, 9503744, 9632256, 9193984, 9420800, 9600512, 10262528, 9742848, 8157696, 9204224, 9142784, 9092096, 9415680, 10331648, 10163712, 9473536, 10729984, 9752576, 9598976, 9702400, 9966080, 10083840, 9461760, 9615872, 10031616, 9881600, 10006528, 9421824, 10102272, 9401344, 9133568, 10737152, 10628608, 9714688, 10253824, 10630656, 10281984, 11611648, 12986368, 17056256, 23735808, 31861760, 24222720, 16886784, 12128768, 9777152, 9664000, 8479744, 8576000, 8543232, 8138240, 6773760, 7638016, 8034304, 8190976, 7865344, 7284224, 7266816, 8039936, 7101952, 7091712, 8309248]
1987H309248k69824p68512M09088O30784m98688o72256j4336q73472J179648L39968
1977G771648o0928n83680M52096p16800K15552o40000N17632p83360k23744M59264
1967F407680j092096n93408N54496M78208J1264n27872L63008j078272J202176
1958E725184m22400j534464R61536l27680O38464p6800l47648P09632J90464m68480
1948E047808p45984J233408l66592K91328m60288j17248J639424p60832j450496
1939D310528J075712k36032m1472m91008L91680l55840m80256J537024k53440
1930E456896K14016k48320n47840J029632o68672j13152N10464l20512J93536
1921E506048M4032n95968M67456L98848j09568m09088M71552M5056k90304l6864
$$ y = [8309248, 8039424, 7270912, 7680000, 8310784, 7812096, 7139840, 7125504, 6252032, 7431680, 7771648, 7710720, 7127040, 7579136, 6862336, 7077888, 6437888, 6955520, 6172160, 5948416, 6407680, 5315584, 4722176, 5276672, 5754880, 5766144, 5238272, 5601280, 4523008, 5725184, 5302784, 3768320, 4729856, 4402176, 5040640, 4963840, 4616192, 5325824, 5516288, 5047808, 4301824, 5535232, 5168640, 5459968, 4999680, 4882432, 6521856, 5761024, 4310528, 5386240, 5150208, 5108736, 4617728, 5009408, 4653568, 4173312, 5710336, 5456896, 5670912, 5422592, 4874752, 5904384, 5235712, 5122560, 5633024, 5312512, 5506048, 5550080, 4954112, 5421568, 5820416, 5710848, 5301760, 5773312, 5818368, 5528064, 5491200]
1911E491200P48544k71872j419776J203712n52448m80256J238528K65216m30080
1902E792768L29728j320448J815552J76640L68640j350656N38624J054208q92928
1893F512128q59136N34016J374208p47520M34688j55136k19648r4720P44960O51264
1883H175104j351168Q89856p51104J178624J71520j54624j29024J019904o30784
1874H418304j12128k25792J520128m22912m19328K11968l96800O44096M6592k2528
1864I241600Q72448p29088N68320n45280O6560Q66816j54624N58080m01920M03456
1854A0746368J52064k09920J159168j135616N0688P61344l68128k54976j61792
1845A0739200L22560M66944k93376j98656Q69376j580032o69184J82272j42848
$$ y = [5491200, 6239744, 5967872, 4548096, 5751808, 5199360, 4719104, 5957632, 6222848, 5792768, 6122496, 4802048, 6617600, 6794240, 7162880, 5812224, 6350848, 7405056, 6512128, 5652992, 6187008, 7561216, 6813696, 7248384, 7093248, 6873600, 6778880, 7523840, 8175104, 6823936, 7713792, 6962688, 8141312, 8312832, 8158208, 8029184, 9049088, 8418304, 8306176, 8080384, 9600512, 9177600, 8758272, 8970240, 8573440, 9217536, 9264128, 9241600, 10114048, 9384960, 9953280, 9408000, 9474560, 10341376, 10186752, 10744832, 10342912, 10746368, 10898432, 10688512, 11847680, 10712064, 10762752, 11524096, 11155968, 10900992, 10739200, 11061760, 11528704, 11235328, 11036672, 11906048, 10326016, 9656832, 9839104, 9696256]
1836I696256P79264L5328m76672J4848M8640P26016j183744O69696N26848q91904
1826I944576Q85760p20896l87584P8848L13856N08928n17120j220096M12672O24640
1816I923584j24416L51232j431552J46432n1200M75136o144k91840M39808Q4480
1806I515520q15616j04960j90464K83136J63328j109504J132544j573888J50016
1797G450112J178112q16128j2288L3280m53120J44384K94912o69696N69344R43616
1787H662528j117184m6592K62656n07392N52960K44736j297408p44960R41568
1778F950912N61152l13856j404416J284608r07776O30272l33312J25952P7312
1769F670848K70336p09632j036288J910272p76192J95584P36768r46176N24800
$$ y = [9696256, 10475520, 10510848, 10034176, 10049024, 10097664, 10823680, 9639936, 10309632, 10836480, 9944576, 10830336, 10109440, 9721856, 9800704, 10114560, 10623488, 10106368, 8886272, 9298944, 9923584, 9799168, 10150400, 8718848, 8865280, 8814080, 9289216, 9283072, 8991232, 9431040, 9515520, 8699904, 8594944, 8404480, 8687616, 8850944, 7741440, 8873984, 7300096, 7450112, 8628224, 7812096, 7799808, 7833088, 7379968, 7524352, 7819264, 7149568, 7718912, 8662528, 7545344, 7498752, 7761408, 7254016, 7806976, 8051712, 6754304, 6009344, 6950912, 7512064, 7198208, 5793792, 7078400, 6170624, 6800896, 6467584, 6593536, 6670848, 6941184, 6231552, 5195264, 7105536, 6329344, 6524928, 7261696, 6315520, 6840320]
1760F840320n99040J500672r79456M08064M14720M84352m56192q82176M5056j37728
1750F638592P31648Q76032o77888M15744k32448Q0384p10144K403328m7104m27520
1740I050624p80288J232384K3552l04128J961984j537536n19168R68192m94592
1731I601024J18784P70048l3792P49056k51904n12P61344J0752R4720J42848k7648
1720A1934720P22432R65632R43104j309184Q5504J457664k31424l40480J000960
1711A5228928O44096l30752o3488J819648J12128J030144M5056N66784Q43264
1702A9895808K68800J639936J256448J236992j49504J671168K395136R44128O06720
1693B9765632R14432J628672M82304Q59648K86720Q40192J074688Q93952L03616
$$ y = [6840320, 6241280, 7741952, 6762496, 7170560, 7585280, 8069632, 7613440, 6731264, 6776320, 6638592, 7370240, 8246272, 7568384, 7984128, 7751680, 7832064, 7121920, 9525248, 9478144, 9050624, 8270336, 9502720, 9526272, 9222144, 11184128, 9646592, 9127424, 10095616, 9601024, 9719808, 10489856, 10456064, 11205120, 10953216, 10952704, 11714048, 11724800, 11819520, 11962368, 11934720, 12657152, 13622784, 14565888, 13256704, 13342208, 14799872, 14568448, 14227968, 15228928, 15873024, 15542272, 15478784, 17298432, 17410560, 18440704, 18485760, 19052544, 19895808, 20164608, 21804544, 23060992, 24297984, 24148480, 25819648, 28214784, 29158912, 29765632, 30680064, 32308736, 32791040, 33650688, 33937408, 34777600, 35852288, 36746240, 37049856]
1684C7049856j29024J388544J464320L73760R69216J221120J388544K148352J456128
1675D7330816L248640K043392K302976K962432M127744L932160O574080M911104
1667G7433344Q132608O239744O390784L280384o81984m349952q434688q265728
1659G9744512q471552r233408r914880q888320p640576n176320m987392k634240
1651B2797824l256832j869824j632768j687552r97888n03296j347072J95584j253376
1642A0444800n51936o3488m84352j453056R45664k38592k47296j248768M16256
1633G519232r96352j96096Q11520M50560o62528l56352p69536m39808l7376N74464
1623E897728l20000L51232M63872k700800K188800m5056j360896K59072P72096
$$ y = [37049856, 36920832, 38309376, 39773696, 40147456, 41116672, 42337792, 43726336, 45874688, 47330816, 50579456, 52622848, 54925824, 57888256, 62016000, 65948160, 72522240, 77433344, 85565952, 91805696, 98196480, 101476864, 100794880, 96444928, 88010240, 79744512, 71272960, 62039552, 52124672, 43236352, 35595776, 30419456, 25432064, 22797824, 19540992, 17671168, 16038400, 14350848, 13352960, 12849664, 11502592, 11698176, 10444800, 9892864, 9829376, 9345024, 7891968, 8837632, 8599040, 8351744, 7102976, 7519232, 6522880, 6326784, 7138304, 7588864, 6926336, 6569984, 5800448, 5360640, 5323264, 5897728, 5577728, 5928960, 6392832, 3692032, 5880832, 5835776, 4474880, 4733952, 5506048]
1614E506048j126400m40832K33984J086464j604096k53440L1232N35552N46304
1605D514816r09824j2288R04704o40000N96480j321984J351680l85536j213952
1596B884096Q48896l87072l95776N07904o95808J243136j162240l22560L60448
1587B881024J71008j61792N85216r08800o58944M62848Q1408P26528j16224j02912
1577B959360P17312j751552O71232K20160l1744P10144q0896k048Q13056j993216
1567B231808m01408J153536Q3968L1744l13856q56576O01600K51904%J399808
1557D182528j309184O55872q192J10592r98912R32864N63712j613312Q75520N46304
1547C937792l4304k08896p87968L02080j74080L24096K82624j72032J16224M27520
$$ y = [5506048, 4379648, 3938816, 4172800, 5259264, 3655168, 3401728, 3432960, 3968512, 4514816, 3604992, 3592704, 4497408, 3857408, 4453888, 3131904, 4483584, 4098048, 2884096, 3732992, 3345920, 2950144, 3458048, 2762240, 4005376, 2843136, 2520576, 2881024, 3052032, 2890240, 3475456, 2566656, 1907712, 2370560, 2451968, 3178496, 3062272, 2959360, 3676672, 1925120, 2596352, 2816512, 2784768, 3494912, 3414016, 3411968, 4225024, 2231808, 1830400, 2983936, 3067904, 3099648, 2785792, 1929216, 2530816, 2782720, 2782720, 4182528, 2873344, 3529216, 3521024, 3631616, 2632704, 3565568, 4129280, 2515968, 3391488, 3937792, 3903488, 3694592, 2906624, 3208704, 3034624, 3358720, 3641344, 3469312, 3585536, 4013056]
1537D013056K82112n0688L00032n02784K85184P99232L072L69152N58080j61280
1527E895168j242112P56224N28384o60992J85856L77856R89184J41312L16416
1518G287296L3792j40288K04288J882624j67936J560064O29760J66912r47200
1509A0509312j307648m45952L03104l14880l24096l84000L0208q87296N92896
1500G771648l05152N56544q15104O82496j183744R64096k28864n66784M79744
1491G354880N68320j123840L00544K60608m33152K88768K59072j363456N74464
1482F686208J056256J160192j178624P04512K39616P58272J257984K45248j93536
1473A0736128q19200K627072o88640j091072p99232p42400l20512k022912K65216
$$ y = [4013056, 4295168, 4244480, 4544512, 4041728, 4326912, 5126144, 5129216, 5498368, 6056448, 5895168, 4653056, 5409280, 5937664, 5276672, 5462528, 5840384, 6829568, 6970880, 7287296, 7321088, 7180800, 7385088, 9267712, 9099776, 10659840, 11289600, 11456512, 10509312, 9201664, 8755712, 9058816, 8743936, 8419840, 8035840, 8066048, 7178752, 7771648, 7466496, 8023040, 7207936, 7890432, 6706688, 7670784, 7441920, 6875136, 7354880, 7923200, 6799360, 7099904, 7360512, 6927360, 7216128, 7475200, 6111744, 6686208, 7742464, 8902656, 7724032, 8428544, 8668160, 9426432, 10684416, 10929664, 10736128, 9916928, 12544000, 11855360, 10764288, 9965056, 9222656, 8902144, 6879232, 7144448]
1464G144448K27328j550336M15232r4208q15104r7280M82304J010688k032128
1455D690944P06048M24960o18496K31424Q92928k02752k78016o5536J387520M81792
1445G650816j81248R4208J26976l43552K5088n16608q90880k26816P53152l81952
1435F109184j064960r00608Q19200k87744M34688j238528p37280K8672K12992
1426C375616n73952l30240L29728K19648r54880R30304N62688k10432m5568o47168
1416B655744k02240O4512K22720l36384k86208P49568q70912Q23808j205248N78560
1406B193920O39488N72416j110016R07776o27712M81280o04160P40352j030656
1397B162688M7104l26144R14944K31424l46624M99712L30240p16800K86208Q3968
$$ y = [7144448, 7371776, 5821440, 6236672, 6142464, 5327360, 5230080, 5712384, 6723072, 4690944, 5396992, 5821952, 5203456, 5434880, 6327808, 6125056, 5847040, 5781504, 7169024, 7650816, 7469568, 7563776, 7690752, 7347200, 7372288, 6855680, 5964800, 5737984, 6491136, 6109184, 5044224, 4143616, 4962816, 4675072, 5109760, 3871232, 3133952, 3162624, 3375616, 2801664, 2471424, 2801152, 3020800, 2065920, 2996224, 3558912, 3348480, 3302912, 2655744, 2453504, 2518016, 2740736, 2404352, 2118144, 2867712, 1996800, 2820608, 1615360, 2193920, 2833408, 3405824, 2295808, 3203584, 2575872, 3057152, 2452992, 3193344, 2162688, 2209792, 1883648, 2798592, 3030016, 2683392, 3183104, 3513344, 2796544, 3082752, 3166720]
1387C166720K21184k50880J07520j097728M66432J646080j234432l50720R16480
1378C590656r14944L4816K38592J24928j036288Q63744k54464J239552N78560
1369D465152j766912k17600R58976k18624M79744K63168j134080N27872q6016
1360C271680J11104j048064K138624m08576R5744j435136J380864N71392j146368
1351C531264O50240k35520p07584j70496K88768k28352n95968L24608M66432l62496
1341B960896L74784j011200Q26368m59776I20064J283584p12192o64064l98848
1332D28544J454080o78912k97472B22208Q72448m40832N93408E10464J033728
1323A544192l42016j60768m5056j4336k41664P13728m4544B74944P46496k44736
$$ y = [3166720, 3387904, 3137024, 3244544, 2146816, 2613248, 4259328, 3024896, 2674176, 3590656, 2675712, 2710528, 2949120, 3074048, 2037760, 2901504, 2647040, 3886592, 4465152, 2698240, 2480640, 3439616, 3220992, 3700736, 3963904, 2829824, 3357696, 3271680, 3382784, 2334720, 4473344, 4064768, 4160512, 2725376, 4106240, 4677632, 3531264, 4181504, 3945984, 3238400, 3067904, 3356672, 3128320, 2532352, 2856960, 3323392, 2960896, 3335680, 2324480, 3150848, 2691072, 920064, 2203648, 1491456, 827392, 428544, 1882624, 1203712, 906240, 222208, 1094656, 653824, 1247232, 510464, 1544192, 1202176, 1041408, 996352, 982016, 740352, 1454080, 1409536, 274944, 1021440, 776704]
1313G76704J26976B90816L81440L62496k73920j32096r6768A48480g680A111040
1302H70400J21344J92512j83296B56512N28896j12128j23904O87616A88416O33856
1292H22272A93536P96160J079808H92928C94240J054720C61984o656a01376D77184
1281A061376f08256G43424Q15104d28032F13376O07232m68992m3520l20000K79040
1271F67136F2976P41376A15712J31072P2192K01728A63840J481216G43936J258496
1261B002432r13920c14368H40704j67424K56000A89952J74080P64416B33984O94272
1251I28256c76832I79968A92000J036800D34688K28864O22080B41664M54144Q4992
1241G80800A28000h21760I44640D11648K44224B43712R07776k87232a77152A010688
$$ y = [776704, 903680, 290816, 672256, 1034752, 760832, 628736, 531968, 148480, -7680, 1111040, 870400, 991744, 1184256, 1000960, 256512, 785408, 673280, 549376, 1236992, 188416, 822272, 193536, 989696, 2069504, 892928, 394240, 1448960, 361984, 355328, -101376, 477184, 1061376, -608256, 743424, 1558528, -428032, 613376, 1220608, 751616, 708096, 388096, 667136, 62976, 804352, 115712, 246784, 318976, 520704, 163840, 1645056, 743936, 2002432, 1088512, -314368, 840704, 673280, 929280, 189952, 364032, 1128448, 233984, 928256, -376832, 979968, 192000, 1228800, 434688, 663552, 1285632, 241664, 695808, 780800, 128000, -821760, 944640, 411648, 655872, 243712, 1151488, 864256, -177152, 1010688]
1230D22400j7920P96160m35712a96096E85728O03648B50368R44640B03776O10304
1220H14080R4208D01408q704J239552m06016E62688l0720Q1920b26816B25280
1209A787904F99904J53600N93920e00224A196032k76992j76128l52256O02112
1200I92768j34144L6352O39488k4576k82624k68800P59296p32672P64928p29088
1190A020928a5872F72768J48992O5536L32800k24256l55328A20832J111552k18112
1180A014272O32320A80736Q93440E17632J134592n55520K8672j73568D48512O6560
1170E15072N64736D96128B18624q6016Q67840D84864F1440J356288K91840m10112
1160A299456A55136Q22784O64064k87232P16800I34400k47296R51296A60256N10464
$$ y = [422400, 404480, 1200640, 764928, -196096, 585728, 1189376, 250368, 1195008, 203776, 814080, 908288, 401408, 392704, 1632256, 1226240, 562688, 531968, 613888, -226816, 225280, 1787904, 699904, 853504, 1447424, -500224, 1196032, 919040, 742912, 390656, 992768, 858624, 894976, 1534464, 1509888, 1227264, 958464, 1717760, 985088, 1750016, 1020928, -15872, 672768, 821760, 887296, 1220096, 995840, 640512, 120832, 1232384, 1014272, 1646592, 180736, 1074176, 517632, 1652224, 1096704, 1125376, 951808, 448512, 515072, 1079808, 496128, 218624, 132608, 1000448, 484864, 61440, 1417728, 1709568, 1299456, 155136, 977920, 1641984, 1354752, 2071552, 934400, 687104, 1638400, 160256, 670720]
1150F70720k31424R05216D98176O16448a64352G58272k62656L22048O81472E45280
1139A168896J08032k38592M3520D53120R50784F89152L43040j95072K10944D46976
1128G68512O2464j36704b48320A358848l13856O00064a07008I46176j48480R02656
1118A700352H11520B42688J250304A06496K37056J5360J297920A69472j3312P37280
1108H93440k70336J0240P78752o03648J90464l31264O31296q9088a14688E17120
1097G84896J34656m1472K58560l94752J188864q85248J179648I57440m07040O45632
1087A196032J024m57728J69472j94048J492992m95616L97312k68288Q704m92544
1077A357312j99168k70336P81824R10848A230848O74816H31488J391616D60288
$$ y = [670720, 439296, 1344512, 498176, 1114624, -164352, 758272, 495616, 817664, 1499136, 545280, 1168896, 1276928, 1038336, 1081856, 453120, 1403904, 689152, 1032192, 837120, 1048064, 446976, 768512, 830976, 694272, -248320, 1358848, 1044992, 1645056, -107008, 946176, 797696, 1700352, 811520, 242688, 1492992, 106496, 343552, 358912, 1656832, 169472, 156160, 893440, 623104, 633344, 1412096, 808448, 998912, 667648, 1298944, 1209856, -114688, 517120, 784896, 919552, 878080, 1136640, 741888, 1930752, 1045504, 2225152, 957440, 550400, 1196032, 1197056, 739328, 908800, 714752, 2207744, 1712128, 2109440, 1841152, 1849856, 1357312, 1158144, 887808, 1669632, 2580480, 1230848, 1905664, 831488, 2223104, 460288]
1067B964992C51232J955840n81632q6528Q53504m48512k83648J415680L17440
1058C493376k53952j55648N58592N7856k07872P69024k75456Q24320M54656o24640
1048D640256K579456J765376l39968k53440n76512k73920K35520J304064L22048
1039I402880j01376L99872J851392J694208P02976K790912J358336M711936R234944
1030C2046080K7821056O5195520l826176n1846656l3864192A7602560n726208
1023A1876352j169408m173824j978368K35520k25280j125888n64224m47488J280512
1014C707904p06048l56864j38240J664000J286144k111488j601536K8672J17760
1005A890304j98656E47328P39328J64352n3248n88288p3728k5088O35392r1136
$$ y = [2964992, 351232, 2307072, 1725440, 1638912, 2492416, 2043904, 1760256, 3175936, 3493376, 3239424, 3083776, 3642368, 3700224, 3492352, 4261376, 3985920, 4810240, 5264896, 4640256, 7219712, 8985088, 8645120, 8391680, 7815168, 7541248, 7776768, 9080832, 9402880, 9301504, 9701376, 11552768, 13246976, 13949952, 16740864, 18099200, 22811136, 32046080, 59867136, 125062656, 121236480, 69389824, 35525632, 17602560, 11876352, 10706944, 6533120, 4554752, 4790272, 4564992, 3439104, 2874880, 2427392, 3707904, 3001856, 2644992, 2506752, 4170752, 5456896, 3345408, 1743872, 1772544, 1890304, 1691648, 547328, 1286656, 1451008, 1397760, 809472, 735744, 710656, 1346048, 1254912]
995A254912N7856k01728l31776C55840J272832n63200A38240a74592A308672m07552
985I01120A14688J332736D72064A20832b08896C84000J6384J29536N13536J10080
975A153536j07520D7616R63072D46464N68832b048j9968C59936O30784c07712
964H34560K0992C30752J89952J34656B24768r2672E632R61024b51392l70176D00896
952C89120a87392a0752H44288l37408n1200O32832I3696K82112J22368K0480J22880
941F41536I1136c85024l15904K11456C25632K2016N08928a50528q9088C45600
930F48704k53440J4848I4208J035776j52576e89824A242112J29024D61824e58592
919b09408F22592A07520E2224c8400j47456C0720n12M62336D096O44608N65248
$$ y = [1254912, 1312768, 1111040, 779264, 355840, 1628672, 1065472, 138240, -174592, 1308672, 901120, 114688, 1447424, 472064, 120832, -208896, 384000, 400384, 529920, 1043456, 1153536, 1046016, 47616, 1010688, 446464, 1015296, -2048, -22016, 359936, 990720, -307712, 834560, 855552, 330752, 520704, 655360, 224768, 132096, 5632, 966656, -251392, -621568, 400896, 389120, -187392, -10752, 844288, 506880, 455680, 1088512, 93696, 375808, 498176, 518656, 641536, 91136, -385024, -700928, -489472, 325632, 347648, 856576, -150528, -239616, 345600, 648704, 395264, 410112, 94208, 1129984, 977408, -589824, 1242112, 1371136, 461824, -558592, -209408, 622592, 107520, 52224, -38400, -185856, 30720, 30208, 492544, 4096, 648704, 1213952]
908A213952c70688D51584J1776K35008k38592f87616I77920J005056e51936D83328
897G70560c99360F08768k61632e66272H86784B13504J25952J54112A39264K35520
887C74784b2016A381888F12352b6112A536N90336k38080L35360c92704E16096
876D16256M1472B07872J036800F1440i86112G22432e44768A4848Q46336D05504
865H85760R2672f02624J62304e0176A330688f15936G67488l31264a95584A56160
854D76672c32288B70848k048b34496O1952D62336p2192O9632f60480a0752D41344
842C37920k4576M45952b30400D91008e43744o42048B89792P70048B66240c6864
831I35936I5232N5808O40512l00032j65888G4240N46304k72896A31584c71712
$$ y = [1213952, -370688, 451584, 463360, 698368, 459776, -687616, 977920, 1982976, -551936, 483328, 770560, -399360, 608768, 347136, -566272, 886784, 213504, 339456, 493568, 139264, 374784, -22016, 1381888, 612352, -26112, 1536, 591872, 353792, 689152, -392704, 516096, 416256, 457728, 207872, 1244672, 61440, -986112, 722432, -544768, 14848, 861184, 405504, 885760, 978432, -602624, -440320, -50176, 1330688, -615936, 767488, 436224, -195584, 156160, 476672, -332288, 270848, 268800, -234496, -172544, 462336, 390144, 459776, -660480, -10752, 441344, 337920, 313344, 759296, -230400, 491008, -543744, -1185792, 289792, 1059840, 266240, -36864, 935936, 95232, 151040, 791552, 491520, 325632, 74240, 620544, 347648, 131584, -371712]
820G680Q59648h65280m26496D61824J04960J82272l14368i10336c72736A60768
809F38976A81760M34176d63872p4240C90656N60640a46432j106432B65216K7136
799B92352r0112A6384d03456H6016K560J57184j11616J15712a64864A574400e41696
787B95424h6528G00928g7312D21888b83648n14048C48160e7344G96672k70848
777E25824A74592i3184k96960F5024M58752P3728e87264E20192c8912F99904O55872
766A355776B95936A33120m1984J223168a98144A263104l96800p168f3488A1264
755A819136G28064C57888i87136H25344P1680D13696K22208K59584D44416N27872
745I72288A32096O09280B58560h35072A97632P76192C78880P55712j63840l99872
$$ y = [7680, 867328, -865280, -1291776, 461824, 566784, 749056, 434688, -910336, -372736, 160768, 638976, 181760, 615936, -463872, -538112, 390656, 951296, -146432, -1252864, 265216, 292352, 202240, 16384, -403456, 86016, 88576, 245760, 134144, 249856, -164864, 1574400, -541696, 295424, -86528, 700928, -77312, 421888, -283648, -797696, 348160, -57344, 796672, 525824, 174592, -93184, -390144, 65024, 523776, 597504, -587264, 520192, -38912, 699904, 1355776, 295936, 133120, 91136, 1314304, -198144, 1263104, 866304, 859136, -63488, 11264, 1819136, 728064, 357888, -987136, 825344, 897024, 413696, 635904, 895488, 444416, 972288, 132096, 741376, 258560, -835072, 197632, 973824, 378880, 1134592, 970752, 570880]
735E70880L25632J61280R3184D36224J499136q70912Q58624Q3968o14912n04320
725H87808N10976k25280B80576R67680P8336P5776J96096j35680k96448N42720
715A709056p44448L51744j55136k08384C7888N27360J31584M30080D59264J88416
705F47680C07200N17632j39776A51552a68448A126912D7104M58240K0992J87904
695G14240e74976C82976N68320r728A78688a70496k62144P8848k64704A9456b3040
683e03808m77696b50368D13696n2224A54112i5232n00736E21728a39264e632l03104
672c08736A53088N70880A34656a35680o07744b42176C42528d42368I56416A35168
661a65888C35360a14176D85376L20000g90528C22048G4752g64416j46432a37216
$$ y = [570880, 896512, 1057792, 1150976, 436224, 1935360, 1064448, 1923072, 2007040, 1392128, 887808, 1398784, 1173504, 280576, 1248256, 1326592, 1402368, 1598464, 1462784, 1166336, 1709056, 964608, 1316352, 1161216, 952832, 37888, 565248, 696832, 1126912, 459264, 647680, 307200, 824832, 685056, 151552, -168448, 1126912, 47104, 505344, 526336, 714240, -574976, 382976, 951296, 941568, 178688, -170496, -432640, -353792, -618496, 19456, -23040, -503808, -981504, -250368, 413696, 361472, 154112, -95232, -595968, 521728, -139264, -5632, -308736, 153088, 723968, 134656, -135680, -743424, -242176, 342528, -442368, 956416, 135168, -165888, 335360, -114176, 485376, 805376, -790528, 322048, 74752, -764416, -910848, -137216]
650g03488C23584J20832A97120a70496j29536G59808A88416f7072p41888c1232
639H79104g02464a45920l39968p11680b61120A020416C85536M27520m03456d51584
628b14528C81952A22880a92000m09088B27840r8816a20320H65792A19296d61312
617H02816n5296i7792L6864J3824a6384B36032B5088J04448o4000K24256J37216
606D27008Q4480A28512d48000B88256P20896m39808A00352P24480B1504J143808
596A165312B07360G5776N46304i2160B67264C8400O11328c27680A58720b84160
585C41504A2800J050112B67776M50560e83680a95584k57536a37728l7888E08928
574B01728J029632f42560F68672c2256A36704a53088p1168n77536G35232a9456
$$ y = [-703488, 323584, 444416, 197120, -170496, -300032, 759808, 188416, -67072, -808960, -31232, 879104, -702464, -145920, -485888, -1197568, -261120, 1020416, 385536, 813056, 409600, -451584, -214528, 381952, 122880, -192000, -601088, 227840, 129024, -120320, 865792, 119296, -461312, 802816, 747520, -97792, -60928, -47104, -16384, 236032, 25088, 129536, 65536, 289792, 427008, 511488, 128512, -448000, 288256, 1009152, 569344, 100352, 824832, 21504, 1165312, 207360, 75776, 622080, -92160, 267264, 38400, 649728, -327680, 158720, -284160, 341504, 12800, 1062912, 267776, 718336, -583680, -195584, -453120, -137728, -175616, 508928, 201728, 1231360, -642560, 668672, -32256, 136704, -153088, -224256, -801792, 735232, -19456]
563a35680G50080a157632A76640d28544A67424a41312r0624l56864K70848D37760
552C584e71904J54112j29536Q1920A114112A65376a395712C91680c78368I55392
541E78560j13152b08896q6016B07360Q97024j33632b84672C36896j09056g74656
530b83136B11456L65568h46848a51040A80224a45920G78752l76320d51584p4240
520e25824j41824K84672a74080k04800f7584a6896I60000C13856L58400A19808
509H192L01568i8304A81248G0144b25792l22560k25280o0928c94240C42528k4576
498C17952b11456M7616E36576a96096E32992d28032k8160e632j73568k00704k61632
487f41536C44064E4784a00352G94112D2496c81952l86048L06688a16224B69312
$$ y = [-135680, 750080, -1157632, 176640, -428544, 167424, -141312, -231936, -588800, -317952, 437760, 3584, -571904, -417792, -547328, -465408, 1114112, 165376, -1395712, 391680, -378368, 955392, 578560, 465408, -208896, -294912, 207360, 1104384, 970752, -284672, 336896, 227840, -774656, -283136, 211456, 577024, -846848, -151040, 180224, -145920, 778752, 402432, -451584, -525824, -667648, -382976, -174080, -378880, -67584, -16896, 960000, 313856, 672256, 119808, 8192, 309760, -98304, 181248, 70144, -225792, -548352, -773632, -834560, -394240, 342528, 317952, -211456, -163840, 536576, -196096, 532992, -428032, -456192, -5632, -179200, -379904, -641536, 344064, 54784, -100352, 794112, 42496, -381952, -768000, -461312, -116224, 269312]
476D43392K39104k41152N48352B96448a64352E74976c37920B14528L66080L70688
466I51296B95936r4720c39968i3184D68480f68672F7584K51392K35008A79712
455A66912Q19200D05504A94560c01056a11104D87936M2496B3040d6592G85920
444G57760e94944a20832D29056r1136r5232d22912C44576b3040F60480b11456
433F0416a01888C38944f1440I7280N06880e54496A109504j62304k52928B26304
422d64384E51936L25632J72032l75808b40128j74592F08768L40992m56704h704
411F70720a38240A014784k048B86208J094656l29728M00896k41664p7312J241088
401B374144p70048C90656N12J78688c13856A851904G84384Q11008d6080q4992
$$ y = [443392, 682496, 441344, 989696, 296448, -164352, 574976, -337920, 214528, 580608, 951296, 295936, 201216, -339968, -93184, 468480, -668672, 67584, 318976, 553984, 179712, 166912, 986112, 405504, 194560, -301056, -111104, 487936, 530432, 23040, -46592, 785920, 757760, -594944, -120832, 429056, 337920, 242688, -422912, 344576, -23040, 660480, -211456, 60416, -101888, 338944, -61440, 97280, 604160, -554496, 1109504, 947200, 694272, 226304, -464384, 551936, 877568, 1049600, 673792, -240128, -414720, 608768, 949760, 493056, -8704, 670720, -138240, 1014784, 1012736, 286208, 1380864, 1051136, 1452032, 1210368, 1133056, 2374144, 1604096, 390656, 391168, 569856, -313856, 1851904, 784384, 1595392, -46080, -131072]
391a31072F656h96512E77024C584M93056k29376K67264a57696A215488B83136
380D40320A01376K67776O4000c3792C38432K11456f04160G19872b8672m06528
370d35200G78240f90176F38976K61120B30912L04640A536J65888b80064B84672
359E88288B36544J45408a54624a9456A24928A0752i62560a89952D24960A33120
348I08800g80800e3760p6800A5360M09600g09120K4576b560l04128I728b79040
336F56384k99008N29408h70400b79040D24960d51072J024a80224B09920g16288
325D46464H0896L54816e44768A07520i99424a71008A434624l072D66944k24768
315B42176c03104a3312E21216b32448q68352M98176b60096m31616D63360K0480
$$ y = [-131072, 6656, -896512, 577024, 3584, 496640, 267264, 534528, -157696, 1215488, 283136, 440320, 101376, 369152, 433152, -33792, 338432, 549888, -604160, 719872, -28672, -435200, 778240, -690176, 638976, 900096, 230912, 535552, 1536, 167424, -280064, 284672, 588288, 236544, 381952, -154624, -19456, 124928, 10752, -962560, -189952, 424960, 133120, 908800, -780800, -53760, -130560, 15360, 424960, -709120, -684544, -2560, -306688, 9728, -279040, 656384, 357376, 886784, -870400, -279040, 424960, -451072, -450048, -180224, 209920, -716288, 446464, 80896, 435712, -544768, 107520, -999424, -171008, 1434624, 1431552, 466944, 242176, -303104, -13312, 521216, -232448, -1100800, -602624, -260096, -691712, 463360, 483840]
305D83840C8400a51040E15072b95936a24928k08896B69312r4720O72256e9392
294F00064J5360b81088P680K7136k19136A99680J178112a2800I36960a8944o82496
283g01440a31584G680L31264b20672P6288q85760g2704q2944A28000E0688g63392
271G19872a5360D79744q192a93024m83840H0896J40288P55200a536G35232B27840
259h192A171456e55520b21184D54144h59136H76032j80736G3216d96640A256960
248H18688P4752G2192a78688j13664A32608K93376M17280C80416A6384d42368
237D6080a28000D60288K26304B42176K03264c69152C93216e8368G77216k56000
227E21216a39264l77856m3008C14880P21920c70176B43200L55328k63168j65376
$$ y = [483840, 38400, -151040, 515072, -295936, -124928, -333824, 269312, 174592, 846848, -59392, 600064, 615424, -281088, -273408, -246272, -465408, 199680, 1377792, -12800, 936960, -18944, -701440, -131584, 7680, 338944, -220672, -144384, -1030144, -72704, -155648, 128000, 50688, -763392, 719872, -15360, 479744, 471552, -193024, -676864, 80896, 221184, 976384, -1536, 735232, 227840, -8192, 1171456, -555520, -221184, 454144, -859136, 876032, 695296, 73216, -496640, 1256960, 818688, 893440, 72192, -178688, -292352, 132608, 425984, 843264, 380416, 16384, -442368, 46080, -128000, 460288, 686592, 242176, 445440, -369152, 393216, -58368, 777216, 521216, -139264, -517120, -560128, 314880, 1036800, -370176, 243200, 598528, 335360, 169984]
217A69984J67424b77504N8368B44224K04288n7344A71008J2288f70720H38144
206i48736M34176C58912A27488i4720H75520a05472D69504E9904L05664f00064
195G83360d71040A425920A47968d41344E14560g168F68672B51392M80768a90976
184A573888a000960C72736j22880f07744D71040b48320p53152K11456B79040g82336
173a66912A702400H26880j61280e59104K18112f9632H18688E0688c46624F06720
162C65056A58720c31264A70496i65632A96608K61632g85408C44064Q01792B90816
151C94240a05472m5568c6864C97824P5264H9088J403904m38272m70528f02112
140a97120E71904L85024J34144d98176C54816h90368A89952a63328K0992A229824
$$ y = [169984, 337408, -277504, -219136, 244224, 448512, 391168, 171008, 183296, -670720, 838144, -948736, -514560, 358912, 127488, -94720, 875520, -105472, 469504, 59904, 365568, -600064, 783360, -471040, 1425920, 147968, -441344, 514560, -7168, 668672, 251392, 732160, -190976, 1573888, -1000960, 372736, 249856, -607744, 471040, -248320, -1001472, -790016, 279040, -782336, -166912, 1702400, 826880, 665600, -559104, -340992, -69632, 818688, 50688, -346624, 606720, 365056, 158720, -331264, 170496, -965632, 196608, 458240, -785408, 344064, 1145856, 290816, 394240, -105472, -151040, -36864, 397824, 473088, 89088, 1492992, 1054720, 584192, -602112, -197120, 571904, 956928, 1091072, -498176, 354816, -890368, 189952, -163328, -142336, 1229824]
129G98720k99520N34016l35872a46944C94752g9872E4272a076224N14560G22432
118G75680f1440r3184j042432a50528E22240E5296M75648A98144K10944J96096
108F05184F2464b79552D34176N41696k98496a64352j31584I09312e40160A675776
97C9936K13504J41824K69824A80224q0384c91680a57696H48384e05856D16256
86F17472d44928A48992j5872a46944A32096d50048A52576m3520J34144M04480
76F47680J33632E5808b89280F63552d13696A07520M83328g0144p07072C10784
65e82144D9152a20832C82976k4064a39776E66272k66752J9968E120K89280P33184
54A027584a74592l46112b26304n56032a38240D1472g6288C89632M94592g62368
$$ y = [798720, 499200, 1033216, 697344, -146944, 394752, -79872, 54272, -1076224, -561664, 722432, 775680, -61440, -154624, -1197056, -150528, 522240, 55296, 530944, 198144, 409088, 605184, 62464, -279552, 434176, 975872, 677376, -164352, -295936, 909312, -540160, 1675776, 39936, 253440, 395264, 665088, 180224, 99840, -391680, -157696, 848384, -505856, 416256, 617472, -444928, 148992, 133120, -146944, 132096, -450048, 152576, 109056, 243200, 647680, 781312, 55808, -289280, 663552, -413696, 107520, 590848, -70144, -777216, 310784, -582144, 49152, -120832, 382976, 358912, -139776, 566272, 299520, 319488, 5120, 294400, 1027584, -174592, -520704, -226304, -782336, -138240, 41472, -76288, 389632, 884224, -762368]
43D8640a89952N1200A99168L68640L03104f03136q7040A89952e16096j16736H63744
31g83872a86368p76704M36224A26464a3824A66912P80800i1136l40480m3008F78400
19e2224F13888A4336J542144F15936i45664A074176c35360B44224A07520b53440
8I3184h84736a69472j86368A86880H3968Q46336A38240e51424
$$ y = [48640, -189952, -138752, 199168, 567808, 870912, -603136, -690176, 189952, -516096, -632832, 863744, -783872, -186368, -963072, -526848, 126464, -13824, 166912, 947712, -91136, -431616, -474624, 678400, -52224, 613888, 14336, 1556480, 615936, -945664, 1074176, -335360, 244224, 107520, -253440, 93184, -884736, -169472, -355840, 186880, 83968, 930304, 138240, -551424]
##END=
