##TITLE=1321
##JCAMPDX= 6.0         $$ Bruker NMR JCAMP-DX V2.0
##DATA TYPE= NMR SPECTRUM
##DATA CLASS= XYDATA
##ORIGIN= NUTS EXPORT
##OWNER= Administrator
$$ 1.72 TOPSPIN		Version 2.1
$$ 2016-02-23 12:19:40.480 -0800  Administrator@X
$$ Compression mode = diff/dup
##.OBSERVE FREQUENCY= 90.275459
##.ACQUISITION MODE= SIMULTANEOUS (DQD)
##.ACQUISITION SCHEME= undefined
##.AVERAGES= 16
##.DIGITISER RES= 22
##SPECTROMETER/DATA SYSTEM= 
##.PULSE SEQUENCE= zg30
##.SOLVENT NAME= None
##.SHIFT REFERENCE= INTERNAL, None, 1, 10.37881
##AUDIT TRAIL= $$ (NUMBER, WHEN, WHO, WHERE, PROCESS, VERSION, WHAT)
$$ ##TITLE= Audit trail, TOPSPIN		Version 2.1
$$ ##JCAMPDX= 5.01
$$ ##ORIGIN= Bruker BioSpin GmbH
$$ ##OWNER= Administrator
$$ $$ E:/data/jwist/nmr/1321/1/pdata/1/auditp.txt
$$ ##AUDIT TRAIL=  $$ (NUMBER, WHEN, WHO, WHERE, PROCESS, VERSION, WHAT)
(   1,<2016-02-23 08:50:37.116 -0800>,<Administrator>,<X>,<jcamp>,<TOPSPIN 2.1>,
      <fromjdx created from
       E:\data\jwist\nmr\uniandes\1321
       data hash MD5: 8K
       DF 72 F1 6C C5 6F CE 36 87 BC 84 99 98 5B D2 8E>)
$$ ##END=
$$ 
$$ $$ hash MD5
$$ $$ 0D E7 A1 02 65 03 64 DD F1 8F 98 87 AF 5B E3 71
##$RELAX= 
$$ Bruker specific parameters
$$ --------------------------
##$DU= <E:>
##$EXPNO= 1
##$NAME= <1321>
##$PROCNO= 1
##$TYPE= <nmr>
##$USER= <jwist>
##$ACQT0= 0
##$AMP= (0..31)
100 100 100 100 100 100 100 100 100 100 100 100 100 100 100 100 100 100
100 100 100 100 100 100 100 100 100 100 100 100 100 100
##$ANAVPT= 1
##$AQSEQ= 0
##$AQ_mod= 3
##$AUNM= <au_zg>
##$AUTOPOS= <>
##$BF1= 90.275459
##$BF2= 400.02
##$BF3= 400.02
##$BF4= 400.02
##$BF5= 400.02
##$BF6= 400.02
##$BF7= 400.02
##$BF8= 400.02
##$BYTORDA= 0
##$CFDGTYP= 0
##$CFRGTYP= 0
##$CHEMSTR= <none>
##$CNST= (0..63)
1 1 145 1 1 1 1 1 1 1 1 1 1 1 1 1 1 1 1 1 1 1 1 1 1 1 1 1 1 1 1 1 1 1 1
1 1 1 1 1 1 1 1 1 1 1 1 1 1 1 1 1 1 1 1 1 1 1 1 1 1 1 1 1
##$CPDPRG= <>
##$CPDPRG1= <>
##$CPDPRG2= <>
##$CPDPRG3= <>
##$CPDPRG4= <mlev>
##$CPDPRG5= <mlev>
##$CPDPRG6= <mlev>
##$CPDPRG7= <mlev>
##$CPDPRG8= <mlev>
##$CPDPRGB= <>
##$CPDPRGT= <>
##$D= (0..63)
0 1 0 0 0 0 0 0 0 0 0 0 0 0 0 0 0 0 0 0 0 0 0 0 0 0 0 0 0 0 0 0 0 0 0 0
0 0 0 0 0 0 0 0 0 0 0 0 0 0 0 0 0 0 0 0 0 0 0 0 0 0 0 0
##$DATE= 0
##$DBL= (0..7)
120 120 120 120 120 120 120 120
##$DBP= (0..7)
150 150 150 150 150 150 150 150
##$DBP07= 0
##$DBPNAM0= <>
##$DBPNAM1= <>
##$DBPNAM2= <>
##$DBPNAM3= <>
##$DBPNAM4= <>
##$DBPNAM5= <>
##$DBPNAM6= <>
##$DBPNAM7= <>
##$DBPOAL= (0..7)
0.5 0.5 0.5 0.5 0.5 0.5 0.5 0.5
##$DBPOFFS= (0..7)
0 0 0 0 0 0 0 0
##$DE= 6.5
##$DECBNUC= <off>
##$DECIM= 2432
##$DECNUC= <off>
##$DECSTAT= 4
##$DIGMOD= 1
##$DIGTYP= 12
##$DL= (0..7)
0 120 120 120 120 120 120 120
##$DP= (0..7)
150 150 150 150 150 150 150 150
##$DP07= 0
##$DPNAME0= <>
##$DPNAME1= <>
##$DPNAME2= <>
##$DPNAME3= <>
##$DPNAME4= <>
##$DPNAME5= <>
##$DPNAME6= <>
##$DPNAME7= <>
##$DPOAL= (0..7)
0.5 0.5 0.5 0.5 0.5 0.5 0.5 0.5
##$DPOFFS= (0..7)
0 0 0 0 0 0 0 0
##$DQDMODE= 0
##$DR= 22
##$DS= 2
##$DSLIST= <SSSSSSSSSSSSSSS>
$$ [...]
##$SPOFFS= (0..31)
0 0 0 0 0 0 0 0 0 0 0 0 0 0 0 0 0 0 0 0 0 0 0 0 0 0 0 0 0 0 0 0
##$SUBNAM0= <"">
##$SUBNAM1= <"">
##$SUBNAM2= <"">
##$SUBNAM3= <"">
##$SUBNAM4= <"">
##$SUBNAM5= <"">
##$SUBNAM6= <"">
##$SUBNAM7= <"">
##$SUBNAM8= <"">
##$SUBNAM9= <"">
##$SW= 20.5580556627758
##$SWIBOX= (0..15)
0 0 3 4 0 0 0 0 0 0 0 0 0 0 0 0
##$SW_h= 8223.68421052631
##$SWfinal= 0
##$TD= 65536
##$TD0= 1
##$TE= 300
##$TE2= 300
##$TE3= 300
##$TEG= 300
##$TL= (0..7)
0 120 120 120 120 120 120 120
##$TP= (0..7)
150 150 150 150 150 150 150 150
##$TP07= 0
##$TPNAME0= <>
##$TPNAME1= <>
##$TPNAME2= <>
##$TPNAME3= <>
##$TPNAME4= <>
##$TPNAME5= <>
##$TPNAME6= <>
##$TPNAME7= <>
##$TPOAL= (0..7)
0.5 0.5 0.5 0.5 0.5 0.5 0.5 0.5
##$TPOFFS= (0..7)
0 0 0 0 0 0 0 0
##$TUNHIN= 0
##$TUNHOUT= 0
##$TUNXOUT= 0
##$USERA1= <user>
##$USERA2= <user>
##$USERA3= <user>
##$USERA4= <user>
##$USERA5= <user>
##$V9= 5
##$VALIST= <valist>
##$VCLIST= <CCCCCCCCCCCCCCC>
##$VD= 0
##$VDLIST= <DDDDDDDDDDDDDDD>
##$VPLIST= <PPPPPPPPPPPPPPP>
##$VTLIST= <TTTTTTTTTTTTTTT>
##$WBST= 1024
##$WBSW= 4
##$XGAIN= (0..3)
0 0 0 0
##$XL= 0
##$YL= 0
##$YMAX_a= 1618727168
##$YMIN_a= -2038218.24
##$ZGOPTNS= <>
##$ZL1= 120
##$ZL2= 120
##$ZL3= 120
##$ZL4= 120
##$ABSF1= 10
##$ABSF2= 0
##$ABSG= 5
##$ABSL= 3
##$ALPHA= 0
##$AQORDER= 0
##$ASSFAC= 0
##$ASSFACI= 0
##$ASSFACX= 0
##$ASSWID= 0
##$AUNMP= <proc_1d>
##$AXLEFT= 0
##$AXNAME= <>
##$AXNUC= <off>
##$AXRIGHT= 0
##$AXTYPE= 0
##$AXUNIT= <>
##$AZFE= 0.1
##$AZFW= 0.1
##$BCFW= 1
##$BC_mod= 2
##$BYTORDP= 0
##$COROFFS= 0
##$CY= 15
##$DATMOD= 1
##$DC= 2
##$DFILT= <>
##$DTYPP= 0
##$F1P= 0
##$F2P= 0
##$FCOR= 0.5
##$FTSIZE= 0
##$FT_mod= 4
##$GAMMA= 1
##$GB= 0
##$INTBC= 1
##$INTSCL= 1
##$ISEN= 128
##$LB= 0.3
##$LEV0= 0
##$LPBIN= 0
##$MAXI= 10000
##$MC2= 0
##$MEAN= 0
##$ME_mod= 0
##$MI= 0
##$NCOEF= 0
##$NC_proc= -9
##$NLEV= 6
##$NOISF1= 0
##$NOISF2= 0
##$NSP= 1
##$NTH_PI= 0
##$NZP= 0
##$OFFSET= 10.37881
##$PC= 1
##$PHC0= 0
##$PHC1= 0
##$PH_mod= 0
##$PKNL= yes
##$PPARMOD= 0
##$PPDIAG= 0
##$PPIPTYP= 0
##$PPMPNUM= 2147483647
##$PPRESOL= 1
##$PSCAL= 4
##$PSIGN= 0
##$PYNMP= <proc.py>
##$REVERSE= no
##$SF= 90.2745220575498
##$SI= 8192
##$SIGF1= 0
##$SIGF2= 0
##$SINO= 400
##$SIOLD= 32768
##$SPECTYP= <>
##$SREGLST= <1H.CDCl3>
##$SSB= 0
##$STSI= 0
##$STSR= 0
##$SW_p= 1497.18866228788
##$SYMM= 0
##$S_DEV= 0
##$TDeff= 0
##$TDoff= 0
##$TI= <>
##$TILT= no
##$TM1= 0
##$TM2= 0
##$TOPLEV= 0
##$USERP1= <user>
##$USERP2= <user>
##$USERP3= <user>
##$USERP4= <user>
##$USERP5= <user>
##$WDW= 1
##$XDIM= 8192
##$YMAX_p= 1618726912
##$YMIN_p= -2037760
##$CURPLOT= <PDFCreator>
##$CURPRIN= <$PDFCreator>
##$DFORMAT= <normdp>
##$LAYOUT= <+/1D_H.xwp>
##$LFORMAT= <normlp>
##$PFORMAT= <normpl>
##$SURQMSG= 1
$$ End of Bruker specific parameters
$$ ---------------------------------
##XUNITS= HZ
##YUNITS= ARBITRARY UNITS
##XFACTOR= 0.182762287876938
##YFACTOR= 1
##DELTAX= -0.182762287876938
##NPOINTS= 8192
##FIRSTX= 1497.0059
##FIRSTY= 241152
##LASTX= 0
##MAXY= 1618726912
##MINY= -2037760
##XYDATA= (X++(Y..Y))
8191B41152f15936G20896e20704a14176G00928a121792K79040a74592A459200
8181c76320G6288L9936O03648f01088C20512P2704f51264C01568J70496K2528
8171D94592a347584b08896n80608b07872j20320k89280k43200C80416j44384N85728
8161H21760l89120a164800D29056e06880l36896k98496d09600D8128d14208h3968
8150c33312I8304h26368F8608N03296L20000C84000M80256J4336c584C71200a94560
8138I35424A1776c90144B97984N2224b54464n72928J86880C72736d25472m65920
8128h91392f7072c2768n40160D5056a55136A93024R4720h33024G24992d20352
8117C31264b47296m31104J11104a41824f9120o65600c28192E83680g36256b80064
$$ y = [241152, -615936, 720896, -520704, -114176, 700928, -1121792, -842752, -174592, 1459200, -376320, 76288, 116224, 719872, -601088, 320512, 393216, -651264, 301568, 472064, 494592, -1347584, -208896, -789504, -207872, -328192, -617472, -860672, 380416, 236032, 821760, 432640, -1164800, 429056, -506880, -843776, -1142272, -409600, 48128, -414208, -83968, -333312, 98304, -826368, 68608, 571904, 891904, 384000, 864256, 878592, -3584, 371200, -194560, 935424, 11776, -390144, 297984, 350208, -254464, -827392, -640512, 372736, -425472, -891392, -67072, -32768, -572928, 45056, -155136, 193024, 287744, -833024, 724992, -420352, 331264, -247296, -678400, -567296, -141824, -69120, -734720, -328192, 583680, -736256, -280064]
8106B41664R728c65568J29024a03936B67776N3760h05888C41504A31072a18272
8095a189376M36224a8944E71392b24256P8848l1744m06016a15200n45792A267200
8084D84864O76864f1440k36544l13344C42016b31424m27008J29536F23104K74944
8074H98048a86880E76512a212928F4512A4336i54880B06848L66592f0928j313792
8064a374720b62656H6528Q03840d32128o06208f1440q7552P0144F17984B44224
8053H00768k36544d45952E57056K07360b5600k70336l75296a16736B84672c25120
8042d12672o27712c73248B2528O71232b41152p14752b2016E20192j58720g1168
8031f26176c00544F32832a070592K22208C94752a038336b75456q1408j9968l38432
$$ y = [241664, 251392, -365568, -236544, -103936, 267776, 321536, -805888, 341504, 131072, -118272, -1189376, -753152, -18944, 571392, -224256, -145408, -177152, -583168, -115200, -660992, 1267200, 484864, 1161728, -61440, -297984, -611328, 342016, -231424, -658432, -528896, 623104, 898048, -186880, 576512, -1212928, 64512, 14336, -954880, 206848, 573440, -60928, -1374720, -262656, 86528, 890368, -432128, -1038336, -61440, -148992, -78848, 617984, 244224, 800768, 564224, -445952, 557056, 764416, -25600, -295936, -671232, -116736, 284672, -325120, -412672, -1040384, -373248, 22528, 693760, -241152, -955904, -22016, 520192, 361472, -71168, -626176, -300544, 632832, -1070592, -848384, 394752, -1038336, -275456, -356864, -376832, -715264]
8021g15264c29728P4240H11520c9936A76128j8432a65888A17760i96352c42528
8010A03936D9152Q0896b00192d2496l32288j12128o656B50368d64896R1648B38592
7998a089536a1776D98176F5024P32160k64192h01792F19520A47456b87744a12640
7987e20704D78720i08288c29728A03936h00768N8880D91008f34880A75616i47712
7976G03488f14912o1440F59456l00544L90656b26816G72096d24448l99872E91360
7965B59072K38080f26176R1136Q6528g4240I19040m20864m3520j0240K40640f0928
7953a065472C11808K96960f55872a44384e8880k95424F66112a26464o656l67616
7943e00736o98368c01568h0384j00352m66432f1440F59456F0416b87232H30976
$$ y = [-715264, -329728, -255488, 811520, -39936, 176128, 157696, -165888, 117760, -996352, -342528, 103936, 49152, 130048, -200192, -42496, -374784, -486912, -493568, 250368, -464896, -373248, 238592, -1089536, -11776, 498176, 65024, 797184, 532992, -801792, 619520, 147456, -287744, -112640, -520704, 478720, -908288, -329728, 103936, -800768, -741888, 491008, -634880, 175616, -947712, 703488, -614912, -676352, 659456, 358912, 749568, -226816, 772096, -424448, -824320, 591360, 259072, 497152, -626176, -535040, -448512, -74240, 919040, 498176, 454656, 444416, 685056, -60928, -1065472, 311808, 608768, -655872, -144384, -58880, -354304, 666112, -126464, -133120, -500736, -1199104, -301568, -80384, -180736, -647168, -61440, 659456, 60416, -287232, 830976]
7932A70496a37216o87104e120I6256d51584J44896C76320L07712c94240H19200
7921e96992b5600l70688B82624L58400b41152n70880a33120D39296h41728d1472
7910a58720A3312O43072d68992D77696b18624A61280L44576a59744p1680e9392
7899d76672r79456A168384d76160D31104c39456H03328a299968b54464k04288
7890d58752C68640b05312l9424C67104j43872I9328Q9088J172992E69344j06496
7880D62848b57536n03808A20320b58560B3552e56032B72896f79424a26464M0960
7870h5504k9184a2288o28736E10464J128448i6768n6832C2768c26656J53600r99424
7859a172480A66400K21184L8912a99168l39456k88768a33120o74304A141760k63680
$$ y = [170496, -137216, -824320, -5120, 96256, -451584, -306688, 376320, 684032, -394240, 819200, -596992, -25600, -396288, 282624, 641024, -241152, -812032, -133120, 439296, -841728, -41472, -158720, 13312, 656384, -468992, 477696, -218624, 161280, 505856, -159744, -231424, -59392, -476672, -1456128, 1168384, -476160, 431104, -339456, 803328, -1299968, -254464, -458752, 368640, -205312, -244736, 367104, 223232, 99328, 188416, 1361408, 569344, 462848, -257536, -761344, 120320, -258560, 23552, -556032, 272896, -679424, -126464, -85504, -114688, -12288, -641024, 510464, 1638912, -96768, -153600, 32768, -326656, -173056, -1172480, 166400, 387584, 426496, -199168, -538624, -827392, -133120, -807424, 1141760, 878080]
7849H78080f51776c5840m33152E31456A00352J66912L08736f19008C98848K82624
7839F81472a76640j78688Q3968B63680K44736B44736M27520d52096A53600A7920
7828h7552l12832B15552a64352e1712k30400D86400i3696M5056m62848j14176
7818f25664B64192n1200O61504C24096J10080E4784a213440L65056a7408j59232
7808a76640I35936b560q78592K48832K16064B31936c85536M1472d6592A98656
7797d67968K1504k18624F90688g8848I0112g30624b17600C63520e34528C86560
7786A75616O656J11104N02272l8912f46656B50880c94752k88768A80736R88160
7776A168896D87424r2160b24256C68128C5328J47456a24928G42912k34496j13152
$$ y = [878080, -651776, -35840, -468992, 531456, 100352, 267264, 576000, -619008, 398848, 681472, -176640, -355328, -271360, 263680, 508416, 244736, 672256, -452096, 153600, 17920, -87552, -400384, 215552, -164352, -51712, -282112, 486400, -93696, -48640, -511488, -625664, 264192, 212992, 874496, 324096, 434176, 54784, -1213440, -848384, -17408, -176640, 935936, -2560, -881152, -632320, -416256, 231936, -385536, -344064, -46592, 198656, -467968, -446464, -665088, 690688, -78848, 90112, -730624, -217600, 363520, -534528, 386560, 175616, 182272, 293376, 795648, 756736, -646656, 250880, -394752, -683520, 180736, 1168896, 487424, 395264, -224256, 368128, 35328, 182784, -124928, 742912, 508416, 395264]
7766C95264h2432A38752N632R96352B97984K24256a0240l06688k97984B01216
7755c59936C80928c64544a41312D75648h0384E02784k04800b98496H11520H704
7744b71360A05472J015808j20832e44768a43872l84000a49504m52096B23232O19520
7734H42752h35072A52576N71904b50880O4512O8096a024A78176a79712E26336
7723C56352b25792j78688j84832B94912i08288b44224D45440a015296G11168j48480
7713E62688J16224j62304e24288C18976A22368Q18176C47136J383936A72032P35744
7703I07776J9968a025024C01568J96608a708032N45792H06912a168896K23232
7694i45664A17760K39104c0720j15712C7888d93568I8816h06400N8880j05472
$$ y = [395264, -82432, 138752, 144384, 1140736, 297984, 522240, -10240, -316928, -614912, 201216, -359936, 380928, -364544, -141312, 475648, -80384, 502784, 297984, -298496, 811520, 8704, -271360, 105472, 1121280, 1000448, -544768, -143872, -527872, -149504, -601600, 223232, 842752, -835072, 152576, 724480, -250880, -186368, -118272, -1024, 178176, -179712, 526336, 356352, -225792, -404480, -589312, 294912, -908288, -244224, 445440, -1015296, 711168, 562688, 678912, 516608, -524288, 318976, 122368, 940544, 347136, 1731072, 172032, 907776, 927744, -1025024, 301568, 498176, -1708032, -1162240, 806912, -1168896, -945664, 117760, 356864, -30720, -146432, 37888, -493568, 98816, -806400, -747520, -852992]
7684h52992G37792k94400g74656b10944B11456R08800l4304C98336d4032C28704
7673e28384a68448l63008k73408F72256D8128d1472E03808a79200j70496k12480
7663e62176H16640d32128J56160F73792f8096B31424e19168o0416b9696p43936
7653g73632K65216j040896g68512C44064h37632I10848c90656A48992f93248A067520
7642E1200c7888j25952B02240d64384O3488k4064D28032j89952a34144k99008
7632d33152C22560a12128C29216b15040i8816G44960Q20224B71872R57440F08768
7621A11104R22624a26464G34720K43200j68960B58048j20320Q01792R18016r01120
7611I56416M3008m33664M88960l09760Q25856D80768d86400A217536k49344C82464
$$ y = [-852992, 737792, 443392, -774656, -210944, 211456, 1120256, 1085952, 398336, -44032, 328704, -528384, -168448, -531456, -804864, 672256, 48128, -41472, 503808, -179200, -349696, -562176, 816640, -432128, -275968, 673792, -68096, 231424, -519168, -579584, -29696, -773632, -508416, -1549312, -768512, 344064, -837632, 910848, -390656, 148992, -693248, 1067520, 51200, -37888, -163840, 202240, -464384, -400896, -424960, 428032, 238080, -134144, -433152, 322560, -112128, 329216, -215040, -98816, 744960, 1565184, 271872, 1229312, 608768, 111104, 1033728, -126464, 734720, 977920, 808960, 258048, 137728, 939520, 1857536, 956416, 999424, 565760, 1054720, 744960, 1570816, 480768, -486400, 1217536, 968192, 382464]
7600H67328l56864c54816A31072c48160O2976o68672g7824A067520A38752n120
7590A33632K52928R97376i67680a88928j27488E84192i19040A132544g92576b81600
7579A77152J096704j26976d12160M7104m33152A28000B1504a99168M2496j86368
7569c43040C04640a65888F42048h77056C27680c46112a01376C15904i29792L52256
7559e77536l67616d7104E9392d12160l79904E79584A50016b560o74304c5840C3792
7547a066496G5264a09056p12192B43712d38272J98144r9840I06752a43360A17248
7536a000960a46432O7584p72096J69984m00896C89632N46304C50208G3728K86720
7526C60448b75456A383424E44768k6624d09088C14368i27744b99520E55008A23392
$$ y = [867328, 510464, -354816, 131072, -348160, -285184, -953856, -77824, 1067520, 138752, 133632, 386560, 1383936, -967680, -188928, -316416, 584192, -919040, 1132544, -792576, -281600, 177152, 1273856, 1146880, -412160, -365056, -798208, 128000, 21504, -199168, -156672, -343040, 304640, -165888, 642048, -877056, 327680, -346112, -101376, 315904, -929792, -577536, -945152, -47104, 59392, -412160, -792064, 579584, 150016, -2560, -676864, -35840, 33792, -1066496, 75264, -109056, -821248, 243712, -438272, -240128, -339968, 906752, -143360, 117248, -1000960, -146432, -78848, -850944, -680960, -1081856, 389632, 935936, 350208, 73728, 360448, -275456, 1383424, 544768, 518144, -409088, 314368, -927744, -299520, 555008, 123392]
7515h192F3488b93376H88832d70016C0208i57440D51072g36256b61120m24960
7505f86080b80064q61696L88608a16736p63392E70880J23904B8672K01216c7888
7494B59072J594880b01216E36064K94912l90656p8848D5056J122816E81632O89152
7484A270784c40480A049600N3760d99712D0448d4544j5872H08448a13664m92544
7474f06208j12640l71200C47648N96992m58752a28512B65216K95424m8640G0656
7463C51744L10784k57536K22720k66752N57568Q09984G13216A27488P82848B62144
7452I55392j35168N15072B25792K29888O85568Q14592C30240Q03840E12512P11168
7442A223680E09440R80480o16448j03936B81088N94432R216j43872B35008N8880
$$ y = [-8192, 63488, -293376, 888832, -470016, 30208, -957440, 451072, -736256, -261120, -686080, -280064, -1141760, -753152, -116736, -880128, 570880, 694784, 28672, 229888, -37888, 259072, 1853952, -201216, 536064, 830976, 440320, 361472, 45056, 1167872, 581632, 1270784, -340480, 1049600, 1103360, -499712, 40448, -44544, -60416, 808448, -113664, -606208, -718848, -1090048, 347648, 944640, 485888, -128512, 265216, 560640, 512000, 70656, 351744, 662528, 404992, 627712, 360960, 918528, 1728512, 713216, 127488, 910336, 262144, 955392, 820224, 1335296, 225792, 455680, 1141248, 1955840, 330240, 1134080, 512512, 1223680, 509440, 1489920, 873472, 769536, 281088, 875520, 884736, 740864, 235008, 293888]
7432B93888L6864M1984l6864O52800n4784h81664H47360f1952A016320D92544
7421F00064a56160H09984A84832b25792G41376c10784D93568j99680p9360b48832
7410B3040c33824J65888A36192c34848p12704B95936N53472b46272G14752A024
7399E89312b53440r9840B09920O45120c56864H62720C86048h3456A34656f40512
7388C46112K6112N74464i2160H02816p0656B87744K44224a14176m03456H0384
7377b54464n19680E02784c22560m74112a21344E2224c92704j57696m43392h0896
7366A24928M58240J20832c41504p53664F9120L6864R44640b59072E9904K93888
7356C53792Q01280b28352E19680M25984a47456k64192E2224b84672A76128O75328
$$ y = [293888, 330752, 372736, 335872, 988672, 933888, -881664, 847360, -61952, 1016320, 492544, 600064, -156160, 809984, 184832, -225792, 741376, -310784, 493568, 293888, 214528, -248832, 23040, -333824, -167936, 136192, -334848, -1047552, 295936, 849408, -246272, 714752, 1024, 589312, -253440, -353280, 209920, 855040, -356864, 862720, 386048, -83456, 134656, -640512, 346112, 372224, 946688, -92160, 802816, 732160, 287744, 531968, -114176, -517632, 80384, -254464, -774144, 502784, -322560, -796672, -121344, 52224, -392704, -550400, -993792, -80896, 124928, 583168, 704000, -341504, -1095168, 69120, 105984, 1050624, -259072, 59904, 353792, 1155072, -228352, 519680, 945664, -147456, -411648, 52224, -284672, 176128, 851456]
7346H51456d44416q31488D86400k08896c26144I56416b63168n9392C82464g99232
7335h98560E61152m5568b09408C54816g7824D73088P7312k63168J26464b560r43616
7324i46176a47968o97856B47296M91520A43360K17600b3040j162752A81760L88608
7314E70368b41152A11616B9696a062400b91328o31296K63168g6800j019904D6080
7303E68832j88928H1408J43872c38432j25440l03616a3312j53600B89280b15552
7292D02944A75616i216p14752j1776c18976a13664d3520m20864A90464g11680
7281C25632e632C21024c81440B39616f66624D31104D3008J29024b40640k04800
7271d45440A15712i1648k36544B80064k8672P3216h6528b2016F74304b61632C36384
$$ y = [851456, -444416, -1275904, 486400, 277504, -326144, 956416, -263168, -322560, 382464, -799232, -898560, 561152, 515584, -209408, 354816, -77824, 473088, 550400, 287232, 413696, -2560, -946176, -147968, -845824, 247296, 738816, 143360, 360960, -23040, -1185792, 181760, 570368, -241152, 111616, 29696, -1062400, -291328, -922624, -659456, -76800, -1096704, 46080, 568832, 379904, 81408, 225280, -338432, -463872, -767488, -13312, -166912, 289280, -215552, 402944, 175616, -9216, -723968, -735744, -318976, -113664, -43520, -464384, 190464, -711680, 325632, -5632, 321024, -381440, 239616, -666624, 431104, 43008, 172032, -240640, -445440, 115712, -91648, -328192, 280064, 251392, 324608, -86528, -22016, 674304, -261632, 336384]
7259C06688E9904L34336Q3456H9088d70016D86400k9184P29600a080832B0480
7248d50048l47136A235456A11616N9392L69664a98144l68640J98144D66944J92000
7238F58944d1984p44448F40000F0416P7824J102848E30432G168J16224E3760K74944
7227C28704b39616j57184E09440g74144D84864P19360D18816a16224m63360E56544
7216B19648M13184k560C7376L15904O13888C54304K32448K83648A25440E7344
7205A17248K37568K36032R728j35168J11104l5840a56160D95104K24768e03808
7194F47680q0384A94560M39808O96320I8304b9184A7408B048R70240J57184k41664
7183H87808J134080j91488M17792l55328O79424P8848j073664n59104l9424k21696
$$ y = [306688, 59904, 394240, 477696, 89088, -470016, 486400, 457216, 1186816, -1080832, 20480, -450048, -797184, 1235456, 111616, 171008, 540672, -198144, -566784, -368640, 466944, 658944, -41984, -786432, 640000, 60416, 138240, 1241088, 530432, 7168, 123392, 53760, 328704, -239616, -396800, 509440, -774144, 484864, 1204224, 418816, -116224, -579584, 556544, 219648, 632832, 630272, 37376, 353280, 967168, 354304, 586752, 870400, 125440, 57344, 117248, 354816, 590848, 600576, 465408, 576512, 540672, -156160, 495104, 719872, -503808, 647680, 567296, 194560, 634368, 1330688, 98304, -29184, 17408, 2048, 972288, 1129472, 887808, 2021888, 1830400, 2248192, 1892864, 2572288, 2651136, 1577472, 1018368, 978944, 757248]
7173G57248k18624E8368N23264b21184k48320B68800M56192C4816J143808D24448
7162c10784D88960C0208J119744f80448f9120G26016M4544e4784r20576j16736
7152a092096d28032l62496B1504J36192P45984g66976I49760A62816K66240e32480
7141b14016A47968f70208L18464f7584l13856J46944a11616o41024L25120f5024
7130C40480A6384e35552a19808B03776d83840D81792B22208b22208B53440e6320
7119f65600k8160A58720J98144e44256j78688a24416r6768j72544a46944F656
7108A68448Q78080B80064K94400c9936k77504A399808D15744A46432L86560L77344
7098I10336B88256f10816C39456j32096a82272j93536m59264k21696A00352a189888
$$ y = [757248, 538624, 58368, 581632, -221184, -469504, 268800, 724992, 34816, 1178624, 424448, -310784, 488960, 30208, 1149952, -680448, -69120, 726016, 770560, -54784, -975360, -1092096, -428032, -790528, 21504, 157696, 903680, -766976, 949760, 162816, 429056, -532480, -214016, 147968, -670208, -351744, -67584, -381440, -234496, -111616, -752640, -427520, -65024, 340480, 16384, -535552, -119808, 203776, -483840, 481792, 222208, -222208, 253440, -56320, -665600, -693760, 158720, 356864, -544256, -722944, -124416, -221184, -393728, -146944, 6656, 168448, 1046528, 280064, 574464, -39936, -317440, 1399808, 415744, 146432, 532992, 910336, 288256, -610816, 339456, 207360, -182272, -375808, -835072, -1056768, 100352, -1189888]
7087H7552L21536A36704K67264e05856G3216N60640J80736J98656D82304O27200
7077A109504D14208L48160c24608o81472d40832@D52096b24768C49184e2224C51232
7065H00256b30912E43744k40128F8096a98144O9120H74496P43424B65728J160704
7055A426432F20544j14176d31616H64256A67936K52928j36704A33120P32160k91328
7045E73952n2224j33120M43904c4304A053184k90304a45920i728k9696p76704
7035h16128L88096E51424k18624J119232F58432R61536p52640B25280g94112h9600
7024a099776b4576A225728C85536A31584e5808A323008c98848C072e83168b37568
7013B7648J073664D80768K27840J90464L58912k30400K60608F11328P59296F8096
$$ y = [87552, 409088, 136704, 403968, -505856, 73216, 633856, 814592, 1013248, 482304, 1109504, 414208, 762368, -324608, -1006080, -440832, 0, 452096, -224768, 349184, -52224, 351232, 800256, -230912, 543744, 303616, 68096, -198144, -129024, 874496, 1617920, 265728, 1426432, 620544, 506368, -431616, 864256, 167936, 420864, 284160, 133120, 865280, 573952, 521728, 388608, 832512, -34304, 1053184, 762880, -145920, -9728, -39424, -816128, -428032, 551424, 332800, 1452032, 658432, 1619968, 867328, 225280, -794112, -89600, -1099776, -24576, 1225728, 385536, 131584, -55808, 1323008, -398848, 3072, -583168, -237568, 27648, 1101312, 480768, 708608, 899072, 1257984, 1027584, 1288192, 611328, 1370624, 68096]
7002I32352k92352P21920f69184A137152D03968c32288A638400D12160B7648R92768
6992A020416A77152Q73984C30240A5360P9872L07200a402368A019392B76992Q38656
6982A115648E5808a1264k54464G13216r0624j41312j19296g73120b0992E6832
6971e6832j09568B30400a5872F40000R2160C28704q7552M84864M96640A50528
6960A205760k02240j40288j58208B66240I1136R18528k83136L26144J377792k25792
6950B204672R12896m54144R73312O36928K21184n120P99232j758720j7408K78016
6940C790848j634304Q82176j236992k28352K15040c51744H03840B36032L14880
6931E50912K14016A95584N69856B70848P0144R85088c82976G72096K99008l26144
$$ y = [932352, 640000, 1361920, -669184, 1137152, 403968, -332288, 1638400, 412160, 27648, 1020416, 177152, 1051136, 330240, 15360, 95232, 402432, -1402368, 1019392, 276992, 1115648, 55808, -11264, -265728, 713216, 622592, 481280, 361984, -773120, -20992, 56832, -56832, -166400, 230400, -15872, 640000, 732160, 328704, 241152, 726016, 1222656, 150528, 1205760, 1003520, 863232, 705024, 266240, 91136, 1009664, 726528, 1052672, 2430464, 2204672, 3117568, 2663424, 3636736, 4273664, 4494848, 4489728, 5288960, 3530240, 3512832, 3790848, 2156544, 3038720, 1801728, 1573376, 1788416, -351744, 803840, 236032, 550912, 764928, 195584, 765440, 270848, 340992, 1326080, -382976, 772096, 1071104, 744960]
6921G44960f144B24256a86368E77536j95072L57376a90976A445888B26816K58048
6911D84864A86880d608F67648b65728I27744A90464f85568A063424C9936J047040
6901A086976b90816J03936D05504p1680c76320m20352C25120j19808m0448o8096
6891I6768O08256a95584B1504J161216m56192b94912D06016J061888o00064B02752
6880d17792A24928J138176k49344a41824m41344F45632J16224L5840B2528K71360
6870B93888L58912q0384c08224G59808a77152H04864A09568J327104B91328M18304
6860G09632N98528F09792L66080f68672D31616k9184D8128K80576R2672J93024
6850F14400j05472L04128L13856l4816E32992N9904M67456O07744F52800l16416
$$ y = [744960, -6144, 224256, -186368, 577536, 382464, 739840, -190976, 1445888, 226816, 484864, 186880, -4608, 667648, -265728, 927744, 190464, -685568, 1063424, 39936, 1086976, -290816, -186880, 405504, 333824, -376320, -796672, 325120, 205312, 164864, 96768, 705024, -195584, 21504, 1182720, 726528, -294912, 406016, 1467904, 867840, 202752, -417792, 124928, 1263104, 1013760, -141824, -583168, 645632, 761856, 797696, 22528, 293888, 652800, 572416, -308224, 759808, -177152, 804864, 109568, 1436672, 291328, 709632, 1308160, 609792, 975872, -668672, 431616, 402432, 48128, 328704, 421376, 614400, 508928, 813056, 1126912, 1092096, 532992, 592896, 1060352, 1668096, 652800, 336384]
6840C36384K88256A73056J145344a08032k8160A189888a14176J8944j19296j37216
6830c51744C04128A35168M22400a19296C31776O20544k65216M26496A55648L78880
6820E34528d86400A233920M7104n62688M35200E74976A66400a15200c9936A035776
6809C92704O17472b42176E85216K44736B87744J185280a96096A80224k2528j0240
6799A47456b89280C26656P06560B59072k6112N28896Q67328E02784Q89856B98496
6788A10592J28512A18784J336320C82464J335296n60640m52096r6256j35680O72768
6778A145856B03264P42912K17600n65248B07360P36256d47488C86048A80736c05664
6767F66112m5568J159680A07520J607168E72416c93216I99424C21536J370112
$$ y = [336384, 624640, 173056, 1318400, -108032, -136192, 1189888, -114176, -95232, -214528, -351744, 304128, 135168, 557568, -119296, 331776, 952320, 687104, 1113600, 155648, 534528, -486400, 1233920, 1281024, 718336, 1153536, 574976, 166400, -115200, -39936, 1035776, 392704, 1010176, -242176, 585216, 829952, 287744, 1473024, -196096, 180224, 157696, 147456, -289280, 326656, 1033216, 259072, 232960, 761856, 1629184, 502784, 1392640, 298496, 110592, 239104, 118784, 1455104, 382464, 1717760, 1157120, 705024, 608768, 473088, 1145856, 203264, 946176, 1163776, 598528, 207360, 943616, -447488, 386048, 180736, -305664, 666112, 620544, 1780224, 107520, 1714688, 572416, -393216, 999424, 321536, 1691648]
6758A691648D96640J156608G51616Q26368e3760H87296a34144r728H93952C85536
6747F89152K90816A11104m5056Q08448l16928i4720E62176a4336A621504E55520
6736C67616L29216J81760l36384j26976e01760D89472k6624j95584K94912J40800
6726G02976a12128A454080C74272K16064j35168J80736B85184J127936n18656
6717H94464b32448a09056C25632c00544B59584J45408L54816A47456e87264B23744
6706A502208C8912N29920h3456A614336B18112g18848a04448I86624C76832O32320
6696A009152h4992E15584j14688O22080B50368J8432R5744O47168M30592m09600
6686A032704j19808P27040G05536L18976B78528J62304J275904A08032J189888
$$ y = [1691648, 496640, 1653248, 751616, 1577984, -53760, 887296, -134144, -143872, 893952, 385536, 689152, 979968, 111104, 66048, 874496, 557568, -94720, 562176, -14336, 1621504, 555520, 367616, 696832, 878592, 542208, 415232, -501760, 489472, 462848, 267264, 562176, 702976, -112128, 1454080, 374272, 590336, 455168, 635904, 285184, 1413120, 894464, -232448, -109056, 325632, -300544, 259584, 404992, 759808, 147456, -587264, 223744, 1502208, 38912, 568832, -83456, 1614336, 218112, -718848, -104448, 986624, 376832, 1009152, -84992, 515584, 400896, 1022976, 250368, 268800, 364544, 1011712, 1442304, 1032704, 912896, 1639936, 705536, 1024512, 278528, 440832, 1716736, 108032, 1297920]
6677A297920Q03328n92896P5776o15936J17248E29408L61984d56192B01216f0928
6666F45120B53440J063936D44416K78528j57696J9456A7408K34496J76640O66624
6656A095168j55136J89440k00704K80064L80928F37440R16480n93920l89120J250816
6646A821696D91008j30048L38432c7888B823168A280512B35520Q37120N50912
6637A623552J13664G99232O01088m12672m6080M02944B75968n2224J58208A01376
6626B429952I32352P54176e05856D50048Q08448L09760C31264J376768G15776
6616E85728e67808D82304J125888n32992O08256C17440L06688L0720K28352c72224
6605a7408B97472J44896j99680K560b62656D91008N6320A07008J647104E99552
$$ y = [1297920, 2101248, 1508352, 1584128, 968192, 1085440, 529408, 891392, -456192, 201216, -60928, 645120, 253440, 1317376, 444416, 722944, 565248, 584704, 17408, 251904, 428544, 1095168, 940032, 1129472, 928768, 1208832, 1589760, 637440, 1553920, 960000, 570880, 1821696, 491008, 360960, 699392, -37888, 2823168, 1280512, 235520, 1072640, 1623552, 1737216, 799232, 1400320, 987648, 941568, 1344512, 275968, 223744, 381952, 101376, 2429952, 932352, 1686528, -505856, 450048, 1258496, 1568256, 331264, 1708032, 715776, 585728, -567808, 482304, 1608192, 1075200, 1683456, 317440, 624128, 654848, 883200, -372224, -17408, 297472, 442368, 242688, 245248, -262656, 491008, 547328, 107008, 1754112, 599552]
6594C4304b02752B87232r0112j4848m9664N4272E0176a64352C23072R68704N3248
6583A345024f5024B91328A25952N57056k33472J117696p66464C21024e07392A110528
6572A267200C13856O66112B31936R06752l69664C28704P88480A04448J155072
6563A259520K04800j49504n4784L072J23904l32288K2528J224192q55552M3520
6553A489408J003520p61856L23072k46272L57376m02432p6288J184256j30048
6544B740736A011712Q41728P45472n78048m80256Q2944n05344J19296J74080J332224
6534B743808j61792A124864C31264J349632j96608q8576J10080D19328O53824
6525A073152K06848J30048j42336J56160o26688M86400l99872j39264B38080R96864
$$ y = [34304, -202752, 287232, 197120, 182272, 132608, 186880, 50176, -164352, 323072, 1291776, 1345024, -65024, 291328, 125952, 683008, 449536, 1567232, 800768, 321024, -507392, 1110528, 1267200, 313856, 979968, 231936, 1138688, 769024, 328704, 1117184, 104448, 1259520, 1464320, 1314816, 1260032, 1263104, 1387008, 1054720, 1077248, 2301440, 1445888, 1489408, 2492928, 1731072, 2054144, 1807872, 2165248, 1762816, 1686528, 2870784, 2740736, 1011712, 1853440, 2598912, 2020864, 1540608, 1623552, 1118208, 1237504, 1411584, 2743808, 2582016, 1124864, 331264, 1680896, 1484288, 1395712, 1505792, 419328, 1073152, 1280000, 1410048, 1267712, 1423872, 797184, 1283584, 883712, 744448, 238080, 1234944]
6515A234944C31776J763328r20064G2192J459200n03296l23584j00352K28864
6506H33024M89984k13504J76128D48000P17312L40480j54624k04800B39616L08224
6496E47840P3216P51104J052160n65248k01728P8848k64192n0176L84000K74432
6486B080256l53280k82112j98656N25312H704J177600J52064P33184p54688O87104
6476B003968r71264N02272F81984k59584P15264P22944a11616A001472D90496
6466A392640n90336O15936j57696j38752m98176M15232k19136J19808L09248C88608
6455A598976l92192N65248o78912k35008J24928f6048A64352R96352k51392Q1408
6445I90720L22048l99872Q88832H19200k06848J096704n49376a85344A000960
$$ y = [1234944, 331776, 2095104, 1175040, 72192, 1531392, 1028096, 704512, 604160, 833024, 1323008, 1109504, 1285632, 448000, 1165312, 1505792, 1351168, 1146368, 239616, 547840, 621056, 1372160, 2424320, 1859072, 1657344, 1736192, 1472000, 1421824, 1805824, 2080256, 1726976, 1444864, 1246208, 1771520, 8704, 1186304, 1338368, 2071552, 1316864, 2003968, 1032704, 1534976, 681984, 422400, 1137664, 1860608, -111616, 1001472, 490496, 1392640, 802304, 1418240, 1260544, 1121792, 623616, 1038848, 819712, 939520, 1248768, 388608, 1598976, 1206784, 1772032, 1093120, 858112, 983040, -66048, 164352, 1160704, 909312, 990720, 1312768, 912896, 1801728, 819200, 612352, 1709056, 1159680, -185344, 1000960]
6435H37120J764864j185792K71872M71040m71552L90144l45088O08768L16416
6426B657792I8816Q72960N00736n53472B28864R34912m40320Q80128n39136J15712
6416A180160M53120D82816P85920l78368L85024l39456j56160N19680n80608M36224
6406A155072M5056E35552Q00768h9088A645056n87264m31104C1744R13920A30048
6395A163264M68480j84832m02944k03776p3728J466880A114624J107456j076736
6386A145344k12480M31104J065984j160192E78048J605120A053696d8640F16448
6376a02912k80064E78048Q26368a36704A867776o10304Q0384d9664A807360A16736
6365F42560A13152N04832a27488G28576j47456k52928R1648J168384F78400L01568
$$ y = [837120, 2601984, 1416192, 1688064, 2159104, 1687552, 2077696, 1732608, 2341376, 2657792, 98816, 971776, 1472512, 919040, 228864, 1163776, 723456, 1603584, 1064448, 1180160, 1633280, 482816, 1268736, 890368, 1275392, 935936, 779776, 1299456, 718848, 1155072, 1200128, 535552, 1336320, -89088, 1645056, 1057792, 626688, 31744, 945664, 130048, 1163264, 1631744, 1446912, 1043968, 840192, 766464, 2233344, 1114624, 2222080, 1145344, 932864, 1363968, 2429952, 1269760, 578048, 2183168, 1053696, -48640, 616448, -102912, -382976, 578048, 1404416, -136704, 1867776, 1257472, 1337856, -49664, 1807360, 116736, 642560, 113152, 617984, -127488, 728576, 581120, 328192, 419840, 1588224, 678400, 979968]
6355I79968K40128i0112D4032b43200I12896c072C46624c6352A55136K20672M46976
6344H22784K59072L23072C04128n5808r5232L81952L38432M76672l41504J86880
6334A195520e9904E89824N08416E39136O64576n29408j00864J183232A05984J277952
6324A383936l82464J79712D4032d6080C02592L55328J88928J35168m24960B51904
6313g8848C584J212928A35168Q51968m32640j43360l1232r4720G3728d42880E30944
6301E61664o0416k7136K99008A85856K45248K7648b09408A139200D52096O11840
6291A063936d77184E97504K13504g7312I05728B17088J008128j48480p6288J32096
6281A132544l38944r5744Q9088C584J451520E96992o7584N36064N44256m09088
$$ y = [979968, 1220096, -90112, 44032, -243200, 912896, -3072, 346624, -36352, 155136, 375808, 822784, 1081856, 1404928, 304128, 248320, 153088, 535040, 873472, 1350144, 1008640, 1195520, -59904, 589824, 1098240, 539136, 1203712, 674304, 573440, 1756672, 105984, 1383936, 1001472, 1181184, 44032, -46080, 302592, 657920, 846848, 982016, 557056, 251904, -78848, 3584, 1216512, 135168, 987136, 554496, 411136, 379904, 285184, 73728, -442880, 530944, 561664, 501248, 474112, 773120, 185856, 431104, 458752, -209408, 1139200, 452096, 1063936, -477184, 597504, 811008, -77312, 905728, 217088, 1225216, 1076736, 1000448, 1132544, 793600, 697856, 786944, 3584, 1455104, 596992, 529408, 1065472, 1609728, 1200640]
6271A200640E59616J81760j0240J53600p9360J066496l62496E60640Q8576O82496
6261A331712C00032J101312p3728L11296j26464q3456E86240K48832J618432H29952
6250A208832j39264L11808l11808P19360M44928k80576m26496K51392n66784K45248
6240A456640J54624k87744P4240d30592A073664C98336J189376j64352A05984
6230B24256J047552D53120O52288j18784A93536R62048N67808J05984q31488k69312
6220G28576Q02304o03136b77504H57088J65888P73120m61312J96608j82272M7616
6210A396736R8816j29024J179648J7920l52256O46656p77728o00064J431040j269760
6200A641984K052096A416192Q66816l99872L90144J80224J101312j269248n30944
$$ y = [1200640, 559616, 741376, 731136, 884736, 805376, 1871872, 1509376, 560640, 649216, 1331712, 300032, 1401344, 1327616, 1638912, 1512448, 1428992, 586240, 835072, 2453504, 829952, 1208832, 1069568, 1381376, 1069568, 1788928, 2233856, 1953280, 1526784, 1778176, 1211392, 1456640, 1611264, 1323520, 1397760, -430592, 1073664, 398336, 1587712, 1423360, 105984, 224256, 1271808, 453120, 1105408, 986624, 193536, 1155584, 1723392, 1829376, 997888, 728576, 1530880, 927744, -277504, 857088, 1022976, 1796096, 1334784, 1531392, 1349120, 1396736, 1495552, 1366528, 2546176, 2564096, 2211840, 2858496, 2080768, 1480704, 2911744, 1641984, 3694080, 1416192, 2283008, 1883136, 2273280, 2453504, 3554816, 2285568, 1754624]
6191A754624j61280k01728q3456l45600L15392m74112k80064J005568n26848N632
6181A008128J344000c6864D09088A93536J216512K95936p50080Q51456F26176
6171A068032l01056J336832G76704Q45824n30432J39264l05664K56512K28864
6162A411072o51264O144Q12032m37760K72384F10304P12192A71008K31424Q50944
6152A253376P34208j06496p62368L97312l68640D86912J72032l05152L25632J473024
6142B152448D89472J090048r8304j89440J066496k43712L65568j103872P680K61120
6132A645056o25664j85856K71360k560K09408k26816J35680M90496J82784p09632
6122A184256R37472K23232j114624J461248J40288j314304j36192J155072j085440
$$ y = [1754624, 1593344, 1391616, 1308160, 962560, 1277952, 803840, 523776, 1529344, 1002496, 1008128, 2352128, -36864, 409088, 193536, 1410048, 1705984, 955904, 1807360, 626176, 1068032, 766976, 2103808, 776704, 1622528, 1092096, 1231360, 925696, 1182208, 1411072, 759808, 765952, 1577984, 1140224, 1412608, 610304, 1322496, 171008, 402432, 1253376, 1987584, 1881088, 1118720, 1516032, 1147392, 486912, 658944, 353792, 679424, 2152448, 489472, 1579520, 1481216, 1291776, 2358272, 2114560, 2480128, 1376256, 1383936, 1645056, 1019392, 833536, 1104896, 1102336, 1311744, 1084928, 1220608, 1711104, 1893888, 1184256, 2121728, 2344960, 1230336, 2691584, 2831872, 1517568, 1381376, 2536448, 1451008]
6113A451008F89664K89280O12864E19680M22400k71872m608c4816B78016H2944
6102G25504B71360P66976b26304G01952k82112O91712b62656C52768N47328A24928
6091G11168B70848K91328e30432C01056K57024R3696L19488n3248C88608j024
6081C87584H8064K48320J026560f89152A44896R82016f51776C86048O74304D92544
6070A335296o61504A2288N20192A8432Q16640M84864n16096K40640N1712C90656
6059C43552j2800M79232J82272l01056K52928M88960M6592m50048a53600A433088
6048A28000N16608B09408N63712N44768E51936O07744B06336J39776j57696M78720
6038F67136J039872n67808M82816F24640J56160L10784m53120l16416P50592o4000
$$ y = [1451008, 689664, 978944, 1591808, 519680, 942080, 670208, 665600, -34816, 278016, 82944, 725504, 271360, 1038336, -226304, 701952, 419840, 1111552, -262656, 352768, 900096, 124928, 711168, 270848, 562176, -530432, 301056, 558080, 651776, 971264, 918016, 388608, 387584, 88064, 336384, 1362944, -689152, 144896, 1126912, -651776, 386048, 1060352, 492544, 1335296, 673792, 12288, 532480, 18432, 835072, 1319936, 803840, 1044480, 1096192, 390656, 343552, 330752, 809984, 992256, 691200, 944128, 1433088, 1479680, 1029632, -153600, 1433088, 128000, 644608, 209408, 773120, 1317888, 551936, 1159680, 206336, 346112, 188416, 667136, 1707008, 1139200, 1622016, 624640, 780800, 1091584, 638464, 322048, 1072640, 1008640]
6028A008640M71040J20320j05984P76704j108992J213952j083904L41504k60096
6019A373184L68128J340928j067520O80960n11488j18272N632j72544J1776P21408
6009B632192k69824m15232J137152j541632M43904l7376m03968J045504l67104
6000B223616l06688O18496L90144p53664N37600M04480j23392n28896j97632Q12544
5990C076608m96640L23584r2160r08800J828864q62720L29216j063424N30944
5981B665472M63360K18112l30240O60992m44416R10848l04640J48480K85184j231872
5971C041280Q704q5504k28352L51232o55360J092608j186304J20320P47520n35040
5961B671104l68640L67104q59648K2016l53792o656P74656J119744G38816N84704
$$ y = [1008640, 1479680, 1600000, 1494016, 2270720, 1161728, 2375680, 1291776, 1633280, 1373184, 1741312, 3082240, 2014720, 2695680, 2184192, 2065920, 2071552, 1899008, 1910784, 2632192, 2362368, 1947136, 3084288, 1542656, 1986560, 1949184, 1545216, 2590720, 2223616, 1916928, 2535424, 2925568, 2171904, 2709504, 3113984, 2990592, 2461696, 2264064, 3076608, 2579968, 2903552, 2811392, 1902592, 3731456, 2868736, 3197952, 2134528, 2665472, 3128832, 3346944, 3016704, 3677696, 3233280, 4144128, 3839488, 3987968, 4273152, 3041280, 3049984, 2964480, 2736128, 3087360, 2432000, 3524608, 2338304, 2458624, 3206144, 2671104, 2302464, 2669568, 1809920, 1831936, 1478144, 1471488, 2246144, 3365888, 738816, 1323520]
5951A323520R00096L584M73600O1440A009664P14240l38944R32864m52096L38432
5941B204160G62880l24096R34912K87232m57216m93568N63712L94752J63840H69888
5930H79104Q42752m98688L05664n52448J118208j96096o75840J155584A85856
5920D66944J741312p68512K67264J04448n03808M91520j00864M36736E63712J670144
5910B233856q60672P76192p46496k36032J86880R86624j132544P62880k59072
5901A711616P20384D50560J795072Q1920q94976Q02816j005568l0720O79936m096
5891A874944l77856K49344k16576P72608D16256R60000M24448m19840M41344G51104
5880A818624o82496A68448J334784M42880q71936J91488l11296L61472j03936
$$ y = [1323520, 2223616, 2227200, 2700800, 2762240, 1009664, 1723904, 1384960, 2317824, 1865728, 2204160, 762880, 438784, 1373696, 1660928, 1203712, 710144, 1273856, 1668608, 1832448, 869888, 879104, 1721856, 1223168, 1528832, 976384, 2094592, 1898496, 1222656, 2378240, 185856, 466944, 2208256, 1439744, 1707008, 1811456, 1307648, 1799168, 1698304, 2135040, 563712, 2233856, 1373184, 2149376, 1402880, 1166848, 1353728, 2340352, 1207808, 1970688, 1711616, 2432000, 450560, 2245632, 2327552, 1432576, 2235392, 1229824, 1199104, 1879040, 1874944, 1497088, 1746432, 1529856, 2302464, 416256, 1376256, 1800704, 1380864, 1822208, 751104, 1818624, 1136128, 168448, 1503232, 1946112, 1074176, 1265664, 954368, 1315840, 1211904]
5871A211904K50880C99360J240064j28512P58272p53152n78048J405952A088000
5861I53856J629696B97472P09120L86048n13536J005056J30048j22880L46112
5852B237440o69696J13664%M15232q47872M20352q9088K05824n89824l39968A92512
5840B387968q96512o48704L54304l8912N74464n26848J41824J326080G66976J494016
5830B260992A035264D89472R40544l99872J607168H83200J55648P99232k76480
5821A561600l29216J549824j175040G11168l6864L21536N66272Q09984p05536
5812A666560p60320J993216j073152k19648K0992C10784J540096l88096J057792
5803B520576n22752l91168J07008L2768J43360n73952Q76544j73568l52768p3216
$$ y = [1211904, 1462784, 399360, 1639424, 1510912, 2269184, 1516032, 937984, 2343936, 1088000, 953856, 2583552, 297472, 1006592, 1392640, 879104, 1884160, 2014208, 1891328, 2237440, 1567744, 1681408, 1681408, 2096640, 1248768, 1669120, 1580032, 1785856, 1196032, 856064, 192512, 2387968, 1491456, 842752, 1197056, 1158144, 1732608, 1205760, 1347584, 2673664, 766976, 2260992, 1035264, 489472, 1430016, 1030144, 2637312, 883200, 1038848, 1838080, 1561600, 1232384, 2782208, 1607168, 711168, 674304, 995840, 1562112, 2372096, 1666560, 906240, 2899456, 1826304, 1606656, 1627648, 310784, 1850880, 1462784, 2520576, 1997824, 1606656, 1713664, 1746432, 1889792, 1315840, 2192384, 2018816, 1666048, 1592832]
5793A592832k33984J525248A134080O03648q0384N71392j041920J97120J290240
5784B674176Q66304l04640J291264m18304M49024l14368j36704N03808j090560
5775C520000P19872j837568l27680J576960j112576N04832K12480m95616N14560
5766C275264J89952J484800j028096P83872m68480J461760l16416m05504L36384
5757E313536L89632n17632M77696J64864P18848L86560p49056J201664l16928
5748G069184R2160j3312O49216J110528J484800j244160R93792J696256l96288
5739A1442176J023488O13376J294336J033728P94112n26848N86240j79200r8816
5730A5982592J143296n0688o57920L616768r75872O18496R96864j93024P69536
$$ y = [1592832, 1358848, 2884096, 1134080, 1737728, 1657344, 2228736, 1186816, 1383936, 2674176, 3540480, 3235840, 4527104, 4108800, 4557824, 4243456, 4106752, 4610560, 3520000, 4239872, 2402304, 2074624, 3651584, 2539008, 3043840, 3256320, 2760704, 3275264, 3465216, 4950016, 3921920, 4705792, 4237312, 5699072, 5382656, 4977152, 5313536, 5703168, 5185536, 5663232, 5828096, 6546944, 6933504, 6184448, 7386112, 7069184, 7161344, 7148032, 7797248, 8907776, 10392576, 9148416, 10142208, 11838464, 11442176, 12465664, 13079040, 14373376, 15407104, 16201216, 15674368, 16260608, 16081408, 15982592, 17125888, 17075200, 16417280, 20034048, 19058176, 19676672, 20673536, 20480512, 21250048]
5721B1250048J213952L08736L07200K398720k80576K260992Q16128M39808k204160
5712B6510848k045440j772544l266048p86944j334272p94112l90144J4848j103360
5703A5032832j142784k703872n57056k54976j479168l33824o88128O41024j89952
5694H324096L63520N12512j218048j184768O98880J61280N29920K65216j063424
5685G389184k68800J70496k6624J95072j056768O30784K81600k74944N33504M38784
5675H012288m72064P14752j440768J018368k637312P36256K51904j565696J626624
5666F244352j395200o0928N71904j046016J312256j293312n16608J077248m096
5657D889600o21056M46976P2192j330176J25440J349632p86432o48192R60000
$$ y = [21250048, 22464000, 22772736, 23079936, 25478656, 25198080, 27459072, 28275200, 28715008, 26510848, 24465408, 22692864, 19426816, 18639872, 17305600, 16511488, 16121344, 16136192, 15032832, 13890048, 11186176, 10629120, 10374144, 8894976, 8561152, 7873024, 8514048, 8324096, 8687616, 9200128, 7982080, 6797312, 7496192, 7657472, 8187392, 8452608, 7389184, 7120384, 7290880, 7264256, 7459328, 6402560, 7033344, 7314944, 7040000, 7573504, 8012288, 7540224, 8254976, 6814208, 7832576, 5195264, 5931520, 6183424, 4617728, 6244352, 4849152, 4788224, 5360128, 4314112, 5626368, 4333056, 3816448, 4893696, 4889600, 4268544, 4715520, 4787712, 3457536, 3582976, 4932608, 4146176, 3497984, 4457984]
5648D457984l74272j75616J249792q79104R05216j173504J202176j148928J3824
5639D077568N57056N120o93248J46944n42720P7824J368576r66656n68832j60768
5629C300864Q88320K90816l17952L68640M19328j521664J051648o30784n76512
5620C272704L82464j00352J016320j67424r32352J329664k04288j067520N69344
5611D098560J36704K4576j89440k41664P63392k03264k69312k12992J76640M86400
5601D569600j103872K93376M01408n18656J64864M45952m94080M62336L5840o58432
5591C598336L92192M77184l77856k74432J98144m73600j2800J595392j458176
5582C664384Q15104q06912n51936O0928R68704n53984l0208J061888n03296O08768
$$ y = [4457984, 4083712, 3908096, 5157888, 4278784, 5184000, 4010496, 5212672, 4063744, 4077568, 4634624, 4639744, 3946496, 4093440, 3550720, 3628544, 4997120, 4030464, 3461632, 3300864, 4189184, 4480000, 4162048, 4530688, 4950016, 3428352, 4480000, 3849216, 3272704, 3655168, 3554816, 4571136, 4403712, 3471360, 4801024, 4596736, 3529216, 4098560, 4235264, 4259840, 4070400, 3828736, 4592128, 4388864, 4119552, 3906560, 4083200, 4569600, 3465728, 3759104, 4160512, 3641856, 3806720, 4252672, 3758592, 4220928, 4256768, 3598336, 3990528, 4467712, 4089856, 3815424, 4013568, 3539968, 3527168, 5122560, 3664384, 4479488, 3672576, 3120640, 3181568, 4150272, 3596288, 3566080, 4627968, 4124672, 4733440]
5572D733440q52480K27840l41504J57184N51424o73280m76160J159168q55040
5563C630592P09632m61312Q59136j648640Q7040P75680R31840l38944J270272
5554E815296k95936o72768J102848k222592R76896M41344p49056J45408q70400
5545C671040J060864l60960p21408n8880K89792r11360P85920o65088k95424L66080
5535C160576j316864J050112r94816K185728o97856K086912k19136P47520P96160
5526F798336j261568m20864l86048J279488K50368P75168k13504J32096J99680
5517G153152P88480j50528K185216L58400j22880L47648l32288n4784J513984
5508A1686400Q60672j259008J323008k50880K34496J48480m79232K368000N90848
$$ y = [4733440, 3880960, 4108800, 3767296, 3924480, 4475904, 3802624, 3326464, 4485632, 3630592, 4340224, 3878912, 4738048, 3089408, 3176448, 3952128, 4883968, 4545024, 5815296, 5519360, 4846592, 5949440, 3726848, 4703744, 5145088, 4396032, 4541440, 3671040, 4731904, 4370944, 3649536, 3590656, 3880448, 2969088, 3755008, 3089920, 2794496, 3160576, 1843712, 2893824, 1899008, 4084736, 3386880, 5473792, 5254656, 6002176, 6798336, 5536768, 5115904, 4729856, 6009344, 6259712, 7034880, 6821376, 6953472, 7153152, 7941632, 7791104, 9976320, 10334720, 10211840, 10559488, 10227200, 10172416, 11686400, 12547072, 11288064, 12611072, 12360192, 12594688, 12743168, 12263936, 14631936, 15222784]
5499A5222784J323008J550336J347072J02400J872384J228800Q63232J448448
5491B4958464K198528l40480K652160K842112J625600R01632K313728K624000
5483C9775744K407424L569664L245568M712960N343744O287360O831104P266816
5475G9440384P940096P893504R617920Q853504J0522112R267200J1798016J3152256
5467A58484992J0959360J4862848J5594496J7680896K1465600K3656448K9306368
5460B92011008L4980352M4028928N7586688P7093376J05490432J47247616J91135744
5453I49574144K24663552K34486272J79843584L0159360j51959040k59437568
5447A207330304k67077632k23005696j66889472j20338432q2546176n7097728
$$ y = [15222784, 16545792, 18096128, 19443200, 19545600, 21417984, 22646784, 23510016, 24958464, 27156992, 26816512, 29468672, 32310784, 33936384, 34838016, 37151744, 39775744, 42183168, 45752832, 48998400, 53711360, 59055104, 65342464, 72173568, 79440384, 87380480, 95273984, 104891904, 113745408, 124267520, 133534720, 145332736, 158484992, 169444352, 184307200, 199901696, 217582592, 239048192, 262704640, 292011008, 326991360, 371020288, 428606976, 505700352, 611190784, 758438400, 949574144, 1174237696, 1408723968, 1588567552, 1618726912, 1466767872, 1207330304, 940252672, 717246976, 550357504, 430019072, 347472896, 290375168]
5441B90375168m2707456l3355264k5865728k1200896j5447552j4462464j1586048
5434A25749760r628160o867456o958080n595648n246976k920960o431232k857984
5426G9243264l369984o627328k647040k503168k023424l991040j298944l055616
5418E3726720k118656j529344j645056j749504k366976j623040k20672j530368
5410D0943104m25984j34144k190336m86400k686976J78176l75296p17824r39008
5401C3165312j054208N0688k29888k419200n4784q55040l29728O4512K02240j159168
5391B7380736m50048j563648n57056o93760K8672m31104r73312K33984R94816
5382B3969280J68960N38624q93952k292224J546752j085952J367552j154048J2800
$$ y = [290375168, 247667712, 214312448, 188446720, 167245824, 151798272, 137335808, 125749760, 116121600, 109254144, 102296064, 96700416, 91453440, 88532480, 82101248, 79243264, 75873280, 69245952, 66598912, 64095744, 62072320, 58081280, 56782336, 53726720, 51608064, 50078720, 48433664, 46684160, 44317184, 42694144, 42473472, 40943104, 40517120, 40382976, 38192640, 37706240, 35019264, 35197440, 34822144, 34104320, 33165312, 32111104, 32161792, 31931904, 29512704, 29457920, 28602880, 28273152, 28337664, 28539904, 27380736, 26930688, 25367040, 24809984, 24116224, 24144896, 23713792, 22740480, 22974464, 23969280, 24138240, 24676864, 23782912, 21490688, 23037440, 21951488, 23319040, 22164992, 22177792]
5373B2177792m25472j092608O92736L28192p0656l33824l2256m31616p65952p05024
5363A9341312K89280j444864O48192j22368j488896N66272K10432o32320o82496
5354A6684544J73056p42912q83712J34144j433600K03264k75968M7616l59424
5345A3547008R67680k21696m9152n38624q57600M37760k09408Q21760j758208
5336A2139520J13664P21920N77536j18784r12896M23936j19296m91008q07424
5327A1527168J134080j305088k02752j61280k11968R82528Q50432j424384j529344
5318I659392Q35584O28224q28416q19200Q2432L49696J386496j601024J217536
5309A0910720n04832j486336Q37120P55200j953280J025536j093120M99712Q58624
$$ y = [22177792, 21752320, 20659712, 21352448, 21680640, 21609984, 21276160, 21243904, 20812288, 20046336, 19341312, 19630592, 18185728, 18833920, 18711552, 17222656, 17788928, 17999360, 17367040, 16684544, 16857600, 16114688, 15230976, 15365120, 13931520, 14134784, 13858816, 13906432, 13547008, 14514688, 14292992, 14243840, 13705216, 12847616, 13285376, 13075968, 13897728, 12139520, 12253184, 12975104, 13552640, 13433856, 12520960, 12944896, 12825600, 12334592, 11527168, 12661248, 11356160, 11153408, 10992128, 10780160, 11762688, 12613120, 11188736, 9659392, 10494976, 11123200, 10294784, 9475584, 9558016, 9907712, 11294208, 9693184, 10910720, 10405888, 8919552, 9756672, 10511872, 8558592, 9584128, 8491008, 8990720, 9849344]
5300I849344M50048n69344j497088J512960P0144j253376J313280k556928J438208
5291H757248R75360k40128l10272L7376n62688O83520j45408M6592m82816n28384
5281H230400P7312p45472K28864K10944K88768q66816J645568j176064p22944
5272G170560J001472l99872Q43264n6320r63584L78880M09088n70880K84160j198080
5262F898688K025984M33152J233920n66272J107968k94912J566720o66112J3824
5253A1752960l48672k51392J39264k399744r6256k30400n44768j36192J40800
5244H025600k83648L74784R36448k28864K22720j31072o28224J164800K93888
5235I746432M23424P85920j515520J216512n1200l34336Q15616j188352L6352
$$ y = [9849344, 10299392, 9730048, 8232960, 9745920, 9816064, 8562688, 9875968, 7319040, 8757248, 9732608, 9492480, 9182208, 9219584, 8656896, 9340416, 9195008, 9241600, 8758784, 8230400, 8307712, 7562240, 7791104, 8002048, 8290816, 7424000, 9069568, 7893504, 7170560, 8172032, 7772160, 8615424, 8559104, 7595520, 7974400, 8383488, 7812608, 8096768, 6898688, 8924672, 9357824, 10591744, 10025472, 11133440, 10838528, 12405248, 11739136, 11752960, 11404288, 11152896, 11292160, 8892416, 8796160, 8565760, 8020992, 7884800, 8025600, 7741952, 8116736, 9053184, 8824320, 9047040, 8915968, 8287744, 9452544, 9746432, 10169856, 10955776, 9440256, 10656768, 10605568, 10271232, 11086848, 9898496, 9934848]
5226I934848J571328M16768l8912m0960L56864j669632J150976J781248q94976
5217A2567552N08928R66144J80224p1680J642496j96096J150976k18624J251840
5208A7781760J091584j68960l43040J405440K58560K58048N3760O18496n07904
5199B0447744R45152k03264J412608p40352N68320M52096J168896N03808J246720
5190B5801728J288704J088000J065984j970688r63072o92224l584000k034688
5182A9999744k167808j478656j015808Q23808q74496p34720k0992k0480l43552
5173A4167040l3280P37792p30112n59616o84544L20512j64352j51040o08256j00864
5163A2193280J31584m45952M35712p56224j528832K69824k91328o14912k11968
$$ y = [9934848, 11506176, 11922944, 11884032, 11843072, 12199936, 10530304, 11681280, 13462528, 12567552, 13076480, 14042624, 14222848, 14151168, 15793664, 15597568, 16748544, 16529920, 17781760, 18873344, 18704384, 18361344, 19766784, 20025344, 20283392, 20337152, 20955648, 20447744, 21392896, 21189632, 22602240, 21861888, 22430208, 22882304, 24051200, 24555008, 25801728, 27090432, 28178432, 29244416, 27273728, 26310656, 25618432, 22034432, 19999744, 17831936, 16353280, 15337472, 16161280, 15286784, 14552064, 14531072, 14510592, 14167040, 14133760, 14871552, 14141440, 13581824, 12897280, 13217792, 13053440, 12902400, 12294144, 12193280, 12324864, 11878912, 12314624, 11558400, 10029568, 10299392, 10008064, 9393152, 9181184]
5154I181184K02240R0112p58784Q4992l54816j043456K594304j960960J68960
5145H203776j202176L94240J673216k210816J427456J24928j091584M62336J201664
5136H983040k98496m4544j605632J37728N50912p59296J403904j315328k5600
5127G026688N18656k531328l33824o57920O01600Q2432J766912j756672K523136
5118G239680k03776j390080N07904J200640n79584J339904r54880j15712p45472
5109F298624P48544M11136k73920J71008K56000J34144j506304Q08448j00352
5100F947328l46112m49024N99552N62176o16960p4752Q59648j214976J171968
5091G438848j165312M74112J916928q24832N6320l71712j66400Q0384m7104L02592
$$ y = [9181184, 9383424, 9473536, 8714752, 8799744, 8444928, 7401472, 9995776, 8034816, 8203776, 7001600, 7395840, 9069056, 6858240, 8285696, 8410624, 7319040, 7781376, 8983040, 8684544, 8640000, 7034368, 7172096, 7723008, 6963712, 8367616, 7052288, 7026688, 7545344, 5014016, 4680192, 4022272, 4623872, 4706304, 6473216, 4716544, 7239680, 7035904, 5645824, 6153728, 7354368, 6774784, 8114688, 7159808, 7044096, 6298624, 7047168, 7458304, 7184384, 7355392, 7611392, 7745536, 6239232, 7047680, 6947328, 6601216, 6152192, 6751744, 7313920, 6696960, 6622208, 7481856, 6266880, 7438848, 6273536, 6747648, 8664576, 7839744, 7896064, 7524352, 7357952, 7438336, 7391232, 7693824]
5081G693824q97024p98208L584O41024j97120r84576J433600j006080J410048
5072G299072j122816O24640q36096K12992j61280o06208N67808N16096o47168
5063E847040k83136Q3968O50752k04288J84832l64544l40480J78688n52960K94400
5053E494272N61664K55488K81600n29920J251328M01920m66432O64576K55488
5044H169984o32320r97888O48704J105408m02432M84864L82976N86240n59104
5035H786432j148928K694144J085952K107904K196480L288064J777152L425280
5027B4212480O97344o00064k814976k168832n104640k743808j906176j684480
5019G886848o89664J014784k312192m52608M57216N70880o89664J39776j533440
$$ y = [7693824, 6796800, 5998592, 6002176, 6643200, 6446080, 5461504, 6895104, 5889024, 7299072, 6176256, 6800896, 5964800, 6177792, 6016512, 5410304, 5978112, 6494208, 5847040, 5563904, 5647872, 6298624, 6094336, 6279168, 5914624, 5574144, 5752832, 5199872, 5494272, 6055936, 6311424, 6593024, 6063104, 7314432, 7716352, 7249920, 7914496, 8169984, 7537664, 6539776, 7188480, 8293888, 7891456, 8376320, 8759296, 9345536, 8786432, 7637504, 10331648, 11417600, 13525504, 15721984, 19010048, 20787200, 24212480, 24909824, 24309760, 21494784, 19325952, 14221312, 11477504, 9571328, 7886848, 7197184, 8211968, 5899776, 5447168, 5904384, 6475264, 5785600, 5925376, 4391936]
5010D391936J987584q00256L73760n78048O90688j525248J740800k92864q33024
5001E155328M5568l84512J315328j361408Q76032J292288j051136q09472J474048
4992F552064q68864L46624P59808j217536O58944Q29952p84896l01056P07072
4983F682112p09632P02976j76640p47520Q51456r216j397248J01888L15904K28864
4973E842944p35744J193984J82272j786880P98208n52960N5296J204736k63680
4964E938176l33312P04512m75136j19808r16992L56864R08288o92736K24256N13536
4954F107648n18144m24960L53792L74784J222656q81664R10336N10464n83680
4945G071232r07776J372160j118720J54624J0240l072k62144O0928L55328p4240
$$ y = [4391936, 6379520, 5579264, 5953024, 5374976, 6065664, 4540416, 6281216, 5988352, 5155328, 5200896, 4816384, 6131712, 4770304, 5646336, 6938624, 5887488, 5078016, 6552064, 5683200, 6029824, 6789632, 5572096, 6231040, 7060992, 6276096, 5975040, 6682112, 5972480, 6675456, 6498816, 5751296, 6602752, 6593536, 5196288, 5298176, 5614080, 5842944, 5107200, 6301184, 6483456, 4696576, 5494784, 4941824, 4997120, 6201856, 5938176, 5604864, 6309376, 5834240, 5714432, 4797440, 5154304, 6062592, 5369856, 5594112, 6107648, 5589504, 5164544, 5518336, 5893120, 7115776, 6234112, 7144448, 7654912, 7071232, 6163456, 7535616, 6416896, 6571520, 6581760, 6578688, 6316544, 6377472, 6732800, 6658560]
4935F658560j40800k50880Q12032P55200j086464o40000J042944N8880N70368
4926G779840k12992K68288l00032o24128J321472j539584Q37632J34656r54880
4917F710272m86912J40288J588736j483776o12864J000448L57376p7824n62688
4908F573056n01760K64192r8816q75520R41568p680K95424q46848K94912p28064
4898E310464R80480j16224M1984j082368J395712o68160n77536J47456J62304
4889E594112K84672r63072J084416J23904j213952q33536J313280O85568o90176
4880E385216K43712n19680l34336R2160M96128j116672J115648j65376M68992
4871E665792n02272J42336P06560j760768Q37120J242624j507840M57216L99360
$$ y = [6658560, 6517760, 6266880, 7078912, 7834112, 6747648, 6107648, 7150592, 7209472, 7779840, 7566848, 7835136, 7535104, 6910976, 8232448, 6692864, 7530496, 7665152, 6710272, 6223360, 6363648, 7952384, 6468608, 5855744, 6856192, 7213568, 7135744, 6573056, 6071296, 6335488, 6236672, 5361152, 6302720, 6295040, 6590464, 5743616, 6038528, 5310464, 6290944, 6174720, 6216704, 5134336, 6530048, 5861888, 5284352, 5431808, 5594112, 5878784, 4915712, 6000128, 6124032, 4910080, 4076544, 5389824, 6075392, 5385216, 5628928, 5109248, 4774912, 4867072, 5363200, 4246528, 5362176, 5196800, 5665792, 5163520, 5305856, 6012416, 4251648, 5088768, 6331392, 4823552, 5280768, 5680128]
4862E680128L71200j724416N06368N33504J181184j303040K06336N16608m56192
4853E511680P7312j285120R83552m3520p61344l46112j29536O08768J232384l69664
4843E478400K87232K87744j163776K70336o94272j2288J222656m95104q20224
4834D360704O62528J28512M25984j89440J54112q26880N04832m06528O13376l49184
4824E078016J294848j193472J062400j757184J425920J64352P24480K63680J41312
4815G204352J670144L215360J848832L472896L953664L773440M661760j698816
4807B8101632m975616p968768n040128j584128j867776j85856q23296l54816M30080
4798E731328k63680P03488o45120j535488M49024q21248J104896j626624R23648
$$ y = [5680128, 6051328, 4326912, 4833280, 5366784, 6547968, 5244928, 5451264, 5967872, 5511680, 5588992, 4303872, 5287424, 5243904, 4482560, 4136448, 4006912, 4615680, 5848064, 5478400, 5765632, 6053376, 4889600, 5159936, 4465664, 4453376, 5676032, 5180928, 4360704, 5023232, 5151744, 5577728, 5388288, 5542400, 4715520, 5220352, 4813824, 5427200, 5078016, 6372864, 5179392, 6241792, 4484608, 5910528, 6074880, 6799360, 7063040, 7204352, 8874496, 12089856, 13938688, 17411584, 21365248, 25138688, 29800448, 28101632, 23126016, 15157248, 10117120, 8532992, 6665216, 6479360, 5656064, 5301248, 5731328, 5467648, 6171136, 5526016, 3990528, 4439552, 3618304, 4723200, 3096576, 4020224]
4789D020224l16928Q56576l25120J005056l47648j181696R36960k49344M4544
4780D442624n44256J34656J86368Q4480J58720m7104o81472J396224j320448Q34560
4770D644352o52800P23968K59584m51072q57088o5024n80096J911808j056768
4761C876864p13728N95968Q54528p81824m96128j019904J185280O46144j315840
4752B831360M51072J18784J543168j465856J768448p84896r4208N56544q28928
4743D095488j1776K2528L86560J846272j047552q97536n2736J657344n46304J14176
4733E566464O11328j32608M46976R32352k79040J838080Q04864K48832K907136
4724A2944384L542528M282368N494272M484608N741056N755392j474560q272896
$$ y = [4020224, 3703296, 4559872, 4234752, 5239808, 4892160, 3710464, 4647424, 4398080, 4442624, 3898368, 4033024, 4219392, 4303872, 4462592, 4415488, 3734016, 5130240, 3809792, 4644352, 3991552, 4715520, 4975104, 4524032, 3666944, 3601920, 3021824, 4933632, 3876864, 3163136, 3759104, 4613632, 3831808, 3335680, 2315776, 3501056, 4147200, 2831360, 3282432, 3401216, 4944384, 3478528, 5246976, 4462080, 4367872, 4924416, 4095488, 4083712, 4106240, 4492800, 6339072, 5291520, 4393984, 4341248, 5998592, 5452288, 5566464, 6177792, 6045184, 6492160, 7424512, 7145472, 8983552, 9788416, 10037248, 12944384, 16486912, 20769280, 26263552, 30748160, 36489216, 42244608, 40770048, 32497152]
4716C2497152j0064896l834368K54976K56000L443712L357696M581376j39776
4708C0351872k507776m806656j979392J740288R28768M776448M366848N388800
4700C8259200J361920l075584j0358272n301760j440256k93376K459136K424320
4692B4035328L119616Q31488l133440n946368m032512k020864m04992N53472J552896
4683A4554624J219072J094656k454528k564608l288064q27904j114624r2672j405952
4674E120000N34016N33504k9184r75360Q04864j285632J149440N36576j011712
4665E376512J588736l64544J20320K098176m50560p57248K05312J150464q81664
4656H085504j159168K54464O77888j418240o52288N08416M14208j558016l08224
$$ y = [32497152, 22432256, 18597888, 18852864, 19108864, 22552576, 25910272, 30491648, 30351872, 27844096, 23037440, 21058048, 22798336, 23727104, 28503552, 32870400, 38259200, 39621120, 36545536, 26187264, 20885504, 19445248, 19151872, 21611008, 24035328, 27154944, 27986432, 24852992, 18906624, 14874112, 12853248, 12448256, 13001728, 14554624, 15773696, 16868352, 14413824, 11849216, 8561152, 7733248, 6618624, 6525952, 5120000, 5654016, 6187520, 6158336, 5182976, 5987840, 4702208, 5851648, 6388224, 5376512, 6965248, 6600704, 6721024, 8819200, 8368640, 7611392, 7816704, 8967168, 8085504, 6926336, 7180800, 7858688, 6440448, 5788160, 6296576, 6710784, 5152768, 4844544]
4647D844544P68512r89184m40832n87776L62496j373696Q08960r1136J549824
4638D851712j102336J68448M7104j223680J063936k83136j245184J95072O64064
4629C136000N8880j067520J391104q90368P9360O96320j385472J687040P60320
4620D465664j789440Q67840j159168J7920J048064j329152J143808J60768p61344
4611B664960K94400o38464N35040J08544A432064J282560o13888J17760K30400
4602B448896L81440J048576j147392j7920j148416Q32512J312256o92736o66112
4593B351104M57728j336832J543168o15936j157632Q91392P3216K13504q19712
4584A600000J048064m41856P65952l60448I71264M32128R70240p06560R57440
$$ y = [4844544, 5613056, 4623872, 4183040, 3595264, 3957760, 2584064, 3393024, 3301888, 4851712, 3749376, 3917824, 3964928, 2741248, 3805184, 3522048, 2276864, 2471936, 3136000, 3194880, 2127360, 3518464, 2628096, 2707456, 3403776, 2018304, 3705344, 4465664, 2676224, 3544064, 2384896, 2402816, 3450880, 2121728, 3265536, 3426304, 2664960, 2959360, 2320896, 2855936, 2964480, 1432064, 2714624, 2100736, 2218496, 2448896, 2830336, 3878912, 2731520, 2713600, 1565184, 2397696, 3709952, 3017216, 2351104, 2808832, 1472000, 3015168, 2399232, 1241600, 2132992, 2206208, 2419712, 1600000, 2648064, 2206208, 2972160, 2611712, 971264, 1403392, 2373632, 1667072, 2624512]
4575B624512L48160J21856A192960J262080n77024l39968P87456R46688j320448
4566A951744L91168p01952O16448L41504N4784l80416m608J546240j715712O19008
4556B718208k12480J023488j630208H67840J466368k6112A052160J343488n6832
4547B338816j86880M0448j55136N9392q09472O35904j7920p75680Q85248K34496
4537B249216M04480r05728K63168m5568E80096K156544p12192K2528J39776K44736
4527B431488K97472p50592J043968n69344m69504K48832m33152Q53504p72096
4518A880576M31104o7584J25952L86560n64224J350144A641472k62144j89440
4509A189888J641984p72096l94240O46656o78400J389056j157632P35232Q3968
$$ y = [2624512, 2972672, 3094528, 1192960, 2455040, 1878016, 1538048, 2325504, 3272192, 1951744, 2342912, 1640960, 2257408, 2598912, 2653696, 2273280, 2268672, 3814912, 2099200, 2718208, 2505728, 3529216, 1899008, 867840, 2334208, 2308096, 1052160, 2395648, 2338816, 2151936, 2192384, 2037248, 2096640, 1287168, 1923072, 1905152, 1129472, 2014720, 2249216, 2653696, 1747968, 2011136, 1965568, 580096, 2736640, 2024448, 2046976, 2186752, 2431488, 2728960, 1978368, 3022336, 2452992, 1983488, 2232320, 1799168, 2652672, 1880576, 2311680, 2244096, 2370048, 2756608, 2192384, 3542528, 1641472, 1379328, 1189888, 2831872, 2059776, 1665536, 2312192, 1633792, 3022848, 1865216, 2600448, 2684416]
4500B684416j019392m7104N37088J025536n23264m74112k05312l50208O40000
4491B267648j94560J375232j357312Q18176o28224k89280O44096p07072N52960
4482B481664K00192K76992o28736J150976j53600m93568M41856m16256m79232
4473B380288J341440o55872L02080J035264L67616j369600M83328k22720M7616
4464C709440q37120N28384J129984p81312o73280M94080N44768n76512J12128
4455C650560M1984P94624o79936l96800J221120k26304j263104J009664p28576
4446C423232J673728j314816O07744L02592L09760j038336P88992N48352r43104
4437D358144J3312L64544M47488k52928l65568r9840m44928J670656q06912j323520
$$ y = [2684416, 1665024, 1617920, 2155008, 3180544, 2657280, 2183168, 1977856, 1627648, 2267648, 2073088, 3448320, 2091008, 2909184, 2280960, 1991680, 2635776, 1928704, 2481664, 2681856, 2958848, 2330112, 3481088, 3327488, 2833920, 3275776, 2859520, 2380288, 3721728, 3065856, 3367936, 4403200, 4770816, 3401216, 3884544, 3661824, 3709440, 2872320, 3400704, 4530688, 3749376, 3076096, 3570176, 4114944, 3538432, 3650560, 3692544, 4487168, 3807232, 3410432, 4631552, 4405248, 3142144, 4151808, 3423232, 5096960, 3782144, 4389888, 4692480, 5002240, 3963904, 4752896, 5301248, 4358144, 4371456, 4736000, 5183488, 4930560, 4564992, 4465152, 4020224, 5690880, 4883968, 3560448]
4427C560448p92576J123840l02080M33664j79712m88960J070592q00768k12480
4418C411968Q43264K58560j142784L18976j276928Q35072k16576P14752j79200
4409C567104L65568o31808J156608j196032M56704P58272o08256q78080P70048
4400C760128k71360L97312q4992m91520J004544j223168P78240j146368J219584
4391C942400j778176J060864n74976M12672L82976j398784J823232n78560l34336
4382B957312J44384j306624j5360J321984n55008n0688l20512j35168J538048
4373C578368j706496N37088P62368n24800K38592J062912j135616k34496P55712
4364C333632J37728L65056k35008n68320P42912q26368A380864J769984R2672
$$ y = [3560448, 2767872, 3891712, 3589632, 4023296, 3843584, 3354624, 4425216, 3624448, 3411968, 4255232, 4513792, 3371008, 3689984, 2413056, 3248128, 3031552, 3746304, 3567104, 3932672, 3300864, 4457472, 3261440, 3718144, 4476416, 3868160, 2990080, 3760128, 3488768, 3886080, 3801088, 3309568, 4314112, 3090944, 3869184, 2722816, 3942400, 2164224, 3225088, 2650112, 3062784, 3445760, 2046976, 3870208, 3291648, 2957312, 3101696, 1795072, 1779712, 3101696, 2546688, 2496000, 2175488, 2040320, 3578368, 1871872, 2408960, 3171328, 2646528, 2885120, 3948032, 2812416, 2577920, 3333632, 3471360, 3836416, 3601408, 3033088, 3776000, 2949632, 1380864, 3150848, 3243520]
4355C243520j03424n32992Q21760M5568j077248K57024l30240Q6528P10656O00576
4345C721728j452544O5024K75456J77152N44768m3008Q8576A624064J822720J242112
4335D688896j741312j39264N17120J88928k31936Q47872N20704r49248K2528N6320
4325C780608q18176J07520L96800j21344k79552J589760q66816j150976J336320
4316C974144j061376P14752j07520q89344N57056j30560J141760j330688R96864
4307C865088O99904q93440O03648j347072k28352J041920K6112j019392j75104
4298B573312M78208j346560J184256p11680J751552j032704Q58624r06240N0176
4289B898944Q1920J228800p4752p97696o32320J653760o02624m97664J155072
$$ y = [3243520, 3140096, 2607104, 3428864, 3474432, 2397184, 2654208, 2323968, 2410496, 3121152, 3721728, 2269184, 2334208, 2609664, 2786816, 3331584, 3288576, 3377152, 1624064, 3446784, 4688896, 2947584, 2808320, 3325440, 3514368, 3282432, 4130304, 4651008, 3701760, 3724288, 3780608, 2962432, 3069952, 3466752, 3345408, 3065856, 4655616, 3788800, 2637824, 3974144, 2912768, 3627520, 3520000, 2630656, 3187712, 3057152, 4198912, 2868224, 3865088, 4564992, 3671552, 4275200, 2928128, 2699776, 3741696, 3767808, 2748416, 2573312, 3051520, 1704960, 2889216, 2177536, 3929088, 2896384, 3755008, 2848768, 2898944, 2980864, 4209664, 4134912, 3337216, 2704896, 4358656, 3756032, 3258368, 4413440]
4280D413440Q7040j742336K238464p0144r87648J68960n07904R26720r54368J005056
4270D577280o27712O57920j105408J396736p59296N84192K27328n65248J72032
4261D557824n2224P8336R56416n02784l584L95776L87072l14368q44800n2224
4251D605440P84896K89280l86048J572352k11968r56928O80960J40800P35744
4242G254528K65728q35584j4336J210880r70752o84032N26336l52768M33664L76832
4232G210496o34368j89440r88672J68960O81472J157120j135104k0992M03456
4223F652928k37056o1440O05184l45600O80448o19520j3824l68128k52416L71200
4213F411776J059328j183744O03648R52832n85216j109504N60128J35168o47168
$$ y = [4413440, 4500480, 2758144, 4996608, 4926464, 3938816, 4107776, 3599872, 4526592, 3572224, 4577280, 3949568, 4607488, 3502080, 4898816, 4139520, 4723712, 4951040, 4385792, 4557824, 4505600, 4583936, 5540352, 5037568, 5033984, 5429760, 5816832, 5502464, 4657664, 4605440, 5390336, 5679616, 5293568, 6865920, 6653952, 5697024, 6377984, 6518784, 7254528, 7520256, 6684672, 6670336, 7881216, 6910464, 6226432, 6752768, 6400000, 6833664, 7210496, 6576128, 6386688, 5398016, 5566976, 6248448, 7405568, 6270464, 6249472, 6652928, 6415872, 6354432, 6959616, 6614016, 7294464, 6674944, 6661120, 6292992, 6040576, 6411776, 7471104, 6287360, 6891008, 7843840, 7258624, 6149120, 6709248, 6844416, 6197248]
4204F197248k9696K09920N35040o11840m39296R33888m31616n98528n6832L73248
4194F081536l89632R43616k68288l65056k21184O93760o05184j39776J459712
4185G189504r83040j44384K83648o0928K67776j23904o41024J18784k17088R1136
4175E780480N37600o01088j968128Q39168R90208j223680J660416K33472j857024
4166D391424K39616J803264j295360p42912J585664j87392j515008K83136M18816
4157D981248J281024j384448R41568r84576M85376J062400r09312k24768k35008
4148E013504J575424k34496o50240R728N36064l20512k99520J187840j839616
4139D978176L5328J566720k43200K91328r93280M67456P02976p01440M20864M21376
$$ y = [6197248, 6167552, 6377472, 6912512, 6300672, 5861376, 6795264, 6363648, 5765120, 5708288, 6081536, 5691904, 6635520, 6367232, 6002176, 5780992, 6474752, 5869568, 5729792, 7189504, 6206464, 6062080, 6345728, 6284800, 6552576, 6428672, 5787648, 5906432, 5689344, 5780480, 6318080, 5716992, 3748864, 4588032, 5578240, 4354560, 6014976, 6248448, 4391424, 4631040, 6434304, 5138944, 4396032, 5981696, 5794304, 4279296, 4562432, 4981248, 6262272, 4877824, 5819392, 4834816, 5320192, 6382592, 5473280, 5248512, 5013504, 6588928, 6354432, 5704192, 5713920, 6249984, 5929472, 5629952, 6817792, 4978176, 5013504, 6580224, 6337024, 6628352, 5635072, 6102528, 6805504, 6104064, 6524928, 6946304]
4129F946304J130496k207232O95296p1168K78528J534464q30976k0992L51232
4120G805952J271296r91232J90976P28576M1984K53952k4576q59648n02272J933824
4110I848832L1744l58912p66464L34336R94304j491968J537536M43904M5568j451008
4100I167872Q23296k06336k66240k76992N901312o582784Q65280J194496j871360
4091H748544L38944n25824K316288r97888J000960j584128M31104j104896L97312
4082I020416P20896J32608j64352Q0384n23776K20160n12K18112J139200l93216
4072A0449920r70752J221632j867776J784832L2768q01280R63584q38656K4064
4063I998336R8304K85696J31072l21536j8944n14560o83520J268224k8672m73600
$$ y = [6946304, 8076800, 5869568, 6564864, 6493696, 6772224, 8306688, 7475712, 7454720, 7805952, 9077248, 8086016, 8276992, 9005568, 9047552, 9301504, 9276928, 8417280, 7915008, 9848832, 9880576, 9521664, 8755200, 9089536, 10083840, 8591872, 10129408, 10573312, 10618880, 9167872, 9991168, 9784832, 9518592, 9241600, 15142912, 8560128, 9425408, 10619904, 8748544, 9087488, 8561664, 10877952, 9880064, 10881024, 9296896, 9728000, 8623104, 9020416, 9741312, 9873920, 9709568, 9789952, 9266176, 9486336, 9485824, 9703936, 10843136, 10449920, 9479168, 10700800, 8833024, 10617856, 10650624, 9849344, 10812928, 9974272, 9998336, 10096640, 10382336, 10513408, 10191872, 10172928, 9658368, 8974848, 10243072, 10214400, 9740800]
4053I740800Q84224R32864K022912J608704L457024J119232M464640L00544j111552
4044B3419392n642752m744704j846784k370560K95936j48992j98656o18496k23232
4035G921152j148928J550336k45760p19872N99040M75648j064960L93728l90656
4026G369728n28384m17280O32832Q6016L8912j037312m49536K69824P74656K23744
4016F963200k02240N33504j676288J321984q91904n75488K714112k019840J217536
4007G384576o51776p94112J344512p93600k08896J75104M8640K09408O33856l58400
3997F989312r88160Q1408K20160p59808R44128K33472O16448q77056M02432K96960
3987G159296J93024j490432J94560M78208K78528O65600J36704m27520R42080
$$ y = [9740800, 10625024, 11557888, 13580800, 15189504, 18646528, 19765760, 24230400, 24530944, 23419392, 17776640, 13031936, 11185152, 8814592, 9110528, 8961536, 8762880, 8144384, 7921152, 6772224, 8322560, 8076800, 7356928, 7955968, 8431616, 7366656, 7760384, 7369728, 6841344, 6424064, 7056896, 7142912, 7181824, 6144512, 5694976, 5964800, 6739456, 6963200, 6760960, 7294464, 5618176, 6940160, 6048256, 5472768, 8186880, 6167040, 7384576, 6732800, 5938688, 7283200, 6489600, 6280704, 6455808, 6504448, 6713856, 7347712, 6989312, 6001152, 6082560, 6302720, 5542912, 6487040, 6720512, 7336960, 6459904, 6862336, 7159296, 7352320, 5861888, 6056448, 6534656, 6813184, 7478784, 7615488, 7187968, 8130048]
3978H130048j190912R4720m92032P81824l82976p66464J478144Q00256j363968
3969G088640R0112L72736N25312o48192J266688n72416j303552J076736j142272
3960F753792L01568n98016p79776R23648l99872M46464j040384J71520P61344
3951F540288L5840l99360M92032p6288P9872j97120j00352n72928P63904M096
3941F569984k61120O47168L85024j242624J210368m94080M08576o32320P8848
3932F669824K52928L77856L78368l74272l69152N29920J116672r83040J369088
3923H968192k99008p56224q9088J057280j372672J680896j000448M51072Q46336
3914I486336m45440r40032J679360j21856o38976Q71424q00256R49760K27328
$$ y = [8130048, 6939136, 7033856, 6541824, 7323648, 6940672, 6174208, 7652352, 8452608, 7088640, 7178752, 7551488, 8076800, 7428608, 8695296, 8122880, 6819328, 7896064, 6753792, 7055360, 6457344, 5677568, 6601216, 6201344, 6647808, 5607424, 5778944, 6540288, 6576128, 6176768, 6668800, 6592512, 6672384, 6475264, 6374912, 5801984, 6565888, 6569984, 6308864, 6956032, 7341056, 6098432, 7308800, 6814720, 7223296, 6590976, 6669824, 6922752, 7300608, 7678976, 7304704, 6935552, 7465472, 8582144, 7599104, 8968192, 8669184, 7912960, 7823872, 8881152, 7508480, 9189376, 8188928, 8640000, 9486336, 9040896, 8100864, 9780224, 9658368, 9019392, 9890816, 9090560, 10040320, 10267648]
3905A0267648K52416L03616n10464P6800L58912J027584j836032O31296L98848
3896A0970624N80096N99040l3280k80064n50400J508352m58240P22944m18304
3887A2640768J7920j073664J547264r59488N37600l91168P74144j094656L42016
3878A2340736J90464m58752Q7040n49376N55520K07360j598464J286656M13696
3869A2474880k23744j118208J239552q71936J79200K06848n36064N89312j24416
3860A1815424n00736l40480Q63232N05856n67808m27520M37760P00416j092608
3851A1393536j5360k17600l25632L1232N46816j388032L072P98208l58912J64352
3841A0631680m38784j283584R5232Q33536p63904N95968n70880k26816n64224
$$ y = [10267648, 10520064, 10823680, 10313216, 10390016, 10748928, 11776512, 9940480, 10571776, 10970624, 11550720, 12149760, 12116480, 11836416, 11286016, 12794368, 12336128, 13059072, 12640768, 12658688, 11585024, 13132288, 12172800, 12710400, 12319232, 13093376, 11998720, 12340736, 12531200, 12072448, 12159488, 11610112, 12165632, 12372992, 10774528, 12061184, 12474880, 12251136, 11132928, 12372480, 11500544, 11679744, 11886592, 11350528, 11939840, 11815424, 11314688, 10974208, 11837440, 12343296, 11775488, 11347968, 11785728, 12486144, 11393536, 11378176, 11160576, 10834944, 10866176, 11412992, 10024960, 10028032, 10826240, 10467328, 10631680, 10192896, 8909312, 9004544, 9838080, 9074176, 9670144, 9099264, 8872448, 8308224]
3832H308224Q31488k83136j31584J30560l39968N4784n58592K71360Q27392r73824
3822H136704j033728J338368l5840L7376j006080j08032J016832j212416K17088
3813G350272l94752M47488j241088J121280m02944J58720K80064K68288j717248
3804E870080P88992J90464K40640r92256j39264L17440M37248n20192Q70912Q33536
3794G897600j879552J904128p79264k8160j53088k73920O92224L95264l17952
3785G457280p56224K14016R46176n9904j233920K184192j67936q38656J169920
3776H914944j031168R06752p43936m35200M76672J309696j469440K220544n84704
3767I564160k99008j6896Q14080j409024K269184k85696k24256l6352J755648
$$ y = [8308224, 9139712, 8856576, 8724992, 8855552, 8515584, 8570368, 8011776, 8283136, 9110528, 8136704, 7102976, 8441344, 8405504, 8442880, 7436800, 7328768, 8345600, 7133184, 7350272, 6955520, 7403008, 6161920, 7283200, 6880256, 7038976, 7319040, 7587328, 5870080, 6659072, 6849536, 7090176, 6097920, 5958656, 6276096, 6713344, 6193152, 7064064, 7897600, 6018048, 7922176, 7142912, 7114752, 6961664, 6687744, 7379968, 7775232, 7457280, 6701056, 6915072, 7861248, 7801344, 6567424, 8751616, 8583680, 7745024, 8914944, 7883776, 8790528, 8046592, 7611392, 8088064, 9397760, 7928320, 10148864, 9564160, 9265152, 9248256, 10062336, 8653312, 10922496, 10636800, 10412544, 10376192, 12131840]
3758A2131840O46144l09248l11808J027072J16736L13344p55200J718784p5264
3749A4502400P15264J84832r05728J655808M50560l8400R79968J366016J19296
3740A9030016J053184J629696J266176J211904M62848J388544K850304M81280
3732B9373952J086464J527808J000960J445888J092096K276864Q98560n26336
3724C8176256J432064P53152J23392J693184J146368N57056J348096K780672J058304
3715D9068544K525184K352128L176960L218432K980352M550656L496960O804992
3707G8174208P363072P519232P589888O608384P583744L564032l90656k405376
3699A15606528o773760j1371520j0948608j0859520j0661376j0288640o996480
$$ y = [12131840, 12777984, 12468736, 12156928, 13184000, 13300736, 13614080, 12858880, 14577664, 14502400, 15217664, 15402496, 14496768, 16152576, 16603136, 16564736, 17544704, 18910720, 19030016, 20083200, 21712896, 22979072, 24190976, 24653824, 26042368, 28892672, 29373952, 30460416, 31988224, 32989184, 34435072, 35527168, 37804032, 38702592, 38176256, 39608320, 40361472, 40484864, 42178048, 43324416, 43881472, 45229568, 48010240, 49068544, 51593728, 53945856, 57122816, 60341248, 63321600, 67872256, 71369216, 78174208, 85537280, 93056512, 100646400, 107254784, 114838528, 118402560, 118011904, 115606528, 108832768, 97461248, 86512640, 75653120, 64991744, 54703104, 47706624]
3692D7706624p011328n360640l517952l310592j705984k608128m84864j542656
3684B2164480r69216j565184l3280j963008P84896k417664l10272O34368n5808
3675A6269312k459648Q06912j80736m61312j423872L46624l01056K48832n15072
3666A2329984r61024L6352O85056o92224P16288j974272N93920k60608k76480
3657A0196992n69344r37472Q39680p10656Q92928j825280Q08448P4240l73760
3648H395776n31968k6624J408000j441792O16960k04800n86752o46656K08384
3639G190528L67616p51616M55680L15904l92704L48672o10304q07424Q12544Q13568
3629G742464k262528J028096j166848J099264n77024M20864O49216p27040q51456
$$ y = [47706624, 40695296, 35334656, 31816704, 28506112, 26800128, 24192000, 23707136, 22164480, 21195264, 19630080, 19596800, 17633792, 18418688, 16001024, 15690752, 16325120, 16269312, 13809664, 14616576, 14435840, 13974528, 12550656, 12897280, 12596224, 12845056, 12329984, 11368960, 11405312, 12090368, 11398144, 12114432, 10140160, 10734080, 10473472, 10196992, 9627648, 8690176, 9529856, 8819200, 9712128, 7886848, 8695296, 8769536, 8395776, 7863808, 7837184, 9245184, 7803392, 8420352, 8215552, 7628800, 6982144, 7190528, 7558144, 6806528, 7262208, 7578112, 7185408, 7534080, 6923776, 6116352, 6928896, 7742464, 5479936, 6508032, 5341184, 6440448, 5863424, 6284288, 6933504, 6206464, 5355008]
3620E355008Q01792r71264N72416L73760R79456j680384Q16640K6624j349120
3611D924928K05312k28352l14368N61152O23616m096q65792J505792r90208j536000
3601C881984P98720O78912j414144J659904L04128j239040p97696J369600l11808
3592D930560O20032r98912K278400j992704k50880L71200n29920N39136O16448
3583E583360j076736K05312R93280j562624P11680l00544J004032L32800M35200
3574F325760J64864J33632K47808Q86272L60960j140224Q36096J34144j10080
3565G839232m23424K76480k5600p33184P22432m06016J42848J530368K4576J33120
3555I080832J244672k38592J99168J610752n15072J200128k44224l11296M9664
$$ y = [5355008, 6156800, 5185536, 5757952, 6131712, 7111168, 5430784, 6247424, 6274048, 4924928, 5130240, 4901888, 4587520, 5148672, 5772288, 5768192, 4902400, 6408192, 5417984, 3881984, 4680704, 5359616, 3945472, 5605376, 5909504, 4670464, 3872768, 5242368, 4930560, 5550592, 4551680, 6830080, 4837376, 4586496, 4957696, 4427776, 4966912, 5583360, 4506624, 4711936, 5705216, 4142592, 4854272, 4553728, 5557760, 5890560, 6325760, 6490624, 6624256, 6872064, 7758336, 8119296, 6979072, 7815168, 7949312, 7839232, 7415808, 7692288, 7666688, 6933504, 7655936, 7249920, 7392768, 8923136, 8947712, 9080832, 10325504, 10086912, 10286080, 11896832, 11381760, 12581888, 12337664, 12026368, 12076032]
3546A2076032Q86272j153024j087488m84864j354752Q38656K07360L75808m70528
3537I833472J043968l70688J111552q54528m19840j75104L92192r41056Q44288
3528A0464256j122304M30592J047040j010176n69856J999872j812480R25696P68000
3519A1120640j56672k2528J443840J77664O92224J29024J059328p680l6864O25664
3509A5024640k21184n24800O08256j231872k179072L01568p75680l74784j348096
3500I278976K3040n20704J94560k85696m89472J756672j796096o65600R42592
3491H438272J90976j249792J185792j219584N52960N55008K21184P62368n15072
3482H922112J27488m3008M67456k8672j022976O79936K69824j87904j288192L67104
$$ y = [12076032, 12962304, 11809280, 10721792, 10236928, 8882176, 9720832, 9928192, 10304000, 9833472, 10877440, 10506752, 11618304, 10763776, 10343936, 10168832, 10561024, 9619968, 10464256, 9341952, 9772544, 10819584, 9809408, 9239552, 11239424, 9426944, 10352640, 11120640, 10963968, 10941440, 12385280, 12562944, 13255168, 13384192, 14443520, 14435840, 14398976, 15024640, 14803456, 14278656, 14886912, 13655040, 11475968, 11777536, 11001856, 10627072, 9278976, 9302016, 8781312, 8975872, 8690176, 8200704, 9957376, 8161280, 7495680, 8438272, 8629248, 7379456, 8565248, 7345664, 7898624, 8453632, 8674816, 9437184, 8922112, 9049600, 9006592, 9474048, 9445376, 8422400, 9102336, 9372160, 9184256, 7896064, 8263168]
3472H263168M8640o99904k77504q72448O01088p11680J65376M07552n01248j001984
3462E421056J591808j455104j51040J57696j00352J182720l2256j156096k84672
3453E173760M95104k37568o24128P33184p77728r00096Q89856R11872j052672
3444D611584M6080l90656Q20736k06336o75328J547264j165824J45920J0240q03840
3434C939840m3008k29888o46656J47456j75104K21184M53120m68992N60640j80736
3424C577856k72896O71232r69728R7792K4576j458176J226752L17440n01760q01280
3414A911808O77888l33312J435648j200640j62816J655296A541632J423360m02944
3405B562048j092608J210368O86080j531392M09600j3312R2160A039872q1920
$$ y = [8263168, 8311808, 7611904, 7334400, 6461952, 7063040, 6351360, 6516736, 6924288, 6423040, 5421056, 7012864, 5557760, 5406720, 5564416, 5464064, 6646784, 6614528, 5458432, 5173760, 5668864, 5431296, 4807168, 5540352, 4762624, 3862528, 4752384, 5664256, 4611584, 4657664, 4267008, 5087744, 4881408, 4206080, 5753344, 4587520, 4733440, 4743680, 3939840, 3896832, 3666944, 3020288, 3167744, 2992640, 3213824, 3666944, 3197952, 3758592, 3577856, 3304960, 3976192, 3006464, 3104256, 3128832, 1670656, 2897408, 3214848, 2713088, 1911808, 2589696, 2256384, 3692032, 2491392, 2328576, 3983872, 1541632, 2964992, 2562048, 1469440, 2679808, 3365888, 1834496, 2244096, 2230784, 2322944, 1039872, 957952]
3396I57952K413568j638400j43360J164288k73408R37472n78560j61280r44640
3387A733632J367552k07360n81120m84864o98880J398272p57248n35040L52256
3378A587200L80928o24640L88096J40288J293824A362944l89632J268736r33888
3369A308160K94400J332224j054720K54976k32960K84672l072r73824P53664P97184
3359B760704j256448j73568F22080J812480j171968J698816m21888j195520R60000
3350B304000L72224m76672j026560M14720L41504k65216m86912E80096R03680
3341A483776J012736o60992J36704N46304o53824Q69376n53472O89664p34208
3332B136064L86560R38496m09600p22944J28000M66944A77152J123840k86208
$$ y = [957952, 3371520, 1733120, 1589760, 2754048, 2480640, 3418112, 2839552, 2678272, 1733632, 3101184, 2893824, 2312704, 1827840, 1128960, 2527232, 1769984, 1234944, 1587200, 1968128, 1343488, 1731584, 1871872, 3165696, 1362944, 973312, 2242048, 1308160, 1602560, 2934784, 1880064, 2135040, 1902080, 2186752, 2183680, 1209856, 1963520, 2760704, 1504256, 1330688, 622080, 2434560, 1262592, 2961408, 2539520, 1344000, 2304000, 2676224, 2199552, 1172992, 1587712, 1929216, 1664000, 1177088, 580096, 1483776, 2496512, 1835520, 1972224, 2518528, 1864704, 2734080, 2180608, 2870272, 2136064, 2522624, 3461120, 3051520, 2328576, 2456576, 2923520, 177152, 1300992, 1014784]
3323A014784Q43264n5808M75136j026560R48736l89120O40512q02816Q4992K21696
3313A954816F71744R75872l61472J70496R0624F40512j56672J505280l31776B07360
3302A095168K81600O32832k23744P6288p59296N53472l48160N81120j6384q65280
3292A007616L26144k44224O49728k74944J3312j24416K40128C86560O35392O07232
3282A629184A65376J555968l70688F75328R67680P14240p82336K80064D78208
3272A286656J63840o77376O60480m88448R19552N09440I80480j27488K54464K1504
3262A128960l3792E0688Q05376J01888N26848o53312O62016j94048C22048J225216
3252A547264G59808K48832R14432R5232p67488L68640m85888C78880J15712N99040
$$ y = [1014784, 1858048, 1802240, 2277376, 1250816, 2199552, 1810432, 2450944, 1648128, 1733120, 1954816, 671744, 1647616, 1286144, 1456640, 1547264, 640512, 483840, 1989120, 1657344, 207360, 1095168, 1376768, 2009600, 1785856, 1862144, 1102848, 1656320, 1308160, 1889280, 1872896, 1007616, 1333760, 1089536, 1739264, 1464320, 1477632, 1353216, 1593344, 386560, 1021952, 1629184, 165376, 1721344, 1350656, 675328, 1643008, 2357248, 1574912, 1854976, 478208, 1286656, 1450496, 773120, 1433600, 945152, 1864704, 2374144, 980480, 852992, 1107456, 1128960, 1095168, 50688, 856064, 957952, 1484800, 831488, 1493504, 1299456, 322048, 1547264, 759808, 1008640, 1923072, 2018304, 1250816, 1619456, 1133568, 378880, 494592, 1093632]
3242A093632j99680o9632L09760D67456J236992B10432J94560N65760N47328J72032
3232A690112a28000G12192L69152O09280o97344b18624D63872K33472N66272g680
3221A474048n28896J95072k96448K91840l54816K59072C86048P02464k30400k30912
3211F27200N06880Q77568F35904d33152A316864K9696J47456C20512L97312O22080
3201A339904j55648C65568J228288F52800K6112Q46848j7408a73568A210368k37056
3191I73312N46304I8816O92736l48160M61824N52448n22240C85536K42688J016320
3181A644544H01280b56000F34880B55488M86912l50720M94080m07040J33120Q45312
3171A457152F13888k37568J755136C59936E4784Q94464O22080D43904P49056j62304
$$ y = [1093632, 893952, 824320, 1134080, 467456, 1704448, 210432, 404992, 970752, 1518080, 1690112, -128000, 712192, 1081344, 1690624, 993280, -218624, 463872, 697344, 1263616, -7680, 1474048, 945152, 1140224, 843776, 1135616, 780800, 1039872, 386048, 1088512, 858112, 627200, 1134080, 2011648, 635904, -433152, 1316864, 1346560, 1494016, 320512, 717824, 1339904, 1184256, 365568, 1593856, 652800, 678912, 1525760, 1508352, -173568, 1210368, 973312, 1519616, 98816, 791552, 443392, 905216, 1457664, 935424, 385536, 628224, 1644544, 801280, -256000, 634880, 255488, 742400, 391680, 885760, 478720, 611840, 1457152, 613888, 376320, 2131456, 359936, 54784, 949248, 1571328, 443904, 1192960, 1030656]
3161A030656N12l5328j73568m5056O12864h82688A104384c80416A743360e3760
3150A001984B46784d7104C98848f82496L27168A100800A12640J021952D60800
3140B78528R15968c6864G33184J60768h04352H70400l58912M38784O7584A18272
3129A334784P72608d04480D73600J228800D28544K73408l38432d06528N7856O0416
3119b88256A204736E77536A44896J81248J39776J65376N10464m02944J241088
3110A979904i7792B23232A1776J555456n35552A67936P82336j20320M7104j9456
3100H57600J33120L19488m77696Q61696k560M29056o15424J112576j106944J365504
3090B876416n67296J728000Q0384J088000N72928J455104J24928N00224L15904
$$ y = [1030656, 1031168, 995840, 822272, 777216, 1390080, -882688, 1104384, -380416, 1743360, -53760, 1001984, 246784, -47104, 398848, -682496, -355328, 1100800, 112640, 1134592, 460800, 278528, 1194496, -36864, 733184, 893952, -804352, 870400, 511488, 950272, 1017856, 118272, 1334784, 2107392, -404480, 473600, 1702400, 428544, 701952, 363520, -406528, -348672, -288256, 1204736, 577536, 144896, 326144, 465920, 631296, 1141760, 738816, 1979904, -97792, 223232, 11776, 1567232, 1031680, 167936, 950272, 829952, 877056, 857600, 990720, 1310208, 832512, 1694208, 1691648, 2120704, 1505280, 2617856, 1510912, 2876416, 2309120, 4037120, 4117504, 5205504, 5778432, 7233536, 7358464, 7858688, 8174592]
3081H174592j296384R77408n09440K66752Q83712J219584J232384J768448K148352
3072A4865408M115456J7486848L475456J9233792J9895296K1391872J9576832
3065A20040960o541312m1160192l1312896j5703040p988736n032960j584640j247744
3057I469440k78016j493504k084864O96320j072128J116672L01056k54464J052672
3048G453184l71200k01216p94112j387520n79072l58912o12352J393664M97664
3039E040128j640448m88448J32608L37920o30784J87392l6352n20704J90976k77504
3029B294784k06336k72384L87072p5776l11808N65248L9936j80224k36032J68960
3019B173440j50016o31808J606144o62016o02112N96480m50048J152512p71584
$$ y = [8174592, 6878208, 7855616, 7346176, 7612928, 8496640, 9716224, 10948608, 12717056, 14865408, 18980864, 36467712, 39943168, 59176960, 79072256, 100464128, 120040960, 113499648, 72339456, 41026560, 25323520, 17334784, 12301824, 10717184, 9469440, 9191424, 7697920, 5613056, 6309376, 5237248, 6353920, 6654976, 6400512, 7453184, 7081984, 6880768, 6086656, 4699136, 4120064, 3761152, 3148800, 4542464, 5040128, 3399680, 2911232, 3043840, 3381760, 2750976, 2938368, 2902016, 2381312, 2572288, 2294784, 2088448, 1816064, 2203136, 2127360, 1815552, 2380800, 2420736, 2240512, 2004480, 2173440, 2023424, 1391616, 2997760, 2335744, 1733632, 2330112, 1880064, 3032576, 2260992]
3010B260992k93376Q77568o62528j48992p49056M97664p94624P02976n47328P35232
3000A878528J09056o29248L70688l78880N17632k80064o79424P77728C37920Q95488
2990A233408B85696J366528E44256P96672L07712j25440L78880r6768H31488P39328
2980A570816k56512C09248L96800J043968j37728m5568l58912q1408M48512E80096
2969H73472l18976l3792P680Q72960B86208M77696j9456k32960J378816m52096
2959A438208C24096M33664K10432Q81152F47680O88640l82464k25280C22560J006592
2949A329152f91712A716736m25984m01920R50272l39968g9360I3184Q02816j83296
2939G12704M55680N15584m00384A49504J049088j44896k36544J3824k29376N25312
$$ y = [2260992, 1967616, 2845184, 2182656, 2033664, 1284608, 1782272, 987648, 1690624, 1143296, 1878528, 1987584, 1358336, 1729024, 1350144, 1867776, 1587712, 908288, 1686016, 337920, 1233408, 285696, 1652224, 544256, 1340928, 1648640, 1523200, 1902080, 1805312, 831488, 1570816, 1314304, 309248, 706048, 1750016, 1612288, 1566720, 1207808, 1126400, 1574912, 580096, 873472, 554496, 520704, 528384, 1401344, 286208, 763904, 744448, 511488, 1890304, 1438208, 324096, 757760, 968192, 1849344, 647680, 1336320, 953856, 728576, 322560, 1329152, -691712, 1716736, 1290752, 888832, 1839104, 1499136, -79360, 93184, 896000, 712704, 1168384, 1683968, 1283584, 149504, 1198592, 1053696, 817152, 830976, 601600, 1126912]
2929A126912e87264C06176d42880H60672K89792n07392N17632l70688P15776C94752
2918F14912M67968A99680J317888k63168N00224a6896A524224m04992C29728K59584
2908E89312K44224A90976K07360L64032J16736b66752E84192c2768A001472J00352
2898A101824k64192E8880L36896N19168B0480M24448j7408O12352B90816K60096
2888E50912A90464C1744O01088L36896D54656O5536k22720L96800l33824J126400
2878A486848A99680j3824O58944D0960M61824K8672B45760P26016B38080r8816
2868A39264b45248F95296A44896M86400J53600C83488b58560B35520L89120a8432
2857H65280j37216j71520j62816M95616n0176j79712k90816K24256b16064B30400
$$ y = [1126912, -587264, 306176, -442880, 860672, 1150464, 643072, 1160704, 790016, 1505792, 394752, 614912, 1082880, 199680, 1517568, 1254400, 1754624, -16896, 1524224, 1119232, 329728, 589312, 833536, 190976, 398336, 762368, 879104, -266752, 584192, -32768, 1001472, 1101824, 837632, 58880, 395776, 914944, 20480, 444928, 427520, 1039872, 290816, 550912, 190464, 31744, 632832, 969728, 454656, 520192, 297472, 694272, 360448, 1486848, 199680, 185856, 844800, 40960, 502784, 531456, 245760, 971776, 238080, 139264, -245248, 695296, 144896, 631296, 784896, 383488, -258560, 235520, 624640, -18432, 865280, 728064, 556544, 393728, 889344, 839168, 659456, 368640, 592896, -216064, 230400]
2846D6080K54976N26848l33312b01216A050624r2672A34656N67296m3008j68960
2836D89984L00032Q72448n90336j62304J34144k63680a10592A362944J54112D17280
2825B68800p2192P64416b23232A654784n18656N85216j51040n17632J037312r04704
2815A185280A78688R43104A75104J077760J14688A01888J631744p98720J034752
2806A969664j54112k35008M5568J24416K1504k01216j66400P49056p52640j21344
2796A279488C0208h26880A800192C85024L36896C8400L88096j98144K11968L68640
2786H08960N23264B84672j1264N79072a136640I16480A88416P7824R09312k04800
2776I70752k82624a20832A37216K26304J452032F4000b91328B050560D77696O20544
$$ y = [46080, 301056, 827904, 494592, -201216, 1050624, 957952, 134656, 701952, 658944, 489984, 790016, 1662464, 1072128, 909824, 1043968, 780288, -110592, 1362944, 1517056, 417280, 268800, 196608, 961024, -223232, 1654784, 1136128, 1721344, 1570304, 1052672, 2089984, 1185280, 178688, 1121792, 175104, 1252864, 1367552, 101888, 1733632, 934912, 1969664, 1815552, 1580544, 1626112, 1750528, 1772032, 1570816, 1404416, 2153472, 1400832, 1279488, 30208, -826880, 1800192, 385024, 721920, 38400, 426496, 228352, 440320, 808960, 1332224, 284672, 273408, 852480, -1136640, 916480, 188416, 266240, 1175552, 970752, 688128, -120832, 137216, 363520, 1815552, 64000, -291328, 2050560, 477696, 1098240]
2766A098240k80576l08736A99680R52832B62656A15712b03264N5296k67264H91392
2755H43264l28192G0144a3312F00576O4512j68960L32800J55136R3696a03936
2744A343488j63328C15904P17824l90144B62144K48320O56896B32960J431040
2735A664000n17632A62816M15744d29056E88800p4240P4752i98912H20736B64704
2724b91840J01888e1200k16576D11648Q8064K61120q704k07360D7616M31616O1952
2713E41184M1472O3488K048P04000l47136d81792a6384D19840h09984I25184j61280
2702G63904N42720%K10944d00384R1648f8096B04288d92032E90336c92704B40128
2690c02592A244160d78208D18304O46144f20032G17824B43712j03936E0688i9840
$$ y = [1098240, 817664, 508928, 199680, 1152512, 262656, 115712, -203264, -147968, -415232, 891392, 843264, 515072, 70144, -13312, 600576, 665088, 496128, 828928, 984064, 1077760, -103936, 1343488, 1180160, 315904, 1033728, 643584, 262144, 510464, 1167360, 232960, 1664000, 1146368, 162816, 578560, -429056, 588800, 514560, 589312, -998912, 820736, 264704, -291840, -189952, -51200, -267776, 411648, 499712, 760832, 752128, 544768, 47616, 479232, 541184, 582656, 646144, 648192, 1352192, 1005056, -481792, -16384, 419840, -809984, 925184, 763904, 1306624, 1306624, 1517568, -400384, -308736, -68096, 204288, -492032, 590336, -392704, 240128, -302592, 1244160, -478208, 418304, 1064448, -620032, 717824, 243712, 139776, 50688, -99840]
2679A66400J178112n23776a08032E31968I8304f72768E76000j47968b58560G3216
2668c02080H43776A36704n7344O5024g90528F79424f7584j79712D95104A2800
2657f70720D84864L98848j10080B29888N85216M85888a16736E56032N12b74432
2646c94240l84512B31424K048R11872f95296k97472H46848C83488P28576d12672
2635A39264a010176H42752C32288Q44800b90304J6384B4064b36032f9632C92704
2624c78368G24992B68288E2736L67616k3040g168j17760m19840d8128D60800F8608
2612a22880j21344I2160b96960A54112Q01280a24416A168384a012224b37568D00384
2601B05312K33472M33152l10784b57024A1264K59072d44416C72736C5328O02624
$$ y = [166400, 1344512, 820736, -108032, 531968, 98304, -672768, 576000, 428032, -258560, 73216, -302080, 843776, 136704, 79360, 144384, -790528, 679424, -67584, -247296, 495104, 12800, -670720, 484864, 883712, 773632, 229888, 815104, 1300992, -116736, 556032, 556544, -274432, -394240, -778752, 231424, 233472, 1145344, -695296, -992768, 846848, 383488, 1112064, -412672, 139264, -1010176, 842752, 332288, 1177088, -290304, -273920, 24064, -236032, -69632, 392704, -378368, 724992, 268288, 52736, 420352, 397312, -7168, -124928, -544768, -48128, 460800, 68608, -122880, -244224, 92160, -296960, 154112, 955392, -124416, 1168384, -1012224, -237568, 400384, 205312, 438784, 871936, 561152, -257024, 11264, 270336, -444416, 372736, 35328, 637952]
2591F37952J18272b33472D56704b03776P2192D37248P6800b53440C73760P6800
2581D50560j22368K86208d80768D72576K95936d10624k83648A159168E62176c34848
2570A79712b08384o04672D29568c05664F24128b11968B71872a68448K048I17504
2559a36704m2496n5296j60768m04992B46272L85536A88416f38976K20160A579008
2548a66912B88768n5296M56192c15904A6896e65248A3312R29792k74432i9840
2537b91328A04448a33632E67808h16640A278976F9120a30048m21376k39616l06688
2527a097728f0928A00864b5600A487360k41152n85728a98144C60960a56672G33184
2516c43552A07008a097216A80224N32992l14880j62816h30464M03456l6864b4576
$$ y = [637952, 756224, -233472, 456704, -203776, -131584, 437248, 514048, -253440, 373760, 450560, 328192, 614400, -480768, 472576, 768512, -410624, -694272, 1159168, 562176, -334848, 179712, -208384, -813056, 429568, -305664, 624128, -211968, 271872, -168448, -166400, 917504, -136704, -179200, -234496, -395264, -800256, 246272, 631808, 188416, -638976, -418816, 1579008, -166912, 288768, 233472, 689664, -315904, 16896, -565248, 13312, 943104, 668672, -99840, -291328, 104448, -133632, 567808, -816640, 1278976, 69120, -130048, -551424, -791040, -1097728, -60928, 100864, -25600, 1487360, 1246208, 660480, -198144, 360960, -156672, 733184, -343552, 107008, -1097216, 180224, 713216, 398336, 235520, -830464, -427008, -463872, -24576]
2505g92576b29376R9328m03456A65376a43360A658880F65600F2976R51296j38240
2495H76032b49344p01440L84000H03328B97472c29728F50240d62848G66976A57696
2484b48320C88608O15424A4336f5536A097216n43232d2496I77408B12480b65728
2473c66080E32992a348096A00864J60256M64896A3824J32608d39808E39136b74432
2462A72544b66752A79200N9904f97344m1472b52416E92384g12192A590272c08224
2451a10592j171968A1264h2944L584C70688A11104J137664k52416C63008b03776
2440H69376P7824b9696C30240J024A18272N7344b61632A133056f5024H00768A29536
2428A351168B95936J86880j90464L20512a14688@E45280d57216F2976J46944a45920
$$ y = [-792576, -229376, -130048, -533504, 165376, -143360, 1658880, 665600, 62976, 1014272, 876032, -249344, -950784, -566784, 803328, 297472, -329728, 650240, -462848, 766976, 157696, -248320, 388608, 1004032, 14336, -65536, 1097216, 553984, -42496, 977408, 212480, -265728, -366080, 532992, -1348096, 100864, 261120, 726016, 13824, 146432, -439808, 539136, -274432, 172544, -266752, 179200, 239104, -697344, -738816, -252416, 592384, -712192, 1590272, -308224, -110592, -1282560, 11264, -82944, -79360, 370688, 111104, 1248768, 996352, 363008, -203776, 869376, 947200, -29696, 330240, 331264, 118272, 175616, -261632, 1133056, -65024, 800768, 129536, 1351168, 295936, 482816, 292352, 612864, -114688, 0, 545280, -457216, 62976, 209920, -145920]
2416e52448K29376f6560q67840E17120A68448R96352f03136A64864M608d01408
2405A013760D40320K048A41312L06688b85696E13024M81280m89472b17600n62176
2395g79776G6288K28352a77152I49760C8400K35520L80416e63200K65216G36768
2384c94240C14880g88480K10944E08928g44448K81600A36704g08096A01888g39840
2373a14176A02400O64064f28224A294336C85024a095680H90368B44224h33536
2363h3456n05344b15040i2160m31616C21024J10592M9152B21696e73440H58624
2352a06496A85856c07712C70688P17312d30592m09600F2976d04992Q0896A30560
2341b81600n85216C11296L31264a32096j762816A110528C47648J88928B42688
$$ y = [-552448, -323072, -66560, -934400, 517120, 168448, 1164800, -603136, 164864, 169472, -401408, 1013760, 440320, 442368, 141312, 448000, -285696, 513024, 994304, 504832, -217600, -779776, 76288, 304640, -177152, 949760, 38400, 273920, 654336, -563200, -297984, 736768, -394240, 314880, -788480, -577536, 508928, -744448, -462848, 136704, -708096, 101888, -739840, -114176, 102400, 766464, -628224, 1294336, 385024, -1095680, 890368, 244224, -833536, -83456, -588800, -215040, -92160, -523776, 321024, 431616, 480768, 221696, -573440, 858624, -106496, 185856, -307712, 370688, 1088000, -430592, -840192, 62976, -404992, -324096, 130560, -281600, -866816, 311296, 642560, -132096, -1894912, 1110528, 347648, 536576, 242688]
2331H20224B36544J18272e43232d0960p00416i9840j095680M72064n44768A181184
2320D17792a32608H704f1440j94560B5600M68480a213440J32096b52416l51232
2310f03648m40832c46624E62688e19168p6288J26976B13504f90176L42528g168
2299c49696E30944a052672E3248a03424o29248D35200a62816B18624o6560K40128
2289C92192h22272K32960F9632d72576L6352a89952k22720A94048e632q67840
2279h73472C08224f656D70016n632k19648i76384a82784k79040d5056C91168e50912
2267b17600j104384K57024o3488J33632K88256j23904c26656n92384A017344C65568
2256G59808A45920e48864H97024i73312I71776f75840J48480J30560A40288N23264
$$ y = [820224, 236544, 354816, -543232, -40960, -741376, -99840, -1195520, -723456, -1268224, 1181184, 417792, -132608, 8704, -61440, -256000, 25600, 494080, -1213440, -1081344, -252416, -603648, -1044480, -346624, 562688, -519168, -595456, -468480, 213504, -690176, -347648, -7168, -349696, 530944, -1052672, 53248, -103424, -732672, 435200, -162816, 218624, 152064, 392192, -822272, -589312, 69632, -472576, -436224, -189952, -412672, 194048, -5632, -873472, 308224, -6656, 470016, 464384, 244736, -976384, -182784, -461824, -45056, 391168, -550912, -217600, -1321984, -1064960, -1128448, -994816, -706560, -830464, -326656, -919040, 1017344, 365568, 759808, 145920, -548864, 897024, -973312, 971776, -675840, -527360, -396800, 140288, 663552]
2246F63552b22720C0720g11168o9120f6560o51776J99168F50240A12640a57184
2235a46944j302016N26848M59264m93056J86368H61184c23584j9456j020416b14016
2224b45760H28416C25120B7648b30912l56864b9184I8304K22720d90496B01728
2213c84000l9936E6832d28544m12672a98144C14368l2256J42848g96672B95936
2202a050112H89856B79552e24800n1200g4752F35904E1200b69312g3728j08544
2192a82272L9936G40864h97536l44576b12992D52608A05472a8944m89472G2192
2181d5568A59744h00768H37120k23232L7888a835520C95264L95264j67936J25952
2171G48544G2704J006080a15200q11520A103872d01408A56672M7104c74272O8096
$$ y = [663552, -222720, 30720, -711168, -780288, -66560, -718336, -519168, 650240, 112640, -157184, -146944, -1448960, -922112, -462848, -955904, -769536, 861184, -323584, -343040, -1363456, -214016, -245760, 828416, 325120, 27648, -230912, -587776, -29184, 98304, 321024, -490496, 201728, -384000, -423936, 56832, -428544, -841216, -198144, 314368, 282112, 424960, -796672, 295936, -1050112, 889856, 279552, -524800, -576000, -74752, 635904, 51200, -269312, -73728, -182272, -142336, 740864, -897536, -1242112, -212992, 452608, 105472, -18944, -508416, 72192, -45568, 159744, -800768, 837120, 613888, 651776, -1835520, 395264, 790528, 622592, 748544, 72704, 1078784, -115200, -926720, 1103872, -401408, 156672, 203776, -374272, -306176]
2161c06176A03936J43872e43232B52928c67616J4336A175040k92352a324032A7920
2150b86208F63552M60288D18816L23072j70496F2976g4240r04192K38592L8912
2140g00928a99168I68704f15424K04288A041408j35168d91008k19136E82144k70848
2130C11296a5872B74944d60288P1680G28064j12640C04128b42688C94752c87584
2119I6768d48000c7888A47456K48320d24448J02912B86208c18464l23072o19008
2109a260544D01920b42176E20192A31072J138176A49504a16224k70336k6112a54112
2098g91040L72736E77536e80096j21856a43872C02080K77504b64192E38112I216
2087E0688i29792F49216b25280D74624a36704A83808M89984c59424B93376d52096
$$ y = [-306176, 103936, 247808, -543232, 252928, -367616, -353280, 1175040, 882688, -1324032, 17920, -286208, 663552, 1123840, 418816, 741888, 571392, 62976, -74240, -978432, -739840, -700928, -199168, 968704, -615424, -411136, 1041408, 906240, -491008, -710144, 582144, 311296, -15872, 274944, -460288, -388608, 728064, 615424, 304128, -242688, 394752, -387584, 96768, -448000, -37888, 147456, 395776, -424448, -321536, 286208, -318464, -641536, -1260544, 401920, -242176, 520192, 131072, 1269248, 149504, -116224, -386560, -412672, -154112, -791040, -418304, 577536, -580096, -701952, -143872, 302080, 579584, -264192, 538112, 9216, 50688, -929792, 649216, -225280, 474624, -136704, 183808, 673792, -359424, 293376, -452096]
2076e60128G36768d89984I37472e29408j65888L11296j49504G05536A02400N70880
2066F73280J448448g32672b64704J23904B00704b17088F7072J92000i8304l4816
2056a33120K3552o51776K3552D79232b05824C53792j02400b00704B30400C5328
2045B59072a083392i8304o74816K6112a63840G11168A21344L31776d50560j96608
2035f47168A24928f17472b28352o81472j2288D25984A90464a13664n29408a23904
2024c58400p93600c34848l28704L4304A74080D9152j7408h55040A39264N03296
2014F42560C04640g04000a07008e12j210880I10336K97472E82144e95456D68992
2003c18976D78208d93056J12128H42240g94624c43552O8608k53952E46816i47712
$$ y = [-560128, 736768, -489984, 937472, -529408, -695296, -384000, -533504, 705536, 102400, 673280, 2121728, -732672, -264704, -140800, 200704, -217088, 67072, 259072, -98304, -133120, -109568, -761344, -737792, 479232, -205824, 353792, 251392, -200704, 230400, 35328, 259072, -1083392, -98304, -773120, -747008, -163840, 711168, 121344, 453120, -450560, -647168, 124928, -617472, -228352, -909824, -922112, 425984, 190464, -113664, -643072, -123904, -358400, -1152000, -334848, -663552, -629248, 174080, 49152, 31744, -855040, 139264, 642560, 304640, -704000, -107008, -512, -1211392, 910336, 1207808, 582144, -595456, 468992, -318976, 478208, -493056, -380928, 842240, -794624, -343552, -274944, -528896, 546816, -947712]
1992e44768k71360E22240N15072a21344B28352b72896k11456F08256A15200L03616
1982D18816g21920F56896b68288A14688L27680J10592d3008o15936m04992c23072
1971d49024a71008l12832F69696a096192N05344J06496f4000F2976a13152k61120
1961c74272A71520J46432a159680F2976O2464K43712O86080I1648l584d11136
1950a173504A352192n39136d61824N1712j6384D35200m1472L55328d36736I59488
1939d75136b20672n44256J13152a50528E88800L86048H2944e87264F4512d65408
1928F21056A56160L70176h0896j1776C38432e86240G52640c98848l82976G49056
1917d54656I0624I216J57184P54688B15040J8944L67104f36416m09088l99872
$$ y = [-544768, -816128, 522240, 1037312, -121344, 228352, -272896, -484352, 608256, 115200, 418816, -721920, 656896, -268288, 114688, 442368, 552960, -43008, -658944, -1063936, -323072, -449024, -171008, -483840, 669696, -1096192, -590848, -484352, -64000, 62976, -113152, -374272, 171520, 317952, -1159680, 62976, 125440, 369152, 1055232, 91648, 88064, -411136, -1173504, 1352192, 813056, -461824, -410112, -426496, 435200, 393728, 749056, -436736, 959488, -475136, -220672, -764928, -651776, -150528, 588800, 974848, 82944, -587264, 64512, -465408, 621056, 156160, 526336, -80896, -92672, 338432, -586240, 752640, -398848, -781824, 749056, -454656, 90624, 9216, 166400, 921088, 215040, 233984, 601088, -636416, -1045504, -1445376]
1907a445376k06336P41888b45760P4240G40864K9184C69152a357824H5504J19808
1897B05312q9088K32960L0720e62688C10784c02080j385984f09280H06912k04800
1887F02112B46272h04352K39616J95072n17120m17792a00864c3280j68448D28544
1876A53088J52064e80096o10304B93376A38240R76896a579520b01216A271296
1866D80768J61792K43200a034240d34176B93888a687552D21888h14592c00544
1856a92000C61472a02912I06752b64704J32096n58080J95584j8944e2736o85568
1846g38304h3968E39136K06336A60768e56544F13376c15904Q704j156608e22752
1835a34144j2288E10464b01728C52768f7072l6864k6624J1776B57536e04320K35520
$$ y = [-1445376, -1651712, -909824, -245760, -171520, 740864, 770048, 369152, -1357824, 85504, 205312, 116224, 349184, 379904, -562688, 310784, -302080, -1688064, -609280, 806912, 602112, 246272, -804352, -564736, -369664, -886784, -1304576, -100864, -33280, -201728, 428544, 153088, 305152, -580096, -1190400, 293376, 138240, 1115136, -1579520, -201216, 1271296, 480768, 642560, 885760, -1034240, -434176, 293888, -1687552, 421888, -814592, -300544, -192000, 361472, -102912, 906752, -264704, -132608, -690688, -495104, -514048, -52736, -738304, -83968, 539136, 745472, 160768, -556544, 613376, -315904, -307200, -1463808, -522752, -134144, -146432, 510464, -201728, 352768, -67072, -103936, -130560, -118784, 257536, -504320, -268800]
1824b68800k75968q15104G62880l42016b27328r48224b11456o6048A155072H4992
1813D86400g66976p30112F13888e1712r89184b18112I09312a008128A185280e45792
1802c40480a54624A222144c88096n52448B42688a36192N5296n48352j60256a76640
1791h40192A1264b17088n74464A28000f80448A08544h64768L14880a28512D42368
1780b88768q77568C35360N63200M6592B40128M34688i8816C10784a7920A57696
1769b04800n3248I0624a48480j272320B14016d18304A144832b35008p8848J16736
1759a97120L8400k15040J76128B03776M42880f05696G168K0992i39520L96800
1749e42720p30112D32640A12640N08928b83648A79712H2944g29600b24768m5056
$$ y = [-268800, -544768, -1359872, 762880, 420864, -227328, -1175552, -211456, -277504, 1155072, 84992, 486400, -766976, -1497088, 613888, -51712, -1040896, -218112, 909312, -1008128, 1185280, -545792, -340480, -154624, 1222144, -388096, -940544, 242688, -136192, -80896, -629248, -789504, -176640, -840192, 11264, -217088, -791552, 128000, -680448, 108544, -864768, -549888, -128512, 442368, -288768, -1166336, 335360, 898560, 945152, 240128, 674816, -98816, 310784, -17920, 157696, -204800, -258048, 90624, -148480, -1420800, 214016, -418304, 1144832, -235008, -313856, -197120, -158720, -373760, -197632, 203776, 646656, -605696, 7168, 28160, -939520, -542720, -1272832, 432640, 112640, 621568, -283648, 179712, 82944, -729600, -224768, -269824]
1739b69824C2256h91904B21696i55904a52576n95968b8672n95456B35520M31616
1729F67136a56672q1920n75488A34656Q32512h8576j98144e7344E2224c4816o00576
1718f35392A07520M57728e82144A093120D89472a68960n66272A348608d23936
1708g30624B04800a25952j031680D22400c19488B82112L64032N3248c48160m65408
1698h13568G36768d73088l85536g4752C29728g37280b18624i0624o01600a23392
1687F22080e19680m84864f4512A033216l13344b55488l64032J51040a12128k12992
1677c25120D19328g23456J32096l73248H4480K65728b83648n01760o58944b83136
1666c15392h0384q16128E8880g10144q192A03936h4992C66592d12672I9840M12672
$$ y = [-269824, 32256, -891904, 221696, -955904, -152576, -748544, -28672, -624128, 235520, 667136, -156672, -238592, -814080, 134656, 967168, -88576, -286720, -57344, 52224, -34816, -635392, 107520, 565248, -582144, 1093120, 489472, -168960, -735232, 1348608, -423936, -730624, 204800, -125952, -1157632, 422400, -319488, 282112, 646144, 699392, -348160, -813568, 736768, -473088, -858624, -74752, 329728, -737280, -218624, -90624, -692224, -123392, 622080, -519680, -1004544, -64512, 1033216, 719872, -255488, -619520, -468480, -112128, -325120, 419328, -723456, -591360, -964608, 84480, 350208, -283648, -785408, -1444352, -283136, -315392, -80384, -896512, 58880, -710144, -718336, 103936, -84992, 366592, -412672, 99840, 512512]
1655E12512g64928B66240h02304L54816Q3456J32096o38976B49344c13344E4272
1644g19360D15744f05696F40000k41152g9872k20672C90656c08224E43232P16800
1634A260032b58560C7888b50880p30112a82272F05696a69472j536o37952c06688
1623H99072f73792c21024l584C10784Q9088M92032C4304a63328q3968l0208h192
1611E29920c32800k18112A34656J104896i06240i9328k67264C74784j4848A40288
1600B81600a60256k53952r7792B5600f14400K0480k86720M00384A20832g78240
1589d1472B7648R3696d28032B9696P7312a66400l57376j48480F58432k67776Q7552
1578D78208e22240N0688J66400P9360c4816j18784F37440a005568a19296q3968
$$ y = [512512, -764928, 266240, -802304, -447488, -364032, -231936, -870912, 249344, -313344, 54272, -719360, 415744, -605696, 640000, 398848, -79872, -300544, 390656, -308224, 543232, 1260032, -258560, 37888, -250880, -980992, -182272, 605696, -169472, -171008, -808960, -306688, 899072, -673792, -321024, -324608, 310784, 399872, 891904, 34304, -163328, -247296, -277504, -8192, 529920, -332800, -550912, 134656, 1239552, -906240, -99328, -366592, 374784, 359936, 140288, 281600, -160256, -414208, -512000, 25600, -614400, -593920, -880640, -480256, 120832, -778240, -41472, 27648, 121344, -428032, 29696, 107008, -166400, -523776, -672256, 658432, 390656, 478208, -522240, -471552, -305152, -225792, -34816, -153600, 637440, -1005568, -119296, -203264]
1568b03264D64896b037760B10432e47840b560k33472k68288E5808K76480e26848
1557b36544k12992A122304c15904p02464q1408K43712c57376J36704J09056C54816
1546F34880i00608C94752J167360A9456g67488J14176N2224D96640k37568b62144
1535c5328j55136m04992b15552A47456c48160B27328Q25856a147392A69472P84896
1525I54368e89312J02400c8912j58208j7408N6320C2256a39776m07040B39616
1514C2256K84672a431552H9600d63360n17632C23072J6896a46432j89952L5840
1504c00544m608E44256A30048f21056K0480A131008d38272k88256F34368c47648
1493a375744B45248b04800I32352a96608o14400B99520i24672n4784B5088M34176
$$ y = [-203264, 464896, -2037760, 210432, -547840, -2560, -236032, -504320, 55808, 332288, -526848, -236544, -449536, 1122304, -315904, -1018368, -1099776, -856064, -357376, -220672, -111616, 354816, 634880, -900608, 394752, 1562112, 19456, -767488, -653312, -601088, 496640, 259072, -262144, -35328, -190464, -595456, -215552, 147456, -348160, 227328, 1053184, -1147392, 169472, 954368, -589312, -486912, -38912, -197120, -214528, -158208, 32256, -139776, -546816, 239616, 32256, 316928, -1431552, 89600, -463360, -980992, 323072, 339968, -146432, -336384, -300544, -305152, 544256, 130048, -621056, -600576, 1131008, -438272, -726528, 634368, -347648, -1375744, 245248, -204800, 932352, -196608, -811008, 299520, -924672, -979456, 25088, 459264]
1483D59264e61152a28512j201152H15104a87904A49504M6592f47680E18144E0176
1472a93536q6016A16736k5600b08384d7616F79936a39776m97664C17952K4576
1462C42528h4992j354240L49184b78016o16448o71232E89824C1744e6320j024
1452e7344A88928q8576P7312a52064l93216k98496a45920F6048J53088c38944
1441e70368j65888K51392A58208i04192J48480j34656a89952r96864b19648c9424
1430a526272E76000a5360k50880n13536j41824B78016P20384c85024B21696a015808
1419C35872f40512b35520l34336k81600D58240k08384i728D25472e25824a29024
1408i95328B48832e82144J5360G50080i67168A495552c2256o98880K83136B14016
$$ y = [459264, -561152, -128512, -1329664, 815104, -187904, 149504, 196096, -647680, 518144, 50176, -193536, -279552, 116736, 91136, -208384, -47616, 679936, -139776, -637440, 317952, 342528, -84992, -1439232, -1090048, -278016, -894464, -1565696, 589824, 31744, -56320, -57344, 188928, 100352, 177664, -152064, -545280, -843776, -145920, 66048, 219136, -338944, -570368, -736256, -484864, 158208, -904192, -755712, -890368, -189952, -1186816, -219648, -39424, -1526272, 576000, -15360, -266240, -779776, -921600, 278016, 998400, -385024, 221696, -1015808, 335872, -640512, -235520, -569856, -851456, 458240, 249856, -9728, 425472, -525824, -129024, -995328, 248832, -582144, -566784, 750080, -967168, 1495552, -32256, -731136, -448000, 214016]
1397C80416f18496K43712k19136o5024P0144d4032I36448A80736q5504a051648
1386E46816a642496B54464e12000K23744j141248c46624D80768N3760i728l16928
1376c26656o71744A87904K1504g69536C89120k3552c82464k58560b70848J21856
1366a48992G17824f01600a2800j72544k66240C85536c03616G6288b18112B04800
1355d02432B40128O99392l09760c86048A064960H9088a40288j46944L1232G16800
1344B92864a608704g49568b89280M0448e4272k39104k20160D25984D5056c64032
1333a125376A266688o06208G6288K40128M17280C32288c47648F59968d36736J57184
1323b79552m19328a72032A63328K64704a044992b96960j52064F83520i95328A33120
$$ y = [380416, -618496, -374784, -593920, -658944, -588800, -44032, 936448, 180736, 95232, -1051648, 546816, -1642496, 254464, -512000, -288256, -1429504, -346624, 480768, 534528, -9728, -326656, -998400, 187904, 209408, -769536, 389120, 365568, -382464, -641024, -270848, -148992, 717824, -601600, -12800, -185344, -451584, 385536, -303616, 76288, -218112, 204800, -402432, 240128, 939520, 629760, -386048, 1064960, 89088, -140288, -287232, -256000, 716800, 292864, -1608704, -749568, -289280, -248832, -54272, -293376, -513536, 425984, 45056, -364032, -1125376, 1266688, 660480, 76288, 316416, 733696, 332288, -347648, 659968, -436736, -279552, -698880, -172032, 163328, 428032, -1044992, -296960, -449024, 683520, -995328, 133120]
1312d93568A39776J44896d10624J024L4816j269760Q02304b04288n91360A3824
1301e41696M6080A18784d27008G98208i7280i216F94784e56544B49344K4576c60960
1289h16640M3008L20000J54624q5504h4992o00576B17088c06688M2496B0480g56736
1277B60096f1952j138176A029120A27488h86784M38784r91232C88608h98560D33152
1266b26816K7136b4576j316352A69984L8400c37920l6352C93216a005568a536
1255B01216J6896O68160D23936q704f144k65728C96800d34688A024O03648O7584
1244F72256e27360b60608p26528L89632K47808j67424A34656N82656o1440d27520
1233A04448J62304i8816A825280C68128b34496C9424L08736K81600L03104g8848
$$ y = [-493568, 139776, 284672, -410624, -409600, -374784, -1644544, -842240, -204288, -795648, 13824, -541696, -495616, 118784, -427008, 798208, -97280, -9216, 694784, -556544, 249344, 273920, -360960, -816640, -773632, -453632, -299008, -384512, -84992, -685568, 217088, -306688, -264192, 20480, -756736, 260096, -61952, -1200128, 1029120, 127488, -886784, -448000, -1439232, 388608, -898560, 433152, -226816, -199680, -24576, -1340928, 169984, 208384, -337920, -374272, 393216, -1005568, -1536, 201216, 218112, 886272, 423936, 415232, -6144, -271872, 396800, -434688, 1024, 604672, 672256, -527360, -260608, -987136, -597504, -349696, -517120, 134656, 717312, 655872, -427520, 104448, 266752, -98816, 1825280, 368128, -234496, 39424, 348160, 629760, 932864, -78848]
1222c35872q3456h9088j18272j47968r4208j11616h4480E3248a60256l29216j024
1211d90496B14016M80768c9424p51616J22880C15392N76000a444352A51040e60128
1200E55520a25952c7888r82528C0208f54848b65216a22880A547776A37216J17760
1190B54976N30432B39104a26976n8880l25632b04800A085952a410048D52096a80224
1179a62304o02624E66272e96480Q1408f2464D55168c36384F69184e0688l30240
1169c80928k53952D63872a6896n05856F21056J7920Q09984d31104l01056D86912
1158e92384p19360E4784a262592E02272A62304b03776J1776P8848B63168d97152
1147H9600d60800A44384R9840J25952d58240E52960e86752G31136a285120E35040
$$ y = [-335872, -419328, -89088, -207360, -355328, -449536, -561152, -84480, 53248, -160256, -489472, -490496, 214016, 694784, -39424, -791040, -668160, 315392, 891392, -1444352, 151040, -560128, 555520, -125952, -37888, -1020416, 30208, -654848, -265216, -122880, 1547776, 137216, 254976, 785408, 239104, -126976, -185856, -511488, -204800, 1085952, -1410048, 452096, -180224, -162304, -764928, 566272, -596480, -515072, -62464, 455168, -336384, 669184, -50688, -380928, -634880, 463872, -16896, -522752, 621056, 638976, 1448960, -431104, -732160, 486912, -592384, -1311744, 54784, -1262592, 502272, 162304, -203776, -192000, -113152, 263168, -497152, 89600, -460800, 144384, 244224, 370176, -458240, 552960, -586752, 731136, -1285120, 535040]
1136h6016H1920N97504a2800B74432e59104k87744b24256m65408g8336p4752P680
1125a45408f144C3280c77856a60768k5600F29760A17248M6080b6112F27712j66912
1114D60800d18304m83840b95424E5296h00768o35904f0416B47296M3520L97312
1104F88128d55168B78528K12480J17760f6048k95424R0624h7040L0208E42720
1093b64192B8672c47136@F144a78176j18272J28512j77152H27392D9152b47808
1081C70176c00544l17440H96000H8576d50048a43872B02752a079808A29536J16224
1071B45760c55840H7040C4816L76832i6768C74272i3696A68448f1952A291264
1060A37216d07040F01088F6560N08928e20192m608p3216H6528g56736c31776G3728
$$ y = [-86016, 81920, 679424, -12800, 274432, -559104, -846848, -224256, -689664, -78336, -153088, -145408, -6144, 33280, -377856, -160768, -186368, 629760, 117248, 163328, -26112, 627712, 460800, -418304, -902144, -295424, 55296, -800768, -1436672, -60416, 247296, 290816, 688128, -455168, 278528, 491008, 608768, -66048, -361472, -270848, -87040, -56832, 542720, -264192, 28672, -347136, 0, 6144, -178176, -296448, -167936, -345088, 827392, 49152, -247808, 370176, -300544, -617984, 896000, 88576, -450048, -143872, 202752, -1079808, 129536, 245760, -355840, 87040, 34816, 411648, -96768, 374272, -93696, 168448, -61952, 1291264, 137216, -407040, 601088, 66560, 575488, -520192, -524800, -598016, 86528, -756736, -331776, 73728]
1048c17440A019392c05664A052160B34496I1136g37792L38432j42848d0448E67296
1037h37632a28512k41664l07200L29216H65280b69824A13152M06528i93792D54144
1026b85696B11456g91552A36192l1744d51584J8432J89440l37920K36032a48480
1015A037312f74816n92896d12672C7888g60320C58912h58112G92064b17600B96960
1004e1712l89120k20160J58208D99200A93024c12320o11840I7792e86240l40992
994i27232c92704o45632C54816D2496K72384a110528J97632L00032E12J50016
984A50528O34368d49536a35168C072J23904K15040j58208f75328i9328H6016J059328
973A145344M86400d40320A80736M65920e72928a64864j18784a5872A12640a651200
$$ y = [-317440, 1019392, -305664, 1052160, 234496, 91136, -737792, -399360, -542208, -40448, 567296, -837632, -128512, -370176, -677376, -348160, 865280, -269824, 113152, 519680, -993792, 454144, -285696, 211456, -791552, 136192, 104448, -451584, -433152, -243712, -581632, -345600, -148480, 1037312, -674816, -1267712, -412672, 37888, -760320, 358912, -858112, 792064, -217600, 296960, -51712, -440832, -660992, -502784, 499200, 193024, -312320, -924160, 97792, -586240, -927232, -392704, -1038336, 354816, 42496, 314880, -1110528, -912896, -612864, 512, 150528, 784896, -449536, -135168, 3072, 126976, 342016, 183808, -675328, -99328, 86016, 1145344, 1631744, -440320, 180736, 646656, -572928, -164864, -283648, -15872, 112640, -1651200]
962A40288b2528B9696b90304C63520h84736a55136j19808j64352b16064H15616
951h81152M14720C86560A89440n5296i90720B89792g03488A103360a12640F656
940d28032D15232C7376a000448c01568J42848B98496b63168m87424b15552A90464
929G87968a249792J5872G6800P88480d86400G9872O53824B01216f58944a50528
918b02240l8400o64064e3248j69984k51904N9392E2736i6768C21536h77568L16416
907e61152C63520f09792K10944h9088G53664b18112k06336A80736a78176p56736
897i34912g168j35680A080832E34016A32096a3824p64928n7344E3760c10784F7072
885D5568b92864p14240J65376a6896r72800C26656g18848J74592N7344j02912
$$ y = [140288, -22528, 29696, -290304, 363520, -884736, -155136, -274944, -439296, -216064, 815616, -881152, -466432, 386560, 189440, 134144, -990720, 289792, -703488, 1103360, -112640, 6656, -428032, 415232, 37376, -1000448, -301568, -158720, 298496, -263168, -750592, -215552, 190464, 787968, -1249792, -1233920, 76800, 865280, -486400, 79872, 733696, 201216, -658944, -150528, -202240, -240640, -904704, -53248, -223232, -475136, -415744, 52736, -96768, 321536, -877568, -561152, 363520, -609792, -398848, -89088, 753664, -218112, -424448, 180736, -178176, -934912, -7168, -142848, 1080832, 534016, 132096, -13824, -778752, -836096, 53760, -310784, 67072, 45568, -292864, -1007104, -841728, -16896, -989696, 326656, -718848, -544256, -486912, -589824]
875e89824A74592Q33024G0144P3216f4512o99392m85376N51936R4208G680d13696
863a74080j24928O5536m6592F36928c94240k77504A76128g4240A15200a97632
852D27008A93024c53792j22880P1680J18272D18816A99680L7376F7584h2944E52960
840I5744M90496a16736E20192k24256d62336H52480j98144d71040J98656A96096
829B06848E1200Q67328p1168a32096o10304D12672b84672B20672P6288e30944
818B96448a038336A19808f96320l15392F40000b12480j72032C0720d06528D42368
807A62816h21760E98528i45664E8368M28544j63328a718272D00896d01408B06336
796d04992K048q39168e9392k38592e2736l77856B20672J20832c66592C12320b70336
$$ y = [-589824, 174592, 1007616, 70144, 143360, -64512, -763904, -1249280, -697344, -603136, 7680, -413696, -174080, -299008, -233472, -280064, 636928, -394240, -671744, 176128, -74240, 115200, -197632, 427008, 193024, -353792, -476672, -404992, -286720, 418816, 199680, 237056, 67584, -82944, 552960, 95744, 586240, -116736, 520192, 295936, -462336, 852480, 654336, -471040, -272384, 196096, 206848, 51200, 918528, 847360, -132096, -742400, 412672, -284672, 220672, 296960, -530944, 296448, -1038336, 119808, -696320, -1011712, 640000, -212480, -384512, 30720, -406528, 442368, 162816, -821760, 598528, -945664, 58368, 486912, 323584, -1718272, 400896, -401408, 206336, -404992, -402944, -1242112, -59392, -297984, -52736, -430592, 220672, 341504, -366592, 312320, -270336]
784G168d15232m52608a7920k04288N7344j124352B24768e54496G2192c14368A015808
772h02816e12j366016E12d05504C79392a032704l86560e97504B76992b86720B2528
760a50016j56672E58592b56000m9664H70912m14208a68960l15392K06336A32608
749E7344g70560a35680E22752K33472c02592h2944m55168i2160o57920a09568
738A225728E53984j89952J87392f95296o9632D1984L55840f79936A38752c64032
727H27392F5536R2672N31456a20320F30784A54112J65888g77216J66400b03776
716a323008A98144Q99584a00864c1232C18464j56672K44224q9088F9632Q44800
706I14432d68480r54880D27520g04000g8848C77856A31072P28064g70048a09568
$$ y = [7168, -415232, -867840, -17920, -222208, -164864, -1289216, 224768, -554496, 72192, -314368, 1015808, -802816, -512, -1366528, 512, -405504, 379392, -1032704, -1419264, -597504, 276992, -286720, 22528, -150016, -306688, 558592, -256000, -305664, 870912, 456704, -168960, -484352, -278016, 132608, 57344, -770560, -135680, 522752, 756224, -302592, -82944, -538112, -92160, -750080, -109568, 1225728, 553984, 364032, 551424, -695296, -764928, 41984, 397824, -679936, 138752, -364032, 827392, 65536, 158208, 689664, -120320, 630784, 154112, 320000, -777216, -610816, -203776, -1323008, 198144, 1097728, -100864, -31232, 318464, 161792, 406016, 316928, 69632, 914432, -468480, -1423360, 427520, -704000, -78848, 377856, 131072, 859136, -770048, -109568]
695E92896f29760a27488m88960b92352A090048a483264A100800c00544A98144
685b81088l10784j01376n49376d65920n65760b26304D45952g06048a50528n78560
675g29088F80448b80064m86912A10592K19136A14688M76160M096B46784e65248
664f32832K33984D47488A45920a08544n6832o46144E9392g79264b32960n56544
654g89504c10272n12512E120M35200g51104J54624F80960g7312E89312p8336M44928
643I55904a46432j7920B2528c50720B70336M67968f38976j47456I7792J81760
633B79552A09056f94784K76992n98528c4304k01728d0448j43872j026560a50016
622f76864o4000L35872J32608r0112g9360r48736F59968b7136k50880B26304d64896
$$ y = [592896, -629760, -127488, -616448, -292352, 1090048, -1483264, 1100800, -300544, 198144, -281088, -591872, -693248, -1242624, -465920, -1031680, -226304, 445952, -706048, -150528, -729088, 680448, -280064, -766976, 110592, 329728, 114688, 590848, 594944, 246784, -565248, -632832, -398848, 447488, 145920, -108544, -165376, -811520, 59392, -779264, -232960, -789504, -310272, -822784, 5120, 440320, -751104, -596480, 680960, -77312, 589312, 510976, 955904, -146432, -164352, 22528, -350720, 270336, 738304, -638976, -786432, 97792, 279552, 109056, -694784, -417792, -1016320, -34304, -236032, -40448, -184320, -1210880, -150016, -676864, -740864, -404992, -272384, -362496, -79360, -1028096, 659968, -27136, -278016, 226304, -464896]
610h92928F4512d56192F63040b69824m25984C07712b51392m16256I61536h76544
599c3280l9936B86720J7408a110016N48864k64704I5744c08224d1984F30784d71040
587h49408B57024A22368J01376C1232h49408b92864h6016i216j029632K40128
577g98720j00352a97632B6624N37600g6288r50784K84160E89824J58208g78240
566B93888o3488a25952E18656f44608o0928k88768a76128q71936G68512j63840
556F04672d64384o04160G0144Q1408F4512a62816F56896b26816j60768n6320B32448
544I7280a74592p44960J90464l02080b23744n8880q1920C22560a47968n98016
534g45984b21696Q8576E50912f17984k2528b61632P2704C97312M8128K74432e81632
$$ y = [-892928, 64512, -456192, 663040, -269824, -695808, 307712, -251392, -667648, 961536, -876544, -33280, -73216, 286720, 304128, -1110016, -561152, -825856, 95744, -308224, -41984, 630784, -471040, -849408, 257024, 122368, 223744, 31232, -849408, -292864, -86016, -9216, -1038848, -798720, -899072, -197632, 26624, 564224, -76288, -1027072, -742912, 589824, 748032, -778240, 293888, 230400, -125952, 518656, -644608, -705536, -994304, -176128, -1048064, 768512, 604672, -464384, -1068544, 70144, 151552, 64512, -162816, 656896, -226816, -387584, -443904, 232448, 97280, -174592, -919552, -729088, -1031168, -223744, -282624, -364544, 322560, -147968, -745984, -221696, -133120, 550912, -617984, -640512, -261632, -188928, 397312, 445440, 719872, -581632]
522B19136d00384a36192E79072k87744e34528P0656l46112K31424A062912d55680
511D48000b51904K4576C584a46944j98656m25472A38752J85856e24288e9904I0112
499a100288C54304c00544G34208A33632A6384P0144g34720D00896O144e30432
488b9696E5296e88800j46432L8400K17088j314816c42016a23904i728E16608h58112
476a62304k56512l69152C09760d12672j0752e5808o76352G7824c70688F2464b77504
464i51808J76128K2016C47136d92544K29888A54624a068032B58560K13504b89792
453E34528Q18176f81472b52416F58944A47456a016832C38432g4240n84704b23232
442h33024D19328a11616A1776c42016j89952J83296n90336A54624Q02304D22912
$$ y = [219136, -400384, -136192, 579072, 291328, -534528, -463872, -809984, -578560, 1062912, -455680, 448000, -251904, -227328, 3584, -146944, -345600, -771072, 138752, 324608, -524288, -59904, 90112, -1100288, 354304, -300544, 734208, 133632, 16384, 86528, -734720, 400896, 407040, -530432, -29696, 55296, -588800, -735232, -696832, -479744, -1794560, -342016, -123904, -9728, 516608, -858112, -162304, -418816, -787968, 309760, -412672, -423424, -55808, -732160, 77824, -370688, 62464, -277504, -951808, -775680, -753664, 347136, -492544, -262656, 154624, -1068032, 258560, 472064, -289792, 534528, 1352704, -681472, -252416, 658944, 147456, -1016832, 338432, -74240, -658944, -223232, -833024, 419328, -111616, 11776, -342016, -531968, -348672, -939008, 154624, 956928, 422912]
431f8096m63360I1136b30912l51232C64544e13024F91712a05472q08448B91840
420i9328D09088a54112p0144A58208b560m71552E21728B29888p7312M99200c06688
408c28704o74816G35232P23968b01728P0144c0208D8640f10304B47808g88992
397f36928n35040E18656f33344C03104f14400B81600R3696N05856i86624E41184
386b19136E31968a314304B65728J14688a649152O20032P7824A093120c76832A44384
375B29888j12640M37760g96672A086464n18656b10432A79712a66912d4032n73952
365f17984c02080O2464q9600a19296A48992f42560q0896F84032d03456k88256
355f91712A81760K29376J54112h32512K02240G35232B30912b28352A73056J38240
$$ y = [-68096, -531456, 91136, -230912, -582144, 364544, -513024, 691712, -105472, -913920, 291840, -99328, 409088, -154112, -224256, 158208, -2560, -474112, 521728, 229888, 152576, 651776, -306688, -328704, -1003520, 735232, 1459200, -201728, -131584, -30208, 48640, -610304, 247808, -788992, -636928, -1171968, 518656, -633344, 303104, -614400, 281600, 375296, 881152, -986624, 541184, -219136, 531968, -1314304, 265728, 380416, -1649152, -1029120, -951296, 1093120, -376832, 144384, 229888, 117248, 555008, -796672, 1086464, 567808, -210432, 179712, -166912, -44032, -617984, -302080, -239616, -329216, -119296, 148992, -642560, -723456, 684032, -403456, -691712, 181760, 411136, 565248, -832512, -630272, 735232, 230912, -228352, 173056, 311296]
345C11296f05696k8672a37216C85536K5088k9696b44736M3008m45952m92032e28896
333A18784m4544i92256e632r7280k99008E19680c08224G51104B30912f75328F33344
321C0720e18144J32096J88928C10272c6352n55520A3824K65216e9392j051648
311a111040c71712J04960C2256O0928N7344e35040H23296c33824B89280a1776
300C10272A48992a71008n90848h5504n83680K66752B25792i1648G5776N39648
290F15424P8336c1744E53984i20064c84512c584l50720j12128k89792F07232L37920
279I45152f12864G22432f2464%F7072g8848k08384j024C25632J04960a37216C46112
266e00736D9152i52320c33824p69536E1712M94080c77856k48320f0416F12864
$$ y = [311296, -605696, -634368, -137216, 385536, 410624, 380928, -244736, -201728, -647680, -1139712, -528896, 118784, 74240, -992256, -5632, -102912, -401920, 519680, -308224, 751104, 230912, -675328, 633344, 30720, -518144, -386048, -197120, 310272, -36352, -591872, 13824, 279040, -59392, -1111040, -371712, -266752, 32256, 93184, 150528, -535040, 823296, -333824, 289280, -11776, 310272, 148992, -171008, -761856, -85504, -669184, -402432, 225792, -91648, 75776, 615424, 693760, -31744, 553984, -920064, -384512, -3584, -354304, -466432, -756224, 607232, 945152, -612864, 722432, -62464, -62464, 67072, -78848, -287232, -288256, 325632, 430592, -137216, 346112, -500736, 49152, -952320, -333824, -1103360, 51712, 545792, -377856, -626176, -60416, 612864]
255A46944J7920i39008D7616R4208E2736K10944a019904L68640C19488a49504
244D8128a47456j46432m45952D62336a51040E8368d50560e5296A2800c96800A042944
232a135616N27872o656q56064b17088k39616A68960g78240J32608D23936d11136
221F30784b35008c6352r3696k5088D57216e74464A073664B65728a24928o19520
211g44448c07200H05376a14688F98880c04640n120I1136a7408o8096A88416e95968
199h4480k9184p2704C4816h59136E61664b5088D20352i51808A33120a322496d54656
187A17248K94912K64704j62816a90976D29056N23776d02432C41504a003520A15200
176a97120A01888J92512b05312q27904d11136a45408o10304l0720B22208b49856
$$ y = [146944, 164864, -939008, 47616, 141824, 52736, 263680, -1019904, -651264, 319488, -149504, 48128, -147456, -293888, -739840, 462336, -151040, 58368, -450560, -55296, 12800, -396800, 1042944, -1135616, -607744, -614400, -1470464, -217088, -456704, 168960, -778240, -645632, 423936, -411136, 630784, -235008, -36352, -130048, -155136, 457216, -574464, 1073664, 265728, -124928, -744448, -307200, 805376, -114688, 698880, -304640, -309760, 91136, -17408, -85504, 188416, -595968, -84480, -113664, -186368, 34816, -859136, 561664, -25088, 420352, -951808, 133120, -1322496, -454656, 117248, 412160, 676864, 514048, -190976, 429056, 952832, -402432, 341504, -1003520, 115200, -197120, 101888, 294400, -205312, -1033216, -411136, -145408, -755712, -786432, 222208, -249856]
165F49728C8912h15616D58240f95296A047552A92512e29920F83008J40800e08416
154C56352A44384%a04960r05728b93888D31616D9152b50368G60832L67104n01760
143F26176d00896k14016H6528g50592L08736R8304D48000C2256L52768e84192
132c36896g4752l59424A003520B63680e60128A64352i2160r79968D15744e08928
121f79424a46432I1136l3280b26816G82336D0448J7920j9968a113600C57888a96608
109a40800j6896A46432J77152i14432K34496a38240M4032l34848a5872A295872
98e70368J13152M5568j01376K32960o75840J10080a73056D78720b75968F36928
87B79040J90976f75328l2256A22368a536j469952a00864C78880f25152f7584n78560
$$ y = [649728, 38912, -815616, 458240, -695296, 1047552, 192512, -529920, 683008, 823808, -508416, 356352, 144384, 144384, -104960, -1010688, -293888, 431616, 49152, -250368, 760832, 1127936, 626176, -400896, -614912, 86528, -750592, -441856, -343552, 448000, 32256, 385024, -584192, -336896, -74752, -434176, 1003520, 263680, -560128, 164352, -92160, -1072128, 415744, -508928, -679424, -146432, 91136, 57856, -226816, 782336, 40448, 58368, 38400, -1113600, 357888, -196608, -140800, -157696, 146432, 323584, -914432, -679936, -138240, -94208, -429056, -15872, 1295872, -570368, -457216, -411648, -513024, -280064, -955904, -845824, -173056, 478720, -275968, 636928, 279040, 470016, -675328, -707584, 122368, -1536, -1471488, -100864, 378880, -625152, -67584, -646144]
76f46144q69888A144320e73440K35520A056768A71520b43200B84672a668096d51072
65a82272n95456C17440b7136q55552D19840b76480J02912D48000j37728j32096
55A78176f07232E63200a60768D39296h16640a92000D25472N98528e80096m70528
45a050624E01248r4208b64192l58912E92384e33504n82144d12160D096K56512
35B60608r9840N24800k69824d63360O8096p23968c22560j77152I26720A17760
24E85216f92224A213952A42848O12352q7552h03840D89472b75456A38240K14016
14C52256J74592B00704J85344c88608A82272J098752e13024m85888E27872c9424
3C24096i23136K60608K69312
$$ y = [-646144, -1516032, 1144320, -573440, -337920, 1056768, 171520, -243200, 284672, -1668096, -451072, -182272, -777728, 317440, -27136, -882688, 419840, -276480, -173568, 448000, 310272, 178176, -607232, 563200, -160768, 439296, -816640, -192000, 425472, 1024000, -580096, -1050624, 501248, 407040, -264192, -623104, 592384, -533504, -1115648, -412160, 4096, 260608, 160768, 685568, 415744, -463360, -395264, -1119232, -322560, -499712, 926720, 117760, 585216, -692224, 1213952, 142848, 755200, 667648, -803840, 489472, -275456, 138240, 352256, 526848, 200704, 386048, -388608, 182272, 1281024, -513024, -998912, 527872, -39424, 324096, -923136, -662528, -393216]
0c93216
$$ y = [-393216]
##END=
