##TITLE=1324
##JCAMPDX= 6.0         $$ Bruker NMR JCAMP-DX V2.0
##DATA TYPE= NMR SPECTRUM
##DATA CLASS= XYDATA
##ORIGIN= NUTS EXPORT
##OWNER= Administrator
$$ 1.72 TOPSPIN		Version 2.1
$$ 2016-02-23 12:20:00.230 -0800  Administrator@X
$$ Compression mode = diff/dup
##.OBSERVE FREQUENCY= 90.275459
##.ACQUISITION MODE= SIMULTANEOUS (DQD)
##.ACQUISITION SCHEME= undefined
##.AVERAGES= 16
##.DIGITISER RES= 22
##SPECTROMETER/DATA SYSTEM= 
##.PULSE SEQUENCE= zg30
##.SOLVENT NAME= None
##.SHIFT REFERENCE= INTERNAL, None, 1, 14.51876
##AUDIT TRAIL= $$ (NUMBER, WHEN, WHO, WHERE, PROCESS, VERSION, WHAT)
$$ ##TITLE= Audit trail, TOPSPIN		Version 2.1
$$ ##JCAMPDX= 5.01
$$ ##ORIGIN= Bruker BioSpin GmbH
$$ ##OWNER= Administrator
$$ $$ E:/data/jwist/nmr/1324/1/pdata/1/auditp.txt
$$ ##AUDIT TRAIL=  $$ (NUMBER, WHEN, WHO, WHERE, PROCESS, VERSION, WHAT)
(   1,<2016-02-23 08:51:18.108 -0800>,<Administrator>,<X>,<jcamp>,<TOPSPIN 2.1>,
      <fromjdx created from
       E:\data\jwist\nmr\uniandes\1324
       data hash MD5: 8K
       4A 4E 65 8E A2 BF D0 66 CE 6E 4E 58 8D 7D F8 A2>)
$$ ##END=
$$ 
$$ $$ hash MD5
$$ $$ 76 EE 09 01 E3 21 62 F5 2B 5F D0 4F F7 29 21 9E
##$RELAX= 
$$ Bruker specific parameters
$$ --------------------------
##$DU= <E:>
##$EXPNO= 1
##$NAME= <1324>
##$PROCNO= 1
##$TYPE= <nmr>
##$USER= <jwist>
##$ACQT0= 0
##$AMP= (0..31)
100 100 100 100 100 100 100 100 100 100 100 100 100 100 100 100 100 100
100 100 100 100 100 100 100 100 100 100 100 100 100 100
##$ANAVPT= 1
##$AQSEQ= 0
##$AQ_mod= 3
##$AUNM= <au_zg>
##$AUTOPOS= <>
##$BF1= 90.275459
##$BF2= 400.02
##$BF3= 400.02
##$BF4= 400.02
##$BF5= 400.02
##$BF6= 400.02
##$BF7= 400.02
##$BF8= 400.02
##$BYTORDA= 0
##$CFDGTYP= 0
##$CFRGTYP= 0
##$CHEMSTR= <none>
##$CNST= (0..63)
1 1 145 1 1 1 1 1 1 1 1 1 1 1 1 1 1 1 1 1 1 1 1 1 1 1 1 1 1 1 1 1 1 1 1
1 1 1 1 1 1 1 1 1 1 1 1 1 1 1 1 1 1 1 1 1 1 1 1 1 1 1 1 1
##$CPDPRG= <>
##$CPDPRG1= <>
##$CPDPRG2= <>
##$CPDPRG3= <>
##$CPDPRG4= <mlev>
##$CPDPRG5= <mlev>
##$CPDPRG6= <mlev>
##$CPDPRG7= <mlev>
##$CPDPRG8= <mlev>
##$CPDPRGB= <>
##$CPDPRGT= <>
##$D= (0..63)
0 1 0 0 0 0 0 0 0 0 0 0 0 0 0 0 0 0 0 0 0 0 0 0 0 0 0 0 0 0 0 0 0 0 0 0
0 0 0 0 0 0 0 0 0 0 0 0 0 0 0 0 0 0 0 0 0 0 0 0 0 0 0 0
##$DATE= 0
##$DBL= (0..7)
120 120 120 120 120 120 120 120
##$DBP= (0..7)
150 150 150 150 150 150 150 150
##$DBP07= 0
##$DBPNAM0= <>
##$DBPNAM1= <>
##$DBPNAM2= <>
##$DBPNAM3= <>
##$DBPNAM4= <>
##$DBPNAM5= <>
##$DBPNAM6= <>
##$DBPNAM7= <>
##$DBPOAL= (0..7)
0.5 0.5 0.5 0.5 0.5 0.5 0.5 0.5
##$DBPOFFS= (0..7)
0 0 0 0 0 0 0 0
##$DE= 6.5
##$DECBNUC= <off>
##$DECIM= 2432
##$DECNUC= <off>
##$DECSTAT= 4
##$DIGMOD= 1
##$DIGTYP= 12
##$DL= (0..7)
0 120 120 120 120 120 120 120
##$DP= (0..7)
150 150 150 150 150 150 150 150
##$DP07= 0
##$DPNAME0= <>
##$DPNAME1= <>
##$DPNAME2= <>
##$DPNAME3= <>
##$DPNAME4= <>
##$DPNAME5= <>
##$DPNAME6= <>
##$DPNAME7= <>
##$DPOAL= (0..7)
0.5 0.5 0.5 0.5 0.5 0.5 0.5 0.5
##$DPOFFS= (0..7)
0 0 0 0 0 0 0 0
##$DQDMODE= 0
##$DR= 22
##$DS= 2
##$DSLIST= <SSSSSSSSSSSSSSS>
$$ [...]
##$SPOFFS= (0..31)
0 0 0 0 0 0 0 0 0 0 0 0 0 0 0 0 0 0 0 0 0 0 0 0 0 0 0 0 0 0 0 0
##$SUBNAM0= <"">
##$SUBNAM1= <"">
##$SUBNAM2= <"">
##$SUBNAM3= <"">
##$SUBNAM4= <"">
##$SUBNAM5= <"">
##$SUBNAM6= <"">
##$SUBNAM7= <"">
##$SUBNAM8= <"">
##$SUBNAM9= <"">
##$SW= 20.5580556627758
##$SWIBOX= (0..15)
0 0 3 4 0 0 0 0 0 0 0 0 0 0 0 0
##$SW_h= 8223.68421052631
##$SWfinal= 0
##$TD= 65536
##$TD0= 1
##$TE= 300
##$TE2= 300
##$TE3= 300
##$TEG= 300
##$TL= (0..7)
0 120 120 120 120 120 120 120
##$TP= (0..7)
150 150 150 150 150 150 150 150
##$TP07= 0
##$TPNAME0= <>
##$TPNAME1= <>
##$TPNAME2= <>
##$TPNAME3= <>
##$TPNAME4= <>
##$TPNAME5= <>
##$TPNAME6= <>
##$TPNAME7= <>
##$TPOAL= (0..7)
0.5 0.5 0.5 0.5 0.5 0.5 0.5 0.5
##$TPOFFS= (0..7)
0 0 0 0 0 0 0 0
##$TUNHIN= 0
##$TUNHOUT= 0
##$TUNXOUT= 0
##$USERA1= <user>
##$USERA2= <user>
##$USERA3= <user>
##$USERA4= <user>
##$USERA5= <user>
##$V9= 5
##$VALIST= <valist>
##$VCLIST= <CCCCCCCCCCCCCCC>
##$VD= 0
##$VDLIST= <DDDDDDDDDDDDDDD>
##$VPLIST= <PPPPPPPPPPPPPPP>
##$VTLIST= <TTTTTTTTTTTTTTT>
##$WBST= 1024
##$WBSW= 4
##$XGAIN= (0..3)
0 0 0 0
##$XL= 0
##$YL= 0
##$YMAX_a= 1357126784
##$YMIN_a= -1630625.28
##$ZGOPTNS= <>
##$ZL1= 120
##$ZL2= 120
##$ZL3= 120
##$ZL4= 120
##$ABSF1= 10
##$ABSF2= 0
##$ABSG= 5
##$ABSL= 3
##$ALPHA= 0
##$AQORDER= 0
##$ASSFAC= 0
##$ASSFACI= 0
##$ASSFACX= 0
##$ASSWID= 0
##$AUNMP= <proc_1d>
##$AXLEFT= 0
##$AXNAME= <>
##$AXNUC= <off>
##$AXRIGHT= 0
##$AXTYPE= 0
##$AXUNIT= <>
##$AZFE= 0.1
##$AZFW= 0.1
##$BCFW= 1
##$BC_mod= 2
##$BYTORDP= 0
##$COROFFS= 0
##$CY= 15
##$DATMOD= 1
##$DC= 2
##$DFILT= <>
##$DTYPP= 0
##$F1P= 0
##$F2P= 0
##$FCOR= 0.5
##$FTSIZE= 0
##$FT_mod= 4
##$GAMMA= 1
##$GB= 0
##$INTBC= 1
##$INTSCL= 1
##$ISEN= 128
##$LB= 0.3
##$LEV0= 0
##$LPBIN= 0
##$MAXI= 10000
##$MC2= 0
##$MEAN= 0
##$ME_mod= 0
##$MI= 0
##$NCOEF= 0
##$NC_proc= -9
##$NLEV= 6
##$NOISF1= 0
##$NOISF2= 0
##$NSP= 1
##$NTH_PI= 0
##$NZP= 0
##$OFFSET= 14.51876
##$PC= 1
##$PHC0= 0
##$PHC1= 0
##$PH_mod= 0
##$PKNL= yes
##$PPARMOD= 0
##$PPDIAG= 0
##$PPIPTYP= 0
##$PPMPNUM= 2147483647
##$PPRESOL= 1
##$PSCAL= 4
##$PSIGN= 0
##$PYNMP= <proc.py>
##$REVERSE= no
##$SF= 90.2741483311586
##$SI= 8192
##$SIGF1= 0
##$SIGF2= 0
##$SINO= 400
##$SIOLD= 32768
##$SPECTYP= <>
##$SREGLST= <1H.CDCl3>
##$SSB= 0
##$STSI= 0
##$STSR= 0
##$SW_p= 1497.18866228788
##$SYMM= 0
##$S_DEV= 0
##$TDeff= 0
##$TDoff= 0
##$TI= <>
##$TILT= no
##$TM1= 0
##$TM2= 0
##$TOPLEV= 0
##$USERP1= <user>
##$USERP2= <user>
##$USERP3= <user>
##$USERP4= <user>
##$USERP5= <user>
##$WDW= 1
##$XDIM= 8192
##$YMAX_p= 1357126656
##$YMIN_p= -1630208
##$CURPLOT= <PDFCreator>
##$CURPRIN= <$PDFCreator>
##$DFORMAT= <normdp>
##$LAYOUT= <+/1D_H.xwp>
##$LFORMAT= <normlp>
##$PFORMAT= <normpl>
##$SURQMSG= 1
$$ End of Bruker specific parameters
$$ ---------------------------------
##XUNITS= HZ
##YUNITS= ARBITRARY UNITS
##XFACTOR= 0.182762287876938
##YFACTOR= 1
##DELTAX= -0.182762287876938
##NPOINTS= 8192
##FIRSTX= 1497.0059
##FIRSTY= 54784
##LASTX= 0
##MAXY= 1357126656
##MINY= -1630208
##XYDATA= (X++(Y..Y))
8191E4784C584b90304A50016f9632A63840K40128a9968q93952G1680N57568P0144
8180F99392k35008g77728n5808B66752K79040f2976o47168l97824B36032b39104
8169d55168C61984g168o30272C15392p9872c52256e6832m6080F2976d60800H69888
8157E10464a82784j81248n1712m37760g4240A67424L22048J6896f56384F04672
8146G7312c48160k54976g2704C61984A67936O53824h25856C95264i8304l21536
8136d19840a85344B60096C2768M51072n4272R52320i61024a47968D43904A19296
8125I39520b09920c0208C01056c11808F47168B26816j03936a64864l1744o4512
8115b61120H43264B18112N87776a78176A72544M40832B64192a90464J6384L1744
$$ plain form
8191 54784 3584 -290304 150016 -69632 163840 403968 -19968 -913920 71680 629248 699392
8180 699392 464384 -777728 -833536 266752 545792 -62976 -710144 -1107968 236032 -239104
8169 -455168 361984 -7168 -637440 315392 235520 -352256 -56832 -102912 62976 -460800 869888
8157 510464 -182784 -364032 -415744 -853504 -74240 167424 489472 506368 -656384 604672
8146 77312 -348160 -603136 -72704 361984 167936 821760 -825856 395264 -98304 -419840
8136 -419840 -185344 260096 32768 483840 429568 1381888 -961024 -147968 443904 119296
8125 939520 -209920 -30208 301056 -311808 647168 226816 122880 -164864 -196608 -261120
8115 -261120 843264 218112 805888 -178176 172544 613376 264192 -190464 -174080 -142336
8105a42336A50016d46464j22368E0688i216C31776d54656I04192A82784J17248
8095C00032O656G8848i86112A459200a77152I4208O14400g53152J77664e9904
8084d5056o29248j85344c44576A81760m3520L50208e38112r728D13184f75840
8073C21536J79712A29536Q70400A8944e4272E32480n0176b31936C00032a47968
8062C42528f144k72384A70496d58752k19648B36544J05984a44384D78208c28704
8051B34496e47840G96672A74592f07232g7824l95776I45664b48320H38144D14720
8040A38752J18784J30560b4576k43200N8880B40128E12b2016l58912D00896A50528
8028A08032K48832b70848H26880a015296d20352J35168k20160a26976N5296E34528
$$ plain form
8105 -142336 150016 -446464 -568832 50688 -9216 331776 -454656 904192 182784 300032
8095 300032 306688 78848 -986112 1459200 -177152 94208 708608 -753152 -575488 -59904
8084 -45056 -674304 -859648 -344576 181760 138240 488448 -538112 -547840 413184 -675840
8073 321536 501248 129536 999936 18944 -54272 532480 482304 -231936 300032 -147968
8062 342528 -6144 -278528 170496 -458752 -678400 236544 342528 -144384 478208 -328704
8051 234496 -547840 796672 174592 -607232 -77824 -473600 945664 -248320 838144 414720
8040 138752 257536 388096 -24576 -267776 -208896 240128 512 -22016 -380928 400896 150528
8028 108032 356864 -270848 826880 -1015296 -420352 -285184 -505344 -126976 -71680 534528
8017b0992A31072r216a33120j07008H42240l29728b44736A29024b72384k0992
8007b93376D11136Q3456E3248P29088C31264d39808D97664A87392j7920a75104
7996C072d73600B39616K25792c52256E77024c07712k07360a40800I73824C98336
7985E07904B06848d66432n60128a79712I55904c59424G81824A5360J14688N81120
7975G11168a115648J92000G21408j59232a13664A16736J50016k7648m4032e76512
7964f90688B57024a98144a536l73248J74592n0176A504768d56192J94048I8304
7953A80224o1952M61312k29376N1200b98496M2496l38944B71872i4208j45408
7943b39616M3520A039360m15232m3520B30912J74080K39104L57888G680a66400
$$ plain form
8017 -20992 131072 121856 -133120 -240128 842240 512512 -244736 129024 -272384 -293376
8007 -293376 411136 494592 53248 782336 331264 -439808 497664 187392 169472 -175104
7996 3072 -473600 239616 465408 -352256 577024 -307712 -515072 -140800 973824 398336
7985 507904 206848 -466432 -1026560 -179712 955904 -359424 781824 15360 130048 711168
7975 711168 -1115648 -923648 721408 562176 -113664 116736 266752 239104 195072 -576512
7964 -690688 257024 -198144 -1536 -374784 -200192 -250368 1504768 -456192 -262144 98304
7953 180224 118272 579584 350208 401408 -298496 -256000 -594944 271872 -94208 -239616
7943 -239616 -196096 1039360 624128 580608 230912 404992 644096 1001984 7680 -166400
7932c55840b3040D58240P2704i1648B89280L58912I6256a95584F2464Q9600O97856
7921H49920C22048i01632b09408j7408k39616r2672j07008c31776E18144M9664
7911E67808A87392G680c33824F3488g16288K89280A05984P17312C62496j15200
7901B47296q3968Q63232b4064n29920C74784a94048H03328i6256D53120d49536
7890A02400a4336q47872B62656I5232d24448a19808A032192m36736M99200B61120
7879G25504A47968i41568L26656B08896J07008@b21696m54144Q4480Q4480J68960
7868c37920K9696D40320c02592k64704A47456K69824j99168J88928K06336e1200
7857d14208C27168I3696M50560d31616B74944M0448I9328g86432C6352e21728
$$ plain form
7932 -355840 -23040 458240 530944 -91648 289280 648192 96256 -195584 62464 152064 849920
7921 849920 322048 -901632 -209408 -226816 -466432 -559104 -666112 -331776 518144 567808
7911 567808 187392 7680 -333824 63488 -716288 -427008 105984 823296 362496 247296
7901 247296 163328 1026560 -24064 -553984 374784 -194048 803328 -96256 453120 -449536
7890 102400 -14336 -862208 262656 95232 -424448 -119808 1032192 595456 1094656 261120
7879 725504 147968 -941568 -614912 208896 315904 0 -221696 -675840 -591360 -506880 -337920
7868 -337920 -308224 440320 -302592 -567296 147456 417280 218112 407040 613376 -51200
7857 -414208 327168 93696 544256 -431616 274944 315392 99328 -786432 36352 -521728
7846A64352c64544B99520A6384f98368A07008l0208O5536d82816q1920A10080
7835e6832m85376H20224c74784D34176K00704d79232C20512k8160L21024b03776
7824H70400A24416R41056m45440A42336O09792d7616o08256a65376l83488g2192
7813e11488J25440H89856a72032k24768a86880B6112J47456K02240A46432J408000
7803A554432p42400k23744A71008e95456F4000L56352E1712a206272N57568G45984
7792B51392a26464o47680b14528c2768G62880A15712e3248E74464d5056E1200
7781e29920I728M57216e14048G36768d80768E7856e73440A58208M40832J98656
7771G97696k97984J16736e7344I97888l55840L42016D24960d54144b18112B24256
$$ plain form
7846 164352 -364544 299520 16384 -698368 107008 76800 142336 -482816 -564736 110080
7835 -56832 -542208 820224 -374784 434176 634880 -479232 320512 292352 613376 -203776
7824 870400 124416 1065472 620032 142336 752128 -47616 -655872 -165376 -548864 -72192
7813 -511488 -386048 889856 -172032 -396800 -186880 26112 173568 375808 146432 1554432
7803 1554432 812032 588288 171008 -595456 64000 420352 51712 -1206272 -648704 745984
7792 251392 -126464 -774144 -214528 -32768 762880 115712 -53248 574464 -45056 51200
7781 -529920 9728 466944 -514048 736768 -480768 57856 -573440 158208 599040 797696
7771 797696 499712 616448 -57344 997888 642048 984064 424960 -454144 -218112 224256
7760e35040G08096B1504J76128g34720A91488K01728d25472l6352E44768C072
7749A247744n52448d64384a24928k42688B48320N92896c74272D22400j62816a12128
7738H7040d80768F84544e1200D29056A55136P8848c13856B29888c59424d4032
7727a20832I75360e8368k97984l584P5264I34912D22912O47168f35904a6896m43904
7716d60800E52448j70496R5744R19552k64704b88768J09056k49856k97472J0752
7706g16288E69856a25952k18624a22880G44448a60256A77152c51232D79232c20512
7695b71872R9328D16768a16224e5808H1408J03936K60608A71520d11136M1472
7685c69664l98336C15904K74944d77184A044992a79712E25824h1920C50720i8304
$$ plain form
7760 -535040 708096 21504 197632 -734720 191488 393216 -425472 -461824 544768 3072
7749 1247744 695296 -464384 -124928 -367616 248320 841216 -374272 422400 259584 -112128
7738 87040 -480768 684544 -51200 429056 155136 233984 -313856 229888 -359424 -44032
7727 -120832 975360 -58368 -356352 -359936 -284672 934912 422912 1070080 -635904 -16896 -460800
7716 -460800 552448 381952 477696 1397248 1132544 -288768 -179712 -429568 -727040 -716288
7706 -716288 569856 -125952 -344576 -122880 744448 -160256 177152 -351232 479232 -320512
7695 -271872 -172544 416768 -116224 -55808 81408 185344 445952 171520 -411136 -369664
7685 -369664 -768000 315904 590848 -477184 1044992 -179712 525824 -81920 350720 -98304
7674F25664A60256d42880J15712k50880C24096E6832O25152B1504c5328k560D53632
7662h23808B39104Q54528b87744a17760C46624R2160i23136E4784M58752c02592
7651c7888l9424j19296k27840a22880A001472f44608I7792P5264a16224n56032
7641f72256p680F84032j42336R3184K048d13696r35936d56704A091584R3696b05824
7629c60448k50880a95072l06688D97664b44736J5360D2496c04640I3696b12480
7618C51744A41824d10624H85760l83488a17760L1232a9968l17440H00256c11296
7607F48704g5264A85344R36448B46272o4000N78560B93888e89824a55136m12160
7597e67296G02464b03776D608M44928e85728G22432P8848B9696a45408F47168
$$ plain form
7674 625664 160256 -442880 -327168 -578048 324096 56832 681984 21504 -35328 -37888 453632
7662 -823808 239104 1093632 -287744 -117760 346624 438784 -923136 54784 513536 -302592
7651 -37888 -77312 -196608 -424448 -122880 1001472 -644608 97792 173056 -116224 -672256
7641 -672256 -679936 684032 541696 634880 636928 -413696 -1349632 -456704 1091584 1185280 -205824
7629 -360448 -611328 -195072 -501760 497664 -244736 -229376 42496 -304640 93696 -212480
7618 351744 141824 -410624 885760 502272 -117760 -86528 -19968 -337408 800256 -311296
7607 648704 -75264 185344 1121792 246272 182272 760832 293888 -589824 -155136 -567296
7597 -567296 702464 -203776 4608 449536 -585728 722432 801280 29696 -145408 647168
7586C70176a00864j12128C81440b40640D28032I7280K20672a245696I78944m43392
7576E35552a67424A62304P0656P05024m46464f01600D0448Q04864A16224b06336
7565f20544C52768A59744O40512e2736j0752D87936b82624A156608n67808G9872
7554G37792J38240B96960g19872L58912A419776m91520b25280C6352h71936D10624
7543b02240r87136F60480d76160A58720c21024D68992h23808G44448d33152l8400
7533d71552n632B76992b58560A20320N5808N14048h6016H0896Q58112C12832a383936
7521a275904B76992e43232F58432b53440A45408N17120B15040a8944o6048B62144
7510C64544D7616K05312a96096I42592h93952H90880B43712J30048d71552d3008
$$ plain form
7586 370176 -100864 -212992 381440 -240640 428032 97280 317952 -1245696 978944 535552
7576 535552 -167424 162304 232960 937984 491520 -601600 40448 845312 116224 -206336
7565 -620544 352768 159744 800256 -52736 -63488 487936 -282624 1156608 588800 79872
7554 737792 876032 296960 -719872 -360960 1419776 928256 -225280 36352 -871936 410624
7543 -202240 -1189376 660480 -476160 158720 -321024 468992 -823808 744448 -433152 -471552
7533 -471552 -477184 276992 -258560 120320 176128 690176 -86016 80896 939008 312832 -1383936
7521 -1275904 276992 -543232 658432 -253440 145408 662528 215040 -18944 -84992 262144
7510 364544 47616 252928 -196096 942592 -893952 890880 243712 373760 -471552 -43008
7499a3824j25440l95776E50400h50944F17984c2768C15392M40832C7376J56160
7489A93536N15072B19648a009152E95456E1712Q23296B17088L00544d5568B32448
7478b14528G75680C10272H9088a7408j242112N34016D36224N32992b02752C66080
7467E25824D4032c41504r54880N60640C77856Q6528L70688a075200C72736H2432
7456a522176I2160g07072B7648J1264d53120F9632i11872i4720J536B00704c22560
7444G1680a92000A033216a7920A482240e40672B43200a5360g168r6768B43712
7433C79904g08608i216j62816F07232J08544C7376K92352J45920c33312C39456
7422a116672a30560G65952c7376l36896J15200j61280N2736D07040a1776j339392
$$ plain form
7499 -13824 -139264 -535040 550400 -850944 617984 -32768 315392 756224 37376 193536
7489 193536 708608 219648 -1009152 595456 51712 875008 217088 517632 -45568 232448
7478 -214528 775680 310272 89088 -17408 -1259520 -725504 436224 969216 -202752 366080
7467 525824 44032 -341504 -1296384 -735744 377856 464384 835072 -1075200 372736 82432
7456 -1522176 92160 -707072 27648 38912 -453120 69632 -911872 -94720 -93184 200704 -322560
7444 71680 -192000 1033216 -17920 1482240 -540672 243200 -15360 -7168 -103936 243712
7433 379904 -708608 -9216 -172032 607232 715776 37376 329728 475648 -333312 339456
7422 -1116672 -130560 765952 -37376 -374272 -259072 -420352 -367616 407040 -11776 -1351168
7412a351168C25632M608K39616f66624C41504R73312A48992L39456A37216J058816
7402A196032f84032F57920h7040H77568C8912b51904n24288G36256k63168e120
7391a61280A34144C4304g88480L35360A20320O83520B98496N8880a11104A025024
7380A44896B5088i8304k048F2976a24416q69888B25280N3760m1472K97984j98144
7369C37408b96448n51936D48512k21696e29920J79200F63040a41824C64544R728
7359C74272c28192D09088i09824B38592q8064L1232g80288c584C07200j9456A23392
7347G69024J74080f53312I91232D61824K99008d79744E60128j00864C0720J07008
7337A37728L34848A59232f29248I58976L85536k29888c4816E7344P06560e74976
$$ plain form
7412 -1351168 325632 330240 569856 -666624 341504 1314816 148992 488448 137216 1196032
7402 1196032 -684032 657920 -87040 877568 38912 -251904 -776192 736256 473088 -5120
7391 -161280 134144 34304 -788480 -453120 120320 803840 298496 357376 -111104 1025024
7380 144896 25088 -98304 -100352 62976 -124416 -994304 225280 279040 237568 535552 337408
7369 337408 -296448 -848384 448512 226816 -529920 -350720 663040 -141824 364544 374272
7359 374272 -328192 409088 -909824 238592 150528 181760 -780288 -3584 307200 287744 123392
7347 769024 943104 -653312 991232 461824 760832 -479744 560128 459264 30720 137728
7337 137728 472576 159232 -629248 958976 1344512 1114624 -34816 57344 763904 -574976
7326C07200J593856b53440J2288J11104o09792F94272M58752b69312j39264F72768
7315C34848c54816C32800J24416F3488k5600e89824b46272a15200m3520C66080
7304b64704l37920A475072p20384l66080A69984K28352J46944f61504H65792f13888
7293A63328Q38656C01568K85696k14016K16064g9360A46432c05664m49024c74784
7282b24256C63008f88128M4544A03424P47008k78528B36544j2800O1440b07360
7271e55520D46976Q0896J86368i7792k18112j081856D97664e90336b53952A94560
7260F71232a94560k57536E06880A29024c60960C23072h43264I2160b9696j17248
7250a46944G57248a63840m63360b83136a22880j53600H47872d6080n68832l67616
$$ plain form
7326 307200 1901056 -253440 -241152 -130048 -739840 694272 1153024 -269312 -408576 672768
7315 334848 -354816 332800 457216 63488 37888 -589824 -246272 -115200 -158720 366080
7304 -264704 -602624 1475072 754688 388608 169984 398336 545280 -661504 865792 -613888
7293 163328 1001984 301568 587264 373248 589312 -79360 146432 -305664 -754688 -374784
7282 -224256 363008 -688128 -643584 103424 850432 571904 236544 223744 285184 -207360
7271 -555520 446976 527872 714240 -97792 -315904 -1397760 497664 -590336 -253952 194560
7260 671232 -194560 -452096 506880 129024 -360960 323072 -843264 92160 -29696 -146944
7250 -146944 757248 -163840 -627200 -283136 -122880 -276480 847872 -46080 -614912 -982528
7240i82528F10304b86720D17792e08928G7824L89632J58208M1984e56032i728
7229e0688m67456K41664r11872F0928b82624k63168B60608A17760K8672L10784
7219D57216d7616D88448g94112C9936L13344J024000D55168e54496E13024A20832
7208D26496f17472D20352L53792c02592D03968e91872B36032M61824C40992e72928
7197B6624a80736E13024A80736c38432a50528o89664A248256f17472J76640C33824
7186G14752j01888k38592O9632i11872A22368F144b97472a16224A55648c86560
7175C70176K92864p9360B85696O23616l56864K09408C59424A04960g3728r5744
7165a69472d608A805312A47968B4576d25984B03264d60800m30592j26464E39648
$$ plain form
7240 -982528 610304 -286720 417792 -508928 77824 467456 625664 667648 -556032 -9728
7229 -50688 -518144 -276480 -1188352 60928 -282624 -545792 260608 117760 146432 457216
7219 457216 -47616 488448 -794112 39936 353280 1377280 455168 -554496 513024 120832
7208 426496 -617472 420352 774144 -302592 403968 -591872 236032 697856 340992 -572928
7197 26624 -180736 513024 180736 -338432 -150528 -840192 1248256 -617472 -440832 333824
7186 714752 612864 374272 443904 -911872 122368 6144 -297472 -116224 155648 -386560
7175 370176 663040 583680 285696 909312 552448 761856 359424 104960 -73728 -169472
7165 -169472 -4608 1805312 147968 24576 -425984 203264 -460800 -891392 -1017856 539648
7154b10944C73760A74080K01216h704C81440c46112D92032b58560f144I60512
7143b11968H76544a8944o9632E96992K50368d45952C44576K27840e120B83136
7132D96128f4000B76992F1440i5232D9664L84512b23744H3968h11520j23392E56544
7120E82656A29024L45600E4272O84032K63168b89792C78880c11296j91488C0720
7109c03104a8432D1472M94080K81088A1264J12640O3488c06176O7072O144C97824
7097E69344d77696j05472b03264H09984l10272Q2432d25472F09792L51232a47456
7086D75648A81760J582080B86720d59776a89440n19168m40832D58240M55168K99008
7076A212416n50400k5088k27328E4272f66624B41152j13664J75616i3696E10464
$$ plain form
7154 -210944 373760 174080 375296 -8704 381440 -346112 492032 -258560 -6144 960512
7143 -211968 876544 -18944 -88576 596992 847360 -445952 344576 572416 -5120 283136
7132 496128 -64000 276992 61440 -95232 49664 434176 -223744 83968 -811520 -934912 556544
7120 582656 129024 474624 54272 738304 1001472 -289792 378880 -311296 -502784 30720
7109 -303104 -18432 41472 535552 816640 11264 123904 187392 -306176 -239104 -232960 397824
7097 569344 -477696 -583168 -203264 809984 499712 582144 -425472 609792 961024 -147456
7086 475648 181760 1763840 286720 -459776 -189440 -708608 -1149440 458240 913408 1212416
7076 1212416 662016 636928 409600 54272 -666624 241152 127488 303104 -93696 510464
7065b02240j90976F99904f656m60800Q4992F77376B00704G3728f00064b08896
7054A53088J23904J35680j57184O11840H7552N20704F4512O83008J37728b99520
7043B16064p8336M93056a6384n46304A54624J11104K90816B5600L21536K73920
7033F21056k82624J46944l1744b31424H24832l4816A61280E0176d02944a72032
7022C62496d93056Q704J07008H29440B52928f54848C64032j58720P43936c12832
7011h9088A62304D3008Q33536g23456a56160n73952b14528B21696N09952m6080
7001F85568B35520q4992K52416J005056h5504q63232J11616F2976K16576f22592
6990A070080c77344o51776D04992j33632N14560A84832j5872L15392a536m53120
$$ plain form
7065 -202240 -393216 699904 -6656 -467456 -382464 677376 200704 73728 -600064 -208896
7054 153088 276992 412672 255488 867328 87552 608256 64512 747520 885248 -299520
7043 216064 137728 630784 -16384 -562688 154624 265728 556544 25600 347136 621056
7033 621056 338432 485376 453632 -231424 824832 790016 161280 50176 -402944 -172032
7022 362496 -493056 -484352 -377344 829440 252928 -654848 364032 205312 949248 -312832
7011 -89088 162304 43008 876544 -723456 -156160 -730112 -214528 221696 731648 685568
7001 685568 235520 150528 402944 1408000 -85504 -948736 -837120 62976 279552 -622592
6990 1070080 -377344 -1029120 404992 271360 785920 184832 168960 484352 -1536 -454656
6980d54656B47808J39776K30400f19520H56576j84320K30400a69984k27328B21696
6969B24768O35904b75456n42208h7552m34688b49856l24096i4208C58400J83808
6959E42208N6832b39104G25504a0240E82656O32832d94080C15904c86048B37056
6948H72448O86080C29728K15552A0752g00928i728D78208h60160j49504B42176
6937A062912f07744i5232A266688E08928j63840D8128N6320J54112K02752d52096
6926d09600a41312n0176r7792l00544d4032D61824J56672M19840b59072A064448
6915C35872h06912b90816H41216j25440k59072e27360l89120C60960c29728A32096
6904E21728B19648b18112b6624n59616o51264A293824A50528g6800A010176A47968
$$ plain form
6980 -454656 247808 387584 617984 -619520 856576 672256 902656 -169984 -397312 221696
6969 224768 860672 -275456 -817664 -87552 -522240 -249856 -573952 -94208 358400 542208
6959 542208 599040 -239104 725504 -10240 582656 1215488 -494080 315904 -386048 237056
6948 872448 1558528 329728 545280 10752 -700928 -9728 478208 -860160 -1009664 242176
6937 1062912 -607744 -95232 1266688 508928 345088 48128 104448 258560 461312 -452096
6926 -409600 -141312 -191488 -289280 -589824 -44032 461824 618496 1038336 -259072 1064448
6915 335872 -806912 -290816 841216 715776 456704 -527360 -916480 360960 -329728 132096
6904 521728 219648 -218112 -26624 -586240 -1237504 1293824 150528 -76800 1010176 147968
6893E22752B43200i7280A160704n02272L13856J94048C97312e05856a07520A013248
6882D096M12160q9600e8368l11808A196544b81600D94080f38464F44608d63360
6871d44928G26528j56160j01888a9456E2224f21568E32480c35360B32960d50560
6860A120768e78560b73408c584o0416o52800b80064a34144n49376K92352H07424
6849C75808K12480c08736H52992A85856g4752C69664f40000E6832J46944a79712
6838a103360B91840p2192N06880l20000g41888F2976L74272k9184d99712A20832
6827g85408h0896n13536A92000L15392D1472a34144F59968J00864B51392O79936
6817I31328b88768D34688b12480C05152c88608B74944i8816C84000J23904d39808
$$ plain form
6893 522752 243200 -97280 1160704 658432 972288 1166336 397312 -505856 -107520 1013248
6882 4096 416256 326656 -58368 -370176 1196544 -281600 494080 -638464 644608 -463360
6871 -444928 726528 570368 468480 -19456 52224 -621568 532480 -335360 232960 -450560
6860 1120768 -578560 -273408 -3584 -64000 -716800 -280064 -134144 -683520 -391168 807424
6849 375808 588288 -308736 852992 185856 -74752 369664 -640000 56832 203776 -179712
6838 -1103360 291840 219648 726528 406528 -741888 62976 437248 408064 -499712 120832
6827 -785408 -80896 -594432 192000 507392 41472 -134144 659968 760832 251392 931328
6817 931328 -288768 434688 -212480 305152 -388608 274944 -98816 384000 507904 -439808
6806g61344a73056F22592d58240k27840K76992k23232H91392P7824d03456C63520
6795g33696b0480o46144b90304k43200n82656K21184c86048D72576O43072b81088
6784D3008c68128k54976A62816J77152J033216C60960K56000k39616e90336F30784
6773D04480j19296a012736L51232H44288a56160j17760A48992c30752k27328C88608
6762A98656a036800A452032A19808N68320A15200h50432I3696c40480F13888K64704
6752H78592c31264a5872b048j543168f88640G10144D6080L99872k00704h4992
6741A291264a52576A082368C98336e13536A04448P05024B26304L76320q6528J1264
6731E27360J071104A26976g95648b19136a04960p49056c07712j00864a26976A60768
$$ plain form
6806 -761344 -173056 622592 -458240 -686080 -409088 -632320 891392 969216 -403456 363520
6795 -733696 -20480 -666624 -290304 -533504 -1116160 -894976 -386048 472576 1115648 -281088
6784 43008 -368128 -623104 162816 339968 1373184 360960 616960 377344 -590336 630784
6773 404480 285184 -1012736 -661504 844288 -156160 -273920 148992 -330752 -558080 388608
6762 198656 -1036800 1452032 119808 688128 115200 -850432 93696 -340480 613888 878592
6752 878592 -331264 -15872 -2048 -1545216 -688640 710144 46080 445952 245248 -84992
6741 1291264 -152576 1082368 398336 -513536 104448 809472 226304 602624 516096 527360
6731 527360 1598464 126976 -795648 -219136 -104960 -854016 -307712 -408576 -126976 160768
6720d45952A30560F1440d8128C07200e45280A138176k90304h87296F68672J4848
6710F83520Q704A08032P21920A61792a36704m33152n3760a56160C73248f67136
6699C10784r8816O64576c21536A101312E42208F9120K65728j24416p6288P60320
6689H94464C32288h50432D93568j15712M74624k03264g62880H8576i80480J6896
6679i63584F13888A0752P04512C0720L48672J66400I216J31584J1264i04704d22912
6667A103360K51904g1680D31104K55488e34016A072640b85696B24768I2672b38592
6656I88160E3760N30432f50240F46144B44224a10080F81984G5776d1472k43712
6646b85184J39264B64192r4720g23456D28032b07872K5600F03136f02624p8848
$$ plain form
6720 -445952 130560 61440 -48128 307200 -545280 1138176 847872 -887296 668672 683520
6710 683520 692224 108032 829952 161792 -136704 -569856 -623616 -156160 373248 -667136
6699 310784 211968 876544 -321536 1101312 542208 69120 334848 210432 134144 894464
6689 894464 332288 -850432 493568 377856 852480 649216 -762880 88576 -980480 -963584
6679 -963584 613888 10752 715264 30720 379392 545792 9216 140800 152064 -904704 -422912
6667 1103360 1355264 -71680 431104 686592 -534016 1072640 -285696 224768 92672 -238592
6656 988160 53760 584192 -650240 646144 244224 -110080 681984 75776 -41472 -285184
6646 -285184 -145920 264192 169472 -723456 428032 -207872 -182272 603136 -602624 -681472
6636f81472R7280G04512G5776N77536J61792j25952P51616D87936B19136L12832
6626E31968a86368I97376g1680q192A75616K18112q704b62656J26464f0416C59936
6614b19136o65088A049088B26304a010688B04288a62304J4336j21344j18272P1168
6604c16416d6592G3728q192g90016F4512L17440A73056L49184k00192b07360B75456
6592h8576E12a56160l31264A388544k28352E63200j66400J89440m096c58400M1984
6581c16416A04960N50400C12320F5024J024512c05152C10784e49888A34656b47296
6570G92576i14432A58720M86400K2016M64384b2016l83488n47328H192O70208
6560F78400H3968d5568A15200j1776d25472m33664i8816B10944f81984C16928
$$ plain form
6636 -681472 -584192 704512 75776 653312 815104 689152 1440768 487936 219136 531968
6626 531968 -186368 997376 -71680 -79872 175616 393728 385024 -262656 -136192 -60416 359936
6614 -219136 -884224 1049088 226304 -1010688 204288 -162304 -147968 -269312 -387584 -316416
6604 -316416 -46592 73728 65536 -790016 64512 381952 173056 522240 322048 -207360 275456
6592 -88576 512 -156160 -487424 1388544 1160192 563200 396800 586240 582144 -358400 -316416
6581 -316416 104960 655360 312320 65024 1089536 -305152 310784 -549888 134656 -247296
6570 792576 -914432 158720 645120 667136 1131520 -22016 -405504 -952832 8192 678400
6560 678400 83968 -45568 115200 103424 -425472 -859136 -98816 210944 -681984 316928
6549B28864Q6528h39168E79584b19136j11104K6624B7648P1168k9696N52448A01376
6537a4848l2768I2672g67488E43744M48512j64864j95584b83648C61984j58720
6527B03264K99008d7104j140224F33344K36544K73920m18304e57568E54496A82272
6516D77184M45952C57888e36576P2192E64224j16224P2704e00736C8912M0448
6506G9360J89440g23968L18976j24416G68000k39616c45600E1712P03488C06688
6495B71360c52256E77536H7040M0448L17440a22368o10304A065984b99008M8128
6485b50880D73600J73568M8128a74592E78560a078272b00192E3760c2256a3312
6474E77536a21856m3520E03296A4336L70176J56160M40832H1920a20832o21056
$$ plain form
6549 228864 315392 -839168 579584 -219136 -330240 -303616 27648 98816 69120 621568 101376
6537 -14848 -47616 92672 -767488 543744 992256 827392 631808 -283648 361984 203264
6527 203264 502272 -47104 -1187328 633344 869888 1143808 725504 -557568 554496 182272
6516 477184 923136 357888 -536576 -464384 564224 448000 520704 -500736 38912 79360
6506 79360 268800 -723968 -404992 -529408 768000 528384 -345600 51712 755200 306688
6495 271360 -352256 577536 87040 127488 444928 -122368 -732672 1065984 -299008 -250880
6485 -250880 473600 647168 695296 -174592 578560 -1078272 -200192 53760 -32256 -13312
6474 577536 -121856 -165376 503296 14336 384512 540672 981504 81920 -120832 -741888
6464g41888A085440b89280A07520a26976D46976J23392a53600E1712O78400b54464
6453a21856A153536A24928a27488k79552e4784H32512b48832A84832O58944C12832
6442E24800e48352j081856b1504m13696E06368P1680B68800J011712d24960j22880
6432e47840K34496C68640H3968e9904I6768c08224I02656C53280O80448B52416
6421f69696a17248E62688A61792d53632J66912K3552l27680D4544M12672c46624
6410A136640A38240f21056J27488J14176J31072N9392A196032d03968F9120f47168
6399E70368a21344B91328A07008J24416a52064B12480D608K22720J010176a11104
6388a28000F3488N77536B37056f72256b41152A84832d9664D74624b01216F83008
$$ plain form
6464 -741888 1085440 -289280 107520 -126976 446976 570368 -153600 51712 730112 -254464
6453 -121856 1153536 124928 -127488 -407040 -54784 832512 -248832 184832 843776 312832
6442 524800 -548352 -1630208 -21504 -435200 506368 578048 268800 1280512 -424960 -547840
6432 -547840 -313344 368640 83968 -59904 96768 -308224 902656 353280 1033728 252416
6421 -669696 -117248 562688 161792 -453632 -286720 -263168 -590848 44544 457216 -346624
6410 1136640 138240 -621056 -493568 -379392 -248320 -188928 1196032 -403968 69120 -647168
6399 570368 -121344 291328 107008 231424 -152064 212480 4608 227328 1237504 -111104
6388 -128000 63488 641024 237056 -672256 -241152 184832 -49664 474624 -201216 683008
6377c7376n43232b89792o144C38944J04960@A75616A1264e59104E34528J1776
6366E46304P9872B60096J93536A62304L54816C5328Q02304c77344D94592B22720
6355E77024f66112B02240f44096B12992H8576P27040e34016G26016B78016N52960
6345H30976a91488l12320a28000C20512N29408B80064P16800A80736j2800K20672
6335C88608e32992E8880P5264O25152i25696c37920M5056L5328C31264M41344
6325G72608J69984G1680a67936A58208B0992M46976c88608A71008L13856j20320
6315C64544O55360B4064a095680L53792F42560j12640R13920B04800f74816E45792
6304g32672F42048J14176B67776J86368a67424o24640D13184N12c072A304576
$$ plain form
6377 -37376 -580608 -289792 -295936 338944 443904 0 175616 11264 -559104 534528 546304
6366 546304 626176 260096 453632 162304 517120 35328 837632 -377344 494592 222720
6355 577024 -666112 202240 -644096 212992 88576 815616 -534016 726016 278016 830976
6345 830976 -191488 -503808 -128000 320512 849920 280064 996864 180736 167936 388608
6335 388608 -532992 58880 134144 759296 -925696 -337920 -292864 -257536 331264 772608
6325 772608 942592 71680 -167936 158208 20992 467968 -388608 171008 484864 364544
6315 364544 1019904 24064 -1095680 -741888 642560 529920 1443840 204800 -674816 545792
6304 -732672 642048 756224 267776 454144 -167424 -792064 413184 413696 -3072 1304576
6293A53088R25184A41824Q48896D53632R3184O84032j41312d61824N8368a74592
6282B70336a14688l40992A7408R01632C19488a36192D30080L70176H6016J80736
6272B66752m9664L13344a242624B35008b97984E43744N00224a76640C92192d24960
6261c5840r84576D8128M82304B17600M31616b53952E120N69856e87264A04960
6250F6560P93600a46432A8432J28000c8912E32480a018368B64704i93792B38592
6239G3728c42528A00352l7376f86592a65376B9184d89984B00704J095680C83488
6228A95584g168C35360L47136c9936D64384c48672j41824C4816P98720J58208
6218I91744l56864O4512b96960E79072i87648M71040a9456m83840J50528m85376
$$ plain form
6293 153088 1078272 141824 990720 453632 546816 1230848 1089536 -461824 -403456 -174592
6282 270336 -114688 -455680 17408 919040 319488 -136192 430080 800256 86016 266752
6272 266752 217088 530432 -1242624 235008 -297984 543744 1043968 -176640 392192 -424960
6261 -35840 -1020416 48128 530432 217600 649216 -253952 5120 574976 -587264 104960
6250 66560 860160 -146432 18432 146432 -38912 532480 -1018368 264704 -993792 238592
6239 73728 -342528 100352 62976 -686592 -165376 29184 -489984 200704 1296384 383488
6228 195584 -7168 335360 682496 -39936 464384 -348672 -490496 34816 833536 991744
6218 991744 634880 699392 -296960 579072 -987648 -516608 -19456 -503296 -352768 -838144
6208h38144I63072f58944k76480a4336F73792j98656e74464F20544D4544c94752
6197B62144C0720K15040M50048c77344A87392M68992j96096c96288j42848G51616
6186G32672b24256E62176C2256O35392j03424J11616d55680j5360Q704B71872
6175E31456N28896m64896j00864J73568B3552P96160e61152C31776l9936d96640
6164H90368C30240O1440M9152H5504L39968K40640f5024F49216j46944B49856
6153f15936I99936c23072G77728B13504d77184C11808h36096G18336l49696b25280
6142A58208G1168N1712e60640C43552M01920O30784D21376M51072l63008A39264
6131A273344A5872a64864C35872L21024c90656H9088J83808A13152O55360C20512
$$ plain form
6208 -838144 963072 -658944 -935424 -14336 673792 475136 -574464 620544 44544 -394752
6197 262144 30720 245760 695808 -377344 187392 656384 460288 -396288 -539136 751616
6186 732672 -224256 562176 32256 667648 564224 675840 -455680 -471040 -462336 271872
6175 531456 1060352 595456 494592 668160 23552 819712 -561152 331776 291840 -496640
6164 890368 330240 391680 440832 85504 425472 666112 -65024 649216 502272 249856
6153 -615936 999936 -323072 777728 213504 -477184 311808 -836096 718336 368640 -225280
6142 158208 71168 122880 -560640 343552 745472 1376256 421376 872448 509440 139264
6131 1273344 15872 -164864 335872 656896 -390656 89088 272896 113152 768512 320512
6120a65376B34496P6288q3968J95072O36416N37088e56544D10112J20320h9600
6109F6048P50080f9632k85696D83328f41536A49504R82528C35872K94400d63872
6098E46304Q29440F82496h25344I4720P34208e95968F60480a188352A533440b5088
6087H25344p3728C03104J17760A00864k2528f15936a10080E66272f58432F34368
6076B30912L12832K32960C04640b16576E6320J271296b63680L6352j05472a07008
6065e08928C91168H7040R57440H1408M64384A28000e4784D41344h61696L27680
6055e34016E95968K31936K76480m64896j34656A68960b91840i6256j168896D46976
6044D26496N16096f25664E94432b06848F52288l20512P33696b42176C25632a86880
$$ plain form
6120 -165376 234496 310784 226816 421888 1058304 1595392 -556544 410112 530432 -89600
6109 66048 816128 -69632 -355328 483328 -641536 149504 1132032 335872 630272 -463872
6098 546304 1375744 682496 -825344 94720 828928 -595968 660480 -1188352 1533440 -25088
6087 825344 751616 303104 420864 100864 78336 -615936 -110080 566272 -658432 634368
6076 230912 543744 776704 304640 -216576 56320 1327616 -263680 -227328 -332800 -107008
6065 -508928 391168 87040 1044480 81408 545792 128000 -54784 441344 -861696 -534016
6055 -534016 595968 827904 1104384 639488 504832 168960 -291840 -96256 -1265152 446976
6044 426496 942592 -625664 594432 -206848 652288 331776 1065472 -242176 325632 -186880
6033B37056P48544J08544j47968C89632a08032B30400M64896j82272h2432m41856
6023e24288G34208B44736b69824H58112c66592B91328k8672A3824c03616M4032
6013b59584D46464A7408P10144h56064D40320A21344J106432C56352J1776Q6528
6003D54656d55680C79904m4032K41152a29536k89792l48160A97632K5600a229312
5992c85024G42400j38752B7648L40480N56032N3760A4336g3728B99008J42336
5982D41344M78720l49696i3696H64256a2800A098240B64192f80448G3216e11488
5971H45824b37568D7104P19872M0960f98880A321472m56192I8816i7792C57376
5960i25184q8576i728H1920a72544C67616K22720k55488e12G70560A18272K42688
$$ plain form
6033 237056 985600 1094144 946176 389632 -108032 230400 695296 513024 -82432 -524288
6023 -524288 734208 244736 -269824 858112 -366592 291328 262656 13824 -303616 -259584
6013 -259584 446464 17408 727552 -856064 440320 121344 1227776 356352 368128 454656
6003 454656 -455680 379904 335872 577024 -129536 -419328 -767488 197632 223232 -1229312
5992 -385024 742400 603648 27648 368128 924160 977920 14336 -73728 299008 441344
5982 441344 920064 570368 -93696 864256 -12800 1098240 264192 -680448 73216 -511488
5971 845824 -237568 47104 766976 807936 -698880 1321472 865280 98816 -97792 357376
5960 -925184 -1013760 -9728 81920 -172544 367616 590336 334848 -512 770560 118272 360960
5949C60960K81600O4000M12160c1232H3968M53632n3760A7408d17280B64192L55328
5938F19520O99392o34880A74592b96960k86208A285632b92352b5088D86912O94272
5928A181184h4992E55008o3488p2704L46624M27520b43712A84832O6048o656a62816
5916H05376B39104M56192c2768D80256b75968j19296B33984f4512G49568j35168
5906F14400H6528c98336E60128j51552a179648G53152K18112C00032A7408Q19712
5896H37120d73600N8368B49344N2736R19552n11488j26976g76704d3520H01792
5885A16224c51744G74144J04448k26816l07200P72608g07584G38304M83328D63360
5874f4000A67424L69664L05152a10080k0480j55136n89312E4784I216a22368F01088
$$ plain form
5949 360960 642560 706560 1118720 -31232 83968 537600 483840 17408 -417280 264192 619520
5938 619520 1318912 684032 174592 -296960 -583168 1285632 -292352 -25088 486912 1181184
5928 1181184 -84992 555008 491520 418816 765440 1192960 -243712 184832 250880 244224 -162816
5916 805376 239104 695296 -32768 480256 -275968 -395264 233984 -64512 749568 614400
5906 614400 86528 -398336 560128 408576 -1179648 753152 971264 300032 17408 837120
5896 837120 -473600 -415232 249344 302080 1221632 710144 583168 -776704 -43520 801792
5885 116224 -351744 774144 878592 651776 344576 1117184 -707584 738304 1221632 463360
5874 -64000 167424 537088 842240 -110080 -130560 -285696 -875008 54784 9216 -122368 601088
5862C17952c3792G87968a032704B29888c87584P0144D50560b57536I73824A24416
5851A161728m25984B86720N71904C07200a72544A593344E70368N43232D71552
5841D65408e632j93024E84192k33472F656M34688H192J37216L04128L9936j1264
5830D78208I3184J69984F5024O93248J32096R3184I5232a156608M42368J65376
5820e48864A294848A82784N72416M5056N61664F29760h72960f8096G22432d87424
5809c33824A281536m86400A22368N97504a97632B28864J243648A00352P97184
5800H97536e77024A30560L48672a71008r70240G59808f69696D23424K88768K70848
5790I83040D67968f10304b27840A141248B79040j00864J174016a64352B60608
$$ plain form
5862 317952 -33792 787968 -1032704 229888 -387584 -317440 450560 -257536 973824 124416
5851 1161728 735744 286720 858624 307200 -172544 1593344 570368 1113600 471552
5841 465408 -5632 -198656 584192 350720 6656 441344 8192 145408 449536 489472 478208
5830 478208 93184 263168 65024 758272 890368 983552 95232 -1156608 -714240 -548864
5820 -548864 1294848 182784 755200 800256 1361920 629760 -872960 -68096 722432 -487424
5809 -333824 1281536 795136 122368 719872 -197632 228864 1472512 100352 897536
5800 897536 -577024 130560 479232 -171008 -1141248 759808 -669696 423424 712192 983040
5790 983040 467968 -610304 -227840 1141248 279040 178176 1352192 -164352 260608
5780A223680F3488K90304a332736b96448H04352j28512A93024O09280N89824E98016
5769I02656l36384A88928a50528G76192k51392R2160g02464A060352D90496b8672
5758A56672O16448k39104E5296K94912J304576B70848c71200l37408A44896K56512
5748D01408M57216a85344G02464k06848K44224k6112c9424A843712D04480i76896
5737D73088K5600B31936M74112l0208E2224J174016a30560K3040A14688M33664
5727E48352g0144D97152N87264b30912C76832L68640n1200F1440a30048n49376
5717f79424J36704J08032C56864P42912p1680c85024F4512b8672H06912A03424
5706B63168e43744B67264c78368H14592A04960J177088A42848N17120A08544A5360
$$ plain form
5780 1223680 63488 353792 -1332736 -296448 804352 675840 193024 802304 1392128 598016
5769 902656 566272 188928 -150528 776192 524800 616960 -702464 1060352 490496 -28672
5758 156672 773120 534016 55296 350208 1654784 270848 -371200 -708608 144896 401408
5748 401408 858624 -185344 702464 495616 739840 713728 -39424 1843712 404480 -976896
5737 473088 498688 231936 706048 675840 52224 1226240 -130560 -107520 114688 548352
5727 548352 -70144 497152 1084416 -230912 376832 745472 694272 61440 -130048 -679424
5717 -679424 -542720 -434688 356864 1099776 1028096 -385024 64512 -28672 806912 103424
5706 263168 -543744 267264 -378368 814592 104960 1282048 142848 659968 108544 15360
5695H39680f02624b49856e7344A02912a09056I00096j76640f76352C95776N34528
5685I30304m03456J154560F91712F3488L28192i9328A427456C03616L87072K88768
5675I79456d64896A230336d86400D61824c96800C10784b60096D83840c52256B92352
5664A306624a00352F69184k97984g18336E17632n9392L19488l19488d98176A345536
5653D86912A8944J006592a44384D93056O05184J17760B92352K71872j59744j15712
5643B88768a6896G68000h7040l32288C5840C584M68992J001472G29600O76352
5633A405952n00224j77152K68800j2288c1232l47648B09920h06912A344000m21376
5623I22624B97472a49504B63680j16224J7408c49696b2528A034240l82976J12128
$$ plain form
5695 839680 -602624 -249856 -57344 102912 -109056 900096 723456 -676352 395776 930304
5685 930304 526848 1681408 691712 63488 391680 -99328 1427456 303616 690688 979456
5675 979456 -464896 1230336 -486400 461824 -396800 310784 -260096 483840 -352256 292352
5664 1306624 -100352 669184 371200 -718336 517632 458240 777728 458240 -498176 1345536
5653 486912 18944 1025536 -144384 493056 1098240 1216000 292352 564224 404480 288768
5643 288768 -16896 768000 -87040 -419328 35840 3584 472576 1474048 729600 1405952
5633 1405952 905728 728576 997376 985088 -31232 -378880 209920 -806912 1344000 922624
5623 922624 297472 -149504 263680 147456 164864 -349696 -22528 1034240 651264 763392
5613G63392B18112L89120d97152a4848k81600D29568A5872J473536D28032B2528
5602g94112A050112K78528d4032A05984K66240b50368F29760e41184b8160G1680
5591I95840D9152P60320J84832b05824k5088A432576D41344L3280e36064C70176
5580E1200P72608q0384C36896R49248l55840J166848q52480K30912p23456L40480
5570A092608n14048c07200A308160L77344A90464J328640M38784B39616E1712
5560E40672M81280l20512a89440E94944k57536M93568P25504K82624G5776L08736
5550C84512O79424O22592b048B4576P50592B49856K42176N24800C40992K93888
5540F34880B68288N00224c15392G59296l072a37216E4784M98688H704J227776
$$ plain form
5613 763392 218112 607232 -497152 -14848 -296448 429568 15872 1489408 428032 22528
5602 -794112 1050112 1328640 -44032 105984 372224 -250368 629760 -541184 -28160 71680
5591 995840 49152 809472 994304 -205824 -230912 1432576 441344 474624 -536064 370176
5580 51200 823808 743424 336896 1286144 930304 2097152 1244672 1475584 752128 1092608
5570 1092608 578560 -307200 1308160 1685504 190464 1519104 1957888 239616 51712
5560 540672 1021952 701440 -189440 594944 337408 830976 1556480 1839104 75776 384512
5550 384512 1063936 1686528 -2048 24576 775168 249856 492032 1016832 340992 634880
5540 634880 268288 768512 -315392 759296 756224 -137216 54784 553472 8704 1236480
5530A236480m25984c77344A70496P48032A90976L1232E632P09632o6560M61312
5520A110016k30912M54656d1472A83296l2768Q9600R77408l45088e74976A5360
5509C51232K60096J45408c68640D31104J87904L23072g05536K10944A088000B26816
5498d81792H92416C07712N73440b47296C96800G3728f28736B47808a28000A88928
5487a28512C36384N01248C99872J09056b31936R0624I20576B42688J005056j24928
5477A122816k39104N27872C21024n8368K06848K6112K65216b16064l45088H44288
5466H42240L49696A85344m6080Q74496l98336k39104j87904O17472J12128m21376
5456D96640O07232D1472J87392M32128N18656n69344k8160j98656M87424p9872
$$ plain form
5530 1236480 810496 -377344 170496 918528 190976 222208 5632 715264 648704 1110016
5520 1110016 879104 1333760 -41472 183296 150528 240128 1217536 872448 -574976 15360
5509 351232 611328 756736 -368640 431104 619008 942080 -705536 -494592 1088000 226816
5498 -481792 892416 307712 881152 -247296 396800 73728 -628736 247808 -128000 188928
5487 -128512 336384 837632 399872 508928 -231936 -141312 920576 242688 1247744 1122816
5477 1122816 883712 1411584 321024 262656 469504 495616 760832 -216064 -561152 844288
5466 842240 1191936 185344 139264 1013760 615424 376320 188416 805888 918016 496640
5456 496640 1103872 41472 228864 660992 1179648 610304 582144 383488 870912 791040
5446G91040j08032l27168P35232k62144d57216H79616M8640A39264K86208a70496
5435F56896l2768I5744J863680p60320n95968L73760Q39680A4848J422336C19488
5424A228288C02080J35680K11456L25120k14016N36064m42880k67776k27328P70048
5414A128448q9600j5872j64352C20000P12704R17504p53664C15392L75296o7584
5404F23104k13504M38272l22560P2192R85088n77536K62656n23776K7136j83808
5394E87264a52064H92416k8160p3728K02240l84000l9936A35168Q8576L17440
5384E41184K34496K93376g168A523712D17280M03968N44256b54976E05344B44736
5373A610240G19872l2256K78528L85024n20192C46624i58464D02432d52608E37600
$$ plain form
5446 791040 683008 355840 1091072 828928 -457216 879616 928256 139264 425472 -170496
5435 656896 624128 95744 1959424 1199104 603136 976896 1816576 14848 1437184 319488
5424 1228288 302080 437760 649216 974336 760320 1296384 853504 585728 358400 1128448
5414 1128448 1038848 1022976 858624 320000 1032704 1950208 1196544 315392 690688 623104
5404 623104 409600 847872 525312 597504 1582592 1005056 1267712 743936 771072 587264
5394 587264 -152064 892416 864256 790528 992768 608768 568832 135168 223744 541184
5384 541184 775680 1069056 -7168 1523712 417280 821248 1365504 -254976 505344 244736
5373 1610240 719872 687616 966144 1351168 830976 346624 -958464 402432 -452608 537600
5362B50368F144g5776F55872c28192A273344A16736R00096d85888I94816H6016
5351C06688Q91904n31968K81088r4720B76992c37408I27744C69152Q91904n90336
5341F70720a5872E14560q4480K012672b67264A67424J72544A66912K36544%M15232
5330H18688j78176c39968A268736I7792c29216F34368B68288J8944J270272P7824
5320A635328o30784D47488H192M80256b7648A255424D21888N21728C29216N19168
5310H48384D03456P1680d22912a36192n92384f5536C98336O04672C76832k6112
5300C50720L25632C3280M96128k16576P71584J55648n18144L58400D84352O1440
5290E45792B31424j5872N26336j01888B69824J76128K65216B49344J0240L50720
$$ plain form
5362 250368 6144 -75776 655872 -328192 1273344 116736 1016832 -485888 994816 86016
5351 306688 1198592 666624 947712 852992 276992 -337408 927744 369152 1261056 670720
5341 670720 -15872 514560 430080 2442752 -267264 167424 339968 166912 403456 403456 818688
5330 818688 640512 -339968 1268736 97792 -329216 634368 268288 287232 1557504 1635328
5320 1635328 1004544 447488 8192 488448 -27648 1255424 421888 943616 329216 848384
5310 848384 403456 475136 -422912 -136192 -728576 -65536 398336 1003008 376832 350720
5300 350720 676352 33280 529408 312832 1084416 1240064 721920 1080320 484352 545792
5290 545792 231424 215552 741888 640000 269824 445952 711168 249344 259584 610304
5280F10304J0752b59584D05504L94752d01920C68128b82112A197568j55136E15584
5269c97824H9088P62880J50016E0176l072J088512K54976n95456q0896B09920
5258F89152M91520E00224j93024K29376A15200O67648b84672A196032j92512m56704
5248E46816K84160q7552C37920K02240e7856A179136K21696B21184K65216n5296
5238D31104j3824j9968L10784C51232K4576a90976F53312l03616J01888p6288
5228C75296L40992L43040f93760D10624O30784B82112J404416d95616C90656N14048
5218I04704a87392A382400g4240A411072o85568B14016f53824B99008J069056
5209A368064E50400J555968G74656p9872O21056d93568A089536C84000e57568
$$ plain form
5280 610304 621056 -259584 405504 800256 -401920 368128 -282112 1197568 1042432 515584
5269 -397824 89088 851968 1001984 50176 47104 1135616 1390592 795136 714240 209920
5258 689152 1180672 500224 307200 536576 115200 782848 -284672 1196032 1003520 546816
5248 546816 830976 743424 337920 540160 -57856 1179136 1400832 221184 486400 431104
5238 431104 417280 397312 708096 351232 375808 -190976 653312 349696 451584 375296
5228 375296 716288 1059328 -693760 410624 1041408 282112 1686528 -495616 390656 904704
5218 904704 -187392 1382400 -74240 1411072 725504 214016 -653824 299008 1368064
5209 1368064 550400 2106368 774656 694784 1315840 -493568 1089536 384000 -557568
5199A213952H8064B0992J001984M1984C7888J485824l93216E64736K36032J96608
5189I97376C33824M09600j7408k47808B11968J9968l6352R49248J63840k12480
5179A096192n45280b17600F54336l4816K78528O65600n61664m11648p1680B3552
5168G95648c75296B276352j108480A78688O64064J1776J5872A19296J027072L70688
5158A517056J140736p73120L82976R35936k79552L9936n80096j077760B67264
5148A353728n09952N11488k6112B560Q05376j74080N59616n5296B9696R99424
5138A029120D91008B2016M14720K07872B44224M69504k01728P49568h4480E85728
5127I83040C23584J009664D14208M1984b23744A210368j88928J8944O67136D14208
$$ plain form
5199 1213952 88064 20992 1022976 1064960 37888 1523712 1130496 564736 800768 997376
5189 997376 333824 743424 726016 478208 211968 231936 195584 1144832 1308672 1096192
5179 1096192 550912 -217600 654336 619520 898048 1563648 1001984 590336 518656 23552
5168 795648 -375296 2276352 1167872 178688 842752 854528 870400 119296 1146368 1517056
5158 1517056 2657792 1884672 2267648 3203584 2924032 2963968 2383872 1306112 267264
5148 1353728 843776 1355264 1329152 2560 807936 633856 1193472 1138176 29696 1029120
5138 1029120 491008 22016 436736 644608 244224 713728 512000 1261568 -84480 585728
5127 983040 323584 1333248 414208 456192 -223744 1210368 1021440 1040384 1707520 414208
5116B060800d11136I10336J7408P3728l70176A15200O71232j24416Q02816m23936
5106A040896k93888B42176a5360F86592O99904o37952a536A7920K44736a85344
5095I68704C90144h00256D3008N57568B24256P77728M05504o28736j79712J123328
5085A722368C92704Q01280C9936M40832M32128M7616K76992B87744b66752A164800
5074E48352K50880R216k40128L97312D15744P56224E45280M24960J197056a73568
5063G26016J194496a8432n2736H24832l35872L14368P99232p27040N83680b72896
5052G98208K29376K15552n62176R6768P82848G13728M11648L3280M40320n63200
5042A035776M17792o76864Q84736l33824D99200j91488J664512I70752r1136K72896
$$ plain form
5116 2060800 -411136 910336 927744 1001472 631296 115200 786432 662016 1464832 1040896
5106 1040896 747008 242176 -15360 686592 1386496 748544 -1536 17920 262656 -185344
5095 968704 390144 -800256 43008 600576 224256 1001984 1407488 778752 599040 1722368
5085 1722368 392704 1193984 39936 480768 912896 960512 1237504 287744 -266752 1164800
5074 548352 799232 808448 568320 965632 415744 1171968 545280 970240 2167296 -173568
5063 726016 1920512 -18432 -71168 824832 488960 803328 1602560 875520 1459200 -272896
5052 798208 1027584 1243136 680960 777728 1560576 713728 1125376 1158656 1598976 1035776
5042 1035776 1453568 776704 1661440 1327616 499200 307712 1972224 970752 879616 1152512
5032A152512A95072J039360l89632J094144H56064l08736J86368L63008k54464
5023H42240K71872j74080J8432J32096K23744c80928D49536J03936A30048n120
5013A24928J540608o34368J50016K74432n10976B98496J201664m67968l10784
5004G21408K2016e4272A689600n32480N91872B19136K01216C072J069568K26304
4994A298944K72384m27008L98336B61120g68512F74304J473536j060864J18272
4985A205248C74784M51072N40672n14560A92000J332224n65248J85856j94560
4976I50272N1712k51904R5232l31264J005568j13664L81952F47680B67776P89504
4966A057280j70496M23936l35360B67776N42208k54464N25312K84160L08224p27552
$$ plain form
5032 1152512 195072 1234432 844800 1938944 856064 547328 733696 1096704 842240
5023 842240 1114112 940032 958464 1090560 1314304 -380928 449536 553472 130048 124928
5013 124928 1665536 1031168 1181184 1455616 944640 298496 1500160 1032192 721408
5004 721408 743424 -54272 1689600 1157120 1748992 219136 420352 3072 1072640 1298944
4994 1298944 1571328 1144320 1542656 261120 -768512 674304 2147840 1086976 1205248
4985 1205248 374784 825856 1366528 851968 192000 1524224 958976 1144832 950272
4976 950272 1001984 750080 845312 514048 1519616 1405952 1787904 647680 267776 1057280
4966 1057280 886784 1310720 975360 267776 809984 555520 1080832 1364992 1673216 945664
4956I45664j30560n7344L92704Q35584r00608c88608p3728A282560j88928J08032
4946A201664M1984m14208L86560m55680Q67328l38944K21184l08224B63168P87456
4936A050624J276928r82528A21856R74848k89792P7824k23744M3520N2224l43040
4926D13696J374720q68864N37600L55328G27040J104896l58400Q704M60800G63904
4915H88832K48832M72576l01056Q61184j039360P15776K66752J32608j002496
4906A243648J518592O84544l39968J180672P57760L33824j297408R88672m32128
4897D638208n73952K59584n08928n08416A426432o5536l9936p3728m9664K55488
4887A453056n11488j32608K72384m52096O77888Q3968B89792o2464Q55552m7616
$$ plain form
4956 945664 815104 757760 1150464 1986048 1085440 -388608 -462336 1282560 1093632 1201664
4946 1201664 1243648 829440 1216000 760320 1627648 1288704 1509888 1201664 263168 1050624
4936 1050624 2327552 1345024 121856 1096704 806912 884736 660992 704512 756736 413696
4926 413696 1788416 919552 1457152 1812480 727040 1831936 1473536 1482240 1943040 763904
4915 888832 1137664 1610240 1309184 2170368 1131008 1846784 2113536 2246144 1243648
4906 1243648 2762240 3446784 3106816 4287488 5045248 5379072 4081664 5070336 4638208
4897 4638208 4064256 4323840 3814912 3306496 1426432 1360896 1320960 1247232 1197568 1453056
4887 1453056 941568 808960 1081344 629248 1307136 1391104 289792 227328 1082880 1035264
4877A035264L5328k67264K68800D21376Q13056r0112K18624J45920n31968%B93376
4865B480640j077248K17088C98336O86080A01888J89440J104384C29728O56384
4856I86112j02400j1264O44608G58272P4752J8432K51904L20000o49728B1504
4845A019904D11136J446912j62816n81632K60096o04672J97120k1504j36192L66592
4835A175040M63360l71200F09280J172480l8400G76704K71360K69312m98688M77184
4825A295872J48480k35520k57024N76512k50880a11616I14432r7280O56896K55488
4815A729536p21408l8400N16608m81280J259008D15232J24416b19136A417216
4805I93792P168M82816D24960Q50944O19008I30816C90656O36416L73248p168
$$ plain form
4877 1035264 1070592 803328 1072128 421376 1234432 1144320 1362944 1508864 976896 976896 293376
4865 2480640 1403392 1620480 398336 1084416 101888 291328 1395712 329728 986112
4856 986112 883712 872448 1517056 758272 833024 851456 1103360 1423360 773632 21504
4845 1019904 411136 1858048 1695232 1113600 1373696 769024 966144 944640 808448 1175040
4835 1175040 1638400 1267200 609280 1781760 1743360 776704 1048064 1317376 818688 1295872
4825 1295872 1444352 1208832 951808 1528320 1277440 -111616 914432 817152 1474048 1729536
4815 1729536 1008128 969728 1486336 1005056 2264064 415232 539648 -219136 1417216
4805 993792 1000960 1483776 424960 1275904 1894912 930816 390656 1027072 1400320 1393152
4795A393152b71872E89312A23392J576960D72576K93376C76832R76896j62304
4786A191424N01760n93920N64736m13184C32288O12864m70528K93376O20032N632
4776A393664E99040P46496H0896R82528J42848J245696H65280A61792R01632j80736
4766H82688B84160P36768N86752o85568l69152j83296J309696q14080M72064K3040
4756A360384j89440M08064o22080J864704I06240L20000J094144F91712P73120
4747A464832n03296O0416R20064H54016L24096l26144Q64768J40288H18688K9696
4737H48384Q99072k17600D30080O96832j03424D46976K27840L31776L09248E24288
4726A114112P2192J06496j58720P57248D31104R20576k03776J87904P1680K33984
$$ plain form
4795 1393152 -271872 589312 123392 1700352 472576 765952 376832 1353728 1191424
4786 1191424 1693184 1099264 1664000 1250816 332288 945152 474624 768000 1388032 1393664
4776 1393664 599040 1345536 80896 1063424 1206272 2451968 865280 161792 1063424 882688
4766 882688 284160 1020928 1607680 922112 552960 369664 1679360 865280 1337344 1360384
4756 1360384 1170944 1579008 956928 2821632 906240 1226240 2320384 691712 1464832
4747 1464832 961536 1021952 1942016 854016 1178112 851968 1716736 1857024 818688 848384
4737 848384 1747456 1529856 430080 1126912 1023488 446976 674816 1006592 1315840 524288
4726 1114112 1186304 1292800 1134080 1891328 431104 1351680 1147904 1335808 1407488 1641472
4716A641472J72544N01248R728q10496G10144J231360H36096j58208J32096K46784
4706A056768j44384l74272M66944J107968I66144K23232J80736J09568P3728l03104
4696A250304k67776l3280Q86784q45824Q51968k89280F73792O10304K08384m46976
4686A045504O55360J80224b05312I80480Q93952r0624m85376O66624q39680o7584
4676A057792J43872P11168K74432o52800m06016E58592M42368R89184n63712k22208
4666A204224j76640l46112N11488M8128p0144O53824N4784a22368A252864Q07936
4656B060800M0448r10848A69984J616384o5024n11488K78528J16224K15040L6864
4646A856512O13888r40544M87936O15936J58720j075200N92384J53600l85536
$$ plain form
4716 1641472 1814016 2315264 2324992 1514496 710144 1941504 836096 677888 809984 1056768
4706 1056768 912384 538112 1005056 2113024 966144 1189376 1370112 1479680 1553408 1250304
4696 1250304 982528 949248 1836032 990208 1842176 1552896 673792 1284096 1492480 1045504
4686 1045504 1700864 1881088 -205312 980480 1874432 1783808 1298432 1965056 1125376 1057792
4676 1057792 1201664 1912832 2187264 1534464 1128448 558592 1000960 1990144 1426432 1204224
4666 1204224 1027584 681472 1192960 1241088 1170944 1824768 1879552 -122368 1252864 2060800
4656 2060800 2101248 1190400 169984 1786368 1721344 1209856 1488384 1604608 1819648 1856512
4646 1856512 2470400 1529856 2017792 2633728 2792448 1717248 2309632 2463232 2077696
4637B077696p00928N1712M82304J82272R41056l16416l50208J95584r60000o6048
4627A537024o26176Q36096N82656L75808A346560J89952R42080M55168A280512
4617B297856k44224K16576o38464m68992O16960M10112n23264L99872O47168j210880
4607A502720J345024m74112Q05376m1472p11168L77344l91680J23392m47488p22432
4597A365504J712640j340928Q10496n05344R08800k3552r35424k81600N4272k99520
4587A465344J467392A217536j04448J284608c39456A841664M79744I42080K02240
4578A144320O88128Q62208o76352j31584L63008j114624R47200H83200Q55040
4569A738240k16576J12128l03616j02400N52448l48672K79552j83296J38752N7856
$$ plain form
4637 2077696 1376768 1428480 1910784 2093056 3034112 2717696 2367488 2563072 1603072 1537024
4627 1537024 910848 1746944 2329600 2705408 1346560 1536512 2478592 2933760 1280512
4617 2297856 2053632 2270208 1631744 1162752 1779712 2189824 1666560 2066432 2713600 1502720
4607 1502720 2847744 2373632 3179008 3137536 2426368 2803712 2412032 2535424 2087936 1365504
4597 1365504 3078144 1737216 2547712 2042368 2951168 2927616 1992192 1710592 1764864 1465344
4587 1465344 2932736 1217536 1113088 2397696 -339456 1841664 2321408 942080 1144320
4578 1144320 1832448 2694656 2018304 1886720 2249728 1135104 2082304 883200 1738240
4569 1738240 1521664 1633792 1330176 1227776 1780224 1431552 1711104 1527808 1666560 1724416
4559A724416b14528A064960M51072p1680D58752O12352j19296M95104R56928j121280
4549A282560P33696j90464l70688o53312R69728o80960N52448N83168m63360k50368
4539A512448n78048R88160A70496P92064k29888P13216M3520j21856B33984J432576
4529A666560M65920l59936m26496J96096k92864N2224O11328p48032n120J353216
4519B512896Q6528A215488J387008j000448N76000m12672O01600k98496q2944
4510A985536P0656P11168r9328A081856R11872R76896r56928r63584R49760R52832
4500B952704p70048Q43776N6832p63904j144320P07072J7920Q2944j84832l8912
4490A759232n7856M49024k75456M63872p94112M92032L06176j122304J339904
$$ plain form
4559 1724416 -214528 1064960 1516032 1444352 458752 1071104 951808 1446912 2403840 1282560
4549 1282560 2016256 1825792 1455104 801792 1771520 1090560 1643008 2226176 1762816 1512448
4539 1512448 934400 1922560 170496 962560 732672 1445888 1489408 1367552 233984 1666560
4529 1666560 2132480 1772544 1346048 1542144 1249280 1301504 1912832 1164800 1159680 2512896
4519 2512896 2599424 1215488 2602496 1602048 2178048 1765376 2366976 2068480 1985536
4510 1985536 2056192 2767360 2668032 1081856 1993728 2970624 2013696 1050112 1999872 2952704
4500 2952704 2182656 3026432 3083264 2319360 1175040 1882112 1900032 1982976 1798144 1759232
4490 1759232 1701376 2150400 1874944 2338816 1544704 2036736 2342912 1220608 2560512
4481B560512A241600j9456K20672Q99072r34400P87968o89152k5600q7552J205760
4471B598912j083904n45792J260544K74432o1440j190912O58432H34560J213440
4462B048000E44768J197568K65728I45152M81792L79392H22784M73600O44096
4453A940480J69984m86400k86720J080832A107456N79072K17088M86400k78528
4444B111488K08896A132032N8880J130496k49344J042944q06400O13888j008128
4435A914368M71040n10976k87744J039360r38496R34400j174528M93056l10272
4426A630208N65248j55648j9456n80096N16096E06368J314816H00768N9392j95072
4416F65088M66432r216K76480M00896j65376L59424o17472J71008r7792k55488
$$ plain form
4481 2560512 1241600 1222144 1442816 2341888 1407488 2195456 1506304 1480704 1393152 2598912
4471 2598912 1515008 969216 2229760 2504192 2442752 1251840 1910272 834560 2048000
4462 2048000 544768 1742336 2008064 945152 1426944 1806336 822784 1296384 1940480
4453 1940480 2110464 1624064 1337344 2418176 1107456 1686528 1903616 2390016 2111488
4444 2111488 2320384 1132032 1190912 2321408 2072064 3115008 2308608 2922496 1914368
4435 1914368 2385408 1874432 1586688 2626048 1687552 2621952 1447424 1940480 1630208
4426 1630208 2195456 2039808 2020352 1440256 1956352 506368 1821184 800768 860160 665088
4416 665088 1131520 1122304 1398784 1799680 1634304 1993728 1376256 1547264 1449472 1193984
4406A193984J641472q55552F70208J298944m63872R8304K11456m89472J017856
4397B343424A099776P38816l11296J079808j150976P66976L98848q58624M8640
4388A811968J013248q4992o85568Q85760l93216P65440p59296J2288j103360L45088
4378A807360l1232k97472Q50944k18624p3728H16640J138176J206784q02816p84384
4368A574400J520128q15104o35904P21920l10784q4992p49056O41024L58400m81792
4358A738240O53312l96800J751040q02816j445888J014272o76352J80224M73088
4349B488320M4544R49248n59616J230336r34912M22400k01728K05824j222144
4340B422272K65728Q77568m71552K84160j21344N93920m12160j01376L56864A556480
$$ plain form
4406 1193984 2835456 1979904 670208 1969152 1505280 1603584 1815040 1325568 2343424
4397 2343424 1099776 1838592 1527296 2607104 1456128 2223104 2621952 1763328 1811968
4388 1811968 2825216 2740224 2054656 2940416 2547200 3312640 2553344 2565632 1462272 1807360
4378 1807360 1776128 1478656 2329600 2110976 2037248 816640 1954816 3161600 2358784 1574400
4368 1574400 3094528 2279424 1643520 2365440 2054656 1969664 1220608 1861632 2220032 1738240
4358 1738240 2391552 1994752 3745792 2942976 1497088 2511360 1835008 2015232 2488320
4349 2488320 2532864 3482112 2922496 4152832 3217920 3640320 3438592 3644416 2422272
4340 2422272 2688000 3565568 3094016 3378176 3256832 3850752 3438592 3337216 3694080 1556480
4329B539520Q7552p33696K243072q02304k21184p38816J95584R24160l61472J146880
4319D279296j640960J016832O8608k12480j204224J241600p37792j87392j71008
4310B452480K74432L76320r22112N93408O52288o80960R5232K53440o12352L61472
4300B843648r8304m31104Q3968p168K03776j09568j48992J161216j632768K67264
4290B131968P24480L01568l34336q32512J30560M29568M95104o07232j082368
4281A356800J143296j73056l84512l31264L86560R43104r60000r50272N68320
4272A598976l12320L29216L9424Q65280n13536M33152j066496J4848M29056m60800
4262A356800J380352r53856K10432L87072k30912A48480O83520J177600l5840
$$ plain form
4329 2539520 2627072 1893376 4136448 3334144 3112960 2374144 2569728 3493888 3132416 4279296
4319 4279296 2638336 3655168 3723776 3511296 2307072 3548672 2810880 2623488 2452480
4310 2452480 2726912 3103232 2181120 2774528 3426816 2745856 2841088 3094528 2482176 2843648
4300 2843648 2745344 2314240 2398208 2391040 2594816 2485248 2336256 3497472 1864704 2131968
4290 2131968 2856448 3158016 2823680 1991168 2121728 2551296 3046400 2439168 1356800
4281 1356800 2500096 2327040 1942528 1611264 1997824 2940928 1980928 1030656 1598976
4272 1598976 1286656 1615872 1655296 2520576 2007040 2440192 1373696 1388544 1817600 1356800
4262 1356800 2737152 1783296 1993728 2380800 2149888 148480 832000 2009600 1973760
4253A973760K7136J65376m27008J136640j415680L45600k55488L2256j63840r0624
4243A328128Q23296k48832l97312Q2432k02240k11968Q22272D77696J395712j54624
4233A718784P27040r38496l49696P35744k08896m3008L66592J25952M76672k30400
4223B380288n68320j98144j04960O60480m94592J8944L12320k19136H72960J779200
4213B652160j59232A209344K96960L86560m4544M72064j030144m58752J722368
4204B553856m64384M73600p04512R42592A312256O03136K36032k71360j18272
4195A761792M81280J2800p66464j54112P83872N85728J87392q22784H22272J078272
4185A900544j2800o6048K80064l25632J88928M53632J03936j145856N02784O87104
$$ plain form
4253 1973760 2000896 2166272 1739264 2875904 1460224 1805824 1550336 1582592 1418752 1328128
4243 1328128 2151424 1902592 1505280 1587712 1385472 1173504 1995776 477696 1873408 1718784
4233 1718784 2445824 1507328 1157632 1893376 1684480 1641472 2008064 2134016 2610688 2380288
4223 2380288 1811968 1613824 1508864 2169344 1674752 1693696 2006016 1786880 872960 2652160
4213 2652160 2492928 1209344 1506304 1892864 1848320 2320384 1290240 831488 2553856
4204 2553856 2089472 2563072 1858560 2801152 1312256 1915392 2151424 1880064 1761792
4195 1761792 2243072 2255872 1489408 1335296 2119168 2704896 2892288 2069504 822272 1900544
4185 1900544 1887744 1821696 2101760 1776128 1965056 2418688 2522624 1376768 1879552 2566656
4175B566656j146880J619456k72896m4032j157632K70848K01728M79232k2016
4166B494464J479168A958912J166848p05536J148416l58912r3696n43232O45120
4157C217920L52768J24416O78400k176000J058304A568256J502208k05312n75488
4148B289664j10080m18816J218560N78560l44576j317888N02784M9664l51744
4139B096128G89504J472512R02656j462784j09568N56544m84352R98400M8128
4130B711040J07008p97184j7920o09792K080256r59488M98176m45440P83872q58112
4120B492416n83168k77504O65088J94048N9392j78176n57568P79264m48000Q82176
4110C027968n06880J35680A179648O07232O00576N35552K2016m13184N9904k83136
$$ plain form
4175 2566656 1419776 3039232 2766336 2722304 1564672 1835520 2037248 2516480 2494464
4166 2494464 3973632 1958912 3125760 2420224 3568640 3209728 3116032 2572800 3217920
4157 3217920 3570688 3695104 4373504 2197504 3255808 1568256 3070464 2865152 2289664
4148 2289664 2179584 1760768 2979328 3557888 3213312 1895424 2398208 2447872 2096128
4139 2096128 789504 2262016 3164672 1701888 1592320 2148864 1664512 2662912 2711040
4130 2711040 2818048 2020864 2002944 1393152 3473408 2513920 3012096 2566656 3350528 2492416
4120 2492416 1909248 1631744 2296832 2490880 2550272 2372096 1814528 2593792 2145792 3027968
4110 3027968 2521088 2656768 1179648 1786880 2387456 2923008 2945024 2531840 2591744 2308608
4100B308608q99584P76704O76352m3008Q872448B617856O20544l34336L36896
4091C240960L91680q47872M88960o65600K44224R85088m21376j30048O70208m60800
4081C495424M9152n95968M16256Q0896J771008m67456q83200O40000l56864j61280
4071C987968O03648L10272l59424J06496m85376j44896l54304J060864k36032
4062D489216q10496P85920l86048L80928l88096L36896M79232J181184j135104
4053D933632k36032P85408l30240L71200N17120M64384j020416P02464k56512
4044E931008Q8576J064960L29728O20544j518592J696768K31936K65728j808384
4035F902272K405888j216512O63552Q60160m86400Q10496J39776O87616K40640
$$ plain form
4100 2308608 1409024 2185728 2862080 2819072 11691520 2617856 3238400 2904064 3240960
4091 3240960 3632640 2784768 3273728 2608128 2852352 3837440 3416064 3286016 3956224 3495424
4081 3495424 3544576 2948608 3364864 3445760 5216768 4749312 3866112 4506112 4149248 3987968
4071 3987968 4591616 4901888 4542464 4648960 4163584 4018688 3664384 4725248 4489216
4062 4489216 3678720 4464640 4078592 4459520 4071424 4408320 4887552 6068736 4933632
4053 4933632 4697600 5483008 5152768 5523968 6041088 6505472 5485056 6187520 5931008
4044 5931008 6019584 7084544 7414272 8034816 6516224 8212992 8444928 8710656 6902272
4035 6902272 9308160 8091648 8755200 9615360 9128960 9939456 10079232 10766848 11007488
4026A1007488k27840L22048R81504l24608O30272Q32000l93728R06240j328128
4017A2405248R50784p28064P81312k067968K95936p75680j42336l32800l31776
4008A0054656k68288o20032j64352j90464P42912K85184l13344q67840K67776
3999H926208j975808M8640L25632R21600J02912j004544M01920l34848R4208q03840
3989F702080m51584j042432j9968o0928o31296n22752N53472k9184q46336K84160
3979C935232N03808k90816N02272j446400M79232Q81152j130496j11104M45952
3970C768832p17824J368576j224704m28032J285632j416192K99520k00704O34880
3961C369984K10944p0144j091072O62016m58752J80224J524736j391104k9696
$$ plain form
4026 11007488 10779648 11101696 12083200 11758592 12388864 13220864 12827136 13733376 12405248
4017 12405248 13356032 12627968 13409280 11341312 11637248 10861568 10719232 10386432 10054656
4008 10054656 9786368 9166336 9001984 8811520 9554432 9839616 9526272 8658432 8926208
3999 8926208 6950400 6999040 7324672 8246272 8349184 7344640 7746560 7411712 7505920 6702080
3989 6702080 6250496 5208064 5188096 5127168 4495872 3973120 4526592 4497408 3651072 3935232
3979 3935232 4439040 4148224 4650496 3204096 3683328 4564480 3433984 3322880 3768832
3970 3768832 3051008 4419584 3194880 2766848 4052480 2636288 2935808 2735104 3369984
3961 3369984 3580928 3510784 2419712 3081728 2622976 2803200 4327936 2936832 2907136
3952B907136O77376j525760K91840l67616J544704j059328J13152l78368J22368
3943B325504J98656l49184J09568P98720m74112R22112p83360l54816J154048
3934C547136j055744m5056L06688N1712m4032q24832J281024p20384N02784M48000
3924C447296m74112P7824m7616q06400Q71936k87744l80416N43744p95648P05024
3914B853888r33376J052160j337344J011200Q3456m26496p43936J523712k40128
3905B843136k29888n71904Q00256j119232O78912p07072J849856n13024j13152
3896B917888p68000n7856m62848N73440R91744m81280J2800j034752M62848j08032
3886B045952N26848N43232m86400r82016j19808R81504l12320N23264n24288l04128
$$ plain form
3952 2907136 3584512 2058752 2350592 1982976 3527680 2468352 2581504 2203136 2325504
3943 2325504 2524160 2174976 2284544 3083264 2609152 3531264 2747904 2393088 3547136
3934 3547136 2491392 2446336 2753024 2804736 2760704 1935872 3216896 2496512 2999296 3447296
3924 3447296 2973184 3051008 3003392 2196992 3068928 2781184 2400768 2944512 2148864 2853888
3914 2853888 1920512 2972672 1635328 2646528 2729984 2303488 1559552 3083264 2843136
3905 2843136 2613248 2041344 2841600 1722368 2401280 1694208 3544064 3031040 2917888
3896 2917888 2149888 2092032 1629184 2202624 3194368 2713088 2725888 1691136 2153984 2045952
3886 2045952 2572800 3116032 2629632 1647616 1527808 2509312 2196992 2720256 2195968 1891840
3876A891840Q3968Q83200A426432J293312M25472B40640J361408L99360O60992
3867B662400L54304A442304J370112n96992l08224L35360Q34560M17792j044992
3858B449920o0416M02432p1168m07040J031680q37632K14016M56192n06368l12832
3848B358784j52064q192M74624M86912j055232R75360j299456R06752L88096r33376
3838B142208R56928m69504n65248M57728Q75008n79072k91328k57536L16928J43872
3828B729984L51744n66272L48160n28384O85568N9392m70528m59264J125888m75648
3818B800640j143296J255936m48512O99904q55040q1920L04640K49856N34528
3809C316736q00768N25312p11680J040384m03968l86048O54336p85920j72032
$$ plain form
3876 1891840 1975808 2859008 1426432 2719744 3145216 240640 1602048 2001408 2662400
3867 2662400 3016704 1442304 2812416 2215424 1907200 2242560 3077120 3494912 2449920
3858 2449920 2389504 2791936 2720768 2313728 3345408 2507776 2721792 3177984 2671616 2358784
3848 2358784 2206720 2198528 2673152 3160064 2104832 3080192 1780736 2687488 3075584 2142208
3838 2142208 3099136 2629632 2064384 2522112 3397120 2818048 2526720 2269184 2586112 2729984
3828 2729984 3081728 2515456 2863616 2335232 3020800 3080192 2609664 2150400 3276288 2800640
3818 2800640 1657344 2913280 2464768 3164672 2309632 2227712 2532352 2782208 3316736
3809 3316736 2515968 3041280 2329600 3369984 2966016 2579968 3234304 2448384 2276352
3800B276352O72256j45408J25952p57248O8608P17312N00736j283584M53120K09408
3790B837504J51552m51584J291776l52768L13856k34496k79552m19328M49024
3781C305984K23744k46784J67424k47296L24096n07392R13920q39680j074176
3772B019840J249280L70688J49504j72032K40640p54176k05824P23968L64544
3763C986432m51584O90688j7920p59296J4848J232896j42848O15424o52800K63168
3753D779008M56192j006592R72288l04640M60800K88768j287680J95584P59296
3744E313024J047552K54976q04864Q21760Q14080k5088J468416j31584l37408
3735H420864J216512j042432P94624J809408N96480l06176n63712J482240J987584
$$ plain form
3800 2276352 2948608 2803200 2929152 2171904 2240512 2957824 3458560 2174976 2628096 2837504
3790 2837504 2989056 2537472 3829248 3476480 3790336 3555840 3276288 2856960 3305984
3781 3305984 3529728 3282944 3450368 3203072 3527168 3019776 3933696 3094016 2019840
3772 2019840 3269120 3639808 3789312 3617280 3857920 3103744 2897920 3621888 3986432
3763 3986432 3534848 4225536 4207616 3448320 3463168 4696064 4553216 5168640 4515840 4779008
3753 4779008 5235200 4228608 5200896 4896256 5357056 5645824 4358144 4553728 5313024
3744 5313024 6360576 6615552 5810688 6632448 7446528 7421440 8889856 8758272 8420864
3735 8420864 9637376 8594944 9389568 11198976 11795456 11489280 10925568 12407808 14395392
3726A4395392p7824J443328O27200Q7552J559040O63040Q61696M99712J818112
3717B1877248J132032r2160K512384j46432l43040j50528K04288j076224r52832
3708B2964736m77184j160192O43584j788416n97504r54880j089024r58976l29728
3699A6252416j726464p36256j940480p26528N1200K78528k32448j539072J59744
3690I840640J70496r57440r50272K44736j046528k82624J362432j296384K33984
3681G319040J63840R42080J52576q14592r49248l01568L15904R51296j329152
3672F450176Q44288o99904K8160M73088O38464j492992M23936R06240K305024
3663I876480m73600K385408J119744q80128o08768j202176k540032K74944l91168
$$ plain form
3726 14395392 14317568 15760896 16388096 16475648 18034688 18697728 19559424 20059136 21877248
3717 21877248 23009280 22917120 25429504 25283072 24940032 24789504 24993792 23917568 22964736
3708 22964736 22487552 21327360 21970944 20182528 19585024 18630144 17541120 16582144 16252416
3699 16252416 14525952 13789696 11849216 11122688 11173888 11452416 11219968 9680896 9840640
3690 9840640 10011136 9053696 8103424 8348160 7301632 7019008 8381440 7085056 7319040
3681 7319040 7482880 8424960 8577536 7762944 6813696 6512128 6828032 7779328 6450176
3672 6450176 7294464 6594560 6622720 7095808 7734272 6241280 6665216 7571456 9876480
3663 9876480 9402880 11788288 12908032 12027904 11419136 10216960 7676928 7951872 7560704
3654G560704m19840k31936m78208r3696o12352Q76544O88128j107968M096k36544
3644E948928L15904L46112L16928N12O1952o1440p48544J006080p53664m06528
3634F026240j79712R55392M52096R19040j362944Q57600q37632n93408N29408
3625F766080m45440j049088P168j338880J130496p99232J349120j42336j371136
3616D106752J98656P77728N70880n47840K17088j073664j45920J259520p03488
3607D659712j86880Q4992M68992M72064j43872k11456j65376n05344M29568K95424
3597E197824R95328m23424n31456o37952R09312k48320N1200n21216J251328k168320
3587C874304M29568J85856j55648J592832p18336K4064j05472J25440L45600L39456
$$ plain form
3654 7560704 7140864 6908928 6430720 6337024 5724672 6601216 7289344 6181376 6185472 5948928
3644 5948928 6264832 6610944 6927872 6928384 6990336 6928896 6180352 7186432 6432768 6026240
3634 6026240 5846528 6801920 7254016 8173056 6810112 7667712 6830080 6236672 6766080
3625 6766080 6320640 5271552 5278720 3939840 5070336 4271104 5620224 5477888 4106752
3616 4106752 4305408 5083136 5654016 5106176 5323264 4249600 4103680 5363200 4659712
3607 4659712 4472832 4557824 5026816 5498880 5355008 5143552 4978176 4472832 4902400 5197824
3597 5197824 6193152 5769728 5238272 4600320 5509632 5261312 5312512 4791296 6042624 3874304
3587 3874304 4303872 4489728 4334080 5926912 5208576 5232640 5127168 5252608 5598208 5937664
3577E937664k81600j184768J672704l35360N3248r46688l97824o15424N84704
3568D486656m63360j022976J516544J162752j421312M49024q33024J047552o57408
3559D264448M68480K84160%j28000o92736N34016m65920m87936l50208R72288
3549D398592P46496j14688l45088O75840j090048N23776N0688R54368j182208
3540D617728P82336r37472J354752o38464O92224N46304j593344Q79616R12384
3531F616064p87968j341952J868288j112064N12512Q44288r90720m82816Q26368
3522E952000r08800K153472j667072K10944m27520O24640l75808J026560k54976
3513F333440m39808r62560J875968k17600O63552j076224K60096Q48384p35232
$$ plain form
3577 5937664 5656064 4471296 6144000 5808640 5861888 4915200 4517376 3901952 4486656
3568 4486656 4023296 3000320 4516864 5679616 4258304 4707328 3874304 4921856 4264448
3559 4264448 4732928 5017088 5017088 4889088 4196352 4730368 4264448 3776512 3426304 4398592
3549 4398592 5145088 5030400 4685312 5361152 4271104 4794880 4845568 5799936 4617728
3540 4617728 5400064 4462592 5817344 5178880 5871104 6417408 4824064 5703680 6616064
3531 6616064 5828096 4486144 6354432 5242368 5754880 6599168 5608448 5125632 5952000
3522 5952000 5043200 7196672 5529600 5740544 5313024 5937664 5561856 6588416 6333440
3513 6333440 5893632 4931072 6807040 6589440 7252992 6176768 6436864 7285248 6550016
3504F550016o85568L13344J285632Q58112j046528J017856J94048j78688J304064
3495I612288M06016k04288K15040j1264r32352L38944J082368j195008P6800N01248
3485I889792p60832J34144L02080M30080l81440Q63744m13184J501696R10848
3476A2476928l44064O67648l29728O87616r21600j86880l90656R26720p40352
3467A1845632J646080m81792R14944J236992N89824m28544M42880k86720P7824
3458A5557120Q58112O30272P39840L84000n66784K562560k78016L40992J211904
3449B1440000J26464J294848R02144M73088Q33536K043904P92576R32352J509376
3440C0348288K580480K509824J233920K063360L081216K961408L803136K989568
$$ plain form
3504 6550016 5864448 6177792 7463424 8321536 7275008 8292864 8486912 8308224 9612288
3495 9612288 10018304 9814016 10029056 10017792 9085440 9424384 10506752 9311744 9388544 9889792
3485 9889792 9128960 9263104 9565184 9995264 9613824 10477568 10064384 11566080 12476928
3476 12476928 12132864 12800512 12470784 13158400 12236800 12049920 11659264 12585984 11845632
3467 11845632 13491712 13009920 13924864 15161856 15751680 15323136 15766016 15479296 15557120
3458 15557120 16415232 17045504 17785344 18169344 17602560 20165120 19887104 20228096 21440000
3449 21440000 21566464 22861312 23763456 24236544 25070080 27113984 27906560 28838912 30348288
3440 30348288 32928768 35438592 36672512 38735872 41817088 44778496 48581632 51571200
3432E1571200N200384M793856N538304N898240O980608Q032768R024000Q112128
3424A05151488Q570368J2425728Q461824J2729344J4230528J5675904J6864768
3417A94109952J8736640K6359808K9015040L7598720M7566848O2773760Q8588800
3410E04749568J26941696J72041728K10219520K07988224J35185920k6356224
3404A330770432j98116352k53297664k14364672j62104320j22165248q9561088
3398B91161088n9617792m0839680l0735360k3007744j9152896j2544512j1125760
3391I4137344p652864p178240n319168n458432n422592l771904k310656l238912
3383E3784576l656192k979840l217408o23616k125824k641920k026496j383936
$$ plain form
3432 51571200 56771584 61565440 67103744 73001984 79982592 88015360 97039360 105151488
3424 105151488 113721856 126147584 134609408 147338752 161569280 177245184 194109952
3417 194109952 212846592 239206400 268221440 305820160 353387008 416160768 504749568
3410 504749568 631691264 803732992 1013952512 1221940736 1357126656 1330770432
3404 1330770432 1132654080 879356416 664991744 502887424 380722176 291161088
3398 291161088 231543296 190703616 159968256 136960512 117807616 105263104 94137344
3391 94137344 86484480 79306240 73987072 68528640 63106048 59334144 57023488 53784576
3383 53784576 50128384 47148544 43931136 43307520 41181696 38539776 36513280 35129344
3375C5129344N12512j521664k066432j151488l21536k006016M43392p68512j404416
3366B6845184o89664j193984j147392q51456j266688j402368N59104p88992n120
3357B0058624q24832k629632J381888o44608p53152m29056J024000j298432J068032
3348A6952832j728000l22048j17248j280512Q10496m19328p79264k74944o89664
3339A2152320O44096j262080q91392k65216o02624M53120q73472R39008n99552
3330I694208O37440l79904J367040o19520j30048l17952l13856r29280M98176
3321I506304p96672K66240r01120L072O51264k07872O89664j715200K23232L68128
3311H087040o42048O67648M36736M94592j067008P97696R1648K50880K98496r03680
$$ plain form
3375 35129344 35641856 34120192 32053760 30902272 30580736 28574720 29018112 28249600 26845184
3366 26845184 26155520 24961536 23814144 22962688 21696000 20293632 20852736 20063744 20058624
3357 20058624 19233792 16604160 17986048 17341440 16588288 16159232 17183232 15884800 16952832
3348 16952832 15224832 14902784 14785536 13505024 14315520 13896192 13116928 12841984 12152320
3339 12152320 12796416 11534336 10642944 10377728 9775104 10228224 9354752 10293760 9694208
3330 9694208 10331648 9951744 11318784 10699264 10569216 10251264 9937408 9008128 9506304
3321 9506304 8709632 8975872 8074752 8077824 8729088 8521216 9210880 7495680 7718912 8087040
3311 8087040 7444992 8112640 8549376 9043968 7976960 8774656 8866304 9117184 9415680 8512000
3301H512000o45120J015296j232384K25792k54976m6592K48320m83328j076736
3292F262272P41376N53472j87904P82848r4208j122304P99232J62816o21056l22048
3282F954496m99200l584k92864j1264L07200K12992m81792K5600K75968k31936
3272F255616o27712J66912K43712Q70912q16640M2496k65216J43360O05696k02240
3262F416896l42016k63680O656N46816p81312p28064O21568L56352p47008R32352
3252F018560r71776K9696j73056k44736J260032N12512j0752K56512l33312L24608
3242F668288M4032p73120L96288q33024j065472L92192n51424n2224q03840p9360
3232C342336K2528K88768K2016K73920M1472N9904R21600r96864M1984J147392
$$ plain form
3301 8512000 7866880 8882176 7649792 7875584 7620608 7574016 7822336 7339008 6262272
3292 6262272 7003648 7557120 7369216 8152064 8057856 6935552 7734784 7897600 7276544 6954496
3282 6954496 6455296 6451712 6158848 6147584 6454784 6667776 6185984 6211584 6487552 6255616
3272 6255616 5627904 5794816 6038528 6909440 6092800 6135296 5870080 6013440 6619136 6416896
3262 6416896 6074880 5811200 5817856 6364672 5583360 4855296 5476864 5833216 5086208 6018560
3252 6018560 5046784 5076480 4903424 4658688 5918720 6431232 6420480 6676992 6343680 6668288
3242 6668288 6712320 5939200 6335488 5502464 4436992 4829184 4277760 4225536 3421696 3342336
3232 3342336 3364864 3653632 3675648 3949568 3991040 4050944 4972544 3975680 4017664 5165056
3222E165056r79968q31488J975808q69376J274880J35680j66400J69984K69824
3213F144000J725440J086976o73792l61472J198592k178560L94752p0144q93952
3204F371840j129984p35232J034752q49920P5264J3312q08448M36736m4032k37056
3194D127232N77536l24608K23744j681408J260032K10432r84576M13184J04960
3185C926528l42016L23072K68800n71392l42528J822720j433088l94240M00896
3176C658752J134080n37600N18144j18272k76480J121280O33344n65248O89152
3167F257152l76320J476608J38752m93056R75360o88128J074688j50016l57888
3158G857152J063424o8608L99360n17120J077248L47136N91360j08032P34208
$$ plain form
3222 5165056 4185088 3353600 5329408 4460032 5734912 5870592 5704192 5874176 6144000
3213 6144000 7869440 8956416 8282624 7921152 9119744 6941184 7335936 7265792 6371840
3204 6371840 5241856 4506624 5541376 4691456 4766720 4780032 3971584 4408320 4364288 4127232
3194 4127232 4704768 4380160 4603904 2922496 4182528 4392960 3408384 3821568 3926528
3185 3926528 3584512 3907584 4176384 3604992 3262464 5085184 3652096 3257856 3658752
3176 3658752 4792832 4255232 4773376 4655104 4378624 5499904 6133248 5568000 6257152
3167 6257152 5880832 7357440 7496192 7003136 7978496 7290368 8365056 8215040 7857152
3158 7857152 8920576 8851968 9251328 8734208 9811456 10158592 10749952 10641920 11376128
3149A1376128J199104o08256P5776p8336P33696m98688Q84224K53952P60320k5600
3139A4072320P87456J94048O35904N07392J085952Q6016j002496K095104p24992
3130A7736704R73312P06048P48032p15264J12128P6288K037760k87232m3008J291776
3120B2636544K56512O76352J196032n24800K30912R76896Q43264l36896R76896
3111B6931712r73312J9968K66240j07008K27328j384448n23776n07392K20160
3102B4169472j333760n6832j528832j130496j570816p78240k141184j329152j254912
3093A3045248q83712m22400M096j207296n34528p02976l50720J068032q50432
3084I165312N60640J4336r00096K86720j856512R09312k52928J05984k64704j81760
$$ plain form
3149 11376128 12575232 11966976 12042752 11964416 12698112 12199424 13083648 13337600 14097920 14072320
3139 14072320 14859776 15053824 15689728 16197120 17283072 17369088 16366592 18461696 17736704
3130 17736704 18710016 19416064 20164096 19448832 19560960 19637248 21675008 21387776 21344768 22636544
3120 22636544 22893056 23569408 24765440 24240640 24471552 25448448 26291712 25954816 26931712
3111 26931712 25958400 25978368 26244608 26137600 26364928 24980480 24456704 23949312 24169472
3102 24169472 22835712 22778880 21250048 20119552 18548736 17770496 15629312 14300160 13045248
3093 13045248 12161536 11739136 11743232 10535936 10001408 9298432 8947712 10015744 9165312
3084 9165312 9725952 9740288 8840192 9126912 7270400 8179712 7926784 8032768 7768064 7586304
3074G586304N8368K5600l80928j98656r9328p43936Q88832K04800k99008m49536
3064F592512P31136N62688n30944L24096P26016k004480M46976J04448m28032
3055F524416N91360j053184L29216M76160n88288J41824j65888J385984k710016
3046D931584J940992k00704N72928j498112J396224m02432n64736N51424k73920
3037F453248j52064J10080j038336R39520j169920o9632K43712J943040j543168
3028E716480j63328R3696j97120Q39680j296896L80928Q45824l09760k7136o3488
3018E818880j79712L40480n13024Q35584p53152k09408O59456r48736j44896N23264
3008E428736j125376J786368k47808J69472j210880R88672N84704m79232N69344
$$ plain form
3074 7586304 7644672 7670272 7289344 7090688 6991360 6247424 7136256 7341056 7042048 6592512
3064 6592512 7323648 7886336 7355392 7679488 8405504 6401024 6848000 6952448 6524416
3055 6524416 7115776 6062592 6391808 6867968 6279680 6421504 6255616 7641600 4931584
3046 4931584 6872576 6671872 7244800 5746688 7142912 6740480 6175744 6727168 6453248
3037 6453248 6301184 6411264 5372928 6312448 5142528 5072896 5316608 7259648 5716480
3028 5716480 5553152 5646848 5449728 6289408 4992512 5373440 6219264 5909504 5882368 5818880
3018 5818880 5639168 5979648 5466624 6302208 5549056 5339648 5999104 5050368 4905472 5428736
3008 5428736 4303360 6089728 5841920 6011392 4800512 5789184 6373888 5894656 6464000
2999F464000o09280P62368j82784R1648P32672J73568m82816J328128j597952
2990F679552R29280J200640Q23808J764352K150912M944384P403008J360384m701696
2981B2554624L04640K855424n822464o759936m214272j242624L46624j262080
2973F759936M08576j543168N64736j82784n0688m44416N7344p9360J93024n12000
2963E171200N26336p7824m49024P32160r2672n7856o75840N12m39296P97696p46496
2952D688896o75328J52064L46624M23936Q88832m92544q69888J640960j600000
2943D503552P15776l2768l78368m02944Q19712j426432J915392j467904J3312
2934D259328n93920J180672J40288m76672M52096j068544J39776m20352R03680
$$ plain form
2999 6464000 5854720 6617088 6434304 6525952 7258624 7432192 6949376 8277504 6679552
2990 6679552 7608832 8809472 9633280 11397632 13548544 18492928 25895936 27256320 22554624
2981 22554624 22859264 25714688 19892224 13132288 8918016 7675392 8022016 6759936
2973 6759936 7168512 5625344 6190080 6007296 5956608 5512192 5569536 5490176 5683200 5171200
2963 5171200 5697536 5619712 5170688 5902848 5810176 5752320 5076480 5076992 4637696 5435392 4688896
2952 4688896 4013568 4165632 4512256 4936192 5825024 5332480 4462592 6103552 4503552
2943 4503552 5219328 5186560 4808192 4405248 5224960 3798528 5713920 4246016 4259328
2934 4259328 3665408 4846080 4986368 4509696 4961792 3893248 4033024 3612672 4516352
2925D516352p05024L03616M91008N50400j086464J3824P77728q14592l46624L25632
2915D025856Q77056j014272k65216L00544R49248J28512r71264j536r36448J320448
2905D412928K78528o96832K11968n63200J502720j619968m27008M02944R14432
2896D416512M00896m12160o55872M12160N01760m8128J225728k608128J247744
2887D480512K75456j374720J221120O61504q23808j77664q39680J543168j068544
2878C897344P07072M60800k07360k34496k85184J441280j291264j89952M45440
2869D743680J03424l29216k58048O11328q14592N35552k17088j03936L01568J64352
2859D737024o64576N05856K45248P5776k23744K57024O2976M73600j28512n20704
$$ plain form
2925 4516352 3811328 4114944 4605952 5156352 4069888 4083712 4861440 4046848 3700224 4025856
2915 4025856 4902912 3888640 3623424 3923968 4873216 5001728 4030464 4028928 3092480 4412928
2905 4412928 4691456 3994624 4206592 3643392 5146112 3526144 3099136 3502080 4416512
2896 4416512 4817408 4405248 3749376 4161536 4663296 4615168 5840896 3232768 4480512
2887 4480512 4755968 3381248 4602368 5263872 4440064 4262400 3422720 4965888 3897344
2878 3897344 4604416 5065216 4857856 4623360 4338176 5779456 4488192 4298240 4743680
2869 4743680 4847104 4517888 4259840 4871168 4056576 4592128 4375040 4271104 4572672 4737024
2859 4737024 4072448 4578304 4823552 4899328 4675584 4932608 4995584 5469184 5340672 4819968
2849D819968j29536O06720K85696k44224L96800j505792K772480j089536n0688
2840E861888R10336l99872L63008l11296J68960R42080M21376m73088M18304L1744
2830G933440J75616J647104o45632j87904Q01280J46432P68512J42336J613312
2821A2394496J67424k51392K168320o8608P48032l81440M61824r78432l34336
2812A3925888P05536l10272O82496K9696o80448j4336M26496k14528P92064p82336
2802A4560256N10976K95424j088512j62816P14240j430016R69728j63328l32288
2793A3873664n21216j036800P41888j151488r42592M28544j869312J74080r95328
2784H701440L91680n28896j479680J65376K27328q54016j34144J682432q18176
$$ plain form
2849 4819968 4690432 5297152 5582848 5338624 5735424 4229632 7002112 5912576 5861888
2840 5861888 6772224 6372352 6735360 6424064 6593024 7535104 7956480 7483392 7901696 7933440
2830 7933440 8109056 9756160 9110528 8922624 9723904 9870336 10638848 10781184 12394496
2821 12394496 12561920 12310528 14478848 14410240 15158272 14776832 15238656 14260224 13925888
2812 13925888 14631424 14321152 15003648 15033344 14352896 14338560 14765056 14550528 15342592 14560256
2802 14560256 15071232 15366656 14278144 14115328 14829568 13399552 14369280 14205952 13873664
2793 13873664 13352448 12315648 13057536 11906048 10963456 11392000 9522688 9696768 8701440
2784 8701440 9093120 8564224 7084544 7249920 7477248 6623232 6489088 8171520 7353344
2775G353344j1776r16480J151488R58464k29376l58912Q8064K326528K852864
2766A3214208O320128J1259392J4140928j3958656j2320256p136768k852352o25664
2758H040960n09440j068544n00736n48352l49184K74432j57184j042432N5808
2749D195328L71200m85888J9968L49184N84704p77728N90848R9328j043456o144
2739C897344J583616p32672M54656L9936p90528r53856P34208N72928B110976
2729C845632J353216j231360j41312O56384K97984K38080P4240m53632r03168
2720C736064R216M06528j051648K024960k35008j112064N10976j4336j33120k93376
2710C848192l73760J53088Q12032j08544J00352j208832L98848O17472r1648n03808
$$ plain form
2775 7353344 7341568 6425088 7576576 8535040 8305664 7946752 8034816 10361344 13214208
2766 13214208 19534336 30793728 44934656 30976000 18655744 11518976 8666624 8040960
2758 8040960 7531520 6462976 5962240 5413888 5064704 5339136 5181952 4139520 4195328
2749 4195328 4566528 4080640 4100608 4449792 5034496 4256768 4847616 4946944 3903488 3897344
2739 3897344 5480960 4748288 5202944 5242880 4452352 3498496 4232704 4805632 2110976
2729 3845632 5198848 3967488 3826176 4482560 4780544 5018624 5092864 4639232 3736064
2720 3736064 3745280 4151808 3100160 5125120 4890112 3778048 4289024 4274688 4141568 3848192
2710 3848192 3474432 3627520 4439552 4331008 4431360 3222528 3621376 4238848 4147200 3643392
2700C643392R49248O34880j827840Q60160J274880k69824j017856M15232j20320
2691D541952O81984M57216j16736M09088J15712N69856N30432N59104J14688R65632
2681H828928P46496j40800L50720K873856O099456R312256J6979968J2668928
2673E7719808j8332672j4682112r027072j484800j489408J225728K805760P060480
2665B3795712J3512192j905152j3177856o702080k340864J06496M090880L089408
2657B0468736J0631680J7013248n88800j9105280j0885120m615680R6256N80608
2649A3595648K705408N051904J2583936l39968j2640256q372736m137984R5744
2641H541696P11680J061888K286592N454848K43712o803968l340800j712640l59936
$$ plain form
2700 3643392 4592640 5227520 3399680 4259840 5534720 5264896 4247040 4662272 4541952
2691 4541952 5223936 5681152 5564416 5973504 6089216 6659072 7189504 7748608 7863296 8828928
2681 8828928 9575424 9434624 9785344 12659200 18758656 28070912 45050880 57719808
2673 57719808 39387136 24705024 15677952 14193152 12703744 13929472 16735232 23795712
2665 23795712 37307904 35402752 22224896 15522816 13181952 13288448 17379328 20468736
2657 20468736 31100416 48113664 47524864 28419584 17534464 12918784 13015040 13595648
2649 13595648 16301056 21352960 33936896 33596928 20956672 12583936 8445952 8541696
2641 8541696 9253376 10315264 12601856 18056704 18300416 11496448 8155648 6443008 6083072
2632F083072O144j801728R82528p06560j502720K215424j381376N72928k90816
2623D176896P60832j028096l74272J086976P94112M59264j259520O92736K78528
2614E587456M02944O65600r01120k51904k59072j55136j40288J103360k67264
2605E784576m69504r8816J0752j35168l45600r64096J13152q46848N75488j440768
2595B183168J340416K53440k00192n52960m82816N58592J32608l45088J209856
2586D097024j089024p32672l4816J417216j200640P31136A401344Q36608J115648
2577C353600r27744o63552J122816j79200N4272o69696O73280q52992J470976
2568C381760n04320p47008J550848j219584L52256P01952k21184A393152J428480
$$ plain form
2632 6083072 6089216 4287488 5270016 4563456 3060736 5276160 3894784 4467712 4176896
2623 4176896 4937728 3909632 3535360 4622336 5416448 5875712 4616192 5308928 5587456
2614 5587456 5990400 6656000 5754880 5502976 5243904 5088768 4948480 6051840 5784576
2605 5784576 5315072 5216256 5227008 5091840 4746240 3782144 3895296 3048448 3623936 2183168
2595 2183168 3523584 3777024 3576832 3023872 2541056 3099648 3232256 2887168 4097024
2586 4097024 3008000 2275328 2240512 3657728 2457088 3188224 1401344 2237952 3353600
2577 3353600 2425856 1762304 2885120 2705920 2760192 2090496 2763776 1910784 3381760
2568 3381760 2877440 2130432 3681280 2461696 2813952 3515904 3294720 1393152 2821632
2559B821632P10656k11456n09952M65920q16128M60800l68128J264640o94784
2550C123200q77056J420800j143296Q47360q42240k5600L65056k7648n26336P42912
2540C057152j73568n42208J011712J33632n74464p36768O28736r70752P59296
2531B592768K42176J16224J279488n57568r01120L65568L46624J19296j148928
2522B454528L24096P73120A593856K454528j026048M4032o31296J015296j516544
2513A933824L00544P50080P42400j751040K116096j035776K08384l26656l23584
2504B614272N55008l65568m32128m03968J336320l82976N02272m5568j249280
2495B128384P80800k95936M44416n74976l35872J049088q3968k52928k70848M65920
$$ plain form
2559 2821632 3532288 3320832 2810880 3276800 2460672 2921472 2553344 3817984 3123200
2550 3123200 2246144 3666944 2523648 3371008 2528768 2503168 2868224 2840576 2314240 3057152
2540 3057152 2883584 2341376 3353088 3486720 2912256 2175488 2804224 1833472 2592768
2531 2592768 2834944 2951168 4230656 3673088 2771968 3137536 3484160 3603456 2454528
2522 2454528 2778624 3551744 1593856 4048384 3022336 3066368 2435072 3450368 1933824
2513 1933824 2234368 2984448 3726848 1975808 4091904 3056128 3264512 2937856 2614272
2504 2614272 3169280 2803712 2371584 1967616 3303936 2920960 3423232 3377664 2128384
2495 2128384 2909184 2613248 3057664 2482688 2146816 3195904 3111936 2859008 2588160 3054080
2485C054080J9968M17280r15456O656R90720m07552m75136k15040P0656N89312
2475C135488N96480k58048j284096P43936M29568j175040P30624Q34560j276416
2466B477056M51584p6800L072j083904P10656o66112J551872o71744o69184L69664
2456B396160Q31488K86208n23264q3968K57024p23968K19136o01088R57440M14208
2446C429376O18496j900544l36384j14176J239040k45248K22208n45280J67424
2437B534912J671168j240064j64352R66656m47488j326080K011648n89312o24640
2428B792448J82784P80800l35872J66400j261568K140672p73632J244672q53504
2419D083200j57696p22944k74944Q52992j042432O51776n77024L15392M85376
$$ plain form
2485 3054080 3074048 3491328 2575872 2582528 3573248 3165696 2690560 2475520 2546176 3135488
2475 3135488 3731968 3473920 2189824 2933760 3363328 2188288 2918912 3753472 2477056
2466 2477056 2928640 2851840 2854912 1771008 2481664 1815552 3367424 2695680 2026496 2396160
2456 2396160 3227648 3513856 2990592 2906624 3163648 2439680 2658816 2057728 3015168 3429376
2446 3429376 4047872 2147328 1810944 1696768 2935808 2690560 2912768 2367488 2534912
2437 2534912 4206080 2966016 2801664 3768320 3320832 1994752 4006400 3417088 2792448
2428 2792448 2975232 3756032 3420160 3586560 2324992 4465664 3692032 4936704 4083200
2419 4083200 3925504 3202560 2927616 3780608 2738176 3389952 2812928 3128320 3613696
2410C613696Q87808j428480M32640N18656j65888n83168L43552K10432K14016
2401D043264L23072n14560J29024j98656J011200m18304M71040M2496J18784J67936
2391E175296M38784o21568M36736J51552q57088j28000p61856Q66304n2224l32288
2381D315648O30784p2192q19712j83296k21696J573376q76032l41504M94592M9152
2371D549120m98176J005056m95104j011200J320960j45408K560o66624o96832
2362C364352J101312N88800o61504j82784j058816M15232M18816n01248k37056
2353C247104Q33024k9184n55008P7312J6384Q09984j160192M18816p8848r75872
2343B603520J204224R89696m10112m09600r73312J762304j015808r25184O34880
$$ plain form
2410 3613696 4501504 3073024 3505664 4024320 3858432 3275264 3618816 3829248 4043264
2401 4043264 4366336 3851776 3980800 3782144 4793344 4375040 4846080 4888576 5007360 5175296
2391 5175296 5614080 4992512 5429248 5580800 4723712 4595712 3833856 4700160 4647936 4315648
2381 4315648 4946432 4874240 4054528 3871232 3649536 5222912 4346880 4005376 4499968 4549120
2371 4549120 4050944 5056000 4560896 3549696 4870656 4725248 4727808 4061184 3364352
2362 3364352 4465664 5054464 4392960 4210176 3151360 3566592 3985408 3484160 3247104
2353 3247104 4080128 4050944 3495936 3573248 3589632 4399616 3239424 3658240 3579392 2603520
2343 2603520 3807744 4797440 4387328 3977728 3004416 4766720 3750912 2825728 3460608
2334C460608j76128k560L71712p79776J114112j148928j45920K040320m44928
2325D288512n97504L70176L2256j5872K06336O01088m70016r85088J221120j74080
2315D476928p02464k38592o9632L7376L37408K20672M06016r79968M92544O75328
2305D655616j189376J125376r37472P6288N15072j47456k96960K12480P76704
2296D790272j435136J386496K52928O46656j974784R24672l34336J96608K57024
2287D710400M18304M88960o37440o03648J556992r83552Q42752j193472M54144
2278E053440N0688l25120J23392O69696k64192j12640L32288j6896n25312j089024
2268C896320J899008j131008k3040j53600j65888J908736j106432P89504r48736
$$ plain form
2334 3460608 3284480 3281920 3653632 2873856 3987968 2839040 2693120 4733440 4288512
2325 4288512 3691008 4061184 4093440 4077568 4283904 4884992 4414976 3429888 4651008 4476928
2315 4476928 3774464 3535872 3466240 3503616 3841024 4061696 4467712 3487744 3980288 4655616
2305 4655616 3466240 4591616 3654144 3730432 4245504 4098048 3801088 4013568 4790272
2296 4790272 3355136 4741632 4994560 5641216 3666432 4591104 4256768 4453376 4710400
2287 4710400 5128704 5617664 4980224 4376576 5933568 4950016 5792768 4599296 5053440
2278 5053440 5104128 4779008 4902400 5572096 5307904 5195264 5527552 5510656 4985344 3896320
2268 3896320 5795328 4664320 4641280 4487680 4321792 6230528 5124096 5913600 4964864
2259D964864m88448M62848j072640N86752j26976j52576J95584R12384o85056
2250D596736o56384P29600j347072O36416l68640O95808q51968P76192o75840
2241C534848M01920L27680m8128J536L90144R6256J90464j17760p30624N88288
2231D634624o55872j229312K896896r83552j8944k82624q78080J108992J242624
2222E834752j725440O6560L44064M21888r64608J145856k253824K279424L65056
2213E513728r63584O47680q65280J009152l22560M09600O79936j439232Q77056
2204E546496j29536Q81664j41312o50240J35168m45440J068032M13184P41888
2195G419904j224192N52448J98144j180672r9840l12320K8160M24448J747456
$$ plain form
2259 4964864 4476416 4939264 3866624 4453376 4326400 4173824 4369408 5281792 4596736
2250 4596736 3940352 4669952 3322880 3959296 3590656 4286464 3434496 4210688 3534848
2241 3534848 3936768 4264448 4216320 4217856 4608000 4704256 4894720 4776960 4046336 4634624
2231 4634624 3978752 2749440 5646336 4662784 4643840 4361216 3483136 4592128 5834752
2222 5834752 4109312 4175872 4519936 4941824 3977216 5123072 2869248 5148672 5513728
2213 5513728 4550144 5197824 4332544 5341696 5019136 5428736 6108672 4669440 5546496
2204 5546496 5416960 6298624 6157312 5507072 5642240 5196800 6264832 6678016 7419904
2195 7419904 6195712 6748160 6946304 5765632 5665792 5353472 5381632 5806080 7553536
2186G553536j147904r52320P10144n41184J279488j40288n2224R34912m7104r05728
2176F691328n05856L94752N16608L21024j097728J308672k59072J81760L3280
2167G584768n22752j562624Q57088k70336J79712Q95488m01920m91008K12992
2158F481408J75104r2672L6352n58592l9424N03808L35360j330688K41664p24480
2148E027840R91744J88928J024M06528q30464O57408O43584j090560J056256j197568
2138E854720J536L00032N21216m30592j240576R53856R04704j304576k25792J11616
2128E446144r52832J344000r82016J98144j90464L33824j66400m1472k27328q82688
2118C878912M09600R76896k75968N30944J67424p23456J23392k66240j017856
$$ plain form
2186 7553536 6405632 5453312 6163456 5622272 6901760 6761472 6709248 7644160 7597056 6691328
2176 6691328 6185472 6580224 7096832 7417856 6320128 7628800 7369728 7551488 7584768
2167 7584768 7062016 5499392 6356480 6086144 6265856 7161344 6759424 6268416 6481408
2158 6481408 6656512 6563840 6600192 6041600 6002176 6505984 6841344 5510656 5752320 5027840
2148 5027840 6019584 6208512 6209536 6616064 5785600 6443008 7086592 5996032 7052288 5854720
2138 5854720 5856256 6156288 6677504 6246912 5006336 5960192 6864896 5560320 5334528 5446144
2128 5446144 4493312 5837312 4855296 5053440 4862976 5196800 5030400 4988928 4761600 3878912
2118 3878912 4288512 5265408 4989440 5520384 5687808 4964352 5087744 4821504 3803648
2109C803648K209280k62144o15936K9696q00768J452544P21408o64064N6832K77504
2099F208000r3696m55168J021952j609216R24672L26656L13344j142784J85344
2090E679104J012224L64032j167360K20160K93888k28352J160192j372160K70848
2081F232576j11616M81280m11648J420288M4544j235968J017856m58752K82112
2072G260672r8816Q01280p81824J068544J397760p78240K59072p90016K91840
2063H630272l06688M72576K03264o59456N86752R57952o68672m94592J023488
2054I744896o71232K95936N03296N1200j176064k72384J134592p4752J92000n36576
2044I190912J90464j168384J338368m61312q76544J756160q56064m85376n21216
$$ plain form
2109 3803648 6012928 5750784 5134848 5164544 4363776 5816320 6537728 5873664 5930496 6208000
2099 6208000 6114304 5659136 6681088 5071872 5996544 6323200 6636544 5493760 5679104
2090 5679104 6691328 7055360 5888000 6108160 6402048 6173696 7333888 5961728 6232576
2081 6232576 6120960 6602240 6190592 7610880 7655424 6419456 7437312 6978560 7260672
2072 7260672 7161856 7963136 7181312 8249856 9647616 8869376 9128448 8338432 8630272
2063 8630272 8323584 8796160 8999424 8339968 8926720 9884672 9216000 8721408 9744896
2054 9744896 9073664 9369600 9872896 9924096 8748032 8475648 9610240 9535488 9727488 9190912
2044 9190912 9381376 8212992 9551360 9090048 8213504 9969664 9113600 8628224 8107008
2035H107008k01728J263104M15744n04832k26816K94400j61280P42912l73248
2026I355264O13376j062912J74080P77728j536512N16096m12160J164288j28000
2017I461248K40640K39616m04992l43040m85376J205760m71552o25152K66752
2008I083904R37472o56896J93536j07520M43392K610176M781568Q475136P339008
1999C3099776j2916736o428160l569152J40288j35680j118720K38592n57056j682944
1990G070208J035264m45440l93728L0720j62816r74336P84896J651200j055744
1981G540224K52416j172480J449984k44224o60480M95616q05888m01408J059840
1972G513600K19136r42592K52416M74112K8160L84000r29280o6048P53152p66464
$$ plain form
2035 8107008 7905280 9168384 9584128 9079296 8852480 9146880 8985600 9728512 9355264
2026 9355264 9968640 8905728 9079808 9857536 8321024 8837120 8424960 9589248 9461248
2017 9461248 9701888 9941504 9536512 9193472 8708096 9913856 9442304 8817152 9083904
2008 9083904 10021376 9364480 9558016 9450496 9893888 12504064 17285632 25760768 33099776
1999 33099776 20183040 13754880 10185728 10326016 10190336 9071616 9310208 8753152 7070208
1990 7070208 8105472 7660032 7266304 7297024 7134208 6159872 6944768 8595968 7540224
1981 7540224 7792640 6620160 8070144 7825920 7165440 7661056 6855168 6453760 7513600
1972 7513600 7732736 6790144 7042560 7516672 7544832 7928832 6999552 6933504 7686656 6920192
1962F920192K96960k88768P45472j256448L7888P72096j18272q73984K47296p48032
1952E734400P60320K10944j505792k3040Q26880o92736l34848j74080L27680Q8576
1942E218304q45312K81088N61664q52480N70368Q94464j540096K00704J64864
1933D653568l01568L6864K74432Q08448l10784m32128O60480q89856J550848j500160
1923D550144P4240n3760M99200O1440n82656O16448L11808L80416m47488N12512
1913E922304k140672K022912j494528P39328j122304K457088j244672n63712L26144
1904D901888Q39680j189376k66240P68000K14528l07200N05344j14688q8064P49056
1894F012928o16960j43360O51264q25344N02272O81472P08608m58752o78912M71552
$$ plain form
1962 6920192 7217152 6928384 7673856 6417408 6455296 7227392 7109120 6235136 6482432 5734400
1952 5734400 6494720 6705664 5199872 5176832 6003712 5310976 4976128 4802048 5129728 5218304
1942 5218304 4372992 4654080 5215744 4363264 4933632 5828096 4288000 4488704 4653568
1933 4653568 4352000 4388864 4663296 5471744 5160960 4728832 5389312 4499456 6050304 4550144
1923 4550144 4624384 4570624 5069824 5131264 4548608 5165056 5476864 5857280 5409792 5922304
1913 5922304 3781632 5804544 4310016 5049344 3927040 6384128 5139456 4575744 4901888
1904 4901888 5741568 4552192 4285952 5053952 5268480 4961280 5466624 5351936 5263872 6012928
1894 6012928 5395968 5252608 5903872 5078528 5580800 6262272 6970880 6512128 5833216 6304768
1884F304768P37280j228288K86720Q68864p12704J285120j3824q44288j35168
1875F548480J152512q22272P32672k28864R26208j527296M60800J135104n31968
1866G845376o144J219072j393152J592320o19520N83680j03936j069568R91744
1857I039872M04992o54848O13888m23424L6864N42720N43744J401856o64064l29216
1847A0512384L13344m84864P98208j415680J305600K14528K00192o28736J112064
1838A1927040M7616m71552q28928k54976L05664P5776r66656R58976j412608J008128
1828A0388480K46272O95296j050624J0752r41568O51776K50368k07360j004544
1819I038848l02592R18528N51936j20832j040384P18848J36704l29216K83136
$$ plain form
1884 6304768 7042048 5813760 6100480 6969344 6256640 7541760 7527936 6683648 6548480
1875 6548480 7700992 6878720 7611392 7382528 8308736 6781440 7242240 8377344 7845376
1866 7845376 7839232 9058304 7665152 9257472 8637952 9221632 9117696 8048128 9039872
1857 9039872 9444864 8790016 9403904 8980480 9017344 9560064 10103808 11505664 10841600 10512384
1847 10512384 10825728 10340864 11139072 9723392 11028992 11243520 11443712 10814976 11927040
1838 11927040 11974656 11503104 10674176 10419200 10724864 10800640 9833984 10792960 9380352 10388480
1828 10388480 10634752 11330048 10279424 10290176 9348608 10000384 10250752 10043392 9038848
1819 9038848 8736256 9654784 10206720 10085888 9045504 9764352 9901056 9571840 9854976
1810I854976Q58624j80736m32640j47456o79424N00736l57376R73312j543168
1801H846848j79712J029120l1744l60448j000960K64704k9696J54112J90464m37248
1791H445440o8096N43232j138688K57024m11136K29376j10592n70880R40032k89280
1781G826432k52416n0176l61984n81120P07584n14560L45088J66400l26144N32992
1771G492096j051648L2768N6832N35040m6080p27552J51552J11616K52928p51616
1761F055936q79616M9664K589184k054144N18656q22272J30048O56896L79904
1752F624256l38944L15904k47296J80224p30112R59488q0896J74080L89632p86944
1742F459392R80992K77504K16576p31648M13696O34880K74432r33376N41696p33184
$$ plain form
1810 9854976 10713600 10532864 10100224 9952768 9273344 9774080 9416704 10390016 8846848
1801 8846848 8667136 9696256 9664512 9304064 8303104 8567808 8538112 8692224 8882688 8445440
1791 8445440 8377344 8920576 7781888 8038912 7627776 7857152 7746560 7175680 8115712 7826432
1781 7826432 7574016 7523840 7161856 6580736 7288320 6773760 7118848 7285248 6959104 7492096
1771 7492096 6440448 6473216 6530048 7065088 7019008 6291456 6443008 6554624 6807552 6055936
1761 6055936 5176320 5225984 7815168 5761024 6279680 5457408 5587456 6244352 6624256
1752 6624256 6285312 6601216 6353920 6534144 5804032 6763520 6682624 6856704 7246336 6459392
1742 6459392 7440384 7717888 7934464 7202816 7616512 8251392 8525824 7592448 8134144 7400960
1732G400960J185280N40160J3312j425920J433600M4544j204736J862144j086976
1723H762368J385472M5056r98400Q0896J604096P81824o76864K61632K3552o81472
1713A0588160Q97024p62368O27712Q12544k49856P13216P65440k19136j41824
1704A3030912J280000L89632J40288L91680R05216L0208M38784J597440r20576
1695A7283584J468416K277888J257472j229824K113536J038336J905664P50080
1687B6865152K231296P45984J349120Q55040J906176J516544n25312O06208J474560
1678C7024768j81248l32800N93920K275840R58976J359360J510400K593280J877504
1669D7680000J473536J399296M210176K422272K444288M073984N807616N603840
$$ plain form
1732 7400960 8586240 9126400 9139712 7713792 9147392 9191936 7987200 9849344 8762368
1723 8762368 10147840 10192896 9194496 9275392 10879488 11661312 10984448 11246080 11269632 10588160
1713 10588160 11485184 10722816 11350528 12163072 11913216 12626432 13391872 13172736 13030912
1704 13030912 14310912 14700544 14840832 15232512 16137728 16167936 16606720 18204160 17283584
1695 17283584 18752000 21029888 22287360 21057536 23171072 24209408 26115072 26865152
1687 26865152 29096448 29842432 31191552 32046592 33952768 35469312 34944000 35550208 37024768
1678 37024768 36843520 36510720 37104640 39380480 40339456 41698816 43209216 45802496 47680000
1669 47680000 49153536 50552832 54763008 57185280 59629568 63703552 69511168 75115008
1661G5115008P285760P444992Q656384Q452096M355072O80448o149632o877696
1653I8962432j0900480p953920j1557376j1379712j0513408o148096n713920n352448
1645B9443072j795584l887104l08224k564096j047040j420288j387520l55840
1637A6677376o06720m8640o61504p64416j117696M99200k03776k46784j130496
1628A2396544k90816L072l88096M01408n22752o46656m36736L73248q19200N59616
1618A0629632l99360j067520j408512K043904j150464J66912O14400m02432o47680
1609H378880r90208K62144o62016J80224J3824Q47360j529344M39296m16256M4032
1599F567936J69984n12j236992P67488n1200j095680K187264j800704L04128Q0896
$$ plain form
1661 75115008 82400768 89845760 98502144 106954240 111309312 111989760 105840128 98962432
1653 98962432 88061952 80108032 68550656 57170944 46657536 40509440 34795520 29443072
1645 29443072 27647488 23760384 23452160 20888064 19841024 18420736 17033216 16677376
1637 16677376 16070656 16022016 15360512 14596096 13478400 13977600 13773824 13527040 12396544
1628 12396544 12105728 12108800 11720704 12122112 11599360 10952704 10515968 10889216 10070016 10629632
1618 10629632 10230272 9162752 7754240 9798144 8647680 8814592 9428992 9026560 8378880
1609 8378880 7388672 7650816 6988800 7169024 7182848 8030208 6500864 6940160 6523904 6567936
1599 6567936 6737920 6737408 5500416 6267904 6216704 5121024 7308288 5507584 5811712 5892608
1589E892608p7824o48192N91872j024000R99936o80448l85536M78208k61120M43904
1579E329408p42400M70528n96992M94080l29216l4304l58400k26816J111552n1200
1569E066240j512448J478144j255936L45088K97472n78048J497600o41536o32320
1560D064256m67968j85344J228288p45472Q40192k44736Q81664j30048j445376
1551C795456J767936p06048o84032n36576P64416L44576L26144k058752R80992
1542C994112M19328J52064m41856Q93952q04864N58592q77568O40512P68000m57728
1532D844544r15968Q82176L20512j05984J002496o07232L77344r62048N03296
1523E339136L40992M1472m096R4720j52576O21568p1680J57696P87968m82304
$$ plain form
1589 5892608 5814784 5166592 5758464 4734464 5734400 5053952 4668416 5146624 4885504 5329408
1579 5329408 4587008 5057536 4460544 4954624 4625408 4591104 4232704 4005888 5117440 5066240
1569 5066240 3553792 5031936 3776000 4121088 4418560 3840512 5338112 4696576 4064256
1560 4064256 3596288 3410944 4639232 3893760 4733952 4489216 5370880 5240832 3795456
1551 3795456 5563392 4857344 4173312 3636736 4401152 4745728 5071872 3013120 3994112
1542 3994112 4413440 4565504 4123648 5017600 4212736 4771328 3893760 4534272 5302272 4844544
1532 4844544 3928576 4810752 5131264 5025280 6027776 5420544 5797888 4835840 5339136
1523 5339136 5680128 5721600 5717504 5812224 5659648 6281216 6209536 6367232 7155200 6672896
1513F672896K4064J816576j843712L94240J776640p74656J548288J383936k45760
1504A0752512J218048j778176m42368N23776j01888m76160l34848l26656p87456
1495H246784L25120l42528L32800K11456P25504r03680K39616o42048j60768P6800
1485H109056L64032r0624o42560O72256K96448l36384l77344l67616R94816k81600
1475H340480L25632J41312Q72960l30752Q90880K184704k04800O62528J15712
1466A2998656O15936k51904J536512j805824r5232j081856j16736k722304q65792
1457H211456K048O57408n03808j133056L0208K30400p74144J015808o42048N24288
1447G618560r28256O26688o2976P62880j532928J515520o4000J315328M21376
$$ plain form
1513 6672896 6696960 8513536 6669824 7064064 8840704 8066048 9614336 10998272 10752512
1504 10752512 11970560 10192384 9750016 10273792 10171904 9695744 9360896 9034240 8246784
1495 8246784 8571904 8229376 8562176 8773632 9499136 8595456 8835072 8193024 8032256 8109056
1485 8109056 8473088 8382464 7739904 8412160 8708608 8372224 7994880 7627264 8622080 8340480
1475 8340480 8666112 8807424 9680384 9349632 10240512 12425216 12220416 12882944 12998656
1466 12998656 13614592 13362688 14899200 13093376 12998144 11916288 11799552 9077248 8211456
1457 8211456 8213504 8870912 8367104 7234048 7264256 7494656 6720512 7736320 7094272 7618560
1447 7618560 6690304 7316992 7254016 8016896 6483968 7999488 7935488 9250816 9672192
1438I672192K35008K54976N12000j708032J065472o36416n39648k41664l19488
1429H294400j350144R2672O49216J69984j312256q71424j71520Q22784m58752
1420E864960o04160O02112j139712Q96000q36096j151488R21088n63712J51040
1411D140032J241600m49024l28704l26656j43360P5264p06048J170944l87072
1402D286976l00032K94400m72064M98176o4512j1776j28000o89152l57888K73920
1392C330048k01728P99744m4032n37600J358848j344000J593856k8672p04512
1383D221952l45600M63360n06880j9968N98528R02144p12704Q86784q27904J97120
1373D856832K00704k57024q32000J13664J007104q61696j16224P59808r3696o70208
$$ plain form
1438 9672192 9907200 10162176 10674176 8966144 10031616 9395200 8855552 8613888 8294400
1429 8294400 6944256 7036928 7686144 7856128 6543872 5672448 5500928 6323712 5864960
1420 5864960 5260800 5862912 4723200 5619200 4783104 3631616 4552704 3988992 4140032
1411 4140032 5381632 4932608 4603904 4277248 4133888 4209152 3503104 4674048 4286976
1402 4286976 3986944 4281344 3809280 4307456 4242944 4231168 4103168 3414016 3056128 3330048
1392 3330048 3128320 3928064 3884032 3346432 4705280 3361280 4955136 4926464 4221952
1383 4221952 3876352 4339712 3832832 3812864 4411392 5313536 4600832 5487616 4659712 4856832
1373 4856832 5057536 4800512 3968512 4082176 5089280 4227584 4111360 4871168 4777472 4107264
1363D107264J68960j30048J064448j036800l04640N16096k92864Q704o85056J145344
1353D561408n61664k048o68160J536P49568q08960l3280j02912Q13568N24800
1343D473856o15424q7040J21344l08736k31936n84192P12704p15776J013760r19552
1333B859008K20160p17312J441792M3008K20160n44768n02784O15424J90464n30432
1323C294720j628160J501696l60960k7648M06528m8640j138688J77664l71200
1314A805312l90144J450496n51936j77664k17088L51744p04000L77856k34496
1305A710080o72256J574912l50720j126912J044992L92704A120768m6080M71552
1296A546240R64608A079808J599488A090560Q27392o37952L84000G48544K52416
$$ plain form
1363 4107264 4276224 4146176 5210624 4173824 3869184 4385280 4092416 4101120 3416064 4561408
1353 4561408 3999744 3997696 3329536 3331072 4080640 3271680 3238400 3135488 3949056 4473856
1343 4473856 3858432 3771392 3892736 3584000 3352064 2767872 3480576 2764800 3778560 2859008
1333 2859008 3079168 2361856 3803648 3846656 4066816 3522048 3019264 3634688 3825152 3294720
1323 3294720 1666560 3168256 2807296 2779648 3186176 3137536 1998848 2176512 1805312
1314 1805312 1415168 2865664 2313728 2136064 1918976 2270720 1566720 1944576 1710080
1305 1710080 1037824 2612736 2262016 1135104 2180096 2572800 1120768 1074688 1546240
1296 1546240 2510848 1079808 2679296 1090560 1917952 1280000 1664000 748544 1000960
1287A000960j26464J774080q54528C23584J239040l05152O08768k86720R18016
1278B497536k70848E21728J199104m03968o44608O18496Q35584o08768o8096P95136
1268B244608p35744A60768J063424C15392J315328p6800O54848k66752H05376
1258A252352N5808k84160Q74496H61696N04320k72384L74272o35904j01888K96448
1248A026560K52928M87424o57920L67104F78400B37056K345472A246720E28384
1238A575424P2704M44416r60512j43360L96288j92000E79584j1264K054144I37984
1227H51456K55488J80736E20704Q69888l35360M48000G27040J045504n92384j59232
1217A020928B87232P28576j05472k47296J391616j32608q01280R17504G44960
$$ plain form
1287 1000960 874496 2648576 1794048 323584 1562624 1257472 1866240 1579520 2497536
1278 2497536 2226688 521728 1720832 1316864 672256 1290752 2126336 1517568 1449472 2244608
1268 2244608 1508864 160768 1224192 315392 1630720 1553920 2208768 1942016 805376
1258 1252352 1308160 1024000 1898496 861696 1366016 1093632 1467904 832000 730112 1026560
1248 1026560 1279488 1766912 1108992 1476096 678400 237056 2582528 1246720 528384
1238 1575424 1648128 2092544 1132032 988672 1384960 1192960 579584 568320 2622464 937984
1227 851456 1106944 1287680 520704 1390592 1055232 1503232 727040 1772544 1180160 1020928
1217 1020928 287232 1015808 910336 663040 2054656 1922048 1120768 2038272 744960
1207A119744Q88832o45120j44896k95424J178112l04128O13888j058816R07776
1198B259968n21216j22368j2288N1712q3456j3312n78560O24640G66464J23904
1188H90368m3008M39808A69984J59744J524224F80960B60096L89120N08416K42176
1178A399808k23232L00544n30944J22880P98720C75296R96352J9456K2016j47968
1168A265152k54976M15232B65216Q42752P22944l74272E41184Q01792J14176l6352
1158A420800j28000M00384p41888L81952K90304E93408J44896K22720J0240J180160
1148B151424A012224N52448F84544O62016l6352E25824M93056m07552L86048J529344
1138B526720A191424k61120K84672J2288k28352O49216m60800C73760O95808L65056
$$ plain form
1207 1119744 2008576 1363456 1218560 923136 2101248 1797120 2411008 1352192 2259968
1198 2259968 1738752 1616384 1604096 1655808 1572352 1559040 980480 1605120 766464 890368
1188 890368 847360 1287168 169984 329728 1853952 680960 260096 649216 1157632 1399808
1178 1399808 1176576 1477120 946176 1069056 1867776 375296 1371648 1391104 1413120 1265152
1168 1265152 1010176 1425408 265216 1107968 1830912 1456640 541184 1342976 1457152 1420800
1158 1420800 1292800 1693184 951296 1333248 1623552 593408 738304 961024 971264 2151424
1148 2151424 1012224 1564672 684544 1346560 1310208 525824 1018880 611328 997376 2526720
1138 2526720 1191424 930304 1214976 1227264 998912 1648128 1187328 373760 1069568 1434624
1128A434624F98880M30080c60448C89632Q72960J012736D09600L25632R04192
1119A639424D17792J197056F42560B92352J190912o25152L1744M20352O67136
1110A977344r61024j6384j82272J94048Q5504n25824m8128B15040P99744L61984
1100A376768n4272E66784Q15616N48864q62208J181696F27200J184256G88992
1090A196032j54112L64544J395712A067008N15072J00864M36224l95776J52576
1081A875968J07008m43904M88960l33824o58944O31296N86752j2288o2976L70176
1071B548224A041408J404928L12832K8672k84672j049600J980928p88480n06880
1062B139136P71584k89792A246208O39488J9968J013248q45824M88960l23584
$$ plain form
1128 1434624 698880 1128960 -360448 389632 1262592 2275328 409600 735232 1639424
1119 1639424 417792 1614848 642560 292352 1483264 858112 889856 1310208 1977344
1110 1977344 1016320 999936 817664 1011712 1097216 571392 523264 215040 1014784 1376768
1100 1376768 1322496 566784 1382400 1931264 1069056 2250752 627200 1811456 788992
1090 1196032 1041920 1406464 2802176 1067008 1582080 1682944 2119168 1723392 1875968
1081 1875968 1982976 1539072 2028032 1694208 1035264 1666560 2253312 2241024 2178048 2548224
1071 2548224 1041408 2446336 2759168 2787840 2503168 1453568 3434496 2646016 2139136
1062 2139136 2910720 2620928 1246208 1885696 1905664 2918912 2073088 2562048 2238464
1053B238464j89952J282048n59104j089536J185792L97312R9840O59968l00544
1044C724288k66240Q21760J601024J284096J485824o144j555456j479680J139712
1035F749184m34688O91200N36064R51296p0144J795584J979904J554432J494528
1026A5247360J324032M371968J8734080L3863168P2339456M1150976G9546880
1018C9283712A8488832N20704l17952p726080m038656j93536n96992m76160j282048
1009D378112r71776O49728J92512J122304J46432R80480P09120k052096q73984
1000D280832J57696p29088K65728o41536m84352r11360Q68352j369600J199104
991B635776m096L24608j48480j84320J180160A613824Q38656j073664L93216K81088
$$ plain form
1053 2238464 2048512 3330560 2771456 1681920 2867712 3265024 3364864 4024832 3724288
1044 3724288 3458048 4279808 5880832 7164928 8650752 8644608 7089152 5609472 6749184
1035 6749184 6314496 7005696 7541760 8493056 8422912 10218496 12198400 13752832 15247360
1026 15247360 16571392 20943360 39677440 73540608 145880064 187031040 79546880
1018 39283712 18488832 19009536 18691584 10965504 6926848 6733312 6136320 5660160 4378112
1009 4378112 3406336 4056064 4248576 5370880 5517312 6497792 7206912 5154816 4280832
1000 4280832 4438528 3709440 3975168 3333632 2849280 1937920 2806272 1436672 2635776
991 2635776 2631680 2956288 2807808 2623488 3803648 1613824 2452480 1378816 1772032 2053120
981B053120o28224m7104N27360n66784M09600E16096J741824A086464j14176Q08448
971A780736L01568o51776l78368n8880L75296J60256J10080n21216N68832o83008
961A003520l22560j48480J263104o87616J61280j22880J51552C74784J146368
952A521152o08256N20192M0448j55648O1440M3520A06496Q41216k05824J069056
942A810944q32000P38816D36736j54624O07744R1136C65056K86208O78912l35872
932I94304C72224J284608B60096K05312L99360J63840m49024a22368A62304N42720
922G05024e0176I70240L36896C84000N21216p1168B43712J208320D55680K60608
912G16288k92864O13376j53088k74944p4240M44928j09568M9664K93888D76160
$$ plain form
981 2053120 1424896 1377792 1905152 1338368 1747968 516096 2257920 1086464 972288 1780736
971 1780736 2082304 1430528 1052160 993280 1368576 1528832 1638912 1117696 1686528 1003520
961 1003520 680960 532480 1795584 1107968 1269248 1146368 1297920 374784 1521152
952 1521152 912896 1433088 1473536 1317888 1379328 1422848 106496 947712 741888 1810944
942 1810944 978944 1717760 436736 282112 889856 980992 365056 651264 1330176 994304
932 994304 372224 1656832 260096 465408 864768 1028608 579584 -122368 162304 705024
922 705024 -50176 970240 1307136 384000 905216 834048 243712 1452032 455680 716288
912 716288 423424 1036800 883712 608768 534528 979456 869888 919552 1213440 476160
901D94080j71520K51392J129984D85888P81824R5232E87264R09824n21728L7888
891A013248c0720A086464l34336j61280N56544k00704n2224L89632k87744B37568
880E14560P34720n28384k64192B11456P80288L94240C35872J349120h9088A606656
869E27872l9424M50560k16064p0144N68320a65376A930752o48192C01056J87904
859D88960L62496J30560l47648k50368M57728l66592J040896G09120p5776P40352
849A373696o13888a28512F24640Q27392a84320H69888B49856f04672A110016f63040
838E4272O61504A14176e5296A172992D99712O13376B74944a87392I31840P78752
828A710592A08032P93088C32288e4784I72800n3248l33312j71008K13504j63328
$$ plain form
901 494080 322560 573952 1703936 485888 1267712 1362944 587264 1497088 975360 1013248
891 1013248 -30720 1086464 752128 590848 1147392 946688 894464 1284096 996352 237568
880 514560 1249280 720896 456704 211456 991744 1385984 335872 1684992 -89088 1606656
869 527872 488448 939008 722944 652800 1221120 -165376 1930752 1282560 301056 488960
859 488960 851456 982016 634368 384000 841728 475136 1516032 709120 633344 1373696
849 1373696 759808 -128512 624640 1452032 -184320 869888 249856 -604672 1110016 -663040
838 54272 715776 114176 -55296 1172992 499712 1113088 274944 -187392 931840 1710592
828 1710592 108032 901120 332288 -54784 972800 919552 586240 415232 628736 465408
818D65408L90656A48992J399808F66112j56672l7376J36192A33120J467392o54336
808I46176C47648O31296m63872N39648D98176O00576d608B51904J37728A8432
797A131008a4336G32160A42848d48000J25952H86784L94752E33504N08416A86880
786d59264c3792E1712P31136l61472L82976C50720K9184K89792O01088a06496
775A178112K51392m11648B49344J454592F13376J090560p22944k76992L30752
766A034752l12832L8912J39264r7792J76640j15200k78528j15200K95936B33984
755F71232N08928b70336H90368C49696A8944J687552o53824k97984L65568C94752
744E69856J426432G61856M83328k27328P83872E39648J532416p29088D59264J455616
$$ plain form
818 465408 856064 148992 1548800 666112 509440 472064 608256 133120 1600512 946176
808 946176 347648 978944 515072 1054720 498176 1098752 -4608 251904 389632 18432
797 1131008 -14336 732160 142848 -448000 -322048 886784 1281536 533504 1041920 186880
786 -459264 -33792 51712 782848 421376 804352 350720 379904 669696 1270784 -106496
775 1178112 1429504 1017856 249344 1703936 613376 1703936 980992 704000 1034752
766 1034752 721920 760832 900096 802304 978944 863744 585216 470016 765952 233984
755 671232 1180160 -270336 890368 349696 18944 1706496 1052672 754688 1120256 394752
744 569856 1996288 761856 1245184 1017856 1801728 539648 2072064 1342976 459264 1914880
734A914880I19040C46112J118208k73920L61472k08384Q96512I09824N41696R79456
724B430976m68992N75488j07008j13152E29408R58976J536n59616N40672L32800
714A803776m23424L51232k78528E79072b22720k21184D04992A54624Q79104e6320
703G27040j8944r2672Q98048b15552A891328H76544L1744O31808B78528k6112
693B52416L68128P06048D41856g4240o10816K61120I47200B77504b17600A48992
682G18336J60256a97120E52448c13344E13536O6048B10944M95104h3456m29568
672e13024a03936k7648p9360o98880D17280J32096J97632M6080B16576L23584
662E40160N64736J78688n67808f6048F76352C5840M78208P65952E02784j74592
$$ plain form
734 1914880 919040 346112 1464320 1190400 1551872 1343488 2240000 909824 1451520 2430976
724 2430976 1961984 2537472 2430464 2317312 529408 1488384 1489920 930304 1470976 1803776
714 1803776 1380352 1731584 1453056 579072 -222720 -443904 404992 154624 1033728 -56320
703 727040 708096 615424 1513472 -215552 1891328 876544 908288 1540096 278528 252416
693 252416 620544 1326592 441856 -74240 -685056 -423936 947200 277504 -217600 148992
682 718336 878592 -197120 552448 -313344 513536 579584 210944 706048 -83456 -513024
672 -513024 -103936 -131584 -210944 -909824 417280 549376 747008 793088 216576 540160
662 540160 1104896 1283584 715776 -66048 676352 35840 514048 1280000 502784 328192
652C28192O4512d89984L3792m22912a23904l28192m82304a85344n16096g1168
641i0112C74784A86880P42912B99008b90304q0896I28256l36384k00192o3488
631C28192d61312E00736O26176n31456j0752g07584L28704a27488m52096D73600
620g19872A139712F656J299456F38464Q704A44384M08576B33472c78880E34016
609f88128e12C59936j50016h2432D608d77184c5328o2464L2256k96448B55488
597G18848J2800B54976K23744e80608E81120I728L29728L16416k60608g19872
586f65600A025536C15904k6624a18784F14912c68128A461760f97856A00864f02624
575D82816c10784F2976d30080A75616a98656E84704A94560d06528A025536j01888
$$ plain form
652 328192 392704 -489984 -456192 -879104 -123904 -452096 -934400 -185344 -701440 -71168
641 -90112 374784 186880 929792 299008 -290304 -371200 928256 591872 391680 328192
631 328192 -461312 500736 1126912 595456 584704 -707584 -378880 -127488 -579584 473600
620 -719872 1139712 6656 1306112 638464 647168 144384 552960 233472 -378880 534016
609 -688128 -512 359936 209920 -82432 4608 -477184 -35328 -97792 -65536 -361984 255488
597 718848 731648 254976 478720 -580608 581120 9728 339456 655872 395264 -719872
586 -665600 1025536 315904 289280 -118784 614912 -368128 1461760 -697856 100864 -602624
575 482816 -310784 62976 -430080 175616 -198656 584704 194560 -406528 1025536 923648
565I23648d96640A274368b6112D32128B10944a93536B76480K31424k04288j35680
555A67936O16448d11648j05472E03808N36576a146368a34656i728l64032C70176
544D52096K26304C14368a1776k52416A94560L95264B2016J09568Q46848k76480
534G01952B19136K25280A97632Q41728b69824g9360m72576F25664d24448a28000
523A097216k07360g00416H2432h58624C70176K3040h10496c54816H63744j12128
513G51616G0144O66112F0928c94240J14176a7920G69536b16064A103872m09088
503F94784e90336G30112j20320b29376i216k58048l00544C52256a55648j94560
493c50208B16064K23744b16576l04128H05376f57920A67424D1472J50528i6768
$$ plain form
565 923648 -496640 1274368 -26112 432128 210944 -193536 276480 507904 303616 167936
555 167936 784384 -411648 -517120 503808 1040384 -1146368 -134656 -9728 -373760 370176
544 452096 678400 314368 -11776 -264192 194560 589824 22016 131584 978432 701952
534 701952 219136 444416 197632 1039360 -269824 -79360 -551936 625664 -424448 -128000
523 1097216 889856 -700416 82432 -858624 370176 393216 -810496 -354816 863744 751616
513 751616 70144 736256 60928 -394240 -280064 -17920 769536 -216064 1103872 694784
503 694784 -590336 730112 609792 -229376 -9216 -267264 -567808 352256 -155648 -350208
493 -350208 216064 439808 -216576 -520704 805376 -657920 167424 41472 192000 -96768
482D91520A32096L53280e13536a95072A46432D6080e59616E2224J58208g46496
471a07520n20704j024a56672A103360B58048b58560E40672j54112H1408d06016
460D94592c42016Q0896K4576p26528F81472m4544k94400a30560l32800C52256
449E98016L18976J35680B60608M39808i09824e120j71520j10592A1776a72032
438A722880b72384D17792K73408k39104n9904K51904k32448P25504j66400D9152
427A127424E24800N32480C69152P92576P50080j23904B25792b61120G64416i7792
416F13376B20160f86080F10816a56672A116160M96128D28544M95616L10272f21568
405A395712H9088Q704J24928N03808A09568d00896D52608M51072B16576J13664
$$ plain form
482 491520 132096 485376 -513536 -195072 146432 46080 -559616 52224 210432 -746496
471 -107520 -628224 -629248 -156672 1103360 258048 -258560 540672 386560 81408 -406016
460 494592 -342016 -261120 -236544 -963072 681472 636928 342528 -130560 -463360 352256
449 598016 916992 1052672 260608 700416 -909824 -5120 -176640 -287232 11776 -172032
438 1722880 -272384 417792 691200 452096 392192 644096 411648 1137152 970752 49152
427 1127424 524800 1057280 369152 1161728 1911808 1787904 225792 -261120 764416 -97792
416 613376 220160 -686080 610816 -156672 1116160 1612288 428544 924160 1234432 -621568
405 1395712 89088 97792 222720 726528 109568 -400896 452608 903680 216576 330240
395C30240i96352b17088B58048C7376M06016b01728A85344g08096C92704d34176
384E93408B51392j16224F144d62848q43264H2432M88960g70048I84064m68480
374E15584c54816j5360E50912c25632F32832A12128M91008a12640j09568b8160
363a20832n14048C32288L5328j79712L74272b28352j15200j65376n632C49696
352d27008M7104j25952D59776a040384c2768n23264B10944Q01792a88928p72096
342i61024G36768C26656e91872l35872H2944a77152D7616D608J66400c81440o97856
331a079296D16256f42560A185792g01952H2432L14368e73952D28544c1744o93760
321g25504E96992L59424L0720k32448I216a67424B91328P680A15712e09952C05664
$$ plain form
395 330240 -996352 -217088 258048 37376 443392 -201728 185344 -708096 392704 -434176
384 593408 251392 135168 6144 -462848 -1306112 82432 571392 -770048 984064 515584
374 515584 -354816 -370176 550912 -325632 632832 112128 603136 -112640 -222208 -28160
363 -120832 -634880 332288 367616 187904 562176 -228352 -343552 -508928 -514560 349696
352 -427008 -379904 -505856 459776 -1040384 -32768 -556032 210944 1012736 -188928 -961024
342 -961024 736768 326656 -591872 -927744 82944 -177152 47616 4608 171008 -381440 -1079296
331 -1079296 416256 -642560 1185792 -701952 82432 396800 -573952 428544 -31744 -725504
321 -725504 596992 956416 987136 754688 9216 -167424 291328 299008 115712 -509952 305664
309i32352L15392j90976G66464p6800J69472a97120A75616K35008J46432A33632
298B5600R09312B95424b07872A23392d89984C84512i0624j92512C9936O52800
288F92736c36384A80224d6592j298944f0416k40128H2432g69024C22560L85024
278G07584B15040I1136M2496P39328b30912o36928m83328h9088B96960d71552
267B12480j3312m0960f93248K89280J34144l16416A26976M3008J30048N17632
257H17664A86880d11648i7280m62336E79072j88416g15776H3456A3824b67264
246C97312a12128l40992E81632g26016K37056O5536r22624f38976E42720a64352
235f86592D74624b5088r728@B42688J70496Q57088g26528J90976d7616j81760
$$ plain form
309 -932352 -616960 -807936 766464 689664 859136 -197120 175616 410624 557056 133632
298 25600 934912 295424 -207872 123392 -489984 384512 -90624 -283136 39936 692736
288 692736 -336384 180224 -46592 -1345536 -60416 -300544 82432 -769024 322560 707584
278 707584 215040 91136 133632 872960 -230912 -867840 -1351168 -89088 296960 -471552
267 212480 199168 158208 -693248 -403968 -269824 -586240 126976 169984 300032 817664
257 817664 186880 -411648 -97280 -559616 579072 390656 -715776 83456 13824 -267264
246 397312 -112128 -453120 581632 -726016 -488960 -423424 -1346048 -638976 542720 -164352
235 -686592 474624 -25088 -34816 0 242688 413184 1270272 -726528 -535552 -47616 -229376
224b29376B51392K85184i85088D56704b17088l67104k68800j09568a21856q2432
214b04288B04288b51904N6320k69824E7856M72576f36416k88768C29728L83488
204G13216d23936D91520k30912Q77056b4064D11648A92512a354752E93408a36192
193i09312A16736f5536m54656f144B4064b54464C82464E632d61312A27488J86880
182C14368J98144f89152D33664G6288e78048O8608m54144B70848g76192a04448
171E8368c84512A7920a56160C35360g4752n01248I05728h97536L30752E30944
160b12480f7072K3552n62688R216a56672E12512B0480d68992E2224J003520b25792
148c072k16576k87232B47296l7376b13504A74592K83648c70176G26528B48320
$$ plain form
224 -229376 251392 536576 -985088 456704 -217088 -584192 -852992 -962560 -121856 -204288
214 -204288 204288 -251904 -195584 -465408 57856 530432 -636416 -925184 329728 713216
204 713216 -423936 491520 260608 1137664 -24064 411648 192512 -1354752 593408 -136192
193 -909312 116736 -65536 -520192 -6144 24064 -254464 382464 5632 -461312 127488 314368
182 314368 512512 -689152 433664 76288 -578048 -509440 -963584 270848 -776192 -104448
171 58368 -384512 17920 -156160 335360 -74752 -576000 905728 -897536 -566784 530944
160 -212480 -67072 -43520 -606208 -596992 -156672 512512 20480 -468992 52224 1055744 -225792
148 -3072 -219648 -506880 247296 209920 -213504 174592 458240 -370176 726528 248320
137C17440c7888l38432m90496e6320H9600J11104h67328L4304A102336d35200
126A096192b13504G30112f93248F00576j05472h8576j343488B00704a15200m81280
116e96480C25120b68800C98336F656f07232D94080a085952a0752j86880r6768
106b94400e0688l75296j57696K7648e0176J3824j47968E8368h31488d4544m33664
95d78208D17280e24288k16576C6352a035776F144c7888l41504n43232E1712K85696
84C37408a39264j59232B09920b73920I02656a1776j18784q73472A87392i17504
73d86912b24256C99360a200640b1504j276928a58208j53088L8912N7856C69152
62i94304M4544F88640a25952N8880C72224d33152j36704l55328K78528b1504k69312
$$ plain form
137 317440 -37888 -376320 -866816 -56320 89600 200704 -867328 -833024 1102336 -435200
126 1096192 -213504 730112 -693248 600576 495104 -88576 -1432064 200704 -115200 -596480
116 -596480 325120 -268800 398336 6656 -607232 494080 -1085952 -10752 -197632 -294400
106 -294400 -50688 -425984 -583680 -556032 -50176 -36352 -184320 58368 -831488 -44544 -478208
95 -478208 417280 -524288 -740864 36352 -1035776 6144 -37888 -379392 -922624 51712 337408
84 337408 -139264 -298496 209920 -273920 902656 -11776 -130560 -1004032 187392 -917504
73 -486912 -224256 399360 -1200640 -21504 -1298432 -158208 -311296 -272384 -214528 369152
62 -994304 -949760 688640 -125952 -67072 372224 -433152 -569856 -925184 -646656 -21504 -290816
51b90816c7888G42400c97824J42848D88960h4992G07584c73760D78720c81440
40d95104j57696j60768L40480n71904c29728j055744b11456A94560J133056b98496
29h3456A54112b59072r6768l68640A99168b93888E12J65888d94080E34016k03264
18C30752i30816a59232j57184D96128B06336f63040b60608n93920F75328a60768
7E14048j23392O57408h43776c98336A99680M9152b85696
$$ plain form
51 -290816 -37888 742400 -397824 -254976 488960 -84992 707584 -373760 478720 -381440
40 -495104 -652800 -813568 -473088 -1044992 -329728 -1385472 -211456 194560 1327616 -298496
29 -83456 154112 -259072 -355840 -724480 199168 -293888 512 166400 -494080 534016 330752
18 330752 -930816 -159232 -316416 496128 206336 -663040 -260608 -854528 675328 -160768
7 514048 390656 1048064 -843776 -398336 199680 248832 -285696
##END=
