##TITLE=1328
##JCAMPDX= 6.0         $$ Bruker NMR JCAMP-DX V2.0
##DATA TYPE= NMR SPECTRUM
##DATA CLASS= XYDATA
##ORIGIN= NUTS EXPORT
##OWNER= Administrator
$$ 1.72 TOPSPIN		Version 2.1
$$ 2016-02-23 12:20:07.683 -0800  Administrator@X
$$ Compression mode = diff/dup
##.OBSERVE FREQUENCY= 90.275459
##.ACQUISITION MODE= SIMULTANEOUS (DQD)
##.ACQUISITION SCHEME= undefined
##.AVERAGES= 16
##.DIGITISER RES= 22
##SPECTROMETER/DATA SYSTEM= 
##.PULSE SEQUENCE= zg30
##.SOLVENT NAME= None
##.SHIFT REFERENCE= INTERNAL, None, 1, 14.45864
##AUDIT TRAIL= $$ (NUMBER, WHEN, WHO, WHERE, PROCESS, VERSION, WHAT)
$$ ##TITLE= Audit trail, TOPSPIN		Version 2.1
$$ ##JCAMPDX= 5.01
$$ ##ORIGIN= Bruker BioSpin GmbH
$$ ##OWNER= Administrator
$$ $$ E:/data/jwist/nmr/1328/1/pdata/1/auditp.txt
$$ ##AUDIT TRAIL=  $$ (NUMBER, WHEN, WHO, WHERE, PROCESS, VERSION, WHAT)
(   1,<2016-02-23 08:52:06.795 -0800>,<Administrator>,<X>,<jcamp>,<TOPSPIN 2.1>,
      <fromjdx created from
       E:\data\jwist\nmr\uniandes\1328
       data hash MD5: 8K
       FC EA 75 49 EA 1C 1F ED E1 EF D8 00 A7 52 2C E1>)
$$ ##END=
$$ 
$$ $$ hash MD5
$$ $$ 37 78 36 32 C6 47 47 8E CD C6 7F 6C FC 03 C7 7F
##$RELAX= 
$$ Bruker specific parameters
$$ --------------------------
##$DU= <E:>
##$EXPNO= 1
##$NAME= <1328>
##$PROCNO= 1
##$TYPE= <nmr>
##$USER= <jwist>
##$ACQT0= 0
##$AMP= (0..31)
100 100 100 100 100 100 100 100 100 100 100 100 100 100 100 100 100 100
100 100 100 100 100 100 100 100 100 100 100 100 100 100
##$ANAVPT= 1
##$AQSEQ= 0
##$AQ_mod= 3
##$AUNM= <au_zg>
##$AUTOPOS= <>
##$BF1= 90.275459
##$BF2= 400.02
##$BF3= 400.02
##$BF4= 400.02
##$BF5= 400.02
##$BF6= 400.02
##$BF7= 400.02
##$BF8= 400.02
##$BYTORDA= 0
##$CFDGTYP= 0
##$CFRGTYP= 0
##$CHEMSTR= <none>
##$CNST= (0..63)
1 1 145 1 1 1 1 1 1 1 1 1 1 1 1 1 1 1 1 1 1 1 1 1 1 1 1 1 1 1 1 1 1 1 1
1 1 1 1 1 1 1 1 1 1 1 1 1 1 1 1 1 1 1 1 1 1 1 1 1 1 1 1 1
##$CPDPRG= <>
##$CPDPRG1= <>
##$CPDPRG2= <>
##$CPDPRG3= <>
##$CPDPRG4= <mlev>
##$CPDPRG5= <mlev>
##$CPDPRG6= <mlev>
##$CPDPRG7= <mlev>
##$CPDPRG8= <mlev>
##$CPDPRGB= <>
##$CPDPRGT= <>
##$D= (0..63)
0 1 0 0 0 0 0 0 0 0 0 0 0 0 0 0 0 0 0 0 0 0 0 0 0 0 0 0 0 0 0 0 0 0 0 0
0 0 0 0 0 0 0 0 0 0 0 0 0 0 0 0 0 0 0 0 0 0 0 0 0 0 0 0
##$DATE= 0
##$DBL= (0..7)
120 120 120 120 120 120 120 120
##$DBP= (0..7)
150 150 150 150 150 150 150 150
##$DBP07= 0
##$DBPNAM0= <>
##$DBPNAM1= <>
##$DBPNAM2= <>
##$DBPNAM3= <>
##$DBPNAM4= <>
##$DBPNAM5= <>
##$DBPNAM6= <>
##$DBPNAM7= <>
##$DBPOAL= (0..7)
0.5 0.5 0.5 0.5 0.5 0.5 0.5 0.5
##$DBPOFFS= (0..7)
0 0 0 0 0 0 0 0
##$DE= 6.5
##$DECBNUC= <off>
##$DECIM= 2432
##$DECNUC= <off>
##$DECSTAT= 4
##$DIGMOD= 1
##$DIGTYP= 12
##$DL= (0..7)
0 120 120 120 120 120 120 120
##$DP= (0..7)
150 150 150 150 150 150 150 150
##$DP07= 0
##$DPNAME0= <>
##$DPNAME1= <>
##$DPNAME2= <>
##$DPNAME3= <>
##$DPNAME4= <>
##$DPNAME5= <>
##$DPNAME6= <>
##$DPNAME7= <>
##$DPOAL= (0..7)
0.5 0.5 0.5 0.5 0.5 0.5 0.5 0.5
##$DPOFFS= (0..7)
0 0 0 0 0 0 0 0
##$DQDMODE= 0
##$DR= 22
##$DS= 2
##$DSLIST= <SSSSSSSSSSSSSSS>
$$ [...]
##$SPOFFS= (0..31)
0 0 0 0 0 0 0 0 0 0 0 0 0 0 0 0 0 0 0 0 0 0 0 0 0 0 0 0 0 0 0 0
##$SUBNAM0= <"">
##$SUBNAM1= <"">
##$SUBNAM2= <"">
##$SUBNAM3= <"">
##$SUBNAM4= <"">
##$SUBNAM5= <"">
##$SUBNAM6= <"">
##$SUBNAM7= <"">
##$SUBNAM8= <"">
##$SUBNAM9= <"">
##$SW= 20.5580556627758
##$SWIBOX= (0..15)
0 0 3 4 0 0 0 0 0 0 0 0 0 0 0 0
##$SW_h= 8223.68421052631
##$SWfinal= 0
##$TD= 65536
##$TD0= 1
##$TE= 300
##$TE2= 300
##$TE3= 300
##$TEG= 300
##$TL= (0..7)
0 120 120 120 120 120 120 120
##$TP= (0..7)
150 150 150 150 150 150 150 150
##$TP07= 0
##$TPNAME0= <>
##$TPNAME1= <>
##$TPNAME2= <>
##$TPNAME3= <>
##$TPNAME4= <>
##$TPNAME5= <>
##$TPNAME6= <>
##$TPNAME7= <>
##$TPOAL= (0..7)
0.5 0.5 0.5 0.5 0.5 0.5 0.5 0.5
##$TPOFFS= (0..7)
0 0 0 0 0 0 0 0
##$TUNHIN= 0
##$TUNHOUT= 0
##$TUNXOUT= 0
##$USERA1= <user>
##$USERA2= <user>
##$USERA3= <user>
##$USERA4= <user>
##$USERA5= <user>
##$V9= 5
##$VALIST= <valist>
##$VCLIST= <CCCCCCCCCCCCCCC>
##$VD= 0
##$VDLIST= <DDDDDDDDDDDDDDD>
##$VPLIST= <PPPPPPPPPPPPPPP>
##$VTLIST= <TTTTTTTTTTTTTTT>
##$WBST= 1024
##$WBSW= 4
##$XGAIN= (0..3)
0 0 0 0
##$XL= 0
##$YL= 0
##$YMAX_a= 1573451648
##$YMIN_a= -3324103.68
##$ZGOPTNS= <>
##$ZL1= 120
##$ZL2= 120
##$ZL3= 120
##$ZL4= 120
##$ABSF1= 10
##$ABSF2= 0
##$ABSG= 5
##$ABSL= 3
##$ALPHA= 0
##$AQORDER= 0
##$ASSFAC= 0
##$ASSFACI= 0
##$ASSFACX= 0
##$ASSWID= 0
##$AUNMP= <proc_1d>
##$AXLEFT= 0
##$AXNAME= <>
##$AXNUC= <off>
##$AXRIGHT= 0
##$AXTYPE= 0
##$AXUNIT= <>
##$AZFE= 0.1
##$AZFW= 0.1
##$BCFW= 1
##$BC_mod= 2
##$BYTORDP= 0
##$COROFFS= 0
##$CY= 15
##$DATMOD= 1
##$DC= 2
##$DFILT= <>
##$DTYPP= 0
##$F1P= 0
##$F2P= 0
##$FCOR= 0.5
##$FTSIZE= 0
##$FT_mod= 4
##$GAMMA= 1
##$GB= 0
##$INTBC= 1
##$INTSCL= 1
##$ISEN= 128
##$LB= 0.3
##$LEV0= 0
##$LPBIN= 0
##$MAXI= 10000
##$MC2= 0
##$MEAN= 0
##$ME_mod= 0
##$MI= 0
##$NCOEF= 0
##$NC_proc= -10
##$NLEV= 6
##$NOISF1= 0
##$NOISF2= 0
##$NSP= 1
##$NTH_PI= 0
##$NZP= 0
##$OFFSET= 14.45864
##$PC= 1
##$PHC0= 0
##$PHC1= 0
##$PH_mod= 0
##$PKNL= yes
##$PPARMOD= 0
##$PPDIAG= 0
##$PPIPTYP= 0
##$PPMPNUM= 2147483647
##$PPRESOL= 1
##$PSCAL= 4
##$PSIGN= 0
##$PYNMP= <proc.py>
##$REVERSE= no
##$SF= 90.2741537586728
##$SI= 8192
##$SIGF1= 0
##$SIGF2= 0
##$SINO= 400
##$SIOLD= 32768
##$SPECTYP= <>
##$SREGLST= <1H.CDCl3>
##$SSB= 0
##$STSI= 0
##$STSR= 0
##$SW_p= 1497.18866228788
##$SYMM= 0
##$S_DEV= 0
##$TDeff= 0
##$TDoff= 0
##$TI= <>
##$TILT= no
##$TM1= 0
##$TM2= 0
##$TOPLEV= 0
##$USERP1= <user>
##$USERP2= <user>
##$USERP3= <user>
##$USERP4= <user>
##$USERP5= <user>
##$WDW= 1
##$XDIM= 8192
##$YMAX_p= 1573451573
##$YMIN_p= -3324102
##$CURPLOT= <PDFCreator>
##$CURPRIN= <$PDFCreator>
##$DFORMAT= <normdp>
##$LAYOUT= <+/1D_H.xwp>
##$LFORMAT= <normlp>
##$PFORMAT= <normpl>
##$SURQMSG= 1
$$ End of Bruker specific parameters
$$ ---------------------------------
##XUNITS= HZ
##YUNITS= ARBITRARY UNITS
##XFACTOR= 0.182762287876938
##YFACTOR= 1
##DELTAX= -0.182762287876938
##NPOINTS= 8192
##FIRSTX= 1497.0059
##FIRSTY= -2725467
##LASTX= 0
##MAXY= 1573451573
##MINY= -3324102
##XYDATA= (X++(Y..Y))
8191b725467G29553J05126C20291i3765o45802H28384a64167r62829e56539L5573
$$ -2725467 729553 834679 320291 -93765 -739567 828384 -164167 -1126996 -556539 -520966
8181e20966A776551g35466A6661J448602G27665a88587D32150A9227P85186A23193
$$ -520966 1776551 -735466 16661 1465263 727665 -188587 432150 19227 804413 123193
8170a215101d23855A90234a717099O33607j97470L43737G74502A1545J06989c76435
$$ -1215101 -423855 190234 -1717099 -1083492 -1280962 -937225 774502 11545 118534 -376435
8159i33481G65835P54275C84954f29463b51109A051570a076098E55918a206125
$$ -933481 765835 1520110 384954 -629463 -251109 1051570 -1076098 555918 -1206125
8149A296797d17192A01026a422359l71294b78441k88998F97261a679186I50749
$$ 1296797 -417192 101026 -1422359 -1793653 -278441 -567439 697261 -1679186 950749
8139a113901m32457A800442c08109j523169o8938A137589A06591a059312d10796
$$ -1113901 -1546358 1800442 -308109 -1831278 -1900216 1137589 106591 -1059312 -410796
8129a017638d219F51670b061333a01529l87545p41984G54894e2431j150900A073449
$$ -1017638 -4219 651670 -2061333 -101529 -489074 -1231058 754894 -52431 -1203331 1073449
8118f4468A826543q01914b10316k76926B72008R7497P30450d37219D4427J756685
$$ -64468 1826543 1024629 -210316 -487242 272008 369505 1099955 -437219 44427 1801112
8108A801112d31517H89937o9252M70176J29196B87502a80000H23224a27804n49663
$$ 1801112 -431517 889937 820685 1290861 1420057 287502 -180000 823224 -127804 -677467
8098f77467K67495m96087E55047d72002A453006a581540c86316G07986J195457
$$ -677467 -409972 -906059 555047 -472002 1453006 -1581540 -386316 707986 1903443
8089A903443f3708j423233j79943E69850J037229g68323L81447B17686K79270
$$ 1903443 -63708 -1486941 -1666884 569850 1607079 -768323 -386876 217686 496956
8080D96956e77265b38342j461478d243j387928M48064n4875A374471c47413A604178
$$ 496956 -577265 -238342 -1699820 -4243 -1392171 -944107 -998982 1374471 -347413 1604178
8069D4179J092170g4885k93346h8492j637655B82654J509755b35894p70904B67771
$$ 44179 1136349 -74885 -368231 -88492 -1726147 282654 1792409 -235894 -1006798 267771
8058I59695i88021c95457k10016H55041r7541b246860E55259f80200B6248M6120
$$ 959695 -988021 -395457 -605473 855041 757500 -2246860 555259 -680200 26248 72368
8048G2368a363913a02645F1032e76060a99779A031371a151763A038257f77986
$$ 72368 -1363913 -102645 61032 -576060 -199779 1031371 -1151763 1038257 -677986
8038B76612a710907g60162A488737c32426I32414a160971A090334O85105D9639
$$ 276612 -1710907 -760162 1488737 -332426 932414 -1160971 1090334 1775439 49639
8028b18817B88033j3105e71941F53867a56434o80376j0499c69680A67377J106008
$$ -218817 288033 274928 -571941 653867 -156434 -836810 -847309 -369680 167377 1273385
8018A273385C93899c3774H325J117449g54584L00531F9951P49604J42374B35492
$$ 1273385 393899 -33774 8325 1125774 -754584 -454053 69951 819555 961929 235492
8007B81217J978583c5829B240052b673284b24615A049555h15109D64379a369435
$$ 281217 2259800 -35829 2240052 -2673284 -224615 1049555 -815109 464379 -1369435
7997c67984j73171A627669n45961a240322A297212M85919l91404b18845E1770
$$ -367984 -541155 1627669 1081708 -1240322 1297212 1783131 1391727 -218845 51770
7987f40245I21325N80892n7081D7931d0908A105277d13206l89921A591781C57641
$$ -640245 921325 1502217 1445136 47931 -40908 1105277 -413206 -803127 1591781 357641
7976a203716I93358k11710Q63133L51629a885194B342311o73884i11240A630800
$$ -1203716 993358 781648 1644781 1996410 -1885194 2342311 1668427 -911240 1630800
7966B808039a099603C43242Q67904a061668B53034D8571K85194a177922J87499
$$ 2808039 -1099603 343242 1211146 -1061668 253034 48571 333765 -1177922 -990423
7957i90423B092775g09228o37311N6263A152286a160806M65587B676954a103140
$$ -990423 2092775 -709228 -1346539 -1290276 1152286 -1160806 -695219 2676954 -1103140
7947F89329f17705n0488A505909h85695J44007B065071B29736J175122h71284
$$ 689329 -617705 -668193 1505909 -885695 -741688 2065071 229736 1404858 -871284
7937a359096H58244K63684c500r39377l34620j39793F10115i58936A494999F15467
$$ -1359096 858244 1121928 -3500 -942877 -1277497 -1417290 610115 -958936 1494999 615467
7926c02686j419188P38661l96401A277748B57622b38265I44596a081650N04806
$$ -302686 -1721874 -983213 -1379614 1277748 257622 -238265 944596 -1081650 -576844
7917e76844j751584I20452g58274c31982H20109a038383d47768a46349o4877j743361
$$ -576844 -2328428 920452 -758274 -331982 820109 -1038383 -447768 -146349 -211226 -1954587
7907a954587A141885D85512K274133C32892d02640p78898A877330q19000A31935
$$ -1954587 1141885 485512 2759645 332892 -402640 -1181538 1877330 1058330 131935
7897C84259P9617G6704i3191l16398j60617H23206k9774A00716J00505a109233
$$ 384259 463876 76704 -93191 -409589 -570206 823206 793432 100716 201221 -1109233
7886A440256F30487d25824G86752B49039L42315b93607j62710j071420O83518
$$ 1440256 630487 -425824 786752 249039 591354 -293607 -456317 -1527737 -844219
7877h44219E47149N35815M83077E89526J38123J370699D26801L034648E35015
$$ -844219 547149 1082964 1566041 589526 727649 2098348 426801 3461449 535015
7867A123061g15869A32002M13113g41617b93103a36606I24383J50724R28666P66960
$$ 1123061 -715869 132002 545115 -741617 -293103 -136606 924383 1075107 2003773 2770733
7857B770733b272362C90581b294889A168041a039817A269565k03747d30257A014451
$$ 2770733 -2272362 390581 -2294889 1168041 -1039817 1269565 1065818 -430257 1014451
7847f36979A326075G9625J25801R41230i32911I68158O5989a257014e01105m67681
$$ -636979 1326075 79625 205426 1146656 -932911 968158 1034147 -1257014 -501105 -968786
7837i68786E13517J75516a02224A691625o87063m55356a071485E5733J095432
$$ -968786 513517 689033 -102224 1691625 1004562 549206 -1071485 55733 1151165
7828A151165f68641A696608C20912J77911J218274h37462b83575l51319A432547
$$ 1151165 -668641 1696608 320912 498823 1717097 -837462 -283575 -634894 1432547
7818A88864N05360Q2220a029706A55734b21072n68503k32980m33129o23016B262165
$$ 188864 694224 776444 -1029706 155734 -221072 -789575 -1022555 -1455684 -2078700 2262165
7807F10463Q3429A74395a613322C6336a29263p1524j426927e01670j762920F49542
$$ 610463 693892 174395 -1613322 36336 -129263 -200787 -1627714 -501670 -2264590 649542
7796F87007N01637E01969P49038k66956f11898B478071l59919g38578G45552P54032
$$ 687007 1188644 501969 1251007 984051 -611898 2478071 2118152 -738578 745552 1499584
7786A499584F13325Q19385b811014a125692C095215a748112d27590K13730A512244
$$ 1499584 613325 1432710 -2811014 -1125692 3095215 -1748112 -427590 -213860 1512244
7776F8981J032397p3321B87039e58644C29355f85020A643485b74020B184243r78135
$$ 68981 1101378 1028057 287039 -558644 329355 -685020 1643485 -274020 2184243 1206108
7766A206108m15211b17874m96105l02243a35788j350427A695462p04306k33666
$$ 1206108 790897 -217874 -713979 -1016222 -135788 -1486215 1695462 991156 757490
7757G57490B57900R80808k85915d97720l84409E30998N6317J91203J658675F91184
$$ 757490 257900 1238708 952793 -497720 -882129 530998 587315 778518 2437193 691184
7746a435773a16641B555664D93203P65407B67405b222387A894775B6989a412340
$$ -1435773 -116641 2555664 493203 1258610 267405 -2222387 1894775 26989 -1412340
7736b587966A330127e80557M4486A235789B38236j8680O18103l40205q6176a19802
$$ -2587966 1330127 -580557 -536071 1235789 238236 219556 837659 497454 411278 -119802
7725b924100B12680J19297H9766K212217O32085A465506B83303L570551b21045
$$ -2924100 212680 331977 89766 2301983 2934068 1465506 283303 3853854 -221045
7715G79721P86282c31838B70449a166051A18984K092329D47629J040044d19577
$$ 779721 1566003 -331838 270449 -1166051 118984 2211313 447629 1487673 -419577
7705A90209f28196C82204d11837j139786E29823A93257f73487l12553H38400R82592
$$ 190209 -628196 382204 -411837 -1551623 529823 193257 -673487 -986040 838400 1820992
7695A820992d05028E64260R91487R86271c97411A952885F96744J82959b303889
$$ 1820992 -405028 564260 1555747 2542018 -397411 1952885 696744 879703 -2303889
7685b33293G26693e38687A191952n78202p2328A90164J143797I1096J165954i58234
$$ -233293 726693 -538687 1191952 613750 541422 190164 1333961 91096 1257050 -958234
7674H26172J527478q80564e445A24972O85797J17425M83445c04212B250656e47627
$$ 826172 2353650 1473086 -5445 124972 810769 928194 1411639 -304212 2250656 -547627
7663D66846b021499A15467d43933A160769p7113Q82264a30660p65860b03877A508191
$$ 466846 -2021499 115467 -443933 1160769 1083656 1965920 -130660 -896520 -203877 1508191
7652i202j208933C27433L11523c63556o97087c9309q36814E30756K35283B469
$$ -9202 -1218135 327433 638956 -363556 -1060643 -39309 -876123 530756 766039 2469
7641C69885a453114D05957J080637a330854e73605j23175c8005a3636j446213
$$ 369885 -1453114 405957 1486594 -1330854 -573605 -696780 -38005 -13636 -1459849
7632a459849c6414F80619i99963E77992b65752B301400j003317B96734J021876
$$ -1459849 -36414 680619 -999963 577992 -265752 2301400 1298083 296734 1318610
7623A318610a042749J61626I59443N45299K44409i92390G55895J81003k658g24538
$$ 1318610 -1042749 -881123 959443 1504742 1749151 -992390 755895 936898 934240 -724538
7612c80734C18928c78817m55792b47052A087456N75750b66354F96309K36705l56009
$$ -380734 318928 -378817 -834609 -247052 1087456 1663206 -266354 696309 933014 577005
7602E77005K00605P3596l82563J48838j60576h97224A218210c15177B97463L68812
$$ 577005 777610 851206 468643 617481 456905 -897224 1218210 -315177 297463 666275
7592F66275a112027A358156j35571i4475A17439O36613a757058a40456j59910
$$ 666275 -1112027 1358156 1222585 -94475 117439 754052 -1757058 -140456 -300366
7583c00366A81264h86235d9864B06676J251172C23202L61948K496413I78893P20267
$$ -300366 181264 -886235 -49864 206676 1457848 323202 685150 3181563 978893 1699160
7573A699160c71812B489968E42628i9634j5134A902456B60809Q39576g76980A069635
$$ 1699160 -371812 2489968 542628 -99634 -114768 1902456 260809 1100385 -776980 1069635
7562D93636p0640N42321h14602B269747a843710f90344c36822J42094C99918c48686
$$ 493636 422996 965317 -814602 2269747 -1843710 -690344 -336822 -194728 399918 -348686
7551G395J79629c95580A285368A70010J094708f58953j032642A565535G01611
$$ 7395 187024 -395580 1285368 170010 1264718 -658953 -1691595 1565535 701611
7541E87419k21291O10646d50941K1725E96918f25820j224031a29413p36046r65359
$$ 587419 366128 976774 -450941 -429216 596918 -625820 -1849851 -129413 -865459 -1830818
7531a830818A074650m70968K058053f56270H64478a748091A069759c7177A640219
$$ -1830818 1074650 603682 2661735 -656270 864478 -1748091 1069759 -37177 1640219
7521F36015b18416n86872a90883d805B04000b404312g28492m04624E88627A97259
$$ 636015 -218416 -805288 -190883 -4805 204000 -2404312 -728492 -1133116 588627 197259
7510A525932m52537l9631D55224b084245A918322C68234P79777c97181m28586
$$ 1525932 1073395 1033764 455224 -2084245 1918322 368234 1148011 -397181 -825767
7501h25767A294649E15287O00558A59112b50005I77189m69322J792498a83301
$$ -825767 1294649 515287 1115845 159112 -250005 977189 507867 2300365 -183301
7491D222672F60009a954073A669340m43260C28188e6611B871004B74636L24996
$$ 4222672 660009 -1954073 1669340 1226080 328188 -56611 2871004 274636 599632
7482E99632K208258j045222A97582J793481h71576B059980b85362C00310b14559
$$ 599632 2807890 1762668 197582 1991063 -871576 2059980 -285362 300310 -214559
7472B59703N00009l36726L57918g52560n47075C07883c30898A013641J238498
$$ 259703 759712 422986 780904 -752560 -1299635 307883 -330898 1013641 2252139
7463B252139G38436J771744f17925B15624H6213K74622P90824C51886a97465n04626
$$ 2252139 738436 2510180 -617925 215624 86213 360835 1151659 351886 -197465 -702091
7453g02091m58993F53680K80885l22740b27488h1671D93317L80616K197880F81893
$$ -702091 -1161084 653680 934565 611825 -227488 -81671 493317 873933 3071813 681893
7442C5237J836179E82219n1137J283543f67558C246589E58589g99223A369024
$$ 35237 1871416 582219 531082 1814625 -667558 3246589 558589 -799223 1369024
7432I80976i51152b75947l31755j95118C39283N49115a32475C39273K208862e40012
$$ 980976 -951152 -275947 -607702 -802820 339283 888398 -132475 339273 2548135 -540012
7421A36750c5412q87332A828089a87828A57510K82314g46539G50489j52341L25230
$$ 136750 -35412 -922744 1828089 -187828 157510 439824 -746539 750489 598148 923378
7411I23378a157086k87392f62609k15503A697335E79232c2723A130792G6261L82514
$$ 923378 -1157086 -1444478 -662609 -878112 1697335 579232 -32723 1130792 76261 458775
7401D58775Q84679c79355a24523H06927d72981E15040a704919A253009D694P10880
$$ 458775 1343454 -379355 -124523 806927 -472981 515040 -1704919 1253009 4694 715574
7391G15574a026896F00147j06491J66972B3639R80297P12730L61293r74705j12439
$$ 715574 -1026896 600147 493656 660628 23639 1003936 1716666 2077959 1103254 990815
7381I90815a005530c4176q44331A803424l91892A68000K53455g80324C64143R1742
$$ 990815 -1005530 -34176 -878507 1803424 1411532 168000 421455 -780324 364143 455885
7371D55885M07556B16321d56525J05463F40161C6776J170667j70288m34043J73330
$$ 455885 863441 216321 -456525 -351062 640161 36776 1207443 1037155 603112 776442
7361G76442Q14930n31085O56433G22358J413300q23168d90060A157937R0816H393
$$ 776442 1591372 1060287 1716720 722358 2135658 1312490 -490060 1157937 1248753 8393
7350e09645B215999H28357d33939I02537k56227J80175N52985J110290r44723
$$ -509645 2215999 828357 -433939 902537 646310 826485 1379470 2489760 1545037
7341A545037d73439H55475a674247g50272B357799b315170D6369e01971I21157
$$ 1545037 -473439 855475 -1674247 -750272 2357799 -2315170 46369 -501971 921157
7331A562428a26505E7551f58077A46512J014168l44022I7370J697487d68198G91864
$$ 1562428 -126505 57551 -658077 146512 1160680 816658 97370 1794857 -468198 791864
7320D01702J287381K69045O2819i50385k14280m6381c26009k40651n26109m44305
$$ 401702 1689083 1958128 2020947 -950385 -1164665 -1211046 -326009 -566660 -1092769 -1537074
7310a537074B35963P64289l85194e00155A129622b42976A595736B14949K74661
$$ -1537074 235963 1000252 615058 -500155 1129622 -242976 1595736 214949 489610
7301D89610N1713h92534F22778R85b84644k71409I63139C27173P23518J58535
$$ 489610 541323 -892534 622778 623763 -284644 -556053 963139 327173 1050691 1209226
7291A209226f58217b46861H5504J76866h59679E87232K003148q31339P7894A12601
$$ 1209226 -658217 -246861 85504 262370 -859679 587232 2590380 1759041 1836935 112601
7280A710291C07563K14889J838189I27279b81958A031933e77930A97642a075109
$$ 1710291 307563 522452 2360641 927279 -281958 1031933 -577930 197642 -1075109
7270G98622l63141j30096A0906f4502A65230J522351N15629I43319h86446B513501
$$ 798622 435481 305385 10906 -64502 165230 1687581 2203210 943319 -886446 2513501
7259B87378h4071m68385A762256B08301b26724F40126J006351j60532n35014L02477
$$ 287378 -84071 -552456 1762256 208301 -226724 640126 1646477 1485945 950931 1253408
7249A253408a4373D47761a69005j99256A935708Q34097l45749b58506j71571A495983
$$ 1253408 -14373 447761 -169005 -368261 1935708 2769805 2424056 -258506 -430077 1495983
7238B571537j163506F35697a27609A470777I5219M11373J446955m25446K85188
$$ 2571537 1408031 635697 -127609 1470777 95219 506592 1953547 1528101 1813289
7229A813289g7212k18417A247563M04901N78621a04840n20746n97672L99891b99367
$$ 1813289 -77212 -295629 1247563 1652464 2231085 -104840 -625586 -1223258 -823367 -299367
7218I34140L38414k32653D58537g63449D92431h6137H96468c30525D87775a70725
$$ 934140 1272554 1039901 458537 -763449 492431 -86137 896468 -330525 487775 -170725
7207A231898d69035A34766a06550F63268J402012q84846J872774A030951H4628
$$ 1231898 -469035 134766 -106550 663268 2065280 1180434 3053208 1030951 84628
7197A109092B11467e63960A244797C44164J4306f57315A481583F74106M57120
$$ 1109092 211467 -563960 1244797 344164 358470 -657315 1481583 674106 1131226
7188A131226d58458j48532A594793a966599A225933i601A220868H9112f36333
$$ 1131226 -458458 -606990 1594793 -1966599 1225933 -9601 1220868 89112 -636333
7178A822112b14433A663588L59346B45377J859445a30925A704793H03871L46798
$$ 1822112 -214433 1663588 2022934 245377 2104822 -130925 1704793 803871 1150669
7169A150669N34691G21103O25727h28697A009764D18825J781290D07257Q39423
$$ 1150669 1685360 721103 1346830 -828697 1009764 418825 2200115 407257 1246680
7160A246680a530327A52547N91764L35819d57003j125333A333407M53719G11436
$$ 1246680 -1530327 152547 744311 1080130 -457003 -1582336 1333407 1787126 711436
7150b9618j76220q0477A268515E79272B19564B520L137612g38301J99948h8340
$$ -29618 -205838 -286315 1268515 579272 219564 2520 3140132 -738301 -538353 -88340
7139A500275E084J440969a26586A704748a09540B70794J431874M79686j55877
$$ 1500275 5084 1446053 -126586 1704748 -109540 270794 1702668 2182354 2026477
7130B026477E74244P17847I4109M50949R06397E90997i8101H85413a172583o2811
$$ 2026477 574244 1292091 94109 545058 1451455 590997 -98101 885413 -1172583 -1235394
7120a235394b29870j60896A39829J237810n00688D01948N36393j83269G184Q19286
$$ -1235394 -229870 -390766 139829 1377639 876951 401948 938341 755072 7184 826470
7110H26470K331184B2990J148559E2820K443911A193290d68046A439956i33155
$$ 826470 3157654 22990 1171549 52820 2496731 1193290 -468046 1439956 -933155
7100a033574A596547M23791C67821J963138r43453b016179b50432B247508b07465
$$ -1033574 1596547 2020338 367821 2330959 1387506 -2016179 -250432 2247508 -207465
7090D96487L20681J625543k99881e99513D10477J676735b8537C198524j582113
$$ 496487 817168 2442711 2142830 -599513 410477 2087212 -28537 3198524 1616411
7081A616411m67265k78442a117476I30796l1524k35909J020927H3277Q03121C32872
$$ 1616411 1149146 870704 -1117476 930796 899272 663363 1684290 83277 886398 332872
7070D36078R67525A7439J149193c29782D32722J276521a11038I73578b038256
$$ 436078 1403603 17439 1166632 -329782 432722 1709243 -111038 973578 -2038256
7060b61245A675615Q96270a730215P56288h2988A310541A83803e20639I91794
$$ -261245 1675615 2571885 -1730215 -973927 -82988 1310541 183803 -520639 991794
7050B63091J276267n92581Q45690Q99904B00081J389957a90956h2213A78846J247049
$$ 263091 1539358 946777 1792467 2692371 200081 1590038 -190956 -82213 178846 1425895
7040A425895f61173A49745a862147E54809J401064E85185J694683D44866a10814
$$ 1425895 -661173 149745 -1862147 554809 1955873 585185 2279868 444866 -110814
7030B342692k35890a329038B76024J107668N53976e1086A104373B10207g40726
$$ 2342692 2106802 -1329038 276024 1383692 1937668 -51086 1104373 210207 -740726
7020I36656P89093E31913A68808e81850C29554j56469c48555A202847K828275
$$ 936656 1725749 531913 168808 -581850 329554 173085 -348555 1202847 4031122
7011D031122A515957g77159I05401D37012K211548C5675Q53125M54483F52122
$$ 4031122 1515957 -777159 905401 437012 2648560 35675 888800 1343283 652122
7001a255019A446415C79284j34385P96969o5416a045187A440701g28777F29808
$$ -1255019 1446415 379284 244899 1041868 976452 -1045187 1440701 -728777 629808
6991A071655D70422N12246A76049R57594N7868O3118B18909h57538C97387o3358
$$ 1071655 470422 982668 176049 1133643 1191511 1254629 218909 -857538 397387 334029
6981C34029J1001J590306n2888F67785a241897e55704A658551N01472p44246H5466
$$ 334029 345030 1935336 1882448 667785 -1241897 -555704 1658551 2160023 1415777 85466
6970A103015d92236j182900A453910p17903K646290D13606a500500H32076A35818
$$ 1103015 -492236 -1675136 1453910 736007 3382297 413606 -1500500 832076 135818
6960a151853I64O62125A08046f7766A676387a186538b40790D25631P70517O86725
$$ -1151853 964 663089 108046 -67766 1676387 -1186538 -240790 425631 1196148 1882873
6950A882873K6016F67894j90863J22438h62193C117570I98470N29448F88115k98392
$$ 1882873 1908889 667894 477031 599469 -862193 3117570 998470 1527918 688115 389723
6940C89723J510187a082980G74884f79411A527406K262617E36590J51380N56321
$$ 389723 1899910 -1082980 774884 -679411 1527406 3790023 536590 687970 1244291
6931A244291h32586I72595P37124K89143b65272f3014B217812B43103K482399
$$ 1244291 -832586 972595 1709719 1998862 -265272 -63014 2217812 243103 2725502
6922B725502A277048O27708E00222l6785K199237j196988F35535a405375A770688
$$ 2725502 1277048 1904756 500222 463437 2662674 1465686 635535 -1405375 1770688
6912D29970a91928j25841C71343L26963B87370I039b19301A914537q91085C21235
$$ 429970 -191928 -317769 371343 698306 287370 9039 -219301 1914537 1023452 321235
6901i41956G08349a735628E23169J988531A096310j44600B1800b6315A18112E5540
$$ -941956 708349 -1735628 523169 2511700 1096310 951710 21800 -26315 118112 55540
6890A147235D24557a511536H20062a271289N54999B26819J647003r35862J186506
$$ 1147235 424557 -1511536 820062 -1271289 -716290 226819 1873822 937960 2124466
6881B124466D05157M77480a66669j227175H5962a744700A450625k61690M71543
$$ 2124466 405157 882637 -166669 -1393844 85962 -1744700 1450625 1188935 1660478
6872A660478J111766I0568O49219d1003H2682J303945b56288A499378E14754b06726
$$ 1660478 2772244 90568 739787 -41003 82682 1386627 -256288 1499378 514754 -206726
6861A370094E52346M41783O1729J253608i45207C07248a008411b72060A577728
$$ 1370094 552346 994129 1055858 2309466 -945207 307248 -1008411 -272060 1577728
6851A46393J521692F46202L45403e19101A824809D58959a261338A454755h35806
$$ 146393 1668085 646202 991605 -519101 1824809 458959 -1261338 1454755 -835806
6841c57737q339k495B11557K120036Q0207I29651M74986d26133F50634L55322
$$ -357737 -366076 -368571 211557 2331593 2411800 929651 1404637 -426133 650634 1005956
6831A005956K93731K171707A597259L62948A46466N80905c85189A208492j49009
$$ 1005956 1299687 3471394 1597259 1960207 146466 727371 -385189 1208492 1059483
6822A059483d51454A375795O1286k34197a64322j548123G14654Q3786a373486
$$ 1059483 -451454 1375795 1437081 1202884 -164322 -1712445 714654 798440 -1373486
6812F43371n3055A61007a386315A080212R97984n72329b70289A175319C28704
$$ 643371 590316 161007 -1386315 1080212 2078196 1505867 -270289 1175319 328704
6802D19534Q5608N81374d66528A189220D94472J526909a84687G64311L27642Q6962
$$ 419534 505142 1086516 -466528 1189220 494472 2021381 -184687 764311 1091953 1178915
6792A178915J440543E28595a280038A62349i04412E97659K418448e40346F46890
$$ 1178915 2619458 528595 -1280038 162349 -904412 597659 3016107 -540346 646890
6782I97772d73259A582712L76864B38126O81483C74509K604938d02399J12484
$$ 997772 -473259 1582712 1959576 238126 919609 374509 2979447 -402399 -289915
6773b89915C68197f40135B654624a44590j448257B192578E64118b84817C013147
$$ -289915 368197 -640135 2654624 -144590 -1592847 2192578 564118 -284817 3013147
6763D47393J373734d89106B12729R81741D61359O2068N10279M88700J678630A468633
$$ 447393 1821127 -489106 212729 1194470 461359 523427 1033706 1522406 3201036 1468633
6752A543311m00834O40323j34326O1469c45162A068080J014186h52415I01517
$$ 1543311 1142477 1782800 1648474 1709943 -345162 1068080 2082266 -852415 901517
6742A477602n13571m02689J09601e7816A890342p99956P93704b2977G82663d89261
$$ 1477602 964031 561342 670943 -57816 1890342 1090386 1884090 -22977 782663 -489261
6731B826924j044165G09300a24924B122297m81033g4985B68320P88548k78238
$$ 2826924 1782759 709300 -124924 2122297 1641264 -74985 268320 1056868 778630
6722G78630c89452G58604B20601J86487n695Q03187a371940I07981A46251P42865
$$ 778630 -389452 758604 220601 407088 401393 1204580 -1371940 907981 146251 889116
6712H89116e22329C65751J720098E41359L54964J34543J463129a16025G84753
$$ 889116 -522329 365751 2085849 541359 896323 1030866 2493995 -116025 784753
6702A206228O03182k73038F9542J068276n57285J311253l78542m38334J908691
$$ 1206228 1809410 1536372 69542 1137818 580533 1891786 1513244 1074910 2983601
6693B983601H06079P63003m10133D60584g7337B619637j118315N07554B75213
$$ 2983601 806079 1569082 1158949 460584 -77337 2619637 1501322 2008876 275213
6683A468302E76513e5089A491834Q27536O4048D59918J142957j17578o1819e3467
$$ 1468302 576513 -55089 1491834 2319370 2383418 459918 1602875 1485297 1423478 -53467
6672B022201j23662H90230k13938K722259i73021A818812K262096b15023C13127
$$ 2022201 1898539 890230 676292 3398551 -973021 1818812 4080908 -215023 313127
6662a49771A576547k96398f20670A589318K15866h7400o30335G62093L95819L00667
$$ -149771 1576547 1280149 -620670 1589318 1805184 -87400 -717735 762093 1157912 1458579
6652A458579a72238E85367J755062q77329o49424o6158J048221N74718l59744
$$ 1458579 -172238 585367 2340429 1463100 813676 747518 1795739 2370457 2010713
6643B010713b55095A714334k43218k3480B55662J706762J172672A561348J561609
$$ 2010713 -255095 1714334 1471116 1447636 255662 1962424 3135096 1561348 3122957
6634C122957B72578J084073a510045h7001A568758J24727p06393J453991H52216
$$ 3122957 272578 1356651 -1510045 -87001 1568758 1693485 987092 2441083 852216
6624B344368D00286h83189B850116L86576A91152P69114q8625p5498J839886i8268
$$ 2344368 400286 -883189 2850116 3236692 191152 960266 871641 796143 2636029 -98268
6613D69852J845438B94342J716897E25725B37069K069157e87237G61218B04197
$$ 469852 2315290 294342 2011239 525725 237069 2306226 -587237 761218 204197
6603b41984R8603G81370K11338O43519D73093J109534m46221J230564g71104A260535
$$ -241984 -143381 781370 992708 1636227 473093 1582627 1136406 2366970 -771104 1260535
6592i7567A72515O19216j5234b8163C99509M9985J433786a064012e2664B280758
$$ -97567 172515 791731 776497 -28163 399509 449494 1883280 -1064012 -52664 2280758
6581E20616G3596a23410A778568G54571a76402C56833H5876K127283P0911c52971
$$ 520616 73596 -123410 1778568 754571 -176402 356833 85876 2213159 2284070 -352971
6570B317992m53922o61727j97459J97421A43396N50960O87507m67302l96357J160915
$$ 2317992 1864070 1202343 1004884 1202305 143396 694356 1381863 914561 518204 1679119
6560A679119A90074L600554j768811B0962h9025A140387R47958g35908B46602
$$ 1679119 190074 3790628 2021817 20962 -89025 1140387 2088345 -735908 246602
6550G58551L02491L62965a11332F22659a247272f20369A103292J63179l17300
$$ 758551 1061042 1424007 -111332 622659 -1247272 -620369 1103292 1266471 949171
6541I49171L740R8705b23393C46347O70092J250081a76693F72220J315202R73546
$$ 949171 952911 1051616 -223393 346347 1016439 2266520 -176693 672220 1987422 2960968
6531B960968F67380i64730G74151J69617B49881K03653J610650c55026B826654
$$ 2960968 667380 -964730 774151 943768 249881 453534 2064184 -355026 2826654
6521c05929l0583B239848l62228D51181J517311K11572I47845a366076C01732
$$ -305929 -336512 2239848 1877620 451181 1968492 2180064 947845 -1366076 301732
6511e88136G33900l43860K57752J000653G64356K44169R08885L26567F03896J807032
$$ -588136 733900 390040 647792 1648445 764356 1008525 1917410 2243977 603896 2410928
6501B410928r86726l64001I6257Q88544b9967C04175L81451d40281B079161J622554
$$ 2410928 1424202 1060201 96257 984801 -29967 304175 685626 -440281 2079161 3701715
6491C701715A350290B07616J389160R22565D45300K232428m01307H47765B89049
$$ 3701715 1350290 207616 1596776 2519341 445300 2677728 2276421 847765 289049
6481a579804C37499K147205h621E48188q3084L444868A943698k6105q73658J401390
$$ -1579804 337499 2484704 -8621 548188 465104 3909972 1943698 1917593 1043935 2445325
6471B445325F42254J079600j16624E6643K821787j201191Q30423c09869A133513
$$ 2445325 642254 1721854 1605230 56643 2878430 1677239 2507662 -309869 1133513
6461A366108J638924o56101A058868l74759k26966J822028f21922A176413E30136
$$ 1366108 3005032 2348931 1058868 684109 457143 2279171 -621922 1176413 530136
6451B627211H67590M52922p5344E71702J830233E72736b79486B79655M17133P62924
$$ 2627211 867590 1320512 1245168 571702 2401935 572736 -279486 279655 696788 1459712
6441A459712c42873E40531B14335H4622j8940L18887J021960M1956J066383C83079
$$ 1459712 -342873 540531 214335 84622 65682 384569 1406529 1448485 2514868 383079
6430A137613J05157r9135K287562H97786D39072A07893P80813K430311C10809
$$ 1137613 1242770 1143635 3431197 897786 439072 107893 888706 3319017 310809
6420f09443A113094J00889m65338l18297K851691G04913J741797g65204A829197
$$ -609443 1113094 1213983 748645 430348 3282039 704913 2446710 -765204 1829197
6410D363826i20401a26152A893985C48411L545083i13781d00141J24241A381796
$$ 4363826 -920401 -126152 1893985 348411 3893494 -913781 -400141 -275900 1381796
6400I95494J084812n81089m53282L10984b97223A854921F17914J826335J479067
$$ 995494 2080306 1499217 1045935 1356919 -297223 1854921 617914 2444249 3923316
6391C923316f26390E45218J073184F04332N76138b76385A044054i99903A067106
$$ 3923316 -626390 545218 1618402 604332 1180470 -276385 1044054 -999903 1067106
6381B019291n48092P32389A066336L65499c65340D81587J687888A030757J83972
$$ 2019291 1471199 2203588 1066336 1431835 -365340 481587 2169475 1030757 1214729
6372A214729J030307c92138l7279A020662m30692J056349a130611A698607K71722
$$ 1214729 2245036 -392138 -429417 1020662 589970 1646319 -1130611 1698607 1970329
6363A970329o85874O40289N1839J19439q07239C82425J208132P20076a6284B142418
$$ 1970329 1284455 1924744 1976583 2096022 1288783 382425 1590557 2310633 -16284 2142418
6352A346022j13913C08581L066664C53489M03538J176034m8078J216068j59558
$$ 1346022 1232109 308581 3375245 353489 757027 1933061 1884983 3101051 2941493
6343B941493g83811A41503N57622J420653e61831G42471N74712g2931B196912
$$ 2941493 -783811 141503 699125 2119778 -561831 742471 1317183 -72931 2196912
6333E65886e3822A658171p12837D70734J36878B5835L088375C54359Q53489K064477
$$ 565886 -53822 1658171 945334 470734 607612 25835 3114210 354359 1207848 3272325
6323C272325f50684B031667j6912C73016R45613L9474m34286L30593D02393K51010
$$ 3272325 -650684 2031667 2014755 373016 1318629 1358103 923817 1254410 402393 653403
6313F53403O27493J787597K3297r21445a099447H70457j17251J13092J337896
$$ 653403 1280896 3068493 3091790 2170345 -1099447 870457 753206 866298 2204194
6304B204194I74930P50454n13936N73011B82438K230119L00876o55795I35148
$$ 2204194 974930 1725384 1211448 1784459 282438 2512557 2813433 2157638 935148
6294B275068r12118J32486o84482C61934c48191A451115J016616j023314O34736
$$ 2275068 1362950 1495436 810954 361934 -348191 1451115 2467731 1444417 2079153
6285B079153A27562L660851I02720a464424A148061K380701F28663J829488D98921
$$ 2079153 127562 3788413 902720 -1464424 1148061 3528762 628663 2458151 498921
6275B143976r67741J210234F86334k21942j82817N78046J322819p78875E45780
$$ 2143976 1176235 2386469 686334 464392 281575 859621 2182440 1403565 545780
6265A866547M20166a72218A998542n06762p13662d26938p1384F87997J046656
$$ 1866547 2286713 -172218 1998542 1491780 778118 -426938 -498322 687997 1734653
6256A734653K00492F06810B90371O16912J733136o65022l83659F41022J030965
$$ 1734653 1935145 606810 290371 907283 2640419 1975397 1591738 641022 1671987
6247A671987F46625B9030J131133m106K92808J72423b69436k63885B119734K37475
$$ 1671987 646625 29030 1160163 1156057 1448865 1621288 -269436 -533321 2119734 2357209
6237B357209A165016J232948E82692K181710O20487c90774A237218J524600o42741
$$ 2357209 1165016 2397964 582692 2764402 3384889 -390774 1237218 2761818 2119077
6228B119077e04280B610808j027603F75791a31871p61721C63699J194294b45531
$$ 2119077 -504280 2610808 1583205 675791 -131871 -893592 363699 1557993 -245531
6218G12233N01405h62713A417531J183288F97751j06707K169799E12733K324661
$$ 712233 1213638 -862713 1417531 2600819 697751 591044 2760843 512733 2837394
6209B837394j411503J00507i43878n99872F77633J883976H43704J083392d81414
$$ 2837394 1425891 1526398 -943878 -1543750 677633 2561609 843704 1927096 -481414
6199G01968L298375j399130A229920L51513p5915n47133L230657F79601J541872
$$ 701968 4000343 2601213 1229920 1581433 1505518 958385 4189042 679601 2221473
6190B221473G54082b93702B139078k71860n54274E21474J826832J131882E79235
$$ 2221473 754082 -293702 2139078 1867218 1312944 521474 2348306 3480188 579235
6180B688562a09326A660389J121804G16405J785210j016620L84046m34984j09016
$$ 2688562 -109326 1660389 2782193 716405 2501615 1484995 1869041 1434057 1325041
6171A325041J95818m30192i2269A362448r9050M70553m01899J796461m79191h76998
$$ 1325041 1520859 1090667 -92269 1362448 1263398 1733951 1332052 3128513 2649322 -876998
6160E42953J947473j09905r47400d56722E29302K186215E09843O68896J516555
$$ 542953 2490426 2380521 1433121 -456722 529302 2715517 509843 1178739 2695294
6151B695294A309694E41741p1046J557615m88401l41985n04158J158204M79741
$$ 2695294 1309694 541741 470695 2028310 1539909 1197924 693766 1851970 2331711
6142B331711m66465C10887f5969E03283J335122J069461j329542J16973q43146
$$ 2331711 1865246 310887 -65969 503283 1838405 2907866 1578324 1695297 852151
6133H52151K062471j411382J30576q2275p0677L08607m69712L02404Q2112D72681
$$ 852151 2914622 1503240 1633816 1551541 1480864 1789471 1319759 1622163 1704275 472681
6122H23499j93321L58677k73058N38711k25929D88518K511633k45826A198190
$$ 823499 630178 988855 715797 1254508 1028579 488518 3000151 2754325 1198190
6112A75673J460552o09843K093841r00769D88820G8253J750192J37237J397434
$$ 175673 1636225 1026382 3120223 2219454 488820 78253 1828445 1965682 3363116
6103C363116j97152A51443M88552K1687J001192G31586R44673J298044j459494
$$ 3363116 3165964 151443 639995 661682 1662874 731586 1676259 2974303 1514809
6094A514809m38749J878988p38851r78290c60467A419203D94143o9065J457591
$$ 1514809 1076060 2955048 2216197 1237907 -360467 1419203 494143 425078 1882669
6085A882669L7638G54124J321061L43063l99453r14684B04396M69298o0485K902905
$$ 1882669 1920307 754124 2075185 2418248 2018795 1104111 204396 673694 613209 3516114
6075C516114A509019n4468G18375d77561A754895M81372I81784M2346J883213
$$ 3516114 1509019 1454551 718375 -477561 1754895 2236267 981784 1024130 2907343
6066B907343A030411J560825A041970P9282l08883A30347D2157M047806c79508
$$ 2907343 1030411 2591236 1041970 1121252 812369 130347 42157 4089963 -379508
6056A869948G92105K9768C63592J116457Q93603b37858B498868D74985J052345
$$ 1869948 792105 821873 363592 1480049 2373652 -237858 2498868 474985 1527330
6047A527330N91613g9051D67786K369215r27127j54067M52609m79470P8573e10221
$$ 1527330 2118943 -79051 467786 2837001 1909874 1755807 2208416 1728946 1807519 -510221
6036A485286l73103O56487F9472J370125m311J252342j089379K18469J460400
$$ 1485286 1112183 1768670 69472 1439597 1435286 2687628 1598249 1816718 3277118
6027C277118p03652k12972n77892b65867A630945R16506J459127B14443J799817
$$ 3277118 2573466 2360494 1782602 -265867 1630945 2547451 4006578 214443 2014260
6018B014260L90656q52025P79329C40789j03309b89137B100009N71929J009081
$$ 2014260 2404916 1552891 2332220 340789 237480 -289137 2100009 2671938 3681019
6009C681019A582320C59707J432697E35077Q42650F85546M92419J443314N68366
$$ 3681019 1582320 359707 1792404 535077 1377727 685546 1177965 2621279 3189645
6000C189645H88036K501600K05736m31442j532942o29273l16750a59961B14761
$$ 3189645 888036 3389636 3595372 3163930 1630988 1001715 684965 -159961 214761
5990C31451N66772a7219A217505R45591K86360P8437r82837P46235E50518P44924
$$ 331451 898223 -17219 1217505 2163096 2449456 2527893 1545056 2291291 550518 1295442
5980A295442R70120q67239P62474f65240A188490B64631R94800R11771r72444
$$ 1295442 2265562 1398323 2160797 -665240 1188490 264631 1259431 2171202 1198758
5971A198758a63087B912919m22190m34043h48680B820988G90368J729433a7062
$$ 1198758 -163087 2912919 2490729 2056686 -848680 2820988 790368 2519801 -17062
5961H91398P17474o85769p8958K215818c0042A016984L056387b80022m8857B082547
$$ 891398 1608872 923103 844145 3059963 -30042 1016984 4073371 -280022 -328879 2082547
5950C441542j500783K89534m04357m13501J177693A201580l86248j13318J285931
$$ 3441542 1940759 2230293 1825936 1412435 2590128 1201580 815332 702014 1987945
5941A987945B6602K196603c55131A082413R22045l34643a067232D45948L047781
$$ 1987945 26602 2223205 -355131 1082413 2004458 1669815 -1067232 445948 3493729
5932C493729r76848n81184F85198C1076Q68371K073246C94598J038619J920244
$$ 3493729 2516881 1935697 685198 31076 899447 2972693 394598 1433217 3353461
5923C353461a242033C08861L634789H37649Q83569j25689O00489r40042K371600
$$ 3353461 -1242033 308861 3943650 837649 1721218 1595529 2196018 1255976 3627576
5914C627576a19204B372755A087734j54500O59849N51072j31667q88149j08039
$$ 3627576 -119204 2372755 1087734 933234 1593083 2144155 2012488 1124339 1016300
5905A016300K244895j373290k81776l58938G5739J568248k70258K006283j678416
$$ 1016300 3261195 1887905 1606129 1247191 75739 1643987 1373729 3380012 1701596
5896A701596J229146A153476i17197B99148N28439J109699d53799C592787A514024
$$ 1701596 2930742 1153476 -917197 299148 827587 1937286 -453799 3592787 1514024
5886E1883K810855E72862B80168J617138R0627r93163k90595J124263J45719l78302
$$ 51883 2862738 572862 280168 1897306 1987933 994770 704175 1828438 1974157 1595855
5876A595855c5048B370102E2802J132234K85974J320603p76681L73348k43218
$$ 1595855 -35048 2370102 52802 1185036 1471010 2791613 2014932 2388280 2145062
5867B145062K19515J195022q32497A159610O81272q32179J714788B80091J519995
$$ 2145062 2364577 3559599 2727102 1159610 1840882 1008703 2723491 280091 1800086
5858A800086E07238J486347B1947K047481J393588E50576K683387M25876j180538
$$ 1800086 507238 1993585 21947 2069428 3463016 550576 3233963 3659839 2479301
5849B479301B16920K127070K66987j005851Q3174F8009N477194D68752K591805
$$ 2479301 216920 2343990 2610977 1605126 1688300 68009 5545203 468752 3060557
5840C060557o22443p2876j088981J766099F31601O9807J826368A13226L547341
$$ 3060557 2438114 2365238 1276257 3042356 631601 701408 2527776 113226 3660567
5831C660567A402724J501436r00631j66065n30901E62910P85511O5472j58785
$$ 3660567 1402724 2904160 2003529 1837464 1306563 562910 1348421 1413893 1255108
5822A255108J935888a108741A195577L83521k53527o4652k06690k55355Q36055
$$ 1255108 3190996 -1108741 1195577 1579098 1325571 1260919 1054229 798874 1634929
5813A634929K21678N26151o33373J736941j512154B54098M15620J770187A206552
$$ 1634929 1856607 2382758 1749385 3486326 1974172 254098 669718 2439905 1206552
5803A628558P39277D33997L283732A504699J931872I88930N54189A49827J611717
$$ 1628558 2367835 433997 3717729 1504699 3436571 988930 1543119 149827 1761544
5794A761544B6462K996086J099038j622283E09155b75814A631178k05363E29975
$$ 1761544 26462 3022548 4121586 2499303 509155 -275814 1631178 1425815 529975
5784B705828H19933J846865F66547J002668F00432J832098L9307C31862J506151
$$ 2705828 819933 2666798 666547 1669215 600432 2432530 2471837 331862 1838013
5775A838013J095733r47919h89894C15161J512736Q90219r02975M16092K592074
$$ 1838013 2933746 1985827 -889894 315161 1827897 2718116 1815141 2231233 4823307
5766D823307A027189L53644J691790A226471O12037D08838J702204r3091I82944
$$ 4823307 1027189 1380833 3072623 1226471 1838508 408838 2111042 2017951 982944
5756D666954A555373N6056J276276q68195F57074J90677J120907J377903A569001
$$ 4666954 1555373 1611429 2887705 2019510 657074 847751 1968658 3346561 1569001
5746b71770A330844K374199G63393K507764A604365M16383K45928A122435J635952
$$ -271770 1330844 3705043 763393 3271157 1604365 2020748 2266676 1122435 2758387
5737B758387L6849n12501J136971C41626L20245J482046E53390J355109M15147
$$ 2758387 2795236 2282735 3419706 341626 661871 2143917 553390 1908499 2323646
5728B323646J116930o2504l17125G97665L50216K056145j274799d88886I65863
$$ 2323646 3440576 3378072 3060947 797665 1147881 3204026 1929227 -488886 965863
5718A631122J083583A277719J080320q33185m48109J573358A004989L01939E49415
$$ 1631122 2714705 1277719 2358039 1524854 1076745 2650103 1004989 1306928 549415
5708B081893B51380K530555o39455G67133P94791E29972N03197D05036J301739
$$ 2081893 251380 2781935 2142480 767133 1561924 529972 1033169 405036 1706775
5699A706775J690910A359532N81558N16767j216059l0225k51947M41213P14422
$$ 1706775 3397685 1359532 1941090 2457857 1241798 1211573 959626 1400839 2115261
5690B115261E14728J061718p30817J524209J413075D27753O88375J147606n31004
$$ 2115261 514728 1576446 845629 2369838 3782913 427753 1116128 2263734 1732730
5681A732730K85538O41067j157676L4675J316173o35678e76558A024413B61455
$$ 1732730 2018268 2659335 1501659 1536334 2852507 2216829 -576558 1024413 261455
5671E55669K705919A180554J179877A158422M79799k40148o88733a122021B305251
$$ 555669 3261588 1180554 2360431 1158422 1638221 1398073 709340 -1122021 2305251
5661B093504m75578J822328o93723j194881R78940R65046A101501m08951J150986
$$ 2093504 1617926 3440254 2746531 1551650 2530590 3495636 1101501 692550 1843536
5652A843536c1576B288365h24435B850492j356509M09056M73578C50429K465798
$$ 1843536 -31576 2288365 -824435 2850492 1493983 1903039 2376617 350429 2816227
5643B816227n52688J157860C86875J380375p94291J927962o94622K175584A507463
$$ 2816227 2263539 3421399 386875 1767250 972959 2900921 2206299 4381883 1507463
5633A149159J310528A130619J480378D24253L993656B040410n03894R04972c10891
$$ 1149159 2459687 1130619 2610997 424253 4417909 2040410 1536516 2441488 -310891
5623A903645O71323a04198C551949j619907C95447K260872p74008q75653J825839
$$ 1903645 2574968 -104198 3551949 1932042 395447 2656319 1882311 1006658 2832497
5614B832497H76713K59279O23014C2423J38213K766364A042742K143408I75639
$$ 2832497 876713 1135992 1759006 32423 170636 2937000 1042742 3186150 975639
5604C142023m92733j25624k11829F92426K145324k56310J209139m61916j61283
$$ 3142023 2649290 2523666 2311837 692426 2837750 2581440 3790579 3328663 3167380
5595C167380K56793r66583R74191n27608j157599D20109J914518M19470p48066
$$ 3167380 3424173 2457590 3431781 2904173 1746574 420109 2334627 2754097 2006031
5586B006031j7148K684449j111091j650042J799438A059489Q81110n63869P39433
$$ 2006031 1988883 4673332 3562241 1912199 3711637 1059489 1940599 1376730 2116163
5577B116163m36413K38270P97183c81986A311503n71177A37535M8601J689033
$$ 2116163 1679750 1918020 2715203 -381986 1311503 740326 137535 186136 1875169
5568A875169O93139B62781L46376J83354K002302o02214p42343J609957F54845
$$ 1875169 2568308 262781 609157 792511 2794813 2192599 1450256 3060213 654845
5558A830303P66368K04042P93281j775159l46241P77644j46213p56416M64680
$$ 1830303 2596671 2800713 3593994 1818835 1472594 2250238 2104025 1347609 1812289
5549A812289n16540N73835m91236n0121J397318n64096l88361A72652O83583J35832
$$ 1812289 1295749 1869584 1378348 1328227 2725545 2161449 1773088 172652 856235 992067
5539I92067n5598L355442j544287A182843K008648k76522j399889J480952A354510
$$ 992067 936469 4291911 2747624 1182843 3191491 2914969 1515080 2996032 1354510
5529C264331m73647R6798A107846q7534Q36053L55221j54793Q08937o22174J139352
$$ 3264331 2790684 2887482 1107846 1020312 1856365 2211586 2056793 2865730 2243556 3382908
5519C382908A313456l84311A85435J701434k39832J867653J569163A080646J594105
$$ 3382908 1313456 929145 185435 1886869 1647037 3514690 5083853 1080646 2674751
5510B674751p51078n75182C67873J338299L76702K79642J928281j769429J113201
$$ 2674751 1923673 1348491 367873 1706172 2082874 2362516 4290797 2521368 3634569
5501C634569k21828o96692r26224J977316A372302N34668J094901R64985d32708
$$ 3634569 3412741 2716049 1789825 3767141 1372302 1906970 3001871 3966856 -432708
5491B208844N51583n86413F88212K184603A113529K012707r64891p17552M91250
$$ 2208844 2760427 2174014 688212 2872815 1113529 3126236 2161345 1443793 1935043
5482A935043P01574j100178p64909J252672q77816K321880j297464G07518J089095
$$ 1935043 2636617 1536439 771530 2024202 1146386 3468266 2170802 707518 1796613
5473A796613J123119J67333O37755o97334r29758n08342J019904l5092Q5438A210463
$$ 1796613 2919732 3087065 3724820 3027486 2097728 1589386 2609290 2574198 2659636 1210463
5462C415028R11400j804442m17875J44803J335930A234743L217600j484628j116983
$$ 3415028 4326428 2521986 2104111 2248914 3584844 1234743 4452343 2967715 1850732
5453A850732J53170J88363P12121J460611m89163n27392J572320B176090m81751
$$ 1850732 2003902 2192265 2904386 4364997 3875834 3348442 4920762 2176090 1694339
5444A694339J688839A521452Q82364J230223r14548O8987F30765N154274A145367
$$ 1694339 3383178 1521452 2403816 3634039 2719491 2788478 630765 5785039 1145367
5434C950592k57290l20991l88020J294557J072552o45336A909975j88032Q52404
$$ 3950592 3693302 3372311 2984291 4278848 5351400 4706064 1909975 1721943 2574347
5425B574347r77424K392567A664493K232892l09713q44705n57826n42593J360065
$$ 2574347 1596923 3989490 1664493 3897385 3587672 2742967 2185141 1642548 3002613
5416C002613q792J442534j176683k25502A489412n51758D56857K175981J501261
$$ 3002613 2993821 4436355 3259672 3034170 1489412 937654 456857 2632838 4134099
5407D134099L6178A642807L619835I97651R92639J23398n3588R71393q68386N33147
$$ 4134099 4170277 1642807 5262642 997651 1990290 2113688 2060100 3031493 2163107 2696254
5397B696254J66853R29258A727920Q64754r94177N54114j24357n05891J560863
$$ 2696254 2863107 3792365 1727920 2592674 1598497 2152611 2028254 1522363 3083226
5388C083226p65346k65507o98620J840135R78109F72856c85820g2203A706989
$$ 3083226 2317880 2052373 1353753 3193888 4171997 672856 -385820 -72203 1706989
5378B449135J980782k154431P29451k93912q40084R87315K43029E66451R39584
$$ 2449135 4429917 2275486 3004937 2711025 1870941 2858256 3101285 566451 1506035
5369A506035J504848r23286G08943K030930l03764L66428o11467E63607L41522
$$ 1506035 3010883 2087597 708943 2739873 2436109 2802537 2191070 563607 905129
5360I05129J718153p32487J767131j678111F92397P54751P55170N97678j1561
$$ 905129 2623282 1890795 3657926 1979815 692397 1447148 2202318 2799996 2788435
5351B788435m53238F47805K033338O88579l31210O28109j573228q9344o80568
$$ 2788435 2335197 647805 2681143 3369722 3038512 3666621 2093393 2004049 1323481
5342A323481n58940k32538L108471A39223L371393A091212L96985L228253j786732
$$ 1323481 764541 532003 3640474 139223 3510616 1091212 1488197 4716450 2929718
5333B929718O65677r50597p48767J479376k81292q52948J643780j600357q75360
$$ 2929718 3595395 2644798 1896031 3375407 3094115 2241167 3884947 2284590 1409230
5324A409230L32358J988984I81417R10851J52116q82117J803674k92047n91759
$$ 1409230 1741588 3730572 981417 1892268 2044384 1162267 2965941 2673894 2082135
5315B082135J004206o2621p66673l81458R91362j94872J518476F5689J925368
$$ 2082135 3086341 3023720 2257047 1875589 2866951 2672079 4190555 65689 1991057
5306A991057j56614J332845H12441J44767K002892l70615H71944K294967F42941
$$ 1991057 1834443 3167288 812441 957208 2960100 2589485 871944 3166911 642941
5296B787411J060125J10440o39273K59871A138757K457369k99169E48513J977473
$$ 2787411 3847536 3957976 3318703 3578574 1138757 3596126 3296957 548513 2525986
5287B525986M95966A422527N29232J61312J933589n00220A190097J99503J272293
$$ 2525986 3021952 1422527 1951759 2113071 4046660 3546440 1190097 1389600 2661893
5278B661893J614449N23179A188404K009728j164556J42783n47880J120815o8339
$$ 2661893 4276342 4799521 1188404 3198132 2033576 2176359 1628479 2749294 2680955
5269B680955I84651K04915d99238C243218m5014j454809B45267J962041R96056
$$ 2680955 984651 1189566 -499238 3243218 3198204 1743395 245267 2207308 3203364
5260C203364p72107k90881R31497J00346P19752H62542J656659n88980J523165
$$ 3203364 2431257 2140376 3071873 3172219 3891971 862542 2519201 1930221 3453386
5251C453386l78931A194542J543510n80910J336100q31970O6679j027196n13889
$$ 3453386 3074455 1194542 2738052 2157142 3493242 2661272 2727951 1700755 1186866
5242A186866K286647j42875r99628L04690j30505J038959L22655B62991K609849
$$ 1186866 3473513 3330638 2331010 2635700 2505195 3544154 3866809 262991 2872840
5233B872840A377954J921768M4775j120762K046865E47440L013011A8109J720174
$$ 2872840 1377954 3299722 3344497 2223735 4270600 547440 3560451 18109 1738283
5224A738283Q66466A21096Q83980Q62212m33602K875340n62266k05452d49286
$$ 1738283 2604749 121096 1005076 1867288 1433686 4309026 3746760 3541308 -449286
5214H62881J517269P33933K18360O339p69564J7992p75875J850965J700152j068426
$$ 862881 2380150 3114083 3332443 3338782 2569218 2587210 1811335 3662300 5362452 4294026
5204D294026j183094J234909j169200M25760j693419J724497j418123p26756K086872
$$ 4294026 3110932 4345841 3176641 3602401 1908982 3633479 2215356 1488600 3575472
5195C575472A195860J307011L64363n16978J54000P66361J003840K004612j586655
$$ 3575472 1195860 2502871 2867234 2350256 2504256 3270617 4274457 6279069 4692414
5186D692414K92156k024151j96544l12162K976135q46818Q41983m1764k377973
$$ 4692414 4984570 2960419 2763875 2451713 5427848 4581030 5423013 5381249 3003276
5177C003276J255010j323973M32397J829593j804643A033700K085684m04296J029869
$$ 3003276 4258286 2934313 3366710 5196303 3391660 1033700 3119384 2715088 3744957
5168C744957j461203K9896q61103J220445m48518m52921o40001J6824K073036
$$ 3744957 2283754 2313650 1452547 2672992 2224474 1771553 1131552 1148376 3221412
5159C221412A234844K454715K34454g57982C641663j757051q953R51062j412123
$$ 3221412 1234844 3689559 3924013 -757982 3641663 1884612 1875659 2826721 1414598
5150A414598n82340K908907J739220r89411j621600j191608N90720I83092J096352
$$ 1414598 832258 3741165 5480385 4490974 2869374 1677766 2268486 983092 2079444
5141B079444J258931m68063k07491K813946A595398K068661q2074j063741L84286
$$ 2079444 3338375 2870312 2662821 5476767 1595398 3664059 3581985 2518244 2902530
5132B902530n97579Q55052k64127K036844k235895K57171K124158B259180K755590
$$ 2902530 2304951 3160003 2895876 4932720 2696825 2953996 5078154 2259180 5014770
5123E014770B308277J510034A538204J912167N03854q18052A178545K166356O79387
$$ 5014770 2308277 3818311 1538204 3450371 3954225 3136173 1178545 3344901 4024288
5114D024288r88435j38276A249166J573839m1962q2408m44723M30762l52446J95450
$$ 4024288 3035853 2897577 1249166 2823005 2781043 2698635 2253912 2684674 2332228 2527678
5104B527678P36072A438218Q10206J716534l09912M81825m24237j153854q92597
$$ 2527678 3263750 1438218 2248424 3964958 3655046 4136871 3712634 2558780 1666183
5095A666183L101954k107458K49136M78020j20031n68845p8386j27494Q40677
$$ 1666183 4768137 2660679 2909815 3387835 3267804 2698959 2620573 2493079 3333756
5086C333756K433754k216861I01867J629903r87193K039779b60977C695184P61750
$$ 3333756 5767510 3550649 901867 2531770 1544577 3584356 -260977 3695184 4456934
5077D456934j254810A575299J345440N94648j168856R00650A459387J946500R53120
$$ 4456934 3202124 1575299 2920739 3515387 2346531 3247181 1459387 3405887 4359007
5068D359007A748028J080976q94212k37234J156733M92776A256528K675724O4621
$$ 4359007 1748028 2829004 1934792 1697558 2854291 3347067 1256528 3932252 3996873
5059C996873A500844L94761J453224J310399A751493K360453j460950o98554O94357
$$ 3996873 1500844 1895605 3348829 4659228 1751493 4111946 2650996 1952442 2646799
5050B646799J372378J181492j621061M19768p128j073682J17760O08800I54607
$$ 2646799 4019177 5200669 3579608 3999376 3992248 2918566 3036326 3645126 954607
5040B751630j351073L197944n69044I2192J070151M214153j536976r21458J296981
$$ 2751630 1400557 4598501 4029457 92192 1162343 5376496 3839520 2918062 4215043
5031D215043j150166M43709L30490A358419J919492K5411q2323Q66724o09026
$$ 4215043 3064877 3508586 3839076 1358419 3277911 3303322 3220999 4087723 3478697
5022C478697J168474j463544k24094J009441r28061l0967j011470K78399L54290
$$ 3478697 4647171 3183627 2959533 3968974 3040913 3009946 1998476 2276875 2631165
5013B631165P25136l59078P09235m06538m96234m40930Q26677o84685L088568
$$ 2631165 3356301 2997223 3706458 3299920 2803686 2362756 3189433 2504748 5593316
5004E593316k248631j312309J052733l16370K134857p18449p49380m03659K44152
$$ 5593316 3344685 2032376 3085109 2768739 4903596 4185147 3435767 3032108 3276260
4995C276260P96936j12291M13080p08235L81089A837629K39535J444311N47085
$$ 3276260 4073196 3960905 4373985 3665750 4046839 1837629 2077164 3521475 4068560
4986D068560j88894j030723K28722r75334O74316J012742A695241K721062p29496
$$ 4068560 3879666 2848943 3077665 2102331 2776647 3789389 1695241 4416303 3686807
4977C686807j413318L36042J235066k03342N47386J89667J098223A956448L545575
$$ 3686807 2273489 2609531 3844597 3641255 4188641 4378308 5476531 1956448 5502023
4968E502023k175202r00531J025918p3252r4517j100041K482165q13335J728273
$$ 5502023 3326821 2426290 3452208 3378956 3284439 2184398 4666563 3853228 5581501
4959E581501A902871J812310J002384j449767j08476l20866J72001K191149B105807
$$ 5581501 1902871 3715181 4717565 3267798 3159322 2838456 3010457 5201606 2105807
4949C851798R0794J726347k633029K618339j550796o54546K502318k163314J832546
$$ 3851798 3942592 5668939 3035910 5654249 4103453 3448907 5951225 3787911 5620457
4940E620457j106774N54285J41101l12799Q75644K658938j785262O74179n41253
$$ 5620457 4513683 5067968 5209069 4896270 5771914 8430852 6645590 7319769 6778516
4931F778516L609583r2372k883799N83305k7951m91832k047093Q9626m77355j196332
$$ 6778516 10388099 10295727 7411928 7995233 7967282 7475450 5428357 5517983 5040628 3844296
4921C844296l04251A352999L513550j305569j125416j148112J608585P67307j30032
$$ 3844296 3540045 1352999 4866549 3560980 2435564 1287452 2896037 3663344 3533312
4912C533312J115104j627430L97174p64886J3210K514462k244713J399019B062020
$$ 3533312 4648416 3020986 3418160 2653274 2666484 5180946 2936233 4335252 2062020
4902C363753J582831k328885J38531R26292K011187q48838o51375A771874J167722
$$ 3363753 4946584 2617699 2756230 3682522 5693709 4844871 4193496 1771874 2939596
4893B939596K314512B027200M72689R94118J630615j783547K55432q49802J154531
$$ 2939596 5254108 2027200 2499889 3494007 5124622 3341075 3596507 2746705 3901236
4884C901236j685222O3990j75787J475187j07248N9816j070292J513849j565856
$$ 3901236 2216014 2280004 2104217 3579404 3472156 3531972 2461680 3975529 2409673
4875B409673L41196K36393J497633j907739j28650K439164B334907Q99464r60007
$$ 2409673 2750869 2987262 4484895 2577156 2448506 4887670 2334907 3234371 2274364
4866B274364K965460j666469j641359l25124J593526J173309q46239O56787A210572
$$ 2274364 5239824 3573355 1931996 1606872 3200398 4373707 3527468 4184255 1210572
4856D478973o88807M8770j10007o9597j195049J701056J82621A335985K467395
$$ 4478973 3790166 3838936 3728929 3659332 2464283 4165339 4347960 1335985 3803380
4847C803380O59281K9043J59502l99328j440322J429318J96900N65583j312545
$$ 3803380 4462661 4491704 4651206 4251878 2811556 4240874 4437774 5003357 3690812
4838C690812j684647L675874j465601j575875K868315J62591k008654M05033J530500
$$ 3690812 2006165 5682039 4216438 2640563 5508878 5671469 3662815 4067848 5598348
4829E598348j45555r01237r09065q34705M25738K404945j661741J266670J97759
$$ 5598348 5452793 4551556 3642491 2807786 3233524 5638469 3976728 5243398 5441157
4820E441157j289423k15867m1581j14126Q82719j686530k29324J298693j599713
$$ 5441157 4151734 3935867 3894286 3780160 4662879 2976349 2747025 4045718 2446005
4811B446005J032909A530443J312334K90444l6750l15425J646232j236437p59090
$$ 2446005 3478914 1530443 2842777 3133221 3096471 2781046 4427278 3190841 2431751
4802B431751J75275K459466j819414j96310J353213K03534n53146j79202l13475
$$ 2431751 2607026 5066492 3247078 3050768 4403981 4607515 4054369 3875167 3561692
4793C561692j005379K794121B620297K931323j062972j735254L86158p80806R68799
$$ 3561692 2556313 5350434 2620297 5551620 4488648 2753394 3139552 2358746 3327545
4784C327545N07167n16499K217988n47860j953198J443148j265630j294271L327956
$$ 3327545 3834712 3318213 5536201 4988341 3035143 4478291 3212661 1918390 5246346
4775E246346k389196P48597j639508K142181p38947j12571K040777j494968K27390
$$ 5246346 2857150 3605747 1966239 4108420 3369473 3256902 5297679 3802711 4030101
4766D030101L39645Q81872k577055n7602J280958Q42597J606561j002320j648162
$$ 4030101 4369746 5251618 2674563 2616961 3897919 4740516 6347077 5344757 3696595
4757C696595J415213o46203Q19019k150615J66603J648759k01029J08479j837635
$$ 3696595 5111808 4465605 5284624 3134009 3300612 4949371 4748342 4856821 3019186
4748C019186J194949k79378O21951Q11945j160758R88584A657336K896869K50637
$$ 3019186 4214135 3934757 4556708 5368653 4207895 5196479 1657336 4554205 4804842
4739D804842A660938J338154J135244R94758j172624n61125O60130K33955n59424
$$ 4804842 1660938 2999092 4134336 5129094 3956470 3395345 4055475 4289430 3730006
4730C730006J400172k423262J522059o3180p70653J718996j849498Q04470J875573
$$ 3730006 5130178 2706916 4228975 4165795 3395142 5114138 3264640 4069110 5944683
4721E944683B737976m52064J754026K54274j009046J066875j062623J471382K311750
$$ 5944683 2737976 2285912 4039938 4294212 3285166 4352041 3289418 4760800 7072550
4712G072550j139251o26267k100464N9490O69419O02520j515862J398308j386361
$$ 7072550 5933299 5307032 3206568 3266058 3935477 4537997 3022135 4420443 3034082
4703C034082L73121j00199J10140J10321J74406J194341j468502K198133B535683
$$ 3034082 3407203 3307004 3417144 3527465 3701871 4896212 3427710 5625843 2535683
4693D522970j282561R24692K77129K50184J214332j506907j563112K097852k026154
$$ 4522970 3240409 4165101 4442230 4692414 5906746 4399839 2836727 4934579 2908425
4684B908425Q37518J089472J13701p93354K28882P87118N65033j099374k082212
$$ 2908425 3745943 4835415 4949116 4155762 4384644 5171762 5736795 4637421 2555209
4675B555209M515500L00521p90955j374051R44437J368463j519037k249693L277432
$$ 2555209 7070709 7371230 6580275 5206224 6150661 7519124 6000087 3750394 7027826
4666G027826m42720o78119J137363j689157K303609L39903j882467k590551K587303
$$ 7027826 6585106 5906987 7044350 5355193 7658802 7998705 6116238 3525687 6112990
4657F112990r35143l15584j110375J193356o51273O51588p5661j302086K218332
$$ 6112990 5177847 4862263 3751888 4945244 4293971 4945559 4869898 3567812 5786144
4648E786144N73792P19185j872754q64180q80500K318516o03651j992609K654713
$$ 5786144 6359936 7079121 5206367 4342187 3461687 5780203 5176552 3183943 5838656
4639E838656k721594L337973R6915p04745j478781J783215N28456L23131J355025
$$ 5838656 3117062 6455035 6551950 5847205 4368424 6151639 6680095 7003226 8358251
4630H358251k990487J004238K18421j338606j480053J344117N329K170810j374378
$$ 8358251 5367764 6372002 6590423 5251817 3771764 5115881 5121210 7292020 5917642
4621E917642j216809j353556Q00873M02440P08523j479759J238690N75098q62082
$$ 5917642 4700833 3347277 4148150 4550590 5259113 3779354 5018044 5593142 4731060
4612D731060j765852J113139P01105j398573J915723m41248m70904R9740k198868
$$ 4731060 2965208 4078347 4779452 3380879 5296602 4855354 4384450 4484190 2285322
4603B285322K444972m06825j23497J660461j751113r53553p41714K486797l31952
$$ 2285322 4730294 4323469 4199972 5860433 4109320 3155767 2414053 4900850 4568898
4594D568898j036953J256659k141250Q52537m99397j37194N13227Q61789R99047
$$ 4568898 3531945 4788604 2647354 3499891 3000494 2863300 3376527 4238316 5237363
4585E237363r2804k29273m69119J98205J941509C226563J093954r90226J079350
$$ 5237363 5144559 4915286 4446167 4644372 6585881 3226563 4320517 3330291 4409641
4576D409641K93990J40365k363971M476966o23741k327740K093410k295621J077885
$$ 4409641 4703631 4843996 2480025 6956991 6333250 4005510 6098920 3803299 4881184
4567D881184k32135j398040q6110R72252n53587K664993q83433q36871N31505
$$ 4881184 4649049 3251009 3164899 4137151 3583564 6248557 5365124 4528253 5059758
4558E059758j356924r9095L93219r04424Q44166r5372J393754o296r73273J378636
$$ 5059758 3702834 3603739 3996958 3092534 3936700 3841328 5235082 5228786 4255513 5634149
4548E634149j924608P52969K276762l347020K035852J788488l544693J342216
$$ 5634149 3709541 4462510 6739272 3392252 5428104 7216592 3671899 5014115
4540E014115j26505K24125n77607J335471J167268o13463j361592j149281L760262
$$ 5014115 4887610 5111735 4534128 5869599 7036867 6423404 5061812 3912531 7672793
4531G672793k63094l003173J486962R17304l94910j055486l89724n49141J296537
$$ 7672793 7409699 4406526 5893488 6810792 6415882 5360396 4970672 4421531 5718068
4522E718068K518441j297569n40028J372925C473876J712923n74251L99772K81210
$$ 5718068 8236509 6938940 6398912 7771837 3473876 5186799 4612548 5012320 5293530
4513E293530J050214K239654l889754j234884J907604J066934j954914J608108
$$ 5293530 6343744 8583398 4693644 3458760 5366364 6433298 4478384 6086492
4505F086492j894185q67530R83429o21149J597748p19280J99378N2852J659334
$$ 6086492 4192307 3324777 4308206 3687057 5284805 4565525 4764903 4817755 6477089
4496F477089j987163K61967k07818p98581J696671q7523O75579j449533J065322
$$ 6477089 4489926 4751893 4544075 3745494 5442165 5354642 6030221 4580688 5646010
4487E646010M34984q3001j022859P28580j099278J866982j165944r72633J771044
$$ 5646010 6080994 5997993 4975134 5703714 4604436 6471418 5305474 4332841 6103885
4478F103885k32954L58908M92026j285684Q49382q12184K132291j688133o71701
$$ 6103885 5870931 6229839 6721865 5436181 6285563 5473379 7605670 5917537 5245836
4469E245836O84589j011113J287715m68840J564206l67132j793281J22467P94756
$$ 5245836 5930425 4919312 6207027 5738187 7302393 6935261 5141980 5264447 6059203
4460F059203n45497n62800o59471J401141J75192k237455L381806j917868j732521
$$ 6059203 5513706 4950906 4291435 5692576 5867768 3630313 7012119 5094251 3361730
4451C361730n45023J805785J701432j501450n76893J151861J072834p03601l22597
$$ 3361730 2816707 4622492 6323924 4822474 4245581 5397442 6470276 5766675 5444078
4442E444078m0665p41143J434801M34246K59970j161230J788383q95392n71688
$$ 5444078 5403413 4662270 6097071 6531317 6791287 5630057 7418440 6523048 5951360
4433E951360N77410j459386P27421j505203P9062R50343J517847o20109j684383
$$ 5951360 6528770 5069384 5796805 4291602 4370664 5321007 6838854 6218745 4534362
4424D534362K369026M20261k208850k03633L137890k412797L238854l016056K893842
$$ 4534362 6903388 7323649 5114799 4911166 8049056 5636259 8875113 5859057 8752899
4415H752899k912136J220476L78038n95260O22700q66599o24830j082263K803589
$$ 8752899 5840763 7061239 7439277 6844017 7466717 6600118 5975288 4893025 7696614
4406G696614k655642l30418L82762B389462K322316J508185l87357m68768K305301
$$ 7696614 5040972 4710554 5093316 2389462 4711778 6219963 5832606 5363838 7669139
4397G669139l734123J181855j651601o92690L567255k915886J423024l58609J115446
$$ 7669139 3935016 5116871 3465270 2772580 6339835 3423949 4846973 4488364 5603810
4388E603810P99277k12305j6630Q93597j535170J037001j909004Q59715l68173
$$ 5603810 6403087 6190782 6174152 7067749 5532579 6569580 4660576 5520291 5152118
4379E152118o21362P44159J140145j192199J898758j480957r70821J408969J703572
$$ 5152118 4530756 5274915 6415060 5222861 7121619 5640662 4669841 6078810 7782382
4370G782382j308902j476271J621066n20280M81616m50958O3806o17210J27443
$$ 7782382 6473480 4997209 6618275 6097995 6579611 6128653 6192459 5575249 5702692
4361E702692j314579K63745j75644m26379J667741n2656O59446j286375J213206
$$ 5702692 4388113 4651858 4476214 4049835 5717576 5664920 6324366 5037991 6251197
4352F251197C036636K674491k158281l86752K086644J224912J88664P47609j138959
$$ 6251197 3036636 5711127 3552846 3166094 5252738 6477650 6666314 7413923 6274964
4343F274964J065803j495119M331409m664621j195529J792991k032531l81918
$$ 6274964 7340767 5845648 10177057 5512436 4316907 6109898 4077367 3695449
4335C695449J741168J674089k963995J175410J794074j362291l55924J578377
$$ 3695449 5436617 7110706 4146711 5322121 7116195 5753904 5397980 6976357
4327F976357N35742k314400j325213L554139j840355J704641j465201j771950
$$ 6976357 7512099 5197699 3872486 7426625 5586270 7290911 5825710 4053760
4319D053760N95220J386927R35182k97954N57182l486033L10052Q33237K267489
$$ 4053760 4648980 6035907 6971089 6673135 7230317 3744284 4054336 4887573 7155062
4310G155062j292125P7233l42499j68254P92314n94278q7550l60001J240564j484182
$$ 7155062 5862937 5940170 5597671 5429417 6221731 5627453 5539903 5179902 6420466 4936284
4300D936284K268920j526415j75006q11769j462177L700438j296624j019350K011744
$$ 4936284 7205204 5678789 5503783 4692014 3229837 6930275 5633651 4614301 6626045
4291F626045M62694k021191J47177J024912r28201p03591K377361o53918L44163
$$ 6626045 7088739 5067548 5214725 6239637 5311436 4607845 6985206 6331288 6675451
4282F675451J210469k448203P79406j969362J977193q22335J422504l062336N35923
$$ 6675451 7885920 5437717 6217123 4247761 6224954 5402619 6825123 3762787 4298710
4273D298710J592194L56438J516817j792494J438004k01110m86772o95952K07244
$$ 4298710 5890904 6247342 7764159 5971665 7409669 7208559 6721787 6025835 6233079
4264F233079N98448j052410O01326O54488j528728j037029J000284J920290R07098
$$ 6233079 6831527 5779117 6380443 7034931 5506203 4469174 5469458 7389748 8296846
4255H296846n86928k552338J04075Q21109M93762J658506k858127L296833o18922
$$ 8296846 7709918 5157580 5261655 6082764 6576526 8235032 5376905 8673738 8054816
4246H054816j521894J986116k484538J099956M99624r53106j014424J546732l35272
$$ 8054816 6532922 8519038 6034500 7134456 7634080 6680974 5666550 7213282 6878010
4237F878010k35162J044631M58510l27361n66759j485455J614143n08656N20231
$$ 6878010 6642848 7687479 8145989 7818628 7251869 5766414 7380557 6871901 7392132
4228G392132k18305Q70934m32702n70849J31610J818700k693352p78656K215072
$$ 7392132 7173827 8044761 7612059 7041210 7172820 8991520 6298168 5519512 7734584
4219G734584j551872J367419M48827j162403J832771k457007J415312j930009
$$ 7734584 6182712 7550131 7998958 6836555 8669326 6212319 7627631 5697622
4211E697622L21123O63291J690032j849514P84798J849872j817784L97953P56697
$$ 5697622 6018745 6682036 8372068 6522554 7307352 9157224 7339440 7737393 8494090
4202H494090j611246P72420r49462J057418j386886K502515j657170M32608K029490
$$ 8494090 6882844 7655264 6705802 7763220 6376334 8878849 7221679 7654287 9683777
4193I683777j654262J934247j654313N27736k74124J976479j053227l60691L96696
$$ 9683777 8029515 9963762 8309449 8837185 8563061 10539540 9486313 9125622 9522318
4184I522318J585452j882761m19772J137882K76535k388759J332130Q37469j216387
$$ 9522318 11107770 9225009 8805237 9943119 10219654 7830895 9163025 10000494 8784107
4175H784107K20591J05312l25109k034216k04820J26256N38743K049780j284955
$$ 8784107 9004698 9110010 8784901 6750685 6545865 6672121 7210864 9260644 7975689
4166G975689j639355L36548J605392P78239M43271k558388m30448L364455J042307
$$ 7975689 6336334 6672882 8278274 9056513 9499784 6941396 6510948 9875403 10917710
4157A0917710J90419j871454J435380r52538j487863l30551m51306K652811j546734
$$ 10917710 11108129 9236675 10672055 9719517 8231654 7901103 7449797 10102608 8555874
4148H555874R17433k153497K195157k723216K783409L51681k215737J594420j169737
$$ 8555874 9473307 7319810 9514967 6791751 9575160 9926841 7711104 9305524 8135787
4139H135787N62128j8840p91672k05334j010330L721408k835936q15839K589024
$$ 8135787 8697915 8679075 7887403 7682069 6671739 10393147 7557211 6741372 9330396
4130I330396r24192l92963J032603Q55152J37040r3912q20351K186640L45999
$$ 9330396 8406204 8013241 9045844 9900996 10038036 9944124 9123773 11310413 11656412
4121A1656412k360934j126726j204763J194136O29059j88554m88316K139904j232718
$$ 11656412 9295478 8168752 6963989 8158125 8787184 8598630 8110314 10250218 9017500
4112I017500o04063J143611k51149m44270R02280l440450J442864Q01654J413228
$$ 9017500 8413437 9557048 9305899 8861629 9763909 6323459 7766323 8567977 9981205
4103I981205J63819m50355K03856j471599J007633J0297l545707J3065841H106954
$$ 9981205 10145024 9694669 9898525 8426926 9434559 9444856 5899149 18964990 8106954
4093G844415j388057j443754J326921J381546j432108r77259J728364k291771
$$ 7844415 6456358 5012604 6339525 7721071 6288963 5311704 7040068 4748297
4085D748297M290642o15679j430792l97659O45818N81423j89093N06399k699754
$$ 4748297 9038939 8423260 6992468 6594809 7240627 7822050 7632957 8139356 5439602
4076E439602J830001J033752l242188J282094M61283L5919q38655M01400K181797
$$ 5439602 7269603 8303355 5061167 6343261 6804544 6840463 6001808 6403208 8585005
4067H585005o79026o06597K18892k55074Q60058l21322r09432j895553L631869
$$ 8585005 7905979 7299382 7518274 7263200 8123258 7801936 6892504 4996951 8628820
4058H628820l043160K291086k156157J220994J711962p47679k89733o57j016075
$$ 8628820 5585660 7876746 5720589 6941583 8653545 7905866 7616133 7615476 6599401
4049F599401O45405n76003k87909K112619j571443M76664L6322p27166Q17261
$$ 6599401 7244806 6668803 6380894 8493513 6922070 7398734 7435056 6707890 7525151
4040G525151J0185J134249M97869l31381l284598M314260n45709j283228K053827
$$ 7525151 7535336 8669585 9167454 8836073 5551475 9865735 9320026 8036798 10090625
4031A0090625k602462K313215k204655J879183J283098l120808J037414j58354
$$ 10090625 7488163 9801378 7596723 9475906 10759004 7638196 8675610 8517256
4023H517256j43255M91010K66665J390359m52791n20853J17840J285806j314245
$$ 8517256 8374001 8865011 9131676 10522035 10069244 9548391 9666231 10952037 9637792
4014I637792Q77655Q20191K309429l01633O6235k552982K189107k406308Q81309
$$ 9637792 10515447 11335638 13645067 13343434 13409669 10856687 13045794 10639486 11520795
4005A1520795j22597O95592O5074J332800m48609l19743l01244p63466K608255
$$ 11520795 11398198 12093790 12158864 13491664 13043055 12723312 12422068 11658602 14266857
3996A4266857l519616K940098o47933P15957p35668k279991J973102J150371R16381
$$ 14266857 10747241 13687339 13039406 13755363 13019695 10739704 12712806 13863177 14779558
3987A4779558j242834J633686l65385M05400j785470N11557j364140J764281k179694
$$ 14779558 13536724 15170410 14805025 15210425 13424955 13936512 12572372 14336653 12156959
3978A2156959O83046j054131Q82748J058408j113793K794219l54317r89004J346905
$$ 12156959 12840005 11785874 12668622 13727030 12613237 15407456 15053139 14064135 15411040
3969A5411040j474052R54086p71518J591603j031805j657894J094952K229863
$$ 15411040 13936988 14891074 14119556 15711159 14679354 13021460 14116412 16346275
3961A6346275l12898j353584j516155L38407P64566j596984K181302l225165O69016
$$ 16346275 16033377 14679793 13163638 13502045 14266611 12669627 14850929 11625764 12294780
3952A2294780R84746L10074K271788m20866j215522j180168L8910l28392R28215
$$ 12294780 13279526 13589600 15861388 15440522 14225000 13044832 13083742 12755350 13683565
3943A3683565q8171K17601k855194J80431r6453J311764k49065n45848j64841
$$ 13683565 13595394 13812995 10957801 11138232 11041779 12353543 12104478 11558630 11393789
3934A1393789m71148q981K146735n06408j308298K53381L03361K56066n1771J049801
$$ 11393789 10922641 10913660 13060395 12553987 11245689 11499070 11802431 12058497 12006726 13056527
3924A3056527k118398R90550J854295j501342N13023N28404k010791L93867K318130
$$ 13056527 10938129 11928679 13782974 12281632 12794655 13323059 11312268 11706135 14024265
3915A4024265J955542k080724R87653j688316m64654K089435r18039J34895n9111
$$ 14024265 15979807 13899083 14886736 13198420 12733766 14823201 13905162 14040057 13980946
3906A3980946N00818j416217J619094p87192J479061q52983j486684r66608K003638
$$ 13980946 14481764 13065547 14684641 13897449 15376510 14523527 13036843 12070235 14073873
3897A4073873l865982J483864n38028j019811l81333K559355l600217P73048R35988
$$ 14073873 10207891 11691755 11153727 10133916 9752583 12311938 8711721 9484769 10420757
3888A0420757j495181J924893m71956J571834J0362o22653j404221J754221m39209
$$ 10420757 8925576 10850469 10378513 11950347 11960709 11338056 9933835 11688056 11248847
3879A1248847M34958L476970m093604K603151j314017J661681l21963q07110N33615
$$ 11248847 11683805 15160775 11067171 13670322 12356305 14017986 13696023 12888913 13422528
3870A3422528o79108L090567l249503J553354J420722j165321j434652J445115
$$ 13422528 12743420 15833987 12584484 14137838 15558560 14393239 12958587 14403702
3862A4403702j629762J908225J18620J414000j282597J003524k018840P70133
$$ 14403702 12773940 14682165 14800785 16214785 14932188 15935712 13916872 14687005
3854A4687005P04419k836746L181056j898969l79249k237052K1096J370140k541119
$$ 14687005 15391424 12554678 15735734 13836765 13457516 11220464 11241560 12611700 10070581
3845A0070581o94061O11949L9679J052973j714578N39900J46231N28955L19510
$$ 10070581 9376520 9988469 10028148 11081121 9366543 9906443 10052674 10581629 10901139
3836A0901139j910857K119749j883185q2222l27155J760395L710486m719088J500147
$$ 10901139 8990282 11110031 9226846 9144624 8817469 10577864 14288350 9569262 11069409
3827A1069409L52850J80980k022718J072386p91486K335780l06369n57973j563986
$$ 11069409 11422259 11603239 9580521 10652907 9861421 12197201 11890832 11332859 9768873
3818I768873N06883l54180M11793J100585N96546j654793R02958p85486K091577
$$ 9768873 10275756 9921576 10333369 11433954 12030500 10375707 11278665 10493179 12584756
3809A2584756n14464l318871J423507Q73478p11557k74401J94697J481701j273931
$$ 12584756 12070292 8751421 10174928 11048406 10336849 10062448 10257145 11738846 10464915
3800A0464915j27437M91982j188691Q74749M30709O29795M07782k610855P25268
$$ 10464915 10337478 10829460 9640769 10515518 10946227 11576022 11983804 9372949 10098217
3791A0098217J007799k45591K368773j294438r09996j422108L980031k237565
$$ 10098217 11106016 10860425 13229198 11934760 11024764 9602656 13582687 11345122
3783A1345122L82384J043343j26004n48747J790997j271440k98163m31490K235938
$$ 11345122 11727506 12770849 12644845 12096098 13887095 12615655 12317492 11886002 14121940
3774A4121940l784272L519173j622139L133555k446844k186119O65197n66025
$$ 14121940 10337668 13856841 12234702 15368257 12921413 10735294 11400491 10834466
3766A0834466K578579l07311o16449L69270J230329K37479k450682J837697L98233
$$ 10834466 13413045 13105734 12489285 12858555 14088884 14326363 11875681 13713378 14111611
3757A4111611j918429Q37544M56264j505398K394020n46777N3599P13981L21367
$$ 14111611 12193182 13030726 13486990 11981592 14375612 13828835 13882434 14596415 14917782
3748A4917782j529115L021946Q09395j943673J577807L7178j102598J126836l64761
$$ 14917782 13388667 16410613 17220008 15276335 16854142 16891320 15788722 16915558 16550797
3739A6550797K390319l547417M993507q77920o28084J961166P94644j016314L501400
$$ 16550797 18941116 15393699 20387206 19509286 18881202 20842368 21637012 20620698 24122098
3730B4122098k272134J524462J649181j27188K030424J650825o64268M851154
$$ 24122098 21849964 23374426 25023607 24896419 26926843 28577668 27913400 32764554
3722C2764554k687478M251770M41380J638403r03188R78701J410079J430772P53564
$$ 32764554 30077076 34328846 34770226 36408629 35505441 36484142 37894221 39324993 40078557
3713D0078557N711420J745415j659107J066643k099836m323467l426896j700140
$$ 40078557 45789977 47535392 45876285 46942928 44843092 40519625 37092729 35392589
3705C5392589m97872p80531k365184l653389O20536k05971N60800J154727j487503
$$ 35392589 34894717 34114186 31749002 28095613 28716149 28510178 29070978 30225705 28738202
3696B8738202J112738j968850P52617K852480j454451O568270J147959j432904
$$ 28738202 29850940 27882090 28634707 31487187 30032736 36601006 37748965 36316061
3688C6316061k915139l277526j141227j216317l108074r60228J449034k285794
$$ 36316061 33400922 30123396 28982169 27765852 24657778 23697550 25146584 22860790
3680B2860790l65354J508500o60292R22570L3731K252589n36474k402556L833223
$$ 22860790 22495436 24003936 23343644 24266214 24299945 26552534 26016060 23613504 27446727
3671B7446727K124699l1018j354563j378007k508608p46616j080306j110092O89646
$$ 27446727 29571426 29540408 28185845 26807838 24299230 23552614 22472308 21362216 22051862
3662B2051862k774728N35446J156190O3376J213610j693728q86638j420821r92363
$$ 22051862 19277134 19812580 20968770 21032146 22245756 20552028 19665390 18244569 17252206
3653A7252206j97852k268353J271164j481843K469486j317302n69649J974079
$$ 17252206 17054354 14786001 16057165 14575322 17044808 15727506 15157857 17131936
3645A7131936j130725J013265j674717j360246K898190k8649q77972K55310K18538
$$ 17131936 16001211 17014476 15339759 13979513 16877703 16849054 15971082 16226392 16444930
3636A6444930N36264j576270J598118j740105q018r42196K863348J768612k101383
$$ 16444930 16981194 15404924 17003042 15262937 15254919 14312723 17176071 18944683 16843300
3627A6843300k221797K139285M93200P6452j751340J825484j319672J120526n31637
$$ 16843300 14621503 16760788 17253988 17330440 15579100 17404584 16084912 17205438 16673801
3618A6673801j026575m98002J088030J174593Q4101q26289K098223k416557J963025
$$ 16673801 15647226 15149224 16237254 17411847 17495948 16669659 18767882 16351325 18314350
3609A8314350l200433J553242L994439n357907K173151k843039K884215j37392
$$ 18314350 15113917 16667159 20661598 15303691 17476842 14633803 17518018 17380626
3601A7380626P37898K759438k12628l370252J002598K580712J444256l40922o8666
$$ 17380626 18118524 20877962 20665334 17295082 18297680 20878392 22322648 21981726 21913060
3592B1913060R31300r85430K872094k40282R59034J260600K72028r0908L840082
$$ 21913060 22844360 21858930 24731024 24490742 25449776 26710376 26982404 26891496 30731578
3583C0731578J444052j710340L693787O7185R79523K868908M64968L521836M46580
$$ 30731578 32175630 30465290 34159077 34226262 35205785 38074693 38539661 42061497 42508077
3574D2508077O017991N87944J962909k48588k926861p985851p405388l660712
$$ 42508077 48526068 49114012 51076921 50828333 47901472 39915621 32510233 28849521
3566B8849521l470997k277188n34740l300560m75205J010885j403914J501920
$$ 28849521 25378524 23101336 22566596 19266036 18790831 19801716 18397802 19899722
3558A9899722L32946j952406k438516L371596Q90666k361232O78221j84421j045447
$$ 19899722 20232668 18280262 15841746 19213342 20104008 17742776 18420997 18236576 17191129
3549A7191129J542843l37218K042560K62952k40572j094806J598294n35328q56647
$$ 17191129 18733972 18396754 20439314 20702266 20461694 19366888 20965182 20429854 19573207
3540A9573207K408459k770770K264304j077240n57510Q70126j683494J253048
$$ 19573207 21981666 19210896 21475200 20397960 19840450 20710576 19027082 20280130
3532B0280130r95144K336976m92218j073432N64787O27565P0820L106662n75854
$$ 20280130 19284986 21621962 21129744 20056312 20621099 21248664 21319484 24426146 23850292
3523B3850292j254694Q40224o74066J802614j60069J55264J890931M43241j410973
$$ 23850292 22595598 23435822 22761756 24564370 24404301 24559565 26450496 26893737 25482764
3514B5482764M74748j061051K417259K41519Q44796j758301K335401J229817J75793
$$ 25482764 25957512 24896461 27313720 27555239 28400035 26641734 28977135 30206952 30382745
3505C0382745q38077O63357M11429J343371j52452q17698Q04984K523579j883581
$$ 30382745 29544668 30208025 30619454 31962825 31810373 30992675 31797659 34321238 32437657
3496C2437657j42168o11717J701133P71960q82860K294760J450220q3840J461833
$$ 32437657 32295489 31683772 33384905 34156865 33274005 35568765 37018985 36935145 38396978
3487C8396978j390552J870892J951391r00172L38636K145316L048327j616059
$$ 38396978 37006426 38877318 40828709 39928537 40267173 42412489 45460816 43844757
3479D3844757J654847J114049K535907J305604J061765K544063J795653J997175
$$ 43844757 45499604 46613653 49149560 50455164 51516929 54060992 55856645 57853820
3471E7853820P48176L126945M94823J805759J473832L596849N063271p33304P152489
$$ 57853820 58601996 61728941 62223764 64029523 65503355 69100204 74163475 73430171 80582660
3462H0582660L892559J961616N605208L551679Q311960P662048P349872O720111
$$ 80582660 84475219 86436835 92042043 95593722 103905682 111567730 118917602 125637713
3454A25637713R911304J0991279J1525680J0541887J4550416J5252559J4806862
$$ 125637713 135549017 146540296 158065976 168607863 183158279 198410838 213217700
3447B13217700J7781376K3304591K3434719K9099582L5665055M3147038N1440381
$$ 213217700 230999076 254303667 277738386 306837968 342503023 385650061 437090442
3440D37090442O7704413Q9669884J16337019J60638264K05327414K22238837J86455544
$$ 437090442 504794855 594464739 710801758 871440022 1076767436 1299006273 1485461817
3433A485461817Q7989756l2038399j56237433k51719924k82836338k41094069
$$ 1485461817 1573451573 1541413174 1385175741 1133455817 850619479 609525410
3427F09525410j75557432j19957434q2668732n4394333l5520879k8941982j9094032
$$ 609525410 433967978 314010544 231341812 176947479 141426600 112484618 93390586
3420I3390586j4828471j0412175r859924n058848r018151l927024l290963m797377
$$ 93390586 78562115 68149940 58290016 53231168 44213017 40285993 36995030 32197653
3412C2197653l183411k299218l084993j571521n84284m33832k686129j121475
$$ 32197653 29014242 26715024 23630031 22058510 21474226 21040394 18354265 17232790
3404A7232790L9966k243615k063598q28378j048805J606315j597999O21992l316163
$$ 17232790 17272756 15029141 12965543 12137165 11088360 12694675 11096676 11718668 8402505
3395H402505J11810k21967j763440K626029k749997L60083J060158l93376j1943
$$ 8402505 8514315 8292348 6528908 9154937 6404940 6765023 7825181 7431805 7419862
3386G419862N04225p80339r44468k80707L47958K498328l607193r94836L80334
$$ 7419862 7924087 7143748 6199280 5918573 6266531 8764859 5157666 4162830 4543164
3377D543164j182885N5805J657712n54108A940588j63174P93421o10405J016653
$$ 4543164 3360279 3416084 5073796 4519688 1940588 1777414 2570835 1960430 2977083
3368B977083j50280j368251K139611j678572r20555d91985A602764N71897L47897
$$ 2977083 2826803 1458552 3598163 1919591 999036 -491985 1602764 2174661 2522558
3359B522558m69989a43316B905093F77257N47337C11411J990410N00090q46485
$$ 2522558 2052569 -143316 2905093 677257 1224594 311411 2301821 2801911 1955426
3350A955426l28767J510531o1783A065200O66399L70575J001250l79417K049019
$$ 1955426 1626659 3137190 3075407 1065200 1731599 2102174 3103424 2724007 4773026
3341D773026l83599n09312p47134J305388J300619A864357K803906n34506L266680
$$ 4773026 4389427 3880115 3132981 4438369 5738988 1864357 4668263 4133757 7400437
3332G400437l034778L870325q75666j594159P84337p48182J054979j538075K813233
$$ 7400437 4365659 8235984 7360318 5766159 6550496 5802314 6857293 5319218 8132451
3323H132451j257140J608308L74899n54344j60243J543124m76615J131826m40984
$$ 8132451 6875311 8483619 8858518 8304174 8143931 9687055 9210440 10342266 9901282
3314I901282J598855J7344L31458R79886J184150p80144J057427K454113j928370
$$ 9901282 11500137 11517481 11848939 12828825 14012975 13232831 14290258 16744371 14816001
3305A4816001K371805j030867J550219P13004K049471J42069p16024L85508J876184
$$ 14816001 17187806 16156939 17707158 18420162 20469633 20611702 19895678 20281186 22157370
3296B2157370J803648J820726k055656L090648J705636L81322K79518k635782
$$ 22157370 23961018 25781744 23726088 26816736 28522372 28903694 29183212 26547430
3288B6547430k718728l393632l811041L80249k943167n198732L30876L738698
$$ 26547430 23828702 20435070 16624029 17004278 14061111 8862379 9193255 12931953
3280A2931953l249510l933837J082224L08857L188783l435714K639671r12164
$$ 12931953 9682443 5748606 6830830 7139687 10328470 6892756 9532427 8620263
3272H620263J967952j813182p7598O06860k061745Q89568j758423J272062j55061
$$ 8620263 10588215 8775033 8697435 9304295 7242550 8132118 6373695 7645757 7490696
3263G490696k868090L934425k2408k020170L238215j753081J176453o77023M6920
$$ 7490696 4622606 8557031 8534623 6514453 9752668 7999587 9176040 8499017 8545937
3254H545937j124169m56020J606647J178923J201036k173955L249425j742185
$$ 8545937 7421768 6965748 8572395 9751318 10952354 8778399 12027824 10285639
3246A0285639J775569N43888o82713J524317L81817J640890K23453n11723l76731
$$ 10285639 12061208 12605096 11922383 13446700 13828517 15469407 15692860 15181137 14804406
3237A4804406P06776p05608Q34494m041377K152681j002044r10558p64041K606444
$$ 14804406 15511182 14805574 15640068 11598691 13751372 12749328 11838770 11074729 13681173
3228A3681173k8266L33706q24744Q68328q29529O01746J297984K18907j332533
$$ 13681173 13652907 13986613 13161869 14030197 13200668 13802414 15100398 15319305 13986772
3219A3986772j3988K718650m55960K89664j050918K700390n07030m10105K688849
$$ 13986772 13972784 16691434 16235474 16525138 15474220 18174610 17667580 17257475 19946324
3210A9946324p57508L55870k277454J378856L029520j555766J405432J866160
$$ 19946324 19188816 19544686 17267232 18646088 21675608 20119842 21525274 23391434
3202B3391434m88730L6632k494132J491987j61907j339764K61220J915178j16842
$$ 23391434 22902704 22939336 20445204 21937191 21775284 20435520 20696740 22611918 22495076
3193B2495076j465084m42552K441648j950268j148360P50728q50376Q69970M08414
$$ 22495076 21029992 20587440 23029088 21078820 19930460 20681188 19830812 20700782 21109196
3184B1109196M33950j475694J766573P44701m95924K434088l87408p24471J244160
$$ 21109196 21543146 20067452 21834025 22578726 22082802 24516890 24129482 23405011 24649171
3175B4649171k5677J504566J640106o26474J932368m26055K604667k642652K398865
$$ 24649171 24623494 26128060 27768166 27141692 29074060 28648005 31252672 28610020 31008885
3166C1008885O20588m93064K015026k656596J298741K626881N13013j059468J535083
$$ 31008885 31629473 31136409 33151435 30494839 31793580 34420461 34933474 33874006 35409089
3157C5409089M960j289220j635J862419K211432L857896j322476j085584L32324
$$ 35409089 35414049 34124829 34123194 35985613 38197045 42054941 40732465 39646881 39979205
3148C9979205m706772k845276o692307j617596o053672k548383k425221l79496
$$ 39979205 35272433 32427157 25734850 24117254 18063582 15515199 13089978 12710482
3140A2710482j92694k407260l96287k508289M00158K735007j132665o22116n06566
$$ 12710482 12517788 10110528 9714241 7205952 7606110 10341117 9208452 8586336 8079770
3131H079770j258379O18172j160580Q25374l20496J98700O52082j88993J635896
$$ 8079770 6821391 7439563 6278983 7104357 6783861 6982561 7634643 7445650 9081546
3122I081546n53913j146996J286611j030225J237349j872477J831219j490998
$$ 9081546 8527633 7380637 8667248 7637023 8874372 7001895 8833114 7342116
3114G342116P64970J640731k363897L329516m117708J116498j195779L01929j021738
$$ 7342116 8107086 9747817 7383920 10713436 6595728 7712226 6516447 6818376 5796638
3105E796638l57333j084210J561306J082106q35516J697284J125882k843892J808119
$$ 5796638 5439305 4355095 5916401 6998507 6162991 7860275 8986157 6142265 7950384
3096G950384j60156N12998k118780J350275r54487K023874k059796K056290p17488
$$ 7950384 7790228 8303226 6184446 7534721 6580234 8604108 6544312 8600602 7883114
3087G883114J02616K17922k01259k735875L058307L25930l647950J509324J657938
$$ 7883114 7985730 8203652 8002393 5266518 8324825 8650755 5002805 6512129 8170067
3078H170067j170067R29290j544264K490159r58676r91688K399212L57195m00888
$$ 8170067 7000000 7929290 6385026 8875185 7916509 6924821 9324033 9681228 9280340
3069I280340k751117M5740J713557j169991m61240p19959J401359J078350j606272
$$ 9280340 6529223 6574963 8288520 7118529 6657289 5937330 7338689 8417039 6810767
3060F810767M25271K70609J588582j908082L32295j893919K60378K48070J026689
$$ 6810767 7236038 7506647 9095229 7187147 7519442 5625523 5885901 6133971 7160660
3051G160660n31606M03424L033194j341676k551558K460803K48459k021704J205076
$$ 7160660 6629054 7032478 10065672 8723996 6172438 8633241 8881700 6859996 8065072
3042H065072j901921K812161J248135m63499o25069j91696K137707k597141k42485
$$ 8065072 6163151 8975312 10223447 9759948 9134879 8943183 11080890 8483749 8241264
3033H241264L553170k358332Q82406J390851j315327l35297l60262M101345K09741
$$ 8241264 11794434 9436102 10318508 11709359 10394032 10058735 9698473 13799818 14009559
3024A4009559r41422N409j43256J465694N19324L163610k29888K997224N24900
$$ 14009559 13068137 13073546 12930290 14395984 14915308 18078918 17849030 20846254 21371154
3015B1371154N497642P892189N413336k089388k020868m44212o045313q613596
$$ 21371154 26868796 34760985 40174321 38084933 36064065 35619853 29574540 20960944
3007B0960944p366993j178337r31144k190005R97345k822134j287263J617378
$$ 20960944 13593951 12415614 11484470 9294465 10291810 7469676 6182413 7799791
2999G799791J22339J99164q92934l62572P31944J773122K90171k38675j636575
$$ 7799791 7922130 8121294 7228360 6865788 7597732 9370854 9661025 9422350 7785775
2990G785775K665143q42902l269176J142854K308975j647364J230115q34476l4920
$$ 7785775 10450918 9608016 6338840 7481694 9790669 8143305 9373420 8538944 8504024
2981H504024K124473N80554p11700K037678j168435K069273R184l14459J752328
$$ 8504024 10628497 11209051 10497351 12535029 11366594 13435867 13445051 13130592 14882920
2972A4882920j273713m7880J387636N3274k178031l3406j77530O2493J079301
$$ 14882920 13609207 13561327 14948963 15002237 12824206 12790800 12613270 12675763 13755064
2963A3755064k360210J741262p24081N02552m6499k992212R38509O82695Q24784
$$ 13755064 11394854 13136116 12412035 12914587 12868088 9875876 10814385 11497080 12321864
2954A2321864l523550K692455j569760O73111j436342P95873j259572p35313J545230
$$ 12321864 8798314 11490769 9921009 10594120 9157778 9953651 8694079 7958766 9503996
2945I503996q77837J962627j172818L67131J609773K29125j247867q80144J571567
$$ 9503996 8626159 10588786 9415968 9783099 11392872 11621997 10374130 9493986 11065553
2936A1065553j146870l52129K348762o60949q43765m22932K336684l11627j122132
$$ 11065553 9918683 9566554 11915316 11254367 10410602 9987670 12324354 12012727 10890595
2927A0890595q47995J395712p9013L53224K908l2065m81554n80221J928206N98723
$$ 10890595 10042600 11438312 11359299 11712523 11715431 11683366 11201812 10621591 12549797 13148520
2917A3148520k334762M58940P91746j038486L14485J763147R81714j440969J034549
$$ 13148520 10813758 11272698 12064444 11025958 11340443 13103590 14085304 12644335 13678884
2908A3678884O72001K8800q70740K04060O04353k047773K208160k278654J425226
$$ 13678884 14350885 14379685 13508945 13713005 14317358 12269585 14477745 12199091 13624317
2899A3624317j996400j42313q96166J934357j966461R41334k057963O15345j319037
$$ 13624317 11627917 11485604 10589438 12523795 10557334 11498668 9440705 10056050 8737013
2890H737013K706763J54749r40368K68116L80569N69775j950384J181963j887115
$$ 8737013 11443776 11598525 10658157 10926273 11306842 11876617 9926233 11108196 9221081
2881I221081J051938j070514j213430K094121m50066j615413K69970p27750R35576
$$ 9221081 10273019 9202505 7989075 10083196 9633130 8017717 8287687 7559937 8495513
2872H495513q50394J464200k130950j56637R13997j192604J056523l45354q10377
$$ 8495513 7645119 9109319 6978369 6821732 7735729 6543125 7599648 7254294 6443917
2863F443917o37475K278649q17054J376231j468466j071032K78517R11302o32058
$$ 6443917 5806442 8085091 7268037 8644268 7175802 6104770 6383287 7294589 6662531
2854F662531j877606l12213K451974k185696P06993J202705p89319J529748J938165
$$ 6662531 4784925 4472712 6924686 4738990 5445983 6648688 5859369 7389117 9327282
2845I327282j740909J061969q97326n19857n02359O90628M47641o02638j057688
$$ 9327282 7586373 8648342 7751016 7231159 6728800 7419428 7867069 7264431 6206743
2836F206743J160533Q49025m01758k67755j741777K533909k345260J999988j844456
$$ 6206743 7367276 8216301 7814543 7546788 5805011 8338920 5993660 7993648 6149192
2827F149192K431628j896376l22186O92578J726822k335337J74032J402734m82790
$$ 6149192 8580820 6684444 6362258 7054836 8781658 6446321 6620353 8023087 7540297
2818G540297m502J514890n39104j829966M43525j02199j091196R20459o22212
$$ 7540297 7535795 9050685 8511581 6681615 7125140 7022941 5931745 6852204 6229992
2809F229992J138074O98598j818127R36632l19875J588073p56412L746481j975996
$$ 6229992 7368066 8066664 6248537 7185169 6865294 8453367 7696955 11443436 9467440
2800I467440J038489J788682K494427M736214P179326J4773275Q182820n265113
$$ 9467440 10505929 12294611 14789038 19525252 26704578 41477853 49660673 44395560
2792D4395560j7844048j2322458m968561K4491l914256J769900J062250n10931
$$ 44395560 26551512 14229054 9260493 9284984 5370728 7140628 8202878 7691947
2784G691947k215295J689372j20471O9099n32783j068753j57038Q87562N43226
$$ 7691947 5476652 7166024 7045553 7114652 6581869 5513116 5356078 6243640 6786866
2775F786866k412173J764173j036333l72120J184086O55285j118895p43574L3575
$$ 6786866 4374693 6138866 5102533 4730413 5914499 6569784 5450889 4707315 4740890
2766D740890K795098k649305R19694j20827J229298j199345r31569J085413m37935
$$ 4740890 7535988 4886683 5806377 5685550 6914848 5715503 4783934 5869347 5431412
2757E431412l44074K640417o38219K126220l968971R25587J487637j619671n22890
$$ 5431412 5087338 7727755 7089536 9215756 5246785 6172372 7660009 6040338 5517448
2748E517448J405924j788284K578047j741336J412372N09192r12223k14493k5371
$$ 5517448 6923372 5135088 7713135 5971799 7384171 7893363 6981140 6766647 6741276
2739F741276J022791m06331j724001J808704R05953j066403j106431J559299n47621
$$ 6741276 7764067 7357736 5633735 7442439 8348392 7281989 6175558 7734857 7187236
2730G187236N24837N26443k66364j89001J71383j260035K104780k01888M4051
$$ 7187236 7712073 8238516 7972152 7783151 7954534 6694499 8799279 8597391 8641442
2721H641442k060155K732613o11024K56550q5225K696202o13386J680061J773429
$$ 8641442 6581287 9313900 8702876 8959426 8874201 11570403 10957017 12637078 14410507
2712A4410507n94716J947417J116879J211257L759850P543930J4434161J6011459
$$ 14410507 13815791 15763208 16880087 18091344 21851194 29395124 43829285 59840744
2704E9840744J3445043q664271j5108171j4844203j3518076J94220O53998L121160
$$ 59840744 73285787 64621516 49513345 34669142 21151066 21345286 21999284 25120444
2696B5120444Q246701J6957056R567128k990953j3074983j4784565m465720K441369
$$ 25120444 33367145 50324201 59891329 56900376 43825393 29040828 24575108 27016477
2688B7016477M730252J0045016K4412154J2570377m233833k3796935k1385445
$$ 27016477 31746729 41791745 66203899 78774276 74540443 50743508 29358063
2681B9358063n438752l141719J922498P463875J6885463O968241m436757j5717155
$$ 29358063 23919311 20777592 22700090 30163965 47049428 54017669 49580912 33863757
2673C3863757j1858059o620287m644908L908701K666066R076380o88264P84854
$$ 33863757 22005698 15385411 10740503 14649204 17315270 26391650 25703386 26488240
2665B6488240q615542q109220j952704j932468m7884j117919K036862l162449
$$ 26488240 17872698 9763478 7810774 5878306 5830422 4712503 6749365 3586916
2657C586916K066618j045145j909822L856613p57698N55428j424905K79289M59897
$$ 3586916 5653534 4608389 2698567 6555180 5797482 6352910 4928005 5207294 5667191
2648E667191J183439J647065J957155n06796Q04900m16743O60232k071288n92769
$$ 5667191 6850630 8497695 10454850 9948054 10752954 10336211 10996443 8925155 8332386
2639H332386r16180n23115K41955j837918L47621R68971j600586J27755M34530
$$ 8332386 7416206 6893091 7135046 5297128 5644749 6613720 5013134 5140889 5575419
2630E575419j705505K311792j972739j364698N08867r35125K085364B163824J708287
$$ 5575419 3869914 6181706 4208967 2844269 3353136 2418011 4503375 2163824 3872111
2621C872111K37052M03803p64417L19775j913863j62095N07752J43817m87220
$$ 3872111 4109163 4512966 3748549 4068324 2154461 1992366 2500118 2643935 2156715
2612B156715K415535k183768J688044j954356K326423j943438J495198j290656
$$ 2156715 4572250 2388482 4076526 2122170 4448593 2505155 4000353 2709697
2604B709697A135139J593566m07879M49576P77356L8898M55860J579714j997243
$$ 2709697 1135139 2728705 2320826 2770402 3547758 3586656 4042516 5622230 3624987
2595C624987q06849J432478q18012j213332J465966r77572n90997L007772q82472
$$ 3624987 2818138 4250616 3432604 2219272 3685238 2707666 2116669 5124441 4241969
2586D241969J38217A646900L142778N42336j094362j720586R66381Q00617J049659
$$ 4241969 4380186 1646900 4789678 5332014 4237652 2517066 3483447 4284064 5333723
2577E333723J30417j555430P42421B282016J661026J513578m58161Q82523n94951
$$ 5333723 5464140 3908710 4651131 2282016 3943042 5456620 4998459 5880982 5286031
2568E286031m10148L22966j189740o10059M141499j673127k812977J294467p68918
$$ 5286031 4875883 5198849 4009109 3399050 7540549 5867422 3054445 4348912 3579994
2559C579994K584325B194604K950195K026984k342539P39874k320790L74429J169559
$$ 3579994 6164319 2194604 5144799 7171783 4829244 5569118 3248328 3622757 4792316
2550D792316l01336J348026q38848l55041M44683l13551j044191L12287n40776
$$ 4792316 4490980 5839006 5000158 4645117 5089800 4776249 3732058 4044345 3503569
2541C503569P95819m5410M7411L60026k039703J727692O85163J33763L84917r15657
$$ 3503569 4299388 4253978 4301389 4661415 2621712 4349404 5034567 5168330 5553247 4637590
2531D637590j383198J125450K679060l166286J201786q25996J156172j570756
$$ 4637590 3254392 4379842 7058902 3892616 5094402 4268406 5424578 3853822
2523C853822J048439K15486k005307P27017j004747L223854k671585J391847p90290
$$ 3853822 4902261 5117747 3112440 3839457 2834710 6058564 3386979 4778826 3988536
2514C988536A961930M663958j094373l62304Q32578J012028p00985k461307R1794
$$ 3988536 1961930 6625888 5531515 5169211 6001789 7013817 6312832 3851525 3943319
2505C943319K50818K412761k638759J278721k310323O77251L490552k012314J991650
$$ 3943319 4194137 6606898 3968139 5246860 2936537 3613788 7104340 5092026 7083676
2496G083676l175682K579686k383746J79065Q25761R93309r42918o70835J426650
$$ 7083676 3907994 6487680 4103934 4282999 5108760 6102069 5159151 4488316 5914966
2487E914966n62066q09044J346807p1988K99570L61910J1642j76031R96190k967390
$$ 5914966 5352900 4543856 5890663 5818675 6118245 6480155 6491797 6315766 7311956 4344566
2477D344566R59088k43233J443280j657679J737677l52184L87382j448259J41197
$$ 4344566 5303654 5060421 6503701 4846022 6583699 6231515 6618897 5170638 5311835
2468E311835j073616P73899N85270O90663J198992k177478J317833J134058j556968
$$ 5311835 4238219 5012118 5597388 6288051 7487043 5309565 6627398 7761456 6204488
2459F204488o05371P36937j71944J000072J59162R52228j508543K91975L69854
$$ 6204488 5599117 6336054 6164110 7164182 7323344 8275572 6767029 7059004 7428858
2450G428858P29762j488185J440812o36581j186828K243896M23235k091968m40005
$$ 7428858 8158620 6670435 8111247 7474666 6287838 8531734 8954969 6863001 6422996
2441F422996K213938j271165Q22693L0931j282873p12709K609919r82920L98988
$$ 6422996 8636934 7365769 8188462 8219393 6936520 6223811 8833730 7850810 8249798
2432H249798j421344J252186J807481k10744O87731k885579K305664J11341j695453
$$ 8249798 6828454 8080640 9888121 9677377 10365108 7479529 9785193 9896534 8201081
2423H201081J910846L57655N9580K960134l917876J482817l3131j814646M74948
$$ 8201081 10111927 10469582 10529162 13489296 9571420 11054237 11021106 9206460 9681408
2414I681408k59824P91046j423902j706678J336482j881024K128161j133764M0930
$$ 9681408 9421584 10212630 8788728 7082050 8418532 6537508 8665669 7531905 7572835
2405G572835K09316P5770K26706J469367k609294J106613l05453p57545O51439
$$ 7572835 7782151 7857921 8084627 9553994 6944700 8051313 7745860 6988315 7639754
2396G639754P55416l8383m72351O19804j343802P9730m86801J160924j63727n66303
$$ 7639754 8395170 8356787 7884436 8504240 7160438 7240168 6753367 7914291 7750564 7184261
2386G184261K43189p17340j274210K770917k327987j355757M399689k315500o71147
$$ 7184261 7427450 6710110 5435900 8206817 5878830 4523073 8922762 6607262 5936115
2377E936115n60848J383715j851917j19499J680246M76605p37739j221477J906118
$$ 5936115 5375267 6758982 4907065 4787566 6467812 6944417 6206678 4985201 6891319
2368F891319j474394Q4961P89627O68317m01687R82174m6038n05414j878322J736785
$$ 6891319 5416925 5501886 6291513 6959830 6558143 7540317 7494279 6988865 5110543 6847328
2358F847328J531488m65183k431271K069541j651483O49508L81492J366973j240601
$$ 6847328 8378816 7913633 5482362 7551903 5900420 6549928 6931420 8298393 7057792
2349G057792N23651j299392R38535O52226J164795o71319l150958K165233M243
$$ 7057792 7581443 6282051 7220586 7872812 9037607 8366288 5215330 7380563 7384806
2340G384806J059058j177041M85718L70169o21222P00983j795886J672749j348921
$$ 7384806 8443864 7266823 7752541 8122710 7501488 8202471 6406585 8079334 6730413
2331F730413P23954p14252j709115J005732n02566K591163J7610j024196L02587
$$ 6730413 7454367 6740115 5031000 6036732 5534166 8125329 8142939 7118743 7421330
2322G421330j335110Q56456N02249J711977k167968k10376J816729j365866J283105
$$ 7421330 6086220 6942676 7444925 9156902 6988934 6778558 8595287 7229421 8512526
2313H512526J461228j548767j36537k55909k279037N25350K815661k304754K431455
$$ 8512526 9973754 8424987 8288450 8032541 5753504 6278854 9094515 6789761 9221216
2304I221216j362552J64432k636648L577409k129010J420733k67028L58284p94170
$$ 9221216 7858664 8023096 5386448 8963857 6834847 8255580 7988552 8346836 7552666
2295G552666L29636p73270J262756m14758O64962r57951Q93937R81372o73365
$$ 7552666 7882302 7109032 8371788 7957030 8621992 7664041 8557978 9539350 8865985
2286H865985j658156j202281J169410r12689q22667K303127j239163k08515J195217
$$ 8865985 7207829 6005548 7174958 6262269 5439602 7742729 6503566 6295051 7490268
2277G490268j084053J288570R01856j898511K090011L96758Q0979j880175J706845
$$ 7490268 6406215 7694785 8596641 6698130 8788141 9184899 9265878 7385703 9092548
2268I092548J271233l9928j288466O89453N46258n28045n56105j454486K147959
$$ 9092548 10363781 10323853 9035387 9724840 10271098 9743053 9186948 7732462 9880421
2259I880421M78823k624609J801468j76312k014296J991756J144369o39984j298086
$$ 9880421 10359244 7734635 9536103 9359791 7345495 9337251 10481620 9841636 8543550
2250H543550J357649n99472J239538j444374K056229L29554q78468o17823J422734
$$ 8543550 9901199 9301727 10541265 9096891 11153120 11482674 10604206 9986383 11409117
2241A1409117J12123k178054J102011K154267k795464M074354k743095R65055
$$ 11409117 11521240 9343186 10445197 12599464 9804000 13878354 11135259 12100314
2233A2100314l18836J88689L034256j742774J401809m75956k9910j423956K220464
$$ 12100314 11781478 11970167 15004423 13261649 14663458 14187502 14157592 12733636 14954100
2224A4954100l74044j204093R58826k030183K658658k350206Q9906J652764k045468
$$ 14954100 14580056 13375963 14334789 12304606 14963264 12613058 12702964 14355728 12310260
2215A2310260J016399j45686k93318r9581Q8769n00016M75499Q68246K35463r40757
$$ 12310260 13326659 13180973 12887655 12788074 12876843 12376827 12852326 13720572 13956035 13015278
2205A3015278J187778j026429Q99032k254867L536969n79652j599820N87432j443998
$$ 13015278 14203056 13176627 14075659 11820792 15357761 14778109 13178289 13765721 12321723
2196A2321723j092042J825197o9918M38342J339223j338460k362674L283638j107402
$$ 12321723 11229681 13054878 12984960 13423302 14762525 13424065 11061391 14345029 13237627
2187A3237627M78425m14563j093812j99138r05907J188105j507004K203667k341587
$$ 13237627 13716052 13301489 12207677 12008539 11102632 12290737 10783733 12987400 10645813
2178A0645813L568107m494185K567325j163275J399723k52286K511225j924254
$$ 10645813 14213920 9719735 12287060 11123785 12523508 12271222 14782447 12858193
2170A2858193r64339J097609l41998Q7980J321893p64557p00618n37261K086361
$$ 12858193 11893854 12991463 12649465 12737445 14059338 13294781 12594163 12056902 14143263
2161A4143263j789086K13762j137492j124337j90159K109789j259890k69330O9171
$$ 14143263 12354177 12567939 11430447 10306110 10115951 12225740 10965850 10696520 10765691
2152A0765691K45088J030232k137802q4079R48879P46479L04553k592851K203581
$$ 10765691 11010779 12041011 9903209 9819130 10768009 11514488 11819041 9226190 11429771
2143A1429771p25458J469315k476954J28641K10184N78807K73092k96563J14812
$$ 11429771 10704313 12173628 9696674 9825315 10035499 10614306 10887398 10590835 10705647
2134A0705647J205973j81067n1703n2877K95940j462309Q82291P98724j077801
$$ 10705647 11911620 11730553 11678850 11625973 11921913 10459604 11341895 12140619 11062818
2125A1062818k81922K062488j768151P91858K25131n59456K347559l101393L01770
$$ 11062818 10780896 12843384 11075233 11867091 12092222 11532766 13880325 10778932 11080702
2116A1080702J190650K144410k646403O04128j75497K173981j119725n0880M57358
$$ 11080702 12271352 14415762 11769359 12373487 12197990 14371971 13252246 13201366 13658724
2107A3658724k377697J390434J833102R94471j046956n75988k00111N47820P91148
$$ 13658724 11281027 12671461 14504563 15499034 14452078 13876090 13675979 14223799 15014947
2098A5014947J75000K761127m169769J173822r31739K228443j073567m79968M80595
$$ 15014947 15189947 17951074 13781305 14955127 14023388 16251831 15178264 14698296 15178891
2089A5178891J378166J24080j563690K015863j992019j384291J675281J226030
$$ 15178891 16557057 16681137 15117447 17133310 15141291 13757000 15432281 16658311
2081A6658311j382823J780208k188203L273919k614785j520093J509104j20790
$$ 16658311 15275488 17055696 14867493 18141412 15526627 14006534 15515638 15394848
2073A5394848P05635J343389j615442R3769m02890R41514M80267k311578J135140
$$ 15394848 16100483 17443872 15828430 15922199 15519309 16460823 16941090 14629512 15764652
2064A5764652m54852K142996l2476j557057P98487l20435J260071j551357m13525
$$ 15764652 15309800 17452796 17420320 15863263 16661750 16341315 17601386 16050029 15636504
2055A5636504K776436j10133q93665k2582k378078O96522J41465l62111O79887
$$ 15636504 18412940 18302807 17409142 17386560 15008482 15705004 15846469 15484358 16164245
2046A6164245m50393o76875m10446K635333j477241p30560m45293J410390n21745
$$ 16164245 15713852 15036977 14626531 17261864 15784623 15054063 14608770 16019160 15497415
2037A5497415J60847n7676J175025J00609L090676K219272R099029L057100L988885
$$ 15497415 15658262 15600586 16775611 16876220 19966896 22186168 31285197 34342297 38331182
2028C8331182r392051r365949j963588m318246P23903k205203J868587L90900
$$ 38331182 28939131 19573182 17609594 13291348 14015251 11810048 13678635 14069535
2020A4069535k31272k37828k02109l154967O27396K589546l110450J939109q88113
$$ 14069535 13838263 13600435 13398326 10243359 10870755 13460301 10349851 12288960 11400847
2011A1400847k126081L22880J212714J975505l742466K574936J225663j525952
$$ 11400847 9274766 9597646 10810360 12785865 9043399 11618335 12843998 11318046
2003A1318046J351493q86013j39591K176222j705235J337540j100355r83862J278044
$$ 11318046 12669539 11783526 11643935 13820157 12114922 13452462 12352107 11368245 12646289
1994A2646289r71975J96517K006751j756433m96107L26486K326288j634440j178096
$$ 12646289 11674314 11870831 13877582 12121149 11625042 11951528 14277816 12643376 11465280
1985A1465280J716171L2566j947205N88386K630226j661968j39623r40357N39375
$$ 11465280 13181451 13214017 11266812 11855198 14485424 12823456 12683833 11743476 12282851
1976A2282851J901529j812701L913044j174040l074783M106263l235062k47647
$$ 12282851 14184380 12371679 16284723 15110683 12035900 16142163 12907101 12659454
1968A2659454K18922K998148j050990J873730j923440M69649l89227l68579J227343
$$ 12659454 12878376 15876524 14825534 16699264 14775824 15245473 14856246 14487667 15715010
1959A5715010j518588j832916J550698n67045k86988J268023k344618L775785
$$ 15715010 14196422 12363506 13914204 13347159 13060171 14328194 11983576 15759361
1951A5759361k109754o25516j40040J401575n53323k683544K413744J58463R02900
$$ 15759361 13649607 13024091 12884051 14285626 13732303 11048759 13462503 13620966 14523866
1942A4523866k1214q72199K13783p29692m35314Q3934k055404K855664j162513
$$ 14523866 14502652 13630453 13844236 13114544 12679230 12763164 10707760 13563424 12400911
1933A2400911o29823L507420j768810k073806L168766L94318j174916J378724
$$ 12400911 11771088 15278508 13509698 11435892 14604658 14998976 13824060 15202784
1925A5202784j035423k320601R23676j260972J98511L723018p81533R03442M35885
$$ 15202784 14167361 11846760 12770436 11509464 11707975 15430993 14649460 15552902 15988787
1916A5988787N1245O82237k26843j997489J71439L061248j534914J707160q31588
$$ 15988787 16040032 16722269 16495426 14497937 14669376 17730624 16195710 17902870 17071282
1907A7071282j014695J008301o90640l95108M9770l80503K484469k552563J79990
$$ 17071282 16056587 17064888 16374248 15979140 16028910 15648407 18132876 15580313 15760303
1898A5760303J412087K601020j846730L70839Q91907O24252o90748J690744p87726
$$ 15760303 17172390 19773410 17926680 18297519 19189426 19813678 19122930 20813674 20025948
1889B0025948L90390j00812M80552l15732J19994J56146o86018j199564J743630
$$ 20025948 20416338 20315526 20796078 20480346 20600340 20756486 20070468 18870904 20614534
1880B0614534K62902J594034k294362J650916J637778o21794R71488o96732k52998
$$ 20614534 20877436 22471470 20177108 21828024 23465802 22844008 23815496 23118764 22865766
1871B2865766k05660o7496K03482k27754j244092L03704q97112l78288o70692
$$ 22865766 22660106 22592610 22796092 22568338 21324246 21627950 20730838 20352550 19681858
1862A9681858J663056r75166J533384J5031r43647p03124N88524M14332k941445
$$ 19681858 21344914 20369748 21903132 21918163 20974516 20271392 20859916 21274248 18332803
1853A8332803J552215j197372J745476J29996J903234k127894J926499j427271
$$ 18332803 19885018 18687646 20433122 20563118 22466352 20338458 22264957 20837686
1845B0837686j027636o52462K241936q60690J022518l08880M10250N40334n06106
$$ 20837686 19810050 19157588 21399524 20538834 21561352 21252472 21662722 22203056 21696950
1836B1696950p85474N80716K268957k266917K56694j739875j11999J253090j006132
$$ 21696950 20911476 21492192 23761149 21494232 21750926 20011051 19899052 21152142 20146010
1827B0146010o54118r34926J136596J552166n020138l40303K79542P12323l00768
$$ 20146010 19491892 18556966 19693562 21245728 16225590 15885287 16164829 16877152 16576384
1818A6576384j389130j201767K022888j846373m46323R01669R84874j24918p51500
$$ 16576384 15187254 13985487 16008375 14162002 13715679 14617348 15602222 15477304 14725804
1809A4725804j05957J92236J989307j232897j943882j02195n58576K886337Q89545
$$ 14725804 14619847 14812083 16801390 15568493 13624611 13522416 12963840 15850177 16739722
1800A6739722l235167j71109n26165m4641R95072k028356K208399j449365O89319
$$ 16739722 13504555 13333446 12807281 12762640 13757712 11729356 13937755 12488390 13177709
1791A3177709r05189l59093J046850j371607J979468n02495j244271P83019L65992
$$ 13177709 12272520 11913427 12960277 11588670 13568138 13065643 11821372 12604391 12970383
1782A2970383m89638M69425Q49821M84815N81944j965219J894938j200038L69017
$$ 12970383 12480745 12950170 13799991 14284806 14866750 12901531 14796469 13596431 13965448
1773A3965448Q5459J943383k94703J989603k992125J238275M51537m15796P72210
$$ 13965448 14050907 15994290 15699587 17689190 14697065 15935340 16386877 15971081 16743291
1764A6743291j037246J026695O51824m11264J298086K210378j877628k21814N32890
$$ 16743291 15706045 16732740 17384564 16973300 18271386 20481764 18604136 18382322 18915212
1755A8915212n12384J028402R02614J191712j981762K92552K637935k384107R30834
$$ 18915212 18402828 19431230 20333844 21525556 19543794 19836346 22474281 20090174 21021008
1746B1021008r92052K897042M69094J289966j521115K938485j775416J196128
$$ 21021008 20028956 22925998 23395092 24685058 23163943 26102428 24327012 25523140
1738B5523140K018470j117284J942127N89270j705991r1616K998589l84283Q0604
$$ 25523140 27541610 26424326 28366453 28955723 27249732 27158116 30156705 29772422 29853026
1729B9853026L871711M24368J102200K358316P644K639012K225952K115000M31380
$$ 29853026 33724737 34149105 35251305 37609621 37617265 40256277 42482229 44597229 45028609
1720D5028609M6056O555275q82296M098296K520037L049367M10032K490384o84660
$$ 45028609 45074665 51629940 50747644 54845940 57365977 60415344 60825376 63315760 62631100
1711F2631100K536811l56695K153431j284387R01168K270416K150792N68247K178992
$$ 62631100 65167911 64811216 66964647 65680260 66581428 68851844 71002636 71570883 73749875
1702G3749875K587264L074464L142104K628384O031807L023169N984592M377967
$$ 73749875 76337139 79411603 82553707 85182091 91213898 94237067 100221659 104599626
1694A04599626O555712Q796311J0218960J0728823J1307424J4225744J1627454
$$ 104599626 111155338 119951649 130170609 140899432 152206856 166432600 178060054
1687A78060054P020880l1296p493808j1171519j5236880j5539599j8139391j7976247
$$ 178060054 185080934 185049638 177555830 166384311 151147431 135607832 117468441 99492194
1679I9492194j9040503j6188127j0141439p580360q340368o251647k852732l285972
$$ 99492194 80451691 64263564 54122125 46541765 38201397 31949750 29097018 25811046
1671B5811046k460846k280240p04804q05842k30920k106073O92589j440560q86411
$$ 25811046 23350200 21069960 20365156 19559314 19328394 17222321 17914910 16474350 15587939
1662A5587939K98943o88960r08840J406604k257240j121058M32111k150037L589374
$$ 15587939 15886882 15197922 14289082 15695686 13438446 12317388 12749499 10599462 14188836
1653A4188836k144644Q5559R87130j119759p11241j095857r45604K594343j500491
$$ 14188836 12044192 12129751 13116881 11997122 11285881 10190024 9244420 11838763 10338272
1644A0338272J18108k123434J537854j318991J036472j02537o08194k045971J679899
$$ 10338272 10456380 8332946 9870800 8551809 9588281 9485744 8877550 6831579 8511478
1635H511478k74780J788420q01574k92767p10049j169073j302590P99777J069204
$$ 8511478 8236698 10025118 9223544 8930777 8220728 7051655 5749065 6548842 7618046
1626G618046L67574j74900k44064j191468j54264N60155o18276Q94985j840061
$$ 7618046 7985620 7810720 7566656 6375188 6220924 6781079 6162803 7057788 5217727
1617E217727L425275l597247R69619J203874k725431K03107J593683j247271J114716
$$ 5217727 8643002 5045755 6015374 7219248 4493817 4696924 6290607 5043336 6158052
1608F158052K201341N59702C953133K584492j757586J330514O74703m16773k45981
$$ 6158052 8359393 8919095 3953133 6537625 4780039 6110553 6785256 6368483 6122502
1599F122502K10279k37357k97721J83220R55460k32076j371963J475058k126500
$$ 6122502 6332781 6095424 5797703 5980923 6936383 6704307 5332344 6807402 4680902
1590D680902K850353P72904j74129M75911k375948K66394j34581K369303k050945
$$ 4680902 7531255 8304159 8130030 8605941 6229993 6496387 6361806 8731109 6680164
1581F680164j820530L781520K17072k301296O77524l37945J36145J092527j467533
$$ 6680164 4859634 8641154 8858226 6556930 7234454 6896509 7032654 8125181 6657648
1572F657648J213396p09843Q42938K99773J232684k473346K179884O15776k139159
$$ 6657648 7871044 7161201 8004139 8303912 9536596 7063250 9243134 9858910 7719751
1563G719751M76785J06990K971821k637633J526136O13022M44104l0226J225683
$$ 7719751 8196536 8303526 11275347 8637714 10163850 10776872 11220976 11190750 12416433
1554A2416433k196347K603485j66417J205655j527674J672000J061472r71904
$$ 12416433 10220086 12823571 12657154 13862809 12335135 14007135 15068607 14096703
1546A4096703M63259J017908J34737P17257j265710q6850M72679Q81282N765187
$$ 14096703 14559962 15577870 15712607 16429864 15164154 15077304 15549983 16431265 22196452
1537B2196452p10200J608886K468801N50513k670514o74098l615612K51998k061648
$$ 22196452 21486252 23095138 25563939 26114452 23443938 22769840 19154228 19406226 17344578
1528A7344578J27696o21474k458685L028933k139475M34474J4766P34020l650378
$$ 17344578 17472274 16850800 14392115 17421048 15281573 15716047 15730813 16464833 12814455
1519A2814455J546870P56287j153135j093842m45207Q89620O36845j74254J735057
$$ 12814455 14361325 15117612 13964477 12870635 12425428 13315048 13951893 13777639 15512696
1510A5512696j335355O92609K43628r44323p157m02212J224468j802192K203585
$$ 15512696 14177341 14869950 15113578 14169255 14162098 13759886 14984354 13182162 15385747
1501A5385747J756916O85253J173943K578785J005114N85346Q26008L54152j42973
$$ 15385747 17142663 17827916 19001859 21580644 22585758 23171104 23997112 24351264 24208291
1492B4208291l146479j09532o04986l684037k1286k371135n42569L61071j79553
$$ 24208291 21061812 20952280 20347294 16663257 16641971 14270836 13728267 14089338 13909785
1483A3909785R61286k405952R3123Q69822R33027o95869k297878Q13067N66329
$$ 13909785 14871071 12465119 12558242 13428064 14361091 13665222 11367344 12180411 12746740
1474A2746740J175978n11298q3365K80261M815982k577394P18800K48486J535381
$$ 12746740 13922718 13411420 13328055 13608316 18424298 15846904 16565704 16814190 18349571
1465A8349571K44180o04091j520446q70825j590426M26050k88203k746004k86497
$$ 18349571 18593751 17989660 16469214 15598389 14007963 14434013 14145810 11399806 11113309
1456A1113309K619249k683030l42592p81840N14804l07658j492659l70177Q96215
$$ 11113309 13732558 11049528 10706936 9925096 10439900 10132242 8639583 8269406 9165621
1447I165621k238781P43945j128749L428239m082764O44008J415559J582076j927154
$$ 9165621 6926840 7670785 6542036 9970275 5887511 6531519 7947078 9529154 7602000
1438G602000j939202J955361j010278K79493j54721P3001J533091k231154J290918
$$ 7602000 5662798 7618159 6607881 6887374 6732653 6805654 8338745 6107591 7398509
1429G398509l32776L74297O18938k123676J801564m73041j284031m90317O66062
$$ 7398509 7065733 7440030 8058968 5935292 7736856 7263815 5979784 5489467 6155529
1420F155529k138695K831220J980911j278328O57207j480931o15204k39033q41757
$$ 6155529 4016834 6848054 8828965 7550637 8207844 6726913 6111709 5872676 5030919
1411E030919J017997M99347J128417j712211K047325J163598l397482J716741
$$ 5030919 6048916 6548263 7676680 5964469 8011794 9175392 5777910 7494651
1403G494651q31473P5820j158754j441391J554591k741954L270966k069731k97595
$$ 7494651 6663178 6738998 5580244 4138853 5693444 2951490 6222456 4152725 3855130
1394C855130n47444l46222m53086J538454l87524J092614j744117H26125K159001
$$ 3855130 3307686 2961464 2508378 4046832 3659308 4751922 3007805 826125 2985126
1385B985126I27736K284177j15068J173134M14682k032976J651835j070098j189844
$$ 2985126 927736 3211913 3096845 4269979 4684661 2651685 4303520 3233422 2043578
1376B043578N34332R32808j4687Q24229A770814J540820J671191j525749N05329
$$ 2043578 2577910 3510718 3496031 4320260 1770814 3311634 4982825 3457076 3962405
1367C962405j290008J169335K41943j46064J0704A303528K56965J43671K920494
$$ 3962405 2672397 3841732 4083675 3937611 3948315 1303528 1560493 1704164 4624658
1358D624658j642521K57444m50169N37064A145297K116941j089913R03169A329184
$$ 4624658 2982137 3239581 2789412 3326476 1145297 3262238 2172325 3075494 1329184
1348A530900J942888m35859j339177K903954j161398J166697a88980C164177M22386
$$ 1530900 3473788 3037929 1698752 4602706 3441308 4608005 -188980 3164177 3586563
1339C586563k1676r71534K386021j112900L57317J407189k223438R02373J18157
$$ 3586563 3564887 2593353 4979374 3866474 4223791 5630980 3407542 4309915 4428072
1330D428072j70357J368868J43137j653293r02855A485137K050892N45626j367830
$$ 4428072 4257715 5626583 5769720 4116427 3213572 1485137 3536029 4081655 2713825
1321B713825j56745J236995r90336l8491N7867J549557m65348j829861L56245
$$ 2713825 2557080 3794075 2803739 2765248 2823115 4372672 3907324 2077463 2433708
1312B433708J881452j725618M18707J632418J34851j465074p03681j1875K373256
$$ 2433708 4315160 2589542 3008249 4640667 4775518 3310444 2606763 2594888 4968144
1303D968144j059444O2649M21147A945077R25240K129749k304134P58399j34970
$$ 4968144 3908700 3971349 4392496 1945077 2870317 5000066 2695932 3454331 3319361
1294C319361J933231k515317R21292q76681P57955m95738J452629j751625A285221
$$ 3319361 5252592 2737275 3658567 2781886 3539841 3044103 4496732 2745107 1285221
1284C441789j460361J3870L07282n06674o34856L99494J638584m11229p11914
$$ 3441789 1981428 1995298 2302580 1795906 1161050 1560544 3199128 2787899 2075985
1275B075985M4795R73304M59079j184352K470077K50547k049000A352416K374842
$$ 2075985 2120780 3094084 3553163 2368811 4838888 5089435 3040435 1352416 3727258
1266C727258J49995k2787N17749j002335j91268o12721M72462J18973J246155
$$ 3727258 3877253 3854466 4372215 3369880 3178612 2565891 3038353 3157326 4403481
1257D403481n69805j159691P63451K139530B530001K75591J136128j497737A009692
$$ 4403481 3833676 2673985 3437436 5576966 2530001 2805592 3941720 2443983 1009692
1247A233571M13875R78804A161553K353597n47315R8655J051167A612170J258984
$$ 1233571 1647446 2626250 1161553 3515150 2967835 3066490 4117657 1612170 2871154
1238B871154O09888j030003J092675A768002O31738m41057k49663K884107p86067
$$ 2871154 3481042 2451039 3543714 1768002 2399740 1958683 1709020 4593127 3807060
1229C807060j328406K067159k079317k22927O97075P63299L47237k41388l98927
$$ 3807060 2478654 4545813 2466496 2243569 2940644 3703943 4051180 3809792 3410865
1220C410865K5469j424902J863445A634555J360262K22294A315041J196333J71413
$$ 3410865 3436334 2011432 3874877 1634555 2994817 3217111 1315041 2511374 2682787
1211B682787N70150A360922K356019L37301j746645J742317B008532K121445k82586
$$ 2682787 3252937 1360922 3716941 4054242 2307597 4049914 2008532 4129977 3847391
1202C847391J05823m25580J357949L13313j621980K377738k431447J838026p39738
$$ 3847391 3953214 3527634 4885583 5198896 3576916 5954654 3523207 5361233 4621495
1193D621495J49616J382652O73435M41292j250060k098440j72564A314753K051137
$$ 4621495 4771111 6153763 6827198 7268490 6018430 3919990 3747426 1314753 3365890
1184C365890j214994K779994B426886q75222K990230j954685J531694r66390J80455
$$ 3365890 2150896 4930890 2426886 1551664 4541894 2587209 4118903 3152513 3332968
1175C332968l9116A556203K075272A402490K95597J876944j452967J125249A319244
$$ 3332968 3293852 1556203 3631475 1402490 1698087 3575031 2122064 3247313 1319244
1165A952404K32962L48287J021920A528744P40029H25494J492487J051085A265466
$$ 1952404 2185366 2533653 3555573 1528744 2268773 825494 2317981 3369066 1265466
1155C315656l46829p05761J899379B051151O61800P47911j406904J107520K71619
$$ 3315656 2968827 2263066 4162445 2051151 2712951 3460862 2053958 3161478 3433097
1146C433097j18083m35038l65208A044928K200227Q67296A531662m93151K191529
$$ 3433097 3315014 2879976 2514768 1044928 3245155 4112451 1531662 1038511 3230040
1137C230040j089320m18030K928269B056983L042547A351965R05771J000188A532419
$$ 3230040 2140720 1722690 4650959 2056983 5099530 1351965 2257736 3257924 1532419
1127A737506C68611M41986P72249e62899A048264L25926m31080K435603L85502
$$ 1737506 368611 810597 1582846 -562899 1048264 1374190 943110 3378713 3764215
1118C764215A237191J125120J822365j948918I30160J744170j49131O12215a712799
$$ 3764215 1237191 2362311 4184676 2235758 930160 2674330 2525199 3137414 -1712799
1108A985690E69291Q57050J943434A668495E84977J494369L80806A223781J33848
$$ 1985690 569291 1426341 3369775 1668495 584977 2079346 2460152 1223781 1357629
1099A357629L2141L84833O29098J317141A798676M51881q27215K041822n53311
$$ 1357629 1389770 1774603 2403701 3720842 1798676 2250557 1423342 3465164 2911853
1090B911853J482276j545410q7440P8045j53997p66794K081494j585888J73628
$$ 2911853 4394129 2848719 2761279 2839324 2685327 1918533 4000027 2414139 2587767
1081B587767K723808j089130m53044K705373m07932n45053P81778J428844j42290
$$ 2587767 5311575 4222445 3769401 6474774 6066842 5521789 6303567 7732411 7590121
1072G590121J845029J231208K884086o20710J838821k534616k850760P06864M778725
$$ 7590121 9435150 10666358 13550444 12929734 14768555 12233939 9383179 10090043 14868768
1063A4868768o15944J248768J200212J057782K709094M630604M978586L079432
$$ 14868768 14252824 15501592 16701804 17759586 20468680 25099284 30077870 33157302
1055C3157302R264515K2846535L7871466R9939996M4453469j5984719j01176467
$$ 33157302 42421817 65268352 103139818 203079814 247533283 231548564 130372097
1048A30372097E1704541k5703247q566506k448984C767334N551944D329937A987667
$$ 130372097 51704541 26001294 17434788 14985804 3767334 9319278 4329937 1987667
1039B424515N11457L08120O76892o46094K129200l32745J484380k31841j058318
$$ 2424515 2935972 3244092 3920984 3274890 5404090 5071345 6555725 6323884 5265566
1030E265566l03637j769505A155049J315726j049346g28555A66839R7064O27709
$$ 5265566 4961929 3192424 1155049 2470775 1421429 -728555 166839 263903 891612
1021H91612C38511K072439q0951R8141q97057L14642D0523e96050H43161M29263
$$ 891612 338511 2410950 2329999 2428140 1531083 1845725 40523 -596050 843161 1272424
1011A272424D75429R66380o84542K329867f50932B074164F14463i90571M0035
$$ 1272424 475429 1441809 757267 3087134 -650932 2074164 614463 -990571 -950536
1002i50536B87172J610798J73625l36248k15899j68493m85766N01046F40220j43032
$$ -950536 287172 1897970 2071595 1735347 1519448 1350955 865189 1366235 640220 497188
992D97188a024694D41554K67601J125069G02882b34852r4840B2723J279881K67456
$$ 497188 -1024694 441554 709155 1834224 702882 -234852 -329692 22723 1302604 1570060
982A570060a73091A061154a611687A938024k13205F89127j20420P87738g57294
$$ 1570060 -173091 1061154 -1611687 1938024 1724819 689127 568707 1356445 -757294
972d28515C1199a684705b5436G76813J105339C15095l3557J629937c67539G31413
$$ -428515 31199 -1684705 -25436 776813 1882152 315095 281538 1911475 -367539 731413
961E43836g20026J32224D84412c05740A61310f13518r88621a62807M0516A331013
$$ 543836 -720026 -587802 484412 -305740 161310 -613518 -1602139 -162807 -122291 1331013
950A135469D97767a801261C76663f57110G36533a004351I87133N12797k89125
$$ 1135469 497767 -1801261 376663 -657110 736533 -1004351 987133 1499930 1210805
941A210805C54768P68044m5524m89012f51282A487674k2584n25941O76743n44118
$$ 1210805 354768 1122812 1077288 588276 -651282 1487674 1465090 939149 1615892 1071774
931A071774L09079F57792h3637B979187B41543M299001A589130L06313C45851
$$ 1071774 1380853 657792 -83637 2979187 241543 4540544 1589130 1895443 345851
921B485937A078900j740P32628D79928J438838F53471J003685J129671A358158
$$ 2485937 1078900 1077160 1809788 479928 1918766 653471 1657156 2786827 1358158
911B418166j93301Q67025r544n53612r77742G12342N34424g70307B474846D17396
$$ 2418166 2224865 3091890 3082346 2528734 1550992 712342 1246766 -770307 2474846 417396
900B815412E89972d57053A229841D9874K216869A102707b06927I58414P5285j82076
$$ 2815412 589972 -457053 1229841 49874 2266743 1102707 -206927 958414 1033699 851623
890H51623B15575M8365a421090A368552B25412a521873A024905a1106D40951J563442
$$ 851623 215575 263940 -1421090 1368552 225412 -1521873 1024905 -11106 440951 2004393
880B004393d42517I82852k21710l76558j44314J136803i78933m47290c46262H99134
$$ 2004393 -442517 982852 761142 384584 240270 1377073 -978933 -1426223 -346262 899134
869B074955b39075A882000C87028J485501P2297q51945i31117A603685p14918
$$ 2074955 -239075 1882000 387028 1872529 1944826 1092881 -931117 1603685 888767
860H88767k80693Q33805B5178a324191a51974A006052f67274I19982a001502J88685
$$ 888767 608074 1441879 25178 -1324191 -151974 1006052 -667274 919982 -1001502 -812817
850h12817I8189J010228K675833A445916b77464h6325G38097f80903b4591A232351
$$ -812817 98189 1108417 3784250 1445916 -277464 -86325 738097 -680903 -24591 1232351
839C64975K67833J089203o91420R45934J197925A029795p0959D63705J558502
$$ 364975 632808 1722011 1030591 1976525 3174450 1029795 958836 463705 2022207
830B022207b39795f3523C11021J419694P38397F25786J587289p71784m43948k26367
$$ 2022207 -239795 -63523 311021 1730715 2469112 625786 2213075 1441291 997343 770976
820G70976J500155j129386J476388c24850F80407c69044I80458e36619A944460
$$ 770976 2271131 1141745 2618133 -324850 680407 -369044 980458 -536619 1944460
810i39231B127000d67922H55426B84871M27060R53951q2569Q94156p9061A076086
$$ -939231 2127000 -467922 855426 284871 711931 1665882 1583313 2477469 2398408 1076086
799A563608O00190G50168K56871L276446A042322k27186C18543K686530p84001
$$ 1563608 2163798 750168 1007039 4283485 1042322 815136 318543 3005073 2221072
790B221072D78682K307197L0505n39450p60917L189811I52543B7357J347140j15853
$$ 2221072 478682 2785879 2816384 2276934 1516017 4705828 952543 27357 1374497 1258644
780A258644K63688O95173N20448H00574O77071H9618K642711l11569q97645J035573
$$ 1258644 1522332 2217505 2737953 800574 1477645 89618 2732329 2420760 1523115 2558688
770B558688K103210o06342j263832J320230G11704J353454J163873l0924E0076
$$ 2558688 4661898 4055556 2791724 4111954 711704 2065158 3229031 3198107 50076
760B045505g54157K44261D29757b69040m42027H50010b26412A501429a10986k304053
$$ 2045505 -754157 -509896 429757 -269040 -711067 850010 -226412 1501429 -110986 -2415039
750b415039A23820J737419I3398K465006C85653b105810F55139B48117p6839J730155
$$ -2415039 123820 1861239 93398 2558404 385653 -2105810 655139 248117 171278 1901433
740A901433p46562m18772l33544O26816R34321q67197a314685A521099L68476
$$ 1901433 1154871 736099 402555 1029371 1963692 1096495 -1314685 1521099 1889575
731A889575I42807J629572a907176F14897B07827J840085J78558m57586c33037
$$ 1889575 942807 2572379 -1907176 614897 207827 2047912 2226470 1768884 -333037
721e91956I08463K84631a72431h4493m77590C47756J922994A121362a254351b59884
$$ -591956 908463 1193094 -172431 -84493 -562083 347756 2270750 1121362 -1254351 -259884
710a891408F32508b75060j447120B736891j310792o40104l12356h37772j46338
$$ -1891408 632508 -275060 -1722180 2736891 1426099 785995 473639 -837772 -984110
701i84110B372596D0225M9098K541038j212076a22152n40428E77487N31406D11624
$$ -984110 2372596 40225 89323 2630361 1418285 -122152 -662580 577487 1108893 411624
690A783301l97860J77072D69447e64572B7726J817639n23010i07166b83101A666886
$$ 1783301 1385441 1562513 469447 -564572 27726 1845365 1322355 -907166 -283101 1666886
679G70015J629735a78889A03204R62677Q4677l50877J881873A201943R96262D40093
$$ 770015 2399750 -178889 103204 1065881 1150558 799681 2681554 1201943 2198205 440093
668G51759a228845f07135C22321k9371M57670B32147J714101B24972K450632e9576
$$ 751759 -1228845 -607135 322321 292950 750620 232147 1946248 224972 2675604 -59576
657A380155a394736I43790b99408C41156A66802J56139j19580c34497F30005a961103
$$ 1380155 -1394736 943790 -299408 341156 166802 322941 203361 -334497 630005 -1961103
646B32696M56939k08637K89701k44334J499523H60142k16384B79272J383957i86499
$$ 232696 689635 480998 770699 526365 2025888 860142 643758 279272 1663229 -986499
635I18070N52431f68155C757563i73446E33927h0964A918260k42234J03145H11394
$$ 918070 1470501 -668155 3757563 -973446 533927 -80964 1918260 1676026 1779171 811394
624I84393K23950A56948f46998F53789a872657g48660G0639J31808n586i56376
$$ 984393 1208343 156948 -646998 653789 -1872657 -748660 70639 202447 196861 -956376
613C41498c17780I57428i84252A771023P12349a000853C7079L37849a598745k51881
$$ 341498 -317780 957428 -984252 1771023 2483372 -1000853 37079 374928 -1598745 -1850626
603a850626C13865J247963n74626J102729E08311c85526l04015o6201P3659A485602
$$ -1850626 313865 1561828 987202 2089931 508311 -385526 -689541 -755742 -682083 1485602
592A803216c89214A575568G79577L21241A66253a911068A442038a314796B954146
$$ 1803216 -389214 1575568 779577 1100818 166253 -1911068 1442038 -1314796 2954146
582C75324L43366K007167j286853I4616l5186Q51678B22776a062259A667772J8039
$$ 375324 718690 2725857 1439004 94616 59430 911108 222776 -1062259 1667772 1685811
572A685811a69477G30326J655880C20315Q56271L29197d54213f3083G88469P56867
$$ 1685811 -169477 730326 2386206 320315 1176586 1505783 -454213 -63083 788469 1545336
562A545336D91074d51765A358856f6660A07709b81751N5558G42738a270466O2752
$$ 1545336 491074 -451765 1358856 -66660 107709 -281751 -226193 742738 -1270466 -1207714
552a207714F46281M00098l2274d00577A625461B9578J303904i70649F52516B98717
$$ -1207714 646281 1046379 1014105 -400577 1625461 29578 1333482 -970649 652516 298717
541A101712L6473A98659Q25150M35441a035132E10337p7749P08965Q18488a55898
$$ 1101712 1138185 198659 1023809 1459250 -1035132 510337 432588 1141553 1960041 -155898
530B330226o05089a365477I6499b94897n15074k70076B426458H31239B06747L061723
$$ 2330226 1725137 -1365477 96499 -294897 -809971 -1080047 2426458 831239 206747 3268470
520C268470d30081A176528L14260K3724d27635a3829E49536f51256c7714j60321
$$ 3268470 -430081 1176528 1490788 1514512 -427635 -13829 549536 -651256 -37714 -198035
510a98035C65058i26539j334546F31246h77481B391059A75982Q5875J06625J32825
$$ -198035 365058 -926539 -2261085 631246 -877481 2391059 175982 261857 368482 501307
500E01307a350718A21881g73114A368633m89927g51973A719889C11422M56784
$$ 501307 -1350718 121881 -773114 1368633 878706 -751973 1719889 311422 768206
491G68206K040257a888552A071385a083633A216240l20766e76120j926011a033456
$$ 768206 2808463 -1888552 1071385 -1083633 1216240 895474 -576120 -2502131 -1033456
481A825929p8511o00892i97616p91066D44712J168866M82022a54589j243006B82442
$$ 1825929 1747418 1146526 -997616 -1788682 444712 1613578 2095600 -154589 -1397595 282442
470c91277B43555J170504A67110J065882b41085D8789f50059A63090L1943a045511
$$ -391277 243555 1414059 167110 1232992 -241085 48789 -650059 163090 195033 -1045511
459a429956H0024a512863D72176i22510b13707A698885E67048a236571n42768
$$ -1429956 80024 -1512863 472176 -922510 -213707 1698885 567048 -1236571 -1779339
450a779339J49928Q12698b58447B107863G9860a857920C40511L75703N16351b83049
$$ -1779339 -1629411 -816713 -258447 2107863 79860 -1857920 340511 716214 1232565 -283049
439G65234h01116a30819A043820K58691D23692J696621A96743J24006f68758J67802
$$ 765234 -801116 -130819 1043820 1302511 423692 2120313 196743 320749 -668758 -500956
429e00956o63147A37797d64567b01504A198127b17356A9096g72748H00453l96234
$$ -500956 -1164103 137797 -464567 -201504 1198127 -217356 19096 -772748 800453 404219
419D04219d95335A167470a06752C49924j35243a41437j777250i02253A71033Q69664
$$ 404219 -495335 1167470 -106752 349924 214681 -141437 -1918687 -902253 171033 1040697
409A040697J532185J27056c93877G60939A66375h74300C37182P42070h92485K98594
$$ 1040697 2572882 2699938 -393877 760939 166375 -874300 337182 1079252 -892485 -593891
399e93891k34047q4983m93832I43027k5095K42951M11627g91547a67664j233371
$$ -593891 -827938 -912921 -1406753 943027 917932 1160883 1572510 -791547 -167664 -1401035
389a401035I361K143247C60820O17318m9387L84980C56360g20560A42267P9747
$$ -1401035 9361 2152608 360820 978138 928751 1313731 356360 -720560 142267 222014
379B22014b0064l273786a584921c77488e1634A591918n02529k83350g69890a278
$$ 222014 -20064 -3293850 -1584921 -377488 -51634 1591918 1089389 806039 -769890 -1278
368A961016k53985D44527a11410p7270c1732F87697b027392d56339A137433d87691
$$ 1961016 1707031 444527 -111410 -188680 -31732 687697 -2027392 -456339 1137433 -487691
357B238592d39774E73278b95226n67777d07596J30227p62323c72486k102495A325714
$$ 2238592 -439774 573278 -295226 -863003 -407596 -277369 -1039692 -372486 -2474981 1325714
346a194753j022641a60048D69340b82272l27934B820005c80522B84651A1258b96738
$$ -1194753 -2217394 -160048 469340 -282272 -610206 2820005 -380522 284651 11258 -296738
335F76093h12060J71813A206928a018467A399584g57660A292784c026H50404a202046
$$ 676093 -812060 -640247 1206928 -1018467 1399584 -757660 1292784 -3026 850404 -1202046
324F03410A674O05544A00K310297a327102G99947A43748b62663m70930A871887
$$ 603410 1674 607218 100 2310397 -1327102 799947 143748 -262663 -733593 1871887
313a295780G93852e98113H73313Q32906J40485i94704F97742i03235b97222D62956
$$ -1295780 793852 -598113 873313 1706219 1846704 -994704 697742 -903235 -297222 462956
302a056265K23152L80168B951470a76900D82279g49268o43185C16653d40429p23551
$$ -1056265 -833113 -452945 2951470 -176900 482279 -749268 -1392453 316653 -440429 -1163980
292a163980B741507A226134c00812j86671A989996F47363h65458E50520a565591
$$ -1163980 2741507 1226134 -300812 -487483 1989996 647363 -865458 550520 -1565591
282A168522m7959J543019E69788O62531c5932j313685e39612A218927c00612F39233
$$ 1168522 1120563 2663582 569788 1232319 -35932 -1349617 -539612 1218927 -300612 639233
271I81873a929614N09244G9697e07624J51978r48265k7827D08994J69256O9748
$$ 981873 -1929614 -1420370 79697 -507624 -355646 -1303911 -1331738 408994 578250 647998
261F47998M14536g06351A39399e72421b247B061983i88017B17529J869121m12748
$$ 647998 1062534 -706351 139399 -572421 -2247 2061983 -988017 217529 2086650 1673902
251A673902q09784a0618B26262n5405P57645M42212c5058m73042G44929j21010
$$ 1673902 864118 -10618 226262 170857 928502 1370714 -35058 -508100 744929 623919
241F23919M27335h09030P5169j059150A532005a504470E89897i93294A811192
$$ 623919 1051254 -809030 -733861 -1793011 1532005 -1504470 589897 -993294 1811192
231D05194J275165h6723m15949B032667b184052I36208D30212K1570J35394M11202
$$ 405194 1680359 -86723 -502672 2032667 -2184052 936208 430212 451782 587176 998378
221I98378K434i35741A062577b640159A476166a548423P52514A66918R52485c41711
$$ 998378 1000812 -935741 1062577 -2640159 1476166 -1548423 -795909 166918 1119403 -341711
210D95464e0597j23729e5704j221540e85479g4161H71384C71618a018299D2854
$$ 495464 -50597 -174326 -55704 -1277244 -585479 -74161 871384 371618 -1018299 42854
199C50543j51220c24093j431598e75853F51801b211653A027179C95607M4037B19274
$$ 350543 199323 -324093 -1755691 -575853 651801 -2211653 1027179 395607 439644 219274
188B32005a750511A373699o39062b402488C96670A05416a138438J75402a96534
$$ 232005 -1750511 1373699 734637 -2402488 396670 105416 -1138438 -963036 -196534
178D53829A36112n8226a87689h4942l94762a58891g2722G89431c54179m38355
$$ 453829 136112 77886 -187689 -84942 -479704 -158891 -72722 789431 -354179 -792534
168g92534A988782b27076H30211A63676J352702a256391j335013E96034Q75311
$$ -792534 1988782 -227076 830211 163676 1516378 -1256391 -2591404 596034 1471345
159A471345c05343N5536j93095I00069h49605A076986Q06406b54821K3633A391488
$$ 1471345 -305343 -249807 -442902 900069 -849605 1076986 1883392 -254821 -231188 1391488
148h4137B063158A91593a769489j20828m74479C65511K459480A96076d23839G56506
$$ -84137 2063158 191593 -1769489 -1890317 -2364796 365511 2824991 196076 -423839 756506
137a005559I14763a95486A942325A06270h62267E41553a90663B22503L97593J407622
$$ -1005559 914763 -195486 1942325 106270 -862267 541553 -190663 222503 620096 2027718
127B027718a157312B752117e89857o48681A352281f07511I88798f91313F59480
$$ 2027718 -1157312 2752117 -589857 -1238538 1352281 -607511 988798 -691313 659480
117B113018i04084c15675D48064J139171a683765A372566o78023R3149B85530
$$ 2113018 -904084 -315675 448064 1587235 -1683765 1372566 694543 787692 285530
107E65344p8839J0101d27426F53677J913895p33733i51172m77034A538977m22460
$$ 565344 486505 496606 -427426 653677 2567572 1833839 -951172 -1428206 1538977 1116517
97A116517a332109N95728p38893H1807a439943O28944B362280a678060F48480
$$ 1116517 -1332109 -736381 -1475274 81807 -1439943 -810999 2362280 -1678060 648480
87D97383O54997i44217D96955f68776G99763L8746e20943m55991A270709a567170
$$ 497383 1152380 -944217 496955 -668776 799763 838509 -520943 -976934 1270709 -1567170
76A07066J438472Q89621I36166a300355A52382a458657A700170a265778A319812
$$ 107066 1545538 2435159 936166 -1300355 152382 -1458657 1700170 -1265778 1319812
66e86033A143219A51263a136954a85998B64517b472453F59307R39834f07372M4901
$$ -586033 1143219 151263 -1136954 -185998 264517 -2472453 659307 1599141 -607372 -562471
56e62471k96519B038267e89855J11307a53371j91278A190986b45084g5627k47998
$$ -562471 -858990 2038267 -589855 -478548 -153371 -344649 1190986 -245084 -75627 -323625
46c23625A65916a02354B001335B89318M96608d62982p24567F00167A68796K80967
$$ -323625 165916 -102354 2001335 289318 785926 -462982 -1187549 600167 168796 449763
36D49763A52342J146611O98909a453924A033674k778k2387D35479e13320B51253
$$ 449763 152342 1298953 1997862 -1453924 1033674 1030896 1008509 435479 -513320 251253
25e41100B53423d32358A117383a572171f5130p76134a51351p26765a13419D35083
$$ -541100 253423 -432358 1117383 -1572171 -65130 -841264 -151351 -878116 -113419 435083
14A331762h52094H31335j84518Q55654D03756c324102I48829e44099C75668Q58115
$$ 1331762 -852094 831335 646817 1502471 403756 -3324102 948829 -544099 375668 1233783
4A233783h46528j476884I42087h02286
$$ 1233783 -846528 -2323412 942087 -802286
##END=
