##TITLE=1337
##JCAMPDX= 6.0         $$ Bruker NMR JCAMP-DX V2.0
##DATA TYPE= NMR SPECTRUM
##DATA CLASS= XYDATA
##ORIGIN= NUTS EXPORT
##OWNER= Administrator
$$ 1.72 TOPSPIN		Version 2.1
$$ 2016-02-23 12:20:18.027 -0800  Administrator@X
$$ Compression mode = diff/dup
##.OBSERVE FREQUENCY= 90.275459
##.ACQUISITION MODE= SIMULTANEOUS (DQD)
##.ACQUISITION SCHEME= undefined
##.AVERAGES= 16
##.DIGITISER RES= 22
##SPECTROMETER/DATA SYSTEM= 
##.PULSE SEQUENCE= zg30
##.SOLVENT NAME= None
##.SHIFT REFERENCE= INTERNAL, None, 1, 10.33123
##AUDIT TRAIL= $$ (NUMBER, WHEN, WHO, WHERE, PROCESS, VERSION, WHAT)
$$ ##TITLE= Audit trail, TOPSPIN		Version 2.1
$$ ##JCAMPDX= 5.01
$$ ##ORIGIN= Bruker BioSpin GmbH
$$ ##OWNER= Administrator
$$ $$ E:/data/jwist/nmr/1337/1/pdata/1/auditp.txt
$$ ##AUDIT TRAIL=  $$ (NUMBER, WHEN, WHO, WHERE, PROCESS, VERSION, WHAT)
(   1,<2016-02-23 08:52:31.146 -0800>,<Administrator>,<X>,<jcamp>,<TOPSPIN 2.1>,
      <fromjdx created from
       E:\data\jwist\nmr\uniandes\1337
       data hash MD5: 8K
       B9 92 EF 39 79 2F E9 D6 EA 2E E1 8B 80 78 B7 09>)
$$ ##END=
$$ 
$$ $$ hash MD5
$$ $$ 76 57 1E 14 BC 36 E5 DE 84 6E 1C 7F DD 24 E4 6A
##$RELAX= 
$$ Bruker specific parameters
$$ --------------------------
##$DU= <E:>
##$EXPNO= 1
##$NAME= <1337>
##$PROCNO= 1
##$TYPE= <nmr>
##$USER= <jwist>
##$ACQT0= 0
##$AMP= (0..31)
100 100 100 100 100 100 100 100 100 100 100 100 100 100 100 100 100 100
100 100 100 100 100 100 100 100 100 100 100 100 100 100
##$ANAVPT= 1
##$AQSEQ= 0
##$AQ_mod= 3
##$AUNM= <au_zg>
##$AUTOPOS= <>
##$BF1= 90.275459
##$BF2= 400.02
##$BF3= 400.02
##$BF4= 400.02
##$BF5= 400.02
##$BF6= 400.02
##$BF7= 400.02
##$BF8= 400.02
##$BYTORDA= 0
##$CFDGTYP= 0
##$CFRGTYP= 0
##$CHEMSTR= <none>
##$CNST= (0..63)
1 1 145 1 1 1 1 1 1 1 1 1 1 1 1 1 1 1 1 1 1 1 1 1 1 1 1 1 1 1 1 1 1 1 1
1 1 1 1 1 1 1 1 1 1 1 1 1 1 1 1 1 1 1 1 1 1 1 1 1 1 1 1 1
##$CPDPRG= <>
##$CPDPRG1= <>
##$CPDPRG2= <>
##$CPDPRG3= <>
##$CPDPRG4= <mlev>
##$CPDPRG5= <mlev>
##$CPDPRG6= <mlev>
##$CPDPRG7= <mlev>
##$CPDPRG8= <mlev>
##$CPDPRGB= <>
##$CPDPRGT= <>
##$D= (0..63)
0 1 0 0 0 0 0 0 0 0 0 0 0 0 0 0 0 0 0 0 0 0 0 0 0 0 0 0 0 0 0 0 0 0 0 0
0 0 0 0 0 0 0 0 0 0 0 0 0 0 0 0 0 0 0 0 0 0 0 0 0 0 0 0
##$DATE= 0
##$DBL= (0..7)
120 120 120 120 120 120 120 120
##$DBP= (0..7)
150 150 150 150 150 150 150 150
##$DBP07= 0
##$DBPNAM0= <>
##$DBPNAM1= <>
##$DBPNAM2= <>
##$DBPNAM3= <>
##$DBPNAM4= <>
##$DBPNAM5= <>
##$DBPNAM6= <>
##$DBPNAM7= <>
##$DBPOAL= (0..7)
0.5 0.5 0.5 0.5 0.5 0.5 0.5 0.5
##$DBPOFFS= (0..7)
0 0 0 0 0 0 0 0
##$DE= 6.5
##$DECBNUC= <off>
##$DECIM= 2432
##$DECNUC= <off>
##$DECSTAT= 4
##$DIGMOD= 1
##$DIGTYP= 12
##$DL= (0..7)
0 120 120 120 120 120 120 120
##$DP= (0..7)
150 150 150 150 150 150 150 150
##$DP07= 0
##$DPNAME0= <>
##$DPNAME1= <>
##$DPNAME2= <>
##$DPNAME3= <>
##$DPNAME4= <>
##$DPNAME5= <>
##$DPNAME6= <>
##$DPNAME7= <>
##$DPOAL= (0..7)
0.5 0.5 0.5 0.5 0.5 0.5 0.5 0.5
##$DPOFFS= (0..7)
0 0 0 0 0 0 0 0
##$DQDMODE= 0
##$DR= 22
##$DS= 2
##$DSLIST= <SSSSSSSSSSSSSSS>
$$ [...]
##$SPOFFS= (0..31)
0 0 0 0 0 0 0 0 0 0 0 0 0 0 0 0 0 0 0 0 0 0 0 0 0 0 0 0 0 0 0 0
##$SUBNAM0= <"">
##$SUBNAM1= <"">
##$SUBNAM2= <"">
##$SUBNAM3= <"">
##$SUBNAM4= <"">
##$SUBNAM5= <"">
##$SUBNAM6= <"">
##$SUBNAM7= <"">
##$SUBNAM8= <"">
##$SUBNAM9= <"">
##$SW= 20.5580556627758
##$SWIBOX= (0..15)
0 0 3 4 0 0 0 0 0 0 0 0 0 0 0 0
##$SW_h= 8223.68421052631
##$SWfinal= 0
##$TD= 65536
##$TD0= 1
##$TE= 300
##$TE2= 300
##$TE3= 300
##$TEG= 300
##$TL= (0..7)
0 120 120 120 120 120 120 120
##$TP= (0..7)
150 150 150 150 150 150 150 150
##$TP07= 0
##$TPNAME0= <>
##$TPNAME1= <>
##$TPNAME2= <>
##$TPNAME3= <>
##$TPNAME4= <>
##$TPNAME5= <>
##$TPNAME6= <>
##$TPNAME7= <>
##$TPOAL= (0..7)
0.5 0.5 0.5 0.5 0.5 0.5 0.5 0.5
##$TPOFFS= (0..7)
0 0 0 0 0 0 0 0
##$TUNHIN= 0
##$TUNHOUT= 0
##$TUNXOUT= 0
##$USERA1= <user>
##$USERA2= <user>
##$USERA3= <user>
##$USERA4= <user>
##$USERA5= <user>
##$V9= 5
##$VALIST= <valist>
##$VCLIST= <CCCCCCCCCCCCCCC>
##$VD= 0
##$VDLIST= <DDDDDDDDDDDDDDD>
##$VPLIST= <PPPPPPPPPPPPPPP>
##$VTLIST= <TTTTTTTTTTTTTTT>
##$WBST= 1024
##$WBSW= 4
##$XGAIN= (0..3)
0 0 0 0
##$XL= 0
##$YL= 0
##$YMAX_a= 1113212160
##$YMIN_a= -2165618.176
##$ZGOPTNS= <>
##$ZL1= 120
##$ZL2= 120
##$ZL3= 120
##$ZL4= 120
##$ABSF1= 10
##$ABSF2= 0
##$ABSG= 5
##$ABSL= 3
##$ALPHA= 0
##$AQORDER= 0
##$ASSFAC= 0
##$ASSFACI= 0
##$ASSFACX= 0
##$ASSWID= 0
##$AUNMP= <proc_1d>
##$AXLEFT= 0
##$AXNAME= <>
##$AXNUC= <off>
##$AXRIGHT= 0
##$AXTYPE= 0
##$AXUNIT= <>
##$AZFE= 0.1
##$AZFW= 0.1
##$BCFW= 1
##$BC_mod= 2
##$BYTORDP= 0
##$COROFFS= 0
##$CY= 15
##$DATMOD= 1
##$DC= 2
##$DFILT= <>
##$DTYPP= 0
##$F1P= 0
##$F2P= 0
##$FCOR= 0.5
##$FTSIZE= 0
##$FT_mod= 4
##$GAMMA= 1
##$GB= 0
##$INTBC= 1
##$INTSCL= 1
##$ISEN= 128
##$LB= 0.3
##$LEV0= 0
##$LPBIN= 0
##$MAXI= 10000
##$MC2= 0
##$MEAN= 0
##$ME_mod= 0
##$MI= 0
##$NCOEF= 0
##$NC_proc= -9
##$NLEV= 6
##$NOISF1= 0
##$NOISF2= 0
##$NSP= 1
##$NTH_PI= 0
##$NZP= 0
##$OFFSET= 10.33123
##$PC= 1
##$PHC0= 0
##$PHC1= 0
##$PH_mod= 0
##$PKNL= yes
##$PPARMOD= 0
##$PPDIAG= 0
##$PPIPTYP= 0
##$PPMPNUM= 2147483647
##$PPRESOL= 1
##$PSCAL= 4
##$PSIGN= 0
##$PYNMP= <proc.py>
##$REVERSE= no
##$SF= 90.2745263533486
##$SI= 8192
##$SIGF1= 0
##$SIGF2= 0
##$SINO= 400
##$SIOLD= 32768
##$SPECTYP= <>
##$SREGLST= <1H.CDCl3>
##$SSB= 0
##$STSI= 0
##$STSR= 0
##$SW_p= 1497.18866228788
##$SYMM= 0
##$S_DEV= 0
##$TDeff= 0
##$TDoff= 0
##$TI= <>
##$TILT= no
##$TM1= 0
##$TM2= 0
##$TOPLEV= 0
##$USERP1= <user>
##$USERP2= <user>
##$USERP3= <user>
##$USERP4= <user>
##$USERP5= <user>
##$WDW= 1
##$XDIM= 8192
##$YMAX_p= 1113211904
##$YMIN_p= -2165248
##$CURPLOT= <PDFCreator>
##$CURPRIN= <$PDFCreator>
##$DFORMAT= <normdp>
##$LAYOUT= <+/1D_H.xwp>
##$LFORMAT= <normlp>
##$PFORMAT= <normpl>
##$SURQMSG= 1
$$ End of Bruker specific parameters
$$ ---------------------------------
##XUNITS= HZ
##YUNITS= ARBITRARY UNITS
##XFACTOR= 0.182762287876938
##YFACTOR= 1
##DELTAX= -0.182762287876938
##NPOINTS= 8192
##FIRSTX= 1497.0059
##FIRSTY= 0
##LASTX= 0
##MAXY= 1113211904
##MINY= -2165248
##XYDATA= (X++(Y..Y))
8191@D30592J13152k14528P50080D48000a20320B3040c19488m25984n2224B35008
8179h63744M26496L9424E92896k37056R47200A15712L79904q6016a57184n31968
8169f89152A02400c18976k03264A64352b0480l50208k54464C92192e99040A65376
8158D76672e96992C9936f55360l77344c43040p79776c00032h704E64224h38144
8147I9328M23936k26816O08768f98368F44608F9632P36768c8912k57536E42208
8136c45600B42688h60160A082880f61504h2944l09248A297408n27872l58912l4816
8126C75808c8400l91680K04288D41344O83520l77344b10944F2464c85024l45600
8116g30624f6048r23136m33152d63872b04288r49760C00032g7824B76992P01952
$$ y = [0, 430592, 543744, 329216, 1079296, 448000, -120320, 23040, -319488, -745472, -797696, 235008, -863744, -437248, -397824, 592896, 355840, 1303040, 115712, 495616, 409600, -157184, -689152, 102400, -318976, -522240, 164352, -20480, -370688, -625152, 392192, -599040, 165376, 476672, -596992, 39936, -655360, -1032704, -343040, -1122816, -300032, -8704, 564224, -838144, 99328, 523264, 296448, 905216, -698368, 644608, 69632, 806400, -38912, -296448, 542208, -345600, 242688, -860160, 1082880, -661504, -82944, -392192, 1297408, 769536, 410624, 375808, -38400, -430080, -225792, 441344, 1124864, 747520, -210944, 62464, -385024, -730624, -66048, -989184, -1422336, -463872, -204288, -1154048, 300032, -77824, 276992, 978944]
8106I78944c58400C52256J29024c86560Q192j43360K19136J40288A45920i4720
8095d71040r9328C46112a065472B97984L66080A72544K94400c14880k048F11328
8084d33664F54336b3552o02624J76128R0624o17984G01952j15712H1408b49344
8073B37056O48704k9696A69472L22048N56032C60960b62656n12O6048F64064k95424
8062C68640a29024o23104K32960j10592E49888M77184f69696a44896A12640K65216
8052C77856M09088d73600A086464a144320M86400K66752B64704a07008C07712
8042A39776c35360G39328e15072K24768Q0896I0624g08096L03616i4720C76320
8031f59968l83488a37216H55040c52256B71872f21056A44384b94400m0960I9328
$$ y = [978944, -358400, 352256, 481280, -386560, -378368, -521728, -302592, -162304, 145920, -94720, -471040, -570368, 346112, -1065472, 297984, 664064, 172544, 466944, -314880, -316928, 611328, -433664, 654336, -23552, -626176, -450048, -359424, -977408, 701952, 586240, 81408, -249344, 237056, 885760, 856064, 169472, 491520, 1047552, 360960, -262656, -263168, -197120, 664064, 368640, -129024, -752128, -519168, -629760, 549888, 1027072, -669696, -144896, 112640, 377856, 786944, -473600, 1086464, -1144320, -657920, -391168, 264704, -107008, 307712, 139776, -335360, 739328, -515072, -290304, -209408, 90624, -708096, -404480, -94720, 376320, -659968, -1043456, -137216, 855040, -352256, 271872, -621056, 144384, -294400, -335360, 99328]
8020E07392K22208e43232R9328B28864d94080D90496K33984b67264l89632A98656
8009D70016d94592l99872G49568e76000K04288k04800H39680E1200O45120H2944
7998A65888L83488k44224d32128H1408e78560E39136e13024G08608g71072I78944
7987h13568D80256e17632D68992K6624A07520O97856C08224d88960a08032C09248
7976A151488c51232G38304H2432L26656q3968c6352F32832i03168B06848J221632
7966A428480E64224k41664D6592c53280Q704H69376i16480d06528g2192A143808
7955I77920c584A89952J9968Q3456a122816b41152A1264g75680B51904e79584
7944i728C74272P37792f46656F4000L2768C0208R2672g69024C76320j87904k048
$$ y = [507392, 729600, -543232, -443904, 228864, -494080, 490496, 724480, -267264, -656896, 198656, 470016, -494592, -894464, 749568, -576000, -371712, -576512, 839680, 51200, 696320, 82944, 165888, 549376, 305152, -432128, 81408, -578560, 539136, -513024, 708608, -771072, 978944, -813568, 480256, -517632, 468992, 495616, 107520, 805376, 308224, -488960, -108032, 309248, 1151488, -351232, 738304, 82432, 409088, 325120, -36352, 632832, -903168, 206848, 1428480, 564224, 322560, 46592, -353280, -344576, 869376, -916480, -406528, -72192, 1143808, 977920, -3584, 189952, 209920, 293376, -1122816, -241152, 11264, -775680, 251904, -579584, -9728, 374272, 1112064, -646656, 64000, 96768, 30208, 122880, -769024, 376320, 188416, 186368]
7933A86368f33856A37216J77152q192M44416A32608E3760J76128b13504k08384
7923d21888i2672C52256b06848r83040C0208b59072D88960M45440a63840N120
7913a58720K7136C99360b53952A408000a68960C9936j2800g35744a66912B96448
7902D7104g8848n35552a04960E81120j04960P12704l34336g68512k4064E632M66432
7891D72064g88480K91328A458176h0384n62176D56704a88928A79200L42528I6256
7880E37600j29024L47136A9456g25504G37792H6016b38080A4848a08544l08224
7870d16768a69472F51776j0752E8880e69856B81600h66304c08736A01376f52288
7859h17152E35552A99168h2944C13344r4720c29728g2192C47136M63360l55328
$$ y = [186368, -633856, 137216, 314368, 306176, 750592, 132608, 53760, 229888, -213504, -421888, -92672, 352256, -206848, -1189888, 30208, -259072, 488960, 934400, -163840, -158720, -131584, 399360, -253952, 1408000, -168960, 39936, 27136, -735744, -166912, 296448, 47104, -78848, -614400, -104960, 581120, 476160, 1188864, 854528, -768512, -792576, 5632, 472064, -788480, -497152, 1458176, -80384, -642560, 456704, -188928, 179200, 521728, 96256, 537600, 408576, 755712, 19456, -725504, 737792, 86016, -238080, 14848, -108544, -416768, -169472, 651776, 641024, 58880, -569856, 281600, -866304, -308736, 101376, -652288, -817152, 535552, 199168, -82944, 313344, 218624, -329728, -72192, 347136, 810496, 455168]
7849D55168J83808c65056A37216e29920a11104b8672C48160A11104a33632I73824
7838C51232J07520c41504A00352Q3968e3248G14752A05984f38464A013248A75616
7827F29248c89632D23424f13888E10464e94944D43392b15040l03104D08576P47008
7817A155584a144320A013248B26304L88608a52576k28864A91488L61472O9632
7808F22592j43872A68448O56384B21184Q65792f17984H11008q3968j4848B3552
7797B0480M3520J121280E47328L23072j3312B06848e9904m91520E18144h3968
7786d50560C98336K57536d07040j08544C44576g5264G27552I9328d77696D63872
7775I82016c21536E38624j27488F7072L96800n0176c57376a6384j044480a84320
$$ y = [455168, 638976, -365056, 137216, -529920, -111104, -28672, 348160, 111104, -133632, 973824, 351232, 458752, -341504, 100352, 184320, -53248, 714752, 105984, -638464, 1013248, 175616, 629248, -389632, 423424, -613888, 510464, -594944, 443392, -215040, -518144, 408576, 1155584, -1144320, 1013248, 226304, 614912, -152576, -381440, 191488, 552960, 622592, 478720, 168448, 824832, 221184, 1086976, -617984, 811008, 727040, 712192, 23552, 20480, 64000, 1185280, 547328, 870400, 857088, 206848, -59904, -551424, 518144, -83968, -450560, 398336, 655872, -407040, -515584, 344576, -75264, 727552, 99328, -477696, 463872, 982016, -321536, 538624, 411136, 67072, 463872, 413696, -357376, -16384, -1060864, -184320]
7764a29024A97632b25792J4848D58752O38464c13344D86400d01408h9600E83680
7753a103360B37568J80224a82272n58080B45248J2288N1712f74304J66400F08256
7742a104896D52608d37760C61472Q37632C87072p8848a15712A52064a20320A76128
7731a74592H49920q7552b25280C21536c84512D25984M9152q0384K83648a5872
7720f42560c09248r9328E05344J28000f34880I01120j16224l06176L90656B26816
7709g63904F53824B17088b24256B70848d9664j09056o75840A86880a6896E21728
7698B71360J42848J63328o4512c65568H8576K56000b59584Q7040l584C97824b94400
7686B42176J279488o31808B80064L15904j0752e13024B560M75136M8128A26976
$$ y = [-129024, 197632, -225792, -210944, 458752, 1097216, -313344, 486400, -401408, -89600, 583680, -1103360, 237568, 417792, -182272, -740352, 245248, 257536, 309248, -674304, -507904, 608256, -1104896, 452608, -437760, 361472, 1199104, 387072, 308224, -115712, 152064, -120320, 176128, -174592, 849920, 762368, -225280, 321536, -384512, 425984, 475136, 394752, 678400, -15872, -642560, -309248, -408576, 505344, 633344, -634880, 901120, 784896, 478720, 869376, 226816, -763904, 653824, 217088, -224256, 270848, -49664, -158720, -834560, 186880, -16896, 521728, 271360, 414208, 577536, 513024, -365568, 88576, 344576, -259584, -172544, -176128, 397824, -294400, 242176, 1521664, 889856, 280064, 595968, 585216, -513024, 2560, 477696, 525824, 126976]
7675B01728J150464b83648A131008D63360L36384a75616A53088d57728J55648
7666c02080j8432j4336C13344d3008D76672J35168a24416G89504B58560M19840
7656F78400M49536C60960O13888j30560l35872B29376j09568J746944H32512L22048
7646A154560A16736K33984K80064c18976H24832l81952J88928k58560O01600m12160
7636E62688A79200a18272G97184d29568A265664A30048Q48384L13856c9424A885696
7625A85344p3216J368576A99680R05728C91680a04448F75840O7072f87616H57088
7614A12640e6320B77504m7616f73792J92000o4512H21760a69984E70880a088512
7603E65760B55488b12480E74976a36704A099264D79744j81248L04640B80064C072
$$ y = [201728, 1352192, -283648, 1131008, 463360, 799744, -175616, 153088, -457728, -302080, -320512, -334848, 313344, -43008, 476672, 611840, -124416, 789504, 258560, 678400, 1127936, 360960, 974848, 844288, 508416, 229376, 119808, 1866752, 832512, 1154560, 116736, 350720, 630784, -318976, 824832, 442880, 631808, 373248, 974848, 562688, 179200, -118272, 797184, -429568, 1265664, 130048, 978432, 1292288, -39424, 1885696, 185344, 112128, 1480704, 199680, 1105408, 391680, -104448, 675840, 742912, -687616, 857088, 112640, -56320, 277504, 229888, -673792, -481792, -546304, 821760, -169984, 570880, -1088512, 565760, 255488, -212480, 574976, -136704, 1099264, 479744, 298496, 603136, 280064, 3072]
7592B69824j17760b4576H44800M0448C63008b60096k72896E53984b96448C68640
7581A022976M21376F23616A03936K98496M73088J20320h14080J12128B22720n4784
7571A67936e56032K02240H34048B01216N50400c57888B95936b68288o27200c13856
7560C55840L65056d02432i216D4544M57728h59136C03616a35680n24800A444352
7549b73408I03168l0208A77664b07360A608192G18336K16064k2016C48672e18656
7538A012736j62816C62496J61280J04448k43712K31936B74944Q89856n65248N97504
7528A197056K8160E07904M87424g16288b29376E24800Q61184I3184J092608m65408
7518G20384P56224J29024G34208R16480E05344J13664N29408l92192l53792G8848
$$ y = [269824, 152064, -24576, 844800, 885248, 363008, -260096, -532992, 553984, -296448, 368640, 1022976, 1444352, 623616, 103936, 402432, 875520, 995840, -814080, -701952, 222720, 167936, -556032, -353792, 834048, 201216, 751616, -357888, 295936, -268288, -895488, -313856, 355840, 720896, -402432, -9216, 44544, 502272, -859136, 303616, -135680, -660480, 1444352, -273408, 903168, 872960, 177664, -207360, 1608192, 718336, 934400, 912384, 348672, -518656, 1012736, 849920, 362496, 523776, 628224, 384512, 616448, 274944, 1164800, 599552, 1197056, 1225216, 507904, 995328, -716288, -229376, 524800, 1385984, 93184, 1185792, 720384, 1476608, 1605632, 734208, 1650688, 505344, 619008, 1148416, 756224, 402432, 78848]
7507E00736M32640c53280B81088A7408N35040F5536M55168O28224Q2944L57376
7497A589248b04288C26656J294336o69184l0208C14368M63872Q8576P81824j37216
7487A511424F51776M50560B04288K57536b21184H95488K08896L7888n37600J413632
7477B018304l04640l68640n98016O08256K38080n9392m37760K33984E34016P44960
7467A278976K8672l6864o4000K37056K36032n68832b79552E17120n6320K73920
7457G34720K13504C26144g6800A680896j6896k19648o3488m91520O2464P24992
7447A676800j48480l88608k31936j14688N47328a47968F79936b03776H59136C73760
7436f67136a02400l65056A193472j71008l31264l43040J246208D02944b86720
$$ y = [500736, 933376, -353280, 281088, 17408, 552448, 65536, 520704, 1148928, 1231872, 1589248, -204288, 326656, 1620992, 951808, 921600, 314368, 778240, 866816, 1648640, 1511424, 651776, 1102336, 204288, 461824, -221184, 895488, 1104384, 1142272, 604672, 2018304, 1713664, 1345024, 747008, 1355264, 1593344, 1533952, 1096192, 1330176, 534016, 1278976, 1307648, 1270784, 1206784, 1443840, 1679872, 1111040, -279552, 517120, 460800, 734720, 948224, 326144, -76800, 1680896, 1664000, 1444352, 1380864, 889344, 951808, 1676800, 1528320, 1139712, 907776, 793088, 1340416, -147968, 679936, -203776, 859136, 373760, -667136, -102400, -467456, 1193472, 1022464, 691200, 348160, 1594368, 402944, -286720]
7426d32640A081344a30560A199616d6080B10944c23072E84704j99680M29568l14368
7416E00224c5840l49184A19808M50048A99680D3008L85024b24256A439232m50560
7406I88672o4000c83488C41504Q30464b86720A08544K2528K048P25504l08224
7396E50400B73408E4272N02784K9696L28192M80256n37600k43200r5744I0112
7385A27488D7104J3312N46816A51552O94784p6288l37408L69664A66400r216N27872
7374F85056J092096b80576A99168c93216A033216N86240c45600a55648C04128
7364A376256c4816E14048a93536A015808E9904d03968B00704J628160D07552N81632
7354I89184F144N41184k19136O88640k18624a5872B35520L54816D7104a50528
$$ y = [-432640, 1081344, -130560, 1199616, -46080, 210944, -323072, 584704, 385024, 814592, 500224, -35840, -385024, 119808, 569856, 199680, 43008, 428032, -224256, 1439232, 988672, 924672, -383488, 341504, 1171968, -286720, 108544, 131072, 133120, 858624, 550400, 273408, 54272, 557056, 586752, 914944, 1395200, 857600, 614400, 518656, 90112, 127488, 47104, 60416, 607232, 151552, 846336, 770048, 432640, 802304, 166400, 157184, 685056, 1777152, -280576, 199168, -393216, 1033216, 1619456, -345600, -155648, 304128, 1376256, -34816, 514048, -193536, 1015808, 59904, -403968, 200704, 1828864, 407552, 989184, 6144, 547328, 328192, 1016832, 798208, -15872, 235520, 590336, 47104, -150528]
7343D39808A37216M73088K67264B89792b48320C84512e87776H08448k65728H1408
7332B65728Q75008k61120G168O76864L81440M6080L5328B66240c73760a83808
7321B46272M63872K47808K48320m21376b52928p4752A730560A99680R61536a04960
7310A524736B15040H0384N27872E7856b10432F10304a34656A102848c98336G22944
7299a28512B57024P45984A83296g1168B31424K0480L38944P8848k64192N46816
7289I52320m6592k81600J116672H30976d20352L9936H93440K27840E16096P79776
7279A295872I5232g2192C05152L95264N8880l31776N13536p1680K60096E16608
7268a45408A830912q03840D42880P09632l79392J71520l56352N31456C06688J391616
$$ y = [439808, 137216, 610304, 877568, 289792, -248320, 384512, -587776, 808448, 542720, 81408, 265728, 1140736, 879616, 7168, 684032, 1065472, 1111552, 1146880, 266240, -373760, -183808, 246272, 710144, 957952, 1206272, 784896, -252928, -327680, 1730560, 199680, 1161216, -104960, 1524736, 215040, 80384, 608256, 57856, -210432, 610304, -134656, 1102848, -398336, 722944, -128512, 257024, 1003008, 183296, -71168, 231424, 251904, 590848, 669696, 405504, 952320, 905728, 624128, 1740800, 830976, -420352, -380416, 893440, 1121280, 516096, 1295872, 95232, -72192, 305152, 700416, 759296, 427520, 941056, 869376, 1129472, 516608, -145408, 1830912, 1027072, 442880, 1152512, 773120, 944640, 588288, 1119744, 306688, 1698304]
7258A698304n23264J066496j029632Q38656o90176J651712A077248m08064p8336
7249E90848K27328R04704q50432l11296O93248E40160K51392P48032n03296C31264
7238A95072b4064I19040e6832b4064A053184p3216R0112K07360C97312a94048
7227F71232J256448e28384F19008H192J149440D33664I2672N32480J356800A25952
7216A301504j79200b16576A085440j38752m66944k32960E0176L75296L67104J39776
7206I32352A63840b13504B37056R32352L92704c20512F67648k52928N00736j39264
7196G76192k3040j60768c41504E83168d60288E98528e42208b46784C92704J60768
7186E53472O15424a44384D79744J02912p5264R73824l28704b24768N0176I728
$$ y = [1698304, 1175040, 2241536, 1211904, 2050560, 1360384, 3012096, 1077248, 669184, 590848, 818176, 1722880, 872448, 561152, 1254400, 540160, 791552, 1539584, 1036288, 331264, 195072, -24064, 919040, -56832, -24064, 1053184, 979968, 1070080, 1277440, 397312, -194048, 671232, 1927680, -528384, 619008, 8192, 1157632, 433664, 92672, 625152, 1981952, 125952, 1301504, 1122304, -216576, 1085440, 946688, 479744, 246784, 50176, 425472, 792576, 932352, 163840, -213504, 237056, 1169408, 1562112, -320512, 667648, 414720, 915456, 776192, 753152, 592384, -341504, 583168, -460288, 598528, -542208, -246784, 392704, 553472, 1168896, -144384, 479744, 582656, 507392, 1481216, 1152512, -224768, -174592, 9728]
7175F26176N71904N06368n69344k01216A60768R99424k27328a74080G19360J91488
7165I10848A42336f86080C70688j11104g70560C09248J54624O07744j68960B57536
7154G69024e89312K70336A19808K31936K36032Q1920j32608N7344J39264N13536
7144A247232l35872k53952c7888A419264E64224q7552j82784L82976n8368B73408
7133G2704L14880A33120L75296r8816P44448E25312A63840J536P61344j22880
7123H03840M42880D31616K58048B55488l5840L74272J0240M48512d4544I49760
7112A076224k95936R04192n71904O87616C81440J104896l7376J16736K91840m78720
7102A378816n57568p9872M8640Q65792B14528K44224M82816m03968J961984F47680
$$ y = [626176, 1198080, 1704448, 1135104, 933888, 160768, 1160192, 932864, -174080, 719360, 910848, 142336, -686080, 370688, 259584, -770560, 309248, 463872, 1071616, 902656, 257536, 769024, -589312, -318976, 119808, 351744, 587776, 669696, 537088, 594432, 733696, 1247232, 911360, 657408, -37888, 1419264, 564224, 476672, 293888, 676864, 618496, 273408, 72704, 387584, 133120, 508416, 409600, 1154048, 525312, 163840, 165376, 926720, 803840, 1246720, 431616, 689664, 255488, 219648, 593920, 604160, 1052672, -44544, 949760, 1076224, 780288, 1684480, 1112576, 1800192, 381440, 1486336, 1448960, 1565696, 1857536, 1378816, 821248, 741376, 790016, 1655808, 214528, 458752, 941568, 537600, 2499584, 647680]
7091A512960p54688M8640l98848n1200R34912j02912j89952Q81664E92384B92864
7080A195520R08800J68960A125376q7552m91520J240064m52608C43040J453056
7071A796096F66624j10592B68800O03648J972736j029120n26848k65728j49504
7062H73984D31104J062912M34176D60800Q01280r0624n76512A86368J483264p15264
7052I54368J118208r93280m27008p4240L17952l48160R28768k61632a13664D49024
7041A325568m62336r8304A93536R48224M34688n2736o94784C95264E7856J569792
7031A627648j024k8160G59296M74624l18976l56864Q69888j47968F25152P35232
7021A360384E76000j32096O79936J47456E35552N68832j65376A19808J020928
$$ y = [1512960, 758272, 806912, 408064, 356864, 1291776, 1188864, 998912, 1880576, 592384, 292864, 1195520, 2104320, 2273280, 1125376, 1037824, 546304, 1786368, 1333760, 343040, 1796096, 666624, 556032, 268800, 872448, 2845184, 1816064, 1289216, 1023488, 873984, 431104, 1494016, 1928192, 460800, 1262080, 1171456, 594944, 186368, 1669632, 954368, 2072576, 1079296, 652288, 578048, 896000, 547840, 1476608, 1214976, -113664, 449024, 1325568, 863232, 764928, 193536, 1141760, 1576448, 1523712, 828928, 395264, 57856, 1627648, 1626624, 1598464, 759296, 1233920, 914944, 558080, 1427968, 1280000, 625152, 1360384, 576000, 443904, 1123840, 1271296, 535552, 1104384, 939008, 119808, 1140736]
7012A140736D37760d12160A021440L17952J19296G15264M59776p1168l10784L82976
7002A176064K85696m54144m40832P74144E54496K66240P47008G39840l08736J200128
6992A631232j24416A25440J32096J032192m35200m1472J44384N09952j83808l26656
6982I56928J658368A196544r4720L64544R80992l9424A163776J082368J602560
6973C848704k08384m0448J949184j296384Q26368P14752K88256n32992j526272
6964D022784m75648n67808J141760j692160q9088q76032Q3968m12672D64896Q11008
6954A275904j52064l63008q4992M38784K93376E69856k02752J92512P13216K3040
6944A295872J78176L82464H61184m13184K00192O71744n47328A07520N95456j63328
$$ y = [1140736, 437760, -412160, 1021440, 1339392, 1458688, 715264, 1175040, 1103872, 793088, 1176064, 1461760, 1007616, 566784, 1340928, 554496, 820736, 1567744, 739840, 431104, 1631232, 1506816, 125440, 257536, 1289728, 854528, 813056, 957440, 1467392, 1283584, 956928, 2615296, 1196544, 1101824, 1466368, 2447360, 2407936, 1163776, 2246144, 3848704, 3640320, 3599872, 5549056, 4252672, 5079040, 5793792, 6082048, 5549056, 4022784, 3547136, 2979328, 4121088, 2428928, 2339840, 1463808, 1547776, 1135104, 464896, 1275904, 1123840, 760832, 675840, 1114624, 1408000, 569856, 367104, 559616, 1272832, 1295872, 1474048, 1856512, 861184, 448000, 648192, 1319936, 772608, 107520, 702976, 539648]
6934E39648N78048M04992l33824l46112l02592L02080R4720M79744k85696B92864
6923C02592K8672R05728D05504g9872A147392e70880B01728J83808J661952r49248
6913A098240M00384o75328K35008l70176O12352k71872j23904D37248J217536
6904A654784m02432O98368n07904D14208P79776J82272L37920N9392A28512J346560
6894A475072l40480n8368M4032A54624R3696P79264m29568Q61184q7040n19168
6884H52992C03616j22368c31264A622016n81632N87264N59104r62560B02240R88160
6874A190400l79904L61984B83136N18656Q34560F03648P35744k80064l72224J98144
6864H85248J04448j66912Q23296j75104j80224O40000E16096j43872O33344j05472
$$ y = [539648, 1117696, 1522688, 1188864, 842752, 540160, 842240, 936960, 1416704, 1131008, 292864, 302592, 331264, 1236992, 405504, -79872, 1147392, -570880, 201728, 385536, 2047488, 1098240, 1498624, 823296, 1058304, 688128, 1300480, 1028608, 904704, 437248, 1654784, 1252352, 1950720, 1442816, 414208, 1193984, 1376256, 1714176, 1773568, 128512, 1475072, 1134592, 1076224, 1120256, 154624, 248320, 1027584, 598016, 1459200, 1372160, 852992, 303616, 181248, -331264, 1622016, 1040384, 1627648, 2186752, 1224192, 202240, 1190400, 810496, 1172480, 283136, 801792, 1636352, 603648, 1339392, 1059328, 687104, 885248, 989696, 822784, 1646080, 1470976, 1290752, 1930752, 516096, 372224, 1005568, 900096]
6854I00096N91872n05856l28192j8432N64736M91008m57216r3696M11648C29216
6843A461760B55488L50208J38240M53632m04480B62144R24160A37728K57024J05472
6833E00224R75360J84320k71360C00544O39488g76704A89440M3520K87232Q63232
6823A383424M19840m79744L09248G73120O88640p07072N8880n3248j02912Q51968
6813A509376n99040j96608J116160G96672P69536A59744N96480O45120d3520G63904
6802D52096M54656J29024L10272k30912N79072H35072Q30464M74624p00416K8672
6792A468416K3040B28864M34176j27488K206208A309184l75296Q4992Q45824J54112
6782B018816p81824m30592L62496K44736R6256F02624O12864M1984C63008J821696
$$ y = [900096, 1491968, 986112, 657920, 639488, 1204224, 1695232, 1238016, 1144320, 1555968, 329216, 1461760, 255488, 605696, 743936, 1197568, 793088, 262144, 1186304, 137728, 394752, 500224, 1475584, 1659904, 1388544, 300544, 940032, -776704, 189440, 232960, 520192, 1383424, 1803264, 1323520, 1632768, 773120, 1461760, 754688, 813568, 760320, 657408, 1509376, 910336, 713728, 1829888, 796672, 1566208, 159744, 756224, 1401344, -43520, 763904, 452096, 906752, 1035776, 1346048, 1115136, 1694208, 835072, 1665536, 2140160, 1439744, 1468416, 1491456, 228864, 663040, 535552, 2741760, 1309184, 933888, 1018880, 1864704, 2018816, 1236992, 806400, 1168896, 1413632, 1509888, 602624, 1215488, 1257472, 363008, 2184704]
6772B184704o45120J274368A276416j11104l69152N08416r3696m42368N8880P22432
6762A549824n1712k26304k00704J745408m44416q44288r2160o6048A63328J849856
6752B013184D72576J594368o21568F68160J589248l54304m91008j05472n61152
6743G45472P29600K60096G29600k85184M01408C14880P63904l15392J041920l90656
6733A414656D89472l0720P40352j94048L1232N39648o33344J100800r82016J234432
6723B295808q30464M99712k36032m60800n46304N12000L08736J410048j072128
6714A880576P43424r18528O4512J670656j329664R72800l26656o85056J544704
6705C616768j394176k82624K89280R54880j053696J482752p27552p54688J060864
$$ y = [2184704, 1539584, 2813952, 1276416, 1165312, 796160, 1304576, 1210880, 768512, 827392, 1549824, 1498112, 1271808, 1071104, 2816512, 2372096, 1527808, 1435648, 1369600, 163328, 2013184, 472576, 2066944, 1445376, 668160, 2257408, 1903104, 1412096, 1306624, 745472, 1475072, 1735168, 729600, 444416, 845824, 314880, 1078784, 763392, 1805312, 1414656, 489472, 458752, 1199104, 1005056, 1036288, 1575936, 942592, 2043392, 1061376, 2295808, 1465344, 1965056, 1729024, 1268224, 721920, 1233920, 1542656, 2952704, 1880576, 2624000, 1705472, 1769984, 3440640, 2110976, 3083776, 2757120, 2072064, 3616768, 2222592, 1939968, 2229248, 3184128, 2130432, 3613184, 2885632, 2130944, 3191808]
6696C191808j580544N98528j50016n56544j94048K9696j76640Q38144K25280q61696
6686A363968P3728F35904J652736m22400P43936m70528M88448M62848p91040o35392
6676A664512P94112O85056L95776r13408j48992j32608O45632q3456r8304M9664
6666B857984k75968q2944O09792p76704n5808j8944m72064M19328J091584m10112
6656B886144l33312k74944M60288j346048k04800l75296J20832Q95488E16608
6646B17600P39840L32288J03424q1408L17440d7616A048576J197056F96320J235968
6636A932288j55136k06848Q04352j186816L66080l67616n09440L49184j29024
6627H97024N18656l25632O73792k48320J067520C50208P20384J05984J144832
$$ y = [3191808, 1611264, 2209792, 2059776, 1503232, 1309184, 1338880, 1162240, 2000384, 2225664, 1363968, 1437696, 635904, 2288640, 1866240, 2610176, 2139648, 2628096, 3090944, 2299904, 1664512, 2458624, 3143680, 3539456, 2626048, 2477056, 2344448, 2990080, 2906624, 2808320, 2857984, 2582016, 2499072, 3108864, 2332160, 2276352, 2257408, 1785344, 2204672, 3296256, 2886144, 2552832, 2277888, 2738176, 1392128, 1187328, 812032, 932864, 1828352, 516608, 217600, 957440, 1289728, 1393152, 1311744, 1629184, -47616, 1048576, 2245632, 696320, 1932288, 1777152, 1570304, 2374656, 1187840, 1553920, 1186304, 676864, 1026048, 897024, 1415680, 1090048, 1763840, 1515520, 2583040, 350208, 1070592, 1176576, 2321408]
6618B321408G74656M68992E56032J472000q03328L16416l95264L0720O56896n60640
6608A272832E80096O83520P13728%E38624j8432K93376K95424O1440R98400o59968
6597A508864j55648K30400L46112p45472O03648J1776p56224p3728Q1920K92352
6587A344000K38080J93536k22720k23232k06848P55712r14944r1136L73760M08064
6577A654272O30784M35712p16800O36928M18816m85376E44768J969664K33472
6568B747904r17504P32672j14688L74784q27392H33024R04192j98656J000448
6559B539008n69344M38272j21856Q9600G05024J054720Q9600k61120O21568o74304
6549A535488O34880p03488O59456j20320n98016J333760k47296k49344L20000
$$ y = [2321408, 774656, 1243648, 556032, 2028032, 1224704, 1541120, 1145856, 1176576, 1833472, 1272832, 580096, 1263616, 1977344, 1977344, 538624, 520192, 813568, 1108992, 1170432, 2168832, 1508864, 1353216, 1583616, 1929728, 1184256, 1787904, 1799680, 1043456, 969728, 1051648, 1344000, 1582080, 1775616, 1552896, 1329664, 1122816, 1878528, 963584, 872448, 1246208, 1654272, 2285056, 2720768, 2003968, 2640896, 3059712, 2574336, 544768, 2514432, 2747904, 1830400, 2563072, 2448384, 2823168, 1995776, 833024, 1737216, 1538560, 2539008, 1969664, 2407936, 2286080, 2375680, 705024, 1759744, 1849344, 1588224, 2209792, 1535488, 2170368, 1466880, 2126336, 2006016, 1408000, 2741760, 2494464, 2245120, 2565120]
6540B565120q59136J88928j94048K49344m62336p26528J384960q88320M16256
6531A674240C75296L85536K21696j05472M71040n9392J64352R19040q55040K89280
6521A806336j47968L2256K02752M17280P3216q53504N12O144J215488o65088n52448
6510A534976R9328J85856O1952R0112N24288R2672m03456k67264R44640o46656
6500B216448A008128J0240J189888j64864M24960q28928L00544G04512I5232J704960
6490A800192M26496q68352p2704N59104O00064p57248o09792K94912J298432j275904
6480A395200j51552N21728J13664K6624p34208J8944L43040N12000l93216M18816
6470B071040n03808J54624N51424j073664J015808l50720L34848p25504K90304
$$ y = [2565120, 1705984, 1894912, 1700864, 1950208, 1487872, 761344, 2146304, 1257984, 1674240, 375296, 760832, 982528, 877056, 1348096, 1288704, 1453056, 2372096, 1517056, 1806336, 1658368, 1690624, 1893376, 2310656, 2383872, 1530368, 1530880, 1537024, 2752512, 2087424, 1534976, 1634304, 1820160, 1882112, 1972224, 2496512, 2589184, 2185728, 1918464, 2863104, 2216448, 1008128, 1018368, 2208256, 2043392, 2468352, 1639424, 1939968, 704512, 95232, 1800192, 2226688, 1358336, 1285632, 1844736, 2444800, 1687552, 1077760, 1372672, 2671104, 1395200, 1243648, 1765376, 1879040, 1905664, 1171456, 1190400, 1533440, 2045440, 1652224, 2071040, 1567232, 1721856, 2273280, 1199616, 2215424, 1864704, 2199552, 1474048, 1764352]
6461A764352K101760j581056J07520l33824J269760n74976n28896j037312J266176
6452B453504P94112j189888Q6016r94304R05728j22880l95264K14528L60448p97184
6442A314816L96288K77504n73440L33312j1264J43872j13664L39456J51040m09600
6432A848320q87296R9328P24480k23232l4304N01760O56896A110016R07264o656
6422B010624j64864J94560l80416M04992N48352k27328q02816p23968J051136
6413A910272m1472N10976n60128R76896r7792j029120N77536J2800J24928m7104
6403B337792M19328m78208q69888J519104j428480J85856R04704j40288k68800
6394B181120H99072O77888K3040O90176l99360M08064l20000k14016J0752p54176
$$ y = [1764352, 3866112, 2285056, 2392576, 2058752, 3328512, 2753536, 2224640, 1187328, 2453504, 3247616, 2057728, 2143744, 1149440, 2055168, 1932288, 1537024, 1751552, 2112000, 1314816, 1711104, 1988608, 1415168, 1748480, 1737216, 1881088, 1767424, 2106880, 2257920, 1848320, 961024, 1060352, 1784832, 1561600, 1527296, 2029056, 2685952, 1110016, 2017280, 2010624, 1845760, 2040320, 1659904, 2064896, 2613248, 2385920, 1583104, 859136, 1910272, 1868800, 2379776, 1819648, 2796544, 2698752, 1669632, 2247168, 2259968, 2384896, 2337792, 2757120, 2278912, 1409024, 2928128, 1499648, 1685504, 2590208, 2449920, 2181120, 899072, 1576960, 1600000, 2290176, 1890816, 2298880, 1978880, 1764864, 1775616, 1021440]
6384A021440j82784Q35072m96640Q50432M74624k89280j11104J3312p94624J38240
6374A458688O32832l21536O4000D43904K511360j323008G33184L00032L18976
6365A352192D50048J410048L51744J20320k13504H28416J39264J442304j73056
6356B236928l81952j44896m1984k96960E98016J502720m76672R72288j033216
6347A563136j96608K68288p59808R01632n5808D82304k33472J489408k35008j51040
6337A352192O28224I63584l22560j34656J579008m85376l90144K48320J16736
6328A574912D88448M52096M75136J536K560L53280o44608Q77568m88448k38592
6318A278976J004032o96832L84000n57056O28224q70400Q09984m35712L81440
$$ y = [1021440, 838656, 1673728, 1177088, 2027520, 2502144, 2212864, 2101760, 2115072, 1320448, 1458688, 2091520, 1769984, 1833984, 443904, 2955264, 1632256, 733184, 1033216, 1352192, 450048, 1860096, 2211840, 2332160, 2118656, 828416, 967680, 2409984, 2236928, 1854976, 1710080, 1668096, 1371136, 598016, 2100736, 1624064, 2596352, 1563136, 1366528, 1634816, 875008, 1776640, 1720832, 482304, 248832, 1738240, 1503232, 1352192, 1980416, 963584, 641024, 506368, 2085376, 1600000, 1209856, 1458176, 1574912, 488448, 940544, 1415680, 1417216, 1419776, 1773056, 1128448, 2006016, 1517568, 1278976, 2283008, 1586176, 1970176, 1413120, 2041344, 1170944, 1980928, 1545216, 1926656]
6309A926656P5776o89664J08544j93024J053184j58720j51040M40832l79392O51776
6299B684928j180160L4304p8848P56736l63520m08576J595904n78560l86560q28416
6289A247232R90208J46944L60448A323520J85344Q57088L47648q26880L68640
6280B255360O59968q12544j32608o84544o9120o2976J711616I71264R74336n95456
6270A350144j39264Q02816r20576J030144k10432n06368K97472J92000P8336q77056
6260A097216J458688o34880q5504G23456J646592l30752l60960J052160l52768
6251B377728J085440j403392j46944o84032M608J540096M65920q65280q06912
6242A567232J530368k16064M30592A525760N04320J274368p76192k81600L52256
$$ y = [1926656, 2002432, 1312768, 1421312, 1228288, 2281472, 2122752, 1971712, 2412544, 2033152, 2684928, 1504768, 1539072, 1460224, 2216960, 1853440, 1444864, 3040768, 2462208, 2075648, 1247232, 2237440, 2384384, 2744832, 1323520, 1508864, 2365952, 2713600, 1886720, 2255360, 2915328, 2102784, 1970176, 1285632, 1216512, 1153536, 2865152, 971264, 1945600, 1350144, 1210880, 2013696, 1093120, 2123264, 1912832, 1406464, 1703936, 1895936, 1974272, 1097216, 2555904, 1921024, 1835520, 723456, 2370048, 2039296, 1678336, 2730496, 2377728, 3463168, 2059776, 1912832, 1228800, 1233408, 2773504, 3239424, 2374144, 1567232, 3097600, 2881536, 3312128, 1525760, 2030080, 3304448, 2528256, 2246656, 2598912]
6233B598912Q1408P95648o69184l65568K06336L21536Q89856J59744j202176K03264
6223C019776P05536j206272Q87296q0896j95584O40512j27488K44224o20032k59584
6213C007488l46624n24800O74816j15712l69152k08384p55200N43744J145856
6204C052032o62528K7648p65952P68512J015296o23616J1776l49184J71008r54368
6194A690624J793024o44608p52128L7888J98656p12192J520640j266688K49856
6185B115072O17472A004544J157632m24448N19680J34656L74784l24096J01376
6176B544128q51968J337856q81664K2016l29216j47968O97344n48864J193472
6167C035136q14080M65408r47200J073664j5872k36032o01088K124800j15712
$$ y = [2598912, 2680320, 3475968, 2806784, 2441216, 2647552, 2969088, 3858944, 4018688, 2816512, 3019776, 3725312, 2519040, 3406336, 3325440, 3129856, 3770368, 3642880, 3887104, 3267072, 3007488, 2660864, 2136064, 2810880, 2695168, 2326016, 2117632, 1362432, 1906176, 3052032, 2389504, 2417152, 1651200, 2419712, 3435008, 2811392, 2823168, 2473984, 2644992, 1690624, 3483648, 2839040, 2086912, 2124800, 2323456, 1611264, 3131904, 1865216, 2115072, 2732544, 1004544, 2162176, 1737728, 2257408, 2392064, 2766848, 2442752, 2544128, 1692160, 3030016, 2148352, 2170368, 1841152, 1693184, 2390528, 1841664, 3035136, 2221056, 2686464, 1739264, 2812928, 2797056, 2561024, 1959936, 4084736, 3969024]
6158C969024k31936q18688K39616J426432j305088O69696o32320J8432M1472M13696
6148C790336L77344B081792O05696N85728l31264M04992N71904j46432o33856
6139C138560o5536k21696N98016l47648J65888J025536n14048j200128q85248
6130A693696o49216O62016k58048J15712K18624j58208J119744m95616O09280
6121B857984r25696n60128L65568J19808P77216H83712j58720J083904o23104
6112A185792N92384L38944n68320M46464H04352N62688Q88832j039872M07552
6103A623552j80224J34144J568256j187840o1952H40192K04800O62528m04480
6094A303040Q11008l89120m42880O81472q1920q43264J256448j003520k75456
$$ y = [3969024, 3737088, 2918400, 3158016, 4584448, 3279360, 3949056, 3316736, 3335168, 3376640, 3790336, 4167680, 2081792, 2687488, 3273216, 2941952, 3346944, 3918848, 3772416, 3138560, 3073024, 2851328, 3449344, 3101696, 3267584, 4293120, 3779072, 2578944, 1693696, 1044480, 1706496, 1448448, 1564160, 1782784, 1624576, 2744320, 2248704, 2857984, 1932288, 1372160, 1737728, 1857536, 2634752, 883712, 724992, 1808896, 1185792, 1778176, 2117120, 1548800, 1995264, 804352, 1367040, 2255872, 1216000, 1623552, 1443328, 1577472, 3145728, 1957888, 1895936, 840192, 1044992, 1707520, 1303040, 2114048, 1724928, 1282048, 1963520, 1881600, 1038336, 2294784, 1291264, 1015808]
6085A015808J264128j78688n48352%j10080J064960p87968P43424E66272J421824
6075A988096N77536n44768k90304J42336J76640P55712j032192K50368P43936
6066B767360q74496M43392n45280J923072j115136m10624o24128K112000j570816
6057B105344R07264l95776O0928Q62208q35584O78400l99360m1472J375744o72256
6047C645440l10784O48704M14208N19168j41312q62720J54112l61984j17760K22720
6037C809792j071104J10592N59616k81088J29024J26976k07872L74784r70752
6028B579968J608192q76544k45760M91520O65088o23104p43424M73088M67968
6019C796992j8432R87648r79968K51392l64544N20192J13152m40320n67296J161728
$$ y = [1015808, 2279936, 2101248, 1552896, 1552896, 1442816, 2507776, 1719808, 2463232, 566272, 1988096, 2565632, 2020864, 1730560, 1872896, 2049536, 2805248, 1773056, 2023424, 2767360, 1892864, 2336256, 1790976, 3714048, 2598912, 2188288, 1564160, 3676160, 2105344, 3012608, 2616832, 2677760, 3539968, 2704384, 3382784, 2983424, 2941952, 4317696, 3645440, 3334656, 3983360, 4397568, 4916736, 4775424, 3912704, 4066816, 3704832, 3587072, 3809792, 2738688, 2849280, 3408896, 3127808, 3256832, 3383808, 3175936, 3550720, 2579968, 4188160, 3311616, 3065856, 3557376, 4222464, 3599360, 2855936, 3329024, 3796992, 3778560, 4766208, 3786240, 4037632, 3673088, 4193280, 4306432, 3866112, 3298816, 4460544]
6009D460544k53952N08416m19840J14176j83808L83488j473536L12320Q31488
6000D279296j174528J248256K35008j937408M86400J88416L90656k71872J33120
5991C577344R40032j254912M50560m55680m38784N57056q77568k4576O144L57888
5981B837504P58784r22112p35744m03968J290752N39136n59104J117184r50272
5972B972160n32992N55520K06336m63360J56160J93024L54304o67648j065984
5963A707520J277440q34560N08928P86432j248768N36576P6288n63712O49216
5954B895360L10272J37728O03648r23136r34400O24128m78208R1648K92352M10624
5944C030016q57088Q34560j47968M68992j1264A364992K010624A482752O4000
$$ y = [4460544, 4206592, 4715008, 4295168, 4409344, 4225536, 4609024, 3135488, 3447808, 4279296, 3104768, 4353024, 4588032, 2650624, 3137024, 3325440, 3716096, 3444224, 3577344, 4517376, 3262464, 3713024, 3257344, 2818560, 3375616, 2498048, 2473472, 2479616, 2837504, 3596288, 2674176, 1938432, 1534464, 2825216, 3364352, 2805248, 3922432, 2972160, 2439168, 2994688, 3201024, 2737664, 2893824, 3086848, 3441152, 2773504, 1707520, 2984960, 2150400, 2659328, 3445760, 2196992, 2733568, 2809856, 2246144, 2895360, 3205632, 3343360, 3947008, 3023872, 2089472, 2713600, 2235392, 2327040, 2619392, 3030016, 2172928, 3007488, 2859520, 3328512, 3317248, 1364992, 3375616, 1482752, 1546752]
5935A546752J278976j38752m84352J473536j340928O03136L49184j241600J118208
5926C164160m58752J12128o28224j2288J105920n67296n2224m39296K74944K65216
5916B764288p3216L21024J07520r14944n62176J818624L18976o38464P4752O18496
5906C834880j172480O8096j26464N06880j20832N6320q31488J387520l22560K05824
5896C485696k41664j52576j303040N46304J768448j056256R63584j839616J344000
5887C514880j22880j340928J018368N01248j781248J591296n94944L04640o38464
5878B451968q0384R41056q60672R34400r31840j72544Q13056K71360o15936k93376
5868B457088k07872J053184J73568j71520k51392j77664L41504l82464J98656
$$ y = [1546752, 2825728, 2686976, 2202624, 3676160, 2335232, 2938368, 3287552, 2045952, 3164160, 2705408, 2817536, 2189312, 2177024, 3282944, 2715648, 2663424, 2224128, 2499072, 2764288, 2691072, 3012096, 3119616, 2204672, 1642496, 3461120, 3780096, 3141632, 3216384, 3834880, 2662400, 2730496, 2604032, 3110912, 2990080, 3046400, 2214912, 3602432, 3279872, 3485696, 3244032, 3091456, 1788416, 2334720, 4103168, 3046912, 4010496, 2170880, 3514880, 3392000, 2051072, 3069440, 3570688, 1789440, 3380736, 2785792, 3090432, 2451968, 2371584, 3312640, 2451968, 3386368, 2454528, 2281984, 3095040, 3366400, 2750464, 2457088, 2249216, 3302400, 3475968, 3304448, 3053056, 2875392, 3216896, 2834432, 3033088]
5859C033088o63040M49536o05184n08416J397760j027584J360384p98208J15712
5850B754048J277440r58464j95072Q03328j109504J229312o08256J85856N8368
5841C437056q54016L7376R25696q69888J446912q56576m42368P85920K78016n62176
5831C325952l99360O38976K47808o5536r8816m7104q19200J244160j102336J089536
5821D014080k68800j340416L41504J437696n30944L8912p7824P2192J26976J065472
5811D878848j573888M90496O73792o67136m38784J392128n59616n48352K104832
5802E752320j532928J050624j2288q01792J593344j769984J266688R83040K9184
5793F558208l28704p67488K54976P96672k73920O38976j08032k04288P63392J836544
$$ y = [3033088, 2370048, 2819584, 2214400, 1705984, 3103744, 2076160, 3436544, 2638336, 2754048, 4031488, 3073024, 2877952, 3681280, 2571776, 3801088, 3192832, 3378688, 3437056, 2583040, 2620416, 3546112, 2676224, 4123136, 3266560, 2824192, 3610112, 3888128, 3325952, 2926592, 3565568, 3813376, 3747840, 3649024, 3601920, 2782720, 4026880, 2924544, 4014080, 3745280, 2404864, 2746368, 4184064, 3653120, 3692032, 3614208, 3686400, 3813376, 4878848, 3304960, 3795456, 4469248, 3802112, 3363328, 4755456, 4195840, 3647488, 5752320, 4219392, 5270016, 5257728, 4455936, 6049280, 4279296, 5545984, 6529024, 6558208, 6229504, 5462016, 5716992, 6513664, 6239744, 6878720, 6770688, 6566400, 7329792, 9166336]
5783I166336j405440j4848K90816o23104O80448L31264n50400O54336P04000r31840
5773H301568p6288J90464N96992J69984R38496P39328K94912K00192J175040J019392
5763A3550080n35552J832448j26464L96800n2736J496064j43360k7648k44736
5754A6144896o40512J404928k21184L56864O20544R75360O43584p1168L66592
5745A9579904O56384J081344K92864L42016K063872J575936j755648m35200k750976
5736B0650496j977856k015744k180096L57376j077760M90496Q61696R69216j032704
5727A5045120k83136o99904r36960j472512j885184n61664K07360j84320Q192
5718I236992r06240k43200q2432J787904j011712q16128J67424l29216J344000
$$ y = [9166336, 7760896, 7746048, 8036864, 7413760, 8094208, 8425472, 7875072, 8529408, 9233408, 8301568, 8225280, 8415744, 9012736, 9182720, 10121216, 10860544, 11155456, 11355648, 12530688, 13550080, 13014528, 14846976, 14720512, 15117312, 15064576, 16560640, 16417280, 16389632, 16144896, 15504384, 16909312, 16688128, 17044992, 17665536, 18640896, 19284480, 19213312, 19579904, 20236288, 21317632, 21610496, 21952512, 24016384, 25592320, 23836672, 23401472, 20650496, 18672640, 16656896, 14476800, 14834176, 13756416, 14246912, 15108608, 16077824, 15045120, 14761984, 14062080, 13125120, 11652608, 9767424, 9205760, 9413120, 9228800, 9236992, 8330752, 8087552, 8005120, 9793024, 8781312, 7965184, 8132608, 7803392, 9147392]
5709I147392O12864q36096L92192j711104J430528o32320n80096J083904k6624
5700H880640j342464Q63744J362944k062848N25312J69984j643008J02912O48704
5691G505920j372160R97376n53472l33312L49696l53280j028096K4064L58912
5682E595648m00384n56544J239552p28064J185280o27200m92544M26496l31776
5673E310464P82848N19680L50208j584640J36192R43616j0240k42176K16064n76512
5663E845504M096j74592R54368j050112J95072M49536O61504p02464o70208O07232
5653F119936K3552J33120p34720R62048n22240M77184p23968P02464P34208R9840
5643G271424q40704m89472L36896r47200J548288j344512Q58112q37632p4752
$$ y = [9147392, 9760256, 8924160, 9316352, 7605248, 9035776, 8403456, 7823360, 8907264, 8880640, 7538176, 8401920, 9764864, 7702016, 8227328, 8397312, 6754304, 6857216, 7505920, 6133760, 7131136, 6577664, 6244352, 6594048, 6240768, 5212672, 5236736, 5595648, 5195264, 4638720, 5878272, 5150208, 6335488, 5708288, 5215744, 5642240, 5310464, 6093312, 6612992, 6963200, 5378560, 5514752, 6458368, 6448128, 6205952, 6422016, 5845504, 5849600, 5675008, 6629376, 5579264, 5774336, 6223872, 6885376, 6182912, 5512704, 6119936, 6143488, 6276608, 5541888, 6503936, 5981696, 6458880, 5734912, 6437376, 7171584, 7271424, 6430720, 5941248, 6278144, 5330944, 6879232, 5534720, 6392832, 5555200, 5480448]
5634E480448J230336n04320O60480J36192j064960N92896m94080K28352J83296
5625F448640q70912r5744R61024N81632q24320J321984j167360P4240K84672q68352
5615E845504J032704k85184M44928j25440J79200o54848M21376k22720p29600
5606E905920O47680N90336r87648J070080k24768R06240j118208R5744Q22784
5597G708160N5296L02592q9600k20160P36256j207808M78208j773056J283584
5588G273472k15552M7104J287680j044992J220608o34880j44896M75648J91488
5579H455680J48480K44224l65568l22560P91040p75680J089536o81984R79456
5570I562624p78240Q85248N21216p60832J220608m00384j674240K398208j66400
$$ y = [5480448, 6710784, 6206464, 6866944, 7003136, 5938176, 6531072, 6036992, 6265344, 6448640, 5577728, 5481984, 6443008, 7024640, 6200320, 7522304, 6354944, 6429184, 6713856, 5845504, 6878208, 6593024, 7037952, 6912512, 7091712, 6436864, 6858240, 6635520, 5905920, 6553600, 7143936, 6156288, 7226368, 7001600, 7907840, 6789632, 6885376, 7708160, 7763456, 8066048, 7976448, 7756288, 8492544, 7284736, 7762944, 5989888, 7273472, 7057920, 7105024, 8392704, 7347712, 8568320, 7933440, 7788544, 8264192, 8455680, 8604160, 8848384, 8482816, 8160256, 8951296, 8175616, 9265152, 8583168, 9562624, 8784384, 9669632, 10190848, 9430016, 10650624, 10250240, 8576000, 10974208, 10807808]
5561A0807808L37920j180160P16288q82688Q44288j370112L24096Q55552j267712
5552I185280o4000k58048n64224K246144o60992K131456N84704P34720n46304
5543A2788736P15264L7888Q57088P93600q21760R40032J362944L51232k0480J138176
5533A8142720Q16128q86272N65248R09312P0144J009152o144J237504J57696J329152
5523B3344640n12512J660416k89280R44640J669120N62176j42336J523200J705472
5514C0465536R03680P9360J947136J08032M343808P09120J408000J920000L155456
5505D5040128J871360K468352K527232L630080M227584L564032O281728N907968
5497G5518464N238784O591488N592064O240256O827008O688256P820800O346752
$$ y = [10807808, 11145728, 9965568, 10681856, 9799168, 10643456, 9273344, 9597440, 10452992, 9185280, 9121280, 8863232, 8299008, 10545152, 9884160, 12015616, 12600320, 13335040, 12788736, 13504000, 13541888, 14398976, 15192576, 14370816, 15310848, 16673792, 17025024, 17004544, 18142720, 18958848, 18072576, 18637824, 19547136, 19617280, 20626432, 20620288, 21857792, 22015488, 23344640, 22832128, 24492544, 24203264, 25147904, 26817024, 27379200, 27236864, 28760064, 30465536, 31369216, 31448576, 33395712, 33503744, 37847552, 38556672, 39964672, 41884672, 45040128, 46911488, 49379840, 51907072, 55537152, 59764736, 63328768, 69610496, 75518464, 80757248, 87348736, 92940800, 99181056, 106008064, 112696320, 120517120, 126863872]
5489A26863872R483264J0449920R886720J2536320J1994624J6855552J5433216
5482B13503488K1969920K3212544L1345152L8535680N1714048O9172224R2642816
5475E42095872J24780544J60074752J66571520J16125696L563520j07331072j62354688
5468H43526144j62259968j48990464j25645824r6714752p0049792n0486272l4256896
5461A55122176k8144640j8053120j3987328j1829760q739840o189056n222400
5454F2956032o000640l788800l752448l014656k387968l803136n93408j457664
5446C8157312j372160k620928k210304j632768j849856l57888j460736j182720
5438B5469952j640960j100288j74592j519104l27680P21920m87424j395200r28256
$$ y = [126863872, 136347136, 146797056, 156683776, 169220096, 181214720, 198070272, 213503488, 235473408, 258685952, 290031104, 328566784, 380280832, 449453056, 542095872, 666876416, 826951168, 993522688, 1109648384, 1113211904, 1005880832, 843526144, 681266176, 532275712, 406629888, 309915136, 239865344, 189379072, 155122176, 126977536, 108924416, 94937088, 83107328, 74367488, 68178432, 62956032, 56955392, 53166592, 49414144, 46399488, 44011520, 40208384, 39614976, 38157312, 36785152, 34164224, 31953920, 30321152, 28471296, 28113408, 26652672, 25469952, 23828992, 22728704, 22554112, 21035008, 20707328, 21429248, 20941824, 19546624, 18618368]
5429A8618368K26816R7280k442240J03424M0960L3792j359872j783808J41824
5420A3676544Q17152j170944O23616J36192k478592L07200o98368R65120K23232
5411A2401152p56736N64224j280000J468928q02304j623040m11136j1264J775104
5402A1324928j543168Q9600O77888N4784l4304j297920N04832J40800K94912J33632
5392A0345984J83808J10592m32640o30272j305088p36768l39968J34656J36704
5383G467008j517568R42592l10272O0928j84832L6352O20032p34720M28544r9328
5373F708736k6624j207808K58048J593856k68288r56416R80480j317888N69344
5364F333440n05344j29024n22752J663488l10272j572352J815040q91904p47520
$$ y = [18618368, 18845184, 18942464, 16500224, 16603648, 16644608, 16678400, 15318528, 13534720, 13676544, 14493696, 13322752, 13946368, 14082560, 11603968, 11911168, 11212800, 12177920, 12401152, 11644416, 12208640, 10928640, 12397568, 11595264, 9972224, 9561088, 9549824, 11324928, 9781760, 9871360, 10549248, 10604032, 10569728, 9271808, 9776640, 9917440, 10212352, 10345984, 10529792, 10640384, 10207744, 9577472, 8272384, 7535616, 7195648, 7330304, 7467008, 5949440, 6892032, 6581760, 6642688, 6457856, 6494208, 7114240, 6379520, 6808064, 6708736, 6682112, 5474304, 5732352, 7326208, 7057920, 6101504, 7081984, 5764096, 6333440, 5828096, 5699072, 5176320, 6839808, 6529536, 4957184, 6772224, 5880320, 5132800]
5355E132800M44416m54656J527808r88160p97184P36768r92768J522176n71904
5346E559296j90976k24768j439232K012672j26976L55840m65408q69376J536n07904
5336D104704R18528j81760L81440n05344m4544j82784L27680p55200O78400m55680
5326D285440O55872N53472j656320J274880n2736J87392j30048Q64256j221632
5317D760576j45408L81952K2016L19488r16480J466880q8576j376768q0896J025536
5307E368320r53856n16096J668608k202112L77856Q03840j44896j073664J417216
5298D745216o59456L48672R01632j966080J205760M04480j763328J419776m5568
5289D591104l40992R41056l7888p49056J683456q79616P42912P3216K322944j313792
$$ y = [5132800, 5577216, 5122560, 6650368, 5662208, 4865024, 5601792, 4609024, 6131200, 5559296, 5368320, 5143552, 3704320, 5716992, 5590016, 5945856, 5480448, 4611072, 4612608, 4104704, 5023232, 4841472, 5222912, 4717568, 4673024, 4490240, 4817920, 4062720, 4741120, 4285440, 4941312, 5494784, 3838464, 5113344, 5060608, 5248000, 5117952, 5982208, 4760576, 4615168, 4997120, 5019136, 5338624, 4422144, 5889024, 5800448, 4423680, 4342784, 5368320, 4414464, 3898368, 5566976, 3364864, 3742720, 4546560, 4401664, 3328000, 4745216, 4085760, 4434432, 5336064, 3369984, 4575744, 4980224, 3216896, 4636672, 4591104, 4250112, 5191168, 5153280, 4404224, 6087680, 5208064, 5950976, 6024192, 8347136, 7033344]
5279G033344J713664J6896J60768j643520K215424j909248o65088O20544j78688
5270G364096p43936k27840m6592j42336q7040L17440l56352K8160J854976q31488
5260G129088k38080K62656k90816J82272n72416N74464q99584J093120K0480k0480
5250G240704P91040k1504r19040N83680J536O07744p21408j85344J517568n69856
5240H325120l7888K27840J080320r29280J59744K00704R55392P07072L584n81120
5230A0111488J399808q87808J136128J170432l62496Q21248k040832O52288J178624
5221A3178880l2256o69184J453056R3184p01440L92192J399808k89792J235968
5212A6060416L51232O74816R22112L33312J421824n94944J258496K851328o38976
$$ y = [7033344, 8747008, 8763904, 8924672, 7281152, 9496576, 7587328, 6922240, 7542784, 7364096, 6620160, 6392320, 6345728, 6203392, 6116352, 6433792, 6077440, 6105600, 7960576, 7129088, 6891008, 7153664, 6862848, 7045120, 6472704, 7047168, 6147584, 7240704, 7261184, 7240704, 8031744, 8010240, 7091200, 7674880, 7676416, 8284160, 7562752, 7377408, 8894976, 8325120, 8287232, 8515072, 9595392, 8666112, 8825856, 9026560, 9981952, 10689024, 10692608, 10111488, 11511296, 10623488, 11759616, 12930048, 12567552, 13388800, 11347968, 12000256, 13178880, 13146624, 12477440, 13930496, 14023680, 13322240, 13714432, 15114240, 14824448, 16060416, 16411648, 17086464, 18008576, 18341888, 19763712, 19168768, 20427264, 23278592, 22639616]
5203B2639616N49376q45312j059328k358272j208832j479168j318400j059328
5195A3860352j337344p36256m08064l06688l22560p05536J303552k833408k59584
5186H254464n53472Q70912j498112M07552p72096P18336k14528K65216j192448
5177F285824M02944n72928j11104Q97536k143232L23072M14720j98144Q8064J3824
5167E400576M91008j697792J091072k73408K10432q7040o30272N47840n27360
5158D525056j95584J030656j676288K13504J313280N29408M26496j214976K52928
5149E204480J12640m13696N38624k65216k63680J045504j711104J219072m03968
5140E062656J007616j583616J364992j931264P40864K24256N57056N58080q61184
$$ y = [22639616, 23188992, 22343680, 21284352, 18926080, 17717248, 16238080, 14919680, 13860352, 12523008, 11786752, 11378688, 11072000, 10749440, 10043904, 11347456, 8514048, 8254464, 7700992, 8571904, 7073792, 7481344, 6709248, 7427584, 7213056, 7478272, 6285824, 6688768, 6115840, 6004736, 6902272, 4759040, 5082112, 5496832, 5298688, 5386752, 5400576, 5891584, 4193792, 5284864, 5011456, 5221888, 5134848, 4504576, 5052416, 4525056, 4329472, 5360128, 3683840, 3897344, 5210624, 5740032, 6166528, 4951552, 5204480, 5317120, 4903424, 5442048, 5176832, 4913152, 5958656, 4247552, 5466624, 5062656, 6070272, 4486656, 5851648, 3920384, 4661248, 4885504, 5442560, 6000640, 5139456]
5131E139456M40832K49856k73408R61536o43072n91360K52416m97152L24608O5024
5121E428736P2704l15392n46304k64704J872896j326080P07584Q23296k27328
5112F225408M90496k80064m81792p64416J004544q5504m11648L55840r66144M46464
5102E533184l39456O9120M8640n42208m54656J039872j226752k58560P97696k10944
5092D455936n92896L52256Q68352k94400O79936n12512n26336o56384m56192J729024
5082E046784n32992o54336P54688k4576M94592l24096K56000p57248J25952K5600
5072D410368N90336j09056N44768o54848O52800l75296R22624l82976j023488
5063D575232Q37120k25280N89312J73568R08800J355776L22560J091072K901504
$$ y = [5139456, 5580288, 5830144, 5556736, 6518272, 5875200, 5283840, 5536256, 5039104, 5363712, 5428736, 5501440, 5186048, 4639744, 4375040, 6247936, 4921856, 5629440, 6452736, 6225408, 6715904, 6435840, 5954048, 5189632, 6194176, 6108672, 5697024, 6052864, 5086720, 5533184, 5193728, 5262848, 5311488, 4769280, 4314624, 5354496, 4127744, 3869184, 4666880, 4455936, 3863040, 4215296, 5083648, 4789248, 5469184, 4956672, 4430336, 3773952, 3317760, 5046784, 4513792, 3859456, 4614144, 4589568, 5084160, 4760064, 5016064, 4258816, 4384768, 4410368, 5000704, 4891648, 5436416, 4781568, 5434368, 5059072, 5981696, 5598720, 4575232, 5412352, 5187072, 5776384, 5949952, 6858752, 8214528, 8537088, 9628160, 12529664]
5054A2529664L390464J937920M477440J635328m00384r05216M85376m958720n028352
5045A3163520k933248p39840j963520r39520j008128n98528j49504K60608n73440
5036D518400Q15104o19008k9184p7824n96480o42560J738752p44448k56512o5536
5026D040704j055744K181632p58784k13504J06496l77344j81248P54688J41312
5017D638208n27360N04832N34528k56512m46464Q20736L16928m33664K31424K5600
5007E408256j145856n37600l23584P07072j77152M45952O76352j584128J176064
4998D645376j498112R17504J103872j487872K65728m29568J013760o45632O43072
4989D528128r96864N87776o65088L21536n18656K75456N84192k86720O97856L69664
$$ y = [12529664, 15920128, 17858048, 22335488, 23970816, 23570432, 22665216, 23150592, 18191872, 13163520, 10230272, 9490432, 7526912, 6587392, 5579264, 4980736, 4831232, 5091840, 4518400, 5333504, 4714496, 4685312, 4607488, 4011008, 3368448, 5107200, 4362752, 4106240, 4040704, 2984960, 5166592, 4407808, 4194304, 4300800, 3923456, 3742208, 4496896, 4638208, 4110848, 4615680, 5150208, 4893696, 4447232, 5267968, 5584896, 5151232, 5382656, 5408256, 4262400, 3724800, 3401216, 4108288, 3931136, 4377088, 5053440, 3469312, 4645376, 3147264, 4064768, 5168640, 3680768, 3946496, 3516928, 4530688, 3885056, 4528128, 3531264, 4119040, 3453952, 3775488, 3256832, 3532288, 4116480, 3829760, 4527616, 4897280]
4979D897280q73472r6768K54464J15200j52576n09440j33120m65408J840640p09120
4969D167680L72736n46816N99040p33184o56384J714688j035264L34336P23968
4960D940800m79744l66592J229312m6080l00032r9328m0960K20672o79424J336320
4950E714944L76320j238528J377280j444352J486336r88160P93088o81984l84512
4941E010432Q704P96672j032192J366528K76480q42240N57568P73632p39328J26976
4931F303232k71872P05024j319424m27008j155584J134080m05504K048m64384
4922D100608L30752j65376L47648q704n21728P41376j155584k80064J753600r95328
4912D147200N120o94784N31968K30912n03808L45088J17760P80800l7888n79072
$$ y = [4897280, 4023808, 3927040, 4181504, 4296704, 4144128, 3634688, 3501568, 3036160, 4876800, 4167680, 4540416, 3993600, 4592640, 3859456, 3203072, 4917760, 3882496, 4216832, 4940800, 4461056, 4094464, 5323776, 5277696, 4977664, 4878336, 4837376, 5058048, 4378624, 5714944, 6091264, 4852736, 6230016, 4785664, 6272000, 5283840, 6076928, 5394944, 5010432, 5019136, 5815808, 4783616, 6150144, 6426624, 5584384, 6141952, 6915584, 6176256, 6303232, 6031360, 6736384, 5416960, 4989952, 3834368, 4968448, 4562944, 4564992, 4100608, 4431360, 4265984, 4613632, 4604928, 4083200, 4824576, 3668992, 3388928, 5142528, 4147200, 4152320, 3457536, 3989504, 4220416, 3716608, 4061696, 4179456, 4960256, 4922368, 4343296]
4902D343296o62016M29056O61504r33376P94624n62176K79552N34016j692672
4893C191808R56928l38432O91712q99584Q50432o34368J93024N83168m59776M43392
4883D578304J280512n47840n28896n02272M95616L13856l68128P9872j348608
4874C452416J90464J129984J62304p53664l26656P34208j384960O46144O11328
4865D461568L28192o10816K76480N03296o80960L9936p18336M38272J058816J199616
4855F296064j162752o70720P34208n21728R98400m95104P5776R68192j031168
4846E191168n14560J257984j127424J643008q04864J264128N58592k65216J415168
4837H617984O34880J982464M734976Q701952M421120K894336l901952p385600
$$ y = [4343296, 3681280, 4110336, 4771840, 3838464, 4633088, 4070912, 4350464, 4884480, 3191808, 4148736, 3810304, 4502016, 3602432, 4452864, 3818496, 4011520, 4594688, 4134912, 4578304, 5858816, 5310976, 4782080, 4279808, 4775424, 5089280, 4721152, 4801024, 3452416, 3642880, 4772864, 4935168, 4181504, 3854848, 4589056, 3204096, 3850240, 4461568, 4789760, 4178944, 4455424, 4958720, 4277760, 4317696, 3599360, 4037632, 5096448, 6296064, 5133312, 4462592, 5196800, 4675072, 5673472, 5178368, 5254144, 6222336, 5191168, 4676608, 5934592, 4807168, 6450176, 5645312, 6909440, 7468032, 7202816, 8617984, 9252864, 11235328, 15970304, 24672256, 29093376, 31987712, 28085760, 20700160]
4829B0700160o999040o44608l197952l450880k57536m10624j529856N33504r83040
4820C760128O21568J19808n12512J44384m09088k58560N86752N4784r1648j277952
4810B737664R32352Q92928k141696J100800l79392J477120j590784k92864l74272
4801B361856J321472r14944J168384j191424J32608P51616Q23296M04480p54176
4792D103168J21344P73120j307648N53984l48672J15712L02080j139712J29024
4783C302400M20864n21216J66912M65408K57024j65888n09440n4784k8672R61536
4773D294144k22720L53792l79904q33024J977856r04192k78528N00224K99008
4764D806656n26336J056768J36704j8944N82656k26816R41056m68480J289216
$$ y = [20700160, 13701120, 13056512, 9858560, 6407680, 6150144, 5739520, 4209664, 4743168, 3760128, 4381696, 4501504, 3988992, 4133376, 3724288, 3465728, 4052480, 4107264, 4015616, 2737664, 3670016, 4562944, 2421248, 3522048, 3142656, 4619776, 3028992, 2736128, 2361856, 3683328, 2768384, 3936768, 2745344, 2877952, 3629568, 4452864, 4857344, 4103168, 4224512, 4997632, 3689984, 4243968, 3895296, 4011008, 4313088, 3173376, 3302400, 3723264, 3202048, 3368960, 3834368, 4091392, 3925504, 3416064, 3361280, 3332608, 4294144, 4071424, 4425216, 4045312, 3212288, 5190144, 4285952, 4007424, 4507648, 4806656, 4280320, 5337088, 5473792, 5454848, 6037504, 5810688, 6751744, 6283264, 7572480]
4755G572480n29408k76480l39456L235328n73952J536J328640J086976L023872
4746A4529536L068928P879168R489408O689280K079744n924352r257472n929984
4738B2624256j120256k080256j718784N016064L643392M638208j400832o254592
4730B3347200l036672o20544l43552O47168Q264192M321280O606336j341440q532480
4721B9311488o301696l456000n79584j921536L512832K723840L870720j176576
4713B5983488l968000n624832k648576j632768j308160L00032K086912J673728
4705A4861824o17984k424320k977792k654720k54464j195008j094144J667584
4697E310976j394688O11840j354752J90976J359872Q9088j104896j58208j58208
$$ y = [7572480, 7043072, 6766592, 6427136, 9662464, 9088512, 9090048, 10418688, 11505664, 14529536, 17598464, 25477632, 34967040, 41656320, 43736064, 37811712, 28554240, 22624256, 21504000, 19423744, 17704960, 22721024, 26364416, 31002624, 29601792, 23347200, 20310528, 19689984, 19346432, 19993600, 28257792, 32579072, 39185408, 37843968, 29311488, 23009792, 19553792, 18974208, 17052672, 20565504, 23289344, 27160064, 25983488, 22015488, 16390656, 13742080, 12109312, 10801152, 11101184, 13188096, 14861824, 14243840, 11819520, 8841728, 6187008, 5932544, 4737536, 3643392, 5310976, 3916288, 4528128, 3173376, 3364352, 4724224, 4813312, 3708416, 3550208, 3392000]
4688C392000K88768N98528K58560N19680k15040J019392n71392l88608m12160
4679D489728R79968j532928J284608p4752Q42752n12512r27744n2224M66432q86272
4669D077056R8304r90720l68640j7920O85568j32608p62880p47008J025536k56000
4659B610688o85568J149952n76512R9328N0176l54816k60096J5872L88608k45248
4649B192384l08736o9632n73440R24160N632k560K62144l74272J56160p89504
4639A422336P97184k048H97536K317824A127424J048064K41664j11616p30624
4630A574912M41856r8816J05472n47328O67648K19648A156096M12160J187328
4621B755584A301504J13152o05184J368064n14560P61344J93536j72544j121280
$$ y = [3392000, 3680768, 4279296, 4537856, 5057536, 4842496, 5861888, 5290496, 4901888, 4489728, 5469696, 3936768, 5221376, 5146624, 5989376, 5476864, 4549120, 4496896, 4963328, 4077056, 4175360, 3184640, 2816000, 2798080, 3483648, 3351040, 2588160, 1841152, 2866688, 2610688, 1925120, 3075072, 2498560, 2597888, 2648064, 2293248, 2033152, 2049024, 2437632, 2192384, 1883648, 1814016, 1240576, 2164736, 2170368, 2167808, 2429952, 2055680, 2211840, 1422336, 2219520, 2217472, 897536, 3215360, 1127424, 2175488, 2417152, 2305536, 1574912, 2016768, 1917952, 2023424, 1476096, 2143744, 2363392, 1156096, 1568256, 2755584, 1301504, 1414656, 809472, 2177536, 1662976, 2424320, 2617856, 2445312, 1324032]
4612A324032J113088j22880E76512J667072L47136l99360m70528l8400L82976
4603B065408J6384r1136J59744j62304K55488q63744l93728R81504o90688L48672
4593A625600k03776m16256O83008J112576n40672m84352j68448L28192n56544
4584A379328N11488q71936L098112I09824j08032J740800r89184M62336q48384
4575A167360J267712r67168R08800R2672r92768L26144M09088j056768J730048
4566B885120r94816J22880n31968J324032j264640J334784o27712m74624P96160
4557B569216N94432m64896n54496o12864J613824j139200l52768K29888m57216
4548A425920J244160j45408n72928n67808J423360j15712o09792j02912Q03328
$$ y = [1324032, 2437120, 2314240, 576512, 2243584, 2590720, 2191360, 1720832, 1682432, 2065408, 2081792, 1990656, 2150400, 1988096, 2243584, 1379840, 986112, 1967616, 1276928, 1625600, 1421824, 1005568, 1688576, 2801152, 2260480, 1776128, 1607680, 1935872, 1379328, 1890816, 1018880, 4116992, 909824, 801792, 2542592, 1553408, 2015744, 1167360, 2435072, 1467904, 2376704, 2469376, 1476608, 1802752, 2211840, 1155072, 2885120, 1890304, 2013184, 1481216, 2805248, 1540608, 2875392, 2247680, 1773056, 2569216, 3163648, 2698752, 2144256, 1531392, 3145216, 2006016, 1653248, 1883136, 1425920, 2670080, 2524672, 1951744, 1383936, 2807296, 2691584, 2081792, 1978880, 2782208]
4539B782208p86432J3312J19296L41504p58784J443840k91840j193472J157120
4530B826752j009152N19680n63712J223680j60768k38592n87264O54336j272320
4521A392640M83328P5264q37120P78752M56704n06880M06016k26304J84320l51232
4511A855488R7280J165312l91168o78912N27872J20320j134592j62304J235456
4502B634752J48480J331200j019904j69472n120K44736M46976l1232j27488k19648
4492C233280N49888N32480j564160J984000j145856Q94976p82336L78368J75104
4483D255744r728J10592j59744j103360p6288P70560m9152J442304j218560J294336
4473E256704r98400l99872K123776j035776p20384k10432P17312k58560r97888
$$ y = [2782208, 1995776, 2009088, 2128384, 2469888, 1711104, 3154944, 2863104, 1669632, 2826752, 1817600, 2337280, 1773568, 2997248, 2836480, 2597888, 2010624, 2664960, 1392640, 1875968, 1951232, 1114112, 1892864, 2349568, 1842688, 2248704, 2022400, 2206720, 1855488, 1952768, 3118080, 2726912, 2048000, 2575872, 2696192, 1561600, 1399296, 2634752, 2783232, 4114432, 3094528, 2925056, 2919936, 3164672, 3611648, 3580416, 3452928, 3233280, 3783168, 4315648, 2751488, 4735488, 3589632, 4484608, 3702272, 4080640, 4255744, 4246016, 4356608, 4196864, 3093504, 3017216, 3787776, 3738624, 5180928, 3962368, 5256704, 4258304, 3858432, 5982208, 4946432, 4226048, 4015616, 4732928, 4474368, 3476480]
4464C476480L91680J469440K00192o32832L08224R6768j89440J1264P69536j074688
4454D826624J49504m78208j87904L96288j545216N01760n42208J6896l91680J507840
4444D253696o71232j58208M41856r29792J32096P53664K03776p91552N51424L66080
4434D151808j10592P96160L58400q59136n71392L82464j07008n12512L03104K71872
4424D103168j19808j050112Q68352J4848n07392J630720k364416P28064k560Q7040
4414C387904J028608j552896K51392k20160J006592L47648l0208L51232q09984
4405C760128J44896l8400j223168O25664m88448K91328m8128q6016J256448o86592
4395C507712n44768O93760r80480J311232j73568q44800j26464O8608J149952
$$ y = [3476480, 3868160, 5337600, 5537792, 4904960, 5213184, 5309952, 5120512, 5131776, 5901312, 4826624, 4976128, 4497920, 4310016, 4706304, 3161088, 3662848, 3120640, 3137536, 2745856, 4253696, 3582464, 3424256, 3866112, 2936320, 3068416, 3822080, 4025856, 3234304, 3785728, 4151808, 4041216, 4837376, 5195776, 4336640, 3765248, 4147712, 4040704, 3528192, 3831296, 4103168, 3983360, 2933248, 3801600, 3816448, 3309056, 4939776, 2575360, 3303424, 3300864, 3387904, 4416512, 2863616, 3115008, 2894848, 3901440, 4249088, 4218880, 4570112, 3760128, 3905024, 3866624, 2643456, 3269120, 2780672, 3072000, 3023872, 2937856, 4194304, 3507712, 2962944, 3656704, 2676224, 3987456, 3813888, 2969088, 2842624, 2911232, 4061184]
4386D061184p1168O37952j248768n19168Q34048L82464M28032j213952O89152
4377C979776o75328J758720p60832J28000j619968J774080o80960m74112M65920
4368C895296J17248j011200q6528K32960R80992k44224n02272N14048J698816
4359E595136k045440N08416q5504J319936j352192L77344j46432M71040o16448
4350D025856Q66304p680j312768J339392o19008n45792R35936O0416j590272J643008
4340D795392m47488o75840m0960R77920Q3456P01440j290240j11104K3040L2768
4330D048384l5328L48160n76512L90144K08384k10944J90464l83488n12512J340928
4320D807680j651200P84896M32640o60992m56192j04448j4336j12640J571840
$$ y = [4061184, 3990016, 4627968, 3379200, 2860032, 3694080, 4076544, 4504576, 3290624, 3979776, 3304448, 5063168, 4302336, 4430336, 2810368, 4584448, 3903488, 3429376, 3895296, 4012544, 3001344, 2914816, 3147776, 4128768, 3884544, 3382272, 3896320, 5595136, 3549696, 4058112, 3972608, 5292544, 3940352, 4317696, 4171264, 4642304, 4025856, 4892160, 4884480, 3571712, 4911104, 4292096, 3746304, 4682240, 4742656, 3152384, 4795392, 4347904, 3672064, 3631104, 4609024, 4692480, 5393920, 4103680, 3992576, 4015616, 4048384, 4013056, 4361216, 3784704, 4174848, 4383232, 4172288, 4362752, 3979264, 3466752, 4807680, 3156480, 3941376, 4374016, 3713024, 3256832, 3152384, 3138048, 3025408, 4597248]
4311D597248j550848N55008M54144m71040o8096K106368j622528Q18176l55840
4302D462592K79040O30272K50880p54176j0752R8304q89344M22400J209856l97312
4292E301760J28000m34688M74624j26976l9936M30080l3280k65728O35392J79712
4282F248960p98720L75296M42368M38784j75616J47456R28768j378816O64576
4273F893056k7648R12384j039360R82528j88416k7136J64352J593344J63840j354240
4263H072704r2160K69312r53856J164288l40480o38976L96800j6384j48480p21920
4253F990848Q35584m608J59744J62304M04480J24416q65792J021440j354240Q61184
4243H335360q01792M93568j036288P26016J13664j69984j07520P23456p06048
$$ y = [4597248, 3046400, 3601408, 4055552, 3584512, 3516416, 5622784, 4000256, 4818432, 4462592, 4741632, 5371904, 5622784, 4868608, 4857856, 4956160, 4066816, 4489216, 5699072, 5301760, 5429760, 4995072, 5469696, 5342720, 5302784, 5732864, 5699584, 5433856, 6069248, 6248960, 5450240, 5825536, 6267904, 6706688, 6531072, 6678528, 7607296, 6228480, 6893056, 6865408, 7777792, 6738432, 7720960, 7532544, 7505408, 7669760, 9263104, 9426944, 8072704, 7980544, 8249856, 7296000, 8460288, 8119808, 7480832, 7877632, 7861248, 7712768, 6990848, 7826432, 7821824, 7981568, 8143872, 8548352, 8672768, 7806976, 8828416, 7474176, 8335360, 7533568, 8027136, 6990848, 7716864, 7830528, 7660544, 7553024, 8276480, 7570432]
4234G570432j509888J963520m44928k2016o85056J363968j034240K46272M27008
4225G875072L94240m19840p31648O08768j235456J149440q05376K95424l61984
4216F768640M02432M36224P40352k069504J767424p17824J92000m34688K90304
4207G375360J130496o29760L17952l37408j687552K253312j472512r20064J154560
4198G184384N40672j606144J48480n68320M97152k29888L95264q27392R11872
4189F446080N36576l49696j160192j49504J068032j62816K37568Q36608K93376
4180G596032j887744R97376p99744P96160q78080p4752J173504L47648L67616
4171G638016j090048J564160j066496j54112r3696Q1408J37216l9936K44224R1136
$$ y = [7570432, 6060544, 8024064, 7579136, 7557120, 6872064, 8236032, 7201792, 7448064, 7875072, 8269312, 7849472, 7117824, 7726592, 6491136, 7640576, 6835200, 7130624, 6768640, 7171072, 7607296, 8347648, 6278144, 8045568, 7327744, 7519744, 7085056, 7375360, 8505856, 7876096, 8194048, 7856640, 6169088, 8422400, 6949888, 6029824, 7184384, 7725056, 6118912, 6267392, 5699072, 6196224, 5966336, 6361600, 5534208, 6446080, 6982656, 6632960, 5472768, 5323264, 6391296, 6228480, 6466048, 7302656, 7596032, 5708288, 6705664, 5905920, 6702080, 5824000, 5749248, 6922752, 7270400, 7638016, 6547968, 8112128, 7045632, 6891520, 6797824, 6879232, 7016448, 6976512, 7220736, 7311872]
4161G311872m18304N82144q34048J001472m64384M21888j029632J306112m62848
4152G414272L68128j341952J144320P50592n91872j86368o19520R54880J07520
4143H000000R78432p68000O94272J017856j436160N46816K27840m00896L03616
4134I163776l24096J132544J06496j02400J026048o45632M02944o68160N16096
4125A0607616N37088j4336l67616L39456o10304o07744M09600j50016O25664L13856
4115A1083264m15744J79200p19360P4752J65376P06048j457664J321984p33696
4106A0204160M7104N4272M51072O13888j572352R25696j081344J550336j083392
4097A0109440K19648O517248n676544j90976J242624j047552J22368P6288M67968
$$ y = [7311872, 6893568, 7475712, 6641664, 7643136, 7178752, 7600640, 6571008, 7877120, 7414272, 7782400, 6440448, 7584768, 8335360, 7743488, 7557120, 6937600, 7892480, 8000000, 8978432, 8210432, 8904704, 9922560, 8486400, 9033216, 9261056, 8860160, 9163776, 8839680, 9972224, 10078720, 9976320, 11002368, 10356736, 10759680, 10091520, 10607616, 11144704, 11130368, 10762752, 11102208, 10491904, 9884160, 10293760, 10143744, 10769408, 11083264, 10667520, 10846720, 10127360, 10202112, 10367488, 11073536, 9615872, 10937856, 10204160, 10251264, 10305536, 10756608, 11370496, 9798144, 10723840, 9642496, 11192832, 10109440, 10329088, 16846336, 11169792, 10978816, 12221440, 11173888, 11296256, 11372544, 11840512]
4088A1840512j516544J244672L8400J80736j671168O59968L52768J16736o83008
4079A0563072Q65792l89632O05184O0928k1504p04000l30752J986048o20032R29792
4069A2944896l12832M036608K279424N446144O29760m925440k711552l123200
4061A4263808n31968l153920M61824k414592M74112o73280P21920r07776P84384
4052I024512o73792M22400k560q96000M43392K36032k19136q3456m4544m12160
4042G794688l26656n4784q15616J280512L45600L5328l16416m70528K94912n32992
4032G234048J424384q47360p53664P55200j494016J518592n85728O12864J78176
4023H042496J536Q32000k99520q30464N24800N37600l8912j214976m4032L33824
$$ y = [11840512, 10323968, 11568640, 11607040, 11787776, 10116608, 10776576, 11129344, 11246080, 10563072, 11428864, 11039232, 11644416, 11705344, 11683840, 10979840, 10649088, 12635136, 12015104, 12944896, 12632064, 16668672, 18948096, 24394240, 25024000, 20098560, 17387008, 14263808, 13731840, 10577920, 11039744, 8625152, 9099264, 8425984, 9147904, 8240128, 9024512, 8350720, 8773120, 8770560, 7874560, 8317952, 8553984, 8334848, 8251392, 8206848, 7794688, 7468032, 7413248, 6597632, 7878144, 8223744, 8259072, 7942656, 7472128, 7767040, 7234048, 8658432, 7811072, 7057408, 7812608, 6318592, 7837184, 7251456, 7864320, 8042496, 8044032, 8876032, 8576512, 7746048, 8270848, 8808448, 8769536, 7554560, 7510528, 7844352]
4013G844352J03936j62816M82304n82656K45760q64256P35744R45664J74592j009664
4003G912960J24928J156608n98528p41888R32864M11136j501184N09952J010688
3994I217536j55648k83648r85088J947648j256960O08768L51744j482752j42336
3985G819264R75872o9632r23648J211904k029056N36576K64704K048J35680J09056
3975H032768j500160O78912o6048J370112j378816O59456n09440K68800L02080
3966G857664K98496o01088p98720J058816j72544K41664J34144J50528q7040O22592
3956H704512L53792K20160k47808J14688l3792l15392k9696J171968o54848K286592
3946A1570176j408000M61824n1712N34016j249792K66240J179648j358336R21600
$$ y = [7844352, 7948288, 7785472, 8267776, 7685120, 7930880, 7066624, 7802368, 8748032, 8922624, 7912960, 8037888, 9194496, 8595968, 7854080, 8786944, 9198080, 7696896, 8206848, 9217536, 9061888, 8778240, 7793152, 9740800, 8483840, 9092608, 9444352, 7961600, 7819264, 8795136, 8725504, 7801856, 9013760, 6984704, 7521280, 7785984, 7788032, 7923712, 8032768, 6532608, 7211520, 7145472, 8515584, 7136768, 7796224, 7286784, 7555584, 7857664, 8156160, 7555072, 6756352, 7815168, 7642624, 7884288, 8018432, 8168960, 8081920, 8704512, 9058304, 9278464, 9030656, 9145344, 9111552, 8796160, 8766464, 9938432, 9283584, 11570176, 10162176, 10624000, 10572288, 11106304, 9856512, 10122752, 11302400, 9944064, 10865664]
3937A0865664Q99072j94048j28000L84512j162752J227776M16256R13920q75008
3928A2347392O06720k19648Q77568o0928l28704R7792P8848P30624J52064k18624
3918A4063104k92352M82816j38240J340416j64352j09056J61792J58720L01568
3909A5804416n43744J559040j639424J28000p55200J110016j54112q42752l07200
3900A4359040n0176O61504p00928r10848O01088q41216M08576O84032p44448J10592
3890A3577216n16608O97856n9392j26464O656m38272O4512J92000O83520j327616
3880A2753408J99168Q88832R55392j131520j39264j66912j351680K146816n16608
3871A3637632l94240R19552j565184P10656j214976n94432J078784o67136j199104
$$ y = [10865664, 11764736, 11570688, 11442688, 11827200, 10664448, 11892224, 12308480, 13222400, 12347392, 12954112, 12734464, 13612032, 13551104, 13222400, 13320192, 13399040, 14129664, 14281728, 14063104, 13770752, 14253568, 14115328, 15455744, 15291392, 15182336, 15344128, 15502848, 15804416, 15260672, 16819712, 15180288, 15308288, 14553088, 15663104, 15508992, 14666240, 14359040, 14308864, 14970368, 14269440, 13358592, 13959680, 13118464, 13527040, 14211072, 13466624, 13577216, 13060608, 13758464, 13699072, 13572608, 13579264, 13140992, 13205504, 13397504, 14081024, 12753408, 12952576, 13841408, 14796800, 13665280, 13526016, 13359104, 12007424, 14154240, 13637632, 13243392, 14162944, 12597760, 13308416, 12093440, 11499008, 12577792, 11910656, 10711552]
3862A0711552m096l15904j83296Q06912o73280j96096k33984j539584J611264
3853I983488l52256K71360j80224l67616j85856l6864j71520P89504j46944P3728
3843I676800p23968P03488l54816r57952L66592J89952o05184M73088J09568q83200
3833G994368J252864m58240o58432K61120L11808L45600o0416k23232m66432j185792
3823G113216J18784J9968J442304l74784q53504J262592k83136N51936m84864
3814H512512j65376J011200q73984P93088K23744r35936K201088j030656J673728
3805A1409408q51456Q91392j281024J15712M38272M78720P1168j71008O70720
3796A1771904J758208j552896p82336J543680O76864j02400j38240J47456Q23808
$$ y = [10711552, 10707456, 10391552, 10208256, 11015168, 10341888, 10145792, 9911808, 8372224, 9983488, 9631232, 9902592, 9722368, 9354752, 9168896, 9132032, 8960512, 9750016, 9603072, 9676800, 8952832, 9656320, 9301504, 8343552, 8710144, 8900096, 8294912, 8768000, 8877568, 7994368, 9247232, 8788992, 8130560, 8391680, 8703488, 9049088, 8988672, 8765440, 8299008, 7113216, 7232000, 7251968, 8694272, 8319488, 7465984, 8728576, 8445440, 8997376, 8512512, 8347136, 9358336, 8484352, 9277440, 9501184, 8565248, 10766336, 9735680, 11409408, 10557952, 11449344, 10168320, 10284032, 10722304, 11201024, 11272192, 11101184, 11771904, 13530112, 11977216, 11194880, 12738560, 13415424, 13313024, 13174784, 13322240, 14146048]
3787A4146048q33536O71232O32320Q15616K43200J87392M59264K5600K31424J420800
3777A7999360j489920J229824J778176K65216j023488L166208p0656j233408J140224
3768B1761536P66976J160192L08736R88672O22080M65408K684928J276928J137152
3759C1172608K208256J217024K917376J606656R06240M83840L259392J409536
3751D5180928J605632J59232R76384K143744J036800N14048J067520J056256N81120
3742E4321664L258368O22080J384960L332608K964480J611264L166720L809792
3734G4471936K778624N359616N125632N415424P513088R410048R027072P902720
3726A27004160R590784M936704R77408m295168q792576r219584j1582464j3054976
$$ y = [14146048, 13312512, 13983744, 14616064, 15431680, 15674880, 15862272, 16321536, 16347136, 16578560, 17999360, 16509440, 17739264, 19517440, 19782656, 18759168, 21925376, 21854720, 20621312, 21761536, 22528512, 23688704, 23997440, 24986112, 25608192, 26073600, 28758528, 30035456, 31172608, 33380864, 34597888, 37515264, 39121920, 40028160, 40512000, 43771392, 45180928, 46786560, 46945792, 47922176, 50065920, 51102720, 51616768, 52684288, 53740544, 54321664, 57580032, 58202112, 59587072, 62919680, 65884160, 67495424, 70662144, 74471936, 77250560, 82610176, 87735808, 93151232, 100664320, 110074368, 119101440, 127004160, 136594944, 141531648, 142509056, 138213888, 129421312, 120201728, 108619264, 95564288]
3718I5564288j4766080j1910656q551936j0236416n844480o758912m031488k121216
3710C1343104l831808k736640m90496k409472p84384j854464P14752j882112p58272
3701A7310208L58912j986048P0656L3280n51424k10432o45632n40672P77216j589248
3691A3026816N8880k43200L13856j992192J540608k686976P34208K04288j082880
3682I873408O66112n37600n4784N2224o72256K7136o44096K68288p51104J641984
3672I869312r09312O05184q70912p59808J63328j107456J181696m23936L56864
3663H104960n78560k41664m4032l53280o4000m08064r16480J720832J23392j211904
3653F131200q6528L39456L21024r68704J778176o85056o58944k65728k7648M59264
$$ y = [95564288, 80798208, 68887552, 60335616, 50099200, 44254720, 37495808, 33464320, 31343104, 27511296, 24774656, 24284160, 21874688, 21090304, 19235840, 19950592, 18068480, 17310208, 17669120, 15683072, 15753728, 15787008, 15235584, 15025152, 14379520, 13838848, 14616064, 13026816, 13085696, 12842496, 13156352, 11164160, 12704768, 10017792, 10752000, 10956288, 9873408, 10539520, 10001920, 9947136, 9999360, 9327104, 9354240, 8710144, 8978432, 8227328, 9869312, 8960000, 9565184, 8694272, 7934464, 8097792, 6990336, 8172032, 7748096, 8104960, 7526400, 7284736, 7240704, 6887424, 6823424, 6415360, 5498880, 7219712, 7343104, 6131200, 6044672, 6384128, 6705152, 5736448, 7514624, 6829568, 6170624, 5904896, 5877248, 6336512]
3643F336512l36384j286144Q55552L68640q76032L43040L18976j524736J589760
3634E789184J56160q94464k9184P17824j70496k38592r49248O77376J10080J015296
3624F183936j792512J237504O67136j179136L69152J67424k18624n73952L73760
3615E234688p2704K32448L06688q30976M72064M92032n22752j243136K932224
3606G000576j766400N10976n9392r13408O36416N55520o22080R88160P57760j882624
3596E205504K124288l43040P66976j97120n2736l77856N4784j94560L45600p8848
3586G252992J210368O49216L97312k2528J02400M77696j67424l07200J267200
3577A0860032Q14080M65408J426432J487360J250816p44960O4512q96000r27232
$$ y = [6336512, 6000128, 4713984, 5569536, 5938176, 5062144, 5405184, 5724160, 4199424, 5789184, 5945344, 5050880, 5021696, 5739520, 5569024, 5330432, 4381184, 5058560, 5168640, 6183936, 4391424, 5628928, 6296064, 5116928, 5486080, 5653504, 5434880, 4860928, 5234688, 5161984, 5394432, 5701120, 4870144, 5342208, 5834240, 5311488, 4068352, 7000576, 5234176, 5745152, 5685760, 4772352, 5408768, 5964288, 5342208, 6330368, 7088128, 5205504, 7329792, 6986752, 7753728, 7556608, 7503872, 7126016, 7180800, 6986240, 7331840, 7252992, 8463360, 9112576, 9509888, 9487360, 9589760, 10067456, 9900032, 9592832, 10860032, 11674112, 12139520, 13565952, 15053312, 16304128, 15559168, 15623680, 14727680, 13800448]
3568A3800448j194496m77184Q60672r69728j491968J353216o65600j36192K6624
3559A1105792J387520r23648j95072j059328R32352N33504o28736L28192j484288
3550I996288J609216r3184j33120j73568l60960Q23296j118208Q44800P13216
3541A2107776O63040r7280J433088O94784K36032O77888J402368k80064J187840
3532A8025472k11968r97376m62848j504768M88448k075136l71712j556992j370624
3523I962496P72608K15552m65408r91744n6320J549824k265600Q26368L37920
3514I885696l60960j11616j60768L26144J38240J365504J172992K88256o80448
3505A1863040J562112j88416J7920l00544n94432J55136j883648l80928N64736
$$ y = [13800448, 12605952, 12128768, 12989440, 12019712, 10527744, 11880960, 11215360, 11079168, 11105792, 12493312, 11569664, 11374592, 10315264, 11247616, 11781120, 11152384, 11480576, 9996288, 11605504, 11512320, 11379200, 11205632, 10844672, 11667968, 10549760, 11394560, 12107776, 12770816, 12673536, 14106624, 14801408, 15037440, 15715328, 17117696, 16837632, 18025472, 17813504, 16816128, 16353280, 14848512, 15336960, 13261824, 12890112, 11333120, 9962496, 10735104, 10950656, 10485248, 9493504, 9437184, 10987008, 8721408, 9547776, 9885696, 9524736, 9413120, 9252352, 9578496, 9716736, 11082240, 12255232, 12543488, 11863040, 13425152, 13236736, 13254656, 12954112, 12359680, 12514816, 10631168, 10250240, 10814976]
3496A0814976j053696%j382912N65760j409536j22368m10112l02080J42848o20544
3486F222336L27680r00096M81280q50432J90976m75136J203712p23968j39776
3477E336576j19296o9632J45408p93088P26016m3520M17280j89952m15232J114112
3467F108672p18848N6320K1504r11360l3280n25312J059840m52096j8944o49728
3457C936768J144320k97472l51744K32448j042432m02432R65120q18688L75808
3448C741696l25120j79200N59104j8944k37056j173504k6112N87776j422848j02400
3438A403392Q52480M6080j95584K85696M97664o85056M56704m26496j97120L34848
3428B372608l98336l9424q85760M59776J024000I87648J392640j06496M00384
$$ y = [10814976, 9761280, 9761280, 8378368, 8944128, 7534592, 7412224, 7002112, 6700032, 6842880, 6222336, 6550016, 5649920, 6131200, 5280768, 5471744, 4996608, 6200320, 5476352, 5336576, 5217280, 5147648, 5293056, 4499968, 5225984, 5182464, 5599744, 5409792, 4994560, 6108672, 5389824, 5446144, 5467648, 4556288, 4523008, 3997696, 5057536, 4605440, 4586496, 3936768, 5081088, 4783616, 4431872, 4664320, 3621888, 3219456, 4184576, 3365888, 3741696, 3416576, 3237376, 3796480, 3777536, 3540480, 2366976, 2340864, 2928640, 1505792, 1403392, 2255872, 2301952, 2106368, 2392064, 2889728, 2204672, 2661376, 2234880, 2037760, 2372608, 1974272, 1934848, 1049088, 1508864, 2532864, 987648, 2380288, 2273792, 2674176]
3419B674176j166848n02784N01248K84160l06688J60256R88160m28032q13056
3410A390592F05696J568256N80608l59936j63840Q96000j439744J65376k06336
3401A646080O03648k68288K04800A051648M30080o23104J466368m096k97984N57568
3391B580480o54848N37600o85056n4784M65920r2672N1712E98016L9424O92736
3381A330176m9152k41152J418752o19008j84832m56192M7616J32096k18112Q78080
3371B038272L94752q07936K79040J79712j13152o67136L10272j07520J40800k37056
3361A410048J147904J7920I28768D00896K067456k27840I65632N21728j94560
3352A292800L62496p84384Q37120m49024Q92928o98368j83296R64096G48032M36224
$$ y = [2674176, 1507328, 1004544, 1505792, 1789952, 1483264, 1643520, 2631680, 2203648, 1390592, 605696, 2173952, 2754560, 2394624, 2230784, 3126784, 1687040, 1852416, 1646080, 2249728, 1981440, 2186240, 1051648, 1481728, 858624, 2324992, 2320896, 2022912, 2580480, 1925632, 2463232, 1778176, 1723392, 2189312, 2096640, 2148352, 598016, 637440, 1330176, 1281024, 1039872, 2458624, 1839616, 1654784, 1198592, 1246208, 1378304, 1160192, 2038272, 2433024, 1625088, 1904128, 2083840, 1970688, 1303552, 1613824, 1506304, 1647104, 1410048, 2557952, 2575872, 928768, 400896, 2468352, 2240512, 965632, 1487360, 1292800, 1655296, 870912, 1708032, 1259008, 2151936, 1453568, 1270272, 2234368, 748032, 1184256]
3342A184256D99712J362944K01728r01120J6384l21024J55648j60768B62144M74112
3332G36256p6288J038336p43424l59936q1408J089024P31136r71264E17632L79392
3322H97024r0624O93248n57056k77504P00928j04448Q81664r64096C73248M63872
3312H37120J123840A60256K28352N75488k0992K93376m79232J19296j04448K53440
3302A025536O00576m02432N1200J182208A40800P17824a07520A712640p42400
3293I70240j42848Q69376a6384G83872R30304C93728Q14592m06528J750016B10432
3282H44288H6016K29376c11808I75360C73760J003008L83488K11968r18016a057280
3271A430016n12000D40832L76832M42368J18272l98848K10432Q0384A70496R08800
$$ y = [1184256, 499712, 1862656, 2064384, 1163264, 1179648, 858624, 1014272, 853504, 262144, 736256, 659968, 1698304, 954880, 594944, 513536, 1602560, 2333696, 1362432, 517632, 897024, 806400, 1499648, 942592, 665088, 1366016, 1261568, 2143232, 1179136, 373248, 837120, 1960960, 160256, 388608, 964096, 943104, 1236480, 757248, 876544, 772096, 1025536, 1626112, 1223680, 1274880, 2457088, 140800, 858624, -107520, 1712640, 970240, 827392, 1696768, -16384, 783872, 1714176, 393728, 1208320, 801792, 2551808, 210432, 844288, 86016, 315392, -311808, 975360, 373760, 1376768, 1760256, 1972224, 1054208, -1057280, 1430016, 918016, 440832, 817664, 1260032, 1378304, 979456, 1189888, 1270272, 170496, 1079296]
3261A079296J9456e8368C32288M48512J00352m29568d58752I75872O06208E51936
3250A288192j5872F22080N2224E5808J752064n40160C98848R63584K12992F09280
3239D26496k048Q21760n15584B94400O45120M69504o71744O13888k02752E35040
3228A317888A80224J006592K72896M7104G23456l47648Q30976I2160M6080J268736
3218A406976l14368l48672J44384L66080B00192J251840o17984j10080l05152
3209D18816J013760o72256k90304c49696A023488A84832K14528O21568j51552
3200H69376J51552N8368K13504E14560Q60160m16256l28192P55200l28192m10112
3190F47168J2800K08384K23744J07008D81280m1472j98656J63840J074176D25984
$$ y = [1079296, 1098752, -58368, 332288, 780800, 881152, 451584, -458752, 975872, 1582080, 551936, 1288192, 1272320, 622080, 674304, 55808, 1807872, 1267712, 398848, 1362432, 1575424, 609280, 426496, 424448, 1246208, 730624, 294400, 939520, 1409024, 737280, 1351168, 1148416, 535040, 1317888, 180224, 1186816, 1459712, 1506816, 723456, 375808, 1206784, 92160, 138240, 1406976, 1092608, 743936, 888320, 1254400, 200192, 1452032, 834048, 723968, 418816, 1432576, 760320, 470016, -349696, 1023488, 184832, 399360, 1020928, 869376, 1020928, 1079296, 1292800, 514560, 1374720, 958464, 630272, 1385472, 1057280, 647168, 659968, 868352, 1092096, 1199104, 481280, 439808, 241152, 404992, 1479168, 425984]
3179F10816R0112Q22272p41888b11456G21920C24096J022976c10784B11456D6592
3168I4720b08896k78016I94816d608C15392J59744A2800R02144k03776C08224
3157A145856E24800O76352n58592k73408K67264c64032A153024g3728F08256k42688
3147C65568J62304K25280L39968k49856K61632l23584l53280k0480K74432J99168
3137H81152K26816G3216R16480N46304E33504a6896D24960Q97024E87776k77504
3127C10272O93248D32128h3968B12992J219584N65248n37600D92032J170944o7072
3117A595904l65056L87584N50912m76160J190912K46272j95072r0624J290752
3108D135424J160192o23616j31072m46464Q48384m13696p20384O05184O72256
$$ y = [610816, 700928, 1523200, 781312, -211456, 721920, 324096, 1347072, -310784, 211456, 46592, 94720, -208896, -486912, 994816, -4608, 315392, 475136, 12800, 914944, 711168, 308224, 1145856, 524800, 1201152, 642560, 369152, 636416, -364032, 1153024, -73728, 608256, 365568, 527872, 753152, 1093120, 843264, 1104896, 781312, 428032, 407552, 681984, 881152, 1107968, 73216, 989696, 1536000, 533504, -16896, 424960, 1321984, 587776, 310272, 1003520, 432128, -83968, 212992, 1432576, 1997824, 1460224, 492032, 1662976, 1595904, 1230848, 1618432, 2169344, 1693184, 2884096, 3130368, 2935296, 2844672, 4135424, 5295616, 4672000, 4540928, 4094464, 4942848, 4529152, 3808768, 4413952, 5086208]
3099E086208R11360R02144Q33536R71776K398720L416576K804736J7435648J1395584
3090D6156288J6143872K256896j6418304j8673152o372864m684800l214848o834176
3082H358912k012160j503232L78880j201664q50432J75616m30592k3040r09312
3073A982976J351680P66976j096192p6800k73408o14400K21184R728R216r0112
3063B190848j025024J682432p99232r58464K03264O46656o32320m29568L44064
3054A222656K91328J55648E09440M05504D44416N19680L2256D96640K18624J06496
3044H21760i34912D17280D5056a96608A504768k96960E18144R07264K42176K22720
3034A890304q69376k22208k21696R58464L82464H54528f35392A069568C2768J230336
$$ y = [5086208, 5997568, 6899712, 7733248, 8705024, 11103744, 14520320, 17325056, 34760704, 46156288, 62300160, 64557056, 48138752, 29465600, 23092736, 18407936, 15193088, 8358912, 6346752, 4843520, 5222400, 4020736, 3170304, 3345920, 2915328, 2892288, 1982976, 3334656, 4101632, 3005440, 2928640, 2655232, 2040832, 2262016, 2271744, 2280960, 2190848, 1165824, 2848256, 2049024, 1090560, 1293824, 1940480, 1308160, 878592, 1222656, 1513984, 1669632, 509440, 914944, 444416, 964096, 996352, 496640, 715264, 821760, -934912, 417280, 45056, -196608, 1504768, 1207808, 518144, 1425408, 1667584, 1890304, 1020928, 798720, 577024, 1535488, 1917952, 854528, -635392, 1069568, 32768, 1263104]
3024A263104C58912j66400P73632l93216L71200j21856P34208C03616J236480
3015A540096g59296F52800q704J048576B22208J236992J2288F15424a31584A487360
3004A107968J2288d93056H72448c3280D08064a008128A27488i5744E7344K75456
2994C32800O45632m70528B35008N28384L78368j47456r4208l76832c20000E120
2983D29568M32640J16224K92352r8304f54336A807872a83808I83040m86400k02752
2973B93888M58752L34336c68640A048576a71008B25280L94752d7616I57952J34144
2963A092096D36736Q2944h0384C11808Q82688c35360F15936B10432J054208B05312
2952D14720j4336L39456a536p33696A22368M61312d7104r00096D07552A31072
$$ y = [1263104, 358912, 192512, 966144, 572928, 944128, 822272, 1556480, 303616, 1540096, -759296, 652800, 644096, 1692672, 222208, 1459200, 1471488, 615424, -131584, 1487360, 1107968, 1120256, -493056, 872448, -33280, 408064, -1008128, 127488, -95744, 57344, 332800, 978432, 507904, 235008, 763392, 1141760, 994304, 900096, 523264, -320000, 5120, 429568, 862208, 978432, 1270784, 1172480, -654336, 1807872, -183808, 983040, 496640, 293888, 752640, 1086976, -368640, 1048576, -171008, 225280, 620032, -47616, 957952, 1092096, 436736, 519680, -80384, 311808, 1194496, -335360, 615936, 210432, 1264640, 205312, 414720, 400384, 739840, -1536, -735232, 122368, 583680, -47104, -947200, 407552, 131072]
2941a01888k048C02080N01248b3040D62848K76480j07008L05152C96800K16576
2931F13376n8880P38304n82656a81760G05024A12128A1264b14528r5744H8064
2920A061376H8576h25856K04800E15584M14208j2800c27680J16224A064448l33312
2910G31136k33472d27520D83328b60608I50784a87392m60288G69024c98848A330176
2899b92352A62816K31936B9696k048Q70912c42528J05472j32608E61152d00896
2888A365504b02752B56512J03424a1264D82816d91520H72448j52064D3520M72576
2878E16096d32640A91488G0656R216J522688n06880D09088e26848J37728I06752
2867B15040c67616o11840G33696C25120b3552G5264J094144F6048M15232J50016
$$ y = [-101888, -103936, 302080, 803328, -23040, 462848, 739328, 632320, 937472, 396800, 613376, 554496, 1292800, 710144, -181760, 705024, 112128, 11264, -214528, -310272, 88064, 1061376, 88576, -825856, -621056, 515584, 929792, 916992, -327680, -211456, 1064448, 731136, 497664, -427520, 483328, -260608, 950784, -187392, -647680, 769024, -398848, 1330176, -292352, 162816, 394752, 29696, 27648, 898560, -342528, -237056, -369664, 561152, -400896, 1365504, -202752, 256512, 359936, -11264, 482816, -491520, 872448, 720384, 43520, 516096, -432640, 191488, 70656, 79872, 1602560, 1095680, 409088, -526848, -389120, 906752, 215040, -367616, -979456, 733696, 325120, -23552, 75264, 1169408, 66048, 481280, 631296]
2857F31296M03968l37408A66400b06848D02432r1136N120a16224G65952K0480
2847G86432m6592g26016C90656L25632B37056Q31488B18112J217536o63040B31424
2836c35872I69728j95584A41312N95968m8640N91360F27200f59968A304576J78688
2826A483264C6864J020928A22368P01440m04992c33824E46816r0112R46688I7792
2815A526784A85344b56512D9152R07776l66592k76480R1136j17248b59072A5360
2804f144D20352J41824e37088m3520h7040l25632C86048i1136E43232O29248J77152
2793A349632m37248c17440J35168J7408A40800c78880D98688M89984B22720c0720
2782B21696N68832K6624D08064j28000b0992A612288D66944A77152K53952L03616
$$ y = [631296, 1035264, 697856, 166400, -206848, 402432, 311296, 316416, -116224, 765952, 786432, 739840, -726016, 390656, 716288, 237056, 1068544, 218112, 1435648, 772608, 231424, -335872, 969728, 774144, 141312, 737280, 688640, 1280000, 627200, -659968, 1304576, 1483264, 36864, 1057792, 122368, 823808, 418816, -333824, 546816, 456704, 1403392, 97792, 1526784, 185344, -256512, 49152, 956928, 590336, 313856, 404992, 287744, -259072, 15360, -6144, 420352, 562176, -537088, -580608, -87040, -412672, 386048, -91136, 543232, 1172480, 1349632, 912384, -317440, -182272, -164864, 140800, -378880, 498688, 988672, 222720, -30720, 221696, 790528, 817152, 408064, 280064, -20992, 1612288, 466944, 177152, 431104, 734720]
2772G34720g91552a93024H89856j46944O7584Q56576A53088L87584J39776a674752
2761G99232J6896k11968j19296P37280l74784k04800A10080a43360B39104M71040
2751G10144a73568B05824b39616G35232J33632A63840R95328C37408L58400k28864
2741D66944j67936j33632N47328d97152h9088j59232C87072D9152a080320B25280
2730d608m43904J84320n53984D03456b09920c2256r36960H64768c78368D93056
2719C17952K41664A05472N70368m6592A13152K65216b32960n4272D83328N632
2709D88960g6800A11616d0960A37728Q34560B82624P8848g27552C05664i95328
2698d12160D65408L68128a734144H21248g41376G31648f13376F40000c26144j0240
$$ y = [734720, -791552, -193024, 889856, 742912, 810496, 1667072, 153088, 540672, 680448, -1674752, 799232, 816128, 604160, 484864, 1222144, 847360, 642560, 110080, -143360, 239104, 710144, -173568, 205824, -239616, 735232, 868864, 163840, 1159168, 337408, 695808, 466944, 299008, 165376, 712704, -497152, -89088, -248320, 387072, 49152, -1080320, 225280, -4608, -448512, -264192, -818176, 403456, -209920, -32256, -969216, 864768, -378368, 493056, 317952, 559616, 105472, 675840, 629248, 113152, 378368, -232960, -287232, 483328, 488960, -76800, 111616, -40960, 137728, 972288, 282624, 361472, -727552, 305664, -995328, -412160, 465408, 833536, -1734144, 821248, -741376, 731648, -613376, 640000, -326144, -336384]
2688c36384C87072Q7040K92352L584F4000J81760a14176F92224a304576a70496
2677h60672G7824d80768E91872f3488H16128k59584n1200d32640F39488A024L05152
2666C06176c97312I65632f4512E17120d96128a024k59584F90688l39968c70688
2655g8848D40320A32608a229824A444864B01728L72224b29888G4240L4304g4752
2644A23904a15712p42400b54976k65728m23936B43200P10656d83840a43360D06528
2633D02432a28000j77664c584l54304a67424L3280B84160M0960L27168d82304
2622b9696j130496A1264J438208E59616d65920F16960A78176O22080B73920i95840
2611d38272j60768F21568a92000b9184k93376I98912C96288g54688b24768r2672
$$ y = [-336384, 387072, 474112, 766464, 770048, 64000, 245760, -114176, 692224, -1304576, -170496, -860672, 77824, -480768, 591872, -63488, 816128, 556544, 505344, -432640, 639488, 1024, 306176, -397312, 965632, -64512, 517120, -496128, -1024, -260608, 690688, 350720, -370688, -78848, 440320, 132608, -1229824, 1444864, 201728, 573952, -229888, 74240, 108544, -74752, 123904, -115712, -858112, -254976, -520704, -944640, 243200, 953856, -483840, -143360, 406528, 402432, -128000, -305664, -3584, -357888, -167424, -134144, 284160, 325120, 652288, -482304, -29696, -1160192, 11264, 1449472, 559616, -465920, 616960, 178176, 800256, 273920, -995840, -438272, -599040, 621568, -192000, -29184, -322560, 998912, 396288, -754688, -224768, -317440]
2601c17440k5600r74848B47296L23584k13504N10464a071104C5840J52576a85344
2590B01216d29568A156608b95936D04480e9392j146368C15392N46304l55840B44224
2579H6528L97824P08096B16064R8816j41312L71200A12640a09056d4032A123328
2568D25472c90656l49184H72960A29024h41728D20352g84896B6624b46272m29568
2558f75840A21856K85696a06496A18272J0752M21888h96000i8816b4576j83808
2548b08384C8400P9360L26656b87232E62688f17984b16576g5264G76192e41184
2537c95776B67264M33664A36192C5840c00032B81600j18784a90464F37440d88960
2526e38112B63168J030656C56864A15200e4784m06016F31296F5024a55648E22240
$$ y = [-317440, -343040, -1317888, 247296, 570880, 357376, 867840, -1071104, 35840, 188416, -185344, 201216, -429568, 1156608, -295936, 404480, -59392, -1205760, 315392, 861696, 505856, 244224, 86528, 484352, 1192448, 216064, 314880, 173568, 544768, 112640, -109056, -44032, 1123328, 425472, -390656, -739840, 872960, 129024, -841728, 420352, -784896, 26624, -246272, -675840, 121856, 407552, -106496, 118272, 129024, 550912, -896000, -98816, -24576, -208384, 38400, 117760, 444416, -287232, 562688, -617984, -216576, -75264, 776192, -541184, -395776, 267264, 700928, 136192, 35840, -300032, 281600, 162816, -190464, 637440, -488960, -538112, 263168, 1293824, 356864, 115200, -54784, -460800, 631296, 65024, -155648, 522240]
2515f4000G5264R74336A58208J134592b44736D32128A8944e16608l48672a88928
2504F4000a402880c75808k91328a36704m23424b9696j41824j90464k47808G32160
2493a88416D74112A536f6048n74464F78912j32096k0480a09056m23424J16224
2483d16256j064448d43392l60960A74080c87584C8912e60640E37600r1136a10080
2472c52768f3488o89152F09792G4752e78048j92000K81600P1168B10432f26688
2461I4720L32288A55136J93536a26976j414144B04800j5872e61152P1168J62304
2451c27680a55648m34688A13664C4816K00192L07200c55840A015808h38656r2160
2441i30816B0480L46624a530368g12704b36544A51040a13152d6080o5024j27488
$$ y = [-64000, 75264, 1049600, 158208, 1292800, -244736, 432128, 18944, -516608, -865280, -188928, 64000, -1402880, -375808, -667136, -136704, -560128, -29696, -171520, -361984, -609792, 732160, -188416, 474112, 1536, -66048, -640512, 678912, 546816, 526336, -109056, -532480, -416256, -1480704, -443392, -804352, 174080, -387584, 38912, -560640, 537600, 446464, -110080, -352768, -63488, -752640, 609792, 74752, -578048, -770048, -488448, -417280, 210432, -626688, 94720, 427008, 155136, 348672, -126976, -1541120, 204800, 188928, -561152, -489984, -327680, -155648, -590336, 113664, 34816, 235008, 542208, -355840, 1015808, -838656, -930816, 20480, 367104, -1530368, -712704, -236544, 151040, -113152, -46080, -111104, -238592]
2431b38592m46976c06176G69536e58592j8944J56672D00896g49056o5024r216
2421h23296b90816F20032e32480j56672p168F08768A34656H192b38592m67456
2411g06048A196544B49856j07520a85344A132544a536D14720e84192E13536J104896
2401A618432d36224A651712a34144j09056E96992J6896B31936o2976M56704J8944
2391F44608c10784a47456I16992h68864J75616J73568E67808h35584k78016B06848
2380B09408c7888k6624j014784G72608J23904f27200J51040E2736f70720J69984
2370e00736j63840j7408l91680D88448C5328a24416H44800e80608b87232m71040
2360g58272L66080G08608c58912A10080L74784b84160A69472a085440e40672a42336
$$ y = [-238592, -685568, -306176, 769536, -558592, -577536, -420864, 400896, -749056, -814080, -823296, -290816, 620032, -532480, -689152, -696320, 608768, 134656, 8192, -238592, -706048, 1196544, 249856, 142336, -185344, 1132544, -1536, 414720, -584192, 513536, 1618432, -436224, 1651712, -134144, -243200, 596992, 613888, 231936, 168960, 625664, 644608, -310784, -147456, 916992, -868864, -693248, -519680, 567808, -835584, -1113600, 206848, 209408, -37888, -64512, -1079296, 772608, 896512, -627200, -476160, 52736, -670720, -500736, -664576, -681984, -1073664, 488448, 35328, -124416, 844800, -580608, -287232, -758272, -392192, 708608, -358912, 110080, 484864, -284160, 169472, -1085440, -540672, -142336]
2349E94432c64544C82464i24672B15552d16768C46112Q7552K49344g93088C76832
2338C75296N8368i67680D00384C2256J226240E90848k49344K70848n4784f5024
2327A041408a7408n18656j64352Q6016C86560f23104A40800e57568l59936M44928
2317d72576D16768B3552N5296M48512c44576J13664G24992B83648A20320d58752
2306A054720H7552L88608a253888B23232K36032R7280j71520a27488j38752n63200
2296h29440A118208b56512p09632B4064g81312b22720J024D6080F144a87392I06752
2284F66112b29376B560M88960h7040D59776g85920B29376J56160P58784A0752
2273b25280E26336j50016a36192n91360G03488g45472L15392A89952d21888R9328
$$ y = [594432, -364544, 382464, -924672, 215552, -416768, 346112, 433664, 683008, -793088, 376832, 375296, 433664, -967680, 400384, 32256, 1258496, 590848, 341504, 612352, 557568, -65024, 1041408, -17408, -536064, -700416, -614400, 386560, -623104, 140800, -557568, -917504, -472576, 416768, 23552, 78848, 527360, -344576, -230912, 724992, 283648, 120320, -458752, 1054720, 87552, 476160, -1253888, 223232, 459264, 556544, 385024, -127488, -266240, -829440, 1118208, -256512, -966144, 24064, -781312, -222720, -221696, 46080, 6144, -187392, 906752, 666112, -229376, 2560, 491520, -87040, 459776, -785920, 229376, 385536, 1144320, 10752, -225280, 526336, 376320, -136192, -727552, 703488, -745472, -430080, 189952, -421888, -322560]
2263c22560D06528e74464l17440q3968G1168N50400q8064e91360E69344j38240
2253D31104b36544J05984B92864f35392A3824J085952a822208A94560B048a56672
2242d65408C14880O6560b3552H01280d06016G09632a00864n88288j15200G12192
2231C53280O21056b19648e5296B75968b66240o28224B28864c31264g4752p05024
2221g79776B90816a74080A248256E7344d02432E28384A94048M56704K40640f31808
2210G15264b45248n72416M608k87232f1440l81440a76640c8400B49856Q7552j41824
2199A95584a80736r19040E68832g58784D83328n9392N55520L0208b26304r05216
2189a131520N53984B20160d6592o82496n56544E20704f92224L13856a79712D43392
$$ y = [-322560, 406528, -574464, -891904, -975872, 71168, 621568, 533504, -591360, 569344, 431104, -236544, -130560, 292864, -635392, 13824, 1099776, -1822208, 194560, 2048, -156672, -465408, 314880, 381440, -23552, 801280, -406016, 709632, -100864, -689152, -804352, 712192, 353280, 974336, -219648, -55296, 275968, -266240, -894464, 228864, -331264, -74752, -779776, 290816, -174080, 1248256, 57344, -402432, 528384, 194048, 650752, 891392, -631808, 715264, -245248, -817664, -813056, -1100288, -61440, -442880, -176640, -38400, 249856, 337408, 195584, -180736, -1099776, 568832, -758784, 483328, 423936, 979456, 1009664, -226304, -1131520, -577536, 220160, -46592, -729088, -1285632, 520704, -692224, -378368, -179712, 443392]
2178e50912m16256c11296H19712c49696C70688b16064A89440e65248G63904d67968
2167c34336m77696K76480j08544k00704C30752a073664K72896D3008a452032b7136
2156f77888C22048d46976o18496a1776A339904a147904A58208a321984D51072
2146G2704N05856e90336J11616B89792A33120g39328A64352P02976B45760K83136
2136E28896k30400b5088B91328d13696m50560B56512P0656j16736b39616d6080
2125b87232k87232K24768m55168A843712a508352c79904E12512q0896b75456j34144
2115d09600B83136e8368A25952h25344a97120B54464h66304d9664B11456q2432
2105A29024a78688n44256E34016d4032j25952C072K71360e12512B87232e50400
$$ y = [-550912, -967168, -311296, 819712, -349696, 370688, -216064, 189440, -565248, 763904, -467968, -334336, -812032, -535552, -644096, -844800, 330752, -1073664, -800768, 43008, -1452032, -27136, -677888, 322048, -446976, -1065472, -11776, 1339904, -1147904, 158208, -1321984, 451072, 72704, 578560, -590336, -478720, 289792, 133120, -739328, 164352, 867328, 245760, 528896, 298496, -25088, 291328, -413696, -864256, 256512, 327168, 210432, -239616, -46080, -287232, -574464, -349696, -804864, 1843712, -1508352, -379904, 512512, 431616, -275456, -409600, 283136, -58368, 125952, -825344, -197120, 254464, -866304, -49664, 211456, 129024, -178688, -722944, 534016, -44032, -169984, 3072, 274432, -512512, 287232, -550400]
2094a12128k32960a09568D76672A1264L48672O30272a49504B18624g54688c04128
2083c04640l98848B07360K15040I728h45824c65056M096k07872d5056B88768r3696
2072A95072g29600K12480a48480o57408A164288C93728b24768F2464b79552B36032
2061A064960D12160g42400B03776R01632g3216l05664n62176E91872h03328G70048
2050c96288A085952n18144c16416N8880m65408B69824h66304c98848a15200n95968
2040g11168D96640e24288l87584a28000A03424g22432a97632j144320H73984b04800
2029d35712J63840j75616A84320e85728b42176N8368r82528I34912l97312h23808
2018D01920J81248K10432A96608a01888C8912b87232i7792A74592N1200l3792
$$ y = [-112128, -345088, -109568, 476672, 11264, 359936, 990208, -149504, 218624, -754688, -304128, -304640, -703488, 207360, 422400, 9728, -845824, -365056, -360960, -568832, -45056, 288768, 195072, -729600, -517120, -148480, -805888, 1164288, 393728, -224768, 62464, -279552, 236032, 1064960, 412160, -742400, 203776, 1105408, -73216, -378880, -941056, 591872, -803328, 770048, -396288, 1085952, 567808, -316416, -257536, -722944, 269824, -866304, -398848, -115200, -711168, 496640, -524288, -911872, -128000, 103424, -722432, -197632, -1341952, 873984, -204800, -435712, -271872, -447488, 184320, -585728, -242176, -183808, -1166336, 934912, 537600, -823808, 401920, 583168, 793600, 196608, -101888, 38912, -287232, -97792, 174592, 225792, 192000]
2008A92000G4240J20320b17088n42720G0144a255936O01600A1264g46496C96288
1997B5600d66432f7584E14560A02912b3552D64384A62304N27360j83808e44768
1986B42688b16576d7616B63680e61664A625600e30944A683968E3760N37088a22880
1975d27520n53984Q5504l75296c90144l54816D61312A96608J30560c33312l85024
1965g18336l5328o19008O65600b66752r93792O02624c2256k55488r2160G5264
1954G21920k14016c16928j04448n03296C02592h58624g4752p06048l02080I47200
1943d46464J67936m56192o98880c1232l64032R3696C28192d39296E2224b52928
1932B65216r7280L63008n4784K25792e32480B94912b12992l86048A02912c09760
$$ y = [192000, 74240, 194560, -217088, -759808, 70144, -1255936, -654336, 11264, -746496, 396288, 25600, -466432, -67584, 514560, 102912, -23552, 464384, 162304, 689664, 505856, -544768, 242688, -216576, -47616, 263680, -561664, 1625600, -530944, 1683968, 53760, 590848, -122880, -427520, -981504, -896000, -1271296, -390144, -744960, 461312, 196608, 327168, -333312, -718336, -753664, -1372672, -707072, -266752, -1260544, -657920, -32256, -287744, -379904, 75264, 721920, 507904, -316928, -421376, -924672, 302592, -858624, -74752, -780800, -1082880, 947200, -446464, -278528, -734720, -1433600, -31232, -395264, -301568, 328192, -439296, 52224, -252928, 265216, 167936, 530944, 476160, 701952, -532480, 294912, -212992, -599040, 102912, -309760]
1921i08800K58048n39648I4208a69472I03168B6112M42880b92864B0992e85216
1910d19840j89952E07904A12640h07936n12512B56000c99360k74944b30400p50592
1900i80992E35040J09568k78016i96352o2976c30752F25664c21536l86560E92896
1889G2192c01568q19712E44768K07360a65888n84704C83488I8816O50752@e4784
1877B66240g53664j8432A95072e07904J00352q45824d55680N6832G8848b66240
1866f93248E45280e56032Q6528D72576J13152m0960A04448K03776i74336C50208
1855h82688C45088g86944a15712k22208q24832e64224D80256A29536a19296B61120
1844i56416b04800n52448K11968K08896k62656C72736j82784g05024q704K3040
$$ y = [-908800, -650752, -1190400, 94208, -169472, 903168, 26112, 468992, -292864, 20992, -585216, -419840, -609792, 507904, 112640, -807936, -1320448, 256000, -399360, -674304, -230400, -980992, 535040, 644608, 366592, -996352, -1059328, -330752, 625664, -321536, -708096, 592896, 72192, -301568, -1121280, 544768, 752128, -165888, -750592, 383488, 98816, 749568, 0, -54784, 266240, -753664, -772096, 195072, -507904, -407552, -1253376, -455680, -398848, 78848, -266240, -693248, 545280, -556032, -469504, 472576, 585728, 544768, 104448, 308224, -974336, 350208, -882688, 345088, -786944, -115712, -337920, -1162752, -564224, 480256, 129536, -119296, 261120, -956416, -204800, -757248, -545280, -336384, -599040, 372736, 189952, -705024, -713728, -690688]
1834f90688a77152D4032M30080g97184B21696a145344b43712L0208m04992B73920
1823i34400H6016i79456b14016C88608a057792d91008J84832A71520a63840I0112
1812c08736F54848l07200a82272q33024J81248F5024h29440a25440G21408C584
1801e98528L1232A7408a50016n60640k09920A105920E4784J73568e43744b43200
1790a57184j19808q15104H82176g71584b48320R5232l6352r4720j73056F30272
1779A237504f12352o6048K63680C08224a59232r33888D17280a348608N50400J51040
1769f47168f5536o5536F83520e10464A007616b88768F46656e29408A03424K59072
1759C62496d96640l39456B74432D3008J15200C2256L77856a027584J48480D65920
$$ y = [-690688, -177152, 44032, 474112, -797184, 221696, -1145344, -243712, -213504, -618496, 273920, -934400, 86016, -979456, -214016, 388608, -1057792, -491008, -306176, 171520, -163840, 90112, -308736, 654848, 347648, -182272, -1015296, -834048, 65024, -829440, -125440, 721408, 3584, -598528, -567296, 17408, -150016, -710656, -920576, 1105920, 54784, 228352, -543744, -243200, -157184, -276992, -1092096, 882176, -771584, -248320, -153088, -189440, -284160, -457216, 630272, 1237504, -612352, -678400, -414720, 308224, -159232, -1093120, 417280, -1348608, -798208, -647168, -65536, -131072, 683520, -510464, 1007616, -288768, 646656, -529408, 103424, 362496, -496640, -836096, 274432, 43008, 158208, 32256, 410112, -1027584, -879104, 465920]
1748h98560L75296n38624J15200c51744A32608a66400n28384D27008h5504B34496
1737H04864G2192b26304B36032f10304a42336j97120A295360b08896R0112b5600
1726B10944a158656C49184K3040c3792A5872J536a211392F55360C5328c81952
1715d80768A42336g18848J59744F03648J72032g49568A05984e29920a45920F44608
1704B0992a07520C83488a04960F38976K88256m02432b41664A07520k1504R728
1694I5744a72544j56672A371648D58752d82816A132544e69856N9392a46432n3760
1684b00192Q7552m49024K71360Q192A77664R6768g40352b3552o65600k19648F80960
1672h03328b54976j68960j016320M94592A64352M07040K82624G4752q704g7312
$$ y = [-898560, -523264, -1061888, -946688, -351744, 132608, -166400, -694784, 427008, -85504, 234496, 804864, 72192, -226304, 236032, -610304, -142336, -339456, 1295360, -208896, -118784, -25600, 210944, -1158656, 349184, 372224, -33792, 15872, 17408, -1211392, 655360, 35328, -381952, -480768, 142336, -718848, -559104, 603648, 775680, -749568, 105984, -529920, -145920, 644608, 20992, -107520, 383488, -104960, 638976, 927232, 524800, -241664, 107520, 86016, 95744, -172544, -329216, 1371648, 458752, -482816, 1132544, -569856, -510464, -146432, -200192, -112640, -561664, -290304, -282112, 177664, 274432, -740352, -23552, -689152, -908800, 680960, -803328, -254976, -423936, -1440256, -945664, 164352, 571392, 854016, 74752, 66048, -77312]
1661a202688c72736D19328c16416i5744o4512o4000B48832a88416e3248E76000
1650h48384C64032O70208d99712A69984b2528K048j770496B46784c64544m33664
1640g98208i5232q39168E1712J9968f54848b02240l07200E07904a8944D27520
1629G70560c50720k70336E10464f6560o9632F2464b6624C56352J63840f34880
1618h69888a76640o5024d5568q15616K52928k80576F71232e4784E55520e74976
1607G48032a41824l58400E41184d07552m28032A38240B8672a135616b27328C96288
1596A81760c13856E20192k24768A47456h46848C47136L27680g91552M3520B48320
1585d88960J57184l24608D09600f00064b37056D50560d608m72576O6560A68960
$$ y = [-1202688, -372736, 419328, -316416, -95744, -160256, -224256, 248832, -188416, -53248, 576000, -848384, 364032, 1034240, -499712, 169984, -22528, -20480, -1790976, 246784, -364544, -798208, -95232, -934400, 51712, 71680, -654848, -202240, -509440, 507904, -18944, 427520, 770560, -350720, -621056, 510464, -66560, -136192, 62464, -26624, 356352, 520192, -634880, -869888, -176640, -241664, -45568, -861184, -608256, -888832, 671232, -54784, 555520, -574976, 748032, -141824, -500224, 541184, -407552, -835584, 138240, 28672, -1135616, -227328, 396288, 181760, -313856, 520192, 295424, 147456, -846848, 347136, 674816, -791552, -748032, 248320, -488960, -331776, -656384, 409600, -600064, -237056, 450560, -4608, -477184, -410624, 168960]
1574G19360B89280c072m6592o18496C88608M39296a078272L072d10624A108992
1563h0896k43712n5808F68160A39776f14912O7584D89984f71232K65216J46944
1553b59072l74784q40704F30272b38080B60096J12640F6048P85408d63872A00352
1542C60448g38304A18272n3760g62368o8608l25120N63712m95104j55136C28192
1531b11456A01376J25952a007616A89952L79392a474048f86592Q5504A37728o8608
1521F9120P5776n9392c30752E5296c21536J30048A41824g21920b60608k59072
1511e19680K20672A495552a126912L64544b57024n96992K99008J74592m80768
1502h61184b74432B26304f6560j95072A281536n99552F9120e51936j43360k7648
$$ y = [719360, 289280, -3072, -49664, -668160, 388608, 827904, -1078272, -1075200, -410624, 1108992, -80896, -324608, -380416, 668160, 139776, -614912, -547328, 489984, -671232, -406016, -259072, -633856, -1474560, 630272, -238080, 260096, 372736, 66048, 851456, -463872, 100352, 360448, -738304, 118272, 64512, -762368, -830976, -1156096, -592384, -1087488, -1242624, 328192, -211456, 101376, 227328, -1007616, 189952, 569344, -1474048, -686592, -601088, 137728, 69120, 144896, 85504, -330752, 55296, -321536, -191488, 141824, -721920, -260608, -519680, -299008, 1495552, -1126912, -762368, -257024, -854016, -555008, -380416, -861184, -274432, 226304, -66560, -261632, 1281536, 681984, 69120, -551936, -695296, -722944]
1492g22944B03264j5872c67616J56672c6352r77920n17120g43424d608o88640
1482f93248g0656l12320j83296E7856a19808B41152i32352b9696j03936k53952
1472c87584C26144b36544i0112G97184g87456L13344J45920k69312m84352I2160
1461c7376j135104L47648b80576J09056H59136l28704j87904G9360g57248a82272
1450D49536i11872c02080B71360c94240b0480D71552K98496A00352b58048A87904
1439D19840j44384a085952a28000j640448e43744b34496l30240K5088n96480M15744
1429g20384C35360d92544A30048J14688J54112A1776a318912a81760E24288a550336
1418a432576e22752C4304R3696e14560a32608j37728B86208c71200f0416l23584
$$ y = [-722944, 203264, 187392, -367616, -210944, -36352, -1014272, -1531392, -743424, -4608, -693248, -70656, -382976, -566272, 57856, -119808, 241152, -932352, -29696, -133632, -387584, 326144, -236544, -90112, 797184, -787456, -474112, -328192, -597504, -1081856, 92160, -37376, -1172480, -824832, -280576, -171520, 859136, 530432, 342528, 79360, -757248, -182272, 449536, -911872, -302080, 271360, -394240, -20480, 471552, 770048, 100352, -258048, 187904, 419840, 275456, -1085952, -128000, -1768448, -543744, -234496, -564736, -539648, -1136128, -720384, 335360, -492544, 130048, 244736, 398848, 11776, -1318912, -181760, 524288, -1550336, -1432576, -522752, 34304, 128000, -514560, -132608, -270336, 286208, -371200, -60416, -384000]
1408c84000m40320c35872H25856j72032g51104K28864j25440a96608K7136r10336
1398a079808C9936a261568b16064o90688A74080M096k9184B2016d67968A35680
1387F11328b86720k47296l16416K17088j89440b43200m65408b31936k46784f1440
1376I39008B14528g96672D23424A94560h19200L41504d0960C7376e09952b19136
1365a208832D13184d76160Q0384J04960B41152J23904g52128K74944p95136C52768
1354e99040K6624j592832C6352g5776A61280a7408l54304J2800l23072F6048K50368
1343C16416f98368g7312F29248g66464K94400I56928A22880c12832E06368g73632
1332d68480G65440d83328D08064j66400a34656A15200g58272L11296k0992r52832
$$ y = [-384000, -824320, -335872, 825856, 653824, -751104, -522240, -647680, -196608, -169472, -1079808, 39936, -1261568, -216064, -906752, 174080, 178176, 148992, 22016, -467968, 135680, 611328, -286720, -534016, -850432, -633344, -822784, -243200, -708608, -231936, -478720, -61440, 939008, 214528, -796672, 423424, 194560, -819200, -477696, -40960, 37376, -509952, -219136, -1208832, 413184, -476160, -395776, -290816, 241152, 365056, -752128, -477184, -1272320, 352768, -599040, -572416, -2165248, 36352, -75776, 161280, -17408, -371712, -358912, -681984, 66048, 316416, -698368, -77312, 629248, -766464, -472064, 956928, 122880, -312832, 506368, -773632, -468480, 765440, -483328, 408064, 241664, -134656, 115200, -758272, -446976, -467968, -1420800]
1322a420800e60640J17760H1408e85216M0448b23232F86592b13504F34880e95456
1311A54112E632L36896b15040c9424n20704J32096a88928k07360F37440K89792
1301I27232f87616A86880a044480C0208h38656k69312b85696m25472G37792d14208
1290e0176r01632d44416C64032b56512A33120O28224l48672a071616b03264c4304
1279b14528l16928A296384c36896l13856j6384l584p2704c04640B37056g50080
1268i69216K88256i728j079808G55712c47648E91872J54624b40640l74784B62656
1257c91168A34656h42752A99680a41824p63904B76480F5024b28864n6832e6832
1246h4992j71008G72608b29888B58560G680J22880P17312l65568f17984n3248
$$ y = [-1420800, -560640, -442880, 81408, -585216, -544768, -223232, 686592, -213504, 634880, -595456, 154112, 5632, 342528, -215040, -39424, -560128, -428032, -188928, -396288, 637440, 927232, -687616, 186880, -1044480, 30208, -838656, -1107968, -285696, -711168, 737792, -414208, -50176, -951808, -444416, 364032, -256512, 133120, 761344, 412672, -1071616, -203264, -34304, -214528, -531456, 1296384, -336896, -650752, -667136, -670720, -743424, -304640, 237056, -750080, -969216, -680960, -9728, -1089536, 755712, -347648, 591872, 746496, -240640, -615424, 262656, -391168, 134656, -842752, 199680, -141824, -905728, 276480, 65024, -228864, -285696, -56832, -84992, -256000, 772608, -229888, 258560, 7680, 130560, 847872, 482304, -617984, -671232]
1236f71232a8944A005056c91168q0384a55136m96128j45920L59424o2464Q4480
1226d15744l96288b25792j41312J07008k09920j09056J46944g0656m10112E13024
1215d5568o92224A35680f70208C00032g64416K84160K38080l23584p0656b93888
1204a35680E65248A87904L15392f1952p41888J9968C65568a76128j11616j92512
1194d80256J59232j71520R7792M5568A119232d44928m80256B89280L98336b83648
1183A79200a70496r4208m66944r4208P680D7616G680O18496a274880b34496A01376
1171d89472n45280K39616c12320J30560j34656A70496c79904j93024a43872B83648
1160b28352q11520c52256j08544C27168K82112j01376f29248A29024e6320l93728
$$ y = [-671232, -18944, 1005056, -391168, -471552, -155136, -651264, -797184, -437760, -500224, -415744, -812032, -225792, -367104, -260096, -470016, -579072, -432128, -70656, -480768, 513024, -45568, -737792, 135680, -670208, 300032, -764416, -480256, -242176, -565760, -636416, -293888, -135680, 565248, 187904, 503296, -61952, -803840, -783872, 365568, -176128, -287744, -480256, -321024, -492544, -394752, -349184, 1119232, -444928, -925184, 289280, 687616, -283648, 179200, -170496, -264704, -731648, -825856, -818176, 47616, 7680, 626176, -1274880, -234496, 101376, -489472, -1034752, -795136, -312320, -181760, -316416, 170496, -379904, -572928, -143872, 283648, -228352, -1039872, -352256, -460800, 327168, 609280, 507904, -629248, 129024, -56320, -450048]
1150d50048D55680a091584c23584A022976h75520R8304e8368n45280D84864m2496
1140D42368c31264m10112a54112E8368i15968I88160C93216L6864n8880h5504
1129d81280B59072c85536E70368f96832p35744e83680J27488J99680n24800C35360
1118i74336c20000G13728a467904O52288F54336h57600A77664p6288g34208K08896
1108e25312r9328K44224p69024D10624L79904m9664h78592B1504a372160a59232
1097e28896B37056b560@h4992l4816B08384a050624a43360k52416o06720C81440
1085a24416F07232A59232N68832c52256J47968n63200A13664b31936D00384C0208
1074a355776L66080a21344H1920g82848G42912e85728b2528l47648E79072c06688
$$ y = [-450048, 455680, -1091584, -323584, 1022976, -875520, -777216, -58368, -603648, 484864, 442368, -331264, -741376, -154112, 58368, -915968, 988160, 393216, 430080, 371200, -85504, -481280, 259072, -385536, 570368, -696832, -1432576, -583680, -456192, -256512, -781312, 335360, -974336, -320000, 713728, -1467904, -815616, 654336, -857600, 177664, 101376, -734208, -525312, -624640, -380416, -1149440, 410624, 790528, 740864, -878592, 21504, -1372160, -159232, -528896, 237056, -2560, 0, -84992, -119808, 208384, -1050624, -143360, -395776, -1002496, 381440, -124416, 607232, 159232, 728064, -352256, -204288, -767488, 113664, -231936, 400384, 30208, -1355776, -989696, -121344, 81920, -782848, 742912, -585728, -22528, -370176, 579072, -306688]
1063A09568M43904c05664n11488D04480d73600k11968A103872E17632M45440j65376
1053G97696l92704l3792I1648e8880C33312q192d39808r216J34656k22720L7888
1042d99200o97856d81280n7344G92064e35040C22560R2672e32480A484288B40128
1031D55680L2768K68800a0240r60512B25792b25792B88256G3216d24448A084928
1020C22560i08800d34176k4576a32608C17440d3008j013760A180672b46784B91840
1009c25632F48192d07552F74816A1776K56000K77504B5088a12640b6112k076160
999b102272c98848C59424h11008A55648c95264A32608g1680j41312C09248i7280
988A219584I9840a441280E75488a51040o11840r9840d10624Q3456k70336a14176
$$ y = [109568, 553472, -305664, -817152, 404480, -473600, -685568, 1103872, 517632, 963072, 797696, 404992, 371200, 91648, -58880, 333312, 325120, -439808, -449024, -314368, -537088, -499200, -1197056, -481280, -538624, 792064, -535040, 322560, 415232, -532480, 1484288, 240128, 455680, 488448, 757248, -10240, -970752, 225792, -225792, 288256, 73216, -424448, 1084928, 322560, -908800, -434176, -458752, -132608, 317440, -43008, -1056768, 1180672, -246784, 291840, -325632, 648192, -407552, 674816, 11776, 267776, 545280, 25088, -112640, -26112, -2102272, -398848, 359424, -811008, 155648, -395264, 132608, -71680, -212992, 309248, -97280, 1219584, 99840, -1441280, 575488, -151040, -762880, -862720, -410624, -327168, -597504, -114176]
977d92032m96128D18816e46816l59424Q7552B51904a129984d12672q60160B0992
966B69312b85696M2496A80736J024c42016j1264D5056a46944A39264c72224O1952
955c10272E2224O37440B55488h45312b74432r04192b25280C1232a116672b73408
944E14048f81472a90464I51808b4576l1744p8336m62336E2736J348608a171968
933g04000J72032e3248G3216a239552c27168m88448B88768A08544j4336K33472
923C27680c44576d3520m72064j14176P0656o45120e91360E8880J7408a66400j01888
912b68288Q1408j210880B7136N48352e32992b08384i5232E30432K91840e76512
901D70016f83520K34496l83488e120A90976a038336o7584C74272O73280A67424
$$ y = [-492032, -988160, 418816, -546816, -906240, -818688, 251904, -1129984, -412672, -1272832, 20992, 269312, -285696, -243200, 180736, 181760, -342016, -353280, 45056, -146944, 139264, -372224, -310272, 52224, 689664, 255488, -845312, -274432, -1178624, -225280, 31232, -1116672, -273408, 514048, -681472, -190464, 951808, -24576, -56320, -134656, -596992, 52736, 1401344, -1171968, -704000, -531968, -53248, 73216, -1239552, -327168, -815616, 288768, 108544, 94208, 327680, -344576, -43520, -515584, -629760, -559104, -1204224, -591360, 58880, 76288, -166400, -268288, -186880, -1397760, 27136, 575488, -532992, -208384, -95232, 530432, 822272, -576512, 470016, -683520, -449024, -832512, -5120, 190976, -1038336, -1105920, 374272, 1047552, 167424]
890D19840b21184A33632O58432c25632B81600a050112L86560j32608H66816A81248
879h46848o5024p13216e02272B24256a02400H81152g4752F43072e56032k5088
869e81120b65728m74624H64256b8672j162240b30400j238016b57024C5328f17472
858a52576B70336D5568f59456k17600E4272b02752K4576n30432b40128C73248
847f77376c38432l21536n99040L91168b50368C97824a26464m98688A44384d02944
836e3248A043968D67968a99168e5296l97312%k02752n9392b2016j465344e6832
824b66240m07040j64352B01728b22720C6864K01728m3008P4752a21856D79232
813a000960d82304a83296r52832N05856m51584c12832B84672L6352a083392c91680
$$ y = [419840, -221184, 133632, 792064, -325632, 281600, -1050112, -663552, -796160, 866816, 181248, -846848, -911872, -1625088, -502272, 224256, -102400, 881152, -74752, 643072, -556032, -581120, -265728, -740352, 864256, -28672, -1190912, -230400, -1468416, -257024, 35328, -617472, -152576, 270336, 45568, -659456, -877056, 54272, -202752, -178176, -708608, -240128, 373248, -677376, -338432, -659968, -1259008, -867840, -250368, 397824, -126464, -625152, 144384, -402944, -53248, 1043968, 467968, -199168, -55296, -452608, -452608, -655360, -714752, -22016, -1487360, -56832, -266240, -673280, -837632, 201728, -222720, 36864, 238592, 195584, 270336, -121856, 479232, -1000960, -482304, -183296, -1136128, -630272, -1081856, -312832, 284672, 321024, -1083392, -391680]
802A99168a14688r53344c11296A03936K04800a6896C0720a2800E89312K61120
792H50432b26816D52608B0480f3488j55648o29760M03968F7584a23904m5568I24672
780A64864d23424e6320k88768B39104d59264a42848A03936M08576C7888M63360
770E01248e58080o50240a61280C66080p8336c6352r00096d61312n83680K72384
760g72608D09088j2800g22944H84224e57056K43712A60256i7280A62816J5360
750A78176I728J11104b82112G74656i42592d12672F15424f22080E2224a260032
739i26720B5088M4544R5744b17600C6352a382912C60960a000448k81600d59264
728i24160K92864H6016M1984b99008m55168m35712K27840d79744D47488L19488
$$ y = [199168, -114688, -1068032, -311296, 103936, 308736, -16896, 30720, -12800, 589312, 850432, -226816, 452608, 20480, -63488, -219136, -848896, -444928, 67584, -123904, -169472, 924672, 164864, -423424, -56320, -345088, 239104, -459264, -142848, 103936, 512512, 37888, 501248, -558080, -1208320, -161280, 366080, 287744, -36352, -936448, -461312, -1044992, -772608, 409088, 396288, -722944, 884224, -557056, -313344, 160256, -97280, 162816, 178176, 9728, 120832, -282112, 774656, -942592, -412672, 615424, -622080, 52224, -1260032, -926720, 25088, 69632, 165376, -217600, 36352, -1382912, 360960, -1000448, -1282048, -459264, -924160, -631296, 86016, 128000, -299008, -754176, -1189888, -962048, -479744, 447488, 766976]
718G66976e23776l6864F6048b60096n63200K78016B53440g72608A28512f34368
707h01792b048l85536E61152e52960k5600j85856b4064l93216J23392A86880K88256
696D75136b52416C68128h32512k90816J20832C50208A17760Q71936h53504A34656
685i45664A0240a376768H15616a06496H76032a72544n22752A37216o5536b92352
674a6384k39616A97632P3216e0176j52576B66752K47808a668096N53472c78368
663F65600D1984b30912B43200J76128i39008a2288B58560c67104p81824c97824
652c8912B14016n1200F1952L70688c584j96608E36576h17152E65248h75520l21024
641a196544D54144j68448e07904A724928a72032m77696G8336K17088A4848a77664
$$ y = [766976, -523776, -560640, 66048, -260096, -823296, -545280, 253440, -772608, 128512, -634368, -801792, -2048, -387584, 561152, -552960, -578560, -764416, -24064, -417280, -293888, 186880, 475136, -252416, 368128, -832512, -1123328, -1002496, 350208, 117760, 989696, -853504, 134656, -945664, 10240, -1376768, 815616, -106496, 876032, -172544, -695296, 137216, 71680, -292352, -16384, -256000, 197632, 270848, -50176, -202752, 266752, 514560, -1668096, -1114624, -378368, 665600, 41984, -230912, 243200, 419328, -939008, -12288, 258560, -367104, -1148928, -397824, -38912, 214016, 162816, 61952, 432640, -3584, -200192, 536576, -817152, 565248, -875520, -1196544, 454144, 285696, -507904, 1724928, -172032, -649728, 78336, 295424, 14848, -177664]
630d45952j99168K07360B97984b01728A83296a27488G23968k4576b73920l11296
620e85216C32288g75168B09408I1648d0960n29920G86432a60768I0624M32128
610E22752a024000K24768C31264e07904l46624J52576c08224j02912m71552K8672
600h54016I2160J6896J24928h30976J00864L44064R8816A349120F1440a16224
589i05728L06688j86880a56160B83648O2976P6800K53440b66240l80416J54624
579d92032K2016a50528j15200k25792B12992M43904c62496A37216J46944A39776
568a181696m2496c16928j378816G81824p5776a017344A03936a219072B30400d46464
557c57376G05536B0480J056768i98400a41312A50528P28576a72032L5328o3488
$$ y = [-445952, -645120, -437760, 297984, -201728, 183296, -127488, 723968, 699392, -273920, -585216, 332288, -775168, 209408, 91648, -40960, -570880, 786432, -160768, 90624, 522752, -1024000, -799232, 331264, -507904, -854528, -701952, -308224, -411136, -882688, -854016, 92160, 109056, 233984, -830976, -730112, -386048, -287232, 1349120, 61440, -116224, -905728, -599040, -785920, -156160, 283648, 346624, 423424, 676864, -266240, -646656, -492032, -470016, -150528, -265728, -491520, 212992, 656896, -362496, 137216, 284160, 139776, -1181696, -1224192, -316928, -1695744, 781824, 706048, -1017344, 103936, -1219072, 230400, -446464, -357376, 705536, 20480, 1077248, -998400, -141312, 150528, 879104, -172032, -136704, -200192]
547b00192k76480E84704b40640E68320a47456k46272A05984d30592J9968F33344
536I20064g13728h9600I9840L74272D1472c40480R3696A52576O31296B95936d13696
524F27712q2432d3520o40512J19296A9968K23744L29728g13728A71008e84704
513i86112D05504f21568B05824b74944p36768A201664n27360b47808o9120k74432
503e91360D85376M17280e43232a07008o47168G2704M64384A55648f36416j92000
493h28416b74432a02400m57216D22400K85184a79200j024512B9184g19872J33632
483e86240g1168k93888m7616A083904e50912B1504e99552d4544o30272A60768
472e65760E89312c81440a536j77664a6384j283072a22880D04480L71712l10272
$$ y = [-200192, -476672, 584704, -240640, 568320, -147456, -393728, 105984, -430592, -410624, 633344, 920064, -713728, -89600, 99840, 474112, 41472, -340480, -246784, 152576, 783872, 295936, -413696, 627712, 545280, -43520, -684032, -564736, 19968, 243712, 573440, -713728, 171008, -584704, -986112, 405504, -621568, 205824, -274944, -1011712, 1201664, 674304, -247808, -316928, -591360, 485376, 902656, -543232, -107008, -754176, 72704, 537088, 155648, -636416, -828416, -274432, -102400, -559616, 422400, 707584, -179200, -1203712, 29184, -719872, -586240, -71168, -365056, -412672, 1083904, -550912, 21504, -599552, -44544, -674816, 160768, -565760, 589312, -381440, -1536, -179200, -16384, -1299456, -122880, 404480, 776192, 465920]
462D65920J44384b90304k30912K17088P1168B57536b81600j202176D1984i26720
451a59744D4032L03616Q81664b89792A097216b3552l63008k35008D6592L82464
441D29056c03104l13344A09568R7792L69152c71200o35392g9360j16736m20352
431f16448a89440D46464g21408L1744j21856k95936c18976C99872g40864K86208
421d54656F88640b96448F3488a196032M86400d9152j65376o98368o01088G49056
410h24320M06016a81248l29216a32608o86592C82976a059328E19168f37440r96352
400a633792A287168C77856e74976b17600F67648H4480o144b560o41024A99680
389e98528b11968F87616J37216e31968H704a13152r60000d18304j92512m8640
$$ y = [465920, 610304, -290304, -521216, -304128, -232960, 257536, -281600, -1483776, 41984, -926720, -159744, 44032, 347648, 1229312, -289792, 1097216, -23552, -386560, -621568, 46592, 429056, -303104, -616448, 109568, 207360, 576512, -371200, -1006592, -79360, -196096, -616448, -189440, 446464, -721408, -689664, -811520, -1107456, -318976, 399872, -740864, -454656, 688640, -296448, 63488, -1196032, -709632, -49152, -214528, -912896, -1513984, 749056, -824320, -418304, -181248, -510464, -132608, -819200, 382976, -1059328, 519168, -637440, -1633792, 1287168, 377856, -574976, -217600, 667648, 84480, 78336, -2560, -643584, 199680, -598528, -211968, 687616, 824832, -531968, 8704, -113152, -1073152, -418304, -610816, -659456]
379f59456a77664C97824a94048r03168L94240B29888M24448f91712J11616J86368
369c93728A1264e80608K82624G18848A1264M34688I3696f56384K92352i3696@
357F4000O13888g55712K90304D11648e2224E11488n120C3792R216a064960a79712
345a35680H14080k90304g4240m78720D72064g03488b06336Q7040n8368j203712
335a381376d87424j22880a0240j193984I6256J2800h12544K62144K06336l07712
325f51776B73920a17248r05728b14016H64768c75808J2800a77664D52608b88768
314g57248G3728c80416J73056l35360I45664B5600J84832d74624k87232a05984
303f5024k02752o23616L17440m39808A31072L11296A49504R7792j20832g20384
$$ y = [-659456, -177664, 397824, -194048, -1097216, -702976, 229888, 654336, -691712, -580096, -393728, 11264, -580608, -297984, 718848, 11264, 445952, 93696, -656384, -364032, -93696, 0, 64000, 677888, -755712, -465408, 411648, -52224, 511488, 506368, 33792, 43008, -1064960, -179712, -135680, 814080, 523776, -74240, -552960, 472064, -703488, -206336, -119296, -177664, -1381376, -487424, -610304, -10240, -1204224, 96256, 109056, -812544, -550400, -344064, -651776, 273920, -117248, -1022976, -214016, 864768, -375808, -363008, -177664, 452608, -288768, -757248, 73728, -380416, -207360, -542720, 945664, 25600, 210432, -474624, -761856, -105984, -65024, -267776, -891392, -573952, -1013760, 131072, 442368, 149504, 247296, 126464, -720384]
292H20736N8880g84384E64736B54464K50880k08896b60608c9936n06368C43552
281b28864J10592j307136F72256b73920F13376f47680i1136B37568J25952b66240
270b89280J07520k98496A442816e43232m88960J62816O5024b26304I03680e57056
259c11296N7856F5024K2528h50432a82784B36544L89120d35712A57184N9904h75008
247a78176B52416b45760m7616q48896L18464e8880B45760d8640j09056k01216
237c58912o42560K97984F14912B87744a477632b93888H29440h03840K36544D94592
226f24640m50048G1168R5232i3184I96864a191936M58240l72224A51040D608K51904
215B56512a170432b35008m65408b06336B92352J89952d16768K07360A206272i16480
$$ y = [820736, 879616, -784384, 564736, 254464, 505344, 296448, -260608, -39936, -546304, 343552, -228864, -118272, -1425408, 672256, -273920, 613376, -647680, -91136, 237568, 363520, -266240, -289280, -181760, -480256, 1442816, -543232, -1032192, -869376, -804352, -226304, 903680, -557056, -311296, -253440, 65024, 87552, -850432, -182784, 236544, 625664, -435712, 157184, 217088, -875008, -178176, 252416, -245760, -293376, -1142272, -823808, -58880, 245760, -48640, -157696, -358912, -1001472, -703488, 614912, 287744, -1477632, -293888, 829440, -803840, -567296, 494592, -624640, -1074688, 71168, 166400, -93184, 996864, -1191936, -733696, -1105920, 151040, 4608, 256512, -1170432, -235008, -700416, -206336, 292352, 482304, -416768, -209408, 1206272, -916480]
204b14016B23232j02400e31968E2224d29056a87904k34496i6768B25792C1232
193e16096d5568o10816g0144o6560n38112K04800F01600j27488a089536F12864
182a25952e2736n31968a57696E99552b10944n10976b30912J13152b560j79200
172a81760A31584O77376g21920C33824A45408a339904a23392H07424g17312E6320
161e71904G72096a752064c44064n11488J4336e3248r95328b48832a22368o12352
151g34720o51776M44928Q4992j83808d10624A6896a004544D82304A94048b4064
140d90496C63008a291776B89792a046528M74112C7888c20000I01632e0176n68320
130f18496m43392c21024a05984q86784G44960b75456n18656c54304J01376j20832
$$ y = [-214016, 223232, 120832, -531968, 52224, -429056, -187904, -422400, -96768, 225792, 31232, -516096, -45568, -656384, -70144, -136704, -674816, -470016, 601600, 474112, -1089536, 612864, -125952, -52736, -584704, -157696, 599552, -210944, -721920, -230912, -117760, -2560, -181760, 131584, 808960, -721920, 333824, 145408, -1339904, -123392, 807424, -717312, 56320, -571904, 772096, -1752064, -344064, -855552, -841216, -53248, -1048576, -248832, -122368, -734720, -1386496, -941568, -856576, -1040384, -410624, 16896, -1004544, 482304, 194048, -24064, -490496, 363008, -1291776, 289792, -1046528, -572416, 37888, -320000, 901632, -50176, -618496, -1061888, -321024, -105984, -992768, 744960, -275456, -794112, -354304, -252928, -373760]
120c73760D08576A92512f6560l17952P8336j6384m21376K6112A048064e70880
109a99168A86880c59936a47456r7792A84832b9696j420288D4544a598976E50912
98A89440R40544B67264a30048m1984I2160a319424E84704E5808K81088f21056
87g1680A9968L75808a04960j073664b94400F90176k59072R2160a4848j27488k50880
76c93216m03456m50560D06016a32608D32128O22080b31936C02592c86048C66592
65h61696I6256i19552D33152g97184L35872J8944C14880b16064m31616B50880
54a29536n22752l69664c8912q87296E48864a018880N5296d09600l0208D40832
43I52320c76832A054720f51264J70496o07744F76864e19680m5568n24800A22880
$$ y = [-373760, 408576, 192512, -66560, -384512, -306176, -322560, -743936, -717824, 1048064, -570880, -199168, 186880, -359936, -147456, -245248, 184832, -29696, -1449984, 44544, -1598976, 550912, 189440, 1129984, 267264, -130048, -172032, 92160, -1319424, 584704, 55808, 336896, -621056, -71680, 19968, 395776, -104960, -1178624, -294400, 690176, 431104, 523264, -14848, -142336, -393216, -796672, -1247232, 406016, -132608, 432128, 1054208, -231936, 302592, -386048, 366592, -861696, 96256, -919552, 433152, -797184, -461312, -442368, 314880, -216064, -647680, 250880, -129536, -652288, -1021952, -38912, -926208, 548864, -1018880, -963584, -409600, -439808, 440832, 952320, -376832, 1054720, -651264, -480768, -1088512, 676864, -519680, -565248, -1090048, 122880]
32d29568a87904B89280e06368K18624B19648F0928d28032j44384J89952C81952
21f89664G3216K53952i75360L70688k03264A82272e16608O0928a57184m87936
11f45120L20512A689600a87392k83136A094656c37920n42208D32128K38592b8160
0f3488
$$ y = [-429568, -187904, 289280, -506368, -287744, 219648, 60928, -428032, -572416, -382464, 381952, -689664, 73216, 327168, -975360, -604672, -807936, 182272, -516608, -455680, -157184, -645120, -324608, 1689600, -187392, -470528, 1094656, -337920, -880128, 432128, 670720, -28160, -63488]
##END=
