##TITLE=1339
##JCAMPDX= 6.0         $$ Bruker NMR JCAMP-DX V2.0
##DATA TYPE= NMR SPECTRUM
##DATA CLASS= XYDATA
##ORIGIN= NUTS EXPORT
##OWNER= Administrator
$$ 1.72 TOPSPIN		Version 2.1
$$ 2016-02-23 12:20:39.808 -0800  Administrator@X
$$ Compression mode = diff/dup
##.OBSERVE FREQUENCY= 90.275459
##.ACQUISITION MODE= SIMULTANEOUS (DQD)
##.ACQUISITION SCHEME= undefined
##.AVERAGES= 16
##.DIGITISER RES= 22
##SPECTROMETER/DATA SYSTEM= 
##.PULSE SEQUENCE= zg30
##.SOLVENT NAME= None
##.SHIFT REFERENCE= INTERNAL, None, 1, 14.6819
##AUDIT TRAIL= $$ (NUMBER, WHEN, WHO, WHERE, PROCESS, VERSION, WHAT)
$$ ##TITLE= Audit trail, TOPSPIN		Version 2.1
$$ ##JCAMPDX= 5.01
$$ ##ORIGIN= Bruker BioSpin GmbH
$$ ##OWNER= Administrator
$$ $$ E:/data/jwist/nmr/1339/1/pdata/1/auditp.txt
$$ ##AUDIT TRAIL=  $$ (NUMBER, WHEN, WHO, WHERE, PROCESS, VERSION, WHAT)
(   1,<2016-02-23 08:53:47.375 -0800>,<Administrator>,<X>,<jcamp>,<TOPSPIN 2.1>,
      <fromjdx created from
       E:\data\jwist\nmr\uniandes\1339
       data hash MD5: 8K
       58 39 DE 9B 94 D9 D4 65 0E 2C 48 4B DB 8F A7 7D>)
$$ ##END=
$$ 
$$ $$ hash MD5
$$ $$ 1D C3 90 65 00 E5 D2 6F 7F 56 B3 FA CF AB 8E C2
##$RELAX= 
$$ Bruker specific parameters
$$ --------------------------
##$DU= <E:>
##$EXPNO= 1
##$NAME= <1339>
##$PROCNO= 1
##$TYPE= <nmr>
##$USER= <jwist>
##$ACQT0= 0
##$AMP= (0..31)
100 100 100 100 100 100 100 100 100 100 100 100 100 100 100 100 100 100
100 100 100 100 100 100 100 100 100 100 100 100 100 100
##$ANAVPT= 1
##$AQSEQ= 0
##$AQ_mod= 3
##$AUNM= <au_zg>
##$AUTOPOS= <>
##$BF1= 90.275459
##$BF2= 400.02
##$BF3= 400.02
##$BF4= 400.02
##$BF5= 400.02
##$BF6= 400.02
##$BF7= 400.02
##$BF8= 400.02
##$BYTORDA= 0
##$CFDGTYP= 0
##$CFRGTYP= 0
##$CHEMSTR= <none>
##$CNST= (0..63)
1 1 145 1 1 1 1 1 1 1 1 1 1 1 1 1 1 1 1 1 1 1 1 1 1 1 1 1 1 1 1 1 1 1 1
1 1 1 1 1 1 1 1 1 1 1 1 1 1 1 1 1 1 1 1 1 1 1 1 1 1 1 1 1
##$CPDPRG= <>
##$CPDPRG1= <>
##$CPDPRG2= <>
##$CPDPRG3= <>
##$CPDPRG4= <mlev>
##$CPDPRG5= <mlev>
##$CPDPRG6= <mlev>
##$CPDPRG7= <mlev>
##$CPDPRG8= <mlev>
##$CPDPRGB= <>
##$CPDPRGT= <>
##$D= (0..63)
0 1 0 0 0 0 0 0 0 0 0 0 0 0 0 0 0 0 0 0 0 0 0 0 0 0 0 0 0 0 0 0 0 0 0 0
0 0 0 0 0 0 0 0 0 0 0 0 0 0 0 0 0 0 0 0 0 0 0 0 0 0 0 0
##$DATE= 0
##$DBL= (0..7)
120 120 120 120 120 120 120 120
##$DBP= (0..7)
150 150 150 150 150 150 150 150
##$DBP07= 0
##$DBPNAM0= <>
##$DBPNAM1= <>
##$DBPNAM2= <>
##$DBPNAM3= <>
##$DBPNAM4= <>
##$DBPNAM5= <>
##$DBPNAM6= <>
##$DBPNAM7= <>
##$DBPOAL= (0..7)
0.5 0.5 0.5 0.5 0.5 0.5 0.5 0.5
##$DBPOFFS= (0..7)
0 0 0 0 0 0 0 0
##$DE= 6.5
##$DECBNUC= <off>
##$DECIM= 2432
##$DECNUC= <off>
##$DECSTAT= 4
##$DIGMOD= 1
##$DIGTYP= 12
##$DL= (0..7)
0 120 120 120 120 120 120 120
##$DP= (0..7)
150 150 150 150 150 150 150 150
##$DP07= 0
##$DPNAME0= <>
##$DPNAME1= <>
##$DPNAME2= <>
##$DPNAME3= <>
##$DPNAME4= <>
##$DPNAME5= <>
##$DPNAME6= <>
##$DPNAME7= <>
##$DPOAL= (0..7)
0.5 0.5 0.5 0.5 0.5 0.5 0.5 0.5
##$DPOFFS= (0..7)
0 0 0 0 0 0 0 0
##$DQDMODE= 0
##$DR= 22
##$DS= 2
##$DSLIST= <SSSSSSSSSSSSSSS>
$$ [...]
##$SPOFFS= (0..31)
0 0 0 0 0 0 0 0 0 0 0 0 0 0 0 0 0 0 0 0 0 0 0 0 0 0 0 0 0 0 0 0
##$SUBNAM0= <"">
##$SUBNAM1= <"">
##$SUBNAM2= <"">
##$SUBNAM3= <"">
##$SUBNAM4= <"">
##$SUBNAM5= <"">
##$SUBNAM6= <"">
##$SUBNAM7= <"">
##$SUBNAM8= <"">
##$SUBNAM9= <"">
##$SW= 20.5580556627758
##$SWIBOX= (0..15)
0 0 3 4 0 0 0 0 0 0 0 0 0 0 0 0
##$SW_h= 8223.68421052631
##$SWfinal= 0
##$TD= 65536
##$TD0= 1
##$TE= 300
##$TE2= 300
##$TE3= 300
##$TEG= 300
##$TL= (0..7)
0 120 120 120 120 120 120 120
##$TP= (0..7)
150 150 150 150 150 150 150 150
##$TP07= 0
##$TPNAME0= <>
##$TPNAME1= <>
##$TPNAME2= <>
##$TPNAME3= <>
##$TPNAME4= <>
##$TPNAME5= <>
##$TPNAME6= <>
##$TPNAME7= <>
##$TPOAL= (0..7)
0.5 0.5 0.5 0.5 0.5 0.5 0.5 0.5
##$TPOFFS= (0..7)
0 0 0 0 0 0 0 0
##$TUNHIN= 0
##$TUNHOUT= 0
##$TUNXOUT= 0
##$USERA1= <user>
##$USERA2= <user>
##$USERA3= <user>
##$USERA4= <user>
##$USERA5= <user>
##$V9= 5
##$VALIST= <valist>
##$VCLIST= <CCCCCCCCCCCCCCC>
##$VD= 0
##$VDLIST= <DDDDDDDDDDDDDDD>
##$VPLIST= <PPPPPPPPPPPPPPP>
##$VTLIST= <TTTTTTTTTTTTTTT>
##$WBST= 1024
##$WBSW= 4
##$XGAIN= (0..3)
0 0 0 0
##$XL= 0
##$YL= 0
##$YMAX_a= 1230580864
##$YMIN_a= -1733824
##$ZGOPTNS= <>
##$ZL1= 120
##$ZL2= 120
##$ZL3= 120
##$ZL4= 120
##$ABSF1= 10
##$ABSF2= 0
##$ABSG= 5
##$ABSL= 3
##$ALPHA= 0
##$AQORDER= 0
##$ASSFAC= 0
##$ASSFACI= 0
##$ASSFACX= 0
##$ASSWID= 0
##$AUNMP= <proc_1d>
##$AXLEFT= 0
##$AXNAME= <>
##$AXNUC= <off>
##$AXRIGHT= 0
##$AXTYPE= 0
##$AXUNIT= <>
##$AZFE= 0.1
##$AZFW= 0.1
##$BCFW= 1
##$BC_mod= 2
##$BYTORDP= 0
##$COROFFS= 0
##$CY= 15
##$DATMOD= 1
##$DC= 2
##$DFILT= <>
##$DTYPP= 0
##$F1P= 0
##$F2P= 0
##$FCOR= 0.5
##$FTSIZE= 0
##$FT_mod= 4
##$GAMMA= 1
##$GB= 0
##$INTBC= 1
##$INTSCL= 1
##$ISEN= 128
##$LB= 0.3
##$LEV0= 0
##$LPBIN= 0
##$MAXI= 10000
##$MC2= 0
##$MEAN= 0
##$ME_mod= 0
##$MI= 0
##$NCOEF= 0
##$NC_proc= -9
##$NLEV= 6
##$NOISF1= 0
##$NOISF2= 0
##$NSP= 1
##$NTH_PI= 0
##$NZP= 0
##$OFFSET= 14.6819
##$PC= 1
##$PHC0= 0
##$PHC1= 0
##$PH_mod= 0
##$PKNL= yes
##$PPARMOD= 0
##$PPDIAG= 0
##$PPIPTYP= 0
##$PPMPNUM= 2147483647
##$PPRESOL= 1
##$PSCAL= 4
##$PSIGN= 0
##$PYNMP= <proc.py>
##$REVERSE= no
##$SF= 90.2741336039374
##$SI= 8192
##$SIGF1= 0
##$SIGF2= 0
##$SINO= 400
##$SIOLD= 32768
##$SPECTYP= <>
##$SREGLST= <1H.CDCl3>
##$SSB= 0
##$STSI= 0
##$STSR= 0
##$SW_p= 1497.18866228788
##$SYMM= 0
##$S_DEV= 0
##$TDeff= 0
##$TDoff= 0
##$TI= <>
##$TILT= no
##$TM1= 0
##$TM2= 0
##$TOPLEV= 0
##$USERP1= <user>
##$USERP2= <user>
##$USERP3= <user>
##$USERP4= <user>
##$USERP5= <user>
##$WDW= 1
##$XDIM= 8192
##$YMAX_p= 1230580736
##$YMIN_p= -1733632
##$CURPLOT= <PDFCreator>
##$CURPRIN= <$PDFCreator>
##$DFORMAT= <normdp>
##$LAYOUT= <+/1D_H.xwp>
##$LFORMAT= <normlp>
##$PFORMAT= <normpl>
##$SURQMSG= 1
$$ End of Bruker specific parameters
$$ ---------------------------------
##XUNITS= HZ
##YUNITS= ARBITRARY UNITS
##XFACTOR= 0.182762287876938
##YFACTOR= 1
##DELTAX= -0.182762287876938
##NPOINTS= 8192
##FIRSTX= 1497.0059
##FIRSTY= -1079296
##LASTX= 0
##MAXY= 1230580736
##MINY= -1733632
##XYDATA= (X++(Y..Y))
8191a079296L39456C49184d12160G54688b14528F77888g36256b8672H26880I2672
$$ -1079296 -739840 349184 -412160 754688 -214528 677888 -736256 -28672 826880 92672
8180C20512P54176d48000Q7040e4272A41312f1952A69472a33632C68640e17120
$$ 320512 1074688 -448000 -360960 -54272 141312 -61952 169472 -133632 368640 -517120
8169C01568d0448j424384d30080F144a117696L86048b20672j25440L6352F0416
$$ 301568 -40448 -1464832 -430080 6144 -1117696 -731648 -220672 -346112 -309760 60416
8158f9120F47168a135616B00192h40704L95776g1680m93056a11104j35168l34848
$$ -69120 647168 -1135616 200192 -840704 -444928 -71680 -564736 -111104 -246272 -581120
8148e81120C60448c3792B91328g38304I6768N33504J0752A33632K32960j03936
$$ -581120 360448 -33792 291328 -738304 96768 630272 641024 133632 366592 262656
8138B62656i76384H33024l03616b83136Q704l09760G9872K73920M52608M24960
$$ 262656 -976384 833024 529408 -283136 -274432 -584192 79872 353792 806400 1231360
8128A231360C44576Q0384h44800A52064c59936a34144D58752h5504a3824E37088
$$ 1231360 344576 424960 -844800 152064 -359936 -134144 458752 -85504 -13824 537088
8117A021952H704J35168I216b68800I728M14720d64384j19296K89792l50208c05664
$$ 1021952 8704 143872 9216 -268800 9728 424448 -464384 -583680 -293888 -644096 -305664
8105I24672m21888B39616a055232c84512g8848H06400a02400A090560A73568m9664
$$ 924672 502784 239616 -1055232 -384512 -78848 806400 -102400 1090560 173568 123904
8095A23904n3248J39776J024e56032B7136c97312j336320B11968a01888J9968
$$ 123904 70656 210432 211456 -556032 27136 -397312 -1733632 211968 -101888 -81920
8085h1920l38944d8128K2016j25440E68320A12640f76352B46784f21056C44064
$$ -81920 -420864 -48128 -26112 -151552 568320 112640 -676352 246784 -621056 344064
8074A50016N120a34144F28224j07520K048J13152A35680b13504E43744A01888
$$ 150016 155136 -134144 628224 520704 522752 635904 135680 -213504 543744 101888
8063C01056I4208N52448b19648A34656R94304J37216m96128d40320D16768G6800
$$ 301056 94208 646656 -219648 134656 1128960 1266176 770048 -440320 416768 76800
8052b12480B2528R216a587200b15040A200640h7552L584m99200k23232H75008
$$ -212480 22528 31744 -1587200 -215040 1200640 -87552 -83968 -583168 -806400 875008
8041A71520P47008a185280b14528G43424b11968B74432H7040d55680E57056J48480
$$ 171520 918528 -1185280 -214528 743424 -211968 274432 87040 -455680 557056 705536
8031G05536M02944f77376K71360e5808k5600E32992A11616g59296K4064a17760
$$ 705536 1108480 -677376 -406016 -55808 -81408 532992 111616 -759296 -735232 -117760
8020g680m23936K9184N6320g0144m86400D62336c25120E9392b21184r4720C7888
$$ -7680 -431616 -402432 -346112 -70144 -556544 462336 -325120 59392 -221184 -315904 37888
8008B70336f51776b8160G33696C52768A38240M18816a409536I58464C22048e13536
$$ 270336 -651776 -28160 733696 352768 138240 557056 -1409536 958464 322048 -513536
7997A61280N31456B68800E3248J41824K96960J41312I4720e42720j73056A58208
$$ 161280 692736 268800 53248 195072 492032 633344 94720 -542720 -715776 158208
7986D60288f75328G16288A13152L27168B04288e35552J49504m50048K47296A24928
$$ 460288 -675328 716288 113152 440320 204288 -535552 -386048 -836096 -588800 124928
7975F64064b35008B53440b04288A089024e2224D83328J023488F94272k60608a9968
$$ 664064 -235008 253440 -204288 1089024 -52224 483328 1506816 694272 433664 -19968
7964E34016c11808h9088A78176c08224l92704i728B14528J63328A44896K88256
$$ 534016 -311808 -89088 178176 -308224 -700928 -9728 214528 377856 144896 433152
7954D33152r6768e40160E64224p0656a38240g680D66432f6048I28256k53952a86880
$$ 433152 336384 -540160 564224 493568 -138240 -7680 466432 -66048 928256 674304 -186880
7942A35680f08768J00352F49216a94560B46784E8880K09408J32608A86880h2944
$$ 135680 -608768 -508416 649216 -194560 246784 58880 268288 400896 186880 -82944
7931b00704n3248F03648a693184A048576L072B3040c17440g8336A0752M65920
$$ -200704 -253952 603648 -1693184 1048576 1051648 23040 -317440 -78336 10752 476672
7921D76672C2256M54656K42176K24256C34848P680a50016G4240J81248d35200
$$ 476672 32256 486912 729088 953344 334848 342528 -150016 74240 255488 -435200
7910G17824J46944A23392f69696J56160E14560L24608c26656D51584b3040E96480
$$ 717824 864768 123392 -669696 -513536 514560 839168 -326656 451584 -23040 596480
7899F74816o9632B00704K3552N0176i53856H22272D5056c39968C39968n7344r7280
$$ 674816 605184 200704 224256 274432 -953856 822272 45056 -339968 339968 282624 185344
7888A85344a84320l6352B96960e4784A85344Q2432q704O35392o2976l53280Q2432
$$ 185344 -184320 -220672 296960 -54784 185344 267776 259072 894464 831488 478208 560640
7877E60640k30912h57600J01888C88608j84832J70496J90976K40640a04960I07776
$$ 560640 329728 -857600 -755712 388608 203776 374272 565248 805888 -104960 907776
7866F23616g32160E42208M39808d16256D96640M6080k38080n3760C584h704C26144
$$ 623616 -732160 542208 982016 -416256 496640 542720 304640 250880 3584 -8704 326144
7854a23904D33664a1776A157632g85408J09568B4064f98880B80064a34656B83648
$$ -123904 433664 -11776 1157632 -785408 -675840 24064 -698880 280064 -134656 283648
7843I63072k55488i13408J60256k83648c84512j21856C98848F656J37728O43584
$$ 963072 707584 -913408 -753152 -1036800 -384512 -506368 398848 6656 144384 787968
7833G87968C48672K92352c02592A39264L21024e6320D11648f79936A261056C24096
$$ 787968 348672 641024 -302592 139264 460288 -56320 411648 -679936 1261056 324096
7822A942528C6352f26176G71072J88416e05344C14880K65216g1680E70368K86208
$$ 1942528 36352 -626176 771072 959488 -505344 314880 580096 -71680 570368 856576
7812H56576C40992K13504D7616g29088F63040k14528i07264G7312d55168E02784
$$ 856576 340992 554496 47616 -729088 663040 448512 -907264 77312 -455168 502784
7801c63520D54144b17600j88928B36032b99008H11520p168C99872c31776A77152
$$ -363520 454144 -217600 -406528 236032 -299008 811520 804352 399872 -331776 177152
7790B81088c5328o55360A89440c53280a43360A5872K01216f80448K4576H9088
$$ 281088 -35328 -690688 189440 -353280 -143360 15872 217088 -680448 -655872 89088
7779C82976K78016B43712J04960c71712E88800e09952B29888L7376a21344h192
$$ 382976 660992 243712 348672 -371712 588800 -509952 229888 267264 -121344 -8192
7768D79744B35008P55200d02432A641472e5296o5536q25856B15552b07872C36896
$$ 479744 235008 990208 -402432 1641472 -55296 -120832 -946688 215552 -207872 336896
7757C69152b048B60608e56544E8368R30304A24928c8400m42368A90464P95648
$$ 369152 -2048 260608 -556544 58368 988672 124928 -38400 -480768 190464 986112
7747I86112I6768L85024J19296h6528A38752J06496N92384l24096K26816Q0384
$$ 986112 96768 481792 601088 -86528 138752 245248 837632 513536 740352 820736
7737H20736B35520H0384c15904G53152A04448L01568H6016M17280j49504L80928
$$ 820736 235520 80384 -315904 753152 104448 406016 86016 503296 353792 734720
7727G34720d1472j34656F45120h58112B58048a272832C47648c76832m41856a60256
$$ 734720 -41472 -176128 645120 -858112 258048 -1272832 347648 -376832 -818688 -160256
7716C14880h34560E6832J39776e96480C50208a68448l67616J73056a1776l83488
$$ 314880 -834560 56832 196608 -596480 350208 -168448 -536064 -363008 -11776 -395264
7706c95264A44384a49504L7888M1984I21600j88928k20672j66912g10144E63200
$$ -395264 144384 -149504 -111616 -69632 921600 732672 512000 345088 -710144 563200
7695e43744I43616A19808c77344C80416j03936e25312a79200j6384H00768b73920
$$ -543744 943616 119808 -377344 380416 276480 -525312 -179200 -195584 800768 -273920
7684C30752J29024g7824k4576E84192a056256F9632O87616d25472a94048I09824
$$ 330752 459776 -77824 -102400 584192 -1056256 69632 757248 -425472 -194048 909824
7673A44384M03968g75680C15904A26464K16064c24608E93408n4272l4816a71008
$$ 144384 548352 -775680 315904 126464 342528 -324608 593408 539136 504320 -171008
7662B21696J10080P14240a7920A32608b29376A02400f46656H86784a5872D33152
$$ 221696 331776 1046016 -17920 132608 -229376 102400 -646656 886784 -15872 433152
7651a25952F5024d50560a26464F65088k76480a569792F45632J8432K95424D65408
$$ -125952 65024 -450560 -126464 665088 388608 -1569792 645632 664064 959488 465408
7640B48832R57440k02240m24960H1408R84064D76160j55648d85888b37056B26304
$$ 248832 1206272 1004032 579072 81408 1065472 476160 320512 -485888 -237056 226304
7629G63904n1712B64704L25632L17440D37760c25632A65888M35200B36544L23072
$$ 763904 712192 264704 590336 907776 437760 -325632 165888 601088 236544 559616
7619E59616c30240k35520C69664F2976N40160L51744f21568I0624P70560m11648
$$ 559616 -330240 -565760 369664 62976 603136 954880 -621568 90624 861184 449536
7609D49536b58560A5360L33824K3040R9328a18784p5264E52448P73120D93056
$$ 449536 -258560 15360 349184 372224 471552 -118784 -194048 552448 1325568 493056
7598e36064a69984F09792L05152J7408C44064J79712d04992H61184c59936n2736
$$ -536064 -169984 609792 914944 932352 344064 523776 -404992 861184 -359936 -412672
7588d12672k46272E11488b24256B67776N92384d63872G73120K27840b66752A14688
$$ -412672 -658944 511488 -224256 267776 860160 -463872 773120 1000960 -266752 114688
7577H9088Q14592i7280B76480q7040a77664j43872G30624B31936L45600j38752
$$ 89088 903680 -97280 276480 189440 -177664 -321536 730624 231936 577536 438784
7567D38784K30400k84160j12640i70240e2224H5504P57248A48480L02080J09568
$$ 438784 669184 385024 272384 -970240 -52224 85504 842752 148480 450560 560128
7557E60128j18272J93536A27488Q76032j68448j88416a0240F64064N35552E07904
$$ 560128 441856 635392 127488 1003520 835072 646656 -10240 664064 1199616 507904
7546D18304e41184D17792A73056g32160B88256a61792A035776g31136I0624f8608
$$ 418304 -541184 417792 173056 -732160 288256 -161792 1035776 -731136 90624 -68608
7535f39488H49408b09920A61280A3312J44384B048h9088H0896g74144b08896B38080
$$ -639488 849408 -209920 161280 13312 157696 2048 -89088 80896 -774144 -208896 238080
7523d7616r4208H07936j26976a92512e120l9936m6592D18816e59104J01376G70048
$$ -47616 -141824 807936 680960 -192512 -5120 -45056 -91648 418816 -559104 -457728 770048
7511d93568C81440a21856A85344b40640A134080B60096a14176r02656G76192C77856
$$ -493568 381440 -121856 185344 -240640 1134080 260096 -114176 -1016832 776192 377856
7500a318912L03104A38752N28384q3968d4032j01888p5264J01888D32640a7920
$$ -1318912 -1015808 138752 667136 583168 -44032 -145920 -221184 -119296 432640 -17920
7489a17760l45088J20320G10656L39968b91840A83296c12832N6320k27328k78016
$$ -117760 -462848 -342528 710656 1050624 -291840 183296 -312832 -256512 -483840 -761856
7479g61856D86912c8400A308672c50720G38816o1952k26816g69536b33984I48224
$$ -761856 486912 -38400 1308672 -350720 738816 676864 450048 -769536 -233984 948224
7468E88288J19808d16768B20672a36704F53312h08448B30400O36416A66400P36768
$$ 588288 708096 -416768 220672 -136704 653312 -808448 230400 866816 166400 903168
7458I03168B14016L87072B22720a75616B99520a59232B07872r216q704R21088
$$ 903168 214016 601088 222720 -175616 299520 -159232 207872 198656 189952 1111040
7448A111040l24096B93888f23104l62496i3696L3792G15776K10944C99872J55136
$$ 1111040 786944 293888 -623104 -985600 -93696 -59904 715776 926720 399872 555008
7438E55008J6896A21344b48320E9904M19328h80128n4784F81472f46656E69856
$$ 555008 571904 121344 -248320 59904 479232 -880128 -934912 681472 -646656 569856
7427A60256L67616b9696B40128N26336l18464b28352n4784F32320i7280m35200
$$ 160256 527872 -29696 240128 766464 448000 -228352 -283136 632320 -97280 -532480
7417e32480A024O70208A13152L74272q0896J48992O02624g35232D40320G2704
$$ -532480 1024 671232 113152 487424 406528 555520 1158144 -735232 440320 72704
7406D54144c7376o49728A12128d61824B7648K29376L67104L07200c17952A84832
$$ 454144 -37376 -687104 112128 -461824 27648 257024 624128 931328 -317952 184832
7395F72256A45920E6832K61120A03424m9152R44128d65920H45824m11136J33632
$$ 672256 145920 56832 317952 103424 54272 998400 -465920 845824 434688 568320
7385E68320J83808B3552b90304I49248J071616H06912d08576A145856m45952b45248
$$ 568320 752128 23552 -290304 949248 2020864 806912 -408576 1145856 699904 -245248
7374e3760A82272a7408G09632Q42240e26336A113088A86368E12d44416G38304
$$ -53760 182272 -17408 709632 1551872 -526336 1113088 186368 512 -444416 738304
7363d76160A19296O13376i26208B70336J53600d14208D71552l2768j01888c584
$$ -476160 119296 732672 -926208 270336 423936 -414208 471552 438784 336896 -3584
7352h01280B12992c2768H92416I8304N32992H6016N32480p1680b15552A45408
$$ -801280 212992 -32768 892416 98304 631296 86016 618496 546816 -215552 145408
7341b65728j45920D4544M1472R25184a083392a84320A183232C29728j53088N63200
$$ -265728 -411648 44544 86016 1011200 -1083392 -184320 1183232 329728 176640 739840
7331G39840e66272D57216K36544a09056l584A36704b90304A55136Q7552f30272
$$ 739840 -566272 457216 693760 -109056 -112640 136704 -290304 155136 242688 -630272
7320a96096H20224A69472b36544F38464a51552A091584A97632J45408E2224P3728
$$ -196096 820224 169472 -236544 638464 -151552 1091584 197632 343040 52224 125952
7310A25952c03616R7280E82656M64384b04800C2256K18624K56000k41664j21856
$$ 125952 -303616 -206336 582656 1047040 -204800 32256 250880 506880 265216 143360
7300A43360c56864C4816N29408k53952K10432j76640K83136c27680j26464G28576
$$ 143360 -356864 34816 564224 310272 520704 344064 627200 -327680 -454144 728576
7289C32288c42016E61664b52928D50560j49504A19296L17952L79904a260032I6256
$$ 332288 -342016 561664 -252928 450560 301056 119296 437248 817152 -1260032 96256
7278D14720K90304b05312j6896p6800A000960A6384h72448G0656K82112O0416
$$ 414720 705024 -205312 -222208 -299008 1000960 16384 -872448 70656 352768 413184
7268D13184c56864m21888A76640J25952N43744b41664c7888J7920H65792l74784
$$ 413184 -356864 -778752 176640 302592 846336 -241664 -37888 -19968 865792 491008
7258D91008h86272A45408J88928L33824a89440E22240a58720H09984a90976G29088
$$ 491008 -886272 145408 334336 668160 -189440 522240 -158720 809984 -190976 729088
7247G29088J08544K17600m79232k36544M23936A62816b49856D89472O14912l52256
$$ 729088 837632 1055232 576000 339456 763392 162816 -249856 489472 1104384 752128
7237G52128B1504c82464G66464a315328F48192c18976F28224j34144P63392B01216
$$ 752128 21504 -382464 766464 -1315328 648192 -318976 628224 494080 1257472 201216
7226D42880J313792G48544B9696i93280F23616Q18688B11456M05504M29568d80768
$$ 442880 1756672 748544 29696 -993280 623616 1442304 211456 616960 1046528 -480768
7215e22240a03424B22720K54976K6112e8880E83680h04352A33120N79072p8336
$$ -522240 -103424 222720 477696 503808 -58880 583680 -804352 133120 712192 633856
7205F33856N632B17088K32448c3792K560A091072Q1408a08032H09472J81248j02400
$$ 633856 639488 217088 449536 -33792 -31232 1091072 1172480 -108032 809472 990720 888320
7194H88320C50208J29024M18304A33632O81472f90176I44128C81952H6528d9664
$$ 888320 350208 479232 897536 133632 815104 -690176 944128 381952 86528 -49664
7183D99712K67776P32160A25952d29568a97632j92000n40160B22208c35872j6896
$$ 499712 767488 1499648 125952 -429568 -197632 -389632 -929792 222208 -335872 -352768
7173c52768C08736J016832l72224m32128j10080c39456C47648j41824p168J062400
$$ -352768 308736 1325568 953344 521216 411136 -339456 347648 205824 198656 1261056
7163A261056a338880I79968g2704C15904o656c52256B53440b02752B5088K74432
$$ 1261056 -1338880 979968 -72704 315904 309248 -352256 253440 -202752 25088 299520
7153B99520d54144A1776i11360b61632a17248B90304Q67840B5088O33856k61120
$$ 299520 -454144 11776 -911360 -261632 -117248 290304 1158144 25088 658944 397824
7143C97824q3456i2160D88960j4336N88288k31424l072k88768c2768A037312d096
$$ 397824 314368 -92160 488960 474624 1062912 831488 828416 539648 -32768 1037312 -4096
7131A431040B11968b78016J01888A87904O17984J2800k31936P34208c13344D66432
$$ 1431040 211968 -278016 -176128 187904 805888 818688 586752 1320960 -313344 466432
7120A654272b29376A021440E09952N06880i3696k27328I0624a2800E57568j15200
$$ 1654272 -229376 1021440 509952 1016832 -93696 -321024 90624 -12800 557568 442368
7110D42368B04288d83840a90464D02944Q0896A70496N55520p168A76128A7920
$$ 442368 204288 -483840 -190464 402944 483840 170496 726016 718848 176128 17920
7099I16480b09920l3792C80416A51040K07872a060352d05504D34688J218560c58912
$$ 916480 -209920 -243712 380416 151040 358912 -1060352 -405504 434688 1653248 -358912
7088E12P7312L98848C0720K44224M51584g57760D48000i1136B23232N49376J50528
$$ 512 77824 476672 30720 274944 726528 -757760 448000 -91136 223232 772608 923136
7077I23136D23424f21056C61472L92704K3552K43712k05824B15552n9392e84192
$$ 923136 423424 -621056 361472 754176 777728 1021440 815616 215552 156160 -584192
7066C74784b10432l76832G56224J12128j64352J09056O61504E4272K61120c31776
$$ 374784 -210432 -587264 756224 868352 704000 813056 1474560 54272 315392 -331776
7055C15392b81600E72416i9840I16480B09920r3184M8640M58240c27168F60992
$$ 315392 -281600 572416 -99840 916480 209920 116736 165376 623616 -327168 660992
7044D57216O07744E04832j78688K54976D5568O82496A66400j0240l2768N16096
$$ 457216 1064960 504832 326144 581120 45568 728064 166400 156160 123392 639488
7034F39488b20672D37760L16416E2736N9904O63040i23136d34688F13888n8368
$$ 639488 -220672 437760 754176 52736 112640 775680 -923136 -434688 613888 555520
7024E55520M65920l25120b30400D84352b5600E35552q192E5296L28192Q9600J8432
$$ 555520 1021440 696320 -230400 484352 -25600 535552 527360 55296 383488 473088 491520
7013D91520b81088F16960A25440Q70912D20864b03776A241600j25440b90304A261056
$$ 491520 -281088 616960 125440 996352 420864 -203776 1241600 1116160 -290304 1261056
7002B62656H2944J47456M3008P48544D98176B10432a053184A125888j51552d59264
$$ 262656 82944 230400 273408 1021952 498176 210432 -1053184 1125888 974336 -459264
6991F20032j89440P32160J436672H75008d82816K11968C19488J35168Q35072C67616
$$ 620032 430592 1162752 2599424 875008 -482816 -270848 319488 454656 1289728 367616
6980H23296G168N79584c1232j44384j35168b4064j66400I09824a43360q75520
$$ 823296 7168 586752 -31232 -175616 -310784 -24064 -190464 909824 -143360 -1018880
6970a018880a16736k40128J59232A94560a37728E32480N79584a32096k40128A172992
$$ -1018880 -116736 -356864 -197632 194560 -137728 532480 1112064 -132096 -372224 1172992
6959E90848k50880m608E6320c15904J36704E68320j66912j37728J39264a29536
$$ 590848 339968 335360 56320 -315904 -179200 568320 401408 263680 402944 -129536
6948F29760B63168R5232Q90368C06688J0240d49536D50560q9600q6016J84320
$$ 629760 263168 358400 1248768 306688 316928 -449536 450560 360960 274944 459264
6938D59264a74080A329152B9184c59936H02304f0928A119744j23904b90304D88960
$$ 459264 -174080 1329152 29184 -359936 802304 -60928 1119744 995840 -290304 488960
6927d49024A233920n15072D3520M08064P36768c85536B30912b18112A81760g86432
$$ -449024 1233920 718848 43520 451584 1188352 -385536 230912 -218112 181760 -786432
6916c34336G87968B08896J272320E57568j25952a94560B15040K91840B03264O76352
$$ -334336 787968 208896 1481216 557568 431616 -194560 215040 506880 203264 879616
6906H79616B36544g9360A083392e04320H66816g50080G83872A50528N48864d6080
$$ 879616 236544 -79360 1083392 -504320 866816 -750080 783872 150528 699392 -46080
6895H192J532928B4576g86944C38432k3040J014272B49856l9936e45280A380352
$$ 8192 1541120 24576 -786944 338432 315392 1329664 249856 209920 -545280 1380352
6884B48320M54144g5264D14720d22400I57440a78176A9968a40800E60128P77728
$$ 248320 702464 -75264 414720 -422400 957440 -178176 19968 -140800 560128 1337856
6874A337856C54304N10976K81600B69824K81088E2736J30048M91008k97984H0896
$$ 1337856 354304 865280 1146880 269824 550912 52736 182784 673792 375808 80896
6863b33472A41824J156096D94080K20672J99168D5056A7408N88800L30240K07360
$$ -233472 141824 1297920 494080 714752 913920 45056 17408 606208 936448 1143808
6853A143808j92512H2944L3792E7344R00096l05152k35008M19328J82784m59776
$$ 1143808 951296 82944 116736 57344 957440 652288 417280 836608 1019392 559616
6843E59616O25664n76512a97632A227776D14208k3040Q9600J087488g08096D50560
$$ 559616 1185280 608768 -197632 1227776 414208 391168 480768 1568256 -708096 450560
6832B59072O4512L59936J011200B06848K27328M81792j82272l00032A87392R34912
$$ 259072 323584 683520 1694720 206848 434176 915968 733696 433664 187392 1122304
6822A122304P40352b12480J2288c1232F24640B66240L87072d93056A381376m23936
$$ 1122304 1862656 -212480 -200192 -31232 624640 266240 653312 -493056 1381376 957440
6812I57440B33984a31072A147392j67424k64192l37920M34176g9872E75488M37760
$$ 957440 233984 -131072 1147392 979968 715776 377856 812032 -79872 575488 1013248
6802A013248C55328c84512G65952P08096D63360P92064E93920B44224J26464P35232
$$ 1013248 355328 -384512 765952 1474048 463360 1255424 593920 244224 370688 1105920
6792A105920j0752O0416A51552M85376A3824J750016q24320D41344D8128P78752
$$ 1105920 1095168 1155584 151552 636928 13824 1763840 939520 441344 48128 826880
6782H26880j87392b7136C06176L95776o2464d09088A293312C67104o2976M81280
$$ 826880 639488 -27136 306176 701952 639488 -409088 1293312 367104 304128 785408
6772G85408K49344k65728g3216D84864K0480c59936G57760p2704I728P6800L89632
$$ 785408 1034752 769024 -73216 484864 505344 -359936 757760 685056 9728 86528 476160
6761D76160M41856F1952L32288c33824F99392a17760C37408J506816p67488k33472
$$ 476160 918016 61952 394240 -333824 699392 -117760 337408 1844224 1076736 843264
6751H43264A73568b29376B74432b40128E05856H0896P08096l84000A63328N05856
$$ 843264 173568 -229376 274432 -240128 505856 80896 788992 404992 163328 669184
6741F69184G168f6048G93600d8640F00576L66592L94240m83328l97312K99008
$$ 669184 7168 -66048 793600 -48640 600576 967168 1361408 878080 480768 779776
6731G79776j16224M97152E41184L37920B07360A024J170944E47840J40288B6624
$$ 779776 663552 1160704 541184 879104 207360 1024 1171968 547840 688128 26624
6720d42368A029120j40800a18272F29760R2160N50912l99360d85888H32000B69312
$$ -442368 1029120 888320 -118272 629760 721920 1272832 873472 -485888 832000 269312
6709c32288Q8064G91552j61280I3184P02464L06176d096H23296k14528M9152B82624
$$ -332288 -244224 791552 630272 93184 795648 1101824 -4096 823296 608768 657920 282624
6697F89664M83328k2016c23584F29760K40640a50016j06496D94592J44384c36384
$$ 689664 1172992 1150976 -323584 629760 870400 -150016 -256512 494592 638976 -336384
6686D38784Q3968K19648j57696d9664I47712J39776l14880M35712R7280B39616
$$ 438784 522752 742400 584704 -49664 947712 1087488 772608 1208320 1305600 239616
6675A020928C23072I5232P40352B89280a74080F70720q8576q6016J57696b90816
$$ 1020928 323072 95232 835584 289280 -174080 670720 582144 496128 653824 -290816
6664C01056K9184O01600J94048e44256A266688c15904B40128P74144f37952a08544
$$ 301056 330240 931840 1125888 -544256 1266688 -315904 240128 1014272 -637952 -108544
6653A281536B06336J50528M05504j31584L03104Q192k8672C64544B6112c45600
$$ 1281536 206336 356864 762368 630784 933888 942080 913408 364544 26112 -345600
6642g27552G60320l07712R3696R4720N52448a89952G30112K52928l23584j51040
$$ -727552 760320 452608 546304 641024 1193472 -189952 730112 983040 659456 508416
6632E08416e0688D28032J623552B72384a33632A784832c34848G91552a95584G70560
$$ 508416 -50688 428032 2051584 272384 -133632 1784832 -334848 791552 -195584 770560
6621E32992J5360N69344C88608O98368j77152P68512D75648D5056J128960g10144
$$ 532992 548352 1117696 388608 1086976 909824 1678336 475648 45056 1174016 -710144
6610E82144N60640K31424C78368M03456C61984K31424N10464h1920I15968C70176
$$ 582144 1142784 1374208 378368 781824 361984 593408 1103872 -81920 915968 370176
6599H60672L8912B03776c63008H09472L22048N71904E62688j20832I0112P4752
$$ 860672 899584 203776 -363008 809472 1131520 1703424 562688 441856 90112 164864
6589A64864O02624b01728A627648p87968l16416A37216K26816Q61696a50016p2704
$$ 164864 767488 -201728 1627648 839680 523264 137216 364032 1225728 -150016 -222720
6579b22720G4752J13664P84384J77664j15200o8608K11968I216K6624d4032a024
$$ -222720 74752 188416 972800 1150464 1035264 966656 1178624 9216 35840 -44032 -1024
6567F60992k02240O21568b86720C89120r1648N07392e22240C01568A30048M37248
$$ 660992 458752 1080320 -286720 389120 297472 804864 -522240 301568 130048 567296
6557E67296G168O24128N19680j85344j54112K75968C13344J3312K53440M03968
$$ 567296 7168 631296 1150976 965632 811520 1087488 313344 326656 580096 984064
6547I84064j54112B85696M3520N00224J70496M3520C45600O04672E6320P06048
$$ 984064 829952 285696 329216 829440 999936 1043456 345600 950272 56320 762368
6537G62368I6768N94944A52064P37280m5056L82976n72416M71552M79232C46624
$$ 762368 96768 691712 152064 889344 844288 1227264 654848 1126400 1605632 346624
6526a70496F75328B69824j024M30080O10304K74432k58560B19136B9696j1776
$$ -170496 675328 269824 268800 698880 1309184 1583616 1325056 219136 29696 17920
6516A7920K02240N87776i64096a21344F47680N55008j63328c24608F70720p2192
$$ 17920 220160 807936 -964096 -121344 647680 1202688 1039360 -324608 670720 598528
6506E98528j63840f0416B41152J19808Q09984D92032K04288a28512m43392D33152
$$ 598528 434688 -60416 241152 360960 1170944 492032 696320 -128512 -571904 433152
6495A179648l65056p6800k38080L57376b30912E9904O59456l24096F5536J811968
$$ 1179648 814592 737792 499712 857088 -230912 59904 719360 395264 65536 1877504
6485A877504D56192A26976J56672K42688i5744G08608i1648r216A223168B66752
$$ 1877504 456192 126976 283648 526336 -95744 708608 -91648 -100864 1223168 266752
6474e4784F12864K30400J83296D89984b20672D23936P81312C32800L43552B01216
$$ -54784 612864 843264 1026560 489984 -220672 423936 1205248 332800 676352 201216
6463C49696p680a07520l23584I20064n4272L2256D01408Q33536J22368A84320
$$ 349696 342016 -107520 -431104 920064 865792 898048 401408 1234944 1357312 184320
6452A134080n65248N52448B30912J646080F43072m6592B71872e0688E91360A47968
$$ 1134080 568832 1121280 230912 1876992 643072 596480 271872 -50688 591360 147968
6441G20896J62304D14208N86240m99200N05344k19136l93216L9936J62816a3312
$$ 720896 883200 414208 1000448 501248 1006592 787456 394240 434176 596992 -13312
6430E33504J41312R1648d45440A037824m98688j07520J52576K76480A32096J42848
$$ 533504 674816 766464 -445440 1037824 539136 431616 584192 860672 132096 274944
6420B74944h704F47680L40992m46976A96608c77344G55200K80576k4064A17760
$$ 274944 -8704 647680 988672 541696 196608 -377344 755200 1035776 1011712 117760
6409C96800K3552L73760A27488J18784d66944B45248P01952K48832b66240I89184
$$ 396800 420352 794112 127488 246272 -466944 245248 947200 1196032 -266240 989184
6398F04160J09056L8912b88256F05696J27488j89440N45280d14208F144P14752
$$ 604160 713216 752128 -288256 605696 733184 543744 1089024 -414208 6144 720896
6388G20896b8160k71872G82336K38592L07712m60288B60608P61856C23584M90496
$$ 720896 -28160 -300032 782336 1020928 1328640 868352 260608 1022464 323584 814080
6378H14080C11808L06688J63328P02464n71904l39968k39616J84832j44384K81600
$$ 814080 311808 618496 781824 1484288 912384 572416 332800 517632 373248 654848
6368F54848c1744C05664K84160J203200n38112l00032m73600N25824Q9088k31424
$$ 654848 -31744 305664 589824 1793024 1254912 954880 481280 1007104 1096192 864768
6358H64768B62656f87616b91840E24800L65056L28704a86368I88672P1680o1952
$$ 864768 262656 -687616 -291840 524800 889856 1218560 -186368 988672 1060352 998400
6348I98400l2768a02912A441280j72544n48352J74080k45248e81632K43712A096704
$$ 998400 965632 -102912 1441280 1268736 720384 894464 649216 -581632 -337920 1096704
6337A021952l97312j47456b9696F21568K76480B78528J51040J065984m93056b41664
$$ 1021952 624640 477184 -29696 621568 898048 278528 429568 1495552 1002496 -241664
6326D52608M40832J128448H7040Q31488N31456P7824a42336G36768A6384K3040
$$ 452608 893440 2021888 87040 918528 1449984 1527808 -142336 736768 16384 39424
6316C9424d41344A164800k71360k90304P99232D48000e31456G18336B39104g0144
$$ 39424 -441344 1164800 893440 603136 1402368 448000 -531456 718336 239104 -70144
6305I51808C24608L99360R34400n41696I2160a79200D16768A69984J084928O73792
$$ 951808 324608 723968 1658368 1116672 92160 -179200 416768 169984 1254912 1928704
6295A928704B64704N99552a17760H44800N15584D63360L45600J027072n94944
$$ 1928704 264704 864256 -117760 844800 1360384 463360 808960 1836032 1241088
6286A241088n27360L11808D51072d27008E90848k92352J202176n64736a15200
$$ 1241088 713728 1025536 451072 -427008 590848 298496 1500672 935936 -115200
6276A20320J037312A42336J376768A04448M83840L33312p2704A56160K44224P68000
$$ 120320 1157632 142336 1519104 104448 588288 921600 848896 156160 400384 1168384
6266A168384J05984R3696I2672C6864J325056B09920J189888D096f12352D86400
$$ 1168384 1274368 1368064 92672 36864 1361920 209920 1399808 4096 -612352 486400
6255H59136L1744N07392D25472C9424N55008J43872k93888Q7040N25824m93056
$$ 859136 890880 1398272 425472 39424 594432 738304 444416 531456 1057280 564224
6245E64224Q2432N68320Q01792F95808O36928m75648l37408i6768A512448E77536
$$ 564224 646656 1214976 2016768 695808 1332736 857088 519680 -96768 1512448 577536
6234A439232p00928E6320L18464N77024A56160P94624b65728A008128D12160l8400
$$ 1439232 738304 56320 374784 951808 156160 950784 -265728 1008128 412160 373760
6224C73760J484288F53312R9840O03136B90816O56896L76320E94944O77888l46624
$$ 373760 1858048 653312 753152 1356288 290816 947712 1324032 594944 1272832 926208
6214I26208c39968F45632L16416a83296A022464D3520J203200r8304m40320B10432
$$ 926208 -339968 645632 962048 -183296 1022464 43520 1246720 1148416 708096 210432
6203D73088M10112o5536Q21760E24288G4240J366528C33312f04160b22208k23744
$$ 473088 883200 817664 1639424 524288 74240 1440768 333312 -604160 -222208 -445952
6193d45952B074624G78240g5264A042432O24640C22560Q53504l3792J13152e50400
$$ -445952 2074624 778240 -75264 1042432 1667072 322560 1176064 1142272 1255424 -550400
6182G34208M79744J31584m40320B26816K52928o6048J086464C27680M6592J319424
$$ 734208 1213952 1345536 905216 226816 479744 413696 1500160 327680 374272 1693696
6172A693696k22208F51776J055232r1648l22560m26496M08576O08768E55008N10464
$$ 1693696 1471488 651776 1707008 1615360 1292800 866304 1274880 1883648 555008 1065472
6162A065472R6768E68832j92512j68448N12000M2496O47168E61664L3280Q80128
$$ 1065472 1162240 568832 376320 207872 719872 762368 1409536 561664 594944 1475072
6152A475072o55360k14528L62496A34656Q19712D56192J094144f1952A24416K33472
$$ 1475072 819712 605184 967680 134656 954368 456192 1550336 -61952 124416 357888
6142C57888J180160d50560F80448G7824R34912i9840F77376k87744J328640B65728
$$ 357888 1538048 -450560 680448 77824 1012736 -99840 677376 389632 1718272 265728
6131I15456m18304N57568l93216Q81664F69184o1952B81088J814016F97856J99168
$$ 915456 497152 1054720 661504 1543168 669184 607232 281088 2095104 697856 897024
6121H97024O08768F82496J92000l49184B48832J248768n98528C74272K28352m6592
$$ 897024 1505792 682496 874496 525312 248832 1497600 899072 374272 602624 556032
6111E56032J239552k12992C93216J72032N01248K48832j42848o1952N0688D59264
$$ 556032 1795584 1582592 393216 565248 1066496 1315328 1172480 1110528 1161216 459264
6100A308160a30048F11328M12160k27840l78368O2976J291264G03488A39264L98336
$$ 1308160 -130048 611328 1023488 795648 417280 480256 1771520 703488 139264 537600
6090E37600M66944k7136A19296K34496J07008O67648l44064K93376C60448O47168
$$ 537600 1004544 977408 119296 353792 460800 1128448 784384 1077760 360448 1007616
6080A007616j29024M93056D03456J018880m43392O32320p90016q2944N4784J84832
$$ 1007616 878592 1371648 403456 1422336 978944 1611264 821248 738304 793088 977920
6070I77920j73056O24640E40672P96160F03648L65056C30240R40032J59744j25952
$$ 977920 804864 1429504 540672 1336832 603648 968704 330240 1270272 1430016 1304064
6060A304064k60096k35520a76640C6864O66112B95936Q17152B87232j02912P59296
$$ 1304064 1043968 808448 -176640 36864 702976 295936 1113088 287232 184320 943616
6050I43616C49184M92032D15232A93024r1136k8160J103872m57216P5264J7408
$$ 943616 349184 841216 415232 193024 101888 73728 1177600 720384 795648 813056
6040H13056J062400p12192m67456M48512n15072L53280l79904p3216K85184A62304
$$ 813056 1875456 1163264 695808 1144320 629248 982528 602624 529408 814592 162304
6029E59616K02752l76832J062400J82272A56160J080832F07744L90656l15392
$$ 559616 762368 385536 1447936 1630208 156160 1236992 607744 998400 683008
6020F83008A82272L7888J282048o09792q4480l32800P73120l14368L58400D61312
$$ 683008 182272 220160 1502208 892416 807936 475136 1248256 933888 1292288 461312
6009H79104r1648K66752D11136O37440j99680L52768L96288K57024D30592P86944
$$ 879104 787456 1054208 411136 1048576 848896 1201664 1597952 1854976 430592 1217536
5999A217536O75328B49344Q88832K52928B62144J307136c5840A1264P48544A8432
$$ 1217536 1892864 249344 1138176 1391104 262144 1569280 -35840 11264 759808 18432
5988A050624O03136k51392K92352l21024o55872B88256P44448j01888j85856j96608
$$ 1050624 1653760 1402368 1694720 1373696 717824 288256 1032704 930816 744960 548352
5978E48352O18496j1776j85344C89632J034240F30272N03296o4000M18816F30784
$$ 548352 1166848 1155072 969728 389632 1423872 630272 1133568 1069568 1488384 630784
5967I69216n120L6352j23392k31424j93536R63584o05184k15040N02272B22208
$$ 969216 964096 1000448 877056 645632 452096 1415680 810496 595456 1097728 222208
5956A600512K50880n46816C16416a89440B78016q4992J893888G49056j53088J598464
$$ 1600512 1851392 1304576 316416 -189440 278016 193024 2086912 749056 595968 2194432
5946B194432H75008J80736A56672K3552J175552D91520M34176D14208Q41216k27840
$$ 2194432 875008 1055744 156672 180224 1355776 491520 925696 414208 1255424 1027584
5936A027584N4784j32608L45600n18144P19360E66272L84512N8880m29568L51744
$$ 1027584 1082368 949760 1295360 777216 1496576 566272 950784 1009664 580096 931840
5926I31840J011200F69184J123840l14368L6864C01056N25824K19136L72736o79424
$$ 931840 1943040 669184 1793024 1478656 1515520 301056 826880 1046016 1418752 739328
5916G39328O51264n43744J752576G32672N03808E89312Q46848j71520o04672e9904
$$ 739328 1390592 846848 2599424 732672 1236480 589312 1436160 1264640 659968 -59904
5905A774592j93536D78208k32960J16224J81760P40864J95072g0656I66656C04640
$$ 1774592 1581056 478208 245248 361472 543232 1284096 1479168 -70656 966656 304640
5894A48992R07264J48992E70368m6080J256960o25664d40320H6528J175552n91872
$$ 148992 1056256 1205248 570368 524288 1781248 1155584 -440320 86528 1262080 670208
5884F70208K23744k29888R2672B43200J43360q7552J025024n71904B71360L45600
$$ 670208 893952 664064 756736 243200 386560 299008 1324032 752128 271360 616960
5874F16960O66624J62304j34656M15744A43360J306624A59744J129984n70368
$$ 616960 1283584 1445888 1311232 1726976 143360 1449984 159744 1289728 719360
5865G19360P71072l41504M09088Q46848C92704Q50432K35520F17472O24128K41152
$$ 719360 1490432 1148928 1558016 2404864 392704 1243136 1478656 617472 1241600 1482752
5855A482752o08256m16768K68800N56544n41696J04448a024H91904M79232l44576
$$ 1482752 874496 457728 726528 1283072 741376 845824 -1024 891904 1371136 1026560
5845A026560j01376m45440i6256H85248J98656o8608k94400M11648A21344O02112
$$ 1026560 925184 479744 -96256 885248 1083904 1015296 720896 1132544 121344 723456
5835G23456l51232P24992D6592P57248J05472l00544k27328J257472m46464K72384
$$ 723456 372224 1097216 46592 803840 909312 608768 381440 1638912 1192448 1464832
5825A464832o52800l12832J077248F41024M92544a40288l14880D87936M38272
$$ 1464832 812032 499200 1576448 641024 1133568 -140288 -455168 487936 926208
5816I26208D54656K65728L60448l70688K64704D70528L04128l9936J041920I0112
$$ 926208 454656 720384 1080832 710144 974848 470528 774656 734720 1776640 90112
5805A67424J048064j5360B51904J515008k93376j67936C53280P92576k50368k88768
$$ 167424 1215488 1200128 251904 1766912 1473536 1305600 353280 1145856 895488 606720
5795F06720B54464P57760m63360J34656a2288A741824G30624J215488F72768k91328
$$ 606720 254464 1012224 548864 683520 -12288 1741824 730624 1946112 672768 381440
5785C81440P46496J22368l23072o2976o4512Q53504p15776j33120l31776Q1408
$$ 381440 1127936 1250304 927232 864256 799744 1653248 937472 804352 472576 553984
5775E53984J84832L97312m08064J336832C26144M61312k40128Q09472n29920L69664
$$ 553984 738816 1136128 728064 2064896 326144 787456 547328 1356800 826880 1196544
5765A196544n05856c3280F27200M78208C2256M0448R85600k08896R30816C85024
$$ 1196544 690688 -33280 627200 1105408 32256 72704 1058304 849408 1780224 385024
5754A363968k09920l65056l18976Q79104n16608J84832k43200K49856j69984M5056
$$ 1363968 1154048 788992 470016 1349120 832512 1017344 774144 1024000 854016 899072
5744H99072M10624A47456L95776O88640A23392O68160C74272J024000G3728Q69888
$$ 899072 1309696 147456 543232 1231872 123392 791552 374272 1398272 73728 943616
5734I43616N68832k81600L2256A07008N88288j75616O7072l584O55360m34688
$$ 943616 1512448 1230848 1263104 107008 695296 519680 586752 583168 1238528 803840
5724H03840N63200J71008j58720B26816J003008B80064P77216A90976M41344B4576
$$ 803840 1367040 1538048 1379328 226816 1229824 280064 1057280 190976 632320 24576
5713A041408K78016j37728j87904J316352p85408G34208B52416L92192M00896
$$ 1041408 1319424 1181696 993792 2310144 1524736 734208 252416 644608 1045504
5704A045504D89472O36416L3792L584E41696J632768I13920L39968k93376J85344
$$ 1045504 489472 1125888 1159680 1163264 541696 2174464 913920 1253888 960512 1145856
5694A145856M95616F38464L09760N40160o48704N01760j40288M82304j03424J29536
$$ 1145856 1641472 638464 948224 1488384 839680 1341440 1201152 1683456 1580032 1709568
5684A709568G54176L2768j88416N47840E65760J620480A041920K0992n2224L74272
$$ 1709568 754176 786944 598528 1146368 565760 2186240 1041920 1062912 1010688 1384960
5674A384960M02432N20192r84064n31968J32096k52928J122816o07744k80064
$$ 1384960 1787392 2307584 1323520 791552 923648 670720 1793536 1185792 905728
5665I05728J89440O81984l27680r216J71008J33632D68992N16096Q6528N1200
$$ 905728 1095168 1777152 1449472 1440256 1611264 1744896 468992 985088 1071616 1122816
5655A122816J46432O4000B01216J265152G15264a40288A200128D32128O48704
$$ 1122816 1269248 1333248 201216 1466368 715264 -140288 1200128 432128 1080832
5646A080832j98144P02464p01952J212928R9328C71712R42592k31424E34528L33312
$$ 1080832 882688 1585152 883200 2096128 2195456 371712 1314304 1082880 534528 867840
5636H67840M86912m56192l56352P37792D14720K25792J8944B19648Q79616J01376
$$ 867840 1354752 898560 542208 1280000 414720 640512 659456 219648 1099264 1200640
5626A200640R9840J67424k0480n92384l13856J291776o41024K03264o8096j76640
$$ 1200640 1300480 1467904 1447424 855040 541184 1832960 1191936 1395200 1327104 1150464
5616A150464j68960k96448J135616k08384B47808P38304P680C55328R48736j83808
$$ 1150464 981504 685056 1820672 1612288 247808 986112 993792 355328 1304064 1120256
5606A120256A94048J020416C59424Q39168R02144M8640j003008M84864L47136
$$ 1120256 194048 1214464 359424 1198592 2100736 2149376 1146368 1631232 1978368
5597A978368p28576A26976Q75008j02400P33696l42016l93728J721856A305600
$$ 1978368 1249792 126976 1001984 899584 1633280 1291264 897536 2619392 1305600
5587I92256Q35584H43776M6592L56352M13696o3488p33184j72032r4720B09408
$$ 992256 1827840 843776 890368 1246720 1660416 1596928 863744 691712 596992 209408
5576F15936P33184P72608E87776P56224D85376L76832J069056F63040K41152P81312
$$ 615936 1349120 2121728 587776 1344000 485376 862208 1931264 663040 904192 1685504
5566A685504m13184C60448J84320J313792C59936N81632M8640O72768m19840L48160
$$ 1685504 1272320 360448 544768 1858560 359936 941568 990208 1662976 1243136 1591296
5556A591296p31136J24416L96288n32480N03296J81760E49888L36896h1920A917952
$$ 1591296 860160 984576 1380864 848384 1351680 1533440 549888 886784 -81920 1917952
5545A154560n01760J332736r86112J002496l06688H04352J7408J16224l91680
$$ 1154560 652800 1985536 999424 2001920 1695232 804352 821760 937984 546304
5536E46304Q58624n02784b17600B040320o81984o45120Q31488E95456Q27392J26464
$$ 546304 1404928 902144 -217600 2040320 1358336 713216 1544704 595456 1422848 1549312
5526A549312j14688P16800p15264Q2944j61280m74112P82336F72256J033728o02624
$$ 1549312 1434624 2151424 1436160 1519104 1357824 883712 1666048 672256 1705984 1103360
5516A103360R40544F65600N98016J087488j090560M13696n56544m096m99200J959424
$$ 1103360 2043904 665600 1263616 2351104 1260544 1674240 1117696 1113600 614400 2573824
5506B573824A185792O04160j4336p7312p33184C00544Q40192Q8576L45088l65568
$$ 2573824 1185792 1789952 1775616 1698304 965120 300544 1140736 1229312 1574400 1208832
5496A208832K63680K66752q2944O69696N64224j342464L4816N59616l83488l21024
$$ 1208832 1472512 1739264 1656320 2326016 2890240 1547776 1582592 2142208 1758720 1437696
5486A437696J93536K00704k5600J7408K47296m096l2768G07072J031680M62336
$$ 1437696 1631232 1831936 1806336 1823744 2071040 2066944 2034176 707072 1738752 2201088
5476B201088l92192n76000l63008o5536J019392J40800G73120R53344E37088K59072
$$ 2201088 1808896 1232896 869888 804352 1823744 1964544 773120 1726464 537088 796160
5466G96160N66272m21376M36224E13024J93024N50400n18656O11328Q51968q45824
$$ 796160 1362432 941056 1377280 513024 706048 1256448 737792 1349120 2201088 1355264
5456A355264p5776q2944M40832p65440J30048j57184L4304L80928K50880K60608
$$ 1355264 1279488 1196544 1637376 871936 1001984 844800 879104 1260032 1510912 1771520
5446A771520b12480H20224k45760O78912K45760K00192k5600P9360J09056H09472
$$ 1771520 -212480 820224 574464 1253376 1499136 1699328 1673728 1753088 1862144 809472
5435B97984J060864N21728p5264L28704E88800j76640P49568K39616o43584R07776
$$ 297984 1358848 1880576 1805312 2134016 588800 412160 1161728 1401344 757760 1665536
5425A665536m03456p7312J71008l6864n42720N17632o01088J31584J52576r2672
$$ 1665536 1262080 1184768 1355776 1318912 776192 1293824 692736 824320 976896 884224
5415H84224M14208m00896M41856L10784B24768J089024K67776G54688L44064j1776
$$ 884224 1298432 897536 1339392 1650176 224768 1313792 1581568 754688 1098752 1086976
5405A086976K52928o44608O43584n72416d85376B213376H29952N48352j13664
$$ 1086976 1339904 695296 1338880 766464 -485376 2213376 829952 1378304 1264640
5396A264640J50016K4576k40640P09120m70016K6112E44256J210368C74272P48032
$$ 1264640 1414656 1439232 1198592 1907712 1437696 1463808 544256 1754624 374272 1122304
5386A122304A77152N16096J042432A82784J526784p48544R94816K82112q24832
$$ 1122304 177152 693248 1735680 182784 1709568 961024 1955840 2237952 1413120
5377A413120F19520R67680m62848J85344M37248n84192P68000J1264n88288m34176
$$ 1413120 619520 1587200 1124352 1309696 1746944 1162752 1930752 1942016 1353728 919552
5367I19552N27872n5296O9120J58208n4784K84672M67456k46784o99904p0656
$$ 919552 1447424 1392128 1461248 1619456 1564672 1849344 2316800 2070016 1370112 1299456
5357A299456L49184L75808q05376J035264L77344A266688J63328J80736G95136
$$ 1299456 1648640 2024448 1219072 2254336 2631680 1266688 1430016 1610752 795136
5347A715712m67968N95968l16416l09760n85216m3008J220608k93376K13504O02624
$$ 1715712 1247744 1843712 1527296 1217536 632320 589312 1809920 1516544 1730048 2332672
5337B332672M55168A359872n12000J212928k26304j25952j54112l90656P24480
$$ 2332672 2787840 1359872 847872 2060800 1834496 1708544 1554432 1163776 1888256
5328A888256n92384J672192l20000I32864R06752M49024r51808L96288O30784
$$ 1888256 1295872 2968064 2648064 932864 1839616 2288640 1336832 1733120 2363904
5319B363904k97472j94560j35680N74464J10080j38752p37280J002496j36704
$$ 2363904 2066432 1871872 1736192 2310656 2420736 2281984 1544704 2547200 2410496
5310B410496l24096K85184A177088J055744C74272J770496p89504j22368R20576
$$ 2410496 2086400 2371584 1177088 2232832 374272 2144768 1355264 1232896 2153472
5301B153472r94304L75808l22560J016320I96864N05344L28192K5600m50048N3760
$$ 2153472 1159168 1534976 1212416 2228736 996864 1502208 1830400 1856000 1405952 1459712
5291A459712J074176l53280p99744q3456Q75520k26816o23104Q4480K66752k75968
$$ 1459712 2533888 2180608 1380864 1297408 2172928 1946112 1323008 1407488 1674240 1398272
5281A398272D77696K58560J10080M10624J70496F90176R85088j82272M44928l87072
$$ 1398272 477696 736256 846336 1256960 1427456 690176 1675264 1492992 1937920 1550848
5271A550848m20864Q90880M27008F88128J41824N75488n37600J60256J172480
$$ 1550848 1129984 2020864 2447872 688128 829952 1405440 867840 1028096 2200576
5262B200576n05856F00576J114112N89824I68192P44960D88960J036288o58432
$$ 2200576 1694720 600576 1714688 2304512 968192 1713152 488960 1525248 866816
5253H66816K2528J16736Q08960p22944P0656E67808P14752p680R06752q52992
$$ 866816 889344 1006080 1815040 1092096 1162752 567808 1282560 1274880 2181632 1328640
5243A328640k38592k17600k96448J554944r91232J283584o63040C49696J075200
$$ 1328640 1090048 872448 576000 2130944 1139712 2423296 1760256 349696 1424896
5234A424896C68128J034752N48352r67168D25984K64192R99936J167872H46848
$$ 1424896 368128 1402880 1951232 984064 425984 690176 1690112 2857984 846848
5224I86112N04320N38624N26848q46848G85920K00704D67968M41856M23936K58048
$$ 986112 1490432 2029056 2555904 1709056 785920 986624 467968 909824 1333760 1591808
5214A591808l47136N34016n41184R36960n66784m40832J65376l87072j54624J140736
$$ 1591808 1244672 1778688 1237504 2174464 1607680 1166848 1332224 945152 790528 1931264
5204A931264H40192P26528n42720l06176R51808J097216j354752F88640J704960
$$ 1931264 840192 1566720 1024000 717824 1669632 2766848 1412096 688640 2393600
5195B393600q37120j80224k07872R8816l58912R23136R3696R1648E39136K23232
$$ 2393600 1556480 1376256 1168384 1267200 908288 1831424 1925120 2016768 539136 762368
5185G62368P36768j02400J35168n17120J88416J175040k00704p11680B65216J454592
$$ 762368 1499136 1396736 1531904 1014784 1203200 2378240 2177536 1465856 265216 1719808
5175A719808J94560M3520m74624F25664J032192L01568n63200Q36096H46336R87136
$$ 1719808 1914368 1957888 1483264 625664 1657856 1959424 1396224 2232320 846336 1833472
5165A833472r13408k15552J615872j024000J016832j143808K92352N3760j12640
$$ 1833472 920064 704512 2320384 1296384 2313216 1169408 1461760 1515520 1402880
5156A402880J18272P18848D21888J270784j04960j29024J59744J235968j398784
$$ 1402880 1521152 2240000 421888 1692672 1587712 1458688 1618432 2854400 1455616
5147A455616N73952K80064F95808N29408n11488j15712P43936N05856L59936o71232
$$ 1455616 2029568 2309632 695808 1225216 713728 598016 1341952 1847808 2207744 1536512
5137A536512N91872q81664N69344j19808M34688m59264K08384J76128l1232N71392
$$ 1536512 2128384 1246720 1816064 1696256 2130944 1671680 1880064 2056192 2024960 2596352
5127B596352E26848Q85248M46976J3312L31776A092096l8912J121792m91008L31264
$$ 2596352 526848 1412096 1859072 1872384 2204160 1092096 1053184 2174976 1683968 2015232
5117B015232p98208N92896m89472l072L3792o8096K2528L69664K90304j17248
$$ 2015232 1217024 1809920 1320448 1317376 1351168 1283072 1305600 1675264 1965568 1848320
5107A848320J199104j293312n7344L27680K29888O78912j142272Q10496o06208
$$ 1848320 3047424 1754112 1696768 2024448 2254336 2933248 1790976 2601472 1995264
5098A995264L72224j076224J629696j426944J559040l63520O30784j38240j28512
$$ 1995264 2367488 1291264 2920960 1494016 3053056 2689536 3320320 3182080 3053568
5089C053568J58720j433600J91488G37792J155072p80288Q66304n80096P75680
$$ 3053568 3212288 1778688 1970176 737792 1892864 1112576 1978880 1398784 2174464
5080B174464F42048J193984j52064n59104J561600j081856P97184n12k69312K7648
$$ 2174464 642048 1836032 1683968 1124864 2686464 1604608 2401792 2401280 2131968 2159616
5070B159616n10976o27200M6080N23776m41856O1440M25472n26336Q92416L65056
$$ 2159616 1648640 1021440 1067520 1591296 1149440 1210880 1636352 1110016 2002432 2367488
5060B367488m46464j52576M18816A090048K53952L90144N3760o29760J143808
$$ 2367488 1921024 1768448 2187264 1090048 1344000 1734144 1787904 1158144 2301952
5051B301952O10816j424896j90464N01760p16800M24960R94304n84192m20352
$$ 2301952 2912768 1487872 1297408 1799168 1082368 1507328 2501632 1917440 1497088
5042A497088j36192J198592o83520q01792J547776E45280J277440F55360R5232
$$ 1497088 1360896 2559488 1875968 1074176 2621952 545280 1822720 655360 750592
5033G50592J279488q14592Q94464I00608J35168P38304m04992j92512n41184Q91392
$$ 750592 2030080 1215488 2109952 900608 1035776 1774080 1369088 1176576 635392 1526784
5023A526784L98336q87296k41152N31968Q5504P19360q96512J111552A129472
$$ 1526784 1925120 1037824 796672 1328640 1414144 2133504 1236992 2348544 1129472
5013A420800q8064R18016q34560O19008O15424G6288J359360O80960j84832p24992
$$ 1420800 1332736 2250752 1416192 2035200 2650624 76288 1435648 2116608 1931776 1206784
5003A206784J86368K13504q1920J047552D31104J654272n2224l21024O96832A126400
$$ 1206784 1393152 1606656 1524736 2572288 431104 2085376 2033152 1712128 2408960 1126400
4992B177024A023488M28032Q16640J67424r50784Q57600J41312n57568P59808
$$ 2177024 1023488 1451520 2268160 2435584 1484800 2342400 2483712 1926144 2685952
4983B685952q77056J61280l00032l47136O52288l55840K85696q06912J302016
$$ 2685952 1808896 1970176 1670144 1323008 1975296 1619456 1905152 1098240 2400256
4974B400256p96672O7584J119232A257472P65440k66240O7072K7648j43872r216
$$ 2400256 1603584 1671168 2790400 1257472 2022912 1756672 1823744 1851392 1707520 1698304
4964A698304K86208m15232J54624j63328R4720l95264L71200J166848I55904K109440
$$ 1698304 1984512 1569280 1723904 1560576 1655296 1260032 1631232 2798080 955904 3065344
4954C065344p75680q96000K49856J31072J87392j7408k93888J33120j15200l06688
$$ 3065344 2289664 1393664 1643520 1774592 1961984 1944576 1650688 1783808 1668608 1361920
4944A361920Q13056J44384l72224O63552p69536N48352j15200n02272N16096r74848
$$ 1361920 2174976 2319360 1947136 2610688 1841152 2389504 2274304 1772032 2288128 1313280
4934A313280R29792K92864K41152j063936O54848k39616N8368M34688q32000J426944
$$ 1313280 2243072 2535936 2777088 1713152 2368000 2128384 2186752 2621440 1789440 3216384
4924C216384r21600J53088o80960K92864O64576m37248K63680o63040l09248j43360
$$ 3216384 2294784 2447872 1766912 2059776 2724352 2287104 2550784 1887744 1578496 1435136
4914A435136O6560N12Q69888H58112J257472o60480J038848p62880O38976K78016
$$ 1435136 1501696 1502208 2372096 858112 2115584 1455104 2493952 1731072 2370048 2648064
4904B648064j23392r95840N91360P9872n35552m80768J303040M1984A141248N57056
$$ 2648064 2524672 1528832 2120192 2200064 1664512 1183744 2486784 2528768 1141248 1698304
4894A698304O80960j134080O20544m76672n0688J96608R47712M72576j193472
$$ 1698304 2379264 1245184 1865728 1389056 1338368 1534976 2482688 2955264 1761792
4885A761792R19040A097216J027584j022976M73600L29216l99360N20192O44608
$$ 1761792 2680832 1097216 2124800 1101824 1575424 1904640 1505280 2025472 2670080
4876B670080n3760p24992j63328m3520O74816m52096O63040Q97536m73600q20736
$$ 2670080 2616320 1891328 1728000 1684480 2359296 1907200 2570240 3467776 2994176 2173440
4866B173440k16064n33504N75488q3968K14016m4032K27840o41536L7376O11840
$$ 2173440 1957376 1423872 1999360 1915392 2129408 2085376 2313216 1671680 1709056 2320896
4856B320896n66272p38816J769472B8672L405824A485312O50752l73248K58048
$$ 2320896 1754624 1015808 2785280 28672 3434496 1485312 2136064 1762816 2020864
4847B020864O59456J28512n92896N36576M9664j199104P39840m33152K25792R74336
$$ 2020864 2680320 2808832 2215936 2752512 2802176 1603072 2342912 1909760 2135552 3109888
4837C109888k39104L07200n17120P05024k31936o01600P95648M2496j61792N38112
$$ 3109888 2870784 3177984 2660864 3365888 3133952 2532352 3328000 3370496 3208704 3746816
4827C746816P68000p34720j13152J078272J272320j072640J517056j516032J88928
$$ 3746816 4514816 3780096 3666944 4745216 6017536 4944896 6461952 4945920 5134848
4818E134848k68800J318912k212352L44576q84736n1712m51584r35936j73056
$$ 5134848 4866048 6184960 3972608 4317184 3432448 3380736 2929152 1993216 1820160
4809A820160P53152r88160M83328J227264r07264A075712K117632k16064q0384
$$ 1820160 2573312 1585152 2068480 3295744 2388480 1075712 3193344 2977280 2896896
4800B896896j110016n3760L63520G72096J360896M10112n88288I20064Q32512
$$ 2896896 1786880 1733120 2096640 772096 2132992 2543104 1954816 920064 1752576
4791A752576Q9088j59744O41024q77056J00864O6048M20352N57056p61856n6320
$$ 1752576 1841664 1681920 2322944 1445888 1546752 1612800 2033152 2590208 1828352 1772032
4781A772032P8336J46432n25824o26176J338368j07520l90144N10976n120n58592
$$ 1772032 1850368 1996800 1470976 844800 2183168 2075648 1685504 2196480 2191360 1632768
4771A632768J50016P07072j067008R03680k93376N62688o28224N92896q49408
$$ 1632768 1782784 2489856 1422848 2326528 2033152 2595840 1967616 2560512 1711104
4762A711104O38976J45920n71392J045504j160192k17600j88416J006592q7040
$$ 1711104 2350080 2496000 1924608 2970112 1809920 1592320 1403904 2410496 2323456
4753B323456A009664J335808N7344k16576l96288Q48384l3280j025024O57408
$$ 2323456 1009664 2345472 2402816 2186240 1789952 2638336 2605056 1580032 2237440
4744B237440Q62720A463296N93408j017856J501696J84832k33984r55904J353728
$$ 2237440 3100160 1463296 2056704 1038848 2540544 2725376 2491392 1535488 2889216
4735B889216j152512O99392m96128K36544J005568j132544L48160j05472M98688
$$ 2889216 1736704 2436096 1939968 2176512 3182080 2049536 2397696 2292224 2790912
4726B790912o91200N41184j77664k01728K49344o48192j44896R79456n83680L79904
$$ 2790912 2099712 2640896 2463232 2261504 2510848 1862656 1717760 2697216 2113536 2493440
4716B493440l60448L23584j114624J469440j22368k02240A193984J222144J15200
$$ 2493440 2132992 2456576 1341952 2811392 2689024 2486784 1193984 2416128 2531328
4707B531328r7792p680o69696K81600L21536p35744K66240J94048N16608j046528
$$ 2531328 2433536 2425856 1756160 2037760 2359296 1623552 1889792 2083840 2600448 1553920
4697A553920J007616m50560k64704l1232N44768J271296q08448l0208j89440m18816
$$ 1553920 2561536 2110976 1846272 1815040 2359808 3631104 2822656 2792448 2603008 2184192
4687B184192l41504j83296K58560m60288J062400P4240L60448k69824q68864j82784
$$ 2184192 1842688 1659392 1917952 1457664 2520064 2594304 2954752 2684928 1816064 1633280
4677A633280G98720J994752L79392p50080k23744j04960M94592M52096J46432
$$ 1633280 798720 2793472 3172864 2422784 2199040 2094080 2588672 3040768 3187200
4668C187200q61184K20160m2496P51616m82816M6080J65376j336832j07520N06368
$$ 3187200 2326016 2546176 2503680 3255296 2772480 2818560 2983936 1647104 1539584 2045952
4658B045952O91200o52800K5600n47328R2160l30752J541120p22432j08544J515008
$$ 2045952 2737152 2084352 2109952 1562624 1654784 1324032 2865152 2142720 2034176 3549184
4648C549184A410048J399296q44800J157632J22368j66912J84832l14368m09088
$$ 3549184 1410048 2809344 1964544 3122176 3244544 3077632 3262464 2948096 2539008
4639B539008j034240J117184k4576K41152P88480E45280J649152o15424J208832
$$ 2539008 1504768 2621952 2597376 2838528 3627008 545280 2194432 1579008 2787840
4630B787840J66912r50272J88416q0896l91168Q36096n97504K05312m11136P30624
$$ 2787840 2954752 2004480 2192896 2112000 1720832 2556928 1959424 2164736 1753600 2484224
4620B484224O62016j82272r48224J040896j009664R216L70688j41312r95328J925120
$$ 2484224 3146240 2963968 2015744 3056640 2046976 2056192 2426880 2285568 1290240 3215360
4610C215360j117696Q11520l70688n11488P2704J86368O16960k44224p09632J341440
$$ 3215360 2097664 2909184 2538496 2027008 2099712 2286080 2903040 2658816 1949184 3290624
4600C290624A434112Q54016K21696K86720R2160l58400J84320O58944q19200j32096
$$ 3290624 1434112 2288128 2509824 2796544 2888704 2530304 2714624 3373568 2554368 2422272
4590B422272R37984p09120K31424l80416j56160n96480N64224K9184K31936Q6016
$$ 2422272 3360256 2651136 2882560 2502144 2345984 1749504 2313728 2342912 2574848 2660864
4580B660864R06752r61024r3696m20352Q64768o89664Q87808p48032N23264p48032
$$ 2660864 3567616 2606592 2512896 2092544 2957312 2267648 3155456 2407424 2930688 2182656
4570B182656J335808p35744k05824j9968O26176o02112R21088j056256P62880
$$ 2182656 3518464 2782720 2576896 2556928 3183104 2580992 3502080 2445824 3208704
4561C208704R66144o33856n70880J495040k115072n10464J598976m63872K90816
$$ 3208704 4174848 3540992 2970112 4465152 2350080 1839616 3438592 2974720 3265536
4552C265536P51616n91360J39776j35680J55136q33024M46976r91232O77376n04832
$$ 3265536 4017152 3425792 3565568 3429888 3585024 2752000 3198976 2207744 2885120 2380288
4542B380288l21024M10112Q38656j84320j128960P31136n83680Q11520N24288
$$ 2380288 2059264 2469376 3308032 3123712 1994752 2725888 2142208 2953728 3478016
4533C478016q10496p76704m608J466368j099776J241088n41696L58400l42016
$$ 3478016 2667520 1890816 1886208 3352576 2252800 3493888 2952192 3310592 2968576
4524B968576j03936O26176N36576p14752J76128Q23808m49536o2464n74464j018368
$$ 2968576 2864640 3490816 4027392 3312640 3488768 4312576 3863040 3800576 3226112 2207744
4514B207744J299968q65792J148928J2800j184256J009664L75808j783296P99232
$$ 2207744 3507712 2641920 3790848 3803648 2619392 3629056 4004864 2221568 3020800
4505C020800l4816O05184l77856o31808k37568k74432O62528o83008O81472N27360
$$ 3020800 2985984 3591168 3213312 2581504 2343936 2069504 2732032 2049024 2730496 3257856
4495C257856p34720j83296J254400n08416K67776j052672K88768n32992Q18688
$$ 3257856 2523136 2339840 3594240 3085824 3353600 2300928 2589696 2056704 2875392
4486B875392j39264n57056R70240n90848O42048m94080o36928O42560r66144L26144
$$ 2875392 2736128 2179072 3149312 2558464 3200512 2706432 2069504 2712064 1745920 2072064
4476B072064P14752L77344l63520L23584r79968O41024p7312o48704O70720O01600
$$ 2072064 2786816 3164160 2800640 3124224 2144256 2785280 2707968 2059264 2729984 3331584
4466C331584l36384j395200O67648P75168J32096n65248R88672J13152j513984
$$ 3331584 2995200 1600000 2267648 3042816 3174912 2609664 3598336 3711488 2197504
4457B197504j6896j75104J846784q32512m13184m4032K79552K45760n28896J125376
$$ 2197504 2180608 2005504 3852288 3019776 2606592 2562560 2842112 3087872 2558976 3684352
4447C684352m24960J29536m13696P4240L15904j296896N33504M95104l12320j008128
$$ 3684352 3259392 3388928 2975232 3049472 3365376 2068480 2601984 3097088 2784768 1776640
4437A776640L44064R32864M41856n47328J135104j026048m55680K15040O33344
$$ 1776640 2120704 3053568 3495424 2948096 4083200 3057152 2601472 2816512 3449856
4428C449856L46624M73600k35520p72096q93952J285120o34368J101312n96480
$$ 3449856 3796480 4270080 4034560 3262464 2368512 3653632 3019264 4120576 3524096
4419C524096k50880O52288J67424M99200j160704M68992j679872R37472J046528
$$ 3524096 3273216 3925504 4092928 4592128 3431424 3900416 2220544 3158016 4204544
4410D204544j210880M35712K22208p50080j59232O11328M51072k11968j55648
$$ 4204544 2993664 3429376 3651584 2901504 2742272 3353600 3804672 3592704 3437056
4401C437056N93920j07520N38624j611264r7792M04992k57024N32480l22560j208832
$$ 3437056 4030976 3923456 4462080 2850816 2753024 3158016 2900992 3433472 3110912 1902080
4391A902080O72256J20320p12192N29920M43904n55520l28704j95584J089024
$$ 1902080 2574336 2694656 1982464 2512384 2956288 2400768 2072064 1876480 2965504
4382B965504l36896k28352M74112L9936A383936Q53504P78752o64064R68192l38432
$$ 2965504 2628608 2400256 2874368 2914304 1383936 2237440 3016192 2352128 3320320 2981888
4372B981888l16416L27680L7376m37760M62848J46432N71904n45792R728j085440
$$ 2981888 2665472 2993152 3030528 2592768 3055616 3202048 3773952 3228160 3237888 2152448
4362B152448J79712Q21248L15392j48480N62688n83680K7136J373184j074176
$$ 2152448 2332160 3153408 3468800 3320320 3883008 3299328 3326464 4699648 3625472
4353C625472o10816N82656n78560M80256n60640n03808N68832q01792R73824l25120
$$ 3625472 3014656 3597312 3018752 3499008 2938368 2434560 3003392 2201600 3175424 2850304
4343B850304M57216n30944k2528m21888N85216L04128n10464m57216Q03840N7856
$$ 2850304 3307520 2776576 2754048 2332160 2917376 3221504 2711040 2253824 3057664 3115520
4333C115520q01280J186816J22368L99360m04480n07392J76128O01088l12832
$$ 3115520 2314240 3501056 3623424 4022784 3618304 3110912 3287040 3888128 3575296
4324C575296l63520L34848M7616j51552m46464j97120j37728J176064n19680r95328
$$ 3575296 3211776 3546624 3594240 3442688 2996224 2799104 2661376 3837440 3317760 2322432
4314B322432J589248J31072p31648O66624n48864K54976k76992K66240Q07936
$$ 2322432 3911680 4042752 3311104 3977728 3428864 3683840 3406848 3673088 4481024
4305D481024N38624k36544j01376j210368N31968m91520j228800J379840p75168
$$ 4481024 5019648 4783104 4681728 3471360 4003328 3511808 2283008 3662848 2887680
4296B887680N13024j554432J193984l584P27040r24160P680l3280m77696J363456
$$ 2887680 3400704 1846272 3040256 3036672 3763712 2839552 2847232 2813952 2336256 3699712
4286C699712j166336m9664M59264J66400k24768l66592K080256j114112P2704
$$ 3699712 2533376 2483712 2942976 3109376 2884608 2518016 4598272 3484160 3556864
4277C556864j40288M13696k21184k74944L25120n24800M5568L67104L84000j490432
$$ 3556864 3416576 3830272 3609088 3334144 3659264 3134464 3180032 3547136 3931136 2440704
4267B440704J166336M35200p71072m06528O64576K99008j54112n82656N5808O5536
$$ 2440704 3607040 4042240 3271168 2864640 3529216 3828224 3674112 3091456 3147264 3212800
4257C212800n05344K94400J029632o65088n31968n4272Q33024m98176J39776n14048
$$ 3212800 2707456 3001856 4031488 3366400 2834432 2780160 3613184 3115008 3254784 2740736
4247B740736P44960o97344J44896Q12032k64704o31808j14688R35424J50016l55328
$$ 2740736 3485696 2788352 2933248 3745280 3480576 2848768 2734080 3669504 3819520 3464192
4237C464192M61824j152512J099264r05728J263104j864192P97696N29920j227264
$$ 3464192 3926016 2773504 3872768 2967040 4230144 2365952 3163648 3693568 2466304
4228B466304M03456m45440J200128j128960L73248l80416N74976o07744P24992
$$ 2466304 2869760 2424320 3624448 2495488 2868736 2488320 3063296 2455552 3180544
4219C180544N9904p10656M15232n48352O14400j44896J410560j446400o2976m37248
$$ 3180544 3240448 2529792 2945024 2396672 3011072 2866176 4276736 2830336 2767360 2330112
4209B330112J026048p4240J90464r29792Q15104M20864j073152Q12544j069568
$$ 2330112 3356160 3281920 3472384 2542592 3357696 3778560 2705408 3517952 2448384
4200B448384M44416K72896n96992J72032M33664o62528O73792n38624k43712J215488
$$ 2448384 2892800 3165696 2568704 2740736 3174400 2511872 3185664 2647040 2403328 3618816
4190C618816L23584j446912P16288L89120P680K47296j291264L61984j15200R40544
$$ 3618816 3942400 2495488 3211776 3600896 3608576 3855872 2564608 2926592 2811392 3751936
4180C751936l35360l14368m15744J150976j836544J518592k43712R55904j728000
$$ 3751936 3416576 3102208 2686464 3837440 2000896 3519488 3275776 4231680 2503680
4171B503680J230848m17280l7888J12128K87744m63872K23232M3008o42560N48864
$$ 2503680 3734528 3317248 3279360 3391488 3679232 3215360 3438592 3481600 2839040 3387904
4161C387904L11808m22912k71360q41216N79072J176064r17504N88800m78208
$$ 3387904 3699712 3276800 3005440 2164224 2743296 3919360 3001856 3590656 3112448
4152C112448n48864J099264j45920m67456N00224l8400k58560J37216q12544R84064
$$ 3112448 2563584 3662848 3516928 3049472 3549696 3511296 3252736 3389952 2577408 3561472
4142C561472N54496m40320k48320n8880k67264J8432n87264O54336O79936r23648
$$ 3561472 4115968 3675648 3427328 3368448 3101184 3119616 2532352 3186688 3866624 2942976
4132B942976O70720L06176M60288r56416P79264O21568j212928p82336O02112
$$ 2942976 3613696 3919872 4380160 3423744 4203008 4824576 3611648 2829312 3431424
4123C431424P9872N62176r13408N57568P12704q95488K92864N34016m72576q32000
$$ 3431424 3511296 4073472 3160064 3717632 4430336 3534848 3827712 4361728 3889152 3057152
4113C057152K04288m91008P66464J59232q26880r4720L55840Q82688n61664r4208
$$ 3057152 3261440 2770432 3536896 3696128 2869248 2774528 3130368 4013056 3451392 3357184
4103C357184N23264R1648J24416Q42240j009152M17792m22912N803008D670464
$$ 3357184 3880448 3972096 4096512 4938752 3929600 4347392 3924480 9727488 4670464
4093D141056l8400N19680k06848R7792R10336j248256L2768m5056J392128r90720
$$ 4141056 4102656 4622336 4415488 4513280 5423616 4175360 4208128 4163072 5555200 4564480
4083D564480P12192m52096J158656o17984J44896Q9088r26720R0112L26144k56512
$$ 4564480 5276672 4824576 5983232 5365248 5510144 5599232 4672512 4762624 5088768 4832256
4073D832256M38272j396736L40992p80800P5264J632256q92928O95296j210880
$$ 4832256 5270528 3873792 4214784 3433984 3509248 5141504 4248576 4943872 3732992
4064C732992P58784m07552j427456J322496j228288k21184J026048p9872o63552
$$ 3732992 4491776 4084224 2656768 3979264 2750976 2529792 3555840 3475968 2812416
4055B812416J411584o03136L53280K30912L67616j65888l84000M53120J038848
$$ 2812416 4224000 3620864 3974144 4205056 4572672 4406784 4022784 4475904 5514752
4046E514752k262016N11488l0208J9968k12992N81632l45088Q0384M71040J52576
$$ 5514752 3252736 3764224 3734016 3753984 3540992 4122624 3777536 3857920 4328960 4481536
4036D481536p90016J98144j07008L55840N22752o79936l59424P94624j48480m12160
$$ 4481536 3691520 3889664 3782656 4138496 4661248 3981312 3621888 4416512 4268032 3855872
4026C855872K23232O30784j282560L41504m09600N74464o1440L94240R7280K70848
$$ 3855872 4079104 4709888 3427328 3768832 3359232 3933696 3872256 4266496 4363776 4634624
4016D634624j224704J469952L90144m33152n76512Q91904J39264p80288m16256
$$ 4634624 3409920 4879872 5270016 4836864 4260352 5152256 5291520 4511232 4094976
4007D094976Q03840j10592o53312K01216m5056R30816q51456q3456O88128o23616
$$ 4094976 4898816 4788224 4134912 4336128 4291072 5221888 4370432 4286976 4975104 4351488
3997D351488k80576J196544j081856j35680O41024m42880k80576Q79104n6832
$$ 4351488 4070912 5267456 4185600 4049920 4690944 4248064 3967488 4846592 4789760
3988D789760j051648N05856O1440o38464p13728L03104N56544K38080q12032O5536
$$ 4789760 3738112 4243968 4305408 3666944 2953216 3256320 3812864 4050944 3238912 3304448
3978C304448k49344J026048o53312r58976P18848N27360j57184o5024M03456p680
$$ 3304448 3055104 4081152 3427840 2468864 3187712 3715072 3557888 3492864 3896320 3888640
3968C888640j435136R36960q02816J149440N62176k97472j28000M54656r16480
$$ 3888640 2453504 3390464 2587648 3737088 4299264 4001792 3873792 4328448 3411968
3959C411968J155072j658880N57568j21344N30944o8608J06496J54112j79712
$$ 3411968 4567040 2908160 3465728 3344384 3875328 3806720 3913216 4067328 3887616
3950C887616K54976m97664k20672p04000M64896J937920o52288o68160j044992
$$ 3887616 4142592 3644928 3424256 2720256 3185152 5123072 4470784 3802624 2757632
3941B757632J352192k12480L69152o88128L76320p33184Q80640r84064K33984
$$ 2757632 4109824 3897344 4266496 3578368 3954688 3221504 4102144 3118080 3352064
3932C352064J128448k09408j939456J317376L41504m17280Q56576o31808K14016
$$ 3352064 4480512 4271104 2331648 3649024 3990528 3573248 4429824 3798016 4012032
3923D012032K04288j384960L71712J483264q26368J095168j478144M86400k19136
$$ 4012032 4216320 2831360 3203072 4686336 3859968 4955136 3476992 3963392 3744256
3914C744256M24960n89824R28768J72032k07360M00384l06688o43584m6592R216
$$ 3744256 4169216 3579392 4508160 4680192 4472832 4873216 4566528 3922944 3876352 3885568
3904C885568K4064J139712n0176n49888O11328m53120R23136m99712N80096m80256
$$ 3885568 3909632 5049344 4999168 4449280 5060608 4607488 5530624 5030912 5611008 5130752
3894E130752L57888j15200J83808m84864j464832M03968M85888K3040r20064K046976
$$ 5130752 5488640 5373440 5557248 5072384 3607552 4011520 4497408 4520448 3600384 5647360
3884E647360m57728k81600m89984R65120j277440M62336O34368k52928p01440
$$ 5647360 5189632 4908032 4418048 5383168 4105728 4568064 5202432 4949504 4248064
3875D248064j40800J638400j172992O58432m01408J4848R48224j60256n26848
$$ 4248064 4107264 5745664 4572672 5231104 4829696 4844544 5792768 5632512 5105664
3866E105664q55040J79712J330176j359872P72096k0480M07552M41856j121792
$$ 5105664 4250624 4430336 5760512 4400640 5172736 5152256 5559808 6001664 4879872
3857D879872J404928j403904J161728p00416k41664J340928p93600K27840N78560
$$ 4879872 6284800 4880896 6042624 5342208 5100544 6441472 5647872 5875712 6454272
3848F454272P66976K78016j82784P55200p24992J051136O15936L84000j131008
$$ 6454272 7221248 7499264 7316480 8071680 7346688 8397824 9013760 9397760 8266752
3839H266752J45920J85856j190912Q16128M82816P25504l41504L09760j19296
$$ 8266752 8412672 8598528 7407616 8223744 8706560 9432064 9090560 9400320 9281024
3830I281024J589248J351168p27552J443840O7072k414080k88768j501696j438208
$$ 9281024 10870272 12221440 11493888 12937728 13004800 10590720 10301952 8800256 7362048
3821G362048k55488j012736j317376Q89856j19296L97824j2288k50880o68672
$$ 7362048 7106560 6093824 4776448 5666304 5547008 5944832 5932544 5681664 5012992
3812E012992J297920q39680J84320j62816n94432P99744r19552Q36096j119232
$$ 5012992 6310912 5471232 5655552 5492736 4898304 5698048 4778496 5614592 4495360
3803D495360J000448r97376L03104r7280O35392q65792M10112L8912K04800r65120
$$ 4495360 5495808 4498432 4801536 4704256 5339648 4473856 4883968 4922880 5127680 4162560
3793D162560R84064n07904L73248K94400q17664m33152M82304K10944k50880R50784
$$ 4162560 5146624 4638720 5011968 5306368 4488704 4055552 4537856 4748800 4497920 5448704
3783E448704l84000j42848L27680L76832j50016m94592l06688P02464j535488
$$ 5448704 5064704 4921856 5249536 5626368 5476352 4981760 4675072 5377536 3842048
3774C842048J077760K38080J59232m22400K40128j73056K42688Q39168j119232
$$ 3842048 4919808 5157888 5317120 4894720 5134848 4961792 5204480 6043648 4924416
3765D924416o5536p64928N32480R28256j437184J810432n29920J80736J003008
$$ 4924416 4858880 4093952 4626432 5554688 4117504 5927936 5398016 5578752 6581760
3756F581760o92736q46848k2528j80736M4032l63008J016832m63872L01568j45408
$$ 6581760 5889024 5042176 5019648 4838912 4882944 4519936 5536768 5072896 5374464 5229056
3746E229056P71072l63520M41344j030656R47200l2256j85856n96992k53440J344000
$$ 5229056 6000128 5636608 6077952 5047296 5994496 5962240 5776384 5179392 4925952 6269952
3736F269952k44224p40352L29728m76672J58208J40288j038336l35872N72416
$$ 6269952 6025728 5285376 5615104 5138432 5296640 5436928 4398592 4062720 4635136
3727D635136J330688L59424K27840j021440k26816l26656J149440J43360j85856
$$ 4635136 5965824 6325248 6553088 5531648 5304832 4978176 6127616 6270976 6085120
3718F085120n22240o10304P61344J28000k11456P51616L97824j161728j2800o1440
$$ 6085120 5562880 4952576 5713920 5841920 5630464 6382080 6779904 5618176 5605376 5543936
3708E543936j32096J60768J90976O82496j431040J393664n85216J82784j176576
$$ 5543936 5411840 5572608 5763584 6446080 5015040 6408704 5823488 6006272 4829696
3699D829696L00544K72384R31840j78176N41184m93056k86208J97120M12160n30432
$$ 4829696 5130240 5402624 6334464 6156288 6697472 6204416 5918208 6115328 6527488 5997056
3689E997056P70560j081344J039360o60992R93792l60960n58592R37984m76672
$$ 5997056 6767616 5686272 6725632 6064640 7058432 6697472 6138880 7076864 6600192
3680F600192P68512j183232J29024O72256N54496q48896L54304L99872k97984
$$ 6600192 7368704 6185472 6314496 6986752 7541248 6692352 7046656 7446528 7148544
3671G148544k51392O74816q8576p03488N53472k87744m70528K27328K85696N73440
$$ 7148544 6897152 7571968 7483392 6779904 7333376 7045632 6575104 6802432 7088128 7661568
3661G661568k74432P00416Q07424j393152J400832q98048P5264Q704P6288K09920
$$ 7661568 7387136 8087552 8894976 7501824 8902656 8004608 8079872 8088576 8164864 8374784
3651H374784P49568j454592N33504k4576o90688m64384P13216L58400j055744
$$ 8374784 9124352 7669760 8203264 8178688 7488000 7023616 7736832 8095232 7039488
3642G039488R55392N67296M9664k11968Q3968k76480R46688L69152k15040p27040
$$ 7039488 7994880 8562176 8611840 8399872 8483840 8207360 9154048 9523200 9308160 8581120
3632H581120K84160o0928J611264p84384l5328P53152P04000J08544Q24832q84736
$$ 8581120 8865280 8804352 10415616 9631232 9595904 10349056 11053056 11161600 11986432 11101696
3622A1101696J59744K70848Q16128N28384P59808m34688J82784P40352N95456
$$ 11101696 11261440 11532288 12348416 12876800 13636608 13201920 13384704 14125056 14720512
3613A4720512O15424Q704L05152Q94464j135104J005568p6288q25344Q42240L17952
$$ 14720512 15335936 15344640 15649792 16544256 15409152 16414720 16338432 15513088 16355328 16673280
3603A6673280J76640R20064m7616N52960J123840N02784J218560n15584P25504
$$ 16673280 16849920 17769984 17722368 18275328 19399168 19901952 21120512 20604928 21330432
3594B1330432K71360J462272J050112M39808Q98048q68352J785856L0720J292288
$$ 21330432 21601792 23064064 24114176 24553984 25452032 24583680 26369536 26400256 27692544
3585B7692544K35520J350144K408448J194496J022976J908736K70336j269760
$$ 27692544 27928064 29278208 31686656 32881152 33904128 35812864 36083200 34813440
3577C4813440M63360k067456K9184j415680l230720l659264j458176l409408k202112
$$ 34813440 35276800 33209344 33238528 31822848 28592128 24932864 23474688 20065280 17863168
3568A7863168j014272r37984p62880j499136r94304Q30976n46304M50048P34720
$$ 17863168 16848896 15910912 15148032 13648896 12654592 13485568 12939264 13389312 14124032
3559A4124032j528320m096j039872J036288j25440n84704M49024l30752R74336
$$ 14124032 12595712 12591616 11551744 12588032 12462592 11877888 12326912 11996160 12970496
3550A2970496K23232k04800l44576j53600M18816k835968O09280q06400J78176
$$ 12970496 13193728 12988928 12644352 12490752 12909568 10073600 10682880 9876480 10054656
3541A0054656K83648o4512q56576P10656L81440l23072l05664q13568J02912l09248
$$ 10054656 10338304 10273792 9417216 10127872 10509312 10186240 9880576 9067008 9169920 8860672
3531H860672Q16640J183744j119744q00768O00576R82016j306624J444864P02464
$$ 8860672 9677312 10861056 9741312 8940544 9541120 10523136 9216512 10661376 11363840
3522A1363840j419776J37216l43040J059328J00864r56928J289216p65440p23456
$$ 11363840 9944064 10081280 9738240 10797568 10898432 9941504 11230720 10465280 9741824
3513I741824L5840M37760J60256L35360r83040R80480J59232l16928M07552M51584
$$ 9741824 9777664 10215424 10375680 10711040 9728000 10708480 10867712 10550784 10958336 11409920
3503A1409920j040384l00544J795072p14240M52608j031680O92736j674752J404928
$$ 11409920 10369536 10068992 11864064 11149824 11602432 10570752 11263488 9588736 10993664
3494A0993664R5744M98688l14368K16576J2800k54976j118720J662976j208320
$$ 10993664 11089408 11588096 11273728 11490304 11503104 11248128 10129408 11792384 10584064
3485A0584064l21024J230336j02400l76832M67968j448960J235968p08096N32992
$$ 10584064 10263040 11493376 11390976 11014144 11482112 10033152 11269120 10561024 11094016
3476A1094016J33632M77696R57952k69312q76032N52960k199552K203648r53856
$$ 11094016 11227648 11705344 12663296 12393984 11517952 12070912 9871360 12075008 11121152
3467A1121152M38272M82816j99168j6896J606144j970176P18848O19520j139200
$$ 11121152 11559424 12042240 11843072 11826176 13432320 11462144 12180992 12800512 11661312
3458A1661312J065472l04640L5328l4304M9152L72736L44064J63840l81952K69824
$$ 11661312 12726784 12422144 12457472 12423168 12472320 12845056 13189120 13352960 12971008 13240832
3448A3240832Q08960j32608O3488j41312q83712J785344p29088K28864L21536
$$ 13240832 14049792 13917184 13980672 13839360 12955648 14740992 14011904 14240768 14562304
3439A4562304l76832J80224j198592K070528L6864j72032m43392j70496O15936
$$ 14562304 14185472 14365696 13167104 15237632 15274496 15102464 14659072 14488576 15104512
3430A5104512l71200R01120o03136L54816j5872o55360J944064j074688N52448
$$ 15104512 14733312 15634432 15031296 15386112 15370240 14714880 16658944 15584256 16136704
3421A6136704p34208P8336P66464R76896j59232K65216p88992J623552M34176
$$ 16136704 15402496 15480832 16247296 17224192 17064960 17330176 16541184 18164736 18598912
3412A8598912k29376m39296m42368O52800J595904j238016L57888l96288j146880
$$ 18598912 18369536 17930240 17487872 18140672 19736576 18498560 18856448 18460160 17313280
3403A7313280j36704M37760j30048p26016R74848O34880J519616J355776J937408
$$ 17313280 17176576 17614336 17484288 16758272 17733120 18368000 19887616 21243392 23180800
3394B3180800K497536K584576J062400J96608N77536j272832j144320J792000
$$ 23180800 25678336 28262912 29325312 29521920 30099456 28826624 27682304 29474304
3386B9474304J657856O37952J976832J286144o0928R35424K55488N48864L30752
$$ 29474304 31132160 31770112 33746944 35033088 34972160 35907584 36163072 36711936 37042688
3377C7042688M73600Q11008R43616J044992M50048R92256J856000R20576J216000
$$ 37042688 37516288 38327296 39270912 40315904 40765952 41758208 43614208 44534784 45750784
3368D5750784J221120J504768P39840J025024J902592J804800J379840N27360
$$ 45750784 46971904 48476672 49216512 50241536 52144128 53948928 55328768 55856128
3360E5856128J654784L246080J801216J813504K489344L257344K088960L689984
$$ 55856128 57510912 60756992 62558208 64371712 66861056 70118400 72207360 75897344
3352G5897344L055616K266112O239232M342784O029824M759552P888384Q505344
$$ 75897344 78952960 81219072 87458304 91801088 97830912 102590464 110478848 118984192
3344A18984192R180672J0201600J0920448J1145728J1399680J2964864J1757568
$$ 118984192 128164864 138366464 149286912 160432640 171832320 184797184 196554752
3337A96554752J4212608J6423936J8759680K0827648K3139840K7277824L2376320
$$ 196554752 210767360 227191296 245950976 266778624 289918464 317196288 349572608
3330C49572608M1464320N2390400P1116288R5338496J22176512J50730240J59255040
$$ 349572608 391036928 443427328 514543616 609882112 732058624 882788864 1042043904
3323A042043904J34336000N4200832q1126400k00360448k33829888j98109696
$$ 1042043904 1176379904 1230580736 1149454336 949093888 715264000 517154304
3317E17154304j44339456r8675200o8248576m7300096l0740480k2344704j6327680
$$ 517154304 372814848 274139648 205891072 158590976 127850496 105505792 89178112
3310H9178112j2959232j0739200q657408p803904o129664m518912k938880k600960
$$ 89178112 76218880 65479680 56822272 49018368 42888704 38369792 35430912 32829952
3302C2829952k030592k658816j071616j140224k278400l85536j889280q44288
$$ 32829952 30799360 28140544 27068928 25928704 23650304 23264768 21375488 20531200
3294B0531200j102848j014784n24288o49728j62304j701888j268736K37056j465856
$$ 20531200 19428352 18413568 17889280 17239552 17077248 15375360 14106624 14343680 12877824
3285A2877824r16992j178112M58752j076224r27232o26688n72928l74272m37760
$$ 12877824 11960832 10782720 11241472 10165248 9238016 8611328 8038400 7664128 7226368
3276G226368O87104j276928n40160N06368q21248J61792o15936L1232l03104j8432
$$ 7226368 7913472 6636544 6096384 6602752 5781504 5943296 5327360 5358592 5055488 5037056
3266E037056r20064L18976o92736M7104r14944p58784L75296K17600o73792J472000
$$ 5037056 4116992 4435968 3743232 3790336 2875392 2116608 2491904 2709504 2035712 3507712
3256C507712R95328K92352Q61696J75616l73248J35168k03776K4064J787392J219584
$$ 3507712 4503040 4795392 5657088 5832704 5459456 5594624 5390848 5414912 7202304 8421888
3246H421888J115648R72800J047552K41152j057792o07744R5744p04512j075200
$$ 8421888 9537536 10510336 11557888 11799040 10741248 10133504 10229248 9524736 8449536
3237H449536j895424p7824k192384P78240O00064q35072j48480L00032m81280
$$ 8449536 6554112 6476288 4283904 5062144 5662208 4827136 4678656 4978688 4497408
3228D497408J018368p68000O73280N62688k617856J629696J366016j740288N24288
$$ 4497408 5515776 4747776 5421056 5983744 3365888 4995584 6361600 4621312 5145600
3219E145600j001984L88096p87968j95072J105408M07552r06240J112064r26208
$$ 5145600 4143616 4531712 3743744 3548672 4654080 5061632 4155392 5267456 4341248
3210D341248l35872K5088K86720p3728q03840j27488L71712J156096n51424m13696
$$ 4341248 4005376 4030464 4317184 4243456 3439616 3312128 3683840 4839936 4288512 3874816
3200C874816J38752n7344n01760R98400j36704J42848k38080n90848Q19200j550336
$$ 3874816 4013568 3956224 3454464 4452864 4316160 4459008 4220928 3630080 4449280 2898944
3190B898944J830912n15584P1168l63008k74944j16736K25792j86368K40128O78912
$$ 2898944 4729856 4214272 4285440 3922432 3647488 3530752 3756544 3570176 3810304 4489216
3180D489216j46944r33888P58784l35360j58720J234944j580032k36032J39264
$$ 4489216 4342272 3408384 4167168 3831808 3673088 4908032 3328000 3091968 3231232
3171C231232P43936n22752m7616J160192k49344k4064N89824l53792k07360Q89856
$$ 3231232 3975168 3452416 3404800 4564992 4315648 4291584 4881408 4527616 4320256 5210112
3161E210112K23232p23456J55136j306624P69536o95808M54144m33152k68800
$$ 5210112 5433344 4709888 4865024 3558400 4327936 3632128 4086272 3653120 3384320
3152C384320J538048j898496J702400m30080m36224j73568N79072K65216k93888
$$ 3384320 4922368 3023872 4726272 4296192 3859968 3686400 4265472 4530688 4236800
3143D236800n0176M2496K41152l50208O25152K78528q4992J401344j4848r1648
$$ 4236800 4186624 4229120 4470272 4120064 4745216 5023744 4938752 6340096 6325248 6233600
3133F233600J268736L52768M96128J015808j393152Q14592k81600j825792K64192
$$ 6233600 7502336 7855104 8351232 9367040 7973888 8788480 8506880 6681088 6945280
3124F945280j514496J277440m73088l91168K2528j01376N8880j072640K836992
$$ 6945280 5430784 6708224 6235136 5843968 5866496 5765120 5824000 4751360 7588352
3115G588352j206784J491456j541120p5776L12320j10080m89984R69216N60640
$$ 7588352 6381568 7873024 6331904 6256128 6568448 6458368 5968384 6937600 7498240
3106G498240j80224Q77056l46112K06336L72224l75296J59744P18848o21568J248768
$$ 7498240 7318016 8195072 7848960 8055296 8427520 8052224 8211968 8930816 8309248 9558016
3096I558016J383424O7584K75456Q88320J145344n4784J158144P70048J036800
$$ 9558016 10941440 11009024 11284480 12172800 13318144 13263360 14421504 15191552 16228352
3087A6228352j6384J275904M84352j80736J410560q71936J432576O4512m16768
$$ 16228352 16211968 17487872 17972224 17791488 19202048 18330112 19762688 19827200 19410432
3078A9410432L13344P45472J32608J639936J90976K63168J166848k72384j674240
$$ 19410432 19723776 20469248 20601856 22241792 22432768 22695936 23862784 23590400 21916160
3069B1916160K60096j180160l930624p35744l490304k60608n76000m40832j109504
$$ 21916160 22176256 20996096 17065472 16329728 12839424 12578816 12002816 11561984 10452480
3060A0452480j18784j35680j239040J118720k22720L1744K56512m67968r04704
$$ 10452480 10333696 10198016 8958976 10077696 9854976 9886720 10143232 9675264 8770560
3051H770560L20512l85536R68704o76352J53088r42080J736704j408512p23968
$$ 8770560 9091072 8705536 9674240 8997888 9150976 8208896 9945600 8537088 7813120
3042G813120k49344J174528p50080L73760k91328q65792N8368l27680k06848n13024
$$ 7813120 7563776 8738304 7988224 8361984 8070656 7204864 7263232 6935552 6728704 6215680
3032F215680n4272K69312p36256N83680r60512L52768j211392J024000q76544
$$ 6215680 6161408 6430720 5694464 6278144 5317632 5670400 4459008 5483008 4606464
3023D606464R728K80064r09824j08544K21184N45280n14048N94432k76480M31104
$$ 4606464 4616192 4896256 3986432 3877888 4099072 4644352 4130304 4724736 4448256 4879360
3013D879360r09312q704K89792L90656j034752R10336l80928J1264J011712l15392
$$ 4879360 3970048 3961344 4251136 4641792 3607040 4517376 4136448 4147712 5159424 4844032
3003D844032O24128N76000j329152J78176j02912j2288o70208p168o52800J46944
$$ 4844032 5468160 6044160 4715008 4893184 4790272 4777984 4107776 4100608 3447808 3594752
2993C594752J71520q4992J181184n73440L25632K11456o51264q50432P62880k24256
$$ 3594752 3766272 3681280 4862464 4289024 4614656 4826112 4174848 3324416 4087296 3863040
2983C863040r26208J123328Q0384J417728N8880o67136k67264o90688R1136M07040
$$ 3863040 2936832 4060160 4140544 5558272 5617152 4950016 4682752 3992064 4083200 4490240
2973D490240N58592o03648M57728J03424m50048R03168j397760P48544K84672
$$ 4490240 5048832 4445184 4902912 5006336 4556288 5459456 4061696 4810240 5094912
2964E094912N34528Q4992j13664m41344L17952l94752K70848q87808n39136K75968
$$ 5094912 5629440 5714432 5600768 5159424 5477376 5082624 5353472 4465664 3926528 4202496
2954D202496J04960j278976J192448p6288L65568J93024m23936p46496J16224
$$ 4202496 4307456 3028480 4220928 4144640 4510208 4703232 4279296 3532800 3649024
2945C649024O53824j283584J598976j69984K22720O18496p95648J86880k02752
$$ 3649024 4302848 3019264 4618240 4448256 4670976 5289472 4493824 4680704 4477952
2936D477952K91328q24320N73952l71712q73472K33984L02592N57568P168o71232
$$ 4477952 4769280 3944960 4518912 4147200 3273728 3507712 3810304 4367872 4375040 3703808
2926C703808Q68352K73408N06880j244672J412608m41856k43712J61792M4544
$$ 3703808 4572160 4845568 5352448 4107776 5520384 5078528 4834816 4996608 5041152
2917E041152o6560J057280p17824j7920P31648O78400N120o2976P23456J119232
$$ 5041152 4974592 6031872 5314048 5296128 6027776 6706176 6711296 6648320 7371776 8491008
2907H491008P53152K591744L301888L105792N577216o0928l043840M49536J683456
$$ 8491008 9244160 11835904 15137792 18243584 23820800 23759872 20716032 21165568 22849024
2898B2849024q392192o068736j982464j725440p51616Q14592r56416K84672q4480
$$ 22849024 14456832 8388096 6405632 4680192 3928576 4743168 3786752 4071424 3986944
2889C986944k45760r89696P33696M40832k71872q01280Q83200J86368K9696O19008
$$ 3986944 3741184 2751488 3485184 3926016 3654144 2852864 3736064 3922432 3952128 4571136
2879D571136q83200N52448J50528o01600n2736J80736q67840J009664l97824K91328
$$ 4571136 3687936 4240384 4390912 3789312 3736576 3917312 3049472 4059136 3661312 3952640
2869C952640r53344J607168J70496k66752K49344N06368m68480m20352J310208
$$ 3952640 2999296 4606464 4776960 4510208 4759552 5265920 4797440 4377088 5687296
2860E687296k87744o27200j53600J235456j498624P99744q41216Q94976j9968
$$ 5687296 5399552 4772352 4618752 5854208 4355584 5155328 4314112 5209088 5189120
2851E189120K71360o13888m33664M0448J205248l69152P15776l25120r5232M55168
$$ 5189120 5460480 4846592 4412928 4453376 5658624 5289472 6005248 5680128 5584896 6040064
2841F040064J13152M03456k37568p10656L99872J387520k74432J581568o72768
$$ 6040064 6153216 6556672 6319104 5608448 6008320 7395840 7121408 8702976 8030208
2832H030208k9184l7376L0208K00192N41696L65568k92352N12000J69984K79552
$$ 8030208 8001024 7963648 7993856 8194048 8735744 9101312 8808960 9320960 9490944 9770496
2822I770496J763840K8672J670656J670144J4336K82112k235904q34560k573824
$$ 9770496 11534336 11563008 13233664 14903808 14918144 15200256 12964352 12129792 9555968
2813I555968o81984j968640r29280n6320j522176L79392J49504n60640j238016
$$ 9555968 8873984 6905344 5976064 5919744 4397568 4776960 4926464 4365824 3127808
2804C127808J382400n11488M04992p64928M84352k7136N29920j00864O30784j004544
$$ 3127808 4510208 3998720 4403712 3638784 4123136 4096000 4625920 4525056 5155840 4151296
2794D151296J62816j59744o21568R29792l00032L15904r19040K22720K64704P90528
$$ 4151296 4314112 4154368 3532800 4462592 4162560 4478464 3559424 3782144 4046848 4837376
2784D837376j095680p53152P11680O06208P40864l41504j411072P64416o12864
$$ 4837376 3741696 2988544 3700224 4306432 5047296 4705792 3294720 4059136 3446272
2775C446272K46784P60832m27008l23584n6320J593856k53952j669632Q50944
$$ 3446272 3693056 4453888 4026880 3703296 3646976 5240832 4986880 3317248 4168192
2766D168192j61792q55552K7648N56544k17088n2736N90848n85728J9968M52096
$$ 4168192 4006400 3150848 3178496 3735040 3517952 3465216 4056064 3470336 3490304 3942400
2756C942400n07392N53472n65760M30080r36960R33376j134592P03488l28704
$$ 3942400 3435008 3988480 3422720 3852800 2915840 3849216 2714624 3418112 3089408
2747C089408P43936J35168o2464m35712P68512k70848R5744o97344Q81152J212928
$$ 3089408 3833344 3968512 3906048 3470336 4238848 3968000 4063744 3366400 4247552 5460480
2737E460480j066496r43616J307136N23264j265664M53632L35360p74144n08416
$$ 5460480 4393984 3450368 4757504 5280768 4015104 4468736 4804096 4029952 3521536
2728C521536M60800k8160j57184l91168k65216L97312Q7552K84160O07232p29088
$$ 3521536 3982336 3954176 3796992 3405824 3140608 3537920 3625472 3909632 4516864 3787776
2718C787776J56672K06848j149952n632R39520o56384J304576r8304q04352R99424
$$ 3787776 3944448 4151296 3001344 2995712 3935232 3278848 4583424 4485120 3680768 4680192
2708D680192j82272K29376l79392K41152M74112p43936J170432j252864P74656
$$ 4680192 4497920 4727296 4347904 4589056 5063168 4319232 5489664 4236800 5011456
2699E011456J184256q02816O08256j656320L72224J359360J90976J69984l7888
$$ 5011456 6195712 5392896 6001152 4344832 4717056 6076416 6267392 6437376 6399488
2690F399488R45152J108480N70368J511936N773312N402112J0044928O328320
$$ 6399488 7344640 8453120 9023488 10535424 16308736 21710848 31755776 38084096
2682C8084096j4615040A0435584l176448j296384k131968K92864m71552n6320
$$ 38084096 23469056 10435584 7259136 5962752 3830784 4123648 3652096 3595776
2674C595776j31072K18624j036288P75680M19840o96320P29600j361408Q87296
$$ 3595776 3464704 3683328 2647040 3422720 3842560 3146240 3875840 2514432 3401728
2665C401728o05696J114624n58080j10592j54112K5088m11136k91328Q18176J258496
$$ 3401728 2796032 3910656 3352576 3241984 3087872 3112960 2701824 2410496 3228672 4487168
2655D487168r52832K68800k36544j16736n37600P6800R81504j97632r64096J211904
$$ 4487168 3534336 3803136 3566592 3449856 2912256 2989056 3970560 3772928 2808832 4020736
2645D020736m43392J444352m41856j69472j261056J59232m18816J290752j174016
$$ 4020736 3577344 5021696 4579840 4410368 3149312 3308544 2889728 4180480 3006464
2636C006464J223680n10976j823232J285632O55872k22720p5776N69856j13664
$$ 3006464 4230144 3719168 1895936 3181568 3837440 3614720 3538944 4108800 3995136
2627C995136k70336M1472L63520o25152j39264J526784q22784j382912K505216
$$ 3995136 3724800 3766272 4129792 3504640 3365376 4892160 4069376 2686464 5191680
2618E191680p23968O63040j50528O42560o33856J819136j352704P5776J025024
$$ 5191680 4467712 5130752 4980224 5622784 4988928 6808064 5455360 5531136 6556160
2609F556160m37760P40352L24096L87584k82112K244096j028608P55200J314304
$$ 6556160 6118400 6858752 7182848 7570432 7288320 9532416 8503808 9259008 10573312
2600A0573312K6624J020928K028032M196352P436800O808064J5904256L406848
$$ 10573312 10599936 11620864 13648896 17845248 25282048 32090112 47994368 51401216
2592E1401216j7506816j4259200o059520j666048J085952K821120L592704L723264
$$ 51401216 33894400 19635200 13575680 11909632 12995584 15816704 19409408 23132672
2584B3132672J0211328l470336j1350528n248512j209856J809920L226624O345728
$$ 23132672 33344000 29873664 18523136 13274624 12064768 13874688 17101312 23447040
2576B3447040O581248J4045184o323712j6339456p175168m886528J449984K322944
$$ 23447040 30028288 44073472 37749760 21410304 14235136 9348608 10798592 13121536
2568A3121536L708928L052544R521664l376128j0581504o595584j456128r55904
$$ 13121536 16830464 19883008 29404672 26028544 15447040 8851456 7395328 6439424
2560F439424J247232Q63744J742848N019136k597376n212672k960896j093632
$$ 6439424 7686656 8550400 10293248 15312384 12715008 7502336 4541440 3447808
2552C447808q9088J9968j669632O02624N79072m94080n46304O71744o2976Q13056
$$ 3447808 3358720 3378688 1709056 2311680 2890752 2396672 1850368 2522112 2459136 3272192
2542C272192n27872J61280j025536P13216Q33024N17632Q5504n14560M21888q4992
$$ 3272192 2744320 2905600 1880064 2593280 3426304 3943936 4029440 3514880 3936768 3851776
2532C851776k23744k20672J03936J331200j143808L584Q59648J88928j412096
$$ 3851776 3628032 3407360 3511296 4842496 3698688 3702272 4561920 4750848 3338752
2523C338752L95264k78016j117184l55328M51072j149440O92224m56192j63840
$$ 3338752 3734016 3456000 2338816 1983488 2434560 1285120 1977344 1521152 1357312
2514A357312N35552M608K05312n64224p42912J125376O1440K38080o74816R88672
$$ 1357312 1892864 1897472 2102784 1538560 795648 1921024 1982464 2220544 1545728 2534400
2504B534400q39168k75968L33312L73760j86368n74464P9872L46624K8672L2768
$$ 2534400 1695232 1419264 1752576 2126336 1939968 1365504 1445376 1792000 1820672 1853440
2494A853440m78208Q58112J00352H92928J654784M8640p10656E74464J180160
$$ 1853440 1375232 2233344 2333696 892928 2547712 2596352 1885696 574464 1754624
2485A754624n7344m67456l61472J221120H23296L70176Q80640m21888p11680M55168
$$ 1754624 1697280 1229824 868352 2089472 823296 1193472 2074112 1652224 940544 1395712
2475A395712n5808k44736J421312k99008D59776K70848P50080M67456J34144q34560
$$ 1395712 1339904 1095168 2516480 2217472 459776 730624 1480704 1948160 2082304 1247744
2465A247744Q57088l80416J219584A366016M98176L27168m79744j76128J046528
$$ 1247744 2104832 1724416 2944000 1366016 1864192 2191360 1711616 1535488 2582016
2456B582016j204224L5840J152512l52768o54336L9424J249280A069568Q51968
$$ 2582016 1377792 1413632 2566144 2213376 1559040 1598464 2847744 1069568 1921536
2447A921536L52768A057792Q31488j44896J33632m03968J250816l64032j006592
$$ 1921536 2274304 1057792 1889280 1744384 1878016 1474048 2724864 2360832 1354240
2438A354240Q49408l24608L41504r30816M04992H21248j39776P16288K97472L68128
$$ 1354240 2203648 1879040 2220544 1289728 1694720 821248 681472 1397760 1695232 2063360
2428B063360k65216p06560R44640m71040k77504N23776L2768p68000L39456O07744
$$ 2063360 1798144 1091584 2036224 1565184 1287680 1811456 1844224 1076224 1415680 2023424
2418B023424l16928k11456R75360m48512r10336R58976l79392K95936M46976p05536
$$ 2023424 1706496 1495040 2470400 2021888 1111552 2070528 1691136 1987072 2434048 1728512
2408A728512L85536m38272O40512j33120P8336M99712j77152m87936L17440P19872
$$ 1728512 2114048 1675776 2316288 2183168 2261504 2761216 2584064 2096128 2413568 3133440
2398C133440k13504A396736M21888O46144m6080j96096n17632K94912m59776R04704
$$ 3133440 2919936 1396736 1818624 2464768 2418688 2222592 1704960 1999872 1540096 2444800
2388B444800Q36096j293312n83680Q17664O24640l8912m33152M99200q98048K82624
$$ 2444800 3280896 1987584 1403904 2221568 2846208 2807296 2374144 2873344 1975296 2257920
2378B257920l47648L41504K10944n50400l23584J090048r3696m33152J85344P29600
$$ 2257920 1910272 2251776 2462720 1912320 1588736 2678784 2585088 2151936 2337280 3066880
2368C066880M8640o92224N8880M76160j262080J204224k10944n24800L21024P72608
$$ 3066880 3115520 2423296 2482176 2958336 1696256 2900480 2689536 2164736 2485760 3258368
2358C258368j78688J38240n14048J303552j547264Q60160m14208N10976M9152
$$ 3258368 3079680 3217920 2703872 4007424 2460160 3320320 2906112 3417088 3466240
2349C466240O92736r86624J187840m99200M08576j014784P89504q3968o02112
$$ 3466240 4158976 3172352 4360192 3860992 4269568 3254784 4044288 3960320 3358208
2340C358208M04992J251840l41504j032704j26976n92896J180160p92064J332224
$$ 3358208 3763200 5015040 4673536 3640832 3513856 2920960 4101120 3309056 4641280
2331D641280n30944J016832j351680J5360m84352J074176q3968j31584M68480
$$ 4641280 4110336 5127168 3775488 3790848 3306496 4380672 4296704 4165120 4633600
2322D633600l18976p61344j03424Q54016l51232N57568K61632L61472l32288k7136
$$ 4633600 4314624 3553280 3449856 4303872 3952640 4510208 4771840 5133312 4801024 4773888
2312D773888L90656m27008m30080J097216p51616j52064j313280p6288K20672
$$ 4773888 5164544 4737536 4307456 5404672 4653056 4500992 3187712 3111424 3332096
2303C332096n7344J160704j70496j652736P41888k25792L01056M22912r90720
$$ 3332096 3274752 4435456 4264960 2612224 3354112 3128320 3429376 3852288 2861568
2294B861568N33504O16448j436672K13504L75808R2160o15424J47968l10784J710080
$$ 2861568 3395072 4011520 2574848 2788352 3164160 3256320 2640896 2788864 2478080 4188160
2284D188160j007616j48992J000960j94048J80224J75104l53792q65792k19648
$$ 4188160 3180544 3031552 4032512 3838464 4018688 4193792 3840000 2974208 2754560
2275B754560J356800r75360M80256j007104J487360j40800j421312N09440l76832
$$ 2754560 4111360 3136000 3616256 2609152 4096512 3955712 2534400 3043840 2667008
2266B667008L55328M8128n39648Q64256j3312K28352j040384Q68352j19296N63712
$$ 2667008 3022336 3070464 2530816 3395072 3381760 3610112 2569728 3438080 3318784 3882496
2256C882496j526272O69184K18624j66912K4064M8128L06176o36416P42912j058304
$$ 3882496 2356224 3025408 3244032 3077120 3101184 3149312 3455488 2819072 3561984 2503680
2246B503680K396672j855488N44768j405952J641984q80128N29408M89984k70848
$$ 2503680 4900352 3044864 3589632 2183680 3825664 2945536 3474944 3964928 3694080
2237C694080m19840P88480j292288L94752R92256o2976K34496j65376m83840r9328
$$ 3694080 3274240 4062720 2770432 3165184 4157440 4094464 4328960 4163584 3679744 3580416
2227C580416o38976K40640l81440P8848J243136m92544k85696o51264O59456N80608
$$ 3580416 2941440 3182080 2800640 2879488 4122624 3630080 3344384 2693120 3352576 3933184
2217C933184n09952o17472M04480N09440J140736p27040k008064K639872r03680
$$ 3933184 3423232 2805760 3210240 3719680 4860416 4133376 2125312 4765184 3861504
2208C861504P71072j159680Q28416j47456O6560o42048L57376N9904J54112k27328
$$ 3861504 4632576 3472896 4301312 4153856 4220416 3578368 3935744 3995648 4149760 3922432
2198C922432N88800m98176J18272o2976k60608o62016K26304J81760n93408J334272
$$ 3922432 4511232 4013056 4131328 4068352 3807744 3145728 3372032 3553792 2960384 4294656
2188D294656M0448k94400j047040L62496J79712J49504k2528K02752K3552Q89856
$$ 4294656 4335104 4040704 2993664 3356160 3535872 3685376 3662848 3865600 3889152 4779008
2178D779008K26816n96992r23648J10592J410048p52640J80224j01376p4240o1440
$$ 4779008 5005824 4408832 3485184 3595776 5005824 4253184 4433408 4332032 4257792 4196352
2168D196352j03936o55872N09440K08896j058816Q4992J171456l88608n39648
$$ 4196352 4092416 3436544 3945984 4154880 3096064 3181056 4352512 3963904 3424256
2159C424256K106880j206272O13888k56000P73632p58784p13728k27328R18528
$$ 3424256 5531136 4324864 4938752 4682752 5456384 4697600 3983872 3756544 4675072
2150D675072n35040R77920q30464L9424R91232p68000J370112j084416K06848
$$ 4675072 4140032 5117952 4287488 4326912 5318144 4550144 5920256 4835840 5042688
2141E042688n20704K57536J21344K22208J350656j089024J38240l70688N28896
$$ 5042688 4521984 4779520 4900864 5123072 6473728 5384704 5522944 5152256 5681152
2132E681152p4240J024Q704P93600n94944Q22784o59968L0208N03808r41568J510400
$$ 5681152 5606912 5607936 5616640 6410240 5815296 6638080 5978112 6008320 6512128 5570560 7080960
2121G080960l61984L63520J714688k227712J428480o74304Q42240l40992p43424
$$ 7080960 6718976 7082496 8797184 6569472 7997952 7323648 8165888 7824896 7081472
2112G081472J171968p69024p30624J165312n17632q62208J369088p38304Q60160
$$ 7081472 8253440 7484416 6753792 7919104 7401472 6539264 7908352 7170048 8030208
2103H030208j207808Q61184M4544l82976O45120M85376k21184q70912l66592R1648
$$ 8030208 6822400 7683584 7728128 7345152 7990272 8475648 8254464 7383552 7016960 7108608
2093G108608P18848m99200j0752Q29440k42176j000448Q36096o37440J29536N53472
$$ 7108608 7827456 7328256 7317504 8146944 7904768 6904320 7740416 7102976 7232512 7785984
2083G785984r30304J229312j90464k35520J16224k2016J11104o44608o54336Q10496
$$ 7785984 6855680 8084992 7894528 7659008 7775232 7753216 7864320 7219712 6565376 7375872
2073G375872k71360K98496L67616j052160K4064o00064J572864q00256K46272
$$ 7375872 7104512 7403008 7770624 6718464 6742528 6142464 7715328 6915072 7161344
2064G161344j289216J968640j341952J355264k12480l67616j184256K43200Q33024
$$ 7161344 5872128 7840768 6498816 7854080 7641600 7273984 6089728 6332928 7165952
2055G165952l13856L80416L69152r75872k25280n10464Q5504o21568m33664J415168
$$ 7165952 6852096 7232512 7601664 6625792 6400512 5890048 5975552 5353984 4920320 6335488
2045F335488o26688M76160p65952m24960J669632j894400N76512Q44288j74592
$$ 6335488 5708800 6184960 5419008 4994048 6663680 4769280 5345792 6190080 6015488
2036F015488j360896J970688q63232K79040o38464j59232J008640M49024J39776
$$ 6015488 4654592 6625280 5762048 6041088 5402624 5243392 6252032 6701056 6840832
2027F840832j313792J753600j72032l31264N11488p64416P62880p48032k35520
$$ 6840832 5527040 7280640 7108608 6777344 7288832 6524416 7287296 6539264 6303744
2018F303744J077760l32800l15904m1984O31296K38080o44608Q64256o44096M77184
$$ 6303744 7381504 7048704 6732800 6690816 7322112 7560192 6915584 7779840 7135744 7612928
2008G612928p88480J083392o37952N9392M10624q88832N14560L2256M32640P8848
$$ 7612928 6824448 7907840 7269888 7329280 7739904 6851072 7365632 7397888 7830528 7909376
1998G909376j261568J436672o53312N37600L01568j14176K29888J00352j88928
$$ 7909376 6647808 8084480 7431168 7968768 8270336 8156160 8386048 8486400 8297472
1989H297472N03296N06880k0992l58400n05856P08096n61152K628608j037824
$$ 8297472 8800768 9307648 9286656 8928256 8422400 9130496 8569344 11197952 10160128
1980A0160128m02432r54880J124352m58240J85856P66976o75840m46976N90336
$$ 10160128 9757696 8802816 9927168 9468928 9654784 10421760 9745920 9298944 9889280
1971I889280k5600O90176m09088j64352j74080R52832j908736L47136J409024
$$ 9889280 9863680 10553856 10144768 9980416 9806336 10759168 8850432 9197568 10606592
1962A0606592j230336R43104j437184N68832R6768M03456M5056q44800L14368
$$ 10606592 9376256 10319360 8882176 9451008 9547776 9951232 9996288 9151488 9465856
1953I465856K8672j264128K118656M5568J71008q01792J382400r48224j0240j75616
$$ 9465856 9494528 8230400 10349056 10394624 10565632 9763840 11146240 10198016 10187776 10012160
1943A0012160Q4992q17664p8336J511936p7312m07040M17792p4240j172992R03680
$$ 10012160 10097152 9279488 9201152 10713088 10635776 10228736 10646528 10572288 9399296 10302976
1933A0302976j37216j51552K90304M54144M73600j217536n62688J649664q25344
$$ 10302976 10165760 10014208 10304512 10758656 11232256 10014720 9452032 11101696 10276352
1924A0276352P58272O80448J379328K491392L791872Q100352K497536j0901504
$$ 10276352 11034624 11715072 13094400 15585792 19377664 27478016 29975552 19074048
1916A9074048o423040k451968j681920m0448j316352O35392L91680J60768k08896
$$ 19074048 12651008 10199040 8517120 8476672 7160320 7795712 8187392 8348160 8139264
1907H139264p92576J18272q2432k41664Q42752j839616k26816J003520r9840j96096
$$ 8139264 7346688 7464960 7382528 7140864 7983616 6144000 5917184 6920704 6820864 6624768
1897F624768L25632p79264Q02816J73568o49728J157120k086400J822208k80576
$$ 6624768 6950400 6171136 6973952 7147520 6497792 7654912 5568512 7390720 7110144
1888G110144n67296Q84224p54688n21216j05984J76640M96128m31104L85024p96160
$$ 7110144 6542848 7427072 6672384 6151168 6045184 6221824 6717952 6286848 6671872 5875712
1878E875712K55488O02624L14880K79552q25344R27744r79968l48672K26304K82624
$$ 5875712 6131200 6733824 7048704 7328256 6502912 7430656 6450688 6102016 6328320 6610944
1868F610944n53984J162752P04512r72288l74272l12320M93568O75328O7584l17952
$$ 6610944 6056960 7219712 7924224 6951936 6577664 6265344 6758912 7434240 7501824 7183872
1858G183872P74656j250816N95456O9632o65600J400320n56032K45248o43584
$$ 7183872 7958528 6707712 7303168 7372800 6707200 8107520 7551488 7796736 7153152
1849G153152J582592j461760l26144J241088k41152l92704J116160J41312P54688
$$ 7153152 8735744 7273984 6947840 8188928 7947776 7555072 8671232 8812544 9567232
1840I567232j295872k05824N27360Q66304J38752n52448j03936n91360P58784
$$ 9567232 8271360 8065536 8592896 9459200 9597952 9045504 8941568 8350208 9108992
1831I108992J92512K25792n21216L78880j074176m49024M3520K97984j11104J37216
$$ 9108992 9301504 9527296 9006080 9384960 8310784 7861760 7905280 8203264 8092160 8229376
1821H229376k49856J64864l88096k58048m38272K43200R32352O26688j835520
$$ 8229376 7979520 8144384 7756288 7498240 7059968 7303168 8235520 8862208 7026688
1812G026688M44928K69312J109504q39168L07712M17280l80928l56864R10336
$$ 7026688 7471616 7740928 8850432 8011264 8318976 8736256 8355328 7998464 8908800
1803H908800q69376R05216j81248L91168K71360l38432O69184p72096K51904J409536
$$ 8908800 8039424 8944640 8763392 9154560 9425920 9087488 9756672 8984576 9236480 10646016
1793A0646016j856000L84512M09600P5776l56864Q71424O46656l95264k65216
$$ 10646016 8790016 9174528 9584128 9659904 9303040 10174464 10821120 10425856 10160640
1784A0160640Q60160l03616q7552k00704P15776M70528O8608p5264M11648O49216
$$ 10160640 11020800 10717184 10629632 10428928 11144704 11615232 11683840 11608576 12020224 12669440
1774A2669440j270272j66400J583104n30432m62848K64704M88960l89632J010176
$$ 12669440 11399168 11232768 12815872 12285440 11822592 12087296 12576256 12186624 13196800
1765A3196800L32800j018880R90720o21568K0992R26208n77536o62016k6624J533952
$$ 13196800 13529600 12510720 13501440 12879872 12900864 13827072 13249536 12587520 12560896 14094848
1755A4094848k56000j227264p1168O43072o38464P680l6352o21568L98848r02656
$$ 14094848 13838848 12611584 12540416 13183488 12545024 12552704 12516352 11894784 12293632 11390976
1745A1390976K64704R40544j115648M73088q16640R13920o41024O84544o63040
$$ 11390976 11655680 12596224 11480576 11953664 11137024 12050944 11409920 12094464 11431424
1736A1431424O56896m66944J496576j383424j84832N99040o52288j64352K64704
$$ 11431424 12088320 11621376 13117952 11734528 11549696 12148736 11496448 11332096 11596800
1727A1596800j82784O2464m18304K98496n2224K31424m88448m39296m06528l60448
$$ 11596800 11414016 11476480 11058176 11356672 11304448 11535872 11047424 10608128 10201600 9841152
1717I841152N96992n0176o24640o74304J634304k124288J192960R53856k438656
$$ 9841152 10438144 10387968 9763328 9089024 10723328 8599040 9792000 10745856 8307200
1708H307200O37952O12352m8128j246208K381824j473024L02080j187328J007616
$$ 8307200 8945152 9557504 9509376 8263168 10644992 9171968 9474048 8286720 9294336
1699I294336l13344K72384o52800q8064P17312K21184l08736j826816J565696
$$ 9294336 8980992 9253376 8600576 8512512 9229824 9451008 9142272 7315456 8881152
1690H881152j156096J213440r28768l99872Q96512l82464N58592n00224M66944
$$ 8881152 7725056 8938496 8009728 7609856 8506368 8123904 8682496 8182272 8649216
1681H649216o30272Q62720l53792q99584J508352j177088n120Q85248l75808m48000
$$ 8649216 8018944 8881664 8527872 7628288 9136640 7959552 7954432 8839680 8463872 8015872
1671H015872R07264j062912K24256J010176k83648N62176m82816P56224r42080
$$ 8015872 8923136 7860224 8084480 9094656 8811008 9373184 8890368 9646592 8704512
1662H704512J167360k05312Q22784J52576k87232k57024R6256j24416m65920J413632
$$ 8704512 9871872 9666560 10489344 10641920 10354688 10097664 10193920 10069504 9603584 11017216
1652A1017216l25120P21920l5328P68000o10304P12192J024512p34208L5840L34848
$$ 11017216 10692096 11414016 11378688 12146688 11536384 12248576 13273088 12538880 12574720 12909568
1642A2909568k048j68448J855488p52640P91552n15072J069568J080832j082368
$$ 12909568 12907520 12739072 14594560 13841920 14633472 14118400 15187968 16268800 15186432
1633A5186432J653248k88256j8944O14912N45792R48224j74592l2768O65600P42400
$$ 15186432 16839680 16551424 16532480 17147392 17693184 18641408 18466816 18434048 19099648 19842048
1623A9842048J03936O6560O53312Q29952l72224J058816J715200N69344P23968
$$ 19842048 19945984 20012544 20665856 21495808 21123584 22182400 23897600 24466944 25190912
1614B5190912J644544k00704K227200P56224N87776J723392J250816K461696R07776
$$ 25190912 26835456 26634752 28861952 29618176 30205952 31929344 33180160 35641856 36549632
1605C6549632J366016N72416J426432P12192O82496J116160J069568J11104J296384
$$ 36549632 37915648 38488064 39914496 40626688 41309184 42425344 43494912 43606016 44902400
1596D4902400J038848k12480J344000J695232J984000K022400J511424K189312
$$ 44902400 45941248 45728768 47072768 48768000 50752000 52774400 54285824 56475136
1588E6475136K554368K173952L626496K324992L763712M646912M897280O684160
$$ 56475136 59029504 61203456 64829952 67154944 70918656 75565568 80462848 87147008
1580H7147008P174144R518592P242240Q204800K634752j668096q786944j1236352
$$ 87147008 94321152 103839744 111081984 119286784 121921536 120253440 111466496 100230144
1572A00230144j2959232j1974656j3966848j2104192r958400n629952n882880
$$ 100230144 87270912 75296256 61329408 49225216 39266816 33636864 27753984
1565B7753984m211712k549760k366464j977344j852928l94752m19328o84544k478592
$$ 27753984 23542272 20992512 18626048 16648704 14795776 14401024 13981696 13297152 10818560
1556A0818560J10592k92864q704L62496j529344P23456L3280j109504L8912p7824
$$ 10818560 10929152 10636288 10627584 10990080 9460736 10184192 10217472 9107968 9146880 9069056
1546I069056j453568J458688j688576P48032j21344K27328j499136M43392m9664
$$ 9069056 7615488 9074176 7385600 8133632 8012288 8239616 6740480 7183872 7134208
1537G134208k0992k29888M59776j432064M35200n28384O9632q22272N43744j050624
$$ 7134208 7113216 6883328 7343104 5911040 6346240 5817856 5887488 5065216 5608960 4558336
1527D558336J742848j083392K66240k70848k65216P38304q94976l98336R3184
$$ 4558336 6301184 5217792 5484032 5213184 4947968 5686272 4791296 4392960 4486144
1518D486144o144l34848O56384K91840o62528m61824L584k14528K63168N72928
$$ 4486144 4480000 4145152 4801536 5093376 4430848 3969024 3972608 3758080 4021248 4594176
1508D594176l20512q2944k3040L77856m76160q46848J042432m35712O75840J07008
$$ 4594176 4273664 4190720 4167680 4545536 4069376 3222528 4264960 3829248 4505088 4612096
1498D612096L76320p97696L87584p30624j08032P51616k57024m95104r7792O99904
$$ 4612096 4988416 4190720 4578304 3847680 3739648 4491264 4234240 3739136 3641344 4341248
1488D341248p62368L27168N83680k28864o5024j054208J359872q50944j0240n57056
$$ 4341248 3578880 3906048 4489728 4260864 4195840 3141632 4501504 3650560 3640320 3083264
1478C083264m9152l94752J445376q80128J093120j292288Q94976j71008R6256
$$ 3083264 3034112 2639360 4084736 3204608 4297728 3005440 3900416 3729408 3825664
1469C825664L54304M41344j060352J329664j061376K21696J85344p70560L02592
$$ 3825664 4179968 4621312 3560960 4890624 3829248 4050944 4236288 3465728 3768320
1460C768320M44416M096j0752M98176N19680j166336J027072n66272J19296M96128
$$ 3768320 4212736 4216832 4206080 4704256 5223936 4057600 5084672 4518400 4637696 5133824
1450E133824l78368o70720J613824j157632J714688m50560L40992L1744j38240
$$ 5133824 4755456 4084736 5698560 4540928 6255616 5805056 6146048 6177792 6039552
1441F039552k67264k11456N98016M71552M62848m42368J183232q38144k26816
$$ 6039552 5772288 5560832 6158848 6630400 7093248 6650880 7834112 6995968 6769152
1432F769152J874944m01408J41824l6352R75872L30240P46496J123840k9696J61280
$$ 6769152 8644096 8242688 8384512 8348160 9324032 9654272 10400768 11524608 11494912 11656192
1422A1656192k03264j256448L17952j118208j27488R39520r83040k18624k97984
$$ 11656192 11452928 10196480 10514432 9396224 9268736 10208256 9225216 9006592 8708608
1413H708608N26848N32480N1200j410560O49728N94944q4480j282048J0752l13856
$$ 8708608 9235456 9767936 9819136 8408576 9058304 9653248 9568768 8286720 8297472 7983616
1403G983616N95968L71712n37088O05184p51616J392128j245184M65408R32352
$$ 7983616 8579584 8951296 8414208 9019392 8267776 9659904 8414720 8880128 9812480
1394I812480j5872K32448j105920J284608R98912J580032N18656O07744j71520
$$ 9812480 9796608 10029056 8923136 10207744 11206656 12786688 13305344 13913088 13741568
1385A3741568l39968P20384q21248L74272k028032o67136j027072j076224k51904
$$ 13741568 13401600 14121984 13300736 13675008 11646976 10979840 9952768 8876544 8624640
1376H624640p98208L33312j15712j390592p59808J573376p43424j5360M4544L1232
$$ 8624640 7826432 8159744 8044032 6653440 5893632 7467008 6723584 6708224 6752768 6784000
1366F784000R14944l47136j116672M97664Q14592Q02816l27168P92576Q23808
$$ 6784000 7698944 7351808 6235136 6732800 7547392 8350208 8023040 8815616 9639424
1357I639424j021952Q01792m49536k09920J08032L05152q49920q5504j146368
$$ 9639424 8617472 9419264 8969728 8759808 8867840 9172992 8323072 8237568 7091200
1348G091200l23072j59232J77152k48320m12160o55872r99936J832448n20192
$$ 7091200 6768128 6608896 6786048 6537728 6125568 5469696 4469760 6302208 5782016
1339E782016j183232P79776k15040o02112j50528J795584k220032j12640R12384
$$ 5782016 4598784 5378560 5163520 4561408 4410880 6206464 3986432 3873792 4786176
1330D786176j346560K70848k4576R08288n39136l18976p3216o98880Q51456j117696
$$ 4786176 3439616 3710464 3685888 4594176 4055040 3736064 3662848 2963968 3815424 2697728
1320B697728J000960j702912J141248o16448J99168k75968o6560r97888j34144
$$ 2697728 3698688 1995776 3137024 2520576 2719744 2443776 2377216 1379328 1245184
1311A245184M4032K05824O24128l79392L64032l40480R2672M70016j10592o58432
$$ 1245184 1289216 1495040 2119168 1739776 2103808 1763328 1856000 2326016 2215424 1556992
1301A556992P52640n87776j58720R31328k10432J00864L14880q93440l15904m66432
$$ 1556992 2309632 1721856 1563136 2494464 2284032 2384896 2699776 1806336 1490432 1024000
1291A024000J028608E99552Q48896l57376K45248M77184K21184o44096H2944N78560
$$ 1024000 2052608 599552 1448448 1091072 1336320 1813504 2034688 1390592 82944 661504
1281F61504L98336C84000O24128Q51968l86560n21216m35200c65056H31488K85184
$$ 661504 1059840 384000 1008128 1860096 1473536 952320 517120 -365056 831488 1116672
1271A116672J7408k9184j58208L96288M6592N26848F20032J750016o93760J24416
$$ 1116672 1134080 1104896 946688 1342976 1389568 1916416 620032 2370048 1676288 1800704
1261A800704p81824j6896N63200j95584l49696k79552L03616L4816L44064m8640
$$ 1800704 1018880 1001984 1565184 1369600 1019904 740352 1043968 1078784 1422848 1374208
1251A374208E1712J154048m70528a88416B095104F77376J34144N34528B91328
$$ 1374208 51712 1205760 735232 -188416 2095104 677376 811520 1346048 291328
1241I62560J34144j95584J65376J02912m68992M34688j2288n09440A80736K21696
$$ 962560 1096704 901120 1066496 1169408 700416 1135104 1122816 613376 180736 402432
1231D02432R15456M12672p52128k48320j33120K11456l99360J266688q33024C98848
$$ 402432 1317888 1730560 978432 730112 596992 808448 409088 1675776 842752 398848
1220A299968d3520A070080O04672n84704j37728j28000C90144J181696p57248
$$ 1299968 -43520 1070080 1674752 1090048 952320 824320 390144 1571840 814592
1211H14592k048D5568J777152l61472m59264M98176n25312M17280j00352o14912
$$ 814592 812544 45568 1822720 1461248 1001984 1500160 974848 1392128 1291776 676864
1201F76864J086976l33824N632k09408N49376O10816L45088j290752M51584j86880
$$ 676864 1763840 1430016 1435648 1226240 1775616 2386432 2731520 1440768 1892352 1705472
1191A705472o71232J88416K46784J01888a22880A47968N74976P84896E29920J043968
$$ 1705472 1034240 1222656 1469440 1571328 -122880 147968 722944 1507840 529920 1573888
1181A573888F07744L22048j54112N1200f12352G93600j31584j99680K22720j48992
$$ 1573888 607744 929792 775680 826880 -612352 793600 662016 462336 685056 536064
1171E36064O44096l36384M49536L03616E00736A00864J099264l24608o6048B47296
$$ 536064 1180160 843776 1293312 1596928 500736 100864 1200128 875520 809472 247296
1160A694208k73920a14176I28768b22208D85376N8368J90976N92896j54624j53088
$$ 1694208 1420288 -114176 928768 -222208 485376 543744 734720 1327616 1172992 1019904
1150A019904C28192O36928R5232B64704J26976J44896Q42240E34016r216O0416
$$ 1019904 328192 965120 1060352 264704 391680 536576 1378816 534016 524800 585216
1140E85216m5056A82784K88256O81984o6048l27680Q16640B27840Q57600l13856
$$ 585216 540160 182784 471040 1153024 1086976 759296 1575936 227840 1085440 771584
1130G71584l79904Q2432R74848c6864A443328n94944J2800k71872O59968c15904
$$ 771584 391680 474112 1448960 -36864 1443328 848384 861184 589312 1249280 -315904
1119I56928A72544R4720J256960m37248K71872k48832M9152j54624l74784P15776
$$ 956928 172544 267264 1524224 1086976 1358848 1110016 1159168 1004544 629760 1345536
1109A345536l45600k98496M08576m95616M91008c4304A592320M608m06016P94112
$$ 1345536 999936 701440 1110016 614400 1105408 -34304 1592320 1596928 1190912 1985024
1099A985024n36576C34336J160192E7856J128960E40672O17472K69312o21568
$$ 1985024 1448448 334336 1494528 57856 1186816 540672 1158144 1427456 805888
1090H05888J312768j034240I4208R04192P69536c87584H28928k05312J537536
$$ 805888 2118656 1084416 94208 998400 1767936 -387584 828928 623616 2161152
1081B161152A048576M00384K61632o81984M91008l43040K53440D57728J388544
$$ 2161152 1048576 1448960 1710592 1028608 1519616 1176576 1430016 457728 1846272
1072A846272M3008o00576P36256r01632o144J30560E24288J028608n13536O07232
$$ 1846272 1889280 1288704 2024960 1123328 1117184 1247744 524288 1552896 1039360 1646592
1062A646592j80224j86880q2944I1648N08928J245184A79200J233920m11136k68288
$$ 1646592 1466368 1279488 1196544 91648 600576 1845760 179200 1413120 1001984 733696
1052G33696j14176j9968a80736F65088J62816j18784b84672A36704R88672j25440
$$ 733696 619520 599552 -180736 665088 827904 709120 -284672 136704 1125376 999936
1042I99936B99520J03424K60608A64352J21344M16256M46976j63328q4480n3248
$$ 999936 299520 402944 663552 164352 285696 701952 1148928 985600 901120 847872
1032H47872f85568F71744J15200i6768C39456A39776P79264I1648K39104L70176
$$ 847872 -685568 671744 786944 -96768 339456 139776 919040 91648 330752 700928
1022G00928B560c72736C2768J66400c58400A214464a87904G13216M40832m23424
$$ 700928 2560 -372736 32768 199168 -358400 1214464 -187904 713216 1154048 730624
1012G30624M09088k71872l98848L31776L65056C77344Q39168B60608Q05376k00192
$$ 730624 1139712 867840 468992 800768 1165824 377344 1216512 260608 1065984 865792
1002H65792l59424N57056M56704K17600p34720N94944K44736F84032O68672k49344
$$ 865792 506368 1063424 1520128 1737728 1003008 1597952 1842688 684032 1352704 1103360
992A103360K80576m97664J377792m17792k35008N80608J66912n05856K88768k95936
$$ 1103360 1383936 886272 2264064 1846272 1611264 2191872 2358784 1852928 2141696 1845760
982A845760N26848p12192k82112k52416J276928r94304Q76544n4272J567744p35232
$$ 1845760 2372608 1660416 1378304 1125888 2402816 1408512 2285056 2230784 3798528 3063296
972C063296j60768L9424n2736l05152J33632J5872Q56064K8160M51584J96608
$$ 3063296 2902528 2941952 2889216 2584064 2717696 2733568 3589632 3617792 4069376 4265984
962D265984J111040J950720K66240K640384N08928j613824m79744O98880N44256
$$ 4265984 5377024 7327744 7593984 10234368 10743296 9129472 8649728 9348608 9892864
953I892864K23232J226240M36224J048576Q78080J271808L668480K674688L579392
$$ 9892864 10116096 11342336 11778560 12827136 13705216 14977024 18645504 21320192 24899584
944B4899584J1863040K1196288J9858944P3822208J4313472F9364224B7657216
$$ 24899584 36762624 57958912 77817856 151640064 165953536 69364224 27657216
936A1301376m469248n16608k399744j293824m73600M18816l40992A110016J251840
$$ 11301376 6832128 6315520 3915776 2621952 2148352 2567168 2226176 1110016 2361856
927B361856o08256G20896J167360Q56576J009664N81120B158080J157120j424384
$$ 2361856 1753600 720896 1888256 2744832 3754496 4335616 2158080 3315200 1890816
918A890816F53312k49344A22880a86368I27744C40992J904128b06336D0448J235456
$$ 1890816 653312 403968 122880 -186368 927744 340992 2245120 -206336 40448 1275904
908A275904n92384d608I35424f58432a74080C13856p8336J53088M91008a55648
$$ 1275904 683520 -4608 935424 -658432 -174080 313856 235520 388608 879616 -155648
897B70336h71936G45472b47296A475072C14880J86880f9120A250816g64416c23072
$$ 270336 -871936 745472 -247296 1475072 314880 501760 -69120 1250816 -764416 -323072
886D33664A27488O08768m096C06176f62528E8880b9184G73120d09088p99744D04992
$$ 433664 127488 736256 732160 306176 -662528 58880 -29184 773120 -409088 -1208832 404992
874a63328f1440F49728q4480B64704M19328d87424B2528Q35072f1952A166848
$$ -163328 -61440 649728 565248 264704 684032 -487424 22528 857600 -61952 1166848
863I28256L1744l05664l9424G8336R4208c21024E27360a52064E33504b65216E17632
$$ 928256 960000 654336 614912 78336 172544 -321024 527360 -152064 533504 -265216 517632
851i37984E09952f74304b70848A86368O77888e5808A89952a46944A86368A8944
$$ -937984 509952 -674304 -270848 186368 864256 -55808 189952 -146944 186368 18944
840A039872a22880A82272N35552A13152K19648e17120A048064K0480c17440C16928
$$ 1039872 -122880 182272 717824 113152 332800 -517120 1048064 1068544 -317440 316928
829F31296d54656k58048E38112j4848f46656J28512C12832h07424E8880b52416
$$ 631296 -454656 -712704 538112 523264 -646656 -518144 312832 -807424 58880 -252416
818D10624b83648D44416j68448J38752h704I3696L45600g48544i1648o3488I40544
$$ 410624 -283648 444416 275968 414720 -8704 93696 439296 -748544 -91648 -155136 940544
806e39136J36704g6800m3520F69184c45600F12864a7920E04320e5808B40128e86240
$$ -539136 -402432 -76800 -120320 669184 -345600 612864 -17920 504320 -55808 240128 -586240
794E78560j61792c22560a01376G40864o1952e65248j94560L49696a88928r1136
$$ 578560 416768 -322560 -101376 740864 678912 -565248 -759808 -410112 -188928 -280064
784b80064k6112l85536F92736I8304f67648c1744C3280b28352H46336l41504f01088
$$ -280064 -306176 -691712 692736 98304 -667648 -31744 33280 -228352 846336 504832 -601088
772b30400F87616c85024a59744G82336a81760B45248e04320m28032B7136J38240
$$ -230400 687616 -385024 -159744 782336 -181760 245248 -504320 -932352 27136 165376
762A65376f26688J28512a91488a536I79968e87264a95584l50720k33984E94432
$$ 165376 -626688 -498176 -191488 -1536 979968 -587264 -195584 -546304 -780288 594432
751a75616E71904h30976b81600B78016a13664B87232O08256b14528D76160k5088
$$ -175616 571904 -830976 -281600 278016 -113664 287232 895488 -214528 476160 451072
741D51072a5360B4576M0960d33664a23392q06912c42016J10592C29728A51552
$$ 451072 -15360 24576 65536 -433664 -123392 -930304 -342016 -231424 329728 151552
730b0480j295872A309696C89120i8816l71200A7920K06848b7648I03680k72384
$$ -20480 -1316352 1309696 389120 -98816 -470016 17920 224768 -27648 903680 631296
720F31296f50240A37216Q09984A56160J67424b49856b2016k69312H34048p1680
$$ 631296 -650240 137216 947200 156160 323584 -249856 -22016 -291328 834048 762368
710G62368P27040F78912d75648D52608d63360I3696b3552F52288M608Q19712D08064
$$ 762368 1489408 678912 -475648 452608 -463360 93696 -23552 652288 656896 1476608 408064
698E92384B89792J013760j87392n2224n7344R53344D04480P30112R3184M30080
$$ 592384 289792 1303552 1116160 1063936 1006592 1959936 404480 1134592 1227776 1657856
688A657856K40640I25184N58592g19872F11328O2464d57216l48672H72960k01216
$$ 1657856 1898496 925184 1483776 -719872 611328 673792 -457216 -805888 872960 671744
678F71744c6864m67968A45408g32160c41504G41888e2736G47008c66592J39776
$$ 671744 -36864 -504832 145408 -732160 -341504 741888 -52736 747008 -366592 -226816
668b26816A83296L58400c58912k75456b96448p22944E62688A38240i728j188352
$$ -226816 183296 541696 -358912 -634368 -296448 -1019392 562688 138240 -9728 -1198080
658a198080K84160a43872p06560a03936B89280M09088c23584C43552A29024Q02304
$$ -1198080 -913920 -143872 -850432 -103936 289280 698368 -323584 343552 129024 931328
648I31328D64896b03264G29600k33472d86912D86400Q07936c42016E29920D7104
$$ 931328 464896 -203264 729600 496128 -486912 486400 1294336 -342016 529920 47104
637C58400b15040J4336E58080j66400E8368J9456g15776E25312c95264A197568
$$ 358400 -215040 -200704 558080 391680 58368 77824 -715776 525312 -395264 1197568
626g7824A24416a05472k62144D0960O8608B4576M97664Q32000b67776A097216
$$ -77824 124416 -105472 -367616 40960 109568 24576 522240 1354240 -267776 1097216
615D95616P53152A68448b4064G74144B50368d77184h2944q61184M096B63168a98144
$$ 495616 1248768 168448 -24064 774144 250368 -477184 -82944 -944128 -940032 263168 -198144
603b58560k56000F37952J19808j57696k72896g66976r8304d28032B51904e45792
$$ -258560 -514560 637952 757760 600064 327168 -766976 -865280 -428032 251904 -545792
592e87776E94432a92512j82784E58592G680d51072g2192p4240C27680i87136I3696
$$ -587776 594432 -192512 -375296 558592 7680 -451072 -72192 -146432 327680 -987136 93696
580b66752p68000D4544K04288j07008e00736C40480G0144A9968a03424m29056
$$ -266752 -1034752 44544 248832 141824 -500736 340480 70144 19968 -103424 -532480
570e32480E13536G6800a32608j64864B62656P81312h6528r00608A77664a3312
$$ -532480 513536 76800 -132608 -297472 262656 1043968 -86528 -987136 177664 -13312
559d13696M5056o45120e0688@C54304A15712J14688d92032F35904d58240G61344
$$ -413696 -368640 -1013760 -50688 0 354304 115712 230400 -492032 635904 -458240 761344
547b08896D9152j024e84192F07744B75456f95808L5840L03616d096m53632H38656
$$ -208896 49152 48128 -584192 607744 275456 -695808 -659968 -356352 -4096 -457728 838656
535A3312M5056J55136a85344j155584N61664K72896b25280O1440H28416O59456
$$ 13312 58368 213504 -185344 -1340928 -779264 -506368 -225280 -163840 828416 1487872
525A487872i85600g4240C55840i93792a7920H192c47136n66784c74784A2288O14912
$$ 1487872 -985600 -74240 355840 -993792 -17920 8192 -347136 -913920 -374784 12288 627200
514F27200b54976J3312G74144b50368A3312J75104O76352C17440j07008a76640
$$ 627200 -254976 -241664 774144 -250368 13312 188416 864768 317440 210432 -176640
503C15392L77344C03104i8816D0960J89952m608J11616a55648C072O26688M39808
$$ 315392 692736 303104 -98816 40960 230912 226304 337920 -155648 3072 629760 1069568
492A069568e36064e2736B76992g2192B048L18464b84160m32640A002496D59776
$$ 1069568 -536064 -52736 276992 -72192 2048 320512 -284160 -716800 1002496 459776
481a604096b56000D00896e27360I7280J21344L91680D7616q192b73408p06048
$$ -1604096 -256000 400896 -527360 97280 218624 610304 47616 39424 -273408 -979456
471i79456H6016f25152E59104A49504i728B2016J536e632A576448i65632F36416
$$ -979456 86016 -625152 559104 149504 -9728 22016 23552 -5632 1576448 -965632 636416
459C76832K45248j24928B30912c72736D38272a85344F64064e89824E13536g49056
$$ 376832 622080 497152 230912 -372736 438272 -185344 664064 -589824 513536 -749056
448b02752j58720G59296j04448j87392b52928A77152b15040D98688c3280A413120
$$ -202752 -361472 759296 654848 467456 -252928 177152 -215040 498688 -33280 1413120
437E67808j32608O29760j87392I3184M07040E3248L9936N44768A35680c25120
$$ 567808 435200 1064960 877568 93184 500224 53248 93184 637952 135680 -325120
426h7040m88960A310720B80064e87776J09568A03936J69984c79904j69472k18112
$$ -87040 -576000 1310720 280064 -587776 -478208 103936 273920 -379904 -549376 -767488
416g67488E97504g72096J46432K68800p5776A25952c5328A68448P58272A17248
$$ -767488 597504 -772096 -625664 -356864 -432640 125952 -35328 168448 926720 117248
405e64736A32608P3728h07424p0144c96288H66304D04480h62720a31584k15040
$$ -564736 132608 206336 -807424 -877568 -396288 866304 404480 -862720 -131584 -346624
395c46624c5840k73920n42720B99008g59296L04640D07040b51904B30912M55680
$$ -346624 -35840 -309760 -852480 299008 -759296 -454656 407040 -251904 230912 686592
385F86592a001984C1232P7824K67776c36384J62816p37280A22880L80928G4752
$$ 686592 -1001984 31232 109056 376832 -336384 -173568 -910848 122880 503808 74752
374e54496A00864f79424D36736j52576b82112Q3968k00704A00864N6832h78592
$$ -554496 100864 -679424 436736 284160 -282112 -198144 -398848 100864 157696 -878592
363d92032D29568a094656A023488B42688h67328a38240C11808h5504B67776g13728
$$ -492032 429568 -1094656 1023488 242688 -867328 -138240 311808 -85504 267776 -713728
352A037824M53632d30592n92384E45792e12512H85248K29888a074688K83136B2016
$$ 1037824 1491456 -430592 -1022976 545792 -512512 885248 1115136 -1074688 -791552 22016
341b32960j27488c9424C21024E6832f58944A33632b39104E96480L56864d96640
$$ -232960 -360448 -39424 321024 56832 -658944 133632 -239104 596480 953344 -496640
330c59424A31584K57024b28864j77152q56576C70176l0720A11616f91712A32096
$$ -359424 131584 388608 -228864 -406016 -1262592 370176 339456 111616 -691712 132096
319e24800d2496k69312k46272b27328A26464e14560J70496J33632q48896b70848
$$ -524800 -42496 -311808 -558080 -227328 126464 -514560 -344064 -210432 -1059328 -270848
308@A73568b02752C3792P77216h36096c32288J7408D21888b24256j99680m70016
$$ 0 173568 -202752 33792 811008 -836096 -332288 -314880 421888 -224256 -423936 -893952
297h93952B56512O656A5360J102848k45248B09920J32096J030656B60096a292288
$$ -893952 256512 263168 15360 1118208 872960 209920 342016 1372672 260096 -1292288
286F6560N60128k36032f25152j79200B42688i95328e8368n62688K24768D98688
$$ 66560 626688 390656 -625152 -804352 242688 -995328 -58368 -621056 -396288 498688
275B17088c86048j015808h6016m5568n2224I25184K93888b17088A66400f75328
$$ 217088 -386048 -1401856 -86016 -131584 -183808 925184 1219072 -217088 166400 -675328
264D16256c64032I98400A43360b80576k59072e2736N120p34208H47360B4576O63040
$$ 416256 -364032 998400 143360 -280576 -539648 -52736 -47616 -781824 847360 24576 687616
253F87616c24608D58752A00352d42880D91008c77856p168f4512K2528B14016h64256
$$ 687616 -324608 458752 100352 -442880 491008 -377856 -385024 -64512 -41984 214016 -864256
241i69728B12480L73248a134592G67488B97984G2192M45440j15200J11616e49888
$$ -969728 212480 585728 -1134592 767488 297984 72192 517632 402432 514048 -549888
230c90144k92864a54624D4544g168E32480L98336a94048C75808J52064R6768a75616
$$ -390144 -683008 -154624 44544 -7168 532480 930816 -194048 375808 527872 624640 -175616
218c76832B02752H3968J092608A60768g4240D67968d38784C43552f97856G59808
$$ -376832 202752 83968 1176576 160768 -74240 467968 -438784 343552 -697856 759808
207b96960l79904I1648a026048K58560b24768m06528G91552B3040R8304d32640
$$ -296960 -676864 91648 -1026048 -767488 -224768 -631296 791552 23040 121344 -432640
196g2704l56352j09568R728b06336A368064H0384d04480R6768m83840g3216G75168
$$ -72704 -429056 -538624 -528896 -206336 1368064 80384 -404480 -307712 -791552 -73216 775168
184b37568D96128a72544g6288o60992a7408E10976M93568d28544R3696D01408
$$ -237568 496128 -172544 -76288 -737280 -17408 510976 1004544 -428544 -334848 401408
173A298432b24256j33120B6112J020416d7104B64704G7824b17088G2704J92512
$$ 1298432 -224256 -357376 26112 1046528 -47104 264704 77824 -217088 72704 265216
163B65216J8944e30432B03776a059328H3456P7824K89280B16576e84704j73056
$$ 265216 284160 -530432 203776 -1059328 83456 161280 450560 216576 -584704 -757760
153g57760c44064H07424a56672C79392h12032J14176C22560B2528d1984l05152
$$ -757760 -344064 807424 -156672 379392 -812032 -697856 322560 22528 -41984 -347136
143c47136C39968j07008L59424k13504l584e2224b0992B50880k9696h07424P5776
$$ -347136 339968 232960 592384 378880 375296 -52224 -20992 250880 221184 -807424 -731648
132g31648A01376N79072k26816a89440F47680B49344n7856g48032a34144G44960
$$ -731648 101376 680448 453632 -189440 647680 249344 191488 -748032 -134144 744960
121b04800m85376F85568B65216b44736B15552e6832C00544d99712F46144j6896
$$ -204800 -690176 685568 265216 -244736 215552 -56832 300544 -499712 646144 629248
111F29248b08384A303040e20704C56864C5840c12320j36704l23072I2160J04960
$$ 629248 -208384 1303040 -520704 356864 35840 -312320 -449024 -772096 92160 197120
101A97120N94944c85536o43584D86400a068544C60960a37728B01728M6592N61152
$$ 197120 792064 -385536 -1029120 486400 -1068544 360960 -137728 201728 248320 809472
91H09472k24256e9392C37920d38272C9424a14688G85408j6384i216F05184d22400
$$ 809472 585216 -59392 337920 -438272 39424 -114688 785408 769024 -9216 605184 -422400
79B47296h10496A161216e51936d3520k5088j07008B9696b96960G68000a123328
$$ 247296 -810496 1161216 -551936 -43520 -68608 -175616 29696 -296960 768000 -1123328
68c27680b5600m25472a16736j42848D93568P7824R6256l19488j09056e95456m12672
$$ -327680 -25600 -451072 -116736 -259584 493568 571392 667648 348160 239104 -595456 -1008128
57a008128b86208k0480M5568A60256G6800c65568C07200A10080K50368a08032
$$ -1008128 -286208 -306688 -261120 160256 76800 -365568 307200 110080 360448 -108032
46c07712m23936a12128H36096k44224d35200J38240o0416J72544D608J713664
$$ -307712 -731648 -112128 836096 591872 -435200 -296960 -357376 -184832 4608 1718272
36A718272e16608D95616e34016D24960g3728F36416B71872F1952%h0896C30240
$$ 1718272 -516608 495616 -534016 424960 -73728 636416 271872 61952 61952 -80896 330240
24C11808M08576e50912R2160E08416a18784B55488a59744F14400p9360A74592
$$ 311808 720384 -550912 -458752 508416 -118784 255488 -159744 614400 535040 174592
13a45408m6592C31776G6800J017344f36928J30560D33664e27872H2944B5600e16608
$$ -145408 -192000 331776 76800 1094144 -636928 -506368 433664 -527872 82944 25600 -516608
1b0992k11456
$$ -20992 -232448
0b32448
$$ -232448
##END=
