##TITLE=1344
##JCAMPDX= 6.0         $$ Bruker NMR JCAMP-DX V2.0
##DATA TYPE= NMR SPECTRUM
##DATA CLASS= XYDATA
##ORIGIN= NUTS EXPORT
##OWNER= Administrator
$$ 1.72 TOPSPIN		Version 2.1
$$ 2016-02-23 12:20:48.761 -0800  Administrator@X
$$ Compression mode = diff/dup
##.OBSERVE FREQUENCY= 90.275459
##.ACQUISITION MODE= SIMULTANEOUS (DQD)
##.ACQUISITION SCHEME= undefined
##.AVERAGES= 16
##.DIGITISER RES= 22
##SPECTROMETER/DATA SYSTEM= 
##.PULSE SEQUENCE= zg30
##.SOLVENT NAME= None
##.SHIFT REFERENCE= INTERNAL, None, 1, 14.42158
##AUDIT TRAIL= $$ (NUMBER, WHEN, WHO, WHERE, PROCESS, VERSION, WHAT)
$$ ##TITLE= Audit trail, TOPSPIN		Version 2.1
$$ ##JCAMPDX= 5.01
$$ ##ORIGIN= Bruker BioSpin GmbH
$$ ##OWNER= Administrator
$$ $$ E:/data/jwist/nmr/1344/1/pdata/1/auditp.txt
$$ ##AUDIT TRAIL=  $$ (NUMBER, WHEN, WHO, WHERE, PROCESS, VERSION, WHAT)
(   1,<2016-02-23 08:56:44.871 -0800>,<Administrator>,<X>,<jcamp>,<TOPSPIN 2.1>,
      <fromjdx created from
       E:\data\jwist\nmr\uniandes\1344
       data hash MD5: 8K
       5B 2B D0 20 FB 33 01 29 1B B2 AB C5 74 0C 98 CA>)
$$ ##END=
$$ 
$$ $$ hash MD5
$$ $$ DF DB 03 6A 13 89 94 16 D8 6E 93 5F F1 4D DB DC
##$RELAX= 
$$ Bruker specific parameters
$$ --------------------------
##$DU= <E:>
##$EXPNO= 1
##$NAME= <1344>
##$PROCNO= 1
##$TYPE= <nmr>
##$USER= <jwist>
##$ACQT0= 0
##$AMP= (0..31)
100 100 100 100 100 100 100 100 100 100 100 100 100 100 100 100 100 100
100 100 100 100 100 100 100 100 100 100 100 100 100 100
##$ANAVPT= 1
##$AQSEQ= 0
##$AQ_mod= 3
##$AUNM= <au_zg>
##$AUTOPOS= <>
##$BF1= 90.275459
##$BF2= 400.02
##$BF3= 400.02
##$BF4= 400.02
##$BF5= 400.02
##$BF6= 400.02
##$BF7= 400.02
##$BF8= 400.02
##$BYTORDA= 0
##$CFDGTYP= 0
##$CFRGTYP= 0
##$CHEMSTR= <none>
##$CNST= (0..63)
1 1 145 1 1 1 1 1 1 1 1 1 1 1 1 1 1 1 1 1 1 1 1 1 1 1 1 1 1 1 1 1 1 1 1
1 1 1 1 1 1 1 1 1 1 1 1 1 1 1 1 1 1 1 1 1 1 1 1 1 1 1 1 1
##$CPDPRG= <>
##$CPDPRG1= <>
##$CPDPRG2= <>
##$CPDPRG3= <>
##$CPDPRG4= <mlev>
##$CPDPRG5= <mlev>
##$CPDPRG6= <mlev>
##$CPDPRG7= <mlev>
##$CPDPRG8= <mlev>
##$CPDPRGB= <>
##$CPDPRGT= <>
##$D= (0..63)
0 1 0 0 0 0 0 0 0 0 0 0 0 0 0 0 0 0 0 0 0 0 0 0 0 0 0 0 0 0 0 0 0 0 0 0
0 0 0 0 0 0 0 0 0 0 0 0 0 0 0 0 0 0 0 0 0 0 0 0 0 0 0 0
##$DATE= 0
##$DBL= (0..7)
120 120 120 120 120 120 120 120
##$DBP= (0..7)
150 150 150 150 150 150 150 150
##$DBP07= 0
##$DBPNAM0= <>
##$DBPNAM1= <>
##$DBPNAM2= <>
##$DBPNAM3= <>
##$DBPNAM4= <>
##$DBPNAM5= <>
##$DBPNAM6= <>
##$DBPNAM7= <>
##$DBPOAL= (0..7)
0.5 0.5 0.5 0.5 0.5 0.5 0.5 0.5
##$DBPOFFS= (0..7)
0 0 0 0 0 0 0 0
##$DE= 6.5
##$DECBNUC= <off>
##$DECIM= 2432
##$DECNUC= <off>
##$DECSTAT= 4
##$DIGMOD= 1
##$DIGTYP= 12
##$DL= (0..7)
0 120 120 120 120 120 120 120
##$DP= (0..7)
150 150 150 150 150 150 150 150
##$DP07= 0
##$DPNAME0= <>
##$DPNAME1= <>
##$DPNAME2= <>
##$DPNAME3= <>
##$DPNAME4= <>
##$DPNAME5= <>
##$DPNAME6= <>
##$DPNAME7= <>
##$DPOAL= (0..7)
0.5 0.5 0.5 0.5 0.5 0.5 0.5 0.5
##$DPOFFS= (0..7)
0 0 0 0 0 0 0 0
##$DQDMODE= 0
##$DR= 22
##$DS= 2
##$DSLIST= <SSSSSSSSSSSSSSS>
$$ [...]
##$SPOFFS= (0..31)
0 0 0 0 0 0 0 0 0 0 0 0 0 0 0 0 0 0 0 0 0 0 0 0 0 0 0 0 0 0 0 0
##$SUBNAM0= <"">
##$SUBNAM1= <"">
##$SUBNAM2= <"">
##$SUBNAM3= <"">
##$SUBNAM4= <"">
##$SUBNAM5= <"">
##$SUBNAM6= <"">
##$SUBNAM7= <"">
##$SUBNAM8= <"">
##$SUBNAM9= <"">
##$SW= 20.5580556627758
##$SWIBOX= (0..15)
0 0 3 4 0 0 0 0 0 0 0 0 0 0 0 0
##$SW_h= 8223.68421052631
##$SWfinal= 0
##$TD= 65536
##$TD0= 1
##$TE= 300
##$TE2= 300
##$TE3= 300
##$TEG= 300
##$TL= (0..7)
0 120 120 120 120 120 120 120
##$TP= (0..7)
150 150 150 150 150 150 150 150
##$TP07= 0
##$TPNAME0= <>
##$TPNAME1= <>
##$TPNAME2= <>
##$TPNAME3= <>
##$TPNAME4= <>
##$TPNAME5= <>
##$TPNAME6= <>
##$TPNAME7= <>
##$TPOAL= (0..7)
0.5 0.5 0.5 0.5 0.5 0.5 0.5 0.5
##$TPOFFS= (0..7)
0 0 0 0 0 0 0 0
##$TUNHIN= 0
##$TUNHOUT= 0
##$TUNXOUT= 0
##$USERA1= <user>
##$USERA2= <user>
##$USERA3= <user>
##$USERA4= <user>
##$USERA5= <user>
##$V9= 5
##$VALIST= <valist>
##$VCLIST= <CCCCCCCCCCCCCCC>
##$VD= 0
##$VDLIST= <DDDDDDDDDDDDDDD>
##$VPLIST= <PPPPPPPPPPPPPPP>
##$VTLIST= <TTTTTTTTTTTTTTT>
##$WBST= 1024
##$WBSW= 4
##$XGAIN= (0..3)
0 0 0 0
##$XL= 0
##$YL= 0
##$YMAX_a= 1204683520
##$YMIN_a= -1793605.632
##$ZGOPTNS= <>
##$ZL1= 120
##$ZL2= 120
##$ZL3= 120
##$ZL4= 120
##$ABSF1= 10
##$ABSF2= 0
##$ABSG= 5
##$ABSL= 3
##$ALPHA= 0
##$AQORDER= 0
##$ASSFAC= 0
##$ASSFACI= 0
##$ASSFACX= 0
##$ASSWID= 0
##$AUNMP= <proc_1d>
##$AXLEFT= 0
##$AXNAME= <>
##$AXNUC= <off>
##$AXRIGHT= 0
##$AXTYPE= 0
##$AXUNIT= <>
##$AZFE= 0.1
##$AZFW= 0.1
##$BCFW= 1
##$BC_mod= 2
##$BYTORDP= 0
##$COROFFS= 0
##$CY= 15
##$DATMOD= 1
##$DC= 2
##$DFILT= <>
##$DTYPP= 0
##$F1P= 0
##$F2P= 0
##$FCOR= 0.5
##$FTSIZE= 0
##$FT_mod= 4
##$GAMMA= 1
##$GB= 0
##$INTBC= 1
##$INTSCL= 1
##$ISEN= 128
##$LB= 0.3
##$LEV0= 0
##$LPBIN= 0
##$MAXI= 10000
##$MC2= 0
##$MEAN= 0
##$ME_mod= 0
##$MI= 0
##$NCOEF= 0
##$NC_proc= -9
##$NLEV= 6
##$NOISF1= 0
##$NOISF2= 0
##$NSP= 1
##$NTH_PI= 0
##$NZP= 0
##$OFFSET= 14.42158
##$PC= 1
##$PHC0= 0
##$PHC1= 0
##$PH_mod= 0
##$PKNL= yes
##$PPARMOD= 0
##$PPDIAG= 0
##$PPIPTYP= 0
##$PPMPNUM= 2147483647
##$PPRESOL= 1
##$PSCAL= 4
##$PSIGN= 0
##$PYNMP= <proc.py>
##$REVERSE= no
##$SF= 90.2741571038208
##$SI= 8192
##$SIGF1= 0
##$SIGF2= 0
##$SINO= 400
##$SIOLD= 32768
##$SPECTYP= <>
##$SREGLST= <1H.CDCl3>
##$SSB= 0
##$STSI= 0
##$STSR= 0
##$SW_p= 1497.18866228788
##$SYMM= 0
##$S_DEV= 0
##$TDeff= 0
##$TDoff= 0
##$TI= <>
##$TILT= no
##$TM1= 0
##$TM2= 0
##$TOPLEV= 0
##$USERP1= <user>
##$USERP2= <user>
##$USERP3= <user>
##$USERP4= <user>
##$USERP5= <user>
##$WDW= 1
##$XDIM= 8192
##$YMAX_p= 1204683264
##$YMIN_p= -1793536
##$CURPLOT= <PDFCreator>
##$CURPRIN= <$PDFCreator>
##$DFORMAT= <normdp>
##$LAYOUT= <+/1D_H.xwp>
##$LFORMAT= <normlp>
##$PFORMAT= <normpl>
##$SURQMSG= 1
$$ End of Bruker specific parameters
$$ ---------------------------------
##XUNITS= HZ
##YUNITS= ARBITRARY UNITS
##XFACTOR= 0.182762287876938
##YFACTOR= 1
##DELTAX= -0.182762287876938
##NPOINTS= 8192
##FIRSTX= 1497.0059
##FIRSTY= -1313280
##LASTX= 0
##MAXY= 1204683264
##MINY= -1793536
##XYDATA= (X++(Y..Y))
8191a313280D10112a57696C11808L72224h3968j63328d1472B16576b65216C14368
8180d14208d3008D43392b60608D62848A09568B6624d19328A22880N12512b01216
8169A75616e5808q5504K2528E94432B3040K86720K4064H704b59584l48160A017344
8157G69536a20320B23744O34368j57184d0960l2768B85184J64864b06336j81248
8147c87584m14720G11168j08032R8304K48832D61312i89184I6768J79200b98496
8136C52768Q12032D09088b00704O1952B98496c73760D94592J44384B3552e02272
8125B0992J09056P5264E8368c41504B58560d02432A128448A64352P34720b25792
8114d41856F656N80608k11968A13664f88128G4752J35680a91488A9968h96000
$$ plain form
8191 -1313280 410112 -157696 311808 684032 -83968 -247296 -41472 216576 -265216 314368
8180 -414208 -43008 443392 -260608 462848 109568 26624 -419328 122880 635392 -201216
8169 175616 -55808 -141312 -118784 594432 23040 309760 333824 8704 -259584 -607744 1017344
8157 769536 -120320 223744 858112 700928 -40960 -73728 285184 450048 -206336 -387584
8147 -387584 -802304 711168 603136 701440 950272 461312 -989184 96768 275968 -298496
8136 352768 1164800 409088 -200704 -138752 298496 -373760 494592 638976 23552 -502272
8125 20992 130048 205312 58368 -341504 258560 -402432 1128448 164352 899072 -225792
8114 -441856 6656 587264 375296 113664 -688128 74752 210432 -191488 19968 -896000
8103A211904a85344D14720E12J039872e68320j57184a10080L7888F57920A42336
8092F58944O12864B85184L95776D5056N30432k45248J26464K0992f92736D18304
8081D79744O49216b65728j41824C48160p0144l072L14368B5600M4544f06720P9872
8070e26848A006592b61632c1744q45824F08256c07712B97984J77664A76640M35200
8060F11840l03104J12128i7280G36768j12640A91488B5088O99392N6320k41664
8050E39136b38592G18848c47136A117184d65408E76512q7040J052672B06848K66752
8040D73600c50208B86720e79072J24928F0416Q02816D1984K22720M15744n4272
8030F26176k24768b28864A129472a77664o7584K0480d5568H0384Q01280e04320
$$ plain form
8103 1211904 -185344 414720 512 1040384 -568320 -725504 -110080 -72192 657920 142336
8092 658944 1271808 285184 680960 45056 575488 330240 456704 477696 -692736 418304
8081 479744 1128960 -265728 -407552 348160 278016 274944 589312 25600 70144 -606720 -526848
8070 -526848 1006592 -261632 -31744 -877568 608256 -307712 297984 475648 176640 611840
8060 611840 308736 420864 -97280 736768 624128 191488 25088 724480 780800 539136
8050 539136 -238592 718848 -347136 1117184 -465408 576512 489472 1542144 206848 473600
8040 473600 -350208 286720 -579072 -454144 60416 863232 41984 264704 680448 626176
8030 626176 401408 -228864 1129472 -177664 -245248 -224768 -45568 80384 881664 -504320
8019A112064M1984i04192A79712a012224A297920a76128k53440H94976j13152
8010G81824A71520c93728C21024k0480R0624d35712J9968o9120C09248c93216
7999D53632J2800A15712f0928q78080b08896G52128f4512A200640C02080L13344
7989F15424K31424a59232B19136K25792D5568g32160E64224B07872L62496d6592
7978c72224a84832E99040J85856b6624j47968A00864Q58112c25632c2256E07392
7967a08032F85056M97664a47456B90304b49344B12992m6592k5088i216A82272
7956c69664C95776d88960C13344M3520e31456b39616q79104B048J83296Q52992
7946A038336a63840C15904f32832B048R8304a17760A87392b4064A12128O19008
$$ plain form
8019 1112064 1154048 -904192 179712 -1012224 1297920 -176128 -429568 894976 781824
8010 781824 171520 -393728 321024 300544 391168 -435712 -415744 -484864 309248 -393216
7999 453632 466432 115712 -60928 -939008 -208896 752128 -64512 1200640 302080 615424
7989 615424 846848 -159232 219136 444928 45568 -732160 564224 207872 570368 -46592
7978 -372224 -184832 599040 784896 -26624 -174592 100864 958976 -325632 -32256 507392
7967 -108032 685056 1182720 -147456 290304 -249344 212992 166400 141312 -9216 182272
7956 -369664 395776 -488960 313344 356864 -531456 -239616 -1118720 2048 185344 1038336
7946 1038336 -163840 315904 -632832 2048 100352 -117760 187392 -24064 112128 731136
7936G31136B58560k6624M608O76352l072k78528j62816J07008l1232j5360i07776
7924i3696j10080I55392B22208J338368E13024j57184e23264l58400b15552k2528
7914b38080A35680c63520A92000J39776d58240F75328K57024B64192M85376B76992
7903B71360L09760p8336M00896C87584g5776A77664L37920j76640k8160I7280
7892d70016A017856e67296N0176G168i2160B61632J5360J123328C74272a363968
7881B03264J81248f79936D608K93376f54848q8064H87808B17600H6528d90496
7870A86880N47328O68160f06720I28768D8640c39968E31456A0240Q43264m18816
7860D34688c38432J10592A16224g98720L24608A89952f29760B93888e38624J51552
$$ plain form
7936 731136 258560 231936 236544 912896 909824 631296 468480 575488 544256 528896 -907776
7924 -93696 -203776 955392 222208 1560576 513024 355840 -523264 -881664 -215552 -238080
7914 -238080 135680 -363520 192000 331776 -458240 675328 932352 264192 749568 276992
7903 271360 581120 502784 903680 387584 -75776 177664 515584 338944 310784 97280
7892 -470016 1017856 -567296 -517120 7168 -92160 261632 276992 1400320 374272 -1363968
7881 203264 384512 -679936 4608 297984 -654848 -742912 887808 217600 86528 -490496
7870 186880 734208 1402368 -606720 928768 48640 -339968 531456 10240 853504 434688
7860 434688 -338432 -227840 116224 -798720 -474112 189952 -629760 293888 -538624 -387072
7850c87072B06336a69984O9632n1200A34656L43040A58720L89632a13664j13152
7840b26816A160192a93024l48672I50272l11808A63328L09760R75872l60960B40640
7829d42880m1984D80256d21888I5744c03104I1136C584J356800B35008k3040C072
7817h26880C05152c75296J71520j09568J1776F22592g11168a65376C62496A50016
7806a81760C54304a569792M48000E16096d85376j74592O9632I4208E12Q4992K29376
7795C14880Q03840f15936j89952a26464m23424B41152L79392B38080J286144f22592
7784A247744c08736B4064L64544j28000a30560j92000I75360M14208E23776a73056
7773a65888E00736A19296b53952a5360B01216R58976b95424l1744A12640A8432
$$ plain form
7850 -387072 206336 -169984 -100352 -151552 134656 477696 158720 548352 -113664 -226816
7840 -226816 1160192 -193024 -541696 950272 638464 163328 473088 1448960 1088000 240640
7829 -442880 -484864 480256 -421888 95744 -303104 91136 3584 1360384 235008 211968 3072
7817 -826880 305152 -375296 -203776 -313344 -301568 622592 -711168 -165376 362496 150016
7806 -181760 354304 -1569792 -1121792 516096 -485376 -659968 -590336 94208 512 85504 314880
7795 314880 1118720 -615936 -805888 -126464 -549888 241152 620544 238080 1524224 -622592
7784 1247744 -308736 24064 388608 260608 -130560 -322560 975360 1389568 523776 -173056
7773 -165888 500736 119296 -253952 -15360 201216 1160192 -295424 -327168 112640 18432
7762B2528O58432b08384I78944k86208i00608L2256E30432K65728j54624A32608
7751c73760B26816r728N86240K40128A03424M14208B04288K67264e2224E03296
7740i15968c61472P1680I75872l75296a4336k23232J05984D02944c26656A15200
7729A233920a33120C01056K65216J17760B26304O57408e13536E82144g75680C06176
7718F69184b18112G19872K20672c2768a1264A289728l60448B59584c53280G40352
7707A14688R45152B14016K73408a36192E55008R1136A58208b93376C24096M33664
7697G57760B59072g65440C63008c82976B74432i7280G21408C0720M16768j25440
7687C22048a73568k62656I4208N82144b58560F9632a68448A64864N88288C52256
$$ plain form
7762 22528 680960 -208384 978944 692736 -900608 -868352 530432 796160 641536 132608
7751 -373760 226816 217088 803328 1043456 103424 517632 204288 471552 -52224 503296
7740 -915968 -361472 -289792 975872 600576 -14336 -237568 -131584 402944 -326656 115200
7729 1233920 -133120 301056 566272 684032 226304 883712 -513536 582144 -775680 306176
7718 669184 -218112 719872 940544 -32768 -11264 1289728 929280 259584 -353280 740352
7707 114688 1059840 214016 487424 -136192 555008 646144 158208 -293376 324096 757760
7697 757760 259072 -765440 363008 -382976 274432 -97280 721408 30720 447488 322048
7687 322048 -173568 -436224 94208 676352 -258560 69632 -168448 164864 753152 352256
7676B17088I9840L12832A93024Q28928e9392A203712f2976a0752A011712e00224
7665F07744B86208K47808J84832c22048a10080G72608K66240B8160b58048C10272
7654e120B56512K79552k22208a15200a8432m54656D84352h3456r7280G49056A42848
7642D22912i45152A1264L86560A63328a15200k36544E56544b18624f0928A21344
7631I32352l91680g93600k58560C25120P21408g88480F656c11808I19552h49408
7620G18848b40640D59776j84832A04448N99040o4000B03776P44960r0624b69312
7609H1920L1232a53600C57376A10080J220096A2800c27680D59776A89952Q28416
7599A018368I5744N1712Q98560@H704g26016K72384K17600B82112P0656f60480
$$ plain form
7676 217088 99840 412672 193024 1021952 -59392 1203712 -62976 -10752 1011712 -500224
7665 607744 286208 534016 718848 -322048 -110080 772608 1038848 28160 -258048 310272
7654 -5120 256512 536064 313856 -115200 -18432 -473088 484352 -83456 -180736 749056 142848
7642 422912 -945152 11264 397824 163328 -115200 -351744 556544 -218624 -60928 121344
7631 932352 540672 -793600 -1052160 325120 1046528 -788480 6656 -311808 919552 -849408
7620 718848 -240640 459776 274944 104448 703488 639488 203776 948736 858112 -269312
7609 81920 113152 -153600 357376 110080 1330176 12800 -327680 459776 189952 1018368
7599 1018368 95744 147456 1046016 0 8704 -726016 -453632 -236032 282112 352768 -660480
7587c22560G7824J81248a5360A12128d92544D48512A85344O78400b32960G24992
7576A085952e26336b2016B43200o1440N46304k49856G9872N8368J99680E632N29408
7565E35040c56352F30272b51392C98336a43872l60448f144j90976C84000A80224
7554H38144k1504k37056A5360a199104b5088F72768k43712n5296I3696L0720M66944
7543E91360B48320j14176L43040c67616A000448N1712k32960j28512M39808G168
7532E53472a541632d4032j54112I69728I8816J77664a56160C53792L29216A81760
7521C33312J350656p64928M10112b56000A176064d39808B67776K98496k05312
7512C60960M29568l64032J10080K29888R9328A53088e9392m54144a93024H28416
$$ plain form
7587 -322560 77824 259072 -15360 112128 -492544 448512 185344 863744 -232960 724992
7576 1085952 -526336 -22016 243200 181760 728064 478208 79872 138240 337920 5632 535040
7565 535040 -356352 630272 -251392 398336 -143872 -504320 -6144 -197120 384000 180224
7554 838144 816640 579584 15360 -1199104 -25088 672768 429056 373760 93696 124416 591360
7543 591360 248320 134144 477184 -367616 1000448 1052160 819200 690688 1130496 7168
7532 553472 -1541632 -44032 -198144 969728 98816 276480 -156160 353792 683008 181760
7521 333312 1683968 919040 1329152 -256000 1176064 -439808 267776 566272 360960
7512 360960 790528 426496 536576 766464 865792 153088 -59392 -513536 -193024 828416
7501A82272P51616b17088A06496R91232B42176O21568m15744N60128K09920i9328
7490g08608F24128k71360m5568K71360A91488m0448f144C40992k9184a9968A85856
7478a26976A14176O00576a24928J024B98496b70848F80448A73568a23392A394688
7467A22368G680P70048d64384A65888L76320L30240j22368c51232i2672k12992
7457c05664q0384B29376N43744l70688p3728J24928R11872c94240A75104N19168
7447F94272K4064C52256k3552c08224C01056a24928C82976M09088a23392I02656
7436I84064C33312j00352E8880L32800L24096j20320b24768A51552L58912P168
7426E17632J01376M77184f04160G20384C8912a46432H39680B28864K9696N90848
$$ plain form
7501 182272 933888 -217088 106496 1097728 242176 863744 448000 1008128 1218048 -99328
7490 -708608 624128 352768 307200 578560 191488 151040 -6144 340992 311808 -19968 185856
7478 -126976 114176 714752 -124928 -123904 298496 -270848 680448 173568 -123392 1394688
7467 122368 7680 777728 -464384 165888 542208 872448 750080 -351232 -92672 -305664
7457 -305664 -386048 229376 773120 402432 328704 453632 1365504 -394240 175104 694272
7447 694272 718336 352256 328704 -308224 301056 -124928 382976 792064 -123392 902656
7436 984064 333312 232960 58880 391680 715776 595456 -224768 151552 510464 517632
7426 517632 619008 1096192 -604160 720384 38912 -146432 839680 228864 258560 849408
7416H49408h704A392128o78400R20576g84896b8160C14880a30048B26304b48832
7405b54976A22368O26176p6800k12480j33120R5744L09760j19296J16736k52416
7395D76672i728k7136k33472C38432d14208a67424E58592e0688C21536J04448
7385D25984N09440C19488e24800B1504a091072B9696L65056I1648J36704j03424
7375A24928J153024c39968D37760B8160J80736e9392D58752L05664B95936C7888
7364E82144K38080A23392M85376h3968D92544J34656b6112B11968q6016N60640
7354F86592J69472J97120k93376C07712M92032B15552a64864B67264L88608%L24608
7343I80480k7648k90816e77024K46784C37408K48320j9456J40800f98880b17088
$$ plain form
7416 849408 -8704 1392128 713728 1634304 -784896 -28160 314880 -130048 226304 -248832
7405 -254976 122368 748544 671744 459264 326144 421888 731648 612352 729088 476672
7395 476672 -9728 -36864 -270336 338432 -414208 -167424 558592 -50688 321536 425984
7385 425984 935424 319488 -524800 21504 -1091072 29696 394752 91648 228352 124928
7375 124928 1277952 -339968 437760 28160 208896 -59392 458752 764416 295936 37888
7364 582144 820224 123392 608768 -83968 492544 627200 -26112 211968 125952 686592
7354 686592 856064 1053184 759808 307712 799744 215552 -164864 267264 655872 655872 980480
7343 980480 952832 662016 -577024 -330240 337408 585728 566272 707072 -698880 -217088
7332B91840b38080B3040Q63232C55840H6528e79584E05344A42336M17792Q39168
7322A399296B54464i19040G39840C09760J185792E8880M27520m6080r7280p4240
7312B68800K37056k03264R88672E2736N91872h30464E50400J3824i63072I80992
7301H61696d0448o60480B11456D5568J104384A25952J301504C072a32608j44384
7291b76992A32608f0928p26528F26176k09920j71008O49216k00704B04288N84192
7281G88480M18304D12672a56160G95648A07520M30592O18496D29568A44896d28032
7270D58752P56224A14176C4304M73600j10592H4480d1984D52096a9456C38944
7259G49056b79552D94592f08768a87392G36256n8880K74432A40800J01376L27168
$$ plain form
7332 291840 -238080 23040 886272 355840 86528 -579584 505344 142336 560128 1399296
7322 1399296 254464 -919040 739840 309760 1495552 58880 486400 440320 343040 268800
7312 268800 505856 302592 1291264 52736 644608 -830464 550400 564224 -963072 980992
7301 861696 -40448 -700928 211456 45568 1149952 125952 1427456 3072 -132608 -276992
7291 -276992 132608 -60928 -787456 626176 416256 245248 894464 693760 204288 788480
7281 788480 1206784 412672 -156160 795648 107520 538112 1156608 429568 144896 -428032
7270 458752 1214976 114176 34304 507904 397312 84480 -41984 452096 -19456 338944
7259 749056 -279552 494592 -608768 -187392 736256 677376 951808 140800 242176 569344
7249E69344A22880a66400j3312j3312E76512o2464B02240e8368j67936k47296
7239d73600b7136A209856j54112n10464B50368L97312A87392k4064K95424J314304
7229A773056q79104k07872k560j22880A63840N95968k98496L80416k70848P680
7219E78560J23392C04128k0992L1232P0656L5328j01888A37216N14048E0176L41504
7208C91680J24416O81472B59072K95424a03936G7824M72064J469440A17248J07008
7198B24256a60768k11456A135616D04992L4304O70208j68448F1440M04992J81248
7188F47680j46944a26464C15904A35168b27840a02912G24992J01888k67776d44928
7177G74144A61280J39776K30912A77152L98336a79200A056256l51232L05152B46272
$$ plain form
7249 569344 122880 -166400 -179712 -193024 576512 514048 202240 -58368 -226304 -473600
7239 -473600 -27136 1209856 1055744 545280 250368 647680 187392 163328 458752 1773056
7229 1773056 893952 686080 683520 560640 163840 759808 461312 841728 570880 578560
7219 578560 701952 304128 283136 314368 385024 420352 318464 137216 651264 50176 391680
7208 391680 516096 1197568 259072 554496 -103936 77824 549888 2019328 117248 224256
7198 224256 -160768 -372224 1135616 404992 439296 1109504 941056 61440 466432 647680
7188 647680 500736 -126464 315904 135168 -227840 -102912 724992 826880 559104 -444928
7177 774144 161280 301056 531968 177152 575488 -179200 1056256 705024 1010176 246272
7166a053696A85344c88096D84864R6256K05824E3248J68448M41344k9184L21536
7156I55392D51072j40800M47488l17440M5056a27488F37952f45120I49248b1504
7145E84192R2672j35168i69728H4992J280000B60096P99232A26464J265664D21888
7134I67168A1776b20160C51232L4304K90816k24768H6016N34528N59104l83488
7124G96160J64864i8304B36544o8608R96864b89792E29408g65440F80960R1136
7114G72096M14208n42208f97856D72064I3696Q17664B65216J18272A05472P58784
7104H64256a52576m10624B73408M62848M73600E32480k04800Q47360b7648E43232
7093a63328C45088o1952M02432l7888e7344F00064b7136d096I67168A00352o144
$$ plain form
7166 -1053696 185344 -388096 484864 581120 786944 53248 221696 663040 633856 955392
7156 955392 451072 310272 757760 440320 485376 -127488 637952 -645120 949248 -21504
7145 584192 676864 541696 -969728 84992 1364992 260096 1059328 126464 1392128 421888
7134 967168 11776 -220160 351232 385536 676352 451584 86016 620544 1179648 796160
7124 796160 961024 -98304 236544 167936 1164800 -289792 529408 -765440 680960 772096
7114 772096 1186304 644096 -697856 472064 93696 911360 265216 383488 105472 864256
7104 864256 -152576 -563200 273408 736256 1209856 532480 327680 1175040 -27648 543232
7093 -163328 345088 283136 685568 647680 -57344 600064 -27136 -4096 967168 100352 94208
7082I4208d72576R8816C03104J92000b44736D0448q704N13024l6864K9184l7888
7071D99200L59424g33696b6624F46144L33824k89792R96352C54816R5232f0416
7060C51232b32960H30976m06016j53600R85600n13024R6256P5776B2016b2016
7049B88256J220608E01248N73952q4992A87392j1264C0208N77024C9936Q4992
7039A24928J80224E8880Q21760C072P36256h47360A174528B88256d04480a91488
7028I2672Q58112B14016J25952N83680K5088K29376j93536f20032A251840L96800
7018A648640p77728A48992N94432c2768C16416j05472Q7552b44736B78528K99008
7008E77536a71520l08736I08288b54976A192448l40992j35168L0720k63168A13664
$$ plain form
7082 94208 -472576 -373760 303104 495104 -244736 40448 31744 544768 507904 537088 499200
7071 499200 858624 -733696 -26624 646144 979968 690176 1686528 354816 450048 -60416
7060 351232 -232960 830976 424960 271360 1256960 743936 840192 915968 22016 -22016
7049 288256 1508864 501248 1075200 990208 187392 176128 30208 607232 39936 124928
7039 124928 305152 58880 880640 3072 739328 -847360 1174528 288256 -404480 -191488
7028 92672 950784 214016 339968 923648 948736 1178112 984576 -620032 1251840 1648640
7018 1648640 870912 148992 743424 -32768 316416 210944 298496 -244736 278528 577536
7008 577536 -171520 -480256 908288 -254976 1192448 851456 716288 747008 483840 113664
6997G75680L42016c09248B91840K83648k04800F9120Q2944M76672P2704a86880
6986C24608e49888b30400E38112c33312C78368g45472H44288f14912A71008M15744
6976E86752k19136J137664d63360M6592F01088f77376A61280J144320A50016b56000
6965A020416K16576h704H73472B23232d17792F34880j62304J76128e0176F91200
6954c51744F42048@E37088H5504P43424k65728m6080K07872m5056K79552j87392
6943G72096B34496M60288l13344I728K7648J23904J297920B35008J055744p7312
6933A213440a46944F52800A80224k9696p0144J399808a63328C85536b29376f7584
6922G42912a02400o49216E67808j02400R69216E8880J89440P34208m65920a123840
$$ plain form
6997 775680 1117696 -309248 291840 575488 370688 69120 152064 628736 701440 -186880
6986 324608 -549888 -230400 538112 -333312 378368 -745472 844288 -614912 171008 586752
6976 586752 367616 1505280 -463360 -416768 601088 -677376 161280 1305600 150016 -256000
6965 1020416 1236992 -8704 873472 223232 -417792 634880 472576 648704 -50176 691200
6954 -351744 642048 0 537088 85504 828928 563200 517120 724992 679936 959488 772096
6943 772096 234496 694784 381440 9728 37376 161280 1459200 235008 1290752 1213440
6933 1213440 -146944 652800 180224 150528 80384 1480192 -163328 385536 -229376 -67584
6922 742912 -102400 -751616 567808 465408 1434624 58880 248320 982528 516608 -1123840
6911F56896h3968E00224a017344E25312N1712f04672C26144b63168j51040E38624
6900I08800D30080a96096G46496b74432E60128N74976m75136j19296J51552e21728
6889C43552L05152A07520J237504a07008k11456E98528P2192j22880Q91392D8640
6878E66272k04800L19488a253888b03264C90656M97152l40480b66752G79264A8432
6867e8880k16064H20736l36896G4240K65728j14176J171456B82624a2288E45280
6856B31424e4272o40512I46176q9600B73408N92384m7104K64704m32128a14176
6845G41888g680E22240O99392F02112O2464a67936I20064E120M68992P65952c24096
6833D46976J47968c99360B61120J08544k2016a35680N2736G69024l14880N41696
$$ plain form
6911 656896 -83968 500224 -1017344 525312 577024 -604672 326144 -263168 -414208 538624
6900 908800 430080 -196096 746496 -274432 560128 1135104 659968 540672 692224 -521728
6889 343552 648704 107520 1345024 -107008 -318464 598528 670720 547840 1439232 48640
6878 566272 361472 680960 -1253888 -203264 390656 887808 547328 -266752 779264 18432
6867 -58880 -274944 820736 483840 74240 339968 225792 1397248 282624 -12288 545280
6856 231424 -54272 -694784 946176 856576 273408 865792 818688 1083392 651264 -114176
6845 741888 -7680 522240 1221632 602112 664576 -167936 920064 5120 474112 1240064 -324096
6833 446976 594944 -399360 261120 369664 347648 -135680 -82944 769024 454144 995840
6823I95840C29728j56160c39456I89696B95936J43360j16736J37216K18624k76992
6813D01408A66912M46976O60480A68448M02432k0480B55488a81248k92352H81664
6802I83552l57376d4032H63232l50208b63680C11808i8816C37920e632A260032
6791B97984J85856L23584J16224m56192n9392Q28928k32448A82784P65952c96288
6780A02912J06496M66432N45280l31776m37760j48992L17952J77152l06176A67424
6769a793536A22368M00896K07872N79072o14912L22048N22240C56352L54816K25280
6759I36448j84320B2528L46112J07008a61792C26656M88448K20672M4032J36704
6749A216512J23904k86720k53952K03264a6384G05536a09056C21536j54624M27008
$$ plain form
6823 995840 329728 173568 -339456 989696 295936 439296 322560 459776 678400 401408
6813 401408 166912 613888 1274368 168448 570880 550400 255488 -181248 -473600 881664
6802 983552 626176 -44032 863232 513024 -263680 311808 -98816 337920 -5632 1260032
6791 297984 483840 807424 923648 467456 408064 1236992 1004544 182784 948736 -396288
6780 102912 209408 675840 1221120 889344 451584 302592 620544 797696 491520 167424
6769 -1793536 122368 523264 731136 1310208 695296 1017344 1539584 356352 711168 936448
6759 936448 752128 22528 368640 475648 -161792 326656 815104 1035776 1079808 1216512
6749 1216512 1340416 1053696 799744 1003008 -16384 705536 -109056 321536 166912 593920
6739E93920k58048L40992L10272j86880j71520k93376J48992A89440J66912D0448
6728I58976m67456Q1920f22080H07936J32608J1264j11616A98656P75680Q7040
6718A061376A20832J339904n94944A15712b09920H66304e9392B52928q9088a51552
6707d56192H38656C74784m6080L09248k62144L74272Q96000q7552e50912D17792
6696G63904B08384Q57600B64192j04960J313280A65888d3008A399808O27712a33120
6685g3728A01376N06880J63840j55648f15936G51616B74432J078272k36544M15744
6675A531904D46976A7408L34848d67456F75840j80224q704i728H92416l75808
6665E16608i9840E50912J75104B75456J25952J23904g42400C29728N09952B94912
$$ plain form
6739 593920 335872 676864 987136 800256 628736 335360 484352 189440 356352 40448
6728 958976 491520 573440 -622080 807936 940544 951808 840192 198656 974336 1061376
6718 1061376 120832 1460736 865792 115712 -209920 866304 -59392 252928 163840 -151552
6707 -456192 838656 374784 328704 637952 375808 750080 1646080 1558528 -550912 417792
6696 763904 208384 1065984 264192 159232 1472512 165888 -43008 1399808 2027520 -133120
6685 -73728 101376 608256 772096 616448 -615936 751616 274432 1352704 1116160 1531904
6675 1531904 446976 17408 352256 -467456 675840 495616 486912 -9728 892416 516608
6665 516608 -99840 550912 726016 275456 401408 525312 -742400 329728 839680 294912
6654E35552k56512N35040K85184c20512F76352K29888D32128L16416c91168I75360
6643a46432f4000G38304J82784H9600Q63744d13184B21184O60992m31104M72064
6633I23136K28864E1712P5264P09632K39616b06336F09280a28512C72736b56512
6622A034240B26304J164800l82976q9600O7584j32608L71200B01216J98656j56160
6612B43712J2288O80960a071616B51904R84064o656k69312l6352l93728A48992
6601F8608M78720q9088c2768j97632F76352J2288l08736N87776j29024O87616
6591A526272p04512d43904A413120D32128N05856k90304l10272N24288l90144
6582D71552d7104B23744O44096k560B39104b37056F54848J36704K53952b47808
$$ plain form
6654 535552 279040 814080 1099264 -320512 676352 906240 432128 748544 -391168 975360
6643 -146432 -64000 738304 921088 89600 953344 -413184 221184 882176 451072 923136
6633 923136 1152000 51712 126976 836608 1076224 -206336 609280 -128512 372736 -256512
6622 1034240 226304 1391104 1008128 918528 986112 853504 1224704 201216 399872 243712
6612 243712 256000 936960 -1071616 251904 1235968 1229312 960000 923648 529920 148992
6601 68608 547328 458240 -32768 -230400 676352 688640 379904 967680 838656 1526272
6591 1526272 821760 -443904 1413120 432128 937984 647680 337408 861696 471552
6582 471552 -47104 223744 867840 865280 239104 -237056 654848 791552 1045504 -247808
6571A850880B41152N4272l9936L24608O4512B560M11648R66144n68832o6048B15040
6559e16096C44064P88480A50528J47456M28544K43200j08032a93536A79712M34176
6549F13888h12032A829888E91872J46944C16928O1952A8432P60320N61152m28032
6539I11872j30048a8432E83168k64704P31136n6320b49856H70912O02624a81248
6528E15072N60640D86912J070592E14048N75488B00192c16928A294848F20544
6518A585664A09568Q84224C24608P7312J131520m86400a56160A513984C50208
6508A090560D57216D5568L6352J341440n85216c27168C44576R5232N78048n8880
6498I58976K42688E49376P37280F00576M9664d34688E66272l584B7136J333248
$$ plain form
6571 1850880 241152 295424 255488 580096 644608 2560 414208 1380352 811520 745472 215040
6559 -516096 344064 1132544 150528 297984 726528 969728 861696 -193536 179712 613888
6549 613888 -812032 1829888 591872 738816 316928 378880 18432 778752 1339904 911872
6539 911872 781824 -18432 583168 318464 1049600 993280 -249856 870912 1473536 -181248
6528 515072 1075712 486912 1557504 514048 1089536 200192 -316928 1294848 620544
6518 1585664 109568 993792 324608 401920 1533440 1047040 -156160 1513984 350208
6508 1090560 457216 45568 81920 1423360 838144 -327168 344576 439808 1017856 958976
6498 958976 1201664 549376 1286656 600576 650240 -434688 566272 562688 27136 1360384
6488A360384o43584a079808E72416k55488N98528J01888C22560m6080C072K61120
6478B64192Q17152D56192p5264j36192P2192P46496O33344l33312L9424f80448
6467E56544P80800l28704a26464D51584O1440L42016J56160m02432k15552N56544
6457I49760a43872I0624Q22784l60448L49184A00352b33984h4480E06368M96128
6447A002496l58400j2288A25440c87072A089536m3520I8304a8944B46784K89792
6437E36576j66912f656j43872A261568m66944k84672b39104F22080L91168c20512
6426B70336q4480N7856K99008p8336O05184j44384k84160k04800b7648F55360
6415E23264K41664K46272J089024A86880f6560A495040o01088P74656n23776d53120
$$ plain form
6488 1360384 716800 -1079808 572416 316928 915456 1017344 322560 276480 3072 264192
6478 264192 1081344 456192 380928 244736 316928 1063424 1696768 1363456 1402880 -680448
6467 556544 1337344 1008640 -126464 451584 513024 855040 1011200 608768 393216 949760
6457 949760 -143872 90624 913408 552960 902144 100352 -233984 -84480 506368 1002496
6447 1002496 644096 631808 125440 -387072 1089536 1046016 98304 -18944 246784 536576
6437 536576 369664 -6656 -150528 1261568 794624 509952 -239104 622080 1013248 -320512
6426 270336 185856 243712 542720 464384 1069568 925184 641024 436224 -27648 655360
6415 523264 764928 1011200 2100224 186880 -66560 1495040 893952 1668608 1144832 -453120
6404E79072K59072k34496M0448j04448j33632L57888J006080A70496O08768C60448
6393E84192M95616j09056r7280D01920f8096E05856N3760L18976j33632J64864
6383I09824B57024Q12032k04288k57536O53312n80096j0752B71360O95808c66080
6372F84544J146368a0752I90208h23296G47520k59584P67488m7104n28896C38944
6361H93952O03136k03264A09568R77408l69152a38752E89824L73248L32288k38080
6351A057280R1136C87072O2464J319424F77376Q51968J6896E81120Q01792K50368
6341A633280B77504J089024b71872A353728C51232A69984J246720o29760l60960
6332D25984J702912b99008A353216a4336G18848J58208c28192I51296k08384C27680
$$ plain form
6404 579072 838144 603648 644096 539648 406016 763904 1769984 170496 779264 360448
6393 584192 1079808 970752 873472 401920 -68096 505856 559616 878592 744960 909824
6383 909824 257024 1069056 864768 607232 1260544 680448 669696 271360 967168 -366080
6372 684544 1830912 -10752 990208 -823296 747520 487936 1255424 1208320 679424 338944
6361 893952 1497088 1293824 109568 1086976 717824 -138752 589824 963072 1295360 1057280
6351 1057280 1148416 387072 449536 1768960 677376 1529344 1546240 581120 1382912 1633280
6341 1633280 277504 1366528 -271872 1353728 351232 169984 1416704 786944 425984
6332 425984 2128896 -299008 1353216 -14336 718848 877056 -328192 951296 742912 327680
6321A121280k25280E5296N55520K20672k59584r9840R20576H3456c1232H6528
6310F24640N67808r5744k87744Q55552D81792a22368D35712j87904Q17664O7072
6300A132544l82976o6048l01056R3184J143296e48352D16768J112576A42848K65216
6290D08064j64352n632J033216a85344G07072j99680b08896A142784c36384j64864
6280e01248H66304B61120L51744b05312G44960a2288E17632j84320e6320E79584
6269A191936C77856J220608G45472b88256A426944O0416K4576b83648A255936
6259A431552l13344A48480O6048A4848O68672L17952K18624j70496M30080a60256
6248E42208A3312P85408k26816o2464A22368J293312b53952E1200J47456c90656
$$ plain form
6321 1121280 896000 55296 610816 831488 571904 472064 1392640 83456 -31232 86528
6310 624640 1192448 1096704 808960 1664512 481792 -122368 435712 247808 1065472 1132544
6300 1132544 749568 683520 382464 475648 1618944 -548352 416768 1529344 142848 408064
6290 408064 243712 238080 1271296 -185344 707072 507392 -208896 1142784 -336384 -501248
6280 -501248 866304 261120 612864 -205312 744960 -12288 517632 333312 -56320 579584
6269 1191936 377856 1598464 745472 -288256 1426944 1487360 1511936 -283648 1255936
6259 1431552 1118208 148480 214528 14848 683520 1001472 1220096 1049600 1479680 -160256
6248 542208 13312 798720 571904 509440 122368 1415680 -253952 51200 198656 -390656
6237c52768E16608O14912m10624h7040D14720Q5504J39264M18816j59744A61792
6226F36416b18624C85536j72032P8336P45984e16096B36544Q54528j02912M608
6216I92768b53440A074176K0480a05472D66944@i7280F21568B53952P50592B68288
6204G45984d42368A283584l32288k7136R216l32800J050624n30944A80736b82112
6193B97472J753088E8368L05664R04704L38432k68800k81088r7792d94080C87584
6182A068032L01056k7648B56512J133056e8368j07520F42560O13376F24640j38240
6172D86400B7136J244672n35040J21344k44224J64864j46432B26816J081344F07744
6161A172480l98848O23104A41824Q02816l32800F6048R39520N7344b09408A351168
$$ plain form
6237 -352768 516608 1131520 720896 -87040 414720 500224 639488 1058304 898560 161792
6226 636416 -218624 385536 213504 291840 1037824 -516096 236544 1091072 988160 992768
6216 992768 -253440 1074176 1094656 -105472 466944 0 -97280 621568 253952 1004544 268288
6204 745984 -442368 1283584 951296 924160 933376 600576 1651200 1120256 180736 -282112
6193 297472 2050560 58368 364032 1268736 1607168 1338368 1057280 959488 -494080 387584
6182 1068032 1369088 1341440 256512 1389568 -58368 -165888 642560 1255936 624640 486400
6172 486400 27136 1271808 736768 858112 613888 778752 632320 226816 1308160 607744
6161 1172480 773632 1396736 141824 944640 611840 66048 1005568 1062912 -209408 1351168
6150C54304J186304G52640Q16128G31136E4784L40992c99360J64864C97312R71264
6140A368576j47968k8672l19488N1200B64704A07008k4576J214976a16224D90496
6129I74336M27520E39136O1952N26848n45792K98496b86208D43392j11616M52608
6119G84384B06848O45632k08384B40640N45792m9152j17760A83808R28256l34848
6109G77216j4336J34144d44928G23968k67776r0112O63040C08224M40832k79040
6099D70016P27552k63680a53088C32800M98688k12480n120N56032k74432C04640
6088G79776g6288H37632D5568Q30464K57024k30400k65728B25280k3552J190912
6078A392640o87616r9840I4720O20544A78176P97696D87424N68832C40480J14176
$$ plain form
6150 354304 1540608 752640 1568768 731136 54784 395776 -399360 -234496 397312 1368576
6140 1368576 1220608 1191936 872448 923648 264704 107008 82432 1297408 -116224 490496
6129 974336 1401856 539136 601088 1127936 582144 880640 -286208 443392 331776 784384
6119 784384 206848 852480 644096 240640 786432 737280 619520 183808 1112064 777216
6109 777216 762880 897024 -444928 723968 456192 366080 1029120 308224 749056 470016
6099 470016 1197568 933888 -153088 332800 831488 619008 613888 1169920 895488 304640
6088 779776 -76288 837632 45568 876032 1133056 902656 636928 225280 201728 1392640
6078 1392640 705024 605184 94720 715264 178176 975872 487424 1056256 340480 454656
6068D54656k15040P79264m07552q2944k11456a39264j05472I84064N78560G49568
6057G80800C71200J41824l072J041920B17088Q40192L26144A25952h2432c4304
6046A113088C96288c584F59968M89472l74272a28000E31456J37216G3728R2160
6036A65888Q19200M04992E43232n0688N82656B60096N15584R0624C34336j10080
6026B24256R98400A5360R79456K79552B35520N85216l28192C9424M63360L45600
6016H48384C88608d54656A097216j80224B51392J471488C14368d2496H4480Q4480
6006A68960c43552F69696J052672F66624O65088o16960l7888P24480l3792F0928
5995G82336B58560M4032J50528M62848L35360K65728D77184F9632O67648N05856
$$ plain form
6068 454656 239616 1018880 611328 528384 316928 -139264 -244736 984064 1562624 749568
6057 780800 371200 513024 509952 1551872 217088 1057280 1383424 125952 -82432 -34304
6046 1113088 396288 -3584 659968 1149440 775168 -128000 531456 668672 73728 165888
6036 165888 985088 1390080 543232 492544 1075200 260096 775680 866304 334336 224256
6026 224256 1222656 15360 994816 1274368 235520 820736 492544 39424 502784 848384
6016 848384 388608 -454656 1097216 916992 251392 1722880 314368 -42496 84480 168960
6006 168960 -343552 669696 1722368 666624 1331712 714752 676864 1401344 1367552 60928
5995 782336 258560 302592 453120 915968 1251328 1517056 477184 69632 737280 1243136
5985A243136p168l59936L69664C75808C9424N17120a12128F66112G0656K40128
5975C10784N74464k13504N73440C59424I8304M64896J138688B12992a86368I01120
5964E70368R88160g71584A103872m84352j2800Q04352D29056c87072B71872K46784
5954E18656K98496a35680A253376C09760M40832P56224d46464C54816N10976Q07936
5944A673728C79392O70208l46112Q74496j97632l89120N9904e5808F16960J385984
5934B002944D23424Q26368n09440N72416F44096j83296J229824G58272L28192
5925A086464O64064A73568N22752J34656C33312J035776D52608p6288J150976
5916A527296m97664k31936l71712R66144j25952L73760q08960Q75520M26496F66112
$$ plain form
5985 1243136 1235968 876032 1245696 375808 39424 556544 -112128 666112 70656 310784
5975 310784 885248 671744 1245184 359424 98304 563200 1701888 212992 -186368 901120
5964 570368 1558528 -771584 1103872 619520 606720 1411072 429056 -387072 271872 518656
5954 518656 817152 -135680 1253376 309760 750592 1506816 -446464 354816 865792 1673728
5944 1673728 379392 1049600 703488 1577984 1380352 991232 1051136 -55808 616960 2002944
5934 2002944 423424 1249792 740352 1312768 644096 460800 1690624 758272 1086464
5925 1086464 1750528 173568 696320 830976 333312 1369088 452608 376320 1527296
5916 1527296 1029632 797696 425984 1392128 1266176 1639936 830976 1706496 2132992 666112
5905H64256J026560H26880k83136J73056j70496J285632D07552M8640M65408D15232
5894E28384A60768O87616j53088J21344H3456O29760K72896j83808o5024E9904
5883G63392M24448C93728e2224A499648k11456E28384l8912M2496M21376l02592
5873F50752J49504o6560O08768b62144A229312k75968K39616B95936J170432l28704
5863A137664K23232m04992Q73984p60320k96960B80576J296384E49888A41824
5853b9184G08608Q3456O2464Q3456j79200P22432B8672Q59648j7408j99680k78528
5842C92704K47808J2800j00352M56704m91008N50912D61824R83040p19872N96480
5832A321472n80608B19648L0720N19168M71040i2672A499648C55840%N69344l51232
$$ plain form
5905 864256 1890816 826880 543744 716800 546304 1831936 407552 456192 921600 415232
5894 528384 160768 848384 695296 816640 83456 713216 986112 802304 737280 59904
5883 763392 1187840 393728 -52224 1499648 1288192 528384 489472 531968 953344 650752
5873 650752 800256 733696 1342464 -262144 1229312 953344 1192960 295936 1466368 1137664
5863 1137664 1360896 955904 1829888 1069568 772608 280576 1576960 549888 141824
5853 -29184 708608 792064 854528 937984 758784 1481216 28672 888320 870912 671232 392704
5842 392704 640512 653312 552960 1009664 518656 1069568 461824 1444864 724992 1321472
5832 1321472 740864 219648 250368 769536 1240576 -92672 1499648 355840 355840 925184 573952
5821E73952R41056n11488C52768O52288q192N48352E13024J164800m21888B26304
5810A62304J058304Q4480m54656L23072C89120o1440P47008C70176M16256k7136
5800G59296M94592n32480J009152i24672H10496J20320O8096O63040b3552E91360
5789A046016l09248L69664E20192J83808N07904m99200A30560M68480D1984R08288
5779I50272m08064J107968K69824f45120A54624K150400p60832E57568J36192
5770F93760k43200O35392j93536R55904G38304e03296A172480j29536J24416m39296
5760G28064a16224F47680K94912l8912l75808R13408l60960Q8064f8608E17632
5749I11360C49184p1680O08768e6832B73408j05472N59104K41664r6768a42336
$$ plain form
5821 573952 1515008 1003520 352768 1005056 996864 1545216 513024 1677824 1255936 226304
5810 162304 1220608 1305088 850432 1173504 389120 327680 1074688 370176 786432 759296
5800 759296 1253888 721408 1730560 -924672 810496 930816 998912 1661952 -23552 591360
5789 1046016 736768 1106432 520192 704000 1211904 712704 130560 599040 41984 950272
5779 950272 542208 1650176 1920000 -645120 154624 2305024 1544192 557568 693760
5770 693760 450560 1085952 892416 1848320 738304 -503296 1172480 1042944 1167360 728064
5760 728064 -116224 647680 942592 903680 527872 1441280 1080320 1168384 -68608 517632
5749 911360 349184 277504 886272 -56832 273408 167936 727040 968704 871936 -142336
5738G91040B84672J042944o04160K37056M27008l48672B99520N74464K31424J03424
5728A208832Q49920d096C39456J185280l63520K7648n86752J04448J59232D1984
5717G71584J034240n18144E32480P62880m4032B44736K64704M00384P30624j59232
5707A481216l57888D38272R9328J110528G99744L21024N04320l37408n13536O36928
5697A411072B89792M89472k67264J592320E36064Q38656L16416m91520n65760
5688F33856A57696M68480L26144r216B21184K47808J229312G16800L02080j46944
5678H71936E0176J068544l48160O32320m55168M56192N2224A83808J076736n29408
5668G31136O80448o13376M55168l5840O656j67424l7888O2464D81792N68832N72928
$$ plain form
5738 791040 284672 1327616 723456 960512 1387520 1038848 299520 873984 1105408 1208832
5728 1208832 2058752 -4096 339456 1524736 1161216 1188864 602112 706560 865792 41984
5717 771584 1805824 1287680 532480 1295360 1251328 244736 509440 909824 1640448 1481216
5707 1481216 1123328 438272 537600 1648128 799744 1120768 1625088 1287680 774144 1411072
5697 1411072 289792 779264 512000 2104320 536064 1374720 1691136 1199616 633856
5688 633856 157696 626176 952320 943104 221184 468992 1698304 716800 1018880 871936
5678 871936 50176 1118720 770560 1402880 947712 1403904 1456128 183808 1260544 731136
5668 731136 1411584 798208 1253376 1217536 1224192 1056768 1018880 1081344 481792 1050624 1623552
5657A623552A28512K41664R37472o38464N10976n16608N18144J41312B91840J010688
5647A302528j96608I3696J149952K42688o93248k88256J195008q23296J009152
5638A885696l50208p44448M57216L09760j41312n30944O61504E66272P36256j46944
5628A155584J82272J43360K0480j10080k60608J024J031168r72288K04800l07712
5618A088000L584n28384J869824B54976J147392o45632K64192m63872J217536
5609A774592m80256o12864O23616O57408B58048K87744K35008M75648B51904O83520
5599I35424J024A28000P06560Q01792n69856k48320O51776e3248A485824E10464
5588A899520F04160Q36608a26976A271808K77504n67808K63168L14368k42176
$$ plain form
5657 1623552 128512 370176 1307648 669184 1180160 663552 1181696 1323008 291840 1302528
5647 1302528 1105920 93696 1243648 1486336 793088 504832 1699840 876544 1885696
5638 1885696 1535488 791040 1248256 1558016 1416704 885760 1547264 566272 1302528 1155584
5628 1155584 1337856 1481216 1501696 1391616 1131008 1132032 2163200 1190912 1395712 1088000
5618 1088000 1091584 563200 2433024 254976 1402368 756736 1020928 557056 1774592
5609 1774592 1294336 681472 1305088 1962496 258048 545792 780800 1256448 251904 935424
5599 935424 936448 128000 834560 1636352 1066496 818176 1469952 -53248 1485824 510464
5588 1899520 604160 1440768 -126976 1271808 1549312 981504 1244672 1559040 1316864
5579A316864m68992l93216K145792r15456n12c1232F29248J149440C69664o6560
5569C03104O57920j74080R62560p36768N73952G24480M29056R21600b12480A225216
5558A231360l75808J390592F05184R47200J62304m78208M23424G81312J54624
5549I35936I0624R82528P59296m36224j42848m97152J11616Q13056E57568N50400
5539A107968O60992k32960k42688q2944k86720N61664F25664N19168m74112J83296
5529H54016r4208L1232L66592n632O83008q9600k02240G49568J53600L84512M83328
5518A771008l75808K07360E85216Q92928l05152B80064J195520o22592B51392
5508A786368M8640k26816q02816Q15104M19840E84192J48992M77184O96832p21920
$$ plain form
5579 1316864 847872 454656 2600448 1684992 1684480 -31232 629248 1778688 369664 303104
5569 303104 961024 786944 1749504 1012736 1586688 724480 1153536 2075136 -212480 1225216
5558 1231360 855552 2246144 605184 1552384 1714688 1236480 1659904 781312 935936
5549 935936 90624 1073152 1832448 1396224 1253376 756224 867840 1680896 557568 1107968
5539 1107968 1768960 1536000 1293312 1210368 923648 1485312 625664 1144832 670720 854016
5529 854016 759808 791040 1157632 1152000 1835008 1745408 1543168 749568 903168 1287680 1771008
5518 1771008 1395200 1602560 585216 1478144 1172992 280064 1475584 852992 251392
5508 1786368 1835008 1608192 805376 1620480 2040320 584192 733184 1210368 1907200 1185280
5498A185280J5360J19296m41344J219072D66432N40160J224192q21760p0656n72928
5488G65440O50240o24128R59488J50528p58272Q1920L32800j95584M83840l46624
5478A499648E45792L76832L48672R1136k63168E41184J23904P21408A69472J202688
5468A372160p5264M12160n47328j35680C49184J483776o97856l58912R12896K75968
5458A965056J47968n68320o56384R57952o27200M1984J75616G13728N03296J08032
5448A325056O3488A04960Q96000J438720A098240K90304m20864L8400M02944o90688
5438G18336j09568L66592N88800m40832R15968I56416L49184N17120H83712N39648
5428A423360o12352Q49408k72896k24768J046016A025536r216J22368O29760p4240
$$ plain form
5498 1185280 1200640 1319936 878592 2097664 466432 1006592 2230784 1409024 1338368 765440
5488 765440 1415680 791552 1751040 1901568 1143296 1225216 1558016 1362432 1846272 1499648
5478 1499648 545792 922624 1271296 1362432 1099264 541184 665088 1386496 169472 1372160
5468 1372160 1296896 1709056 1161728 1026048 349184 1832960 1135104 776192 1689088 1965056
5458 1965056 2113024 1544704 888320 1846272 1219072 1261056 1436672 713728 1217024 1325056
5448 1325056 1388544 104960 1000960 2439680 1098240 1388544 967680 1006080 1409024 718336
5438 718336 608768 975360 1564160 1123328 2039296 956416 1305600 1822720 883712 1423360
5428 1423360 811008 1660416 1387520 1162752 2208768 1025536 1016320 1138688 1768448 1694208
5418A694208m1472G24992J235456D99200R15456n28896j43872R17504o79424N19680
5408A499648E31968K73408K56000n13536J40288k15040J022976B12480K92352
5399E04832M66432N16096M35712m08576j28000J47456o12352j30560N30432o07232
5389G14240N89312l71200O29760C86048J65376J831936p82336m10112J316864
5380B507776D95616K83648J020928o18496m39808J93536l21536R52320F67136
5370A615872F88640J106944m0960p56736Q67840G43936K87232k0480D12672R97888
5360A410560l17440L43552J26976Q67840q57088p80288J091584Q5504H37120L9424
5350H76544R86624j29536H36608K90816k32960O57408n36576C50720J158144K03264
$$ plain form
5418 1694208 1652736 724992 1960448 499200 1414656 885760 741888 1659392 979968 1499648
5408 1499648 531968 805376 1061376 547840 688128 473088 1496064 212480 504832
5399 504832 971264 1487360 1923072 1514496 1386496 1533952 921600 791040 1321472 714240
5389 714240 1303552 932352 1562112 386048 551424 2383360 1601024 1190912 2507776
5380 2507776 495616 779264 1800192 1181696 741888 935424 613888 1566208 667136
5370 1615872 688640 1795584 1754624 997888 1865728 743936 1031168 1010688 412672 1410560
5360 1410560 1093120 1436672 1563648 2431488 1574400 794112 1885696 1971200 837120 876544
5350 876544 1863168 1733632 836608 1127424 894464 1551872 1015296 350720 1508864 1712128
5340A712128J28512H72960J24928K56000Q00256p23456n48864O47168L24608k65216
5330A488384E93408N02272K67776J60256n63712J340928H25344Q46336F92736
5320C05152J615360K88768p09632k90304G4752K013184r78432P19360P5264j60768
5310A743360L0208k80576J70496m52608J30048O35392D07552L91168O71232N20704
5300A990656I08288j43360P10144P31648o29760j77664n28384K81088K21184k73408
5290A099776P45472n45280k72384N57568Q7040O99392r75872K19136j58720m11648
5280A044480J71008M90496m63872J48480M19328L05664p3728q31488R20064l31776
5270A798656n80096J67936J13152r1136l16928K44224j95584Q55552n7856F51264
$$ plain form
5340 1712128 1840640 872960 997888 1253888 2054144 1330688 781824 1428992 1753600 1488384
5330 1488384 593408 1095680 1363456 1523712 960000 2300928 825344 1671680 692736
5320 305152 1920512 2209280 1499648 1209344 74752 2087936 1109504 1828864 1904128 1743360
5310 1743360 1773568 1492992 1663488 1210880 1340928 1976320 407552 798720 1469952 1990656
5300 1990656 908288 764928 1475072 2206720 1576960 1399296 870912 1152000 1373184 1099776
5290 1099776 1845248 1299968 1027584 1585152 1672192 2371584 1395712 1614848 1456128 1044480
5280 1044480 1215488 1705984 1242112 1390592 1809920 2115584 2041856 1210368 2130432 1798656
5270 1798656 1218560 1386496 1499648 1408512 1091584 1335808 1140224 1995776 1937920 651264
5259B162176e0176A574912K32960q40192Q9088L89632L28192O97856p13216p87968
5249I71264J622016I19040n2736O80960o31808M77696P19360K01216j45920A033216
5238A401344J95072Q9600j57696p07072F1440J397248M22912o84032j35168J039360
5228B101760n79072P19872R3696n79072L49696r53344P12192J162240j102336
5219A925632l10272Q57088P59808j02912m99200m01920M37760k32448j27488q85248
5209A420800L20000j28000o24128N46816l44064J28000D03456M19840M95616K63168
5199A582080K99520m78720m79744D37760L32800C69664J691648o69696J00864
5190A492480L75808l072m54144p6800K14016k02240O73280j12640o49216E17632
$$ plain form
5259 2162176 -50176 1574912 1807872 967680 1056768 1446400 1774592 2472448 1759232 971264
5249 971264 2593280 919040 866304 1547264 915456 1393152 2112512 2313728 2167808 1033216
5238 1401344 1596416 1686016 1528320 821248 61440 1458688 1881600 1197568 1062400 2101760
5228 2101760 1522688 2242560 2336256 1757184 2106880 1153536 1865728 3027968 1925632
5219 1925632 1615360 2472448 3232256 3129344 2630144 2228224 2665984 2433536 2306048 1420800
5209 1420800 1740800 1612800 988672 1535488 1191424 1319424 403456 823296 1318912 1582080
5199 1582080 1881600 1402880 923136 437760 770560 369664 2061312 1391616 1492480
5190 1492480 1868288 1865216 1411072 1334272 1548288 1346048 2019328 1906688 1257472 517632
5179A689600n69856k00192J53600J42848l49184M82304k20160K01728O76864J99168
5169B206720H24320J155584G21408M98688K10944Q81664A035776l68128N13024
5160A180672o5536E18144J549824m39808P73120m10112q78592F6560J976320I37472
5149G38304Q21248J34656G98208M09088Q65280H66816Q27904K52416p34720K52928
5139A465344E25312R95840P2704o37952%J124352j94560p2192M3520N86752P13216
5128C156992H45312Q48896k02240l56864L97312N7856P53152F94272J720832j133056
5118A282048C44576J789952A056256J13664L56864M48000M87424A207808N17632
5109A725440k38080J046016r03168L63520q06400L98848o96320J547264o07744
$$ plain form
5179 1689600 1119744 919552 1073152 1216000 866816 1349120 1128960 1330688 2007552 2206720
5169 2206720 824320 1979904 721408 1220096 1431040 2312704 1035776 667648 1180672
5160 1180672 1115136 518144 2067968 1628160 2401280 1991168 1112576 66560 2042880 937472
5149 738304 1559552 1694208 798208 1207296 2072576 866816 1694720 1947136 1212416 1465344
5139 1465344 525312 1521152 1593856 955904 955904 2080256 1885696 1813504 1857024 2443776 3156992
5128 3156992 845312 1694208 1491968 1135104 1532416 1590272 2343424 694272 2415104 1282048
5118 1282048 344576 2134528 1056256 1169920 1526784 1974784 2462208 1207808 1725440
5109 1725440 1487360 2533376 1630208 1993728 1187328 1586176 889856 2437120 1829376
5100A829376k70336N90848L65056A045504K76992J138688r48224r8304K68800
5091A683456L78368j20320M03968m29056H07424O70208K45760L85024q54016R50272
5081B204672F96832J929216n68320m09600R3696G62880J218560l91168q1408j01888
5071A406976O46144j04448q7552q45312J021952K32960n90336m99200K24768J00864
5061A506816O07744j73056q90880O60480R54368p54688F64064J632256K81600
5052B577920j216000K20160K72384j61280J4336G88480J667584o8096n61152o39488
5042A187328Q58624o89664M13184O5024J277440A331712j03424J174016j191424
5033A210880J197056I39008Q78080P64416A246720L71712O11328O68672m07040
$$ plain form
5100 1829376 1559040 2149888 2514944 1045504 1322496 2461184 1512960 1414656 1683456
5091 1683456 2061824 1941504 2345472 1916416 807424 1477632 1723392 2108416 1254400 2204672
5081 2204672 696832 2626048 2057728 1648128 1741824 762880 1981440 1590272 1508864 1406976
5071 1406976 2053120 1948672 1861120 1015808 2037760 2270720 1680384 1181184 1405952 1506816
5061 1506816 2114560 1941504 1050624 1711104 2665472 1910784 664064 2296320 2577920
5052 2577920 1361920 1582080 1854464 1693184 1707520 788480 2456064 2387968 1826816 1187328
5042 1187328 2045952 1356288 1769472 1834496 3111936 1331712 1228288 2402304 1210880
5033 1210880 2407936 939008 1817088 2581504 1246720 1618432 2229760 2898432 2491392
5024B491392J91488P23456j513472q52480J208320k42176p6800k29888L48160
5015B048000R9840I87648J81760L44064l79392M17792P28576A128448Q78592R69216
5005B976256j204736o1952l4304m09600k93888R03168j6896o27712N23264M87424
4995B241024k22208j02912l23584L02592O38976L17440m25472p46496Q3968M01920
4985B165248K11968J56672n44768K10432k48320J4336j66912k42176M00384J265664
4975C222528A431040R89696q2944m24448m8640R73312p11680m59264P34720q42752
4965A559040k59072L14880P48544M19328P168n34528l29216P01440k0480j111040
4955A496064J609728m72064P66976P32160K64192R216J307648l46112J287680
$$ plain form
5024 2491392 2682880 3406336 1892864 1040384 2248704 2006528 1929728 1699840 2048000
5015 2048000 2147840 987648 1169408 1513472 1134080 1551872 2280448 1128448 2007040 2976256
5005 2976256 1771520 1709568 1675264 1265664 971776 1874944 1858048 1230336 1753600 2241024
4995 2241024 2018816 1915904 1592320 1894912 2533888 2851328 2425856 1679360 1763328 2165248
4985 2165248 2377216 2533888 1989120 2199552 1951232 1965568 1798656 1556480 1956864 3222528
4975 3222528 1431040 2420736 2337792 1913344 1864704 2838016 2126336 1667072 2401792 1559040
4965 1559040 1299968 1614848 2363392 2782720 2789888 2255360 1926144 2627584 2607104 1496064
4955 1496064 3105792 2633728 3400704 4132864 4397056 4406272 5713920 5367808 6655488
4946F655488j533440k76480N86752k026496J03936p7312j487360n81632J233920
4937B597376j068544K31936o7072J29024M83840p48032l3280R81504n80608P39328
4927B665472j16224p8336k17600r18528Q45312o49216J362944n33504j58208m48512
4917A753600P9360L54816r62048N72416m85376R5232P40352r33376n57056J044480
4907A702400n02784O19520J54624k57536n12512J234944o50240l96800k47296
4898A144320P36768p64416J473536j53088m44928l56352J57184N84192p27552
4889A649664l99360J059840q42240J078784I41056O12864j86368Q67840r02656
4880A332736R42592k86720q07424L60960J058816k92352o07744m48512J275392
$$ plain form
4946 6655488 5122048 4845568 5432320 3405824 3509760 3432448 1945088 1363456 2597376
4937 2597376 1528832 1760768 1693696 1822720 2306560 1558528 1525248 2506752 1926144 2665472
4927 2665472 2549248 2470912 2253312 1334784 2180096 1530880 2893824 2360320 2202112 1753600
4917 1753600 1832960 2187776 1225728 1798144 1312768 1408000 2148352 1214976 657920 1702400
4907 1702400 1199616 1819136 1973760 1716224 1203712 2438656 1788416 1391616 1144320
4898 1144320 1881088 1116672 2590208 2437120 1992192 1635840 1793024 2377216 1649664
4889 1649664 1250304 2310144 1467904 2546688 941056 1553920 1367552 2235392 1332736
4880 1332736 2275328 1988608 1181184 1542144 2600960 2308608 1700864 1252352 2527744
4871B527744m47488q36608j50016K29888j92000P14752O65600j182720J352192
4862B681344j094144k15040J319424p95136k55488K01728L63008m72064R8816
4853A832448k79552J201664n41696J6384m58752J8944j43872L8912l63008J86368
4843A507840J039360A270272K6112J398784j102848P3216p02464Q59136K30400
4834B052608n17120J87904J16736O38464l73760m73600L12832J49504O06720o62016
4824B038272r9840j75616P93088j36704l79904l96800J382400j273856O65088
4815B416128j020416R08800k23232K9696l68640K77504n00736N6320J28512n43232
4805A160704L86048K18112M14208q03840K63168j44896P61344j92000P16288p71584
$$ plain form
4871 2527744 2080256 1243648 1093632 1323520 1131520 1846272 2511872 1329152 2681344
4862 2681344 1587200 1372160 2691584 1896448 1640960 1842688 2205696 1733632 1832448
4853 1832448 1552896 2754560 2212864 2229248 1770496 1789440 1645568 1684480 1321472 1507840
4843 1507840 2547200 1270272 1296384 2695168 1592320 1665536 963072 1822208 2052608
4834 2052608 1535488 1723392 1840128 2478592 2104832 1631232 1944064 2093568 2700288 2038272
4824 2038272 1938432 1762816 2555904 2419200 2039296 1642496 3024896 1751040 2416128
4815 2416128 1395712 2304512 2081280 2110976 1742336 2019840 1519104 1575424 1703936 1160704
4805 1160704 1546752 1764864 2179072 1375232 1638400 1493504 2254848 2062848 2779136 2007552
4795B007552O22080j020416R18016J12128N50400q94464J98144j83296O60992
4786B971136m43904l75808o60992N49888R25184j65888o33856M4544R8816L79392
4776B688512M4032j049600O37440L16416j97120o05696N47840M59264l06176L75296
4766B910208m00384l41504J408512m80256j45408p98720M74112j19296R51296
4757C458560l02592p70560j020928L89632R24672j065984R05728A200128J224192
4748B424320J82272J86880k72384l21536p41888Q11008p84384R01120r02144P3728
4738A556992J22368L30752J90464L60960r00608Q44800R3184r91232p0656N0176
4728A587200R88672J075712j234944l99872N37600J26464j16224J2800L6352r29792
$$ plain form
4795 2007552 2629632 1609216 2527232 2639360 3189760 2295296 2493440 2310144 2971136
4786 2971136 2527232 2151424 1490432 2040320 2965504 2799616 2165760 2210304 2309120 2688512
4776 2688512 2732544 1682944 2320384 2636800 2439680 1833984 2381824 2841088 2534912 2910208
4766 2910208 2509824 2168320 3576832 3096576 2951168 2152448 2626560 2507264 3458560
4757 3458560 3155968 2385408 1364480 1754112 2678784 1612800 2518528 1200128 2424320
4748 2424320 2606592 2793472 2521088 2199552 1457664 2268672 1484288 2385408 1483264 1556992
4738 1556992 1679360 2010112 2200576 2561536 1660928 2505728 2598912 1607680 1537024 1587200
4728 1587200 2575872 3651584 2416640 2016768 2554368 2680832 2564608 2577408 2613760 1683968
4718A683968L2256J174528o38464o25152L37920M59264n3248N6832l03104O96832
4708B821632r04192K48832J536K85696O40512m7104j241600J13664J275904q22784
4698B372096K76992q0896k52928P88992J87392J82272j193472m49024M57728J282560
4688C571712A596416J212928Q12544n49888l32288K67776j126400Q09472R53344
4679C643904j192448J428480j194496k22208r98912K209280m63360l74272N00736
4670C336704p48032J121792j15200l67104n02272m76160M31616J030656m01408
4661C310592j590272J199104J63328O44096j374208R70240O14400o71744l23584
4652B941952O88640N62688j411072M44416O44096j214464O58944R54880j160192
$$ plain form
4718 1683968 1716224 2890752 2252288 1627136 1965056 2424320 2371072 2427904 2124800 2821632
4708 2821632 1917440 2166272 2167808 2453504 3094016 3046912 1805312 1918976 3194880 2372096
4698 2372096 2649088 2568192 2315264 3104256 3291648 3473920 2280448 1831424 2289152 3571712
4688 3571712 1596416 2809344 3621888 3072000 2739712 3007488 1881088 2690560 3643904
4679 3643904 2451456 3879936 2685440 2463232 1464320 3673600 3210240 2835968 3336704
4670 3336704 2588672 3710464 3595264 3228160 2725888 2249728 2681344 3712000 3310592
4661 3310592 1720320 2919424 3082752 3726848 2352640 3322880 3937280 3265536 2941952
4652 2941952 3630592 4193280 2782208 3226624 3870720 2656256 3315200 4270080 3109888
4643C109888k85696J054720j33120m96128O47168n38624k81088L50208k04800
4634C222528k95936L00544j25440q46336L34336P58784M74112j143808J054720
4625C733504q46336k88768K06336L35360p39328O05184J15712n32992k23232k04288
4615B161152R0624M15744N93920m18304P15776l7888j99680r89184n73440R05216
4605B663936o18496Q45824p36256j99680k17600Q51968r91744J699328J1776r03680
4595B405376k60608m4544P05536j77152O08256n23776k64704L04640j236480O15936
4585B132480Q66304N06880j035264N5808J03936R54368l22048j33632n01760k71360
4575B355712O64064k68288n65760Q95488M03456r44640K38080j82272m31104J433600
$$ plain form
4643 3109888 2824192 3878912 3745792 3249664 3896832 3358208 3077120 3427328 3222528
4634 3222528 2926592 3227136 3101696 2255360 2589696 3348480 3822592 2678784 3733504
4625 3733504 2887168 2598400 2804736 3140096 2400768 3005952 3121664 2588672 2365440 2161152
4615 2161152 2251776 2667520 3261440 2843136 3558912 3521024 3321344 2332160 1758720 2663936
4605 2663936 2045440 2891264 2155008 1955328 1737728 2589696 1597952 3297280 3309056 2405376
4595 2405376 2144768 2100224 2805760 2628608 3236864 2713088 2448384 2753024 1516544 2132480
4585 2132480 2998784 3505664 2470400 2526208 2630144 3584512 3262464 3128832 2627072 2355712
4575 2355712 3019776 2751488 2185728 3081216 3484672 2540032 2778112 2595840 2164736 3598336
4565C598336K3040j225728L21536Q46336l3792L87584q21248J03936k28864J43360
4555C114496K64192l54816L66592o0928L11296r93792Q91392j89952P73120j789440
4545B332160J002496k62144K95936K28352l17952J34144R18016j533440k63680
4536B533888Q64256m23424N1712Q02304j210368J050624q45312K40640M68992
4527C533312k95936j106432Q50944r45664J079296o83008L75296M02432o4000
4518C146240J86368K77504r20576r33888R85600N15584n44256J37216j87392P0144
4508B732544P5264k90304L35872k5088N09440q02304n48352O26688M15232r34912
4498B094080J506304j394176J50528M90496j79200L07712J083392n77024k97472
$$ plain form
4565 3598336 3621376 2395648 2717184 3563520 3529728 3917312 3096064 3200000 2971136 3114496
4555 3114496 3378688 3023872 3390464 3329536 3640832 2647040 3538432 3348480 4121600 2332160
4545 2332160 3334656 3072512 3368448 3596800 3278848 3412992 4331008 2797568 2533888
4536 2533888 3398144 2974720 3026432 3828736 2618368 3668992 2823680 3064320 3533312
4527 3533312 3237376 2130944 2981888 2036224 3115520 2432512 2807808 3210240 3146240
4518 3146240 3332608 3610112 2689536 1755648 2741248 3256832 2712576 2849792 2662400 2732544
4508 2732544 2807808 2517504 2853376 2828288 3337728 2535424 1987072 2613760 3028992 2094080
4498 2094080 3600384 2206208 2356736 2847232 2668032 2975744 4059136 3482112 3184640
4489C184640J135616j143808J40288J257984j476608M82816L19488j770496R04704
4480C034624J040896j102336O9120j71008p53664Q34560o80960m7104n33504J312256
4470C002880n78560K7648O43072L56864j353728R96864k63168l13344N20704P36768
4460C776000m73600M84352j440256J247232k54976M18816K58560j034240Q41216
4451C823104k60608k24256K47296L60960l86560P07584r28256J84832m58752J69984
4441C235328j068544J043456J4336k560m90496J298944M57216j07520l47648J25952
4431D158464j99168l60448O63040j009664M30080r19040L49184L59424N22240
4422C994112m01408q704K50368o77888P38816j62304n88288P42912l59936R68704
$$ plain form
4489 3184640 4320256 3176448 3316736 4574720 3098112 3580928 3900416 2129920 3034624
4480 3034624 4075520 2973184 3042304 2871296 2117632 2952192 2271232 2224128 1690624 3002880
4470 3002880 2424320 2451968 3095040 3451904 2098176 3095040 2831872 2518528 3039232 3776000
4460 3776000 3302400 3786752 2346496 3593728 3338752 3757568 4016128 2981888 3823104
4451 3823104 3562496 3338240 3585536 3946496 3559936 4267520 3339264 3524096 3065344 3235328
4441 3235328 2166784 3210240 3224576 3222016 2731520 4030464 4487680 4380160 4032512 4158464
4431 4158464 3959296 3598848 4261888 3252224 3682304 2763264 3112448 3471872 3994112
4422 3994112 3592704 3584000 3834368 3156480 3895296 3732992 3144704 3887616 3527680 4496384
4412D496384r20576L69664L31264j465856J230336L39456j297920J027072n27872
4403C581952M11136L19488k86208K84672P43936j981440J472512J16224q48896
4394C813376j2288J08032K4064P78240k41664Q16640j395712k89280J674240j125888
4384D149760Q94976J261568m37248j711616K05824M82304K85696j617920J677824
4375E191168L85536j607680J281024k58560n4784J45408k24768p36768N03296
4366D623872P31648m84864K61120K64192l81440J006592m06528j042944L54816
4357D926464j63328P6288N43744j280512J680896k324992J446400p09120K65216
4348D461056j413120M43904O01088J26976l79392n22752M85376M95104k53952
$$ plain form
4412 4496384 3575808 3945472 4276736 2810880 4041216 4380672 3082752 4109824 3581952
4403 3581952 3993088 4312576 4026368 4311040 5054976 3073536 4546048 4662272 3813376
4394 3813376 3801088 3909120 3933184 4711424 4469760 5286400 3890688 3601408 5275648 4149760
4384 4149760 5044736 6306304 5869056 4157440 4363264 4845568 5131264 3513344 5191168
4375 5191168 5576704 3969024 5250048 4991488 4936704 5082112 4857344 4120576 4623872
4366 4623872 5355520 4870656 5131776 5395968 5014528 6021120 5614592 4571648 4926464
4357 4926464 4763136 4839424 5383168 4102656 5783552 3458560 4904960 4195840 4461056
4348 4461056 3047936 3491840 4092928 4219904 3840512 3317760 3803136 4298240 4044288
4339D044288o26688M65408q05376R85600q25856O75328k95424j470464R98400
4330C145216Q38144q82688P32672o52288M91008l60448L43552k19136p24992Q21248
4320C532288m83840m41856O70720l15904l87072k94912M22912J60768k30912Q19712
4310C451904n23264O69184o51264n45280R84576q40192K57024o69184R28256M27008
4300C488768q67840R99424l33824j09056J62816l60960k40128l15904M60288P46496
4290C630080o00064Q33024j283072J97120j85344P98720l33312j32608p6288K43712
4280C091968j30048M3008P96672q39168O32832m48000L75808L9936l4304q96000
4270B632704J098752l93216L28192m7104k55488j16736L36896P39328M096j413120
$$ plain form
4339 4044288 3417600 3883008 3077632 4063232 3237376 3912704 3617280 2146816 3145216
4330 3145216 3983360 3100672 3833344 3181056 3672064 3311616 3655168 3436032 2711040 3532288
4320 3532288 3048448 2606592 3277312 2961408 2574336 2279424 2702336 2863104 2632192 3451904
4310 3451904 2928640 3597824 2946560 2401280 3385856 2545664 2802688 2133504 3061760 3488768
4300 3488768 2620928 3620352 3286528 3177472 3340288 2979328 2739200 2423296 2883584 3630080
4290 3630080 3030016 3863040 2579968 2777088 2591744 3390464 3057152 2924544 2848256 3091968
4280 3091968 2961920 3004928 3801600 2962432 3595264 3147264 3523072 3563008 3528704 2632704
4270 2632704 3731456 3338240 3666432 3619328 3363840 3247104 3584000 4323328 4327424 2914304
4260B914304j15712N12000N39648j110528j2800m66944J299456R0624k0992j038848
4250B590208J797120p93088K39616l1232n87776p57248J728000p30112L17440
4241C772928j74080K29376q60160R35936n67296l94752M73088N80096j257984
4232B737152O33856L68128r17504p2192L49696k04800L67104k29888M23936L15904
4222C771392J15200J367040j380864j370624P27552K29888o60480J208320p97184
4213C210240J318912r46176m23424K88768J124864n79072R17504j038336l73248
4204C500032p56736O19520L14368m06528K17088L20000k22208o07232M79744R36960
4194D395008j057280L82464l52768J175552j022464k04800L05152K66240q1408
$$ plain form
4260 2914304 2798592 3310592 3850240 2739712 2726912 2259968 3559424 3650048 3629056 2590208
4250 2590208 4387328 3594240 3833856 3802624 3214848 2457600 4185600 3455488 3772928
4241 3772928 3598848 3828224 2968064 3904000 3336704 2941952 3415040 3995136 2737152
4232 2737152 3371008 3739136 2821632 2749440 3099136 2894336 3261440 3031552 3455488 3771392
4222 3771392 3886592 5253632 3872768 2502144 3229696 3459584 2799104 4007424 3210240
4213 3210240 4529152 3582976 3159552 3448320 4573184 3994112 4911616 3873280 3500032
4204 3500032 2743296 3362816 3677184 3270656 3487744 3807744 3585536 2978304 3458048 4395008
4194 4395008 3337728 3720192 3367424 4542976 3520512 3315712 3620864 3887104 3805696
4185C805696k33472J26464O21056n35040M42880j228288N71392J27488L95776
4176D093952r10848Q71424J26976m74624J9968k16064k560l07200J78176R82016
4166D361216r83040k37568J491968M11648r51808j053184J862656j48480j763328
4157B990080J135616k91328j00352k20672N70368l3280L77344j404928J54112
4148C176960M86912P4240R76896q27904n05856L66592J61280R97376k48320K48320
4138D906496L59936j640448P44960m096j23904m77184O57920l3280O69184j505792
4128C553792J223680J86368L71200K25280n98528O87616j669632J272832j303040
4119C949568J479680p47008J500160l90144p75168L44064J598464k098688R61536
$$ plain form
4185 3805696 3572224 3698688 4319744 3784704 4227584 2999296 3570688 3698176 4093952
4176 4093952 3183104 4054528 4181504 3706880 3726848 3510784 3508224 3201024 3379200 4361216
4166 4361216 3378176 3140608 4632576 5044224 4092416 3039232 4901888 4753408 2990080
4157 2990080 4125696 3834368 3734016 3513344 4083712 4050432 4427776 3022848 3176960
4148 3176960 3663872 3738112 4715008 3887104 3381248 3747840 3909120 4906496 4658176 4906496
4138 4906496 5266432 3625984 4370944 4366848 4242944 3765760 4423680 4390400 5059584 3553792
4128 3553792 4777472 4963840 5335040 5560320 4961792 5649408 3979776 5252608 3949568
4119 3949568 5429248 4682240 6182400 5792256 5017088 5361152 6959616 4860928 5822464
4110E822464P83872o5024m99712K68288j54112L82976K31424K95936J94048j492480
4100E767680J389568p3216m15744o76352Q229376F807552K04288P09120k6624
4091G694336l98336P10656j170432J623552q75008Q60672k4576R22624l46624
4082H996864L71200J92000O46656j22368R27744J55648j007104J585152n04832
4073A1240960P46496J582592k04800q08448J604096K9184k92864K66240J501696
4064A5665152j412096J710592p42400R3696J463296O10816P15776L07712M3008
4055A8455552m85888K70848n19680m52608j841664J172992j144320j211392j268736
4046A2975104J83296p42400J10080j253376l88608K59584j06496k215936r58464
$$ plain form
4110 5822464 6606336 6541312 6041600 6309888 6155776 6538752 6770176 7066112 7260160 5767680
4100 5767680 7157248 7084032 6668288 5991936 14221312 6807552 7011840 7720960 7694336
4091 7694336 7296000 8006656 6836224 8459776 7584768 8445440 8420864 9343488 8996864
4082 8996864 9368064 9560064 10206720 10084352 11012096 11167744 10160640 11745792 11240960
4073 11240960 11987456 13570048 13365248 12556800 14160896 14190080 13897216 14163456 15665152
4064 15665152 14253056 15963648 15221248 15314944 16778240 17389056 18104832 18412544 18455552
4055 18455552 17969664 18240512 17720832 17268224 15426560 16599552 15455232 14243840 12975104
4046 12975104 13158400 12416000 12526080 11272704 10884096 11143680 11037184 8821248 7862784
4037G862784k89280j607168j6384j03936N76000o91200n65248M54144J97632N71392
4027F388736q37120o60992q0384R728k2528n56032J122816m82816K11456J86880
4017E279744p77728Q44288k15552j05472k27328J80224L63008P0656r28256j94048
4007D289536M70528m04480P0144Q96000n91360Q48384j157632O71232m95104N81632
3997E178880j82272m58752J037824Q192m65408o01088m69504N42720L01056p27040
3987D164608R0624j92512n632Q84736M37248o44608n06880L83488o06720J325056
3977E329408o42560m88448o8096Q8064k16064k36544O76864J018880n26848o28224
3967D306432J018368j038848J047552j175040m28032K69824r98400J221120K40640
$$ plain form
4037 7862784 7573504 5966336 5949952 5846016 6422016 5730816 5165568 5619712 5817344 6388736
4027 6388736 5551616 4890624 4810240 4819968 4797440 4241408 5364224 4881408 5092864 5279744
4017 5279744 4502016 5346304 5130752 5025280 4797952 4978176 5341184 5411840 4483584 4289536
4007 4289536 4760064 4355584 4425728 5321728 4730368 5578752 4421120 5092352 4597248 5178880
3997 5178880 4996608 4537856 5575680 5583872 5118464 4517376 4047872 4590592 4891648 4164608
3987 4164608 4255232 4062720 4057088 4941824 5379072 4734464 4227584 4611072 4004352 5329408
3977 5329408 4686848 4198400 4130304 4218368 4002304 3765760 4442624 5461504 4934656 4306432
3967 4306432 5324800 4285952 5333504 4158464 3730432 4000256 3001856 4222976 4463616
3958D463616m47488R92256o20544L90656k06848j026048N98528O70208j331712
3949C482624J614848o47168l94752N65760r07776N30432j149952J513984R14944
3940E522944j787392Q2944n43744J065472J75616K85696n85728j9456J614848
3931E811200l75296l18976m21376o71744J491456j129984Q40704n24800j68448
3922D532736J72032q51968j32096k99008J743872o67136k51904q56064O73792
3913D064256k53952J33632O14400j08032J95072L1232L17952n92896m84352J48992
3903D066304P54688m10624L7888n7344k6112L45088m84352q52992M55680J289216
3893E117440m67968o60992j14176j33120J578496r22624l55840O1952J065472
$$ plain form
3958 4463616 4016128 5008384 4387840 4778496 4571648 3545600 4144128 4814336 3482624
3949 3482624 5097472 4450304 4055552 4621312 3713536 4243968 3094016 4608000 5522944
3940 5522944 3735552 3818496 3274752 4340224 4515840 4801536 4215808 4196352 5811200
3931 5811200 5435904 5116928 4695552 4023808 5515264 4385280 5225984 4701184 4532736
3922 4532736 4704768 3852800 3720704 3421696 5165568 4498432 4246528 3390464 4064256
3913 4064256 3810304 3943936 4558336 4450304 4645376 4676608 4994560 4401664 3917312 4066304
3903 4066304 4820992 4410368 4448256 4390912 4364800 4709888 4225536 3372544 3828224 5117440
3893 5117440 4649472 3988480 3874304 3741184 5319680 4397056 4041216 4103168 5168640
3884E168640j30560p50592K75456o93248J178112p29088M4544J55648k9696N52960
3874E042176m40320M62336L48160o36928j129984J501696r01632O14400p01952
3865D157952J131008n06880p05024R25696J11104j21344q28928J036288j239040
3856C960832K593792k170880N15072N56032K18112m30592p78752m57728N63712
3847D569600J152000j169920R86112M19840j506816N73952N56032l46624J00864
3838E335040O9120m20864N58080k78016N86752n52448m70016o6048J465856j177600
3828E049856J26464N25824L55840n37600j025024N99040N77024M87936j207296
3819D952064J001984j562624J647616J81760l77344N72928k01216n68832R72288
$$ plain form
3884 5168640 5038080 4287488 4562944 3869696 5047808 4318720 4363264 4518912 4489216 5042176
3874 5042176 4601856 5064192 5412352 4775424 3645440 5147136 4245504 4859904 4157952
3865 4157952 5288960 4782080 4077056 5002752 5113856 4992512 4163584 5199872 3960832
3856 3960832 6554624 4383744 4898816 5454848 5672960 5242368 4463616 4005888 4569600
3847 4569600 5721600 4551680 5537792 5957632 4450816 5024768 5580800 5234176 5335040
3838 5335040 5404160 4983296 5541376 5263360 5850112 5297664 4827648 4761600 6227456 5049856
3828 5049856 5176320 5702144 6057984 5520384 4495360 5094400 5671424 6159360 4952064
3819 4952064 5954048 4391424 6039040 6220800 5843456 6416384 6215168 5646336 6618624
3810F618624J5360j22368l23072k11456J060352q08448n12Q77568M1984k82624
3800F865408J340928j34656j014272R01632K73920M93568J80224j18272m96640
3791H291840K147840j183744M40832J072128j465856K35520J000960k96960P93088
3782A1035648l4816r20064J586176L31776M79232J925632P3728N04320J163264
3773A6144896J253376R75360n79072J138688l40992K576384k56512O84544L87584
3764B1984256P93088J631232j102848J708032J608192M55168l53280R56416J975808
3755B9656064K96448J516544J66912p1680p71584j297408k110976j867776p59808
3746B4756736q15616k132992l532800p16288l25120j026048N98016q76544j453056
$$ plain form
3810 6618624 6633984 6511616 6188544 5977088 7037440 6228992 6228480 7106048 7148032 6865408
3800 6865408 8206336 8071680 7057408 7959040 8232960 8726528 8906752 8788480 8291840
3791 8291840 10439680 9255936 9696768 10768896 9303040 9538560 10539520 10242560 11035648
3782 11035648 11000832 10080768 11666944 11998720 12477952 14403584 14477312 14981632 16144896
3773 16144896 17398272 18373632 17794560 18933248 18592256 21168640 20912128 21596672 21984256
3764 21984256 22777344 24408576 23305728 25013760 26621952 27077120 26723840 27680256 29656064
3755 29656064 29952512 31469056 31635968 31564288 30792704 29495296 27384320 25516544 24756736
3746 24756736 23941120 21808128 18275328 17559040 17233920 16207872 16805888 15929344 14476288
3737A4476288J05984j264128n12512j391616j55136O10304j116672K288640j697792
3728A1343360K21696R78944q82688Q2944q80640R4720J85344n51424K185216q04352
3718A1973120r23648M13184R70752m11648L61472Q50944r2160K511360K160128
3709A7813504J003008J530880o19520j463808k008576j992192k602496n2224r25184
3700A0683392q91904M41344l28704j1264Q13568Q51456j779200P09120o06208
3691I881600Q24320n00224L11296M14720p66976N1200l07712k73408M10112j36192
3681I908736m48000N39648J316352k92352Q87296j035776J125888j089024j954304
3672H958464M80768m80768j96096j061376k71872N31456j815552J689600p57760
$$ plain form
3737 14476288 14582272 13318144 12805632 11414016 11258880 11869184 10752512 13041152 11343360
3728 11343360 11565056 12544000 11661312 11744256 10863616 10958336 11143680 10592256 12777472 11973120
3718 11973120 11049472 11462656 12433408 12021760 12383232 13234176 13142016 15653376 17813504
3709 17813504 18816512 20347392 19727872 18264064 16255488 14263296 11660800 11608576 10683392
3700 10683392 9791488 10232832 9904128 9892864 10706432 11557888 9778688 10487808 9881600
3691 9881600 10705920 10205696 10516992 10931712 10164736 10215936 9908224 9634816 10044928 9908736
3681 9908736 9460736 10000384 11316736 11024384 11911680 10875904 12001792 10912768 8958464
3672 8958464 9439232 8958464 8762368 7700992 7429120 7960576 6145024 7834624 7076864
3663G076864O62016p17312M39296l57376P34720n19168N4272P27040K85696p60320
3653G625728K94912l66080J77152j69984p20384J001472L50208n73952P26528
3644H345600j210368N71392k74944k27328M72576N02784o73280R96352K97472
3635H800256l22048N51424k88256j68960L93728N78560p92064M23424j40288K38080
3625I273856n58592M85376p29600n38624J125376o85568J297920m80256M08576
3616I598464P95136j183744K7648j54112L0208j2288L21024p07072O69696P79264
3606A0164224m93056m81280p37792l91168J047552N71904o4512J39776q42752
3597H912896N74464m0960j90976m64896J014784l62496m12160Q79616l0720o24640
$$ plain form
3663 7076864 7738880 7021568 7460864 7103488 7838208 7319040 7373312 8100352 8386048 7625728
3653 7625728 7920640 7554560 7731712 7561728 6841344 7842816 8193024 7619072 8345600
3644 8345600 7135232 7706624 7431680 7204352 7676928 8179712 7506432 8502784 8800256
3635 8800256 8478208 9029632 8741376 8572416 8966144 9544704 8752640 9176064 9035776 9273856
3625 9273856 8715264 9200640 8471040 7932416 9057792 8372224 9670144 9189888 9598464
3616 9598464 10393600 9209856 9237504 9083392 9113600 9101312 9422336 8715264 9384960 10164224
3606 10164224 9671168 9189888 8452096 8060928 9108480 9680384 9615872 9755648 8912896
3597 8912896 9487360 9446400 9255424 8790528 9805312 9442816 9030656 9910272 9879552 9254912
3587I254912O10304l08224J536j16224R67680L4304j73568K02752Q2944j139712
3577I416704J391104l26656n8368N94944p62880J338368q11008J246720j509376
3568A0519552N19680l76832l31776R64096P48544k52928O68160r47200N88288
3559A2099584r58976K35520J288704p28064M27520k88768P1168M9664J044992
3550A3241344J31584j212416J007616k56512l35872R00096O23616p96672j30048
3541A3172736K26304R26208p06048l87584M62848N8880Q7040P84384o14400J57696
3531A4168064J207296n63200P57248K73408j62816M92544P06048j34144p86432
3522A5958016j71520P74656J606144R40032j081344J537536n4784M79744l7888
$$ plain form
3587 9254912 9865216 9556992 9558528 9442304 10409984 10444288 10270720 10473472 10556416 9416704
3577 9416704 10807808 10481152 10422784 11017728 10254848 11593216 10782208 12028928 10519552
3568 10519552 11039232 10662400 10330624 11294720 12043264 11790336 12458496 11511296 12099584
3559 12099584 11140608 11376128 12664832 11936768 12364288 12075520 12146688 12196352 13241344
3550 13241344 13372928 12160512 13168128 12911616 12575744 13475840 14099456 13302784 13172736
3541 13172736 13399040 14325248 13619200 13231616 13694464 13753344 13840384 14624768 14010368 14168064
3531 14168064 15375360 14812160 15569408 15842816 15680000 16172544 16878592 16744448 15958016
3522 15958016 15786496 16561152 18167296 19107328 18025984 19563520 19508736 19988480 19950592
3513A9950592q36096J921024P16288j96608J252352q78592J832960j08544J112576
3504B4765952O63040J663488k46272j55136J269760k15040K155008K2016N83680
3495C0506496J507328K335744k68800J611264J158144K880000J201152J480704
3487D2412032K307072K200064J082368J405440L833856K613760K370048L397120
3479F1621760M736512M956160M093440O814208N746176O373888Q473600O472704
3471A09288448Q890368Q406528R147904J0988544J1114496J1389440J4815232
3464A84040960J5011328J7813504K0882944K5554432L0064128L8715904M4781056
3457C76864256O0155904P9391232J07377664J39877888J67464960J60688640J01390848
$$ plain form
3513 19950592 19114496 21035520 21751808 21555200 22807552 21928960 23761920 23653376 24765952
3504 24765952 25428992 27092480 26846208 26691072 27960832 27745792 29900800 29922816 30506496
3495 30506496 32013824 34349568 34080768 35692032 36850176 39730176 40931328 42412032
3487 42412032 44719104 46919168 48001536 49406976 53240832 55854592 58224640 61621760
3479 61621760 66358272 71314432 75407872 82222080 87968256 94342144 102815744 109288448
3471 109288448 118178816 126585344 135733248 146721792 157836288 169225728 184040960
3464 184040960 199052288 216865792 237748736 263303168 293367296 332083200 376864256
3457 376864256 437020160 516411392 623789056 763666944 931131904 1091820544 1193211392
3450A193211392J1471872q2733056j55195392j89967360j82240256j48021248
3444D46525952j10575616p8697472n3331968l8219264k8728320j9685376j5714304
3437A01573632j3337600r317376q365056o103552o351872n371392m453376l673600
3429D4599808j368064l650048j302016k345984k983424j607680j273856j206272
3421B8862464k303488N18144j257472j775616j307648l9424l03104j089024j841152
3412A9463680n16096M53120j911296J80736m87936l27168n17120J021440k093056
3403A5266304j27488l47648q12032R8816k73408j119232K02752j015808j24928
3394A1747328l66080K58048n08416j347584P99744l82976m83840j44896M44928
$$ plain form
3450 1193211392 1204683264 1121950208 966754816 776787456 594547200 446525952
3444 446525952 335950336 257252864 203920896 165701632 136973312 117287936 101573632
3437 101573632 88236032 78918656 70553600 64450048 58098176 52726784 48273408 44599808
3429 44599808 43231744 39581696 38279680 35933696 32950272 31342592 30068736 28862464
3421 28862464 26558976 27077120 25819648 24044032 22736384 22696960 22393856 21304832 19463680
3412 19463680 18947584 19400704 17489408 17670144 17182208 16855040 16337920 17359360 15266304
3403 15266304 15138816 14791168 13979136 14077952 13804544 12685312 12888064 11872256 11747328
3394 11747328 11381248 11639296 11130880 9783296 10583040 10200064 9716224 9571328 10016256
3385A0016256n1200j476608P43936K45248r74336J040384j100800m58752J489408
3376I473536j558528l23072l18464R67168o82496J097216k393600K226176j60768
3367H327168j196032l54304k30912L22048j236992P19872p52640Q08960l91168
3358F016000j1776m33664o55360j55648J03424N12000r67680J641984j563648
3349D485632j90464R17504j56160j79200P07072j334272L13856L32800j81248
3340D715520N47840o2464o89664R62048l58400k86720K66240j469952J28000O97856
3330D450304J2288K53440m68992J28512p3216p13216O38976N54496M70016p09632
3320D542976j137664J373696n03296j657856K395136j379328O27200o6560L77344
$$ plain form
3385 10016256 9965056 8488448 9232384 9477632 8503296 9543680 8442880 7984128 9473536
3376 9473536 7915008 7591936 7273472 8240640 7558144 8655360 6261760 8487936 8327168
3367 8327168 7131136 6776832 6545920 6867968 5630976 6350848 5598208 6407168 6016000
3358 6016000 6004224 5570560 4915200 4759552 4862976 5374976 4407296 6049280 4485632
3349 4485632 4295168 5212672 5056512 4877312 5584384 4250112 4563968 4896768 4715520
3340 4715520 5263360 5200896 4511232 5473280 5114880 4828160 5094400 3624448 3752448 4450304
3330 4450304 4462592 4716032 4247040 4375552 4302336 3589120 4228096 4782592 5252608 4542976
3320 4542976 3405312 4779008 4275712 2617856 5012992 3633664 4260864 4194304 4571648
3311D571648k54464k94912Q07936p27552K11968j009152J424896j21344q86272
3302C722752j54624p0144M32128k560N1712K64192p84384M68480P06048j36192
3292D497408q12544J120256j108992M70016j89952m5056M096j521664Q34560q30976
3282B417152N74464k2528L69152n41184k81600N15584K43200l49184o94784R10336
3272C140608m91520M20352q0896K48832P90528L02592m40320J35168M45440m07552
3262D063232K75456J5872O86592j250304J722368j188352L69152J79200q44288
3253D028928j70496O55360j086464O98368j309184L53280O28736q86784k33472
3244B678272Q37632l41504K6112p680K82624L38944k78016K12992j073152N44768
$$ plain form
3311 4571648 4317184 4022272 4830208 4102656 4314624 3305472 4730368 4609024 3722752
3302 3722752 3568128 3497984 3930112 3927552 3979264 4243456 3459072 3927552 4633600 4497408
3292 4497408 3684864 4805120 3696128 4166144 3976192 3931136 3935232 2413568 3248128 2417152
3282 2417152 2991616 2969088 3338240 2797056 2515456 3031040 3274240 2925056 2230272 3140608
3272 3140608 2649088 3069440 2988544 3237376 4027904 4330496 3890176 4025344 4470784 4063232
3262 4063232 4338688 4354560 5041152 3790848 5513216 4324864 4694016 4873216 4028928
3253 4028928 3858432 4513792 3427328 4125696 2816512 3169792 3798528 2911744 2678272
3244 2678272 3515904 3174400 3200512 3192832 3475456 3814400 3536384 3749376 2676224 3220992
3234C220992P27040l12832o00576m8128M00896Q58112r01120J061376M81792J5360
3224D902912N41184k44736L55840Q9600M02432J121280k88768P36256n16096L24096
3214G424000N86240N71392J06496j0240M30080r39008J536000J29536m18816J99168
3204I614848J58208K63680M73088P77216p20896J007616j35168K81600O89152
3195A2409344k04800p35232R22112K97472J056256n01760P34208Q1920N77024
3186A4636544n53984O20032J44384R42592j262592K07360J226752L15904n00736
3177A5776256K122240o99904K62144L14368p24992J639424J205760q29440R40032
3168B0005888N99552K6624J87904J415168Q9600J021440k73408M62848M54656
$$ plain form
3234 3220992 3948032 3635200 3034624 2986496 3387392 4245504 3344384 4405760 4887552 4902912
3224 4902912 5444096 5199360 5555200 5644800 6047232 7168512 6879744 7616000 7099904 7424000
3214 7424000 8010240 8581632 8688128 8677888 9107968 8168960 9704960 9834496 9415680 9614848
3204 9614848 9773056 10036736 10509824 11287040 10566144 11573760 11438592 11720192 12409344
3195 12409344 12204544 11469312 12391424 12688896 13745152 13243392 13977600 14059520 14636544
3186 14636544 14082560 14702592 14846976 15789568 14526976 14734336 15961088 16276992 15776256
3177 15776256 17898496 17198592 17460736 17775104 17050112 18689536 19895296 19065856 20005888
3168 20005888 20605440 20632064 20819968 22235136 22324736 23346176 23072768 23535616 23990272
3159B3990272O40000j30560L44576J379328m5056O20544n47840o1952K77504j168384
3149B5298432j592832j489920j916928j516032j5872j412096j206272o29248j994240
3140A3524992r93792j139200J07008j117184j352192N42208j296896L1744K40128
3131H546816j89440M72064j224192L36384K048j048064R0624J006080j069056
3122F923264o54848K028544o17472J9968m12672K4576J132544r53344J080832
3113H571392m24448m27520M44416J71520N48352k05312n29920j434112K740224
3104I454592j380864J6896M29568j160192R09824K20160l41504M63360m04992
3095H206848j71008o23616K699264P09120J381888P90528m28544j262080n05344
$$ plain form
3159 23990272 24630272 24499712 24844288 26223616 26178560 26799104 26251264 26189312 26466816 25298432
3149 25298432 23705600 22215680 20298752 18782720 18766848 17354752 16148480 15519232 13524992
3140 13524992 12531200 11392000 11499008 10381824 9029632 9571840 8274944 8306688 8546816
3131 8546816 8357376 8829440 7605248 7941632 7943680 6895616 6986240 7992320 6923264
3122 6923264 6268416 8296960 7679488 7699456 7286784 7311360 8443904 7490560 8571392
3113 8571392 8146944 7719424 8163840 8335360 8883712 8678400 8148480 6714368 9454592
3104 9454592 8073728 8090624 8520192 7360000 8269824 8489984 8148480 8611840 8206848
3095 8206848 8035840 7412224 10111488 10820608 12202496 12993024 12564480 11302400 10797056
3086A0797056m66432k025984J017344j118720j477120k25280O92736P09120j547264
3077F355456Q0384j142784L3792k58560R52832p7312K76480l04128J01376K17088
3067F234624l48672L12832K18112j814016M87424J029120j248256J397760r96352
3058E272576L06688J6384j02912m52096Q48896l50720k36032J188352j435648
3049E055488O42048M52608j21856N57056r8816L26144j31584O94784j12640K63168
3039G526400J55136j07008J300480M49536Q52480K122240L224576M457984K100736
3030B2082560J118720P61856q83712j308672l843584n035008l147264j962496
3022G782400K7648r85088o14912j77152P24992n17120l27168j40800j46432k81088
$$ plain form
3086 10797056 10330624 8304640 9321984 8203264 6726144 6500864 7193600 7902720 6355456
3077 6355456 6435840 5293056 5326848 5068288 6021120 5943808 6220288 5916160 6017536 6234624
3067 6234624 5885952 6198784 6416896 4602880 5090304 6119424 4871168 6268928 5272576
3058 5272576 5579264 5595648 5492736 5040640 5889536 5538816 5302784 6491136 5055488
3049 5055488 5697536 6150144 6028288 6585344 6486528 6812672 6681088 7375872 7263232 7526400
3039 7526400 7681536 7574528 8875008 9324544 10177024 12299264 15523840 19981824 22082560
3030 22082560 23201280 23963136 23079424 21770752 17927168 12892160 9744896 7782400
3022 7782400 7810048 6824960 6210048 6032896 6757888 6240768 5913600 5772800 5626368 5345280
3012E345280L73248J11616n75488R13408j216512K18112o5536P63904l25120k81600
3002E261312M72576j574400K550272k963456Q59136K88256Q66816k4576J980416
2993G716352j505792K77504m13696m27520P680o55360L85024l5328n90336J82272
2983D940800k38592m92032K17600Q05376j214464P45472J061888j310720R75360
2974E490688m70528L28192M4544o31808J31584J403904j841664K84672O81984
2965E421568j109504N92896o7584O78400n22752o35904J3312P55712j475584Q19712
2955D470272J806336j217536n69344J34656O70720l6352k47296k02240N10464
2946E319680j069056k45248J436672p77728o90176K62144Q79616n96480J329152
$$ plain form
3012 5345280 5718528 5830144 5254656 6168064 4951552 5169664 5104128 5868032 5542912 5261312
3002 5261312 5733888 4159488 6709760 3746304 4605440 4893696 5760512 5735936 7716352
2993 7716352 6210560 6488064 6074368 5646848 5654528 4999168 5384192 5348864 4758528 4940800
2983 4940800 4702208 4210176 4427776 5233152 4018688 4764160 5826048 4515328 5490688
2974 5490688 5020160 5348352 5392896 4761088 4892672 6296576 4454912 4739584 5421568
2965 5421568 4312064 4904960 4837376 5515776 4993024 4357120 4370432 5126144 3650560 4470272
2955 4470272 6276608 5059072 4489728 4624384 5295104 5258752 5011456 4809216 5319680
2946 5319680 4250624 4005376 5442048 4664320 3974144 4236288 5115904 4519424 5848576
2937E848576j156096J28000L10272J37216n63712m4032o80448J216512K45248
2928E441536m81792Q9600j38752L89632q19200R56416n39136J313792m59264L7376
2918E790208l06688j70496r8304l39456l91168J15200J101312n5808J094144m56192
2908F282752l30752k23232o2976L56864r87136R23136n0176l09760P68512J71520
2898F538752n1200m01920k36544O01600p44960N29920O33344P99744m86400K46784
2888G429120k36032n18656Q19200j64864Q1408J000448j205248J083392P55712
2879I044480m09600R22624J76640J090560J42336P48544N34016N91872o03648
2870A2237824L60960M12672K195968j263616J327616K6112J553408J300992P53152
$$ plain form
2937 5848576 4692480 4820480 5130752 5267968 4704256 4660224 3979776 5196288 5441536
2928 5441536 4959744 5049344 4910592 5300224 4481024 5437440 4898304 6212096 5752832 5790208
2918 5790208 5483520 5313024 5214720 4875264 4484096 4599296 5700608 5644800 6738944 6282752
2908 6282752 5952000 5728768 5665792 6022656 5035520 5958656 5908480 5598720 6367232 6538752
2898 6538752 6487552 6085632 5849088 6450688 5705728 6235648 6868992 7668736 7182336 7429120
2888 7429120 7193088 6674432 7493632 7328768 7410176 8410624 7205376 8288768 9044480
2879 9044480 8634880 9557504 9734144 10824704 10967040 11715584 12249600 12841472 12237824
2870 12237824 12598784 13011456 15207424 13943808 15271424 15297536 16850944 18151936 18905088
2861A8905088J672192L97824o48704J18272o03648J325056L3792j859584K76992
2852A9617280O26176j153024j80224Q29440k363392o56896p2704N95456j503744
2843A5738368m85376J62304j124864M46464j857536M13696l10784j008128n11488
2834A1462656n61664k10432j573376K90304p24480j046016P59808j180672L0208
2825G246336L82976N632L60448R9328k6624J961984k63168q26880J726464p680
2815A0658816K180096M144640Q303616N384704J255424n008896n678592p734784
2807A3505024l312640j579008r57952j154048l1232o35904L87584j029632J221632
2798F413824j048064o2976m17792M10624K69312o31296P65952j45920o67136L49184
$$ plain form
2861 18905088 20577280 20975104 20326400 20444672 19841024 21166080 21199872 19340288 19617280
2852 19617280 20243456 19090432 18910208 19739648 17376256 16719360 16646656 17242112 15738368
2843 15738368 15252992 15415296 14290432 14736896 12879360 13293056 12982272 11974144 11462656
2834 11462656 10900992 10690560 9117184 9407488 8683008 7636992 8396800 7216128 7246336
2825 7246336 7629312 7634944 7995392 8094720 8068096 10030080 9766912 8940032 10666496 10658816
2815 10658816 12838912 16983552 25287168 30671872 31927296 26918400 21239808 13505024
2807 13505024 10192384 8613376 7655424 6501376 6470144 5834240 6221824 5192192 6413824
2798 6413824 5365760 5302784 4884992 5295616 5564928 4933632 5699584 5553664 4886528 5235712
2788E235712p97184Q30464j326592J369088P9872k06336j190912J294336o53824
2779D634624o7584N28384o39488m94592p4240J555456j497088J305088o53824
2770D596736M83840K97472n84704n59104M1984K75456o2464L31264j21344p5776
2760D623360m51072K55488J409536j021440O656O44096m74624L73248r69216r8816
2750D297216K82624J300480n91872O54336l54304N24288n21728M76160J28512
2741F195712L15904r88160J481728L52768n49376n1712P168j08032J582080R30816
2731I168896O51264L3792l55840J257984M07552L127808L308544N410816J1914240
2722C4925056O440960q33536n579776r114112o734336l725824k246656K813440
$$ plain form
2788 5235712 4438528 5268992 3942400 5311488 5391360 5185024 3994112 5288448 4634624
2779 4634624 4567040 5095424 4455936 3961344 3887104 5442560 3945472 5250560 4596736
2770 4596736 5080576 5378048 4793344 4234240 4276224 4551680 4489216 4820480 4699136 4623360
2760 4623360 4172288 4427776 5837312 4815872 4822528 5466624 4992000 5365248 4396032 4297216
2750 4297216 4579840 5880320 5288448 5942784 5588480 6112768 5591040 6067200 6195712
2741 6195712 6511616 5523456 7005184 7357952 6808576 6756864 6764032 6656000 8238080 9168896
2731 9168896 9820160 9853952 9498112 10756096 11163648 14291456 17600000 23010816 34925056
2722 34925056 41366016 40532480 34952704 25838592 19104256 15378432 13131776 15945216
2714A5945216M538880O832640J699840J97632o208000l619328k607616M36736
2706A7216000N70880O758912J1106816K373120k107392q785920o422016o778880
2698A3931520k07360L36384M240384O392832K055680k030080o453760l337216
2690A4928384l874816j560576j35680K399232K210816J148416r85600l313152
2682A0817024k191360k199552j702400P83360n52960L09248q42752l6352q23808
2673C560448n29920J081856j54112k54976O08768l93216p98720J176064j035776
2664C260416j25952J783808j333760N23776l43552l77344R85600m55168J944064
2655E861888k51904K58560p43424O35392r28768n36576Q80640q46336l23072q62208
$$ plain form
2714 15945216 20484096 27316736 29016576 29214208 23006208 19386880 16779264 17216000
2706 17216000 17786880 24545792 35652608 38025728 35918336 27132416 20710400 13931520
2698 13931520 13724160 14060544 18300928 24693760 26749440 24719360 18265600 14928384
2690 14928384 11053568 9492992 9357312 11756544 13967360 15115776 14130176 10817024
2682 10817024 8625664 6426112 4723712 5507072 4954112 5263360 4420608 4384256 3560448
2673 3560448 3030528 4112384 3958272 3703296 4312064 3918848 3120128 4296192 3260416
2664 3260416 3134464 4918272 3584512 4108288 3764736 3387392 4372992 3917824 5861888
2655 5861888 5609984 5868544 5125120 5760512 4831744 4295168 5175808 4329472 4006400 3144192
2645C144192J4848P8848L15904j242624M97664M25984N5296K00192l87584o4000
2635C038720K91328k03776r22112J024512J02400l87072K04800K10432K86720
2626C645952j43360n20704j34656p97184J076736l1744O9632J256448r38496r79456
2616B503168m55680O33344J72544k45760n8368r4720j143296Q12032J053696r19040
2606B257920J09568Q97024o4512o80448Q71936Q38144j816576J398272q22272
2597B989056l13344j48992k44224P77728O00064L85024n81632J0752o03136o64576
2587B206720Q55552O80960j083904L92704J683968j973248K33472r93792J191424
2578C193856M23936R49248r84064O30784j03936j828864J488896r71776J048576
$$ plain form
2645 3144192 3159040 3237888 3553792 2311168 2808832 3234816 3290112 3490304 3102720 3038720
2635 3038720 3330048 3126272 2204160 3228672 3331072 2944000 3148800 3359232 3645952
2626 3645952 3502592 2981888 2847232 2050048 3126784 3095040 3164672 4421120 3482624 2503168
2616 2503168 2047488 2680832 2853376 2607616 2549248 2454528 1311232 2123264 3176960 2257920
2606 2257920 2367488 3264512 3200000 2519552 3391488 4229632 2413056 3811328 2989056
2597 2989056 2675712 2526720 2282496 3060224 3660288 4045312 3463680 3474432 2871296 2206720
2587 2206720 3062272 3743232 2659328 3052032 4736000 2762752 2996224 2002432 3193856
2578 3193856 3617792 4567040 3582976 4213760 4109824 2280960 3769856 2798080 3846656
2569C846656m24960J21344p42912J03424O43584J071616n74976p7824j38240J42848
2559C970560m24448l20000j45920M35200o16448J358336j501184M94592p75680
2550B475008J787392j226240N03296q24832N02272N12512j72032n22752L76832
2541C411456n58080L01056r49760N81632J637888j036288o36416K12992O4512
2532C028992j033728J557504j59232k3552L8400j64352N38112N9392m24960l66592
2522C049984o99392N56032R85088q59648j30560R05216n10976L12832m64384J040896
2512D185088j072128J02400Q0384M34176M4032n19680n12k5600Q19712q01792
2502C246080M23936r4720n75488Q9600l57888M13696R95840j321472L56864R55392
$$ plain form
2569 3846656 3421696 3543040 2800128 2903552 3547136 4618752 4043776 3965952 3827712 3970560
2559 3970560 3546112 3226112 3080192 3515392 2898944 4257280 2756096 3250688 2475008
2550 2475008 4262400 3036160 3539456 2714624 3216896 3729408 3557376 3034624 3411456
2541 3411456 2853376 3154432 2204672 2786304 4424192 3387904 2751488 2964480 3028992
2532 3028992 1995264 3552768 3393536 3369984 3408384 3244032 3782144 3841536 3416576 3049984
2522 3049984 2350592 2906624 3891712 3032064 2901504 3806720 3295744 3608576 3144192 4185088
2512 4185088 3112960 3215360 3295744 3729920 3773952 3254272 3253760 3228160 4047872 3246080
2502 3246080 3670016 3575296 2999808 3089408 2731520 3145216 4141056 2819584 3176448 4131840
2492D131840o73792L90656J13152m9152m27008M67456N36576k06336r2672J33120
2482D323840k13504j17248k29376R31328j004032Q15104M07040r80480P76192
2473D708864J042944m06016n32480P36768R99936j314816j67424L13856K06848
2464E588480o35392l18464j2800K47808q45312J524736q74496j76640J457152
2455E955072p06048L37408M64384J36704N82656j087488P93088K46784K0992M12160
2445G155712n11488o61504J431552K1504j235456K114560L12832j058304k40128
2436G329280J69984L18976j984000L64032L31776q22272J284608o94272r48224
2427E349888P0656J18272L38432l93728P30112o7072L85536p2704k57024r47712
$$ plain form
2492 4131840 3458048 3848704 3961856 3912704 3485696 3953152 4489728 4283392 4190720 4323840
2482 4323840 4110336 3993088 3763712 4695040 3691008 4506112 4913152 3932672 4708864
2473 4708864 5751808 5345792 4813312 5550080 6550016 5235200 5067776 5381632 5588480
2464 5588480 4953088 4634624 4621824 4869632 4024320 5549056 4674560 4497920 5955072
2455 5955072 5249024 5586432 6050816 6187520 6770176 5682688 6475776 6722560 6743552 7155712
2445 7155712 6644224 5982720 7414272 7435776 6200320 8314880 8627712 7569408 7329280
2436 7329280 7499264 7818240 5834240 6198272 6530048 5707776 6992384 6298112 5349888
2427 5349888 5420544 5538816 5877248 5483520 6213632 6146560 6532096 6459392 6202368 5254656
2417E254656M41856J048576j095680m05504r0624J479168m90496k49856j61792
2408E730304P20384K56512n1712M0448o33856q67840P15776k58048j54624j185792
2398D311552Q37120m51584P73632j134592N87776R216j71008j396736J091584
2389D456960k66240J293824j167872Q04352o67136j13152l64544P11680M45952
2380E133824j078784K93376Q64256k023424J835008K39104n40672M62336n62688
2371D622336L87072r83040R39520q65792M24960j88416L79904J48992m48512R1648
2361D508672J12128m096L26144J32608k21696J247232j208320O00064m79232J33120
2351E146624O70720j646080R06752m29056J466368j832448N67808N89824p99232
$$ plain form
2417 5254656 5696512 6745088 5649408 5243904 5153280 6632448 6141952 5892096 5730304
2408 5730304 6450688 6707200 6655488 6695936 6062080 5194240 5910016 5651968 5497344 4311552
2398 4311552 5148672 4697088 5470720 4336128 4923904 4933120 4762112 3365376 4456960
2389 4456960 4190720 5484544 4316672 5121024 4453888 4340736 3976192 4687872 5133824
2380 5133824 4055040 4348416 5212672 3189248 5024256 5263360 4722688 5185024 4622336
2371 4622336 5009408 4026368 4965888 4100096 4525056 4336640 4716544 4865536 4417024 4508672
2361 4508672 4620800 4616704 4942848 5075456 4853760 6100992 4892672 5492736 5013504 5146624
2351 5146624 5817344 4171264 5078016 4648960 6115328 4282880 4850688 5440512 4641280
2342D641280Q66304q62720J711104j085952j014272J264128R92768l1744j012224
2333E468672J28000K07360J62816J33632k92352m89472P51616Q47360J61280j636352
2323E442560N89312P3728P14240o30272Q04352j395712O65088R07776l61984j66400
2313F642688Q54528p08096m50048o44608Q65792o27200J99168J41824K22720l45088
2303F151680r57440O09280m096K72896j38752q6528j38752j80736j037824N31456
2293E021184q34560J614848p24992k81600J84320J54112q22784N52448q9600N97504
2283E370880l54304j89440n00736O91712J24928L36896K01728J03936J32096P3728
2273E991424N49376m08576P2704M14208N56032j530368O22080p0144J366016p87968
$$ plain form
2342 4641280 5507584 4644864 6355968 5270016 4255744 5519872 6512640 6480896 5468672
2333 5468672 5596672 5804032 5966848 6100480 5808128 5318656 6070272 6917632 7078912 5442560
2323 5442560 6031872 6105600 6819840 6189568 6993920 5598208 6263296 7171072 6809088 6642688
2313 6642688 7497216 6789120 6339072 5694464 6560256 5933056 6132224 6274048 6496768 6151680
2303 6151680 5194240 5803520 5799424 6072320 5933568 5847040 5708288 5527552 4489728 5021184
2293 5021184 4186624 5801472 5076480 4794880 4979200 5133312 4310528 4862976 4773376 5370880
2283 5370880 5016576 4827136 4326400 5018112 5143040 5479936 5681664 5785600 5917696 5991424
2273 5991424 6540800 6132224 6204928 6619136 7175168 5644800 6266880 6196736 7562752 6774784
2263F774784k87744j72544J62816o55872P41376J93024J02400J57696P80800o69184
2253G127552m3520K44736L5840n65248l08224J453568p21920q00768J036800r3696
2243G365120Q23808l57888R45664l61984n24288N84704J23392M59264L84000J432576
2233A0874368j29024M07552m92032P97184R15968m98176n632q43264j204224O77376
2223A0500096O49216j735168L1232j8944J19296n38112P07072k12480l88608r69216
2213H144384L90656P63904k46784k912768J097728P00416q14592R40032n58592
2204G504384N91872r99424N51424O77888K09408N96480Q28928j3312L12320P14240
2194A0974208Q84736j50016O43072p15776K093568r98912j246208l39968n9904
$$ plain form
2263 6774784 6487040 6314496 6477312 5821440 6562816 6755840 6858240 7015936 7796736 7127552
2253 7127552 7084032 7328768 7364608 6799360 6491136 7944704 7222784 6422016 7458816 7365120
2243 7365120 8188928 7831040 8776704 8414720 7890432 8475136 8598528 9057792 9441792 10874368
2233 10874368 10745344 11152896 10660864 11458048 12374016 11875840 11870208 11026944 9822720 10500096
2223 10500096 11149312 9414144 9445376 9426432 9545728 9007616 9714688 9502208 9113600 8144384
2213 8144384 8535040 9298944 9052160 6139392 7237120 7937536 7122944 8062976 7504384
2204 7504384 8096256 7096832 7648256 8326144 8535552 9132032 9960960 9947648 10259968 10974208
2194 10974208 11858944 11708928 12352000 11636224 13729792 12730880 11484672 11144704 11084800
2185A1084800r63072K44736k03264n14048l8912n2736n93408M00384j048576j55136
2175H160768n8880l01568L8400o5536j335808J194496r82016K92352m36224Q50944
2165G356928l90656M4032q7040J459200j440256R46688l47648J229312j208832
2156G561728Q92416N1200l33824Q20736j38240O92736j59232L28192j745920P7312
2146H047104R42080o8096j84320l55840J00864L38944p23456J81248n50912N50400
2136H278016J057792j140224L19488N25824l59936k44224o89664J560576l14368
2127H993280k23744Q11008j420800P28064J415168k86720r30304Q24832n85216
2118I325568R73312j44896P168J266688K21184J48992j82272n77024Q92928R78944
$$ plain form
2185 11084800 10121728 10366464 10163200 9649152 9610240 9557504 8964096 9364480 8315904 8160768
2175 8160768 8101888 7800320 7838720 7773184 6437376 7631872 6649856 6942208 6505984 7356928
2165 7356928 6966272 7010304 6923264 8382464 6942208 7888896 7541248 8770560 7561728
2156 7561728 8454144 8505344 8171520 8992256 8854016 9546752 9387520 9715712 7969792 8047104
2146 8047104 8989184 8921088 8736768 8380928 8481792 8820736 8097280 8278528 7727616 8278016
2136 8278016 9335808 8195584 8515072 9040896 8680960 8436736 7747072 9307648 8993280
2127 8993280 8769536 9580544 8159744 8887808 10302976 10016256 9085952 9910784 9325568
2118 9325568 10298880 10153984 10161152 11427840 11649024 11798016 11615744 11038720 11931648 12910592
2108A2910592o17984K7648L61472K41664l5328j47456K98496j536512N99552q8064
2098A2014080j7920L2768o11840m3008R46176k88768K47808L32288L60960j029120
2088A1943424l71200K23744K3040P70048k21696j372160J814016j221120n31456
2079A1056640P83872O1440L63520N47840o12352j65376M15744L55840p86944J472512
2069A3492736k35520L28192k94912o9632m40320m55680J62304J1264k31936j22880
2059A2143616M68480j07520m63872j108480N28896M45952N65248m85888J268736
2050A3255168J969664N01760N552128L143680J01888k311168m690944k994688
2042A4527488j513984q83712l26656l35360J89440o96832q21760r26208J051648
$$ plain form
2108 12910592 12292608 12320256 12681728 12923392 12888064 12740608 13039104 11502592 12102144 12014080
2098 12014080 11996160 12028928 11417088 11374080 12320256 12031488 12279296 12611584 12972544 11943424
2088 11943424 11572224 11795968 11819008 12589056 12367360 10995200 12809216 11588096 11056640
2079 11056640 11840512 11901952 12265472 12813312 12200960 12035584 12451328 12807168 12020224 13492736
2069 13492736 13257216 13585408 13290496 13220864 12780544 12324864 12487168 12498432 12266496 12143616
2059 12143616 12612096 12504576 12040704 10932224 11461120 11907072 12472320 11986432 13255168
2050 13255168 15224832 15726592 21278720 24422400 24524288 22213120 17522176 14527488
2042 14527488 13013504 12129792 11803136 11467776 11657216 10960384 10138624 9212416 10264064
2033A0264064j53600K79040o11840O30784j67936q18688J345536j637376J90464
2024I320448k46272P33184k63168j32096p07584J7920J052672o46144N35040o85056
2014H978944n43744n27872J036288m91520J298944o42048P0656n82656l0720K54464
2004H820736o72256l80416M83328n03808O24640j429504n1200m9152O23104j546240
1994E919232L18464m27008n7344O37952j480704J806848j446912k22720L4304
1985E082112q704N86240q6016j282048Q12032K42688M06016r45152j98144M36736
1975E045760Q85760j444864J330688Q08448p57248j118720K60608P14240J36192
1966E860864q01280J43872l37408L14880m45952O1440R0624n22240O74816j15712
$$ plain form
2033 10264064 10110464 10389504 9777664 10408448 10240512 9421824 10767360 9129984 9320448
2024 9320448 9074176 9807360 9544192 9412096 8704512 8722432 9775104 9128960 9664000 8978944
2014 8978944 8435200 7907328 8943616 8452096 9751040 9108992 9179648 8596992 8566272 8820736
2004 8820736 8148480 7768064 8251392 7747584 8372224 6942720 6891520 6842368 7465472 5919232
1994 5919232 6237696 5810688 5753344 6391296 4910592 6717440 5270528 5047808 5082112
1985 5082112 5073408 5659648 5573632 4291584 5103616 5346304 5752320 4807168 4609024 5045760
1975 5045760 5931520 4486656 5817344 6625792 5868544 4749824 5010432 5724672 5860864
1966 5860864 5059584 5203456 4866048 5180928 4734976 4796416 4887040 4364800 5039616 4923904
1956D923904k90816J804800l30752l01568m19328m03968O23616m24448m40832
1947D740608J232384J045504j489408l10784R27232l78880m27008J106944p85920
1938E660672R23648r47200J114112o58944Q7552J255936K16576n35552o63552
1929F453248L09248l43040M54144J20832m21376J0752M26496l42016N28384k84160
1919F912512J68448K01728M57216n49376r7280R39520L96800m25472Q83200p87968
1909H099328l45600J282048m39808K69312R9328q1920P168m61312J338880k47296
1899I520128P44448r08288m20864N12000o04160J466368o28736o144O34368q39168
1889I469952P41888m95104N34016p3728J24416L99872M3008l64032j015296K35008
$$ plain form
1956 4923904 4633088 6437888 6107136 5805568 5386240 4982272 5605888 5181440 4740608
1947 4740608 5972992 7018496 5529088 5218304 6145536 5766656 5339648 6446592 5660672
1938 5660672 6584320 5637120 6751232 6092288 6179840 7435776 7652352 7116800 6453248
1929 6453248 6762496 6419456 6873600 6994432 6573056 6583808 7010304 6668288 7196672 6912512
1919 6912512 7080960 7282688 7739904 7190528 7093248 8032768 8429568 8004096 8887296 8099328
1909 8099328 7753728 9035776 8595968 8865280 8964608 8882688 8889856 8428544 9767424 9520128
1899 9520128 10264576 9356288 8935424 9447424 8843264 10309632 9680896 9674752 10309120 9469952
1889 9469952 10211840 9716736 10250752 10177024 10301440 10701312 10744320 10380288 9364992 9600000
1879I600000J510912J06496j357312J594880p48544k99520J27488M9664P86944
1870A1371008n41184K36544l78880l7376Q91392K67776Q13568j133568o41024
1861A0848256Q09472L70688k0992l15904o80960O26688O27712q69888m9664L07200
1851A1652608k20672n85728Q92416n84192m096R35424o28224N7344j149440O98880
1841A1064320p5264L82976k5088M11648r87136n45792R26208j26976n84192P80800
1831A1221504k65728N92384j620992R81504m6080m62848K560J110528j038336
1822A0474496l34848O40000o77888Q36608j190912N10464N74464K4064j352704
1813I503744L5840R23648j277440J293824O18496r10336M85888p67488O28736
$$ plain form
1879 9600000 11110912 11217408 9860096 11454976 10706432 10406912 10534400 10584064 11371008
1870 11371008 10829824 11066368 10687488 10650112 11541504 11809280 12622848 11489280 10848256
1861 10848256 11657728 12028416 12007424 11691520 11010560 11637248 12264960 11395072 11345408 11652608
1851 11652608 11431936 10846208 11738624 11154432 11150336 12085760 11457536 11514880 10365440 11064320
1841 11064320 10989056 11372032 11346944 11758592 10771456 10225664 11151872 11024896 10440704 11221504
1831 11221504 10955776 11548160 9927168 10908672 10862592 10399744 10402304 11512832 10474496
1822 10474496 10139648 10779648 10101760 10938368 9747456 10257920 10832384 10856448 9503744
1813 9503744 9539584 10463232 9185792 10479616 11098112 10187776 10673664 9906176 10534912
1804A0534912j56672M54656J1776j364480Q02816j55648J04448M79232K39104
1795A0950144J09568K47808k14528j4336O18496J124864l99360k18624m608R7280
1785A2296704k25280J001984K46784k41664M06016n37088o8608J111552n61152
1776A3429248K95936P16288k72896O51776P33184m3008P29088n58592K87232M91008
1766A6459264O33856M03968M69504Q48896O144J531392j137152J166848J370112
1757B1752832K74944j02912L6864J454080J103360j354240K557952q192J294336
1748B7009024L38432J974784J005568Q33024J593856J563648J176576J702912
1740C7197824K228224J182720K188288K098176J800192K621440J891840K486784
$$ plain form
1804 10534912 10378240 10832896 10844672 9480192 10283008 10127360 10231808 10711040 10950144
1795 10950144 11059712 11307520 11092992 11078656 11697152 12822016 12422656 12204032 12199424 12296704
1785 12296704 12071424 13073408 13320192 13078528 13484544 12947456 12878848 13990400 13429248
1776 13429248 13725184 14441472 14168576 14820352 15553536 15510528 16239616 15681024 15968256 16459264
1766 16459264 17093120 17497088 17966592 18815488 18821632 20353024 19215872 20382720 21752832
1757 21752832 22027776 21924864 21961728 23415808 24519168 23164928 25722880 25714688 27009024
1748 27009024 27347456 29322240 30327808 31160832 32754688 34318336 35494912 37197824
1740 37197824 39426048 40608768 42797056 44895232 46695424 49316864 51208704 53695488
1732E3695488J979392K215424L97312J639424L65056J978368L69664Q67840L45088
1723F3853056k5600K140672J300480J563136J405952K600960K902016L170304
1715G8910976L819008L350016N200384N588992N999104Q621568J0058752J2327424
1707A33876224J2356096J1012608Q952832K101760q862208j4509568j9942912
1700A24984832j9571712j8758144j5040512j2410880j0076672p142912n796352
1693C6187648m208128k277376l308032j694208k071040P2704m43904k550784m67456
1684A9239424j219584K04800j340928p93600n94944l30752M71040k044416M43392
1675A4034432O90176q24320l97312o44608o23104m1984j131520L5840n71392K66752
$$ plain form
1732 53695488 55674880 57890304 58287616 59927040 60292096 62270464 62640128 63507968 63853056
1723 63853056 63827456 65968128 67268608 68831744 70237696 72838656 75740672 78910976
1715 78910976 82729984 86080000 91280384 96869376 102868480 111490048 121548800 133876224
1707 133876224 146232320 157244928 166197760 168299520 159437312 144927744 124984832
1700 124984832 105413120 86654976 71614464 59203584 49126912 41984000 36187648
1693 36187648 31979520 29702144 26394112 24699904 22628864 22701568 22257664 19706880 19239424
1684 19239424 18019840 18224640 16883712 16090112 15495168 15164416 15635456 13591040 14034432
1675 14034432 14724608 13900288 13502976 12858368 12235264 12193280 11061760 11097600 10526208 10792960
1665A0792960j064960K98496j39264N0176j026560k59072Q7040o144p76704Q9088
1655H045056j257984Q88832m74624O35392o08256o62016j81248q6016M67456o92736
1645F073856Q11008j6896m79232k64192m16768J25952P22944k88768o07744O8096
1635E728256q19712M22912J88416K83136j117184P17312M68992k63168O2464m74624
1625E196800Q13568j268736O98368l05152Q62208j061376K23744j001984J86368
1616D343808M3008L39968J262592j720320N82144m98176r1136J350144r10848
1607D701184l89120J255936p50592m01920N20192l47648p78752J745408j040384
1598D514304P13216n41696M7616K43200k07872J224704q83712P68512j379840
$$ plain form
1665 10792960 9728000 10026496 9887232 9937408 8910848 8651776 8738816 8732672 7955968 8045056
1655 8045056 6787072 7675904 7201280 7836672 7228416 6566400 6385152 6299136 6766592 6073856
1645 6073856 6884864 6867968 6388736 6124544 5707776 5833728 6556672 6267904 5660160 5728256
1635 5728256 4908544 5331456 5519872 5803008 4685824 5403136 5872128 5608960 5671424 5196800
1625 5196800 6010368 4741632 5440000 5134848 5997056 4935680 5159424 4157440 4343808
1616 4343808 4386816 4726784 5989376 4269056 4851200 4353024 4261888 5612032 4701184
1607 4701184 4312064 5568000 4817408 4415488 4935680 4588032 3809280 5554688 4514304
1598 4514304 5227520 4685824 4733440 4976640 4768768 5993472 5109760 5878272 4498432
1589D498432J071104j7408r728J64864P7312J35168p9872J18272q71424N29408
1579E616128L84000n50400N98016J010176l97312J345024o06208J102336L01056
1570H802816j886720Q01792J138688j244672l79904L97824R29792M27008J148928
1561A0135552p34208j039360L38944J646592j025024o12352K534912j049600J020416
1552A1215872r1648J150464j095680R46688m54656p26528J620480n38624P33184
1543A2759552o73280J421312j46944j902592J444352P8848Q35072j176576o97856
1534A1941888N32992Q31488j117696k33472J49504j67424m01408l48672J470464
1525A2657664n92384R87648o6048j389568J397760p8848K411008J004032J674752
$$ plain form
1589 4498432 5569536 5552128 5542400 5707264 5784576 5919744 5839872 5958144 5086720 5616128
1579 5616128 6000128 5449728 6047744 7057920 6660608 8005632 7399424 8501760 8802816
1570 8802816 6916096 7717888 8856576 7611904 7232000 7629824 8559616 8986624 10135552
1561 10135552 9401344 8361984 8700928 10347520 9322496 8710144 11245056 10195456 11215872
1552 11215872 11124224 12274688 11179008 12125696 11671040 10944512 12564992 12026368 12759552
1543 12759552 12086272 13507584 13360640 11458048 12902400 12981248 13816320 12639744 11941888
1534 11941888 12474880 13306368 12188672 11955200 12104704 11937280 11535872 11187200 12657664
1525 12657664 12065280 13052928 12986880 11597312 12995072 12916224 15327232 16331264 18006016
1516A8006016J685504M75136L7888j5360k59072q14592j60768k715648j458176
1507A4780928j676800k80576j493504j190912M70016j485312J117696q62208n20192
1498H859136k23744q5504k31936N24288k2016j147392N51424r7280l40480K03776
1488G990272R94304r3184J43360j73056j00864Q62208L51744p63904Q05888j007616
1478I009152O77888p17312Q6016j117696M88960j048576K95936j18784J72032
1469G727616q98048j28512r52320L27168m44416J74592K54976p30624K32960j68960
1459E394432j14688L93728K16576l92192j88928Q21760j253376M59264l82464
1450D954112j72032O09280k90816M31616l22560Q87296j284096R9840J224192
$$ plain form
1516 18006016 19691520 20166656 20204544 20189184 19930112 19115520 18954752 16239104 14780928
1507 14780928 13104128 12823552 11330048 10139136 10609152 9123840 10241536 9379328 8859136
1498 8859136 8635392 8549888 8317952 8842240 8820224 7672832 8224256 8126976 7786496 7990272
1488 7990272 8984576 8891392 9034752 8861696 8760832 9623040 9974784 9210880 10016768 9009152
1478 9009152 9687040 8969728 9055744 7938048 8427008 7378432 7674368 7555584 7727616
1469 7727616 6829568 6701056 5748736 6075904 5631488 5806080 6061056 5330432 5563392 5394432
1459 5394432 5279744 5673472 5890048 5497856 5308928 6130688 4877312 5336576 4954112
1450 4954112 4782080 5391360 5100544 5532160 5209600 6096896 4812800 4912640 6136832
1441F136832r40544q28928O24640L68640r4208j96096M59264O45632j085440P06560
1431E796352o91712M85376m55168M4032l21024K001408j067520K54464m17792
1422E628416J85856R01632j334784k35520J7408K60608K45760N9392o64064N56032
1412E620736o4000L71200L61984j278976K43712N5808J28512m39296n14560L15392
1402D800512k45760J20832j148928Q29952p46496L9424K73408m49024k70848K52928
1392C456000P35232m08064l50720O45632n02784j081344J361408l22560O37440
1383D170240j203712N94944P8336o92224L78368N48352m86912n09440k30400L60960
1373C008512R39520O1440j409536J223168L11296A904128J056256O9120J091072
$$ plain form
1441 6136832 5196288 4367360 4992000 5360640 5266432 5070336 5529600 6175232 5089792 5796352
1431 5796352 5104640 5590016 5134848 5178880 4857856 6859264 5791744 6046208 5628416
1422 5628416 5814272 6715904 5381120 5145600 5163008 5423616 5669376 5728768 5064704 5620736
1412 5620736 5556736 5927936 6289920 5010944 5254656 5310464 5438976 4999680 4485120 4800512
1402 4800512 4554752 4675584 3526656 4356608 3610112 3649536 3922944 3473920 3203072 3456000
1392 3456000 4191232 3783168 3432448 4078080 3575296 2493952 3855360 3532800 4170240
1383 4170240 2966528 3561472 3639808 2947584 3325952 3874304 3387392 2877952 2647552 3008512
1373 3008512 3948032 4009472 2599936 3823104 4134400 1904128 2960384 3029504 4120576
1364D120576j443840r73824k95936M7616J006080k39104k27328l3280L9936Q51456
1354B852352j315328P53152F70208l584K289152j277952J63328m11136O55360
1345B085376j4848j025024N98016p1680k00704l46624J418752j063424J53600
1336A533440J04960Q97024R0624r71264D43904Q05376L31776l1232m20864l45088
1326G83872k51904Q29952j68448L072j05472J036288m39296K62144E45280O22592
1316A167872M0448k56000J099264o68672J12640N71392p15776q4992D98176J506816
1306B004992p42400Q38144G47520J466880o18496k93888K4064n90336P51616j98144
1296A289216N3248O05184j71520o94784J4336J51552M70016G96160J055232m25984
$$ plain form
1364 4120576 2676736 1702912 1406976 1454592 2460672 2221568 1994240 1960960 2000896 2852352
1354 2852352 1537024 2290176 670208 666624 2955776 1677824 1841152 1430016 2085376
1345 2085376 2070528 1045504 1643520 1571840 1371136 1024512 2443264 1379840 1533440
1336 1533440 1638400 2535424 2626048 1654784 443904 1249280 1581056 1549824 1128960 783872
1326 783872 531968 1361920 1193472 1196544 1091072 2127360 1688064 1950208 545280 1167872
1316 1167872 1208320 952320 2051584 1382912 1495552 2066944 1351168 1266176 498176 2004992
1306 2004992 1262592 2100736 747520 2214400 1595904 1302016 1326080 735744 1487360 1289216
1296 1289216 1342464 1947648 1776128 1081344 1095680 1247232 1717248 796160 1851392 1425408
1286A425408k73408D89984J421824m68992m48000M92032P32160k09408q94976
1277A114624N07392j2800l35360O77376l29728R53856A272832k33472k66752P4752
1267H47360A08032K634240r34400k68288J25440k67776j44384K69824O3488n56544
1257A029632O69696L52256E24288L33824Q18176L61984q07424J68448P40864j007104
1247A133056R50784L7376n14560o60992R87648o14400P12704l85024J69984p20384
1237A096192Q21248p83872O7072N49888L3280k91328n59104N01248L98336H15616
1226A632256K52416l46112L09760j34144j47968O25664J88928p28576J41824N70368
1216B364416k04800q30976N05856F94784M40832Q7040m7616N90848q05888M4032
$$ plain form
1286 1425408 1152000 489984 1911808 1442816 994816 1486848 2219008 2009600 1114624
1277 1114624 1622016 1609216 1273856 1951232 1621504 2575360 1272832 1039360 772608 847360
1267 847360 108032 2742272 1807872 1539584 1665024 1397248 1252864 1522688 1586176 1029632
1257 1029632 1699328 2051584 524288 858112 1676288 2038272 1230848 1399296 2140160 1133056
1247 1133056 2083840 2121216 1606656 945664 1933312 1318912 2031616 1646592 1816576 1096192
1237 1096192 1917440 1133568 1200640 1750528 1783808 1492480 933376 1434624 1832960 815616
1226 1632256 1884672 1538560 1848320 1714176 1566208 2191872 2380800 1652224 1794048 2364416
1216 2364416 2159616 1328640 1834496 694784 1135616 1222656 1175040 1765888 960000 1004032
1206A004032J04448k15552M39296N56544p69536r5744K83136Q31488r39520j48992
1196A049600j90464R44640P8336l3280J85344p99232O02112m31616n29408J401344
1186B277376r72288O88640I49760M18816O6048j11104L05664m76160n6320K60096
1176A356800n47840J336832j26464I00608M21888R35424q29952K71360o17984
1167A081344k02240J005568k90304p30624J224704q29952K33984K9184P82336
1158B304000p96672N61152j51552m95616M61824n0688J42336K048p8336N5808
1148A954304j95072O51264m67968L71200N23776m9152A244672J438208j013248
1139A669632Q29952r00096P07584j006080N80096L38944J11616J067008m46976
$$ plain form
1206 1004032 1108480 892928 1332224 1888768 1119232 1023488 1306624 2138112 1198592 1049600
1196 1049600 859136 1803776 1882112 1848832 2034176 1234944 1837056 1405440 876032 2277376
1186 2277376 1305088 1993728 949760 1368576 1434624 1323520 1629184 1153024 1096704 1356800
1176 1356800 808960 2145792 2019328 900608 1322496 2257920 1427968 1699328 1081344
1167 1081344 879104 1884672 1594368 863744 2088448 1258496 1492480 1521664 2304000
1158 2304000 1507328 2068480 1916928 1421312 1883136 1832448 1974784 1976832 1898496 1954304
1148 1954304 1759232 2410496 1942528 2313728 2837504 2788352 1244672 2682880 1669632
1139 1669632 2499584 1599488 2307072 1300992 1881088 2220032 2331648 3398656 2951680
1130B951680k72384L59424l44064m35712J205248n06368N79072o32832J63840
1121C067904L87072K34496n13024J325568p89504K94400K85184j11104P29088
1112D910080j553920K166272j123328K24256K73408n83168Q33536k57024m17792
1103D472320J11616K00192j189888j090048J260544j46944J35168M96640P680
1094D257280m06016J201152p21920P69024J211392o10304J916416O65088m36736
1085G845376K18112l56864r17504n40672J55648J110016O48192R73824K066944
1076A1203072P09632L100160K014208M611072P879680J7941504M5120000J1819520
1068A04398848j858048k3181312k9433344k2909440j1353600m841472l609088
$$ plain form
1130 2951680 2679296 3038720 2694656 2258944 3464192 2957824 3536896 2904064 3067904
1121 3067904 3454976 3689472 3176448 4502016 3712512 4006912 4292096 4180992 4910080
1112 4910080 3356160 5522432 4399104 4623360 4896768 4313600 5147136 4890112 4472320
1103 4472320 4583936 4784128 3594240 2504192 3764736 3617792 3752960 4249600 4257280
1094 4257280 3851264 5052416 4330496 5099520 6310912 5700608 7617024 8282112 7845376
1085 7845376 8063488 7706624 6789120 6248448 6404096 7514112 8162304 9136128 11203072
1076 11203072 11912704 15012864 17027072 21638144 29517824 47459328 92579328 104398848
1068 104398848 102540800 79359488 49926144 27016704 15663104 10821632 7212544
1061G212544j132032j724416p71072M91520k14528n64224l01056N91360L2768
1052C620864J200128R80992l05664j883136Q51968j126400j022464N4272j12128
1043B258432m44416M06528B25792J114624J08032k38080J46944j9456N12n21728
1033H16640m5056J239552l8400p13216J388032j248256F4000J148416B31936K102272
1023B334208A110528C50208J377792l65568k49344Q73984F00576J393664p40864
1014A253376j61792K03264F03136M98176J02400j28512O656D096R58976K40640
1004A203712E07392K19648J14176C21024K26304Q71424D87936O31808K97472M52096
994A869312A28000K56512a58208D28032Q6528l2768P04512J71520A35680K85696
$$ plain form
1061 7212544 6080512 4356096 3585024 4076544 3862016 3297792 2996736 3588096 3620864
1052 3620864 4820992 5801984 5496320 3613184 4465152 3338752 2316288 2370560 2258432
1043 2258432 1814016 2220544 225792 1340416 1448448 1210368 1357312 1337856 1338368 816640
1033 816640 771584 2011136 1972736 1259520 2647552 1399296 64000 1212416 231936 2334208
1023 2334208 1110528 350208 1728000 1362432 1113088 1987072 600576 1994240 1253376
1014 1253376 1091584 1294848 603136 1101312 1203712 1075200 1081856 4096 963072 1203712
1004 1203712 507392 727040 841216 321024 547328 1418752 487936 1119744 1417216 1869312
994 1869312 128000 384512 -158208 428032 514560 481792 1186304 1357824 135680 421376
984D21376K89280A024J356288F77888L76832M42880D09088J005056J48992G81312
973G71584C66592L52256N53984F14912J45408K12992F2976Q15104L27680A26976
962E41184M64384D90496Q93440m63872J76128N66784a35168H37120k53952k85696
952B97472J462272m41344B18112R82016b60608B143232H00256D608J180672l43040
942H42240B21696M08064N02272D22912N00736j46432L96288L10784D80768Q87296
932A368064l15904L04640o02112l46112M6080N9392J146880E93408N33504k5088
922A101824M05504E64224L92704C31264M58752j75104b10432I28768J18272A47456
911F88640c1744I36960j00864d10624A150464D52608L01056l46624M66944J36192
$$ plain form
984 421376 710656 1024 1357312 677888 1054720 1497600 409088 1414144 1563136 781312
973 771584 366592 718848 1272832 614912 760320 973312 62976 878080 1205760 126976
962 541184 1005568 490496 1383936 920064 1096192 1662976 -135168 837120 583168 297472
952 297472 1759744 1318400 218112 1200128 -260608 2143232 800256 4608 1185280 842240
942 842240 221696 629760 1132032 422912 923648 777216 1173504 1484288 480768 1368064
932 1368064 1052160 1356800 754688 408576 454656 514048 1660928 593408 1126912 1101824
922 1101824 1507328 564224 956928 331264 790016 614912 -210432 928768 1047040 147456
911 688640 -31744 936960 836096 -410624 1150464 452608 753664 407040 873984 1010176
901A010176C55328J154048j30048F9632L4304Q54016K63168j51552B65728J171968
891A437696g8848q70400A205760B45760J08032a19808C00544R78944n54496Q0384
881H05376R1648j39776L70176J33120G9360P05024J17248j83296i8304A728000
870H9088J487360G08608N24288b62656A083392M4544m88960j58720K15040e2224
859H48384g77216E64736c66080I20576l72736B60608J196544F75328M5056l06176
849D14208j69472J353728R5744D51584Q20224d17792g4752n9392A083392O5536
839A148928a40800A4848A024M3008J513984h8064A50528O99392k74432N42208
829A117696A35680R92256n0688m88448Q05888m3520B71872J12128M096D3008K29376
$$ plain form
901 1010176 355328 1509376 1379328 69632 103936 957952 1221120 1069568 265728 1437696
891 1437696 -78848 -949248 1205760 245760 353792 -119808 300544 1279488 724992 805376
881 805376 897024 757248 1127424 1260544 79360 784384 901632 718336 -98304 1728000
870 89088 1576448 708608 1232896 -262656 1083392 1127936 638976 480256 695296 -52224
859 848384 -777216 564736 -366080 920576 547840 260608 1457152 675328 720384 414208
849 414208 244736 1598464 1694208 451584 1271808 -417792 -74752 -134144 1083392 1148928
839 1148928 -140800 14848 1024 44032 1558016 -88064 150528 849920 575488 1117696
829 1117696 135680 1127936 1077248 588800 1394688 1351168 271872 384000 388096 43008 272384
818B72384N48864K18624O63552p28064A22880R24160P8336n13536K4576N46816
808A183232J008640D39296k6624M75648l46624K09408B43200J250304L29728G10656
797F94784O4000o1952L71712N66272p3216A87392J566208H18176M10624J259008
787B487808j243648D32128O91200k59072J55136L15904K39616j65888l78880L73760
777A403904n61152J011712o48192P76704j35168j2800p94624P24992k78528G03488
766e9392G96160L29216k57024K53440k07872O4000e1712D28544e10976C6352O27200
755F63552K09920c80928E55008O51776q7040l70176e16096B04800N77024N71904
745A353728A12128N95456I4720P17824l97824J84320L07712l47648e37088A205760
$$ plain form
818 272384 821248 1039872 1703424 975360 122880 1047040 1125376 611840 636416 1183232
808 1183232 2191872 439296 412672 888320 541696 751104 243200 1493504 1823232 710656
797 694784 758784 696832 1068544 1634816 1561600 187392 1753600 818176 1228800 2487808
787 2487808 1244160 432128 1123328 864256 1019392 1335296 1574912 1409024 1030144 1403904
777 1403904 842752 1854464 1206272 1982976 1847808 1835008 1040384 1765376 1486848 703488
766 -59392 796160 1125376 868352 1121792 913920 977920 -51712 428544 -510976 36352 663552
755 663552 873472 -380928 555008 1206784 1119744 749568 -516096 204800 781824 1353728
745 1353728 112128 707584 94720 812544 414720 599040 906752 559104 -537088 1205760
734C50208J1264J2800Q23808C9936J716224f3488K048k30912k5088A010688m65920
723E44768N32480H0384f144j79712A54624K93888k01216o9632J54624b68800C65568
711d1984D94080R15968B0480e49376E0688a267200B94912O94272A96608g168C27168
699A015808k29888G680J200640B09920M91520B05824M37248l07712O52800c3280
688D54144K88768e120I4208M90496L13344A49504R19552J82784B19136d74624
677c01568j72032C39968c67616A089536C27680M36736o7584g46496C32800n8880
667B73920b23232E49376N72416g81824H54016A61792J00352J86368K28352B4576
656A08544b1504C10272R12384G680K23232a36192C97824p7312K5600c56864D28032
$$ plain form
734 350208 361472 374272 1198080 39936 1756160 -63488 -61440 -292352 -317440 1010688 544768
723 544768 1077248 80384 -6144 -185856 154624 448512 247296 177664 332288 -268800 365568
711 -41984 494080 1410048 20480 -549376 50688 -1267200 294912 989184 196608 -7168 327168
699 1015808 785920 7680 1208320 209920 701440 205824 643072 335360 988160 -33280
688 454144 742912 -5120 94208 584704 898048 149504 1069056 1251840 219136 -474624
677 -301568 -473600 339968 -367616 1089536 327680 764416 696832 -746496 332800 273920
667 273920 -223232 549376 1121792 -781824 854016 161792 262144 448512 676864 24576
656 108544 -21504 310272 1222656 7680 230912 -136192 397824 320512 346112 -356864 428032
644D56192j08544Q86784b08896J1776F81984e78048B03776b45760C56352c72224
633E81120G3728J73056L38944k57536Q69376C06176D8128d78720J83296A024P07584
622G08608q7552b11456f1440A35168N67296A9968h192j43360D48000M6592C5840
610F07232d83840C17440e04320E46304M67456A14176c00032d3008l48160G64416
599B91328c42016A688576C46112O12864o8608d76672B17600g4752C6864e15072
588g2704k97472G93600C6352K04288a74080E88288B77504J003008F22080J7920
578F40000L6352B93376M79744A64352a26464o85056F37952a77152j4848l99872
568e91872i8304A70496J261568c95776C66080a75104D06528j66912R6256B3552
$$ plain form
644 456192 347648 1234432 -208896 -197120 681984 -578048 203776 -245760 356352 -372224
633 581120 73728 246784 585728 328192 1197568 306176 48128 -478720 -295424 1024 708608
622 708608 621056 -211456 -61440 135168 702464 19968 -8192 -151552 448000 494592 35840
610 607232 -483840 317440 -504320 546304 1013760 114176 -300032 -43008 -391168 764416
599 291328 -342016 1688576 346112 958976 890368 -476672 217600 -74752 36864 -515072
588 -72704 -370176 793600 36352 240640 -174080 588288 277504 1280512 622080 640000
578 640000 676352 293376 773120 164352 -126464 -811520 637952 -177152 -192000 -591872
568 -591872 -98304 170496 1432064 -395776 366080 -175104 406528 239616 335872 23552
557F48704d32128B81600e09440K5600E04320O81472C13344f97344D25984O10304
547A036288C67104q6016b84160A05472n2224b27840A59232b05824B26816Q1408
537C08224J096192b80576D33664e58592A185792c86560A13152Q73984q9600a47968
526C95264d608I43104b98496n0688A36704a182720B14528J70496c09760C15392
515c25632k23744F07744f08768D67456j83296J16736J62816J5872A40288a03424
504d09088a38752E1712g70048D27520M17280D14208I2160R98400k78528k42176
494E69856R61024j89952D77184a48480b560A418240l35360M31616n70368l60960
484E83168j05984j25440K61632P87456m50560k39104Q75008p47008M64384k14016
$$ plain form
557 648704 -432128 281600 -509440 -483840 504320 1185792 313344 -697344 425984 1036288
547 1036288 367104 281088 -284160 105472 53248 -227840 159232 -205824 226816 308224
537 308224 1404416 -280576 433664 -558592 1185792 -386560 113152 987136 897536 -147968
526 395264 -4608 943104 -298496 -349184 136704 -1182720 214528 385024 -309760 315392
515 -325632 -549376 607744 -608768 467456 284160 400896 563712 579584 140288 -103424
504 -409088 -138752 51712 -770048 427520 844800 414208 92160 1090560 812032 569856
494 569856 1530880 1340928 477184 -148480 -2560 1418240 1082880 1514496 944128 583168
484 583168 477184 351744 613376 1400832 950272 711168 1586176 839168 1303552 1089536
474A089536J196544H83200J02912L46112K44224l30752o15936O68672m02432M65408
464A361408C57888O7584K01728N64736l3792l09760j92512j59744L77344O4512
454I37984m16768l1232J95072j58208E0176K04800O95808F1440f24128E52448
443H16128a08544j42848H29952l64032B04800c30240e7856I3184b26304j18784
433c45088D02432N6320O26176D16768O0416e51424A02912a19296B94400J78688
423D73088c38944G28576k88256L9424B048a6896B47808L64544A88928Q65280d77696
411d9152j219072F42560e4784m88960G86944k65216f19008a24928A36704f18496
400e5296F55872J50528p4240N50400e22752J90464j62816J64864D04480d54144
$$ plain form
474 1089536 2286080 883200 986112 1332224 1576448 1245696 629760 1298432 896000 1361408
464 1361408 357888 425472 627200 1191936 1158144 848384 655872 496128 873472 937984
454 937984 521216 489984 685056 526848 50176 254976 950784 61440 -624128 552448
443 816128 -108544 -251392 829952 465920 204800 -330240 -57856 93184 -226304 -345088
433 -345088 402432 458752 1084928 416768 477184 -551424 102912 -119296 294400 473088
423 473088 -338944 728576 440320 479744 2048 -16896 247808 612352 188928 1054208 -477696
411 -49152 -1268224 642560 -54784 -543744 786944 521728 -619008 -124928 136704 -618496
400 -55296 655872 806400 732160 1282560 -522752 -332288 -495104 -330240 404480 -454144
389C20000a51040C26144L21024f97344K43712F20032C05664i37472B42688L84000
379F26688A42848a05472r9840E24288O61504k85696a92512B81088M13696G4240
368C40480L5840G9360g53664i4208J8944j45920m36736F70208j81248f25664a25440
356i23648a46432M4032I16992A17248Q6016M608K11968a025536B04288N46304
346G50592a07008j27488C89120J14688b36544C05152a051648a48480A146880J22880
336A269760f88640b86720E32992d55680H25856c23072p7824I48736I5232a024
325H80640B57024J536k3040L05664C3792K22208d11136A058816c93216A82784
314E3760h23808a90976A08544R02144D91520f52288E17632a00352F45120d99200
$$ plain form
389 320000 -151040 326144 647168 -697344 -453632 620032 305664 -937472 242688 626688
379 626688 142848 -105472 -205312 524288 1185792 900096 -192512 281088 694784 74240
368 340480 376320 79360 -753664 -94208 -75264 -221184 -657920 670208 488960 -625664 -125440
356 -923648 -146432 -102400 916992 117248 203264 207872 419840 -1025536 204288 750592
346 750592 -107008 -234496 389120 503808 -236544 305152 -1051648 -148480 1146880 1269760
336 1269760 -688640 -286720 532992 -455680 825856 -323072 -400896 948736 95232 -1024
325 880640 257024 258560 235520 541184 33792 256000 -411136 1058816 -393216 182784
314 53760 -823808 -190976 108544 1010688 491520 -652288 517632 -100352 645120 -499200
303A90976R33888l38944C79904A83296M3008O3488e38112E4272P19360J12128
293H85760l24608h8064A75104Q5504m3008M72064q4992k07872c32800j87392f9632
281@G07072g56736l24096b19648c1744j7920H1408J35680G5264d35200h9600B91840
268f6560B02752c94240a1776G10144L01568A81248g9872A793536C23584L76832
258G00416l48160l3280e55008b04800B42176g36768H35584j94560K67776m33664
248D75136c06688D8640a36192J8944F33856j21344e1200B98496i9328k17600C45600
236A031680C3792a12640H03328C64544l7888N76000l83488A75104M06016a239040
225d58752B59072P60832c1232m57728M2496F38976L28192A67424p5264f46656
$$ plain form
303 190976 1124864 785920 379904 183296 226304 289792 -538112 54272 773632 885760
293 885760 561152 -88064 175104 260608 217600 689664 604672 396800 -332800 -520192 -69632
281 0 707072 -756736 -1080832 -219648 -31744 -49664 81408 217088 75264 -435200 -89600 291840
268 -66560 202752 -394240 -11776 710144 1011712 181248 -79872 1793536 323584 700416
258 700416 352256 318976 -555008 -204800 242176 -736768 835584 641024 908800 475136
248 475136 -306688 48640 -136192 -117248 633856 512512 -51200 298496 -99328 -316928 345600
236 1031680 33792 -112640 803328 364544 326656 902656 519168 175104 581120 -1239040
225 -458752 259072 1019904 -31232 -488960 -446464 638976 967168 167424 92160 -646656
214B67776a34144e6832r92256A78176K76480K38080a77664m97664A98144h27392
203A336832o33856K30912G0656d49536F88128g02976E89312b29376D16256L96288
193H12544p3216g20896J86880C08224j13664c8400A04448K66752g94112b16576
182D30592M94592k4576a80224A52576b44736I58464g00928A93536L25632r7792
172D21376A22368b72384c5328B30912C1232J21856h47360a35680F10304d70528
161C91168A08544M81792F1952N5808a92512G26528b10944B72896K4064h89344
150A775104F19008Q93440a81760m14208D03456j11616b05824K3552A332736D01408
139a86880C1232N40160A81760g49568F31808j93536f86080G54688k48320D5568
$$ plain form
214 267776 -134144 -56832 -1049088 178176 454656 692736 -177664 -675328 198144 -827392
203 1336832 702976 933888 70656 -449536 688128 -702976 589312 -229376 416256 812544
193 812544 739328 -720896 -534016 308224 194560 -38400 104448 371200 -794112 -216576
182 430592 925184 900608 -180224 152576 -244736 958464 -700928 193536 519168 421376
172 421376 122368 -272384 -35328 230912 31232 153088 -847360 -135680 610304 -470528
161 391168 108544 590336 61952 117760 -192512 726528 -210944 272896 296960 -889344
150 1775104 619008 1512448 -181760 -595968 403456 291840 -205824 -182272 1332736 401408
139 -186880 31232 571392 181760 -749568 631808 438272 -686080 754688 506368 45568
128b58048H92416h13568a98656e8368A25952b17088r216k39104D5568M11136d96640
116G43936A72032J97120e26848b30400A09056g60832B97984j6384q8064h1920
105A619968a52064l94240G98720B57536o9632k8672K46784K36032g74656D3008
94B25280b2016I48736A69472c6864n19680I65120O67136b94912C56864J89440
84E46304f33856c11296G40864K88256e38112F74816c74784b7648D11136c23072
73E07392c37408D93056b10944E33504L98848d01920G28576d99712C09760c99360
62d99200G63904l61472h26368b36032n51424n12c90144l7376B42688b36544E12512
50B73920M35200j76128b24256G168d81792C92192b9696H09472b46784I26208e13536
$$ plain form
128 -258048 892416 -813568 -198656 -58368 125952 -217088 -226304 -465408 45568 456704 -496640
116 743936 172032 369152 -526848 -230400 109056 -760832 297984 281600 193536 -81920
105 1619968 -152064 -546304 798720 257536 187904 159232 406016 642048 -774656 43008
94 225280 -22016 948736 169472 -36864 -556544 965120 1632256 -294912 356864 546304
84 546304 -633856 -311296 740864 1029120 -538112 674816 -374784 -27648 411136 -323072
73 507392 -337408 493056 -210944 533504 932352 -401920 728576 -499712 309760 -399360
62 -499200 763904 402432 -826368 -236032 -787456 -787968 -390144 -427520 242688 -236544 512512
50 273920 709120 532992 -224256 7168 -481792 392192 -29696 809472 -246784 926208 -513536
38H99072K48832B91328f84032A03424M96128R3184K03776J30560C59424f87104
27d34688C57376b74432A022976a035264M76160l76832a89440O4000e1712n8368
17a10080l69152J88416J3824a8432A042432B42688a21344A06496i89184G07072
6e51936K08384l00032F57920d3520C81440A24928
$$ plain form
38 899072 1147904 291328 -684032 103424 599552 692736 896512 1027072 359424 -687104
27 -434688 357376 -274432 1022976 -1035264 -559104 -935936 -189440 -125440 -51712 -110080
17 -110080 -479232 -290816 -276992 -18432 1042432 242688 -121344 106496 -989184 707072
6 -551936 -343552 -643584 657920 -43520 381440 124928
##END=
