##TITLE=1346
##JCAMPDX= 6.0         $$ Bruker NMR JCAMP-DX V2.0
##DATA TYPE= NMR SPECTRUM
##DATA CLASS= XYDATA
##ORIGIN= NUTS EXPORT
##OWNER= Administrator
$$ 1.72 TOPSPIN		Version 2.1
$$ 2016-02-23 12:21:01.902 -0800  Administrator@X
$$ Compression mode = diff/dup
##.OBSERVE FREQUENCY= 90.275459
##.ACQUISITION MODE= SIMULTANEOUS (DQD)
##.ACQUISITION SCHEME= undefined
##.AVERAGES= 16
##.DIGITISER RES= 22
##SPECTROMETER/DATA SYSTEM= 
##.PULSE SEQUENCE= zg30
##.SOLVENT NAME= None
##.SHIFT REFERENCE= INTERNAL, None, 1, 14.73627
##AUDIT TRAIL= $$ (NUMBER, WHEN, WHO, WHERE, PROCESS, VERSION, WHAT)
$$ ##TITLE= Audit trail, TOPSPIN		Version 2.1
$$ ##JCAMPDX= 5.01
$$ ##ORIGIN= Bruker BioSpin GmbH
$$ ##OWNER= Administrator
$$ $$ E:/data/jwist/nmr/1346/1/pdata/1/auditp.txt
$$ ##AUDIT TRAIL=  $$ (NUMBER, WHEN, WHO, WHERE, PROCESS, VERSION, WHAT)
(   1,<2016-02-23 09:00:29.105 -0800>,<Administrator>,<X>,<jcamp>,<TOPSPIN 2.1>,
      <fromjdx created from
       E:\data\jwist\nmr\uniandes\1346
       data hash MD5: 8K
       93 4F 68 97 B8 99 47 93 8C 77 A5 91 F0 CE A6 7E>)
$$ ##END=
$$ 
$$ $$ hash MD5
$$ $$ 9F 1E 04 06 1A 3A 7C 09 03 FD 82 C9 04 B4 FC D8
##$RELAX= 
$$ Bruker specific parameters
$$ --------------------------
##$DU= <E:>
##$EXPNO= 1
##$NAME= <1346>
##$PROCNO= 1
##$TYPE= <nmr>
##$USER= <jwist>
##$ACQT0= 0
##$AMP= (0..31)
100 100 100 100 100 100 100 100 100 100 100 100 100 100 100 100 100 100
100 100 100 100 100 100 100 100 100 100 100 100 100 100
##$ANAVPT= 1
##$AQSEQ= 0
##$AQ_mod= 3
##$AUNM= <au_zg>
##$AUTOPOS= <>
##$BF1= 90.275459
##$BF2= 400.02
##$BF3= 400.02
##$BF4= 400.02
##$BF5= 400.02
##$BF6= 400.02
##$BF7= 400.02
##$BF8= 400.02
##$BYTORDA= 0
##$CFDGTYP= 0
##$CFRGTYP= 0
##$CHEMSTR= <none>
##$CNST= (0..63)
1 1 145 1 1 1 1 1 1 1 1 1 1 1 1 1 1 1 1 1 1 1 1 1 1 1 1 1 1 1 1 1 1 1 1
1 1 1 1 1 1 1 1 1 1 1 1 1 1 1 1 1 1 1 1 1 1 1 1 1 1 1 1 1
##$CPDPRG= <>
##$CPDPRG1= <>
##$CPDPRG2= <>
##$CPDPRG3= <>
##$CPDPRG4= <mlev>
##$CPDPRG5= <mlev>
##$CPDPRG6= <mlev>
##$CPDPRG7= <mlev>
##$CPDPRG8= <mlev>
##$CPDPRGB= <>
##$CPDPRGT= <>
##$D= (0..63)
0 1 0 0 0 0 0 0 0 0 0 0 0 0 0 0 0 0 0 0 0 0 0 0 0 0 0 0 0 0 0 0 0 0 0 0
0 0 0 0 0 0 0 0 0 0 0 0 0 0 0 0 0 0 0 0 0 0 0 0 0 0 0 0
##$DATE= 0
##$DBL= (0..7)
120 120 120 120 120 120 120 120
##$DBP= (0..7)
150 150 150 150 150 150 150 150
##$DBP07= 0
##$DBPNAM0= <>
##$DBPNAM1= <>
##$DBPNAM2= <>
##$DBPNAM3= <>
##$DBPNAM4= <>
##$DBPNAM5= <>
##$DBPNAM6= <>
##$DBPNAM7= <>
##$DBPOAL= (0..7)
0.5 0.5 0.5 0.5 0.5 0.5 0.5 0.5
##$DBPOFFS= (0..7)
0 0 0 0 0 0 0 0
##$DE= 6.5
##$DECBNUC= <off>
##$DECIM= 2432
##$DECNUC= <off>
##$DECSTAT= 4
##$DIGMOD= 1
##$DIGTYP= 12
##$DL= (0..7)
0 120 120 120 120 120 120 120
##$DP= (0..7)
150 150 150 150 150 150 150 150
##$DP07= 0
##$DPNAME0= <>
##$DPNAME1= <>
##$DPNAME2= <>
##$DPNAME3= <>
##$DPNAME4= <>
##$DPNAME5= <>
##$DPNAME6= <>
##$DPNAME7= <>
##$DPOAL= (0..7)
0.5 0.5 0.5 0.5 0.5 0.5 0.5 0.5
##$DPOFFS= (0..7)
0 0 0 0 0 0 0 0
##$DQDMODE= 0
##$DR= 22
##$DS= 2
##$DSLIST= <SSSSSSSSSSSSSSS>
$$ [...]
##$SPOFFS= (0..31)
0 0 0 0 0 0 0 0 0 0 0 0 0 0 0 0 0 0 0 0 0 0 0 0 0 0 0 0 0 0 0 0
##$SUBNAM0= <"">
##$SUBNAM1= <"">
##$SUBNAM2= <"">
##$SUBNAM3= <"">
##$SUBNAM4= <"">
##$SUBNAM5= <"">
##$SUBNAM6= <"">
##$SUBNAM7= <"">
##$SUBNAM8= <"">
##$SUBNAM9= <"">
##$SW= 20.5580556627758
##$SWIBOX= (0..15)
0 0 3 4 0 0 0 0 0 0 0 0 0 0 0 0
##$SW_h= 8223.68421052631
##$SWfinal= 0
##$TD= 65536
##$TD0= 1
##$TE= 300
##$TE2= 300
##$TE3= 300
##$TEG= 300
##$TL= (0..7)
0 120 120 120 120 120 120 120
##$TP= (0..7)
150 150 150 150 150 150 150 150
##$TP07= 0
##$TPNAME0= <>
##$TPNAME1= <>
##$TPNAME2= <>
##$TPNAME3= <>
##$TPNAME4= <>
##$TPNAME5= <>
##$TPNAME6= <>
##$TPNAME7= <>
##$TPOAL= (0..7)
0.5 0.5 0.5 0.5 0.5 0.5 0.5 0.5
##$TPOFFS= (0..7)
0 0 0 0 0 0 0 0
##$TUNHIN= 0
##$TUNHOUT= 0
##$TUNXOUT= 0
##$USERA1= <user>
##$USERA2= <user>
##$USERA3= <user>
##$USERA4= <user>
##$USERA5= <user>
##$V9= 5
##$VALIST= <valist>
##$VCLIST= <CCCCCCCCCCCCCCC>
##$VD= 0
##$VDLIST= <DDDDDDDDDDDDDDD>
##$VPLIST= <PPPPPPPPPPPPPPP>
##$VTLIST= <TTTTTTTTTTTTTTT>
##$WBST= 1024
##$WBSW= 4
##$XGAIN= (0..3)
0 0 0 0
##$XL= 0
##$YL= 0
##$YMAX_a= 1122295424
##$YMIN_a= -5389970.944
##$ZGOPTNS= <>
##$ZL1= 120
##$ZL2= 120
##$ZL3= 120
##$ZL4= 120
##$ABSF1= 10
##$ABSF2= 0
##$ABSG= 5
##$ABSL= 3
##$ALPHA= 0
##$AQORDER= 0
##$ASSFAC= 0
##$ASSFACI= 0
##$ASSFACX= 0
##$ASSWID= 0
##$AUNMP= <proc_1d>
##$AXLEFT= 0
##$AXNAME= <>
##$AXNUC= <off>
##$AXRIGHT= 0
##$AXTYPE= 0
##$AXUNIT= <>
##$AZFE= 0.1
##$AZFW= 0.1
##$BCFW= 1
##$BC_mod= 2
##$BYTORDP= 0
##$COROFFS= 0
##$CY= 15
##$DATMOD= 1
##$DC= 2
##$DFILT= <>
##$DTYPP= 0
##$F1P= 0
##$F2P= 0
##$FCOR= 0.5
##$FTSIZE= 0
##$FT_mod= 4
##$GAMMA= 1
##$GB= 0
##$INTBC= 1
##$INTSCL= 1
##$ISEN= 128
##$LB= 0.3
##$LEV0= 0
##$LPBIN= 0
##$MAXI= 10000
##$MC2= 0
##$MEAN= 0
##$ME_mod= 0
##$MI= 0
##$NCOEF= 0
##$NC_proc= -9
##$NLEV= 6
##$NOISF1= 0
##$NOISF2= 0
##$NSP= 1
##$NTH_PI= 0
##$NZP= 0
##$OFFSET= 14.73627
##$PC= 1
##$PHC0= 0
##$PHC1= 0
##$PH_mod= 0
##$PKNL= yes
##$PPARMOD= 0
##$PPDIAG= 0
##$PPIPTYP= 0
##$PPMPNUM= 2147483647
##$PPRESOL= 1
##$PSCAL= 4
##$PSIGN= 0
##$PYNMP= <proc.py>
##$REVERSE= no
##$SF= 90.275459
##$SI= 8192
##$SIGF1= 0
##$SIGF2= 0
##$SINO= 400
##$SIOLD= 32768
##$SPECTYP= <>
##$SREGLST= <1H.CDCl3>
##$SSB= 0
##$STSI= 0
##$STSR= 0
##$SW_p= 1497.18276156757
##$SYMM= 0
##$S_DEV= 0
##$TDeff= 0
##$TDoff= 0
##$TI= <>
##$TILT= no
##$TM1= 0
##$TM2= 0
##$TOPLEV= 0
##$USERP1= <user>
##$USERP2= <user>
##$USERP3= <user>
##$USERP4= <user>
##$USERP5= <user>
##$WDW= 1
##$XDIM= 8192
##$YMAX_p= 1122295296
##$YMIN_p= -5389824
##$CURPLOT= <PDFCreator>
##$CURPRIN= <$PDFCreator>
##$DFORMAT= <normdp>
##$LAYOUT= <+/1D_H.xwp>
##$LFORMAT= <normlp>
##$PFORMAT= <normpl>
##$SURQMSG= 1
$$ End of Bruker specific parameters
$$ ---------------------------------
##XUNITS= HZ
##YUNITS= ARBITRARY UNITS
##XFACTOR= 0.182761567574166
##YFACTOR= 1
##DELTAX= -0.182761567574166
##NPOINTS= 8192
##FIRSTX= 1497
##FIRSTY= 455168
##LASTX= 0
##MAXY= 1122295296
##MINY= -5389824
##XYDATA= (X++(Y..Y))
8191D55168K70336N5296j77664J473536m78208p94112A33632M42880Q15104K79552
8181A671168n53984K21184N47840p74656P61344r00608D80256M66944R0624D04480
8170I47712O8608R4208B66752R48736C23584L52256r5744L13344K95936B48320
8159A114112m51072L16416J64352m64384P90528D92544E9392J184256k94400M01408
8149A350656L65056B13504Q69376M84352F22592N26336n70368J36704B37568J539072
8139A776640p36256k51904k38592j63328K79552K00704Q03328j12640o64064l96800
8129D96640A07008L74272Q45824n26848C17440O25664D10112k04800N49376j31072
8119F23616P79776B3040J653248p42400R64608B11968d2496D29056Q99584Q8576
$$ plain form
8191 455168 725504 780800 603136 2076672 1598464 804352 133632 576512 1391616 1671168
8181 1671168 1117184 1338368 1886208 1111552 1872896 972288 480256 947200 1037824 404480
8170 947712 1016320 1110528 266752 1215488 323584 675840 580096 893440 1189376 248320
8159 1114112 663040 979456 1143808 679424 1469952 492544 59392 1243648 949248 1350656
8149 1350656 1715712 213504 1082880 1567232 622592 1148928 578560 715264 237568 1776640
8139 1776640 1040384 788480 549888 386560 666112 866816 1670144 1557504 893440 496640
8129 496640 107008 481280 1327104 800256 317440 943104 410112 205312 754688 623616
8119 623616 1403392 23040 1676288 933888 1898496 211968 -42496 429056 1328640 1417216
8109A417216l56864O1952j1776j42848L54816E24800R60512m79744N48864O2464
8099A616896D79232N7344J110528F15424k42176P00416B99008K33472J43360K22208
8089H98048n120B5600J453056o25664O72768A20832J347584a80224D39296e4784
8078C16928Q41216l53280O9632B83136L65568P8336c99872C82976M15744j41824
8068F56896Q02304l56864b77504A039872j12128k82112Q99072o01088O64064G99232
8057d6080B98496Q75008P80800m21888k47808a08544B49856R92256m82304B33984
8046D14208J546240q83712M83328C83488D7616P31136j57696j25952R216L86560
8036H90880A84832K58560L51232L77344D56192M93056J20832J29024c98336A273344
$$ plain form
8109 1417216 1060352 1122304 1110528 967680 1322496 524800 1485312 1005568 1554432 1616896
8099 1616896 479232 536576 1647104 615424 373248 1073664 299008 532480 675840 898048
8089 898048 892928 25600 1478656 852992 1525760 120832 1468416 -180224 439296 -54784
8078 316928 1158144 804864 874496 283136 648704 727040 -399872 382976 798720 656896
8068 656896 1459200 1102336 -277504 1039872 927744 645632 1544704 943616 1607680 799232
8057 -46080 298496 1173504 1954304 1532416 1284608 -108544 249856 1242112 759808 233984
8046 414208 1960448 1076736 1560064 383488 47616 778752 621056 495104 504320 890880
8036 890880 184832 443392 794624 1171968 456192 949248 1070080 1199104 -398336 1273344
8025C84000L98848M02944l51744l55840J315840A35168J487360A55648J165312
8016A320960l82464k23744j40800L74272C94240J024000G01440L38944j36192
8007I04192e6832I63584k70848a96096G96160J027072N52448F27200Q56064r4720
7997A388544B79552j34144L30240K95936j6384J05472C45088J252352C51744O90688
7987A042432k58048L99360K00192o81472e1200G680R34400L87584l26656m31616
7977E71392J44896N60128l40992C86048j28000L9424R92256j10080l36896l15392
7967E27360j04448G1168N90848K23232j69472N34528J91488k89792k4064b69824
7956a42336A249792a2800I27232r9840l96800j92000J095680j20832d41344A202688
$$ plain form
8025 384000 782848 1185792 834048 478208 1794048 135168 1622528 155648 1320960
8016 1320960 938496 714752 573952 948224 394240 1418240 701440 1040384 904192
8007 904192 -56832 963584 692736 -196096 796160 1823232 2375680 627200 1483264 1388544
7997 1388544 279552 145408 475648 771584 755200 860672 345088 1597440 351744 1042432
7987 1042432 784384 1183744 1383936 702464 -51200 7680 942080 1329664 1003008 571392
7977 571392 716288 1276416 935424 386048 258048 297472 1289728 1179648 842752 527360
7967 527360 422912 71168 662016 885248 715776 1250304 1441792 1152000 1127936 -269824
7956 -142336 1249792 -12800 927232 827392 430592 238592 1334272 1213440 -441344 1202688
7945A664512l46112k98496B06848K42176K93376n8368J75104P44448m83840j39776
7935I79968n8368g1168A148928j7408D01920c47136I21600N61152A46944k0992
7925A25952O72768Q4992Q22272p36256k60608a40288o6560J9968A106944J10592
7915A217536l79904C80416N32992A10592J101824n99552l6352d35200D63360J000448
7905A463808o62528L31776O74304p42400A50016J244672C82976c65056N8368A13664
7894E44768j34656P12704C10272A07008J35168O9120L3792c5328D94080k19136
7884B74944j17248M29568L08736C20000L64032B45760R82016E6320O66112j23392
7874E99040N15584B05824Q34560C79392L77344E1200M08064P87456D3520M12160
$$ plain form
7945 1664512 1318400 1019904 206848 449024 742400 684032 859136 1603584 1119744 979968
7935 979968 921600 -71168 1148928 1131520 401920 -347136 921600 1482752 146944 125952
7925 125952 798720 883712 1705984 969728 709120 -140288 -206848 -186880 1106944 1217536
7915 1217536 837632 380416 913408 110592 1212416 612864 576512 -435200 463360 1463808
7905 1463808 801280 1133056 1807360 1064960 150016 1394688 382976 -365056 -306688 113664
7894 544768 410112 1122816 310272 107008 242176 311296 345088 -35328 494080 274944
7884 274944 157696 587264 896000 320000 684032 245760 1227776 56320 722432 599040
7874 599040 1114624 205824 1040384 379392 756736 51200 459264 1246720 43520 455680
7864D55680K04288n1200A47456M59776I7280C0208O15424P05024B8160J12640
7854A40800O06208A00352Q57088B81600K88768N25824B60608M57728M29056a10592
7843B51392P60320D2496M93568c40992E04832K22208l18976J203712D6080a63328
7832H47872m10112j84832a02400n63200A392128n47328K53440E2224Q63232L25120
7822A240576D16256A67424P59808D25472M93056K96960l4304L19488f81472C60960
7811I04192A12128O55872a02912B06336a44384E9392L87072J89440M15232D97664
7800A396224o57408d5568A040384k33472j69984K01216b99520l03104I98912B88256
7789f0928A038336k93888l06176O6048c41504A59744L54304k00192L11296a64864
$$ plain form
7864 455680 659968 608768 147456 607232 97280 30208 645632 1350656 28160 140800
7854 140800 747008 100352 957440 281600 570368 1096192 260608 718336 1147392 -110592
7843 251392 1011712 42496 536064 -340992 504832 727040 408064 1611776 46080 -163328
7832 847872 437760 252928 -102400 -665600 1392128 844800 1098240 52224 915456 1240576
7822 1240576 416256 167424 927232 425472 918528 1215488 1181184 1500672 -681472 360960
7811 904192 112128 768000 -102912 206336 -144384 59392 446464 635904 1051136 497664
7800 1396224 738816 -45568 1040384 806912 636928 838144 -299520 -602624 998912 288256
7789 -60928 1038336 744448 438272 504320 -341504 159744 514048 313856 625152 -164864
7778C24608d9152G7824O95808l20512L57888l03104B01216O86592c72224F83008
7767d38784C93216b0992F58432B12992Q192H0896J128448j68448A54624E3248
7756D10112J44896c17440E64224a43872I25696d80768c2256A73568L88096P36768
7746A298432b63680C09760R45664k60608C6864L85536K61120C3280Q18688m21376
7736D30592L3792c51744M9664F52800b7136E60640C8912N86752B14528o3488K78528
7725D29568B14528f08256F60992a65888F21056q1408k36544b11456m30592j96096
7715h38144C37408c8912C1744M50560j99680Q32512l51744R52832g33696H62208
7704G04512l3792k11456K8160j62816N82144l50208k54464R1136c05152e0688
$$ plain form
7778 324608 -49152 77824 773632 453120 811008 507904 201216 887808 -372224 683008
7767 -438784 393216 -20992 658432 212992 221184 80896 1209344 1040896 154624 53248
7756 410112 555008 -317440 564224 -143872 925696 -480768 -32256 173568 561664 1298432
7746 1298432 -263680 309760 1255424 994816 36864 422400 683520 33280 851968 430592
7736 430592 464384 -351744 -302080 652800 -27136 560640 38912 625664 214528 151040 429568
7725 429568 214528 -608256 660992 -165888 621056 539648 303104 -211456 -642048 -838144
7715 -838144 337408 -38912 31744 482304 282624 1115136 763392 1716224 -733696 862208
7704 704512 670720 459264 487424 324608 906752 556544 302080 393216 -305152 -50688
7693d56192I56416l67104k70336O29760A38752P74144k37056F7072K20672N120
7683B92864n5296J150976a4336l08224A120256h1920j18272j22368G87968l23584
7673D64384B06848g92576C58400j23392L05664L04640J78176A67936a37216A5872
7662A6384g86432E69856A19296i9840G88480j87392b62144A133056j93024B63680
7651D52608a64864E81632c92192p39840c44576E36576M19840a18272H12544R0112
7641I02656b33472B38592M096K39104c4816A3312h05376C64032J67424a024E06368
7629H6528b21696A87392a008128B30912A03424k9184K11456H9088f7584F90688
7618a01888k32448A37728c03616A357312i32864F11328k23744M096q5504a62816
$$ plain form
7693 -456192 956416 589312 318976 948736 138752 912896 675840 67072 287744 292864
7683 292864 237568 1388544 -14336 -322560 1120256 -81920 -200192 -322560 787968 464384
7673 464384 206848 -792576 358400 235008 540672 845312 1023488 167936 -137216 15872
7662 16384 -786432 569856 119296 -99840 788480 601088 -262144 1133056 940032 263680
7651 452608 -164864 581632 -392192 -1132032 -344576 536576 956416 -118272 812544 902656
7641 902656 -233472 238592 242688 481792 -34816 13312 -805376 364032 531456 -1024 506368
7629 86528 -221696 187392 -1008128 230912 103424 74240 285696 89088 -67584 690688
7618 -101888 -334336 137728 -303616 1357312 -932864 611328 387584 391680 306176 -162816
7607d74624A95584C8400i71264a13664n12m8640B05312M43904m608k06848c2768
7595a56672A7408f45120A059840e05344I16480B21696f0928A69984N42208c39456
7584f20544A031680I5744f82496D66432G168M92544a119232D15232p7312k048
7574C35872L59936e07392r6256R5744A142272C26144j53088c47648c8912G5264
7563c69152D65920d89984H75008b44736D01408D096g58272B74432f06208C7376
7552B28864h20224J48992j03424J43360K18624A404416e34016B60608G0656M06528
7542D77184A96608I7280b35008A489408b6112B55488b02752D99200j14176a59744
7531E88288k83648a82784Q8576c584q53504C09248L07712J13664h29952A11616
$$ plain form
7607 -474624 195584 38400 -971264 -113664 -114176 -162816 205312 649216 644608 437760 -32768
7595 -156672 17408 -645120 1059840 -505344 916480 221696 -60928 169984 712192 -339456
7584 -620544 1031680 95744 -682496 466432 7168 499712 -1119232 415232 337920 335872
7574 335872 695808 -507392 -603648 -507904 1142272 326144 173056 -347648 -38912 75264
7563 -369152 465920 -489984 875008 -244736 401408 4096 -758272 274432 -606208 37376
7552 228864 -820224 -671232 -774656 -631296 -412672 1404416 -534016 260608 70656 477184
7542 477184 196608 97280 -235008 1489408 -26112 255488 -202752 499200 385024 -159744
7531 588288 304640 -182784 -94208 -3584 -857088 309248 616960 730624 -829952 111616
7520g4240b8160C30752i03168B01216d98176j54112b47296F34880l01056A47456
7509b17088I9840i3696m608D87424P0656b13504o89152A91488b24768j147904
7499a372672a41824B48320c94752O8096A5872f79424B51392D8128N76000B23744
7488h22784B97984d71552D78720a059328c30752r1648B3552g7312f656j163776
7478a170432A566208B74432q3968e97504D9152M49536i2672l75808A23392e20704
7467f33344J57696J25952B59072A5872d63872B80576G5264d7616q09472K87744
7457e69344b06848p0144D6592M22400C8400K02752f84032K10944m4032j01888
7447f19008m85376a29536n87264E19680h54016a98656h4992j98656l44064F75328
$$ plain form
7520 -74240 -28160 330752 -903168 201216 -498176 -652288 -247296 634880 333824 147456
7509 -217088 99840 -93696 -98304 487424 558080 -213504 -902656 191488 -224768 -1372672
7499 -1372672 -141824 248320 -394752 -326656 15872 -679424 251392 48128 624128 223744
7488 -822784 297984 -471552 478720 -1059328 -330752 -422400 23552 -77312 -6656 -1170432
7478 -1170432 1566208 274432 190464 -597504 49152 498688 -92672 -468480 123392 -520704
7467 -633344 -475648 -349696 259072 15872 -463872 280576 75264 -47616 -857088 -569344
7457 -569344 -206848 -276992 46592 468992 38400 241152 -684032 -473088 -517120 -619008
7447 -619008 -1104384 -129536 -716800 519680 -854016 -198656 -84992 -283648 -627712 675328
7436g40352K58560E7856a460736D57728D3008L18464a90976H53504a221632M82816
7426g38816j42336G8848d06016a59232A65376a645056g99744J97120E09952Q37120
7416A347072b03776a5872j2800n86240L01056J22880j80736R5744A33120j0752
7406A22368d55680L3280D41856g18848a03424B66752d24960r58464a48480j214464
7396a362944f41024B98496b43712A12128f29760H52992d41856i216n9392o77888
7386g46496p680a51552q93440c05664F47168K44736a67936B59072M92544b01216
7375a42848C16928h22784c84000B3552c7376E05344f48192K54976B7648c54304
7364a419776f44608a22880k60608m3520R4208r72800F73280l32800A32608a243648
$$ plain form
7436 -740352 -481792 57856 -1460736 457728 43008 361472 -190976 853504 -1221632 -738816
7426 -738816 -881152 78848 -406016 -159232 165376 -1645056 -799744 -602624 509952 1347072
7416 1347072 -203776 -15872 -28672 -614912 -313856 -190976 -371712 -275968 133120 122368
7406 122368 -455680 -422400 441856 -718848 -103424 266752 -424960 -1383424 -148480 -1362944
7396 -1362944 -641024 298496 -243712 112128 -629760 852992 -441856 -9216 -68608 -746496
7386 -746496 -754176 -151552 -1044992 -305664 647168 891904 -167936 259072 751616 -201216
7375 -142848 316928 -822784 -384000 23552 -37376 505344 -648192 -393216 27648 -354304
7364 -1419776 -644608 -122880 -383488 -427008 -332800 -1305600 673280 340480 132608 -1243648
7353C79904H0896J9456f4000n39648l54304K89792J88416J73056C12320e20704
7342f144E1712e27872B94400e63712D9152f00064K66752B16576a07008A16736
7331C9424e00736F47168j16224e09952Q2432f5024q62208B26304g53664q46848
7321a600512f53824K66752r90208M21888M19840R0112k47808c9424A062400i88672
7310c77856p28576i4720n62176K09408a82272K4576E6320a536E1712P0144a777152
7298d81792a68960l16928l10784K33984A01888c1232A18272i24160J21344A90464
7287C72224a35168G87456b43712j030656d09600j61280D4032Q4992d84352J2288
7277d72064m97152b80064l7376o30784P680m80768e89312q46848j70496f29760
$$ plain form
7353 379904 80896 100352 -64000 -603648 -957952 -668160 -479744 -306688 312320 -520704
7342 -6144 51712 -527872 294400 -563712 49152 -600064 -333312 216576 -107008 116736
7331 39424 -500736 647168 530944 -509952 -427520 -65024 -927232 226304 -753664 -1600512
7321 -1600512 -653824 -387072 -1377280 -955392 -535552 -445440 -693248 -39424 1062400 -988672
7310 -377856 -1106432 -94720 -656896 -447488 -182272 -157696 56320 -1536 51712 121856 -1777152
7298 -481792 -168960 -485888 -796672 -562688 101888 -31232 118272 -924160 -802816 190464
7287 372224 -135168 787456 -243712 -1274368 -409600 -570880 44032 129024 -484352 -472064
7277 -472064 -969216 -280064 -317440 -948224 -940544 -1421312 -589312 -1436160 -1606656 -629760
7266c14880n53472A7920J94048b84672o19520d37760j92000B82624L4816b22720
7255b93376m45952c42016j276416e39136j13664b90816n65248F656O0928K20672
7245B88256B4576b87744G58784b40640E14560h15104j92512J36192n10976B34496
7234e64224R8816G49056f1440n89312E54496a3312n80096l45600j11616a31072
7223i2160n18656j47968B27840d55680a9456o24128N8368r20064c31264l04640
7213f35904I9840c55840q45312C7888i31840j32096M35200b31936o21568D81792
7202c584A117696c93216l072G8336g54176a01888j438720C43040g30112R6256
7192f33856C74784B4064a363456B20160e01760F89152J5360e46304i0624C76832
$$ plain form
7266 -314880 -868352 17920 211968 -284672 -904192 -437760 -629760 282624 317440 -222720
7255 -293376 -739328 -342016 -1618432 -539136 -652800 -290816 -856064 6656 67584 288256
7245 288256 24576 -287744 758784 -240640 514560 -815104 -1007616 -871424 -1382400 234496
7234 -564224 -465408 749056 -61440 -650752 554496 -13312 -593408 -939008 -1050624 -131072
7223 -92160 -610816 -758784 227840 -455680 -19456 -643584 -585216 -1505280 -331264 -635904
7213 -635904 99840 -355840 -1201152 37888 -931840 -1063936 -628736 -231936 -853504 481792
7202 -3584 1117696 -393216 -396288 78336 -754176 -101888 -1540608 343040 -730112 -633856
7192 -633856 374784 24064 -1363456 220160 -501760 689152 704512 -546304 -90624 376832
7181a85344r728j259520A30560d94080p08608M08576L41504O6560A29024a285120
7170e22752J35680l9936f4512C09248A06496g24480a01376k10944a47456G4752
7159h13056K22720q0384a67936q68864d84864n77536J79712b78528b2016o91712
7149g13728E16608g44960D98176a022976K36544b75968B89792c71712a31584j133056
7139a264640e16096A03424c51744D096c00544B72896a019904o75840Q41216c63520
7128i07776H704c47136B72384e16608A56672c51744B048a05472p01440c08736
7117g80288l12832a75616E0688e46816b64704a31584j30560G0656f64064k53952
7107i18016a44896k63680l70688b4064m51072I03680i62560M04992k03776L00544
$$ plain form
7181 -185344 -195072 -1454592 130560 -494080 -1202688 -794112 -452608 -386048 129024 -1285120
7170 -522752 -387072 -427008 -64512 309248 106496 -724480 -101376 -312320 -147456 74752
7159 -813056 -590336 -670720 -167936 -1036800 -484864 -1062400 -882688 -278528 -22016 -713728
7149 -713728 516608 -744960 498176 -1022976 -786432 -275968 289792 -371712 -131584 -1264640
7139 -1264640 -516096 103424 -351744 4096 -300544 272896 -1019904 -1695744 -854528 -363520
7128 -907776 8704 -347136 272384 -516608 156672 -351744 2048 -105472 -806912 -308736
7117 -780288 -1093120 -175616 50688 -546816 -264704 -131584 -262144 70656 -664064 -918016
7107 -918016 -144896 -408576 -779264 -24064 -475136 903680 -962560 -557568 -761344 -460800
7097d60800m99200M11136b26816A06496g95648K15040k40640b53440E29920G680
7086h91392M32128a18272l48160o05184f0416l04640r80992M81792a46944n54496
7076g01440b81600M0960D65920b20160m23424b89792p87456b9696j92000B09408
7065d45952a63328n03296j226240D82816e99552j009664c46112n86240B79552
7055a445376A50016e67808n92896B66752a105920J15712a43872j32608m33664
7046g10144C49184i01120A67936c57376o43072Q3456R0112L20000m86912F58944
7035d36224a58208M7104j178112J29536b90304r16992J72544E3248c7376m62848
7025e00224D58752a218560b41152n35040p2704h6016q13056B60096f30272j17760
$$ plain form
7097 -460800 -960000 -548864 -226816 106496 -795648 -580608 -821248 -253440 529920 7680
7086 -891392 -459264 -118272 -466432 -1071616 -60416 -365056 -1346048 -864256 -146944 -701440
7076 -701440 -281600 -240640 465920 -220160 -643584 -289792 -1077248 -29696 -221696 209408
7065 -445952 -163328 -666624 -1892864 482816 -599552 -1609216 -346112 -932352 279552
7055 -1445376 150016 -567808 -1160704 266752 -1105920 -990208 -143872 -276480 -710144
7046 -710144 349184 -901120 167936 -357376 -1000448 -916992 -826880 -506880 -993792 658944
7035 -436224 -158208 -111104 -1289216 -1159680 -290304 -1207296 -1034752 53248 -37376 -500224
7025 -500224 458752 -1218560 -241152 -776192 -848896 -86016 -899072 260096 -630272 -748032
7015g48032m82816d34176J76128C76320a145344k62656b51904F14912d72064l75808
7005h47872n82656N17632L15392O1952K47808D57216c71200r6768k50880J69984
6995e48864l072b51392l98336b82624n0688i2672A22368f02112K20160l65568
6985g47520Q6528J20320i1648j637376B24768i68704m73088Q1408b34496n72416
6975h06912F3488e01760A01376K28352j5360f41024a71520p07584B18624d58752
6964A32608d30592b14528o76864o9120D64384B26304a016832L99360R2160J83808
6954c41504N4272o47680R6256L79392k08896e3248j192448p69536e99040n41184
6944a140224B36032j00864d15744K3040J56160k24768P7312n77024J9968n55008
$$ plain form
7015 -748032 -1230848 -434176 -258048 376320 -1145344 -1408000 -251904 614912 -472064 -847872
7005 -847872 -1430528 -912896 -597504 -535552 -287744 457216 -371200 -467968 -718848 -548864
6995 -548864 -551936 -251392 -649728 -282624 -333312 -92672 122368 -602112 -381952 -747520
6985 -747520 -660992 -540672 -91648 -1729024 224768 -968704 -1441792 -1360384 -234496 -806912
6975 -806912 63488 -501760 101376 329728 314368 -641024 -171520 -879104 218624 -458752
6964 132608 -430592 -214528 -891392 -960512 464384 226304 -1016832 -617472 -525312 -341504
6954 -341504 -287232 -934912 -838656 -459264 -668160 -53248 -1245696 -2015232 -599040 -1140224
6944 -1140224 236032 135168 -415744 -392704 -236544 -461312 -384000 -961024 -941056 -1496064
6934a496064d72064k89792J47456j56160r3696A46944c80416D0448f02624q6016
6924f88640c21024j396736Q57600C33824b325504i42080J39264C38432a20320
6914e33504l41504C64544j66912J74080c5328m93568A12128a049088m57728c54816
6903h86784J74592L36384k3040a41312l48160b25792q18688j36704L22560j48992
6893a007616L55328K54976l1744E82656b048l07712p71072A31072i21600d18816
6882i29792J69472q7552b31424j008640e91360j313792A83808a360896N06880
6873h54016B44736f77376K17600J83808m9664m30592J13664J86880J0752l4304
6863d79232j46432R1136j116672d24960b6112r40544D55168a154048e07904a58208
$$ plain form
6934 -1496064 -472064 -761856 -614400 -770560 -864256 146944 -380416 40448 -602624 -688640
6924 -688640 -321024 -1717760 -860160 333824 -2325504 -942080 -802816 338432 -120320
6914 -533504 -875008 364544 197632 371712 -35328 -528896 112128 -1049088 -1506816 -354816
6903 -886784 -712192 -375808 -398848 -141312 -489472 -225792 -1044480 -1181184 -858624 -1007616
6893 -1007616 -652288 -397312 -429056 582656 -2048 -309760 -1080832 131072 -921600 -418816
6882 -929792 -760320 -847872 -231424 -1240064 -591360 -1905152 183808 -1360896 -854016
6873 -854016 244736 -677376 -459776 -275968 -325632 -756224 -642560 -455680 -444928 -479232
6863 -479232 -625664 -534528 -1651200 -424960 -26112 -966656 455168 -1154048 -507904 -158208
6852a531392d81280i1136q43776a40800j104384k11456O99392J65888b53952l10272
6842e64224n632r39008D17280A83808g63904J98656K61632k92352o76352h7040
6831i24672k53440J16224m2496o90176F5536a169920b58048H3456e04832o94784
6821a199616c63008l84000K59072l49184d8640j3312G5264e47328G6800c26656
6810a242112a98144o54336k51904c87072D24960e02272I216g29088n9904A53088
6799f22592n1200R6768L0208j129472e38624l09760L072m06528b18112l71712
6789e89824q0896c03616q68352N11488A3824J9456e84192a64864j081344b85696
6778a290752E96992h23808m35200e59104p28576b71872O9632j235456c98848n60128
$$ plain form
6852 -1531392 -481280 -91136 -934912 -140800 -1245184 -1456640 -757248 -591360 -253952 -564224
6842 -564224 -569856 -1508864 417280 183808 -763904 -565248 -303616 -595968 -1272320 -87040
6831 -924672 -1178112 -1061888 -1104384 -1794560 65536 -1169920 -258048 83456 -504832 -1199616
6821 -1199616 -363008 -747008 -487936 -837120 -48640 -61952 75264 -547328 76800 -326656
6810 -1242112 -198144 -852480 -1104384 -387072 424960 -502272 9216 -729088 -788992 153088
6799 -622592 -673792 -577024 -546816 -1676288 -538624 -848384 -845312 -1251840 -218112 -589824
6789 -589824 -670720 -303616 -1171968 -660480 13824 33280 -584192 -164864 -1246208 -285696
6778 -1290752 596992 -823808 -1259008 -559104 -1287680 -271872 -202240 -1437696 -398848 -958976
6768i58976m01408c85024p50080F27712a238016L57376r4208A93024d60288l28192
6758g88480a33120k048m71552o5536a49504l34336p21920l55328A44896O144a44896
6746d99200B91840g41376O7072o78400b87744p79776K33984L89632J20832j63328
6736d86400d5568j849344R27744n77536M84352L63520k16064k29376N47328k7136
6726f22080n07904p8848L44576b27328n67296c02592j083392L55328M71040k82624
6716h42240k59584c64032j88416l18976b29376m20864L5840k83136L72736J00352
6706d24448g2192o37952J02912J22880C30240d24448j70496n39648M32640l15904
6696a017856d05504e632o35392j41312r03168h26368j38752n60128g38304p81824
$$ plain form
6768 -958976 -1360384 -385024 -1135104 627712 -1238016 -880640 -974848 193024 -460288 -788480
6758 -788480 -133120 -135168 -606720 -672256 -149504 -483840 -1205760 -1561088 144896 151040 -144896
6746 -499200 291840 -741376 -674304 -1352704 -287744 -1067520 -833536 -443904 -323072 -486400
6736 -486400 -45568 -1894912 -967168 -1544704 -1060352 -696832 -912896 -1142272 -594944 -622080
6726 -622080 -1129984 -1208832 -864256 -227328 -794624 -302592 -1385984 -1030656 -559616 -842240
6716 -842240 -1101824 -364032 -552448 -871424 -229376 -650240 -614400 -897536 -524800 -424448
6706 -424448 -72192 -710144 -607232 -484352 330240 -424448 -594944 -1134592 -701952 -1017856
6696 -1017856 -405504 -5632 -641024 -782336 -1685504 -826368 -965120 -1525248 -738304 -1520128
6686a520128O51264m06528j40800c89120r02144e41696B45760N14560a61792p07584
6676h69376A81760b79040r90208d20864c5840l46112p39840R3184L80928m77184
6666a124864N02784a58208F42048a172480M72576a11616o37440J1776K97984M3008
6656c96288l03104k97984j06496M45952J23392j5872p10144d64896k88256K25792
6646e27360n62176n76000d58752F7072a314816b40640m59776A18784a821696D3520
6635a682944e52960C39456B1504d55168r3184C13344e16096B57024i78432l44064
6625a322496N52960g7312k10432q36096B35520e92384K05824E21728g43424o38976
6615a382400b51392j598976i05216k35520L66080c63520M3520L6864f9120l99872
$$ plain form
6686 -1520128 -868864 -1275392 -1416192 -389120 -1291264 -541696 245760 760320 -161792 -869376
6676 -869376 181760 -279040 -1269248 -420864 -35840 -381952 -1121792 -1028608 -647680 -1124864
6666 -1124864 -622080 -158208 642048 -1172480 -699904 -111616 -749056 -737280 -439296 -396288
6656 -396288 -699392 -997376 -1103872 -657920 -534528 -550400 -1260544 -464896 -753152 -527360
6646 -527360 -1089536 -1665536 -458752 67072 -1314816 -240640 -700416 118784 -1821696 43520
6635 -1682944 -552960 339456 21504 -455168 -548352 313344 -516096 257024 -978432 -1322496
6625 -1322496 -769536 -77312 -287744 -1123840 235520 -592384 -386560 521728 -743424 -1382400
6615 -1382400 -251392 -1850368 -905216 -1140736 -774656 -363520 -320000 -283136 -69120 -468992
6605d68992r0112b50368q12544b87744j38240B09920a403392M74624E29408a497600
6594a397248b57024k77504j28000n00224N49888Q0384q26880H2432L69152a521664
6583a406976a14688A042944a75616j41824j354240e81632J68448l28192o44608
6574a385984a64352l31776k24256a87904q50432b90304m03456M608K28864k59584
6564g19872l37920a58208n39136j86880K36032a01888l82976o43072G61856f86080
6553D76160A0752g81824o85056a71008j179136D28032i04192j73568a56160j68448
6543c24608n74976q82176f72768j83808m82816j60768d25984J84320j120768g9872
6532d30592c8912m43392q96512M88448D82304d4032p13216b27328E01248a894912
$$ plain form
6605 -468992 -559104 -250368 -1062912 -287744 -425984 209920 -1403392 -928768 529408 -1497600
6594 -1397248 -257024 -534528 -662528 -1162752 -612864 -532480 -1359360 82432 451584 -1521664
6583 -1406976 -114688 1042944 -175616 -317440 -1671680 -581632 -413184 -741376 -1385984
6574 -1385984 -164352 -496128 -720384 -187904 -1038336 -290304 -693760 -689152 -460288 -719872
6564 -719872 -1057792 -158208 -697344 -884224 -648192 -101888 -484864 -1127936 761856 -686080
6553 476160 10752 -781824 -1466880 -171008 -1350144 428032 -904192 -1077760 -156160 -324608
6543 -324608 -899584 -1781760 -672768 -856576 -1339392 -1500160 -425984 -241664 -1362432 -79872
6532 -430592 -38912 -482304 -1378816 -890368 482304 -44032 -757248 -227328 501248 -1894912
6521e21216l84512k90304b12992n26848J16224q17152K44736e3760k80576j92000
6511e26336k60608l71712K82112l38944a18272B80576a87392q17664L23072a54624
6500g97696c81952p95648L5328e57568p98720o1952d22400P2704q39168e56544
6489d57216j132544g21920o85056e85216j33632F656f09792M608B60608d03456
6478B5600b261504e5296m44928r72800f70208m04480L01568l99872N27872k36032
6468h81152j86368j2288b60608j50528J82272j164288A03936d67968n36064L35360
6458f68672L25632l99872a41824q42752E49888f2464r27744c68128j0752l14880
6448f93760K18112k42688K67264g5264p48032c86048j56160P0656q41728M50048
$$ plain form
6521 -521216 -905728 -1196032 -212992 -739840 -623616 -1440768 -1196032 -53760 -334336 -526336
6511 -526336 -786944 -1158656 -876544 -1215488 -118272 280576 -187392 -1005056 -681984 -154624
6500 -797696 -381952 -1177600 -1142272 -557568 -1356288 -1418240 -422400 -349696 -1188864 -556544
6489 -457216 -1589760 -721920 -1406976 -585216 -718848 6656 -609792 -605184 260608 -403456
6478 25600 -2261504 -55296 -500224 -1473024 -670208 -1074688 -773120 -1172992 -645120 -881152
6468 -881152 -1067520 -1079808 -260608 -411136 -228864 -1393152 103936 -467968 -1004032 -668672
6458 -668672 -343040 -742912 -141824 -984576 549888 -62464 -990208 -368128 -378880 -693760
6448 -693760 -475648 -718336 -451072 -75264 -823296 -386048 -542208 -471552 -1313280 -863232
6438h63232a56672A31584a176064N54496j38240p74656g21408c05664m92032b7136
6427a012736b560j83296r79456b47808r01632J71520l66080A08032a179136a31584
6416g01952L43552m29056m36224i2672o65088I1648l1232L3792a053696B27328
6405g86432r54368b65216p4752m77184j79200l16416A29536c14880l86560n88288
6395a289728c49184L2256n04320K72896r78432D6592f0928o41024n69344b08896
6384D37248g98720L30240k65728b12992j458688g3216A19296h48896k82624d83328
6373a016832j24416e120j553408d14720j83296a45408l61984j41312G96672B22208
6362f4000l25120l33824m18304J33120K0992f7584F4000g29600j449472B39616
$$ plain form
6438 -863232 -156672 131584 -1176064 -621568 -759808 -1534464 -721408 -305664 -797696 -27136
6427 -1012736 -2560 -185856 -1165312 -247808 -1149440 -977920 -1344000 108032 -1179136 -131584
6416 -701952 -358400 -787456 -1223680 -92672 -757760 91648 60416 94208 -1053696 227328
6405 -786432 -1740800 -265216 -339968 -817152 -996352 -1312768 129536 -314880 -701440 -1289728
6395 -1289728 -349184 -316928 -821248 -548352 -1526784 46592 -60928 -701952 -1271296 -208896
6384 437248 -798720 -468480 -734208 -212992 -1671680 -73216 119296 -848896 -1131520 -483328
6373 -1016832 -1141248 -5120 -1558528 -414720 -598016 -145408 -507392 -648704 796672 222208
6362 -64000 -389120 -722944 -1141248 -1008128 -987136 -67584 64000 -729600 -2179072 239616
6351h07424o5536c38432j036288B21696f44096H4480a62816q86272l08224J43360
6341a213952d37248r3696m31104q18176h72448a21856n44768j8432E92384j62304
6331D30080i72288d20352A034752e99040N5296j416192g88992d5568j14176q17152
6321i76896n60640d24448j48992J16224m99200L60960I9840N61152i17504A62304
6310h36608R1648J25440n32992l67616O07232o4512g3728l97312Q5504a58208
6299a548800M79232d25472l42528k5088l81952a8944p06048b82112o72256l71200
6289a325568N10976p04000b20672E8368i17504K93376m80256d11648A08032f95808
6278C21024P41376a790976h91904q26368h16128B35520d96128r2672r10336N90848
$$ plain form
6351 -807424 -872960 -338432 -1374720 221696 -644096 84480 -162816 -1049088 -1357312 -1213952
6341 -1213952 -437248 -530944 -962048 -1780224 -872448 -121856 -666624 -685056 592384 430080
6331 430080 -972288 -420352 1034752 -599040 -543744 -1959936 -788992 -45568 -159744 -976896
6321 -976896 -1537536 -424448 -573440 -457216 -956416 -595456 99840 660992 -917504 162304
6310 -836608 -744960 -619520 -1152512 -1520128 -912896 -977408 -73728 -471040 -385536 -158208
6299 -1548800 -1069568 -425472 -768000 -793088 -1175040 -18944 -724992 -282112 -954368 -1325568
6289 -1325568 -814592 -1518592 -220672 58368 -917504 -624128 -1104384 -411648 108032 -695808
6278 321024 1062400 -1790976 -891904 -1718272 -816128 235520 -496128 -588800 -1499136 -908288
6268i08288A08032a251328d50048k15552D65920e04320p41376M74624c3792n02784
6258e36576j161728a65888j033216N23264b02240B2528a319424d46464k15552
6249f62016r35936d61824l03104b48320q97024c88608l89632j77664l25120N14560
6239g66464P680j016832a67936j399296e30944K45248n49888J04448j087488Q56576
6229i62048M53632J34656r86624f38464j77664Q1408n42208k61632b57536j199616
6219a457152f44096b08896j316352O74304a88928q13568c90144o93248J59232
6210i24160A20832c51232C65056C0208J07008i64096a80736j87392k56512j9456
6200f44096c06688l16416p34720N64736j57184J35680m61312M99200i7792j486848
$$ plain form
6268 -908288 108032 -1251328 -450048 -665600 465920 -504320 -1245696 -771072 -33792 -536576
6258 -536576 -1698304 -165888 -1199104 -675840 -202240 22528 -1319424 -446464 -662016
6249 -662016 -1597952 -461824 -764928 -248320 -1145344 -388608 -778240 -955904 -1281024 -766464
6239 -766464 -758784 -1775616 -167936 -1567232 -530944 -285696 -835584 -731136 -1818624 -962048
6229 -962048 -508416 -373760 -1360384 -638464 -816128 -734720 -1276928 -1538560 -257536 -1457152
6219 -1457152 -644096 -208896 -1525248 -850944 -188928 -1002496 -390144 -1083392 -924160
6210 -924160 120832 -351232 365056 30208 137216 -964096 -180736 -368128 -624640 -644096
6200 -644096 -306688 -623104 -1357824 -793088 -950272 -814592 -1275904 -776704 -97792 -1584640
6190a584640d35712o52288B64704f12352n7344e5808n85728K88256p5776j149440
6180a578496B53440a471488e86752C3280a039872C58400b76992l01056q35584
6171a413632a64864j608192g52640r5744I07264f79936K47808K13504k5088l82976
6161f26688b90304l23072j29536o19520e92384K67776n10464c51232q32000M22912
6151g60320l79904d45440j22368A16736O57920b54464q73472A41312f55872a44896
6140d68992J12640n83168l52768D89472a049088a42336D80256e47328C22048a229824
6129a98144O1952m608D15232i62048j4848K48832O4000J39776j078784B0480K09408
6118B29888I3184h52992K5088J90464O5536j66400F10816d68480l65056p8848
$$ plain form
6190 -1584640 -435712 -1088000 264704 -612352 -669696 -55808 -641536 -353280 -429056 -1578496
6180 -1578496 253440 -1471488 -586752 33280 -1039872 358400 -276992 -578048 -1413632
6171 -1413632 -164864 -1773056 -752640 -848384 907264 -679936 -432128 -218624 -243712 -626688
6161 -626688 -290304 -613376 -742912 -1362432 -592384 -324608 -835072 -351232 -1183232 -760320
6151 -760320 -1140224 -445440 -567808 116736 774656 -254464 -1127936 141312 -655872 -144896
6140 -468992 -356352 -939520 -1292288 489472 -1049088 -142336 480256 -547328 322048 -1229824
6129 -198144 -136192 -140800 415232 -962048 -976896 -728064 -664064 -524288 -1603072 20480 229888
6118 229888 93184 -852992 -827904 -637440 -571904 -738304 610816 -468480 -833536 -912384
6108i12384N7344L30752l15904o9632L23072J48480k17088J16736D64384i74848
6097g92576K12992J57696m16768b55488j326592O34880L35872r72288c67104J38752
6087b28352l89120m03968C62496a972224c80928l11296c07200r39520L56352N5296
6077h35072K90816C48160f74304K97984m02432j85856c74272E91360d37248m23424
6067h60672b4064j36704q2432p85408d83328p28064J92000D48000e39136j57696
6057f96832K30400M1984j013760C99360f71232c2768B39616i44640K97984q82176
6047a528832e90848b65216j05472D42880f98880j62304N3248L39968o34880e20192
6036a25440p84896m62336d04480a20832m88960p8848B9184M47488b18112q7552
$$ plain form
6108 -912384 -855040 -524288 -840192 -909824 -586752 -438272 -655360 -538624 464384 -974848
6097 -792576 -579584 -421888 -838656 -255488 -1582080 -947200 -611328 -1583616 -367104 -228352
6087 -228352 -617472 -1021440 362496 -1972224 -380928 -692224 -307200 -1246720 -890368 -835072
6077 -835072 -544256 348160 -674304 -376320 -778752 -964608 -374272 591360 -437248 -860672
6067 -860672 -24064 -160768 -243200 -1028608 -483328 -1211392 -1019392 448000 -539136 -696832
6057 -696832 -466432 -424448 -1438208 399360 -671232 -32768 239616 -944640 -646656 -1528832
6047 -1528832 -590848 -265216 -370688 442880 -698880 -861184 -807936 -467968 -1102848 -520192
6036 -125440 -910336 -1372672 -404480 -120832 -609792 -688640 29184 476672 -218112 -305664
6026c05664F2464e38624K41664p8848q34560F30272b50368J8432q98560d74112
6015D71040c68640A62304a268736K31936m04480D76160k26816c92704l30752c13344
6004d92544J57696O8096j85856k45248A49504a377792J536e36064R3184k5088
5994d67968A15712d64384j167360L00544a10592j76640j618432f8096j180160
5985a248256e8880j50016j262592e19680a41824o97856m98688d9152J6384q24320
5975h57088p28064d45440K02752j416192L34848C32800a65376P9360B65728a285632
5964A1264f46144a30560l9936o75328l64544e55520J50528a02400n8368m47488
5954f08256K50880q63744K40128b71872r38496a71520j157120J86368J11104J84832
$$ plain form
6026 -305664 62464 -538624 -296960 -375808 -1210368 630272 -250368 -231936 -1130496 -474112
6015 471040 -368640 162304 -1268736 -1036800 -1441280 476160 249344 -392704 -723456 -313344
6004 -492544 -334848 -266752 -452608 -697856 149504 -1377792 -1376256 -536064 -442880 -467968
5994 -467968 115712 -464384 -1631744 -1331200 -110592 -287232 -1905664 -68096 -1248256
5985 -1248256 -58880 -208896 -1471488 -519680 -141824 -839680 -1338368 -49152 -32768 -857088
5975 -857088 -1585152 -445440 -242688 -1658880 -1324032 332800 -165376 -86016 265728 -1285632
5964 11264 -646144 -130560 -170496 -845824 -1210368 -555520 -404992 -102400 -160768 -608256
5954 -608256 -357376 -1221120 -980992 -271872 -1210368 -171520 -1328640 -1142272 -1031168 -846336
5944h46336J81248F55360e22240q9088n85216M70528n07392C55840b15040C27680
5933a06496F58432h63232D7616a18784o09280D22400g62368K44224A55136f85056
5922a147392L072d7616r38496M53632n96480B89280e26336G7824e93920b25280
5911I2160b90304k23232K53952m42880n73440N48352a36704k74432J75616j490944
5901a726464a82272q94976l10784D0448c14368j80224j67424k14528l43040J97120
5891a022464L47136D9664h28928j317888Q46336B1504a031168K75456n25824M40832
5881h40704L63008D65408a163264c16928p77216a42848j172480q3456K24768M62848
5871g11168m55168C8400g59808J87392j029632e08416C79904N5808g16288m42880
$$ plain form
5944 -846336 -665088 655360 -522240 -611328 -1196544 -726016 -1233408 355840 -215040 327680
5933 -106496 658432 -863232 47616 -118784 -728064 422400 -762368 -518144 155136 -685056
5922 -1147392 -1144320 -47616 -986112 -532480 -1128960 289280 -526336 77824 -593920 -225280
5911 92160 -290304 -513536 -259584 -702464 -1275904 -727552 -136704 -411136 -235520 -1726464
5901 -1726464 -182272 -1077248 -1388032 40448 -314368 -494592 -662016 -876544 -1219584 -1022464
5891 -1022464 -675328 49664 -828928 -2146816 -1300480 21504 -1031168 -755712 -1281536 -840704
5881 -840704 -477696 465408 -1163264 -316928 -1094144 -142848 -1315328 -1398784 -1174016 -711168
5871 -711168 -1166336 38400 -759808 -572416 -1602048 -508416 379904 435712 -716288 -1159168
5861a159168M53632J01376j12128G8336h1920j35168E8368R5744K82624a116160
5850B85184a263104b04288r28768a07520E61152a400832Q2944N39648j94048C25632
5839b15552j272832P30624l7888K97984n12n95968M57216c04640l20000p95136
5829a419776f27200j58720k74432k36544L10784e1712q30976B00704a634304O19008
5819a015296b65728q23808k53440c38944l83488B3552a180160A00352a488384
5809a107968r89184a63328j011200d65408o57408N10976l48672M8640c94240A62816
5798i88672F5024a231872a64352j394176O07232A98656a202688L03616l82464
5789a281536N24288k560j31584j45408d67968m14720b43200j320448N23264L60448
$$ plain form
5861 -1159168 -705536 -604160 -716288 78336 -81920 -217088 58368 154112 436736 -1116160
5850 285184 -1263104 -204288 -1133056 -107520 561152 -1400832 -1317888 -778240 -972288 325632
5839 -215552 -1488384 -757760 -795648 -497664 -498176 -1094144 -636928 -304640 -624640 -1419776
5829 -1419776 -627200 -785920 -1060352 -1296896 -986112 -51712 -882688 200704 -1634304 -1015296
5819 -1015296 -265728 -1089536 -1342976 -338944 -722432 23552 -1180160 100352 -1488384
5809 -1107968 -2097152 -163328 -1174528 -465408 -1122816 -611840 -960512 -911872 -394240 162816
5798 -988672 65024 -1231872 -164352 -1558528 -951296 198656 -1202688 -899072 -1281536
5789 -1281536 -757248 -759808 -891392 -1036800 -467968 -882688 -243200 -1563648 -1040384 -679936
5779f79936m25472M79232m88960L37408l91680M75648b26304m67968J8432J67424
5769e08416r216E14560a060864B64192a500672l45088g26528D25984e04832o44096
5759a148928L76832j260544e35552q44288a61280j55136q8576A61280d22400J90464
5749b31936r06240d50560k40128O4512a83296j602560b53952m78208g168r11872
5739i19040R0624D58752a2288j078784L35360j30560K85696k31936l07712c072
5728c09248c9424m73600r26208c81440m28032m78208c39968n84704M21376b23744
5717g17824r5232A52576i90208m13184e33504j57184p9360k88768a30048r41568
5707a071616k17088m41344A87392g96160b08384q192L8912r3696G6800a584128
$$ plain form
5779 -679936 -1105408 -626176 -1115136 -777728 -1169408 -693760 -226304 -694272 -675840 -508416
5769 -508416 -517632 514560 -1060864 264192 -1500672 -1845760 -726528 425984 -504832 -1148928
5759 -1148928 -772096 -2032640 -535552 -1379840 -161280 -316416 -404992 161280 -422400 -231936
5749 -231936 -1138176 -450560 -690688 -626176 -183296 -1785856 -253952 -732160 -7168 -919040
5739 -919040 -828416 458752 -12288 -1091072 -755712 -886272 -600576 -832512 -1140224 -3072
5728 -309248 -39424 -513024 -1439232 -381440 -809472 -1287680 -339968 -924672 -503296 -223744
5717 -717824 -813056 152576 -990208 -1403392 -533504 -690688 -770048 -1058816 -130048 -1071616
5707 -1071616 -1288704 -1730048 187392 -796160 -208384 -216576 -177664 -271360 76800 -1584128
5696h16640R1136j07008R0112o34368L07712n12N120i6768n5296j965056a54112
5684f89152f656j183232k07360L06176J10080L85536e632q48384b36544p83872
5674a020416N7344c90656q96512M86400j49504A3312h62720c23072m35712b09920
5663a531392b95424A050624i70240L13344J95584j83808j29024l26656d54656
5653d37760m0960F43072a19296l68640k62656k92864M63360a81248n09952p11680
5643a402880c57376j41312r14432f15424n95968m17280c1744m25472q64256M04480
5633i16992L13344J37728Q6016n31456Q3968C2768N42208a499136c52256m87424
5623h39680h0384l584r45152d46464l15392K15040r60512N82144n0688j05984
$$ plain form
5696 -816640 -725504 -832512 -742400 -1376768 -1069056 -1069568 -1064448 -96768 -152064 -2117120 -154112
5684 -689152 -6656 -1189888 -1397248 -1091072 -980992 -595456 -5632 -854016 -236544 -1020416
5674 -1020416 -963072 -390656 -1287168 -800768 -950272 13312 -862720 -323072 -758784 -209920
5663 -1531392 -295424 1050624 -970240 -656896 -461312 -645120 -774144 -1100800 -454656
5653 -437760 -478720 643072 -119296 -487936 -750592 -1043456 -580096 -181248 -691200 -1402880
5643 -1402880 -357376 -498688 -1413120 -615424 -1211392 -1628672 -31744 -457216 -1321472 -916992
5633 -916992 -603648 -465920 -379904 -911360 -827392 32768 574976 -1499136 -352256 -839680
5623 -839680 -80384 -83968 -1029120 -446464 -761856 -546816 -1507328 -925184 -975872 -1081856
5613a081856b3552r14432J33632c59936p11168M46464r67680b59072j025536e38624
5602g29088b31936j15712A11616P168a762816C84512a544192K60608L15904m46976
5592a414656N31968J82784E69344e85216q50944K40128B67264d13696P2192m62848
5582h04352I9328m0448b43712n79584n77536e42208b46784f1952q31488K6624
5572h66816l99360M52608C17952d63872J72544D3008h56576b64192l30240l59424
5562i53856k91840n31968O61504a6384j102336e34528o46656e65248l88096p26528
5552a679872B79552i41568K91840m30592E53472a304576C4816a849856P71584
5543a078272b03776k25792q1408r728p8336J93536q1408N3760J67424C36384C0208
$$ plain form
5613 -1081856 -23552 -937984 -804352 -359936 -1071104 -624640 -1592320 -259072 -1284608 -538624
5602 -729088 -231936 -347648 111616 118784 -1762816 384512 -1544192 -1283584 -967680 -1414656
5592 -1414656 -882688 -699904 569344 -585216 -1436160 -1196032 267264 -413696 -341504 -804352
5582 -804352 99328 58880 -243712 -823296 -1400832 -542208 -246784 -61952 -893440 -866816
5572 -866816 -1266176 -813568 317952 -463872 -291328 43008 -856576 -264192 -594432 -953856
5562 -953856 -1245696 -1777664 -1116160 -16384 -1118720 -534528 -1181184 -565248 -953344 -1679872
5552 -1679872 279552 -941568 -649728 -1080320 553472 -1304576 34816 -1849856 -1078272
5543 -1078272 -203776 -429568 -510976 -520704 -599040 -405504 -486912 -433152 -265728 336384 30208
5531a011200m01408M33152p34720C33312a57184j021952o0928M1472d65408p9872
5521e45280p84896j28512K3040A84320g73632n7856L86048K3040m01408n00224
5511a324032L64032f8608m89472J69472r70240c65568B85184d61824Q6016l00032
5501f75840L02592l94752l8400q57088g15264j90976L75808r46688o34880A62304
5490a553920D8640J7920d40832j347072e32480n76512A01376i55392m57216b13504
5479e82144B7648f12864n55008c69152k95936b30400p77216B61120a182208b58560
5468b22208A48480c45088B36032F2464P12704f42048A23392K4576f8608H50944
5457c02080Q0384l19488n18144M88448J52064p36768H28416c91168p17312c70688
$$ plain form
5531 -1011200 -1412608 -979456 -1714176 333312 -157184 -1179136 -1240064 -1198592 -465408 -545280
5521 -545280 -1330176 -1458688 -1435648 184320 -773632 -831488 -445440 -422400 -823808 -1324032
5511 -1324032 -960000 -68608 -558080 -388608 -1358848 -365568 285184 -461824 -375808 -675840
5501 -675840 -373248 -768000 -806400 -1663488 -715264 -906240 -530432 -1477120 -2112000 162304
5490 -1553920 48640 66560 -440832 -1787904 -532480 -1108992 101376 -955392 -1412608 -213504
5479 -582144 27648 -612864 -1167872 -369152 -665088 -230400 -1007616 261120 -1182208 -258560
5468 -222208 148480 -345088 236032 62464 775168 -642048 123392 147968 -68608 850944
5457 -302080 -221696 -541184 -1059328 -570880 -418816 -1155584 828416 -391168 -1108480 -370688
5446b71360k41152m46464J67936K67264j49504a46432j3312j603584c77344q78592
5436a255936b07360j231872f88128J0240o656a18272q9600j238528J4848f90688
5425a056768e02272j409536M21376b16064k35520a56160m50560l6352k41152J62816
5415g21408k47296M30592m2496m61824e17120q92928k62656b20672j018880b74432
5404g58784a44896o89664K11456o14912c99360I29792e86240r01120J28000L46112
5394a013248K65728J20832J46944k39104o86080f72768A16224a691136H2944a464832
5383a903616B6112a857536d44928j52064I1648i62560M6592O5024E63712a012224
5372a150976j52576J63840j077760h73472L15904a42336m95616M1472b59584k167808
$$ plain form
5446 -271360 -512512 -958976 -791040 -523776 -673280 -146432 -159744 -1763328 -377344 -1255936
5436 -1255936 -207360 -1439232 -688128 -677888 -684544 -118272 -207872 -1446400 -1431552 -690688
5425 -1056768 -502272 -1911808 -1490432 -216064 -451584 -156160 -606720 -643072 -884224 -721408
5415 -721408 -968704 -538112 -580608 -1042432 -517120 -1410048 -1672704 -220672 -1239552 -274432
5404 -758784 -144896 -834560 -623104 -1238016 -399360 929792 -586240 -1487360 -1359360 -1013248
5394 -1013248 -747520 -626688 -479744 -718848 -1404928 -672768 116224 -1691136 82944 -1464832
5383 -1903616 26112 -1857536 -444928 -596992 91648 -962560 -915968 -850944 563712 -1012224
5372 -1150976 -1303552 -1139712 -2217472 -873472 -557568 -142336 -637952 -596480 -259584 -2427392
5362b427392b47296n93408J67936k6112G9360g37280a77664A04448b05824K3040
5352a82784r87648h7552r62048M50048m79744M96640P4240P9360q12032L96800
5342h44288C83488a486848g168r32864a37216H4992f68160a94048a0240l79904
5332c90144F4000d67456j342976P51616c16416C20512a592832e82656m28544k69312
5322a280512f11840k25792l27168k08384a51040m45952k43712J70496b6624D7616
5311a86880j95072j3312o26688J59744B05312c15392J37728q3968I80992a99680
5300b52416p24480C25632c90656E22752K69824g47520B48320a69984m10624a53600
5289e70880r9328m97152h7552E61152p5776H5504A5872b0480C13344i80480k048
$$ plain form
5362 -2427392 -247296 -840704 -672768 -698880 79360 -737280 -177664 104448 -205824 -182784
5352 -182784 -1170432 -87552 -1049600 -599552 -1079296 -582656 -508416 -429056 -1241088 -844288
5342 -844288 383488 -1486848 -7168 -940032 -137216 84992 -668160 -194048 -10240 -390144
5332 -390144 64000 -467456 -1810432 -1058816 -316416 320512 -1592832 -582656 -1011200 -1280512
5322 -1280512 -611840 -837632 -1164800 -1373184 -151040 -596992 -840704 -670208 -26624 47616
5311 -186880 -381952 -395264 -1021952 -862208 205312 -315392 -177664 -261632 980992 -199680
5300 -252416 -976896 325632 -390656 522752 792576 -747520 248320 -169984 -580608 -153600
5289 -570880 -670208 -1167360 -87552 561152 485376 85504 15872 -20480 313344 -980480 -982528
5278i82528b87744r91744A74592f9120l70688A018368g73632j93024b70848r8816
5268c69664q192a42848C79392A08544g83872O8608k93888J85344b92352r93280
5258a285632M11136p0656E34528a592320L60960r728J96608d93568a39264r64096
5248a103360L51232M8640J04960p40864N87264a36192j374208b14528l71200l74272
5238i60000l22560a53088o47680j68960j33120K05312m76672N38112p58784K02240
5228a392640O47168J09056b27328p58784j03424K73408J84832C95264h33024l5840
5218h68864k14528c37408q61184c04640o03136j77664K12480n45792M12672O7584
5208i38496d01920n62176n90848o5024h06912A60768a255424c82464J04960j76128
$$ plain form
5278 -982528 -287744 -1279488 174592 -69120 -439808 1018368 -773632 -966656 -270848 -369664
5268 -369664 -377856 -142848 379392 108544 -783872 -715264 -1009152 -823808 -292352 -1285632
5258 -1285632 -874496 -945152 534528 -1592320 -1231360 -1241088 -1044480 -493568 -139264 -1103360
5248 -1103360 -752128 -703488 -598528 -1339392 -752128 -136192 -1510400 -214528 -585728 -960000
5238 -960000 -1282560 -153088 -800768 -969728 -1102848 -897536 -1374208 -836096 -1594880 -1392640
5228 -1392640 -745472 -636416 -227328 -986112 -1089536 -816128 -631296 395264 -833024 -868864
5218 -868864 -1083392 -337408 -1198592 -304640 -907776 -1085440 -872960 -1418752 -1006080 -938496
5208 -938496 -401920 -964096 -1554944 -1619968 -806912 160768 -1255424 -382464 -277504 -453632
5198d53632C79392a805824Q41728L96800l23072j42336k40640k80064N91360L06176
5188f55872j033728q5504g77728p5264J43360J64864K25280k82624K9696a04448
5177a184768l37408g24992k37056b96448q43264l25632N45280k35520N06368d2496
5166e56032q66816K80576e9392o9632l95264n6832G44448i47712K83648n64224
5156a228288c22048m12672j56672L5328K11968p10144N632K07872N64736q0384
5146f56384o67648M62848M5568a22368j078272j2288N79072m05504Q2944M51072
5136e05344j431552Q11520J63328c38432k73408n55008J85856B06336l1744a039360
5125a216512M82816l44064b63168j392640M72576M42880b81088j487360M57216
$$ plain form
5198 -453632 379392 -1805824 -964096 -567296 -890368 -1032704 -1273344 -1553408 -962048 -655872
5188 -655872 -1689600 -1775104 -777728 -852992 -709632 -544768 -319488 -602112 -572416 -104448
5177 -1184768 -1522176 -724992 -962048 -296448 -1139712 -1465344 -920064 -1155584 -649216 -42496
5166 -556032 -1422848 -1142272 -59392 -129024 -524288 -581120 744448 -947712 -664064 -1228288
5156 -1228288 -322048 -734720 -891392 -856064 -644096 -1354240 -1348608 -1140736 -576000 -656384
5146 -656384 -1324032 -861184 -815616 -122368 -1200640 -1212928 -633856 -1039360 -956416 -505344
5136 -505344 -1936896 -1125376 -962048 -338432 -611840 -1166848 -980992 206336 174592 -1039360
5125 -1216512 -733696 -1077760 -263168 -1655808 -1183232 -740352 -281088 -1768448 -1311232
5116a311232f17472K15552n90848j53088m86400a26976j651712P42912j97632
5107a233408N85728q76032L44064d47488n08416K68800L31264p29600o9632n20704
5097a675776a57184q45312o22080f41536k61632j0752l24096d45952N5808q96512
5087a286656C584a172480M76672l23072c83488J64352r16480b82112o27712n13536
5077a423360b71360j384448e04320j22880q33536M85376j89440C57888h03328
5067a553408N77024A57184a432064O49216c70176n76512b87744j232384N78048
5058i42080L5328J46944a81760j123328b73408p57760F8608M40832j29536E1712
5047A30048e28896b37568j5872A27488a120768L88096b26816q38656K23232n37088
$$ plain form
5116 -1311232 -617472 -401920 -992768 -1145856 -1632256 -126976 -1778688 -1035776 -1233408
5107 -1233408 -647680 -1523712 -1179648 -447488 -955904 -687104 -355840 -1085440 -1155072 -1675776
5097 -1675776 -157184 -1002496 -1624576 -641536 -903168 -913920 -1238016 -445952 -390144 -1286656
5087 -1286656 3584 -1172480 -695808 -1018880 -383488 -219136 -1135616 -282112 -909824 -1423360
5077 -1423360 -271360 -1655808 -504320 -627200 -1460736 -975360 -1164800 357888 -803328
5067 -1553408 -976384 157184 -1432064 -782848 -370176 -946688 -287744 -1520128 -942080
5058 -942080 -906752 -759808 -181760 -1305088 -273408 -1031168 68608 509440 379904 51712
5047 130048 -528896 -237568 -253440 127488 -1120768 -732672 -226816 -1065472 -842240 -1379328
5037a379328m19328O52288e56544r16992P3216M82816p22944g19360L34336j342976
5027a728000d90496J85856n9904m56704m25472n44256d82816o09280c25632n72416
5017h98048j18272b59584m36224p09632k87744O87616b01216r10336L63008K48832
5007d99712q6016n45280J25440c26144j5360p54688e15584n10464J97632p28064
4997a556480L71200M85376m31616k21696m60800h89344o5024a16736o83008b20160
4986d99712r92256K19136B3040g33696l1744o16960e17120j064960M40320j003520
4976b145280i41056j67424K28864l40480L16928k60096d35200j43872J61280k92864
4966g10656L37920r0624j028608d55680q83200l52256Q13056k17088O7072N120
$$ plain form
5037 -1379328 -1798656 -1146368 -556544 -1473536 -1400320 -917504 -1640448 -719360 -385024 -1728000
5027 -1728000 -490496 -304640 -364544 -821248 -1246720 -1790976 -482816 -1092096 -325632 -898048
5017 -898048 -1016320 -259584 -695808 -1405440 -1693184 -1005568 -201216 -1111552 -748544 -499712
5007 -499712 -585728 -1131008 -1005568 -326144 -341504 -1096192 -515584 -1026048 -828416 -1556480
4997 -1556480 -1185280 -699904 -1131520 -1353216 -1814016 -889344 -954368 -116736 -799744 -220160
4986 -499712 -1491968 -1272832 23040 -733696 -765440 -1382400 -517120 -1582080 -1141760 -2145280
4976 -2145280 -941056 -1108480 -879616 -1220096 -903168 -1163264 -435200 -579072 -417792 -710656
4966 -710656 -372736 -463360 -1491968 -455680 -1338880 -1691136 -878080 -1095168 -1028096 -1022976
4956a022976M16768k71360m40320e41184j042432r08800b15552A31584h47872
4946e36576Q1920n69856d11136J2800j55648n60128d14720J32608k306048e22240
4935h02304l39456c89120F656a834496F03136A65888a156096N65248a85856L2256
4925a53600C1744a267712n97504h62208b39616p56224d14208b00704j347584L88608
4915a159680J89440b46784n10464a81760N9904p76704h6528C60448e70880D4544
4904h74496M06016B44224d87936A8944a740288f90688m87424r58464Q50944j92512
4894a478144L52768J08544n51936L35872e84704q21248d51072k7136J65376j019392
4884a332224d18304j67936F0416h02816C81440a628672d67456K3040j599488a42848
$$ plain form
4956 -1022976 -606208 -877568 -1317888 -541184 -1583616 -2492416 -215552 131584 -847872
4946 -536576 -454656 -1024512 -411136 -398336 -553984 -1114112 -414720 -282112 -2588160 -522240
4935 -802304 -1141760 -389120 6656 -1834496 603136 165888 -1156096 -590848 -185856 -153600
4925 -153600 31744 -1267712 -1865216 -862208 -239616 -995840 -414208 -200704 -1548288 -1159680
4915 -1159680 -970240 -246784 -757248 -181760 -121856 -898560 -86528 360448 -570880 44544
4904 -874496 -468480 244224 -487936 18944 -1740288 -690688 -1178112 -2136576 -1285632 -1478144
4894 -1478144 -1125376 -1016832 -1568768 -1232896 -584704 -1405952 -451072 -478208 -312832 -1332224
4884 -1332224 -418304 -586240 60416 -802816 381440 -1628672 -467456 -444416 -2043904 -142848
4873a76640j489920f32832A66912a53600j556480b62144p83872a43360l3280q1408
4863b58048n35552j86368F2976f71232m71552j34144M94592g9872j297920d11136
4852h62208G5264f74816k49344m73088M608c31264q704k24256j67424F98880a047040
4840g23968k04800l95264B1504a203200l6864c81440q85760K78528l16928O51264
4830f54336j26464k54976q704j95072J81248a25440o93760Q6016n16096e38624
4819E120b88768r85088d99712m0960l61472K61632b74432m23424N9904e0688n19680
4808e70368n1712m6592p46496F93248d22400I23136b7136H35584j03424j27488
4798F04672O6048J216512q3456J76128J853952o4000q94464M15744l28704P07584
$$ plain form
4873 -176640 -1666560 -632832 166912 -153600 -1710080 -262144 -1046016 -143360 -176640 -258048
4863 -258048 -793600 -979968 62976 -671232 -1142784 -1276928 -782336 -79872 -1377792 -411136
4852 -862208 75264 -674816 -924160 -1397248 -1392640 -331264 -339968 -564224 -731648 698880 -1047040
4840 -723968 -928768 -1324032 21504 -1203200 -1240064 -381440 -1267200 -988672 -1305600 -654336
4830 -654336 -780800 -1035776 -1044480 -1239552 -1058304 -125440 -819200 -733184 -1249280 -538624
4819 5120 -288768 -1273856 -499712 -540672 -902144 -640512 -274432 -697856 -637952 -50688 -570368
4808 -570368 -622080 -668672 -1415168 693248 -422400 923136 -27136 835584 732160 604672
4798 604672 670720 1887232 1803776 1979904 3833856 3769856 2875392 3291136 2962432 3670016
4788C670016j682944l58912j45920E72928c7888j2288n66272p82848e57056o46144
4778a203200c14880q54528K98496b81600j395712C61472a209344q8576J47968
4769a149952k72384k82624g95136K48832j671168f39488k29888M29056o58432
4760a098752A28000a280000N86752K47296L1744k90816r28768K40128b75968r8304
4750c74272r89184O35904m36736o5536R0112j20832n6320j01376N70368l55328
4740a203200j85344N23264L31776r65120N37088k73920M34688l79392M17280R728
4730g53152r22112N50912M53120l28704j51552M10112l22560I216h25856j165824
4720a991680E12000i78432b09408j130496l11296Q17152j021440h26880j352704
$$ plain form
4788 3670016 1987072 1628160 1482240 572928 -37888 -50176 -616448 -1399296 -557056 -1203200
4778 -1203200 -314880 -1169408 -870912 -281600 -1677312 361472 -1209344 -1297920 -1149952
4769 -1149952 -1422336 -1704960 -795136 -546304 -2217472 -639488 -869376 -440320 -1098752
4760 -1098752 128000 -1280000 -693248 -445952 -414208 -705024 -1633792 -1393664 -275968 -374272
4750 -374272 -1363456 -727552 -1164288 -1229824 -1139712 -1260544 -1316864 -1418240 -847872 -1203200
4740 -1203200 -1388544 -865280 -533504 -1498624 -961536 -1235456 -800768 -1180160 -762880 -753152
4730 -753152 -1675264 -1124352 -671232 -999936 -1151488 -741376 -1063936 9216 -825856 -1991680
4720 -1991680 512000 -978432 -209408 -1339904 -1651200 -834048 -1855488 -826880 -2179584
4711b179584J95584c22048l30752j66912J33120p80288P12704m35200c44064k58048
4701f02112o41536Q9600e22240l47136c48672m50048o52288c73248m17792K24256
4691e66784p5776H0384a443328O92224K27840b16576j284608D9152n632b7648
4680e10464j015296O71744J58720K42688r70240j98144l49696O86592L12320p51104
4670a722880G13216i8816j35680p22432n12512B7648a325568a32096r73312l13344
4660a418752l89632N20192L35360l98848B2016c63520M6592j187840f1952o14400
4650f76352a92512k19648l75296j229312h26368Q6528j62816g0656j31072j146880
4640a348608a81248o39488c99360k75456a58720l98848K12992q37120o08768a18272
$$ plain form
4711 -2179584 -1984000 -322048 -652800 -819712 -686592 -1466880 -754176 -1189376 -344064 -602112
4701 -602112 -1243648 -1154048 -522240 -869376 -348672 -798720 -1451008 -373248 -791040 -566784
4691 -566784 -642560 80384 -1443328 -751104 -523264 -216576 -1501184 49152 43520 -27648
4680 -510464 -1525760 -854016 -695296 -452608 -1422848 -1620992 -1970688 -1284096 -971776 -1722880
4670 -1722880 713216 -98816 -234496 -956928 -1469440 27648 -1325568 -132096 -1105408 -1418752
4660 -1418752 -1808384 -1288192 -952832 -1351680 22016 -363520 -316928 -1504768 -61952 -676352
4650 -676352 -192512 -412160 -787456 -2016768 -826368 -739840 -902656 -70656 -201728 -1348608
4640 -1348608 -181248 -820736 -399360 -674816 -158720 -557568 -344576 -1181696 -1790464 -118272
4629c89120j40800l16928K84160J14176n63200j376768Q40704i5232r78432c41504
4618c59936a14688m52608B7648d97664j76640K31424j66400q90368b74432n67296
4608h41728l73248e59104r47712P05024J95072b17600E83168a015296d14208q68352
4598a282560k84160N06368k8672M67456m03968l30240N75488J20320k09920k86720
4588a156608e34016n39648M65920o28224N66784c1744n53984p28576f51264j40800
4578g92064g2704p18848p7312K57024J25952q66816b40640l03616C34336h03328
4567e63200j411584i01632i6768j1264m56192p14752L71712m6080d57728j187840
4557a645568f98880L2768K84672n05856o45632i2672G51104a814528a95072q61696
$$ plain form
4629 -389120 -529920 -846848 -562688 -448512 -1011712 -2388480 -1547776 -95232 -1073664 -341504
4618 -359936 -114688 -567296 27648 -497664 -674304 -442880 -609280 -1499648 -274432 -841728
4608 -841728 -1214976 -559104 -1506816 -801792 -606720 -217600 583168 -1015296 -414208 -1282560
4598 -1282560 -1566720 -1060352 -1089024 -621568 -1025536 -1355776 -780288 -659968 -869888 -1156608
4588 -1156608 -534016 -1073664 -607744 -1235968 -669184 -31744 -585728 -1314304 -651264 -792064
4578 -792064 -72704 -791552 -868864 -611840 -485888 -1352704 -240640 -544256 334336 -803328
4567 -563200 -1974784 -901632 -96768 -108032 -564224 -1278976 -907264 -953344 -457728 -1645568
4557 -1645568 -698880 -666112 -381440 -887296 -1532928 -92672 751104 -1814528 -195072 -1056768
4547a056768e18656K39104m78208L07712b02240C41504O88640b93376J32096j91488
4537c52768j97120C34336J102848L86048n67296B22720M55168J88928A5872d92032
4526E14560f16448I90720B02240R04192E15072h52992c10272q59136e46816l87072
4516i33888M41856J79200o46656O6560l26144D79232a900032h96512J53088L5328
4506g08096n25312f00064B48832N2736A6896d32640E1712J423360o46144B96960
4495E98528I2160J497088A81760R53344B14016k3552J55136b55488D57216j65888
4485B91328J161216j69472f32832K71360B96448J38240a038336b52928q73984
4476a126912N11488j79712J40800m32128l11296f21056K57024k56000P8848b17088
$$ plain form
4547 -1056768 -518656 -279552 -757760 -450048 -202240 341504 1030144 -293376 -161280 -352768
4537 -352768 -549888 334336 1437184 1823232 1255936 222720 677888 866816 15872 -492032
4526 514560 -616448 990720 202240 1106432 515072 -852992 -310272 -1169408 -546816 -933888
4516 -933888 -492032 -312832 -959488 -892928 -1219072 479232 -1900032 -896512 -743424 -708096
4506 -708096 -1233408 -600064 248832 301568 16896 -432640 51712 1475072 828928 296960
4495 598528 92160 1589248 181760 1135104 214016 190464 345600 -255488 457216 291328
4485 291328 1452544 1283072 -632832 -361472 296448 434688 -1038336 -252928 -1126912
4476 -1126912 -615424 -795136 -654336 -1086464 -1397760 -621056 -364032 -620032 -541184 -217088
4465d53632a77664B70336h30464K80064A40800g18848r23136Q15616m1472m67968
4455a335808m15744h71936b80576n29408R0624k5088c36896o81472d59264r72800
4445a432064a18272k20160o80448Q8064J64864n44768o9632L49696l45088f0928
4434i98400J02400a14688o98368K52416m34688j05472K13504d22400m84864q5504
4424i92768K25280L7376m10112M91008j73056k72896n79072f24128a97632A72544
4413a37216F6560e41696P3216A83808a16224m8640A58208L95264b01216L9936
4403a61280j79712b9184G97696b05824F35904O2976L8912a96096l65056o0416
4393f21568C05664N35040H7552J403392A42848L90144O10304F1440O37440c8400
$$ plain form
4465 -453632 -177664 270336 -830464 -550400 140800 -718848 -1641984 -826368 -867840 -1335808
4455 -1335808 -1751552 -871936 -280576 -809984 -719360 -744448 -336896 -1018368 -459264 -1432064
4445 -1432064 -118272 -338432 -1018880 -930816 -765952 -1310720 -1380352 -1030656 -1375744 -60928
4434 -998400 -896000 -114688 -813056 -560640 -995328 -1100800 -887296 -422400 -907264 -992768
4424 -992768 -767488 -730112 -1140224 -649216 -822272 -1095168 -1674240 -624128 -197632 172544
4413 -137216 66560 -541696 -468480 183808 -116224 -164864 158208 553472 -201216 -161280
4403 -161280 -340992 -29184 797696 -205824 635904 698880 737792 -196096 -561152 -621568
4393 -621568 305664 840704 87552 1490944 142848 532992 1143296 61440 698880 -38400
4382h46336j53600F55360b69312B28352e34016m55168a83808m65408D43392j46944
4372B96448f40512g3216n07904b75456j475072e82144L8400I00096c43040n79584
4362i22624a2800j080832B44224h6528o53312J68960l44064D03968e59616q00768
4352a360384K60608B15552D9664O5024K35008c48672o64064a45920E39648b70336
4341i13408p59296g1168C31264h22272O1440b15552p8336q2432B79552I8816M83840
4330E82656N19168c7888A97632J13664a83296l85536l21536a57184j220608d27008
4319a120256k14528O38976c40992q62208M65920c34336C90656g08608p64928a78688
4308i41056j99680q20224J60768h21248C2256d92032j96608B41664J96608a506304
$$ plain form
4382 -846336 -999936 655360 -269312 228352 -534016 -989184 -183808 -649216 443392 296448
4372 296448 -640512 -73216 -581120 -275456 -1750528 -582144 -543744 900096 -343040 -922624
4362 -922624 -12800 -1093632 244224 -86528 -739840 -570880 -914944 403968 -559616 -1360384
4352 -1360384 -1099776 215552 49664 114688 349696 -348672 -1012736 -145920 539648 -270336
4341 -913408 -1672704 -71168 331264 -822272 -760832 -215552 -293888 -376320 279552 98816 582656
4330 582656 1101824 -37888 197632 311296 -183296 -568832 -890368 -157184 -1377792 -427008
4319 -1120256 -1334784 -695808 -340992 -1203200 -737280 -334336 390656 -708608 -1473536 -178688
4308 -941056 -1140736 -1960960 -1800192 -821248 32256 -492032 -688640 241664 438272 -1506304
4297f40000J94560A38752c97312j97632b11456l48160b39616D37760f89664K36544
4287d53120l22048o4512i9840E16608C6864c28704C95264J74080L0208n4272Q57600
4276A402880F71744L12832M7616m98176g56224a024F4512b52416l43552L0208
4266e65760m79232A19296f57408L06176r24672e36576j64864b96960m94080i5744
4255e70368b31936n53472J86880j0752l62496l89632K21696d74112a47456n4272
4245b01728L2256p61344d4032j949184a71520j179648N75488c41504f656n12000
4235e18656j25440l36384c5840A054208e20704C25632f23104C14368A29536b68800
4224c76320R7792m61824m66432A8944a51552l24096n87264B18624g98720j158144
$$ plain form
4297 -640000 -445440 138752 -397312 -594944 -211456 -559616 -239616 437760 -689664 -453120
4287 -453120 -775168 -839680 -99840 516608 36864 -328704 395264 569344 599552 545280 1402880
4276 1402880 671744 984576 1032192 534016 -756224 -1024 64512 -252416 -595968 -565760
4266 -565760 -1044992 119296 -657408 -351232 -1275904 -536576 -701440 -296960 -791040 -95744
4255 -570368 -231936 -785408 -598528 -609280 -971776 -1361408 -1139712 -474112 -147456 -201728
4245 -201728 -169472 -930816 -44032 -1993216 -171520 -1351168 -775680 -341504 -6656 -518656
4235 -518656 -644096 -980480 -35840 1054208 -520704 325632 -623104 314368 129536 -268800
4224 -376320 -278528 -740352 -1206784 18944 -151552 -475648 -1062912 218624 -798720 -1956864
4214a956864d22912P2192a43360l24608I728J59744a081344a54624r67168o49216
4204a771008N64736C03616c42528p53152l1744m74624L99360e78048k48320n72928
4194a399296e6320k155520e31968j41312a08032j386496J11616c62496l03104
4185f65600C09248i36448Q6528K66240A70496g56736k24256l45088G36768a73056
4174D62848c24096j92000Q4992n83168C37920a783296O78400B29888a349632b75968
4163f33856n55008k99520L95264J66400B3552a212928J25952l6352J44896M04480
4153e73952A27488a527296b06848p47520J84832M0960J85856l32800p49568O17984
4143a007104L35872n81120M56704K30400J13152j083904e01760j536K29888n27872
$$ plain form
4214 -1956864 -422912 -350720 -143360 -467968 9728 169472 -1081344 -154624 -1121792 -1771008
4204 -1771008 -1206272 303616 -342528 -1095680 -1127424 -1602048 -1202688 -578048 -826368 -1399296
4194 -1399296 -56320 -2211840 -531968 -673280 -108032 -1494528 -1382912 -362496 -665600
4185 -665600 309248 -936448 -849920 -583680 170496 -756736 -980992 -1326080 736768 -173056
4174 462848 -324096 -516096 -431104 -1014272 337920 -1783296 -1104896 229888 -1349632 -275968
4163 -633856 -1188864 -1488384 -1093120 -926720 23552 -1212928 -1086976 -1123328 -978432 -573952
4153 -573952 127488 -1527296 -206848 -954368 -769536 -728576 -542720 -875520 -1625088 -1007104
4143 -1007104 -671232 -1252352 -795648 -565248 -452096 -1536000 -501760 -503296 -273408 -801280
4133h01280L30240l47648k33472M11648l02592n92384b45760l072j594368e65760
4122a075200c38432j232384b84672o21568b98496n2736o16448j42336Q3968d26496
4111c94752k52416P9872o3488c3792p12704L04640F93760A03424a110016d77696
4100c08736j59744j728000a026560E01760L769344A097728c93728r7280K19136
4091b71872N9392r44640b10432l81440I1136i66656b88256C5840c75808D66944
4080A54624E6832i92768F656a012224f9632k06848k89792m91008M74624K0480
4070e62176r10336e92384o71232J16736j5872h8576k68800o22080c57376Q6016
4060b71360m18304B46784K9696e18144D51584K9696j33632J54624A59744J619456
$$ plain form
4133 -801280 -471040 -818688 -1052160 -640512 -943104 -1535488 -245760 -248832 -1843200 -565760
4122 -1075200 -338432 -1570816 -284672 -906240 -298496 -351232 -967680 -1110016 -1026048 -426496
4111 -394752 -647168 -567296 -630784 -33792 -746496 -441856 693760 103424 -1110016 -477696
4100 -308736 -468480 -2196480 -1026560 501760 4271104 1097728 -393728 -491008 -271872
4091 -271872 -212480 -1157120 -210432 -591872 91136 -966656 -288256 35840 -375808 466944
4080 154624 56832 -992768 6656 -1012224 -69632 -276480 -566272 -1057280 -582656 -562176
4070 -562176 -1472512 -592384 -1263616 -1146880 -1162752 -88576 -357376 -979456 -357376 -271360
4060 -271360 -689664 246784 276480 -518144 451584 481280 347648 502272 159744 1779200
4050A779200E06368K52416j58208j85344a18784r64096d88448C32288K26816A61792
4039H97536C68640c34848J04448A132032g12704E05344A98656a442816d07552
4029g92576j56672c31776q15616d99712a59744l57376j38240L5840M0448A17248
4018C83488d34688a1264M096o26176A536f32832D92032f84032J83808j68960c14368
4006e88288m66944B2528c4304B90816g22944P680N4784K31424m68992b96448j104384
3995a400832C37408b86208j16224l99872K92864i8816I56928D02944M55168C86560
3984A007616N12000m28032D56704K60608d38784a0752l43552A361920B95424J114624
3974A410048F53824N15072D12672c13856D48512c71200a1776E0176R9328O37440
$$ plain form
4050 1779200 506368 758784 600576 415232 -118784 -1082880 -488448 332288 559104 161792
4039 897536 368640 -334848 -230400 1132032 -712704 505344 198656 -1442816 -407552
4029 -792576 -949248 -331776 -1147392 -499712 -159744 -517120 -655360 -619520 -579072 117248
4018 383488 -434688 -11264 -7168 -633344 1536 -632832 492032 -684032 -500224 -669184 -314368
4006 -588288 -1055232 22528 -34304 290816 -722944 -715264 -660480 -429056 -898048 -296448 -1400832
3995 -1400832 337408 -286208 -402432 -802304 -509440 -98816 956928 402944 858112 386560
3984 1007616 1519616 1091584 456704 717312 -438784 -10752 -354304 1361920 295424 1410048
3974 1410048 653824 1168896 412672 -313856 448512 -371200 -11776 50176 149504 786944
3964G86944m1984J112064B66752r5232P34208C28192a362944c74272n48352K78528
3954f44096p43424p28064h98560d39296m00896j377280J071616a12128l64544
3945d76672o88640e79072j166848K3552J81248L67104n8368j20832B06848h33024
3934a091584M23936k06336d24960j426944a93024l00544j043968B19648a660416
3924a647104f9120n0688k043392g1680m59776J06496p97696P8336L32288J4848
3914g97184g4240k173440O96320m13696M8640N48864Q3456b94912l3280o40512
3904i68704c19488j276928J29536f93760k25792j47456A29024d46976E65248a227264
3893d58240A30560i56928m78720N19680c65568m79744K17088n632n20192n9392
$$ plain form
3964 786944 744960 1857024 266752 171520 905728 328192 -1362944 -374272 -922624 -644096
3954 -644096 -1387520 -2115584 -898560 -439296 -840192 -2217472 -1145856 -112128 -476672
3945 -476672 -1165312 -579072 -1745920 -1722368 -1541120 -1174016 -1232384 -1353216 206848 -833024
3934 -1091584 -667648 -873984 -424960 -1851904 -193024 -493568 -1537536 219648 -1660416
3924 -1647104 -69120 -119808 -2163200 -71680 -531456 -424960 -1222656 -1144320 -812032 -797184
3914 -797184 -74240 -2247680 -1551360 -1965056 -1916416 -1367552 -1284096 -294912 -328192 -968704
3904 -968704 -319488 -1596416 -1466880 -693760 -919552 -1067008 129024 -446976 565248 -1227264
3893 -458240 130560 -956928 -1435648 -915968 -365568 -845312 -628224 -633856 -1154048 -1213440
3883a213440e25824o68160c79392l31264b06336F4000h59136a36704m6080l02592
3873d85376A054208d04480E17120M68992B70848R24672c50720I05216C61472G8336
3862D96128k15040f83520E96480c90144f4000j0752B85696J08032j39776h80640
3851c16928B16576D4032M93568h03840D16256k02752I2160K02752a60768E98528
3840G37280P07584k15040J410560q58112M75648H23808K96448J093120k46784
3831A966592B95936J847296Q34560A287680O48192N92896m06528K063360M6592
3822D232192N17632Q80128P28576j255936O68672k345984k45248j034752r56928
3813A188352M16256E46816M17280a30560I83040a28512B64192M47488k10944b82624
$$ plain form
3883 -1213440 -525824 -1193984 -379392 -710656 -206336 64000 -859136 -136704 -182784 -485376
3873 -485376 1054208 -404480 517120 986112 270848 1195520 -350720 905216 361472 78336
3862 496128 281088 -683520 596480 -390144 -64000 -74752 285696 393728 253952 -880640
3851 -316928 216576 44032 537600 -803840 416256 213504 92160 294912 -160768 598528
3840 737280 1444864 1229824 2640384 1782272 2257920 823808 1120256 2213376 1966592
3831 1966592 295936 2143232 2977792 1287680 1935872 2528768 2122240 4185600 4232192
3822 4232192 4749824 5629952 6358528 5102592 5771264 3425280 3180032 2145280 1188352
3813 1188352 1604608 546816 964096 -130560 983040 -128512 264192 711680 500736 -282624
3802g87968p4752h7040p64416b84672k27328E37088a299968a09056b6624n12000
3792e38624a11104p72096b29376A28000D7616a275392B38592e18144o30784m06528
3782a555456d47488q8576a79712N4784j212928C41504b87744H1920b24256j19296
3772c43552j138176f97856a15712o83520c86560A31584a735680E6320a396736
3762c81952k76480j79712K09408r6256b78528A27488a149440a40288j204736b16064
3751f8608r52832q8064a25952p79776K01728K70848a08032j116160M74112L30240
3741d19840p49056n52448F7072d20864n32480a43360j094656f07744K23744l15904
3731f99904m02944e1712o39488k62144d9152C67616b46784l09248m50560C69152
$$ plain form
3802 -787968 -862720 -87040 -851456 -284672 -512000 537088 -1299968 -109056 -26624 -538624
3792 -538624 -111104 -883200 -229376 128000 47616 -1275392 238592 -518144 -1148928 -1555456
3782 -1555456 -447488 -536064 -179712 -124928 -1337856 341504 -287744 81920 -224256 -343552
3772 -343552 -1481728 -697856 -115712 -799232 -386560 131584 -1735680 56320 -1396736
3762 -381952 -658432 -838144 -628736 -724992 -278528 127488 -1149440 -140288 -1345024 -216064
3751 -68608 -1021440 -1109504 -125952 -905728 -704000 -433152 -108032 -1224192 -750080 -419840
3741 -419840 -1168896 -1721344 67072 -420864 -953344 -143360 -1238016 -607744 -384000 -699904
3731 -699904 -1102848 -51712 -691200 -953344 -49152 367616 -246784 -556032 -1006592 369152
3720g09120L46624e5296E90848i10848B3040i85088a40800o53824j2800d02944
3709i6256G7824L57888A87904d13184j271808J77664L07200l75296f91200F4000
3698f12864D29568A05984f99904l66080c11808J49504o51776k45248L84000A14176
3687f5536C32288c69664O5536M0448%F15424b33984C34336e95456q54528A61280
3675A067008f85568k4576b11968l22560E34528a164288L43040c88608B06336F2976
3664B76480j4848N16096a43872j81248f144k30912b4576j603072D86912a25952
3653H01280L9936A43360R19040D73600L55840g63904e2224k72896K5600D56704
3642I04192j06496N5296B94400K54464J349632H36608J75616D18816l6864J031168
$$ plain form
3720 -709120 -362496 -55296 590848 -910848 23040 -985088 -140800 -794624 -807424 -402944
3709 -96256 77824 435712 187904 -413184 -1684992 -1507328 -1200128 -1575424 -691200 64000
3698 -612864 429568 105984 -699904 -1065984 -311808 -162304 -814080 -1059328 -675328 114176
3687 -65536 332288 -369664 -304128 -263680 -263680 615424 -233984 334336 -595456 -1449984 161280
3675 1067008 -685568 -710144 -211968 -534528 534528 -1164288 -821248 -388608 206336 62976
3664 276480 261632 777728 -143872 -325120 -6144 -237056 -24576 -1627648 486912 -125952
3653 801280 841216 143360 1062400 473600 829440 -763904 -52224 -325120 -299520 456704
3642 904192 797696 852992 294400 548864 1898496 836608 1012224 418816 381952 1413120
3632A413120F23616N77024O00064k73408k20672n73952J917440A286144m04480
3623H81664l23072f28224r48736N07392d56704B23232b58048O2976j42848j74592
3613e12512k68800E96480L34336N93920F26688a2800F77888O00064R04704m03968
3603A778688k82112m36736N89824l71200N15072O53312P69024j295360J397248
3594C317760q90880R95328o09280M34176R60512L64544n0688K01216J299968J23392
3584F146048k46784O62528P70560o56384O09792m86400J081344o2464J937920
3575I756160k55488M81280J661440N88800K4576r52832O46144N77536j3312N28896
3565A3043200O38464r728O10304L91168J759744M28544J870336Q42752m2496J440768
$$ plain form
3632 1413120 623616 1200640 1800704 1527296 1306624 732672 2650112 1286144 881664
3623 881664 558592 -628224 -1576960 -1069568 -456704 223232 -258048 -195072 -337920 -512512
3613 -512512 -781312 596480 930816 1524736 626688 -12800 677888 1277952 2182656 1778688
3603 1778688 1496576 1059840 1649664 1278464 1793536 2446848 3215872 1920512 3317760
3594 3317760 2426880 3422208 2812928 3247104 4207616 4572160 4521472 4722688 6022656 6146048
3584 6146048 5899264 6561792 7332352 6675968 7285760 6799360 7880704 7818240 9756160
3575 9756160 9500672 9981952 11643392 12232192 12256768 11303936 11950080 12527616 12514304 13043200
3565 13043200 13681664 13671936 14282240 14673408 16433152 16861696 18732032 19574784 19532288 20973056
3555B0973056j170944p42400j290752k363392n78560l281408j400832j323008
3547H821760j594368j134592O37440j493504J46432M80256j142784Q03328R20576
3538F444544r91232L85024n75488l05664j024J247744o40512o75328n37600n73952
3528C776512N00736J359360j792000N62688l60960O77376J030656r38496j43872
3519D672000J08544r00608K63168j730048r56416M09088P49568k85184O1952K68800
3509B660864o60480M64896l51744M41344L23072m76672n35040j40800k93888J306624
3499B738176r84064Q88832p57248O52800J48480L36384p02976o42048Q68352j164800
3489A381888Q81152J74592Q14080p86944n79072Q37632p04512M06528J265664
$$ plain form
3555 20973056 19802112 19059712 17768960 15405568 14827008 11545600 10144768 8821760
3547 8821760 7227392 6092800 6730240 5236736 5383168 5863424 4720640 5523968 6444544
3538 6444544 5453312 5838336 5262848 4957184 4956160 6203904 5563392 4888064 4350464 3776512
3528 3776512 4277248 5636608 3844608 4407296 4046336 4723712 5754368 4815872 4672000
3519 4672000 4780544 3879936 4143104 2413056 1456640 1865728 2615296 2330112 2392064 2660864
3509 2660864 2000384 2465280 2113536 2554880 2877952 2401280 1866240 1725440 1431552 2738176
3499 2738176 1754112 2642944 1885696 2538496 2686976 3023360 2320384 1678336 2546688 1381888
3489 1381888 2263040 2437632 3251712 2464768 1885696 2723328 2018816 2425344 3691008
3480C691008p73632j79200j37728j177600P31136L072l82976J019392k86720N79072
3470C085824n28896p42400R09312M07552m32640P12192n89312M73088j100800
3461B193920o9120Q40704k5600j067520N52448j88928M87424k2528j77152K36032
3451B759680Q14592l65568k01216j126400J122816n84704p93600j13664O64576
3442B176512J288704k20672o36928R36960q12544J19296k2528J243648o12864
3433C459584k09920M29568o11328L69664M76160j220608Q48896J13664j05472
3424C550208M85376M27520q48384P8848m03456N95968j147392J005568N20704
3415D264960J72544L13856p2192j47456Q05376j186304J70496k36032K75456n7856
$$ plain form
3480 3691008 2917376 2738176 2600448 1422848 2153984 2157056 1774080 2793472 2506752 3085824
3470 3085824 2556928 1814528 2723840 3131392 2698752 3410944 2821632 3294720 2193920
3461 2193920 2124800 2965504 2939904 1872384 2424832 2235904 2723328 2700800 2523648 2759680
3451 2759680 3574272 3208704 3007488 1881088 3003904 2419200 1625600 1511936 2176512
3442 2176512 3465216 3244544 2607616 3544576 2732032 2851328 2828800 4072448 3459584
3433 3459584 3249664 3679232 3067904 3437568 3913728 2693120 3542016 3655680 3550208
3424 3550208 4035584 4463104 3614720 3693568 3290112 3886080 2738688 3744256 4264960
3415 4264960 4437504 4751360 4679168 4531712 5337088 4150784 4321280 4085248 4360704 4302848
3405D302848J85856n52448J369088p6288j183744J187328l31264l11808K47296
3396D836864o60480Q52480R53856p12192l82464j30048O8096J914880j422336
3387E318656J37216K99520K59072J247744j624576J610752l28192K52928K07360
3378G380480j185280J655296q5504J29024J363456K6624j016832J395200k31424
3369I431040j41312L42016P97696j126912J206272n74464q96000J668096J42336
3360A0848768P63904m51584R4208J211904m54656K279424j338880L46624J203200
3351A4502912J546240J054208n7344J420800L90144J275904M58240K216448m59264
3342B2348288N40672K360832m43904J385984J244672J396736Q13056J514496J737728
$$ plain form
3405 4302848 4488704 3936256 5305344 5229056 4045312 5232640 4901376 4589568 4836864
3396 4836864 4176384 5028864 5982720 5270528 4888064 4758016 4826112 6740992 5318656
3387 5318656 5455872 5755392 6014464 7262208 5637632 7248384 6920192 7173120 7380480
3378 7380480 6195200 7850496 7764992 7894016 9257472 9284096 8267264 9662464 9431040
3369 9431040 9289728 9631744 10429440 9302528 10508800 9934336 9038336 10706432 10848768
3360 10848768 11612672 11161088 11255296 12467200 12012544 14291968 12953088 13299712 14502912
3351 14502912 16049152 17103360 17046016 18466816 18856960 20132864 20591104 22807552 22348288
3342 22348288 22888960 25249792 24805888 26191872 27436544 28833280 29646336 31160832 32898560
3333C2898560N88800K074112O95296K173952K338304J639424J158656K450432
3325D6017536K726400J307648L520000K044928L131904M220416L990016N253120
3317G2211968O643712P365632P951360Q694272Q627200P619584Q814592J0173440
3309A38101760J2043264J3139968J4453248J7963520K0596224K5346048K7872768
3302B69516800L6437504M6429696O0145152Q1205760J12839680J53032192J78715648
3295I38322432J52852992L1119872j19407616k12817920k13665280j66989312
3289D09415168j12166912p1548928m7471616l2385536k3015424j7834496j3160448
3282I1831808j1112448q721920p668224o174208l469312n349888l583488m364800
$$ plain form
3333 32898560 33487360 35561472 36256768 38430720 40769024 42408448 43567104 46017536
3325 46017536 48743936 50051584 53571584 55616512 58748416 62968832 66958848 72211968
3317 72211968 78855680 86221312 94172672 102866944 111494144 119113728 127928320 138101760
3309 138101760 150145024 163284992 177738240 195701760 216297984 241644032 269516800
3302 269516800 305954304 352384000 412529152 493734912 606574592 759606784 938322432
3295 938322432 1091175424 1122295296 1002887680 790069760 576404480 409415168
3289 409415168 297248256 225699328 178227712 145842176 122826752 104992256 91831808
3282 91831808 80719360 71997440 64329216 58155008 54685696 49335808 45752320 41387520
3274D1387520k455552k738688k685440k802176o47680j511424k861568o59456
3266B5025536j323008j868288j648128j689600r09312j579008Q8576m68992j101312
3257A4526464l66080j19808n71904j45408q67840L67616j245696O59456j187328
3248A1049472p90016R63072j979904j31584L12320J13664r40544L14880j312768
3239G598592q17664Q62208l14368l85024k54464N4784r8816o56384m42368o2464
3229E484032K7648j261056j23904N16096K73408j089024j09056L17440J514496
3220E550080k029056O59456o70720o09792O20544N22240p00416j167360J296896
3211C471872p94112O94272Q18688p66976m78720m24448K57536j72032k72896N00736
$$ plain form
3274 41387520 38931968 36193280 33507840 30705664 30057984 28546560 25684992 25025536
3266 25025536 23702528 21834240 20186112 18496512 17587200 16008192 16096768 15627776 14526464
3257 14526464 14160384 14040576 13468672 13323264 12455424 12823040 11577344 12236800 11049472
3248 11049472 10259456 11222528 9242624 9111040 9423360 9537024 8596480 8911360 7598592
3239 7598592 6780928 7643136 7328768 6943744 6689280 6744064 6645248 5988864 5546496 5484032
3229 5484032 5511680 4250624 4126720 4642816 4916224 3827200 3718144 4035584 5550080
3220 5550080 3521024 4180480 3509760 2899968 3520512 4042752 3342336 2174976 3471872
3211 3471872 2677760 3372032 4190720 3423744 2945024 2520576 2778112 2606080 2333184 2833920
3201B833920m22912O7072k74432m36224O32320J97120j102848J92512m60800N01248
3191A726976N1712l584L20512K22720n21728p30112q704k6624J241088q48384
3181A423872L39968e60640A142272C40480K44224d1984B13504A6384K79552K16576
3171E12512O23104C58912h3968A758720E24288k12480J064448C56864O05184B69824
3160G18336b20672I8304i1648A703936g29088I43616j81760c70688q7040E21728
3149a9968E87776M26496a76128k57024A23904d18816C76320g97696C90144M8640
3139D38784M06528k32960K64704M6080e74976A93536d23424B81600r9840J14688
3129B96448J60768b41664n23264b7648k95424A34656Q11520h85248k22720@F49216
$$ plain form
3201 2833920 2411008 2478080 2203648 1767424 2399744 2596864 1494016 1686528 1225728 1726976
3191 1726976 1778688 1775104 2095616 2318336 1796608 1066496 1057792 1031168 2272256 1423872
3181 1423872 1763840 -560640 1142272 340480 584704 -41984 213504 16384 295936 512512
3171 512512 1135616 358912 -83968 1758720 524288 311808 1376256 356864 962048 269824
3160 718336 -220672 98304 -91648 1703936 -729088 943616 761856 -370688 -457728 521728
3149 -19968 587776 1014272 -176128 -433152 123904 -418816 376320 -797696 390144 438784
3139 438784 845312 612352 877056 923136 -574976 193536 -423424 281600 181760 296448
3129 296448 457216 -241664 -764928 -27648 -323072 134656 946176 -885248 -1107968 0 649216
3117G31136a08544A50528N21216B43712J519616o30784c70176B80576q6528M97152
3107F91200R87136J403904J16224r4720M82304j41824R95328r54880j462784l38944
3097A682944O2464A51552M06016A05472K9696E5296J119232e20192I28768G1168
3086F5024O9120P83360k72384B76480f6048D36224J79200L57888B18112d3008
3075G10656m9152M95616P88480q99584J53600Q89344K5600o38464J010176o00576
3065A885696M28544j105408J305600r90208J026048J031680k5088j523712J681920
3056C715072R6768J680896m94080J543680P19360k27840N11488J244672M58240
3047I248256j106432M88960J118208o20544K262528j205760K11968J267200R00096
$$ plain form
3117 731136 -108544 150528 671744 243712 1763328 1132544 -370176 280576 194048 691200
3107 691200 1678336 3082240 3198464 3103744 3586048 3444224 4439552 3484672 2021888 1682944
3097 1682944 1745408 151552 557568 105472 135168 55296 1174528 -520192 928768 71168
3086 65024 134144 917504 645120 276480 -66048 436224 615424 973312 218112 -43008
3075 710656 661504 1157120 1945600 1046016 1199616 2088960 2114560 1476096 2486272 1885696
3065 1885696 2314240 1208832 2514432 1524224 2550272 3581952 3556864 2033152 3715072
3056 3715072 3811840 5492736 4998656 6542336 7261696 7033856 7545344 8790016 9248256
3047 9248256 8141824 8630784 9748992 9128448 11390976 10185216 10397184 11664384 12564480
3038A2564480P9360O09280J066496l03104K193920J148416K87744N02272k636800
3029A5512064j156096l658752q15104n07392j54112r16992M07552k2016J76640
3020H865792p65952m87936j008640J92512r02144N68832k816000O06208j93024
3011D059648J07520j316352J581568q54528A734144J497600q98560n71392N2736
3002A814528K76480o76352J306112j113088m29568J198080q85248p30112l23072
2993D37760b6112I74848k81088N08928j71520o7072m55168O77888k25280k68800
2983F92736K68800K86720n24800O60992I728J193984k06336N27872j56672B27840
2972D67968M53120j92512K71872m71040J204736C19488b59072m54656j05472p59296
$$ plain form
3038 12564480 12643840 13253120 14319616 14016512 16210432 17358848 17646592 18148864 15512064
3029 15512064 14355968 10697216 9882112 9374720 9220608 8303616 8711168 8689152 8865792
3020 8865792 8099840 7611904 6603264 6795776 5893632 6462464 3646464 4252672 4059648
3011 4059648 4167168 2850816 4432384 3577856 1734144 3231744 2333184 1761792 1814528
3002 1814528 2091008 1414656 2720768 1607680 1178112 2376192 1490944 760832 437760
2993 437760 -26112 974848 693760 1202688 1031168 964096 508928 1186816 961536 692736
2983 692736 961536 1248256 723456 1384448 9728 1203712 997376 1525248 1368576 227840
2972 467968 921088 728576 1000448 529408 1734144 319488 -259072 -713728 -819200 -1578496
2962a578496O84032j25952c69664m94080m85888J95584j87392O9120C54816j46944
2952B07872N79072C78368h34048p71584P12704a74080D608M67456c46624m46464
2942g93088c51744h3968o39488a16224k53440r11360G3216N87264a35168q36096
2932i71264d34176o08768L02080A75104N6320e51424j21856l24608C08736A33632
2921b03776n24800A23904l1232g99232m95104C92192a197568N02272q5504q15104
2911a595904g83360J61792M5568p46496M73600j012224f98368n11488K16064K4064
2901i69728r60000a57696n30944k70848F83008a42336l38944M9664B76480N8368
2891C34848g53664a75616H90880O6048l26144M18304r3696R52320k0992O66112
$$ plain form
2962 -1578496 -894464 -1020416 -369664 -863744 -1349632 -1154048 -1341440 -1272320 354816 207872
2952 207872 786944 378368 -834048 -1605632 -892928 -174080 4608 472064 -346624 -793088
2942 -793088 -351744 -83968 -723456 -116224 -369664 -1281024 73216 660480 -135168 -971264
2932 -971264 -434176 -1042944 -740864 175104 231424 -551424 -673280 -997888 308736 133632
2921 -203776 -728576 123904 92672 -799232 -1294336 392192 -1197568 -695296 -780800 -1595904
2911 -1595904 -783360 -621568 -576000 -1322496 -848896 -1861120 -698368 -1209856 -993792 -969728
2901 -969728 -1929728 -157696 -688640 -959488 683008 -142336 -481280 -431616 276480 334848
2891 334848 -753664 -175616 890880 956928 630784 1049088 955392 1907712 1886720 2552832
2881B552832o93760K032128R90208K957824L794432M205056J646592o01600n19168
2872A6364544P2192l741696o318592A779712A42336a9968j634304N49888o35904
2863a740288f83008b61120j639936e93408n07392o46656h22272l59424l82976
2854a564672O9632k62656P45984o36416l8912h07424j235968j20320q7552k66240
2844b517504i02656j092608f57408k59584M5056o83008O86592O1952c46624j39264
2834d85888p29088k89792l4816M83840e19168q55552L26656M21376o26688k32960
2824a486336j05472K02240N84704k33984M24448J92000j459200K32960M24448
2815a224192r81504c72736j152512K06336k23232f23104J18272q57600m096c37920
$$ plain form
2881 2552832 1859072 3891200 4881408 7839232 11633664 15838720 17485312 16883712 16364544
2872 16364544 16436736 12695040 6376448 1779712 142336 -19968 -1654272 -1104384 -1740288
2863 -1740288 -683008 -261120 -1901056 -593408 -1100800 -1747456 -822272 -1181696 -1564672
2854 -1564672 -1495040 -1757696 -1011712 -1648128 -1687040 -807424 -2043392 -2163712 -2251264 -2517504
2844 -2517504 -902656 -1995264 -657408 -916992 -871936 -1554944 -868352 -806400 -346624 -485888
2834 -485888 -1214976 -1504768 -1539584 -1055744 -519168 -1374720 -1048064 -626688 -1253376 -1486336
2824 -1486336 -1591808 -1389568 -804864 -1038848 -614400 -422400 -1881600 -1648640 -1224192
2815 -1224192 -2205696 -372736 -1525248 -1318912 -1542144 -623104 -504832 -1362432 -1366528 -337920
2804a065984M31616j210880e49376k83648L47136j534976R68192J77152L16416
2795e59104m65920J7408m27008e76000N0176L1744K23232p4752f5536D88448d84864
2783A06496L36896A04960L06688a20320A84832L31776J156608j90464o05696P49056
2773A626112R62560R53344R43104L94752Q07424j157632o68160j558016D43904
2763I96864c0208j208320d76160R5744r18016J51040m97152f38976l70688k91328
2753a300992N14560r31328P83872K97472j869312L46624M84352j43360k60096
2744b078208O41536r17504Q05376K62656k44736o92224O45632p88480q69888J411072
2734a824768l16416R0624M37760Q8576q25856J6384j50528j68448Q2944K92352
$$ plain form
2804 -1065984 -634368 -1845248 -549376 -833024 -485888 -2020864 -1052672 -875520 -559104
2795 -559104 -1025024 -1007616 -1434624 -576000 -525824 -494080 -270848 -345600 -65536 488448 -484864
2783 106496 443392 104960 411648 -120320 184832 516608 1673216 1482752 877056 1626112
2773 1626112 2588672 3542016 4485120 4879872 5687296 4529664 3861504 2303488 443904
2763 996864 -30208 -1238528 -476160 -380416 -1298432 -1147392 -1644544 -638976 -1009664 -1300992
2753 -1300992 -786432 -1717760 -933888 -636416 -2505728 -2159104 -1674752 -1818112 -2078208
2744 -2078208 -1436672 -2354176 -1548800 -1286144 -1530880 -2223104 -1577472 -2365952 -3235840 -1824768
2734 -1824768 -2141184 -2050560 -1612800 -1524224 -2350080 -2333696 -2484224 -2652672 -2569728 -2277376
2724b277376m19840J67424Q0896J88416l1232j9456l51744J82784P24480M096
2714a751552j177600P85408O69184l99360K44736J38752j248768l64032J466880
2705a636352n12512Q25856N80608l5328n94432p82848R5744m00896p70048O98368
2695b531840R75360j39264d42368j380352J3824K5088k06848m63360J032192m88448
2685a910272q79104i13408j095168k79040O55872o40512a061888j358848a138688
2675b344448Q22784P48544j016320j44384M38272M28544b22720k51392j006080
2666a480192I49248L8912l00032K42176M01920J142272J522176L496960O265344
2657A3758976Q200192R912320o705664j1599872C052544B17088r9328M096a422336
$$ plain form
2724 -2277376 -2697216 -2529792 -2448896 -2260480 -2291712 -2311168 -2662912 -2480128 -1755648 -1751552
2714 -1751552 -2929152 -2143744 -1474560 -1873920 -1629184 -1490432 -2739200 -3103232 -1636352
2705 -1636352 -2148864 -1323008 -742400 -777728 -1372160 -2155008 -2059264 -2460160 -3230208 -2531840
2695 -2531840 -1556480 -1695744 -442368 -1822720 -1808896 -1783808 -1990656 -2454016 -1421824 -1910272
2685 -1910272 -2789376 -913408 -2008576 -2287616 -1631744 -2272256 -1061888 -2420736 -1138688
2675 -2344448 -1521664 -773120 -1789440 -1933824 -1495552 -1067008 -222720 -474112 -1480192
2666 -1480192 949248 988160 688128 930304 1332224 2474496 3996672 7493632 13758976
2657 13758976 21959168 31871488 25165824 13565952 3052544 217088 117760 121856 -1422336
2647a462272J024k3552M25472l93728j801216J018368N82144n53984n43232O29248
2637b121728O67136j320448J238528l86560j07008k2016j09056o56896k81600
2628c099648j19296O93760q54016P81312Q9600o09792P22432P60832n99040M29056
2618a804800L58912M75136m80256M11648j237504J46432n85728N3760P23456J92512
2608a746432n69344p82848L98336J105408p87456m88448K12480J198592M27008
2599a032704p36768q28928O46656o03136M04992o0416O55360n14560O55360o75328
2589b089472P22944N18144b51392j186304b49856d4544F9120L86048d8640A270784
2578A805824J73056n34528Q35584L74272O09792J680896R8816L326464J534464
$$ plain form
2647 -1462272 -1461248 -1484800 -1059328 -1453056 -3254272 -2235904 -1653760 -2207744 -2750976 -2121728
2637 -2121728 -1454592 -2775040 -1536512 -1923072 -2030080 -2052096 -2161152 -2818048 -3099648
2628 -3099648 -3218944 -2525184 -3379200 -2597888 -2508288 -3118080 -2395648 -1634816 -2233856 -1804800
2618 -1804800 -1445888 -970752 -1451008 -1039360 -2276864 -2130432 -2716160 -2662400 -1938944 -1746432
2608 -1746432 -2315776 -3098624 -2700288 -1594880 -2382336 -2870784 -2658304 -1459712 -1032704
2599 -1032704 -1769472 -2598400 -1951744 -2554880 -2149888 -2210304 -1554944 -2069504 -1414144 -2089472
2589 -2089472 -1366528 -848384 -251392 -1437696 -249856 -44544 69120 455168 -48640 1270784
2578 1805824 1978880 1444352 2279936 2654208 3264000 4944896 5043712 8370176 9904640
2569I904640M364800J1588096J2718080O579200q934912j5759360r058304m504576
2561F897664J29024K195456L494400O256128Q333824O27712q543232q320512k871296
2552H199168N8368K394624O907904Q937472J0689536J387520j1890688A2551168
2543F501888k04800N0176M499456O206976Q457728p29600q591872p870464C062784
2533B357760J101824O89152K882560K658816J124352l993088A680384a027584
2524a055744j51040n4272d97152k125312r4208l45600P80288i66656j584128R41056
2514a609728M76160K37568p02976c33824k71872a33120E0688O27712B26816f45120
2503e1200F98368d93568J38240q75008r96864P65440p30624K67776m36224n72928
$$ plain form
2569 9904640 14269440 25857536 38575616 45154816 36219904 20460544 11402240 6897664
2561 6897664 7026688 9222144 12716544 18972672 27306496 27934208 19390976 11070464 8199168
2552 8199168 8257536 10652160 17560064 26497536 37187072 38574592 26683904 12551168
2543 6501888 6297088 6347264 10846720 17053696 25511424 24781824 16189952 8319488 3062784
2533 2357760 3459584 4148736 7031296 9690112 10814464 6821376 1680384 -1027584
2524 -1055744 -1206784 -1261056 -497152 -2622464 -2716672 -3062272 -2281984 -966656 -2550784 -1609728
2514 -1609728 -1133568 -896000 -1598976 -333824 -605696 -133120 50688 678400 226816 -645120
2503 -51200 698368 -493568 -355328 -1230336 -2227200 -1461760 -2192384 -1924608 -2360832 -2933760
2493b933760l35872L15392M83328r72288q4480j46944j138688R12896Q16128m13696
2483c497984J76128l85536L22560j258496R58976j54112m6592K53440J98144n0176
2473c483648k23232n27872J204736p17312n35040J395712o09792o26176n40160
2464d662784Q64256J82272M43904m79744M31104j028096m1472R62048m65408k65216
2454d059136j330688J240064p9872J073152q64768r4208m4544K89792o38976Q41728
2444c667456L66592j246720j47456O20032J522176j105408K75456j342976J74592
2435d551168O67648p63904K99008q6528K84672L55840P87968j630720J183232
2426c453952r60000Q54016j25952j92512n30432Q38144o13376M56192o4512J22880
$$ plain form
2493 -2933760 -3269632 -2954240 -2470912 -3443200 -3527680 -3674624 -4813312 -3900416 -3084288 -3497984
2483 -3497984 -3321856 -3707392 -3384832 -4643328 -3684352 -3838464 -3885056 -3631616 -3433472 -3483648
2473 -3483648 -3706880 -4234752 -3030016 -3747328 -4282368 -2886656 -3496448 -4122624 -4662784
2464 -4662784 -3798528 -3616256 -3172352 -3652096 -3220992 -4249088 -4290560 -3328512 -3793920 -4059136
2454 -4059136 -5389824 -4149760 -4229632 -3156480 -4021248 -4115456 -4160000 -3870208 -4509184 -3667456
2444 -3667456 -3300864 -4547584 -4695040 -4075008 -2552832 -3658240 -3382784 -4725760 -4551168
2435 -4551168 -3883520 -4647424 -4348416 -4434944 -4150272 -3794432 -3006464 -4637184 -3453952
2426 -3453952 -4413952 -3559936 -3685888 -3878400 -4408832 -3570688 -4184064 -3727872 -3792384 -3669504
2416c669504n57056N15072Q3456m31616o04672P09120L36384J59744r83552J109504
2406c333120l93216l56352M34688j9456M45440p83872P32672n42720p0144n89824
2396d475904J362432m09600o27200O2976n6832M11136j78688j37728O32320p32160
2386d149248L34848K28864o59968K82624O89152j026560k13504k06848R08288
2377c812352k02752J61792k42176J524736l68128j483264J71008J05984Q48384
2368c296768n12512N39136r71264Q40192M66944j009664p168J486336q79616m27008
2358c771392P5264p44448J153536J12640M0960j7408m02944P58272N43232o93760
2348b946048p13728J52576l94752j39776m97152J412608m75648j71520R94816
$$ plain form
2416 -3669504 -4226560 -3711488 -3628032 -4059648 -4664320 -3955200 -3618816 -3459072 -4442624 -3333120
2406 -3333120 -3726336 -4082688 -3648000 -3667456 -3222016 -4005888 -3273216 -3815936 -3886080 -4475904
2396 -4475904 -3113472 -3523072 -4150272 -4087296 -4144128 -3732992 -3911680 -4049408 -3417088 -4149248
2386 -4149248 -3814400 -3585536 -4245504 -3962880 -3273728 -4300288 -4513792 -4720640 -3812352
2377 -3812352 -4015104 -3853312 -4095488 -2570752 -2938880 -4422144 -4251136 -4145152 -3296768
2368 -3296768 -3809280 -3270144 -4241408 -3401216 -2934272 -3943936 -3951104 -2464768 -3344384 -3771392
2358 -3771392 -3696128 -4440576 -3287040 -3174400 -3133440 -3150848 -3553792 -2795520 -2252288 -2946048
2348 -2946048 -3659776 -3507200 -3901952 -4041728 -4538880 -3126272 -3601920 -3773440 -2778624
2339b778624j346048J362944l74784l7888l13344R7280m95104Q06912j147392
2330d226048M59776N67808R01120j099264n32992J030144N7856L53792l93216
2321b881024N14560j037312J154048L77856Q4480k98496l87072k94912M89472
2312b278400m10112Q01280k16064m36736q82688J091584K49344l27680N92896
2303a816576j289728J267712l32288q8576n10976K16064N72416P38816J74592
2294a068544o85056K10944m63872l99872a144320j77152K68288d71040j452032
2285a923072J85856f02624b56000j78176j193472j71520m72576Q13568j00864
2276a559040O0928p23456K26304l33312R18016j493504O30272P71072m14720l13856
$$ plain form
2339 -2778624 -4124672 -2761728 -3136512 -3174400 -3487744 -3390464 -3885568 -3078656 -4226048
2330 -4226048 -3766272 -3198464 -2297344 -3396608 -3929600 -2899456 -2841600 -2487808 -2881024
2321 -2881024 -2366464 -3403776 -2249728 -1871872 -1787392 -2085888 -2472960 -2767872 -2278400
2312 -2278400 -2688512 -1887232 -2103296 -2540032 -3422720 -2331136 -2081792 -2409472 -1816576
2303 -1816576 -3106304 -1838592 -2170880 -2259456 -2770432 -2554368 -1981952 -1243136 -1068544
2294 -1068544 -1753600 -1542656 -2006528 -2406400 -1144320 -1321472 -1053184 -471040 -1923072
2285 -1923072 -1737216 -602624 -256000 -434176 -1627648 -1799168 -2271744 -1458176 -1559040
2276 -1559040 -1498112 -2221568 -1995264 -2328576 -1410560 -2904064 -2273792 -1502720 -1917440 -2231296
2266b231296R43616j067008L18976q9600q06912K75456k73920M00384i90208j640960
2256b631168Q81664q32512k71872J196032q46336M37760K5600q26368M60800j83808
2246b590208J59232n6832l36384k4576P92576j16736r95840K35008P83872q06912
2236b956800l49696n7856P66976k50880J93024J8944p13728R12384k91328j138688
2226c867648O80448J394688p29600j53600n5808R55392k59584j222656P71584
2217b486784l20512P23456k47296l65056l22560M30592N60640l98848j02400L5840
2207b492928a107968j222144n36064j65888J398784j114624M72064p10656n43232
2198c529728J450496m64896l79392l60448J357824n80608Q0384k17600M35712
$$ plain form
2266 -2231296 -1287680 -2354688 -2035712 -2125312 -2932224 -2656768 -2930688 -2530304 -990208 -2631168
2256 -2631168 -1749504 -2582016 -2853888 -1657856 -2504192 -2066432 -2040832 -2867200 -2406400 -2590208
2246 -2590208 -2430976 -2487808 -2824192 -2848768 -2056192 -2172928 -3168768 -2933760 -2149888 -2956800
2236 -2956800 -3306496 -3364352 -2597376 -2848256 -2655232 -2636288 -3350016 -2437632 -2728960 -3867648
2226 -3867648 -3187200 -1792512 -2522112 -2675712 -2731520 -1776128 -2035712 -3258368 -2486784
2217 -2486784 -2807296 -2083840 -2331136 -2696192 -3018752 -2588160 -2027520 -2426368 -2528768 -2492928
2207 -2492928 -1107968 -2330112 -2866176 -3032064 -1633280 -2747904 -2275840 -2986496 -3529728
2198 -3529728 -2079232 -2544128 -2923520 -3283968 -1926144 -2506752 -2426368 -2643968 -2208256
2189b208256o25664N76512L72224k58048j367552J000960M99712q38144N46816
2180b301440q47872R75872m66432a221632j193984P58272k12992n93408M44416
2171b019328R7792N61664O09280p34720j52576q52480K95424L70176m8640l59424
2161b232832R32352j421312J094656M95104l39456q86272Q71936j095680N87264
2152a994240K48320g35744j453568J2800J68960m24960l91168h71424j460736
2143b332160L61984J536o92224L96800O02112m16768J32608J0240O4512n49376
2133b420736o56384a077760L26656n1712K3552p82848M64384m04992o32832N58080
2123a577472L3792Q6016k93376J46944j03424P72096j028608N01248l60448P60832
$$ plain form
2189 -2208256 -2833920 -2257408 -1885184 -2143232 -3510784 -2509824 -2010112 -2848256 -2301440
2180 -2301440 -3149312 -2173440 -2639872 -1221632 -2415616 -1657344 -1870336 -2463744 -2019328
2171 -2019328 -1921536 -1359872 -750592 -1485312 -1637888 -2490368 -2194944 -1824768 -1873408 -2232832
2161 -2232832 -1300480 -2721792 -1627136 -1132032 -1471488 -2357760 -1485824 -2581504 -1994240
2152 -1994240 -1745920 -735744 -2189312 -2176512 -2007552 -2432512 -2823680 -871424 -2332160
2143 -2332160 -1970176 -1968640 -2660864 -2264064 -1661952 -2078720 -1946112 -1935872 -1871360 -2420736
2133 -2420736 -3077120 -1077760 -751104 -802816 -779264 -1562112 -1097728 -1502720 -2135552 -1577472
2123 -1577472 -1543680 -1457664 -1751040 -1604096 -1707520 -935424 -1964032 -1462784 -1823232 -1062400
2113a062400q61696g91552q5504L7888A79712g88480a69472B49856a134080e02272
2102a07520j59744l54816C5328O25152B17600J034752C72736J011200l5328N21728
2092A870336L56352o43584O63552l85536M41344J99168L50208j363968A62304
2082E86752N56032O93248q9088l67104P00928o15936K04288N8880m04480O53312
2072A976832I71776N96992O12352l58912E70368O2976R12896o65600N87264k52416
2062A215488j21344N25824p2704K10432q54528j41824P75168m76672j30560k96448
2052F32832Q32000O63040G97184J64352O94272E94944M60288B28864N08416b54976
2041A193472a80224I02144J57696M7104N09440l4816J05472m9664G92064J099264
$$ plain form
2113 -1062400 -1924096 -791552 -877056 -839168 179712 -788480 -169472 249856 -1134080 -502272
2102 -107520 -267264 -622080 35328 660480 217600 1252352 372736 1383936 1348608 1870336
2092 1870336 2226688 1583104 2246656 1861120 2302464 2501632 2851840 1487872 162304
2082 586752 1142784 1836032 1746944 1379840 2080768 1464832 1669120 1728000 1323520 1976832
2072 1976832 971776 1568768 2181120 1822208 570368 633344 1546240 880640 1467904 1215488
2062 1215488 1094144 1619968 1547264 1757696 903168 761344 1536512 1059840 929280 632832
2052 632832 1464832 2127872 797184 961536 1655808 594944 1055232 228864 737280 -254976
2041 1193472 -180224 902144 1059840 1106944 1616384 1581568 1687040 1637376 792064 1891328
2031A891328j73568A28000R55392E3248J117696m62336k08384O32320M0960E05344
2020A22880a591296B58048N51936a113600d17280K05312j21856A9456K35520J38240
2010C93216J95584d52096C22560J54624M14208J94560g91552o1952h7040A093120
1999f49728F97856Q76032l89120m95616J073152p66464J77152O1952k19648L24096
1989A339392j90976M63872F32320R76896k08384J13152j31072D78208J704960
1980B183168m29568n53984o144r728A77152J896448p74656n632P14752r216M83328
1969B482176q65792j31072J084928p95648J088000L47648R2672o72768L35360
1960B965504j25440M66944n14560J131520j066496Q18688j45920P06560k92864
$$ plain form
2031 1891328 1717760 128000 1083392 53248 1170944 708608 500224 1132544 1173504 505344
2020 122880 -1591296 258048 809984 -1113600 -417280 -211968 -333824 19456 254976 393216
2010 393216 588800 -452096 322560 477184 891392 1085952 -791552 -853504 -87040 1093120
1999 -649728 697856 1573888 1184768 689152 1762304 995840 1172992 1234944 1015296 1339392
1989 1339392 1148416 1612288 632320 1609216 1400832 1513984 1382912 478208 2183168
1980 2183168 1753600 1199616 1193472 1183744 177152 2073600 1298944 1293312 2008064 1998848 2482176
1969 2482176 1616384 1485312 2570240 1774592 2862592 3210240 3302912 2630144 2965504
1960 2965504 2840064 3307008 2792448 3923968 2857472 3676160 3530240 4236800 3943936
1951C943936M52096l58912O94272l9424k43712J63840j031680m36224Q61696K4576
1941D030464k36544J075712m94592N78560l82464j108992M97664Q11520j00352
1932D670976L79392k32960q23808k52928N89312J28000j117696L26656k68288
1923C398656Q79616m54656J099264k04800O5536k05312N27872m0960j188864N8880
1913C935232J734144j587200J122304m71040Q15616p04000r55392J057792J78688
1904E126144q26368K82112N82656r22624P24992j153536r3696P57248J111040
1895E587968L93728K830848M063232M745216l947520n102080m135936j377280
1887C058176j2288L3280L41504q32512o11840N31968M86400m87424j214464P27040
$$ plain form
1951 3943936 4396032 4037120 4731392 4691968 4448256 4612096 3580416 3144192 4005888 4030464
1941 4030464 3793920 4869632 4375040 4953600 4571136 3462144 3959808 4771328 4670976
1932 4670976 5050368 4817408 3993600 3740672 4329984 4457984 3340288 3666944 3398656
1923 3398656 4278272 3823616 4922880 4718080 4783616 4578304 5106176 5065216 3876352 3935232
1913 3935232 5669376 4082176 5204480 4733440 5549056 4845056 3889664 4947456 5126144
1904 5126144 4299776 4581888 5164544 4241920 4966912 3813376 3719680 4476928 5587968
1895 5587968 5981696 8812544 12875776 17620992 13673472 8571392 4435456 3058176
1887 3058176 3045888 3079168 3420672 2588160 1976320 2508288 2994688 2507264 1292800 2019840
1877B019840J39776H96512J81760L88096J181184E95968O79424B11968L93216
1868F05184P4752J89952p9360L26144M5056L10272n0176M36224E41696O12352
1858A154048l91168J00352D00384J350656C75296K35520O57920J85344j36192
1849A317888o6048k08896Q49920B11968N30432M42880m16256J381888E96992k93888
1839C03104M11136K95424j90464k42176M04992L93216m10112J34656O76352j94560
1829A581568J66912J083392o02112A072640J658880r67168k27840P30624O88640
1820B955776j60256k12992R85600j126912R4720N61664K11968k15552K35008m40320
1810B888704Q91904N02784A886208L75296J046528o37440l92704o8608o71744
$$ plain form
1877 2019840 2159616 896512 1078272 1466368 2647552 595968 1275392 211968 605184
1868 605184 679936 869888 790528 1116672 1161728 1472000 1421824 1858048 541696 1154048
1858 1154048 762880 863232 400384 1751040 375296 610816 1268736 1454080 1317888
1849 1317888 1251840 1042944 1892864 211968 742400 1185280 769024 2150912 596992 303104
1839 303104 714240 1009664 819200 577024 982016 1375232 965120 1099776 1776128 1581568
1829 1581568 1748480 2831872 2229760 1072640 2731520 1764352 1536512 2267136 2955776
1820 2955776 2795520 2582528 3568128 2441216 2535936 3097600 3309568 3094016 3329024 2888704
1810 2888704 3780608 4283392 1886208 2261504 3308032 2670592 2277888 2209280 1537536
1801A537536M30592j96608k39616L88608L70176n66272N03808n85216K29888k27328
1791A645568F58432J783296K15552k54976L75296r04192K49344J214464J1264
1782C348480k05312R19552p9360m08064L00544k70336N48864j023488R57952J08032
1772D196864Q89344r58464J09568P64928j096192N6320J567232l74272M33664
1763E588992R8816j833472L72224P06048L21536K3552M89472K01216M9152j45408
1753E872128M43904J69472O81472j026560j65376N88288J030144r24160L53792
1744G023104k76480P57760j5360k70848J92000R37472J17248o80448J738752o05184
1734H918016o57920J334784r42080j11104N05344m53632L15392j771520Q24832
$$ plain form
1801 1537536 1968128 1771520 1531904 1920512 2290688 1724416 2228224 1643008 1872896 1645568
1791 1645568 658432 2441728 2657280 2402304 2777600 1873408 2122752 3337216 3348480
1782 3348480 3143168 4062720 3983360 3575296 3875840 3605504 4154368 3130880 4088832 4196864
1772 4196864 5086208 4127744 4237312 5002240 3906048 3962368 5529600 5155328 5588992
1763 5588992 5687808 3854336 4226560 4932608 5254144 5277696 5767168 5968384 6017536 5872128
1753 5872128 6316032 6485504 7166976 6140416 5975040 6563328 7593472 6669312 7023104
1744 7023104 6746624 7504384 7489024 7218176 7410176 8347648 8464896 7784448 9523200 8918016
1734 8918016 8260096 9594880 8652800 8541696 9047040 8593408 8908800 7137280 7962112
1725G962112P41888j694208j90464m10112Q44800j78688m88960M48512m57216
1716F577664O99392j125376k29376J159168k57536K01728j06496J7408O51264
1707G587840j143808N5808J0752Q20736R02656j182720r30304P43936N09952j62304
1697G212544l28192m76672m72064N43744L23072p07584j11616n5808J24416j645056
1687D406784J246720r27744k38592P92576j130496l93728P91552o36416n31456
1678C379200J79712l12320J180672r71264K25792o01088K14528K21696J03424
1669C620352o73280R89696p88992P77216r22112o03136J055232q80128J586688
1660D161536o14400k31936k6112k15552j57184M77184j103872K599424j408000
$$ plain form
1725 7962112 8704000 7009792 6819328 6409216 7254016 7075328 6586368 7034880 6577664
1716 6577664 7277056 6151680 5922304 7081472 6823936 7025664 6919168 6936576 7587840
1707 7587840 6444032 6499840 6510592 7331328 8233984 7051264 6120960 6864896 7374848 7212544
1697 7212544 6884352 6407680 5935616 6479360 6802432 6094848 5983232 5927424 6051840 4406784
1687 4406784 5653504 4725760 4487168 5279744 4149248 3755520 4547072 3910656 3379200
1678 3379200 3558912 3246592 4427264 3456000 3681792 3080704 3295232 3516928 3620352
1669 3620352 2947072 3936768 3147776 3924992 3002880 2399744 3454976 2574848 4161536
1660 4161536 3547136 3315200 3289088 3073536 2916352 3393536 2289664 4889088 3481088
1651C481088r66656K27840N32992n35552O40512k0480l35872K77504L03104r19040
1641B685440J187840O35392j26464r70240R42080m00896l45088Q75008J029120
1632E512192r95840j44384P45984o37440N51936M94080m13696Q0896N73952O68160
1622F435840J41312k99520L99872n46816J244160j38240N36064m55680m7104R89696
1612H259584k72896K26304K58048J129472r03168M76160J686016n3248p11168
1603A0095104R19040k62144L80416O88640P61344R03168n1712J073664l28192
1594A4179328Q70400k45248J941504n94432K478592n1200P36256J718272L01568
1585B1335040J305088R77920J702400J353216J591808J383936J539072R22624
$$ plain form
1651 3481088 2514432 2742272 3275264 2739712 3380224 3359744 3023872 3301376 3604480 2685440
1641 2685440 3873280 4508672 4382208 3411968 4354048 3953152 3608064 4483072 5512192
1632 5512192 4516352 4371968 5117952 4480512 5032448 5526528 5112832 5193728 5767680 6435840
1622 6435840 6577152 6277632 6677504 6130688 7374848 7236608 7772672 7316992 7269888 8259584
1612 8259584 7986688 8212992 8471040 9600512 8697344 9173504 10859520 10806272 10095104
1603 10095104 11014144 10752000 11132416 11821056 12582400 13485568 13433856 14507520 14179328
1594 14179328 15049728 14804480 16745984 16151552 18630144 18578944 19315200 21033472 21335040
1585 21335040 22640128 23618048 25320448 26673664 28265472 29649408 31188480 32111104
1577C2111104O17984K383360k29376J300480l91680R04704M84352K594816r5744
1568C9680000J257472K558464q61696K024960J940480K500096J997312K016768
1560E3113856K660864K329088L324416M444160L395584N380096N407232P223296
1552H7278592Q847360O327296P710720K397696j228800o146560p292416j0219520
1544H7674368r020928j1756032j1170304j0440192p563776p186432m588544k969600
1536B2978560k537472k147840q33024k130432r78944n84192j596928Q7040j913344
1527A0343424L98336k80064j137152m37760k7648l80416p18848m6080j81760j068032
1517F464000M11648k06336o55360P70048j263104J406976j917952J080320j213952
$$ plain form
1577 32111104 32729088 35112448 34883072 36183552 35791872 36696576 37180928 39775744 39680000
1568 39680000 40937472 43495936 42634240 44659200 46599680 49099776 51097088 53113856
1560 53113856 55774720 58103808 61428224 65872384 69267968 74648064 80055296 87278592
1552 87278592 96125952 102453248 110163968 112561664 111332864 105186304 97893888 87674368
1544 87674368 78653440 66897408 55727104 45286912 37723136 30536704 25948160 22978560
1536 22978560 20441088 18293248 17460224 15329792 14350848 13766656 12169728 12256768 10343424
1527 10343424 10741760 10461696 9324544 8886784 8859136 8478720 7759872 7713792 7532032 6464000
1517 6464000 6875648 6669312 6013952 6784000 5520896 6927872 5009920 6090240 4876288
1508D876288n16608J85344O46144j168384l33824M51584j319936J202688K21696
1499D244992o27200j47456J18784R7280k10944p51616O34880q52992o7584O08256
1489C046400P88992j247744L39968m50048o76864L03104M13184n58592I22112
1479G96672J202176o19520l61984J24928R70240H82688R98912K3552H29440P70048
1469A599488o63552n6832O65600C58912N72416A24416N99552Q06400m23424M30592
1459A537536K70336J16224B42176J346560l41504l49184P64928k10432c67616
1449A347072F37952Q59136d8640A309696Q192m62336K66240m8640R60512I04704
1438B062336q3456J55136k17088I26720g2192A171456D60800J04448M27520R19552
$$ plain form
1508 4876288 4359680 4545024 5191168 4022784 3688960 4140544 2820608 4023296 4244992
1499 4244992 3617792 3470336 3589120 3686400 3475456 2723840 3358720 2505728 2438144 3046400
1489 3046400 3835392 2587648 2927616 2477568 1800704 2103808 2516992 1958400 922112
1479 796672 1998848 1379328 1017344 1142272 2112512 882688 1881600 1905152 829440 1599488
1469 1599488 935936 879104 1544704 358912 931328 124416 723968 1530368 1106944 1537536
1459 1537536 1807872 1924096 242176 1588736 1247232 898048 1662976 1452544 -367616
1449 1347072 637952 1497088 -48640 1309696 1317888 855552 1121792 1073152 2033664 904704
1438 2062336 1978880 2134016 1916928 926720 -72192 1171456 460800 565248 992768 1912320
1428A912320o56896l65056J230336k63680L12320o31296P51616L20000k50880
1419B358784k048J073664n26336l13856P60832J66912p33696J354752j380864
1410B758144l5840Q1408J305088M21376N23264l25120J907200j547264J150976
1401F239232R27744Q08448J273344K64192K409472p99232j621504o78400j612800
1392G210496l12320k34496J13152K79552p25504o37440P51616j006080N73440
1383F012416J622528r21088l71712J216512p00928j624064O91712l98336K14016
1374E741056P22944n68320r41056J000960L8400q85248L59424J565184q56576
1365F176768J310720o4000N64224J711104M78208O0928Q55040o42048L42016J074176
$$ plain form
1428 1912320 1255424 890368 2120704 1857024 2169344 1538048 2289664 2609664 2358784
1419 2358784 2356736 3430400 2904064 2590208 3351040 3517952 2784256 4139008 2758144
1410 2758144 2722304 2803712 4108800 4530176 5053440 4728320 6635520 5088256 6239232
1401 6239232 7166976 7975424 9248768 9512960 11922432 11123200 9501696 8823296 7210496
1392 7210496 6898176 6663680 6776832 7056384 6330880 5693440 6445056 5438976 6012416
1383 6012416 7634944 6713856 6342144 7558656 6857728 5233664 5925376 5527040 5741056
1374 5741056 6464000 5895680 4954624 5955584 5993984 5108736 5468160 7033344 6176768
1365 6176768 7487488 7423488 7987712 9698816 10177024 10237952 11092992 10450944 10792960 11867136
1355A1867136j574912K56000j845760j539584n45280m82816q93440P16800n59104
1346E399040r82016J352704o88640K44736K86720K23744r62048M39296j268224
1337D045312M99712O10304j107968K051072L27168K09408Q54016O81472L44064
1328H514560m5056j299456K40128q52480K94400o46656l6352p15264j7408j361920
1318D074496p8848M97152r35424N5808J96096q09472j25440o73280P87968j93536
1308B795520n18656K18624j78688p72608J058304o42560k84672J68960J110016
1299B954240A354240m94592J305088k61120P96160j008640o77888P77728R2672
1290A883648j17248J00864j05472q3456K6624C03616J876992A053184j93024L20512
$$ plain form
1355 11867136 10292224 10548224 8702464 7162880 6617600 6134784 5241344 5958144 5399040
1346 5399040 4417024 5769728 5081088 5325824 5612544 5836288 4874240 5313536 4045312
1337 4045312 4545024 5155328 4047360 6098432 6425600 6635008 7489024 8170496 8514560
1328 8514560 8469504 7170048 7410176 6557696 6852096 6205440 6169088 5453824 5436416 4074496
1318 4074496 3995648 4492800 3557376 3613184 3809280 2999808 2874368 2201088 2989056 2795520
1308 2795520 2276864 2495488 2316800 1544192 2602496 1959936 1675264 1844224 2954240
1299 2954240 1354240 859648 2164736 1903616 2699776 1691136 1013248 1790976 1883648
1290 1883648 1766400 1867264 1761792 1678336 1704960 303616 2180608 1053184 860160 1180672
1280A180672D07552M34688j9968i28768D59264c08736C94240O54848k7648A28000
1269F35904b26304D36224J80224N29920a33632l38944F79936a13664M6592C40480
1258F80448g0656m19840K32448H99072a71520r7792a26976C17952J4848a347072
1247a028096c37408a41824l40480j056256d60800l08736m78720K94400k65216
1238a219072d43904l072A25952b22208n79584m45440a39264r09824J23904K53952
1228f71232k35520r15968g48544K74432l10784o24640b93376l61984b27328m08064
1218f35392j87392G7824h08448l93728J08544K09920r49248O92736a64864l71712
1208e36576l96800b8672C4304a265664N86240j232896g47008j86368g5776D3520
$$ plain form
1280 1180672 407552 842240 822272 -928768 459264 -308736 394240 1049088 1021440 128000
1269 635904 -226304 436224 616448 1146368 -133632 -472576 679936 -113664 -67072 340480
1258 680448 -70656 -490496 -258048 899072 -171520 -269312 -126976 317952 332800 -1347072
1247 -1028096 -337408 -141824 -482304 -1538560 -460800 -769536 -1248256 -953856 -1219072
1238 -1219072 -443904 -446976 125952 -222208 -801792 -1247232 -139264 -1049088 -925184 -671232
1228 -671232 -906752 -1822720 -748544 -474112 -784896 -1409536 -293376 -655360 -227328 -635392
1218 -635392 -822784 77824 -808448 -1202176 -1093632 -883712 -1832960 -1140224 -164864 -536576
1208 -536576 -933376 -28672 34304 -1265664 -679424 -1912320 -747008 -933376 -75776 43520
1197a85344l50208a89952q49408d9152q33024a61792k14016j968128J126400K74432
1187i43104J0240c90144F144g00416c25632m85376k13504A34144b49344j82272
1177d31616B4576c1744p40352F88640e02784A09056e55008J92000k93888K83648
1167c73248n06368n04320a31584j719808K51904b57024J28000j694208c09248
1157d58752A39264a755648Q43776q49920k24256A84320a169920M7616r92256N1200
1147b063360b89280m39808J04448r82528M0448A27488a338368f42560m65408l80928
1137a488896P26016j74080c63008n05344C17952a584640E15072e79072k38592
1128h17664r19552g47520j245184i68704L7888e8368j76640m85888p5264r40032
$$ plain form
1197 -185344 -535552 -189952 -1039360 -49152 -882176 -161792 -375808 -2343936 -1217536 -943104
1187 -943104 -932864 -390144 6144 -700416 -325632 -811008 -1024512 134144 -249344 -431616
1177 -431616 24576 -31744 -772096 688640 -502784 109056 -555008 -363008 -656896 -373248
1167 -373248 -879616 -1383936 -131584 -1851392 -1599488 -257024 -129024 -1823232 -309248
1157 -458752 139264 -1755648 -911872 -1761792 -1986048 184320 -1169920 -1122304 -2114560 -2063360
1147 -2063360 -289280 -729088 -624640 -1607168 -1566720 127488 -1338368 -642560 -1107968 -1488896
1137 -1488896 -762880 -936960 -363008 -868352 317952 -1584640 515072 -579072 -817664
1128 -817664 -1737216 -747520 -1992704 -968704 -930816 -58368 -235008 -720896 -796160 -1736192
1118a736192h51968L86048j93536k91328I4208a518080A8432a120768j9456m84864
1108a625088f62016p08096a82272h5504p73632a43872j378304g23456j99168a89952
1097a294848N51936K1504c45600g1680r92768d75136l49184L59936r52832a23392
1086b96448J0752j11104r51296a69472m97664k2528g2704j028608c38944r77920
1076a316864c25120E90848K92864a196544M56192L11296p88992J59744M72064
1067e86240C7376i04704a05984C9936c5328o95808a82784m21376J61280p80288
1057a223168E7856f22080p9872c44576E14560a37216B82112e96992j33632k96960
1047a027584g2704D63360h56064D8128a27488j065472N40160J70496A1776h41216
$$ plain form
1118 -1736192 -851968 -465920 -659456 -950784 94208 -1518080 18432 -1120768 -1140224 -1625088
1108 -1625088 -662016 -1370112 -182272 -85504 -859136 -143872 -1522176 -723456 -922624 -189952
1097 -1294848 -742912 -721408 -345600 -71680 -1064448 -475136 -824320 -464384 -1417216 -123392
1086 -296448 -285696 -396800 -1348096 -169472 -667136 -689664 -72704 -1101312 -338944 -1316864
1076 -1316864 -325120 590848 883712 -1196544 -740352 -429056 -1218048 -1058304 -586240
1067 -586240 37376 -904704 -105984 39936 -35328 -731136 -182784 -604160 -442880 -1223168
1057 -1223168 57856 -622080 -701952 -344576 514560 -137216 282112 -596992 -730624 -1027584
1047 -1027584 -72704 463360 -856064 48128 -127488 -1192960 -652800 -482304 11776 -841216
1036e27360K05824f2976n36064B72896f91712m06528H30464j60768g96672a55648
1025g69024l584C59936b10944C34848h21760c98336m36736a90976e1712m41344
1015d93056q44800L53792g6288p97184k61632K25792L71712j52064m96128N6832
1005a128960N16608b14528l34336k74432B70848e74976j59744O1440j57696a12640
994c87584q50432O05184a46432j128960O31296n01760b68800j394688c93216g4240
983f70208j9968K76992m48512l06688e00224l54816E8368c15904C71200c35872
972g55200c09248F51776a113600B96448c02080l54816l17952I0624d77184I36448
961A29024J1776c31776D95104f58944E42720G1680e78560a34656A39776e14048
$$ plain form
1036 -527360 -321536 -62976 -599040 272896 -691712 -1098240 830464 669696 -796672 -155648
1025 -769024 -772608 359936 -210944 334848 -821760 -398336 -835072 -190976 -51712 -493056
1015 -493056 -1337856 -984064 -76288 -873472 -1135104 -909312 -537600 -689664 -1185792 -1128960
1005 -1128960 -612352 -214528 -548864 -823296 270848 -574976 -734720 -673280 -830976 -112640
994 -387584 -1238016 -632832 -146432 -1275392 -644096 -1145856 -268800 -1663488 -393216 -74240
983 -670208 -690176 -413184 -861696 -1168384 -500224 -855040 58368 -315904 371200 -335872
972 -755200 -309248 651776 -1113600 296448 -302080 -656896 -974848 90624 -477184 936448
961 129024 140800 -331776 495104 -658944 542720 71680 -578560 -134656 139776 -514048
950E16096f99392H61696j77152c23072n20704i4720j64352e9904A178624b99008
939A87904a79712A005056K70336R11360j6384R04192p12192J247232R48224l82464
929D175360j794048q704N33504J05984J468416l05664J158656O94784K298368
920H326656J03936K084864P84384M161536J0076672J8942976K8103680K918912
912G5503616k4038912B2108672G461376l464704L39456n78048q99584r05728Q70912
903B823680A256448J114624p02976k40640n90336J112576m52608J1776M92544
894B001408l95776l38432D89472A67424N58592J492480B68288N08928C26656P04512
884A031168a06496A324544A54112c6864q70912a38752A69472g0144p3216F55360
$$ plain form
950 516096 -699392 861696 684544 -323072 -843776 -94720 -259072 -59904 1178624 -299008
939 187904 -179712 1005056 1275392 2186752 2170368 3074560 2362368 3609600 4557824 4175360
929 4175360 2381312 2372608 2906112 3012096 4480512 4174848 5333504 6028288 8326656
920 8326656 8430592 10515456 11299840 15461376 25538048 44481024 72584704 75503616
912 75503616 51464704 22108672 7461376 3996672 4336128 3758080 2858496 1952768 2823680
903 2823680 1256448 2371072 1668096 1427456 837120 1949696 1497088 1508864 2001408
894 2001408 1605632 1267200 489472 167424 726016 2218496 268288 777216 326656 1031168
884 1031168 -106496 1324544 154112 -36864 -907776 -138752 169472 -70144 -143360 655360
873a5872B82112d35200f4000j116672C46112J71520d59776a40800l9424B02752
862A50528d56192o72768a65888A488384a11616A302016d79744a88928N9392m55168
852e84704K9696N120A462272a1776l82464G1680c06176D04992e27872f144B21696
840a63328l26144B2528b60608k95424l94752C01568H1408P168M07040j08544b60608
828e15072E57568b9184C92192A60256P09632m06528h07936L03616I44640A20832
817e632@c99360P9872j098240E87264q4480L60960A30560h04352e3760q49408
806i03168a52064F08256i07264a96608k53440p96160N73440c11808C56864d59264
795B91328g74144a82784F27712l4304e46816F77376f04160K80064c584B66240
$$ plain form
873 -15872 282112 -435200 -64000 -1180672 346112 517632 -459776 -140800 -180224 202752
862 150528 -456192 -1128960 -165888 1488384 -111616 1302016 -479744 -188928 -129536 -584704
852 -584704 -555008 -549888 1462272 -11776 -394240 71680 -306176 404992 -527872 -6144 221696
840 -163328 -489472 22528 -260608 -556032 -950784 301568 81408 88576 495616 387072 -260608
828 -515072 557568 -29184 392192 160256 869888 463360 -807936 -504320 944640 120832
817 -5632 0 -399360 -319488 -1417728 587264 502784 863744 130560 -804352 -53760 -903168
806 -903168 -152064 608256 -907264 -196608 -450048 -1246208 -672768 -311808 356864 -459264
795 291328 -774144 -182784 627712 593408 -546816 677376 -604160 -324096 -3584 266240
784d89984b7136l78368H8064J38752b15552I34912A08032c34336F40000i57440
773a58208o73792c75296B37056i77920d56192j191936G9360R9328M43392c81440
762A97120K71360K90304a03936A536a03936m18304H37120a63328q66816a54624
751C45088g22432r3696E43744a441280d70528A69984j5360J2288a01888q192A09568
739c07712L0720J03936n0688E4272a145856A10592K27328d63872H63232B42176
728b8672D6592B3040P65952g05536J42336k96960g2192D79232e16608G168k048
717E120O68672l33312a04448l36384m43392L99360a21856D86912b49344r2672
707c42016E4272J133056a272320a1776r75872K69312b74432R2160A02400a64352
$$ plain form
784 -489984 -27136 -405504 88064 226816 -215552 934912 108032 -334336 640000 -957440
773 -158208 -832000 -375296 237056 -977920 -456192 -1648128 79360 178688 622080 -381440
762 197120 468480 758784 -103936 1536 -103936 -522240 837120 -163328 -1030144 -154624
751 345088 -722432 -816128 543744 -1441280 -470528 169984 154624 166912 -101888 -110080 109568
739 -307712 -276992 -173056 -223744 54272 -1145856 110592 337920 -463872 863232 242176
728 -28672 46592 23040 788992 -705536 -563200 -860160 -72192 479232 -516608 7168 5120
717 5120 673792 340480 -104448 -440832 -884224 -484864 -121856 486912 -249344 -342016
707 -342016 54272 1187328 -1272320 -11776 -987648 -718336 -274432 -182272 102400 -164352
696D29056c64544d5056C71712a066496M89984l1232B7136M12672P05536c12832
685g43424c43040j64352A379840D41856P3216A35680d52096E4272Q34560a15712
674E2736b20672E3760b1504A6384L49696K76480J80736B09408K0992A11104c66080
662C86560e61664G18336k32960a9456A696256E1200J187840a0240F1440L15392
652C76832O71744a024E41184O80960D4544M82304B18624J062400B4576K32448
642B57024J38240k9184B5600b37056J01376B21184B048R14944k9696k64704c97824
630D06016b6624G29088K13504m32640B06848J87904L89632i68704d78208G54176
619G18848A46432e02784E60128j25440e94944E24288A58208M6080c69664A220096
$$ plain form
696 429056 -364544 -45056 371712 -1066496 -576512 -607744 27136 439808 1145344 -312832
685 -743424 -343040 -507392 1379840 441856 515072 135680 -452096 54272 888832 -115712
674 52736 -220672 53760 -21504 16384 366080 642560 823296 209408 230400 111104 -366080
662 386560 -561664 718336 485376 -19456 1696256 51200 1239040 -10240 61440 376832
652 376832 1048576 -1024 541184 1222144 44544 526848 218624 1281024 24576 257024
642 257024 395264 366080 25600 -237056 -135680 221184 2048 916992 887296 622592 -397824
630 406016 -26624 729088 942592 509952 206848 394752 784384 -968704 -478208 754176
619 718848 146432 -502784 560128 434688 -594944 524288 158208 204288 -369664 1220096
608A036800e6832A33632d14208l7376a51552F33344G6800a085952F99904a042944
597C47648N24800A48480g51616E9392Q72960D3008d73088D20864E9392c45600
586c11808C40992C584a17248F83520A37728J8432d11136G30112l52768b94912
575B43200g3728k560o6048D38784q7040d11136D42880J07008J46432B40640K42176
564D82816L50208b62656G16800L0720e0176j076736B87232j3312C9936b3040l2256
553e5296l05152d096I0624d60800K09920C63008f144m63872A15712a5872E37600
541D40320j04960L77344B65728p1168a124864c72736H46336e9904j21344k67776
531d49024F09792h48384L23584a23904l66592M7616a02912F55360K58048C18464
$$ plain form
608 1036800 -56832 133632 -414208 -451584 -151552 633344 76800 -1085952 699904 -1042944
597 347648 872448 148480 -751616 59392 932352 43008 -473088 420864 59392 -345600
586 -311808 340992 3584 -117248 683520 137728 156160 -411136 730112 377344 -294912
575 243200 -73728 -76288 -142336 438784 351744 -411136 442880 549888 696320 240640 482816
564 482816 833024 -262656 716800 747520 -50176 -1126912 287232 273920 39936 -23040 -55296
553 -55296 -360448 -4096 90624 -460800 -250880 363008 -6144 -470016 115712 -15872 537600
541 440320 335360 712704 265728 194560 -1124864 -372736 846336 -59904 -181248 -449024
531 -449024 609792 -848384 -524800 -123904 -490496 -442880 -102912 655360 913408 318464
520g29600A72544L05664r0624J70496D6080M70016d55168K12992j82784H3968
509A15712e0688B2528N38112A03424K73408J07520N18656a26464G00416A0240
498b8672l81440E64224j45408B5600J9968K29888J23904P48032a53600m18304
488e71904C94752e63712G12192M21888l82976h42752D98688h7040B10432J73568
478C84000M46976k66240O17984b71872A61280N73440k94912b53440A28000R40032
468A068032h1408G95136J73056h84736D65920e7344H28416G680h9088D33152M02944
457H36096a76640l97824b23744A1776R21600A08544A024K13504O67648B24768
446A112064l42016M608l30752q4992L79392B04288M73088A80736J14688A29536
$$ plain form
520 -729600 172544 478208 387584 558080 46080 516096 -455168 -242176 -424960 83968
509 115712 -50688 22528 560640 103424 376832 484352 1003008 -126464 700416 10240
498 -28672 -410112 564224 418816 25600 45568 275456 399360 1147392 -153600 -571904
488 -571904 394752 -563712 712192 1134080 751104 -842752 498688 -87040 210432 384000
478 384000 830976 564736 1182720 -271872 161280 734720 439808 -253440 128000 1068032
468 1068032 -81408 795136 968192 -884736 465920 -57344 828416 7680 -89088 433152 836096
457 836096 -176640 -574464 -223744 11776 933376 108544 1024 214528 882176 224768
446 1112064 770048 774656 443904 358912 738304 204288 677376 180736 295424 129536
435b2528q81664H41216E6832Q7552f64064G79264l80416P41888G0656P1168b00192
423a254912E1200M50048o6048B4576b30400j07520G14752C17440d7616F14912
412F49728A18272J011200b20160C89120j47456a77664A218560B41664K02752L29216
402G73632L90144B23232E4272O24640M53120A66912J014784m59264p3216c8400
391C17952B2528R56416l08224J38752N98528c6864G54688k64704k07360e26336
380F97344c2256A568256d53120b03776A062400g22432F46656L2256B12480d43904
369b22208D87424J38752M37248B81600K86208P56224B19136a01376l12832D3520
358F34368C7888K40640N52448O61504A65376L8912J288704C29728K58560r8304
$$ plain form
435 -22528 -904192 841216 56832 144384 -664064 779264 398848 1140736 70656 141824 -200192
423 -1254912 51200 501248 435200 24576 -230400 -337920 714752 317440 -47616 614912
412 649728 118272 1129472 -220160 389120 241664 -177664 1218560 241664 444416 773632
402 773632 1163776 223232 54272 678912 1132032 166912 1181696 722432 649216 -38400
391 317952 22528 978944 670720 809472 1408000 -36864 754688 489984 282624 -526336
380 697344 -32256 1568256 -453120 -203776 1062400 -722432 646656 678912 212480 -443904
369 -222208 487424 626176 1063424 281600 567808 1324032 219136 -101376 -414208 43520
358 634368 37888 278528 830976 1492480 165376 204288 1492992 329728 588288 489984
348D89984f62016A582080p84384O144j15712c52768j16224B45248J133568E30432
337D13184b15040B21696a67424G73120A55136e55520I18528A78176O23104C21024
326E52960i1136B76480d91520A93536J6384d02432A41824Q7552M78208a2800A039872
314D46976M91008I8816g8336C99872c9424n24288l74272C88096A14688a32608
303C62496P7824R2160a36192j11616E14048f69696K71360H44800l69152c4304
292b50368C57888j31584R9328O06720B04288K25280j30560J50528L66592j24416
282F91712d85888F25152k91328n4272J99680H5504Q50432L14368D30080a08544
271A145856h5504F72256B02240e36064K33984H50944D18304c32288A15712i8816
$$ plain form
348 489984 -662016 1582080 797696 803840 688128 -352768 -468992 245248 1378816 530432
337 413184 -215040 221696 -167424 773120 155136 -555520 918528 178176 801280 321024
326 552960 -91136 276480 -491520 193536 209920 -402432 141824 229376 707584 -12800 1039872
314 446976 937984 98816 -78336 399872 -39424 -563712 -937984 388096 114688 -132608
303 362496 440320 532480 -136192 -247808 514048 -669696 -398336 844800 475648 -34304
292 -250368 357888 226304 325632 932352 204288 429568 299008 449536 816128 691712
282 691712 -485888 625152 333824 279552 479232 85504 935936 1250304 430080 -108544
271 1145856 -85504 672256 202240 -536064 -302080 850944 418304 -332288 115712 -98816
260D72576j38240j16224J23392b560k91328E17632k05312O92736g32160A80224
249a63840A72544J64864P00928A38240a3312H73472A82784l5328L11296b88256
238H85248D08576j48480k1504L87584k38080b25792A054208d19840A02400a82272
227B95424D0448P12704F144N79072B18624L72224i40032G74656B05824m7104N8368
216B17088I1648b45760A22368L08736f144E11488j99168L0720L66592d2496D42368
204A348096C2768O14400k29888j8944L05152O4000a95072I18016H704J123840
194A132544j47456D22912J265152a12128j70496A42848Q1920I0112a4336F56896
183c7376E89824l072c51232l01568C9424O18496c91680F07232j9968J31072b28352
$$ plain form
260 472576 334336 218112 341504 -2560 -293888 517632 312320 1005056 -732160 180224
249 -163840 172544 337408 1038336 138240 -13312 873472 182784 147456 458752 -288256
238 885248 408576 260096 238592 626176 388096 -225792 1054208 -419840 102400 -182272
227 295424 40448 753152 6144 585216 218624 590848 -940032 774656 205824 158720 217088
216 217088 91648 -245760 122368 431104 -6144 511488 312320 343040 709632 -42496 442368
204 1348096 32768 647168 417280 398336 703488 767488 -195072 918016 8704 1132544
194 1132544 985088 422912 1688064 -112128 -282624 142848 224768 90112 -14336 656896
183 -37376 589824 586752 -351232 -652800 39424 657920 -391680 607232 587264 718336 -228352
171I46176K45248l39968A32608M11648j98144e63200C44064Q50432f13376E98016
160B00192b39104A593344G69536K81088m3008J70496m37760e59104C68640E2224
149f25664A80736d58752B14528h69376A214976a319424C0720J136128l56352d42368
138E64224c21024A83808Q82688A47968P7312d19328d1472A8944c12832A50016
127F02624d67456F58432h704A545216f7584k51904C80416L43552k92352f00064
116a56160A10080J14176a95584A23392c0208E57568O97344E51424g00928J06496
106e94432A68960E1200a40800B28352L55328j3312A45920F656Q88320d7104j071616
95a118720B46784R99936D67968M0960B0480J40800L0720N33504M28032e8880A139712
$$ plain form
171 946176 1191424 851456 132608 544256 346112 -563200 344064 1194496 -613376 598016
160 200192 -239104 1593344 769536 1050624 1007616 1178112 740352 -559104 368640 52224
149 -625664 180736 -458752 214528 -869376 1214976 -1319424 30720 1166848 810496 -442368
138 564224 -321024 183808 1066496 147968 225280 -419328 -41472 18944 -312832 150016
127 602624 -467456 658432 -8704 1545216 -67584 -319488 380416 723968 431616 -600064
116 -156160 110080 224256 -195584 123392 -30208 557568 1254912 551424 -700928 -594432
106 -594432 168960 51200 -140800 228352 583680 570368 145920 6656 894976 -47104 -1118720
95 -1118720 246784 1246720 467968 508928 20480 161280 192000 725504 1153536 -58880 1139712
83G58784l04640j26464J20832k01216a21344E70880A78688a10592l29216J20320
73c19488C8912N93920c69152C29216b15040G8336K65728B6624K31424M67968c63520
61B16576R61536h9088B89280a94560n5808j09568F32832A84320M4032i96864b33984
49A125376d1984A090560a1776E19168K73920L5840l16928a10592A042432b23232
38d07040C69152q4992Q10496a062912h0896A83808d87936r4208C51744A01888
27I21600C59424j22368K9696Q56576n34016k82624A37728J19808M71552b52416
16a041920A084416C81952N21728C75296N79072A536N95456d3520k6112j33632
6b03264D30080d41856I1136J81760h97536a80224
$$ plain form
83 758784 454144 327680 448512 247296 -121344 570880 178688 -110592 -439808 -319488
73 -319488 38912 632832 -369152 329216 -215040 78336 344064 26624 258048 726016 -363520
61 216576 1178112 -89088 289280 -194560 -250368 -359936 632832 184320 228352 -996864 -233984
49 1125376 -41984 1090560 -11776 519168 793088 828928 512000 -110592 1042432 -223232
38 -407040 369152 284160 1094656 -1062912 -80896 183808 -487936 -582144 351744 101888
27 921600 359424 237056 266752 1123328 589312 306688 137728 257536 729088 -252416
16 -1041920 1084416 381952 903680 375296 954368 1536 596992 -43520 -69632 -203264
6 -203264 430080 -441856 91136 272896 -897536 -180224
##END=
