##TITLE=1356
##JCAMPDX= 6.0         $$ Bruker NMR JCAMP-DX V2.0
##DATA TYPE= NMR SPECTRUM
##DATA CLASS= XYDATA
##ORIGIN= NUTS EXPORT
##OWNER= Administrator
$$ 1.72 TOPSPIN		Version 2.1
$$ 2016-02-23 12:21:14.777 -0800  Administrator@X
$$ Compression mode = diff/dup
##.OBSERVE FREQUENCY= 90.275459
##.ACQUISITION MODE= SIMULTANEOUS (DQD)
##.ACQUISITION SCHEME= undefined
##.AVERAGES= 16
##.DIGITISER RES= 22
##SPECTROMETER/DATA SYSTEM= 
##.PULSE SEQUENCE= zg30
##.SOLVENT NAME= None
##.SHIFT REFERENCE= INTERNAL, None, 1, 14.95986
##AUDIT TRAIL= $$ (NUMBER, WHEN, WHO, WHERE, PROCESS, VERSION, WHAT)
$$ ##TITLE= Audit trail, TOPSPIN		Version 2.1
$$ ##JCAMPDX= 5.01
$$ ##ORIGIN= Bruker BioSpin GmbH
$$ ##OWNER= Administrator
$$ $$ E:/data/jwist/nmr/1356/1/pdata/1/auditp.txt
$$ ##AUDIT TRAIL=  $$ (NUMBER, WHEN, WHO, WHERE, PROCESS, VERSION, WHAT)
(   1,<2016-02-23 09:00:52.386 -0800>,<Administrator>,<X>,<jcamp>,<TOPSPIN 2.1>,
      <fromjdx created from
       E:\data\jwist\nmr\uniandes\1356
       data hash MD5: 8K
       E3 02 A1 50 A0 81 B7 C0 F7 2E 4C EF 28 A0 BC 38>)
$$ ##END=
$$ 
$$ $$ hash MD5
$$ $$ 60 F7 D7 C6 BD 81 BF 19 28 F3 27 ED 9F 26 FF 13
##$RELAX= 
$$ Bruker specific parameters
$$ --------------------------
##$DU= <E:>
##$EXPNO= 1
##$NAME= <1356>
##$PROCNO= 1
##$TYPE= <nmr>
##$USER= <jwist>
##$ACQT0= 0
##$AMP= (0..31)
100 100 100 100 100 100 100 100 100 100 100 100 100 100 100 100 100 100
100 100 100 100 100 100 100 100 100 100 100 100 100 100
##$ANAVPT= 1
##$AQSEQ= 0
##$AQ_mod= 3
##$AUNM= <au_zg>
##$AUTOPOS= <>
##$BF1= 90.275459
##$BF2= 400.02
##$BF3= 400.02
##$BF4= 400.02
##$BF5= 400.02
##$BF6= 400.02
##$BF7= 400.02
##$BF8= 400.02
##$BYTORDA= 0
##$CFDGTYP= 0
##$CFRGTYP= 0
##$CHEMSTR= <none>
##$CNST= (0..63)
1 1 145 1 1 1 1 1 1 1 1 1 1 1 1 1 1 1 1 1 1 1 1 1 1 1 1 1 1 1 1 1 1 1 1
1 1 1 1 1 1 1 1 1 1 1 1 1 1 1 1 1 1 1 1 1 1 1 1 1 1 1 1 1
##$CPDPRG= <>
##$CPDPRG1= <>
##$CPDPRG2= <>
##$CPDPRG3= <>
##$CPDPRG4= <mlev>
##$CPDPRG5= <mlev>
##$CPDPRG6= <mlev>
##$CPDPRG7= <mlev>
##$CPDPRG8= <mlev>
##$CPDPRGB= <>
##$CPDPRGT= <>
##$D= (0..63)
0 1 0 0 0 0 0 0 0 0 0 0 0 0 0 0 0 0 0 0 0 0 0 0 0 0 0 0 0 0 0 0 0 0 0 0
0 0 0 0 0 0 0 0 0 0 0 0 0 0 0 0 0 0 0 0 0 0 0 0 0 0 0 0
##$DATE= 0
##$DBL= (0..7)
120 120 120 120 120 120 120 120
##$DBP= (0..7)
150 150 150 150 150 150 150 150
##$DBP07= 0
##$DBPNAM0= <>
##$DBPNAM1= <>
##$DBPNAM2= <>
##$DBPNAM3= <>
##$DBPNAM4= <>
##$DBPNAM5= <>
##$DBPNAM6= <>
##$DBPNAM7= <>
##$DBPOAL= (0..7)
0.5 0.5 0.5 0.5 0.5 0.5 0.5 0.5
##$DBPOFFS= (0..7)
0 0 0 0 0 0 0 0
##$DE= 6.5
##$DECBNUC= <off>
##$DECIM= 2432
##$DECNUC= <off>
##$DECSTAT= 4
##$DIGMOD= 1
##$DIGTYP= 12
##$DL= (0..7)
0 120 120 120 120 120 120 120
##$DP= (0..7)
150 150 150 150 150 150 150 150
##$DP07= 0
##$DPNAME0= <>
##$DPNAME1= <>
##$DPNAME2= <>
##$DPNAME3= <>
##$DPNAME4= <>
##$DPNAME5= <>
##$DPNAME6= <>
##$DPNAME7= <>
##$DPOAL= (0..7)
0.5 0.5 0.5 0.5 0.5 0.5 0.5 0.5
##$DPOFFS= (0..7)
0 0 0 0 0 0 0 0
##$DQDMODE= 0
##$DR= 22
##$DS= 2
##$DSLIST= <SSSSSSSSSSSSSSS>
$$ [...]
##$SPOFFS= (0..31)
0 0 0 0 0 0 0 0 0 0 0 0 0 0 0 0 0 0 0 0 0 0 0 0 0 0 0 0 0 0 0 0
##$SUBNAM0= <"">
##$SUBNAM1= <"">
##$SUBNAM2= <"">
##$SUBNAM3= <"">
##$SUBNAM4= <"">
##$SUBNAM5= <"">
##$SUBNAM6= <"">
##$SUBNAM7= <"">
##$SUBNAM8= <"">
##$SUBNAM9= <"">
##$SW= 20.5580556627758
##$SWIBOX= (0..15)
0 0 3 4 0 0 0 0 0 0 0 0 0 0 0 0
##$SW_h= 8223.68421052631
##$SWfinal= 0
##$TD= 65536
##$TD0= 1
##$TE= 300
##$TE2= 300
##$TE3= 300
##$TEG= 300
##$TL= (0..7)
0 120 120 120 120 120 120 120
##$TP= (0..7)
150 150 150 150 150 150 150 150
##$TP07= 0
##$TPNAME0= <>
##$TPNAME1= <>
##$TPNAME2= <>
##$TPNAME3= <>
##$TPNAME4= <>
##$TPNAME5= <>
##$TPNAME6= <>
##$TPNAME7= <>
##$TPOAL= (0..7)
0.5 0.5 0.5 0.5 0.5 0.5 0.5 0.5
##$TPOFFS= (0..7)
0 0 0 0 0 0 0 0
##$TUNHIN= 0
##$TUNHOUT= 0
##$TUNXOUT= 0
##$USERA1= <user>
##$USERA2= <user>
##$USERA3= <user>
##$USERA4= <user>
##$USERA5= <user>
##$V9= 5
##$VALIST= <valist>
##$VCLIST= <CCCCCCCCCCCCCCC>
##$VD= 0
##$VDLIST= <DDDDDDDDDDDDDDD>
##$VPLIST= <PPPPPPPPPPPPPPP>
##$VTLIST= <TTTTTTTTTTTTTTT>
##$WBST= 1024
##$WBSW= 4
##$XGAIN= (0..3)
0 0 0 0
##$XL= 0
##$YL= 0
##$YMAX_a= 2017865216
##$YMIN_a= -3394924.544
##$ZGOPTNS= <>
##$ZL1= 120
##$ZL2= 120
##$ZL3= 120
##$ZL4= 120
##$ABSF1= 10
##$ABSF2= 0
##$ABSG= 5
##$ABSL= 3
##$ALPHA= 0
##$AQORDER= 0
##$ASSFAC= 0
##$ASSFACI= 0
##$ASSFACX= 0
##$ASSWID= 0
##$AUNMP= <proc_1d>
##$AXLEFT= 0
##$AXNAME= <>
##$AXNUC= <off>
##$AXRIGHT= 0
##$AXTYPE= 0
##$AXUNIT= <>
##$AZFE= 0.1
##$AZFW= 0.1
##$BCFW= 1
##$BC_mod= 2
##$BYTORDP= 0
##$COROFFS= 0
##$CY= 15
##$DATMOD= 1
##$DC= 2
##$DFILT= <>
##$DTYPP= 0
##$F1P= 0
##$F2P= 0
##$FCOR= 0.5
##$FTSIZE= 0
##$FT_mod= 4
##$GAMMA= 1
##$GB= 0
##$INTBC= 1
##$INTSCL= 1
##$ISEN= 128
##$LB= 0.3
##$LEV0= 0
##$LPBIN= 0
##$MAXI= 10000
##$MC2= 0
##$MEAN= 0
##$ME_mod= 0
##$MI= 0
##$NCOEF= 0
##$NC_proc= -10
##$NLEV= 6
##$NOISF1= 0
##$NOISF2= 0
##$NSP= 1
##$NTH_PI= 0
##$NZP= 0
##$OFFSET= 14.95986
##$PC= 1
##$PHC0= 0
##$PHC1= 0
##$PH_mod= 0
##$PKNL= yes
##$PPARMOD= 0
##$PPDIAG= 0
##$PPIPTYP= 0
##$PPMPNUM= 2147483647
##$PPRESOL= 1
##$PSCAL= 4
##$PSIGN= 0
##$PYNMP= <proc.py>
##$REVERSE= no
##$SF= 90.2741085120748
##$SI= 8192
##$SIGF1= 0
##$SIGF2= 0
##$SINO= 400
##$SIOLD= 32768
##$SPECTYP= <>
##$SREGLST= <1H.CDCl3>
##$SSB= 0
##$STSI= 0
##$STSR= 0
##$SW_p= 1497.18866228788
##$SYMM= 0
##$S_DEV= 0
##$TDeff= 0
##$TDoff= 0
##$TI= <>
##$TILT= no
##$TM1= 0
##$TM2= 0
##$TOPLEV= 0
##$USERP1= <user>
##$USERP2= <user>
##$USERP3= <user>
##$USERP4= <user>
##$USERP5= <user>
##$WDW= 1
##$XDIM= 8192
##$YMAX_p= 2017865119
##$YMIN_p= -3394924
##$CURPLOT= <PDFCreator>
##$CURPRIN= <$PDFCreator>
##$DFORMAT= <normdp>
##$LAYOUT= <+/1D_H.xwp>
##$LFORMAT= <normlp>
##$PFORMAT= <normpl>
##$SURQMSG= 1
$$ End of Bruker specific parameters
$$ ---------------------------------
##XUNITS= HZ
##YUNITS= ARBITRARY UNITS
##XFACTOR= 0.182762287876938
##YFACTOR= 1
##DELTAX= -0.182762287876938
##NPOINTS= 8192
##FIRSTX= 1497.0059
##FIRSTY= 1005885
##LASTX= 0
##MAXY= 2017865119
##MINY= -3394924
##XYDATA= (X++(Y..Y))
8191A005885m57128a990268F34220k0392e37667K11349H15232b498999h29307
8181A227108a645523B83974K16752J67456Q85007B00420i80323C69371P67132
8172A136503C80277b62880o84565A230477a017671K99874C57791a624714e4893
8162F49013a017089L51924I91448l69479P88906n97189h86499G69563J118798
8153A888361a234745J15388J23541o69301l47637A10970b17255c1408k67721A346274
8142e79850A34111i70247C63524P29398L89863F61909L02254D03530A15130J82465
8132B97595b270022H62879h21468G13139M15476E32690i0230G0579J387108g76990
8121i19330F13564a805992f88026o37637J73774A66592M06988h79576c4797l50864
$$ y = [1005885, 548757, -1990268, 634220, 613828, -537667, -326318, 815232, -2498999, -829307, 1227108, -1645523, 283974, 500726, 668182, 1553189, 200420, -980323, 369371, 1136503, 380277, -262880, -947445, 1230477, -1017671, -717797, 357791, -1624714, -54893, 649013, -1017089, -665165, 991448, 621969, 1410875, 813686, -886499, 769563, 1888361, -1234745, -1119357, -995816, -1665117, -2012754, 110970, -217255, -31408, -299129, 1346274, -579850, 134111, -970247, 363524, 1092922, 1482785, 661909, 964163, 403530, 115130, 297595, -2270022, 862879, -821468, 713139, 1128615, 532690, -90230, 70579, 1457687, -776990, -919330, 613564, -1805992, -688026, -1325663, -1151889, 166592, 573580, -879576, -34797, -385661]
8111c85661A138790g39660q91352A976883b81675j241867B084547f17485B62883
8101d2093A166952e7388o01230A375543a241084b65334B329139a077230A137126
8091B38964h28219K43134A209525a060084A429456P27803I11768j29436D4387
8081A894585C2673J530785C95072i69247H98464a09657n74443G80402f87845j21913
8071h09758a06273B967427d84999I50400j94788C74403a519694O51256j634465
8062b502903H97479a358254B03751K185151G416a30288l91205F69616P16945E18411
8051a177550A391499F45858R83918D23945c38520C22680a860599h04259A440022
8041A739203n37304J48538c56158j061071I0265f11459A50277R27490e73959B71100
$$ y = [-385661, 1138790, -739660, -1631012, 1976883, -281675, -1523542, 2084547, -617485, 262883, -42093, 1166952, -57388, -658618, 1375543, -1241084, -265334, 2329139, -1077230, 1137126, 238964, -828219, -585085, 1209525, -1060084, 1429456, 2157259, 911768, 782332, 44387, 1894585, 32673, 1563458, 395072, -969247, 898464, -109657, -684100, 780402, -687845, -809758, -106273, 2967427, -484999, 950400, 755612, 374403, -1519694, -868438, -2502903, 897479, -1358254, 203751, 2388902, 7416, -130288, -521493, 669616, 1386561, 518411, -1177550, 1391499, 645858, 1629776, 423945, -338520, 322680, -1860599, -804259, 1440022, 1739203, 1201899, 1350437, -356158, -1417229, 90265, -611459, 150277, 1077767, -573959, 271100]
8030b209533B886476a805195a96686F45112A78011h85684D21227a847129l9876
8021a887005g94436A51516h07856B29621b85637H0230J84279K054848a277560
8011A72463f21968F7850Q0900K029172a822931f33360b52626m79739D62778L20483
8001G83261g54334A07845b049371A083489N10704C31827F6011e96706A585441
7991b88560j24668r44464N54399J15461D79748j64431a135464H1826C1690d23148
7980D01161j22819N5471c22168p56886K71577F17235M94955A06177g31505g8756
7969B358014C91757j70039N13545L01263h21176I03776C83652f7597l88144j348574
7959a804315C49818a361574F38620e9549q78068c01495F64203c9037k47951A189784
$$ y = [-2209533, 2886476, -1805195, -196686, 645112, 178011, -885684, 421227, -1847129, -1887005, -794436, 151516, -807856, 229621, -285637, 80230, 264509, 2319357, -1277560, 172463, -621968, 67850, 148750, 2177922, -1822931, -633360, -252626, -732365, 462778, 783261, -754334, 107845, -2049371, 1083489, 1594193, 331827, 66011, -596706, 1585441, -288560, -413228, -1357692, -803293, -687832, 479748, 315317, -1135464, 81826, 31690, -423148, 401161, 278342, 333813, -322168, -1079054, -807477, 617235, 1112190, 106177, -731505, -78756, 2358014, 391757, 221718, 735263, 1036526, -821176, 903776, 383652, -67597, -455741, -1804315, 349818, -1361574, 638620, -59549, -937617, -301495, 664203, -39037, -286988, 1189784]
7948e60410A213445j50725D53507a490500d87933A36406a00805A393829m45647
7939I48182j32628l47278g55837p6923K54892p90867D83053d69467G04616j42969
7929E61647K68351B37982g30696l68199A721725B49749J83606J280357D45632
7919b605396D90228a015328D2708J220077d67603J99812A815320p63935l31738
7910G19647l12501I9753b18881F06715J91934k58305a39656I24130g92629j59580
7900i52209e7545G24109b60345j005094A403520A68030a679466M37897H81192
7890a5125p06738b85452j315227m10686B68026b74592A109318a93250H37496j78374
7880F59122b8009A813943D25917N62753A61519a20534A35576N6128K11531k6701
$$ y = [-560410, 1213445, 1062720, 453507, -1490500, -487933, 136406, -100805, 1393829, 948182, 815554, 468276, -755837, -832760, -577868, -1368735, 483053, -469467, 704616, 561647, 829998, 237982, -730696, -1098895, 1721725, 249749, 433355, 1713712, 445632, -2605396, 490228, -1015328, 42708, 1262785, -467603, -267791, 1815320, 1051385, 719647, 407146, 99753, -218881, 606715, 798649, 540344, -139656, 924130, -792629, -952209, -57545, 724109, -260345, -1265439, 1403520, 168030, -1679466, -1241569, 881192, -15125, -721863, -285452, -1600679, -2011365, 268026, -274592, 1109318, -193250, 837496, 659122, -28009, 1813943, 425917, 988670, 161519, -120534, 135576, 191704, 403235, 376534]
7870C76534b468257O1910B992766a927778a2563B36163J234320J346726A297003
7860i99368c67708m0217j304614B731230C64990p5159M02064b44102A039222l20944
7850G18278a324457F70944k77383a86261E40514J44362a492734f46247D64618
7840A982324n98453d42475A041792O04027a430039F12089j07546d25269B566816
7830B044051F54049A98389L52424B12770a577637B05314J112158A84486a501449
7820g25431G43232J852390I5409a104942m65439A470955A76949g47081A144657
7810c51649l11474g8934H05367J70304J469880G96661A43403N56769b26671A377817
7799a001430K42737a22732A418755m88564b07038E47590f6213l32951j877777
$$ y = [376534, -2468257, -2406347, 2992766, -1927778, -12563, 236163, 1470483, 2817209, 1297003, -999368, -367708, -407925, -1712539, 2731230, 364990, 289831, 691895, -244102, 1039222, 718278, -1324457, 670944, 393561, -186261, 540514, 684876, -1492734, -646247, 464618, 1982324, 1383871, -442475, 1041792, 1645819, -1430039, 612089, 504543, -425269, 2566816, 2044051, 654049, 198389, 550813, 212770, -1577637, 205314, 1317472, 184486, -1501449, -725431, 743232, 2595622, 95409, -1104942, -1570381, 1470955, 176949, -747081, 1144657, -351649, -663123, -78934, 805367, 975671, 2445551, 796661, 143403, 700172, -226671, 1377817, -1001430, -758693, -122732, 1418755, 930191, -207038, 547590, -66213, -399164, -2276941]
7790b276941A062940l66120a12986C85375M7079K154009c10185H66980j43621
7781G23359N5714J55432C30903J13197J02661d03850A74385K716848b523366f70633
7770g04770B28215M11507Q22707N92519e39575A220748k15890B00453c04902D52677
7759b65038A599037a118957q52147A277310C08899Q91816a527559P42353A46572
7749a501669B555375a239782K33731A088784e30721E3934J93492Q45408H8538
7739A90859f39807D25205M8965Q32404F50736K49106a66002r45332d85426R1234
7729c94192F76071h68002m22115B83723J056096b42789E48294k65025j30473g96503
7718A656888h30189j18617M07948K68881r36237j55060E63655l3256a008818q70342
$$ y = [-2276941, 1062940, 696820, -112986, 385375, 432454, 2586463, -310185, 866980, 723359, 779073, 934505, 330903, 444100, 546761, -403850, 174385, 2891233, -2523366, -670633, -704770, 228215, 639722, 1462429, 2054948, -539575, 1220748, 1004858, 200453, -304902, 452677, -265038, 1599037, -1118957, -1971104, 1277310, 308899, 1200715, -1527559, -785206, 146572, -1501669, 2555375, -1239782, -1006051, 1088784, -530721, 53934, 247426, 1092834, 88538, 190859, -639807, 425205, 474170, 1306574, 650736, 899842, -166002, -1111334, -485426, -394192, 676071, -868002, -1290117, 283723, 1339819, -242789, 548294, 283269, 152796, -796503, 1656888, -830189, -948806, -540858, -271977, -1208214, -1363274, 563655, 530399, -1008818, -1879160]
7708a879160i7199o69692b36670j556547P40671A167105h91471A4898a416129
7698D34380Q88428C49189K85031b53072A069281K32407B2982e38187n4334k85827
7688h78348C72382c81038B99326h69974G55893B67745O83396l24864d45406D14970
7677a95852m09883b02352j437621Q690A490198g2073m67803b68407H2692J562939
7667A645631a86527B00615L26263b17981k70055k30646l30094D55860J154795
7658A610655d72025A174159J03450o19192b28374D37298g1186A649232m80346
7649A168886Q3657b88395j56668j67778n0112C663241f35911B660923e44075q5808
7639f29883A043381a791064B042858F70870P63960g91387D31876A01736g62930
$$ y = [-1879160, -97199, -766891, -236670, -1793217, -1052546, 1167105, -891471, 14898, -1416129, 434380, 1322808, 349189, 634220, -253072, 1069281, 1301688, 22982, -538187, -592521, -878348, 372382, -381038, 299326, -869974, 755893, 267745, 951141, 626277, -445406, 414970, -195852, -605735, -202352, -1639973, -1631283, 1490198, -72073, -539876, -268407, 82692, 1645631, -186527, 200615, 526878, -217981, -488036, -718682, -1048776, 455860, 1610655, -472025, 1174159, 1277609, 658417, -228374, 437298, -71186, 1649232, 1168886, 1252543, -288395, -445063, -612841, -662953, 3663241, -635911, 2660923, -544075, -629883, 1043381, -1791064, 2042858, 670870, 1434830, -791387, 431876, 101736, -762930]
7629d25648G61170Q6747a423287B38684h24426o64633G81221c85691A31609P03513
7619H35122f21323A003379f70342I44402h77495c97310A035943d47468F05996
7609d50189A05527L10297l9640c12222m35141L48352h1529B48784B7264J083950
7599A111214J403120l23514A32158e73268m27700H82160g78956H60126A5015P56190
7589G71205B15320P87862k40580j324J060983d77811A374288b193759A60713O31170
7579G91883l08798Q73017h5384A72515e70278E90838B30169K74525J72218c63874
7568D53836a53172A338789g73343B51674J221153K02272e54395D21095g64253
7558f79778n08691H79196O2079f865k08998D64751J080212F02688o2120k01069
$$ y = [-425648, 761170, 847917, -1423287, 238684, -824426, -1489059, 781221, -385691, 131609, 835122, -621323, 1003379, -670342, 944402, -877495, -397310, 1035943, -447468, 605996, -450189, 105527, 415824, 376184, -312222, -747363, -399011, -81529, 248784, 27264, 1111214, 2514334, 2190820, 132158, -573268, -1000968, 882160, -778956, 860126, 15015, 771205, 215320, 1003182, 762602, 761278, 1822261, -477811, 1374288, -2193759, 160713, 791883, 483085, 1356102, -85384, 172515, -570278, 590838, 230169, 504694, 676912, -363874, 453836, -153172, 1338789, -773343, 251674, 1472827, 1675099, -554395, 421095, -764253, -679778, -1188469, 879196, 941275, -6865, -215863, 464751, 1544963, 602688, 540568, 339499]
7548C39499K15359a65069A439091F18661c99689E36947D2532M34162R98242p14650
7538G60286P17977P01165b67033I95028a86570J0441k195829H0633J69928h27231
7527D99658d60910H89907k04150k29938h3106A77643b0402k020681G5400P13338
7517G88738a676456D54745b32179j928922F57379a678821L92660A83732b62480
7507e16371n44788J55045F75142A88408F822e54874H69955h06909A938137a154477
7496b99537A406259g53508A081990b72613r58941G65157C50683b094707B083166
7486a464845A909248a122916A647967b14216k53991l28577D44963a054837d35597
7476A554595A40685M89125A1873d59478m52242M01948P2449E43053b67846j263463
$$ y = [339499, 554858, -165069, 1439091, 618661, -399689, 536947, 42532, 476694, 1474936, 760286, 1478263, 2179428, -267033, 995028, -186570, -176129, -2371958, 80633, 250561, -827231, 499658, -460910, 889907, 685757, 455819, -83106, 177643, -20402, -2041083, 75400, 788738, -1676456, 454745, -232179, -2161101, 657379, -1678821, -1286161, 183732, -262480, -516371, -1061159, -906114, 675142, 188408, 6822, -554874, 869955, -806909, 1938137, -1154477, -299537, 1406259, -753508, 1081990, -272613, -1231554, 765157, 350683, -2094707, 2083166, -1464845, 1909248, -1122916, 1647967, -214216, -468207, -796784, 444963, -1054837, -435597, 1554595, 140685, 629810, 11873, -459478, -911720, -509772, -437323, 543053, -267846, -1531309]
7466a531309B260478b7700G88846M2980K111464a15827r5336j9730F85392J83936
7456H69328m05751p6130a203275F83198J664159d70622j669939g28055H75917
7446h77306d31120q05856A416937C27518K1441O31105c26588A511715a334671
7436f04288R491H72665K56175J673851e11951E18917a926820F24345c1655F63470
7425a97374A319363a289723A119598k55811L75939N89213c38131G99889C2110
7415E71706g8891A333917i49057D90573K269119A237805a408520A957748N58199
7406B515947c37765A834919a31558E02498J98914f71611E11459j53694a680593
7396h81480k89609B607375n86257a034168H85691b19398C6758J87040J291649
$$ y = [-1531309, 2260478, -27700, 788846, 831826, 2943290, -115827, -211163, -230893, 685392, 869328, 463577, 387447, -1203275, 683198, 2347357, -470622, -2140561, -728055, 875917, -877306, -431120, -1236976, 1416937, 327518, 348959, 980064, -326588, 1511715, -1334671, -604288, -594797, 872665, 1128840, 2802691, -511951, 518917, -1926820, 624345, -31655, 663470, -197374, 1319363, -1289723, 1119598, 863787, 1239726, 1828939, -338131, 799889, 32110, 571706, -78891, 1333917, -949057, 490573, 2759692, 1237805, -1408520, 1957748, 2515947, -337765, 1834919, -131558, 502498, 701412, -671611, 511459, 357765, -1680593, -881480, -1171089, 2607375, 2021118, -1034168, 885691, -219398, 36758, 223798, 1515447]
7387A515447d35336D79982L09126B17773R97119c43945G18628a388481O52776
7378g35705b46446o27223A293285e87883I46787d38295A599841C4077K7758d91215
7367a503900a03063c6972J6045B916886G87494a18035o2562F51802k05382f05024
7356g10713J53395A175393b147706A793447p34186d84374b6176D26285J053539
7347A479824I9211O86378f78724a46655o42354l60050C58363C0657c097476J394288
7337a703188a90232k80796F71475R0728J274855e57408B025296C52533a125185
7327E97073B69253J00645a138716A070796j83974a738561B86256a236748B009791
7317A858298B67758R99787m91284C20401k0912R57772a650724b681j053428N27485
$$ y = [1515447, -435336, 479982, 789108, 217773, 1214892, -343945, 718628, -1388481, -735705, -246446, -873669, 1293285, -587883, 946787, -438295, 1599841, 34077, 61835, -491215, -1503900, -103063, -36972, -20927, 2916886, 787494, -118035, -180597, 651802, 446420, -605024, -710713, -557318, 1175393, -2147706, 1793447, 1059261, -484374, -26176, 426285, 1479824, 99211, 785589, -678724, -146655, -789009, -1149059, 358363, 30657, -3097476, -1703188, -190232, -471028, 671475, 762203, 2037058, -557408, 2025296, 352533, -1125185, 597073, 269253, 369898, -1138716, 1070796, 886822, -1738561, 286256, -1236748, 2009791, 1858298, 267758, 1267545, 776261, 320401, 299489, 1257261, -1650724, -2681, -1056109, -528624]
7307e28624J5117J91075m43160K32922B826673i5407l6894M7284k46112k215352
7297b546481A481168l74559f06812m92724A008515a401873L02715D49166b87714
7287B054848n36181D12366r6364i41242A393185C46829E884J318069J6182k62710
7277A077425C45768i54423A594354b51295A95530O95873a286208m55900g52245
7267a554834A698497C56022R16213f21559q13482A970769a97432k00122o65032
7258a062586H25644C0375J354849E86727a554800H22299l75802O58494A42814
7248A055049Q58811a117022N55354L9390A458677i60945A289579k07882D05660
7238E37500h7791B287533A59106Q74390h26777B347940M89848q32145r46892l63929
$$ y = [-528624, -513507, -322432, -765592, -532670, 2826673, -95407, -132301, -85017, -331129, -2546481, 1481168, 1106609, -606812, -1099536, 1008515, -1401873, -1099158, 449166, -287714, 2054848, 1518667, 412366, 316002, -941242, 1393185, 346829, 5884, 1323953, 1340135, 1077425, 345768, -954423, 1594354, -251295, 195530, 891403, -1286208, -1742108, -752245, -1554834, 1698497, 356022, 1272235, -621559, -1435041, 1970769, -197432, -397554, -1062586, 825644, 30375, 1385224, 586727, -1554800, 822299, 446497, 1104991, 142814, 1055049, 1913860, -1117022, -561668, -522278, 1458677, -960945, 1289579, 1081697, 405660, 537500, -87791, 2287533, 159106, 1033496, -826777, 2347940, 2837788, 2005643, 1058751, 694822]
7228F94822J167672K0969a737892E27443d3358A029608j69067l0271a75864D76102
7217A077880h79785A401730f63946A78146e72213A192075f35230a46250n77866
7208g24116F37440a271621B247099a7874A653340P38463A16389J140010D33392
7198c25401E98270K98855N23063B54461L34227i87369B558648h93143G53260d62154
7187B86737e29816B5733K95634J318393m35752O71300a429428A398706b87791
7177A133699D74141a59536c2642j82834n95401A147627R0848A29929K139719j56001
7167B113647a96937H54645k97230b78624M6673G83118m9832l48516h3579A85393
7156d35003l04279I91545f9289A290924d08451A549517n56319a215148b72837
$$ y = [694822, 1862494, 1883463, -1737892, 527443, -43358, 1029608, 860541, 830270, -175864, 476102, 1077880, -879785, 1401730, -663946, 178146, -572213, 1192075, -635230, -146250, -724116, 637440, -1271621, 2247099, -17874, 1653340, 2391803, 116389, 1256399, 433392, -325401, 598270, 897125, 1420188, 254461, 588688, -987369, 2558648, -893143, 753260, -462154, 286737, -529816, 25733, 321367, 1639760, 1204008, 1875308, -1429428, 1398706, -287791, 1133699, 474141, -159536, -32642, -215476, -810877, 1147627, 1238475, 129929, 2269648, 2113647, -196937, 854645, 557415, -278624, -231951, 783118, 733286, 384770, -83579, 185393, -435003, -739282, 991545, -69289, 1290924, -408451, 1549517, 993198, -1215148, -272837]
7146A79198o764O28787a25759D32372J05062J749646F60997M14781J052901B8888
7135H87112l79535B32378K185433j039952e19816a8592A60413J066888b877547
7125a055130F86724g08848F92128M03730B88728K15188b9391H6630J231702A1351
7114B012304A61484d34632l00671K76430A13092J138742i0992B609277a455730
7104a69910j176176J00728B15456a11476q6056E11860h72709B10721a52151B306950
7093B95062M61603N1091b50848l94115a32909j63440l98570J10663k62063C73094
7082a060651d12179i7129q00262A232062a584939e77008f1382G48660b11698A552954
7071i1837A471667a46230E89095H5416P97968B34509J322079h5330A170639C79769
$$ y = [179198, 172434, 801221, -125759, 432372, 537434, 2287080, 660997, 1075778, 2128679, 28888, 887112, 507577, 232378, 2417811, 1377859, -519816, -18592, 160413, 1227301, -2877547, -1055130, 686724, -708848, 692128, 1095858, 288728, 503916, -29391, 86630, 1318332, 11351, 2012304, 161484, -434632, -735303, -458873, 113092, 1251834, -90992, 2609277, -1455730, -169910, -1346086, -1245358, 215456, -111476, -197532, 511860, -872709, 210721, -152151, 2306950, 295062, 756665, 807756, -250848, -644963, -132909, -296349, -694919, -584256, -846319, 373094, -1060651, -412179, -97129, -897391, 1232062, -1584939, -577008, -61382, 748660, -211698, 1552954, -91837, 1471667, -146230, 589095, 85416, 883384, 234509, 1556588, -85330, 1170639, 379769]
7060B337271B22796a261159g9300G19266J463548a03715A153687b283747f80444
7050G65519M20513j07491f3513A4300N04439J844597a081376F20000N45020a211473
7039B745199b43019H77206C33807J981353A141235B19570p2650H347K131361b34004
7028a79174G14573B34521g92415c11822A570791J733821E72593k19310K111251
7019B464534e83354a75366k042983D22250j75691J95550j11383M69048C29261
7009G80158A84596b6631A363478a829819f06536l90826J40911A319430L22603
7000A642033p11595m00989d99840j13185K41348D71692a60083l272k88332F35102
6989i34171C60972M85994J17067Q55799f17804A476907L77538p71746h32731E20580
$$ y = [2337271, 222796, -1261159, -79300, 719266, 2182814, -103715, 1153687, -2283747, -680444, 765519, 1186032, 1078541, -63513, 14300, 518739, 2363336, -1081376, 620000, 1165020, -1211473, 2745199, -243019, 877206, 333807, 2315160, 1141235, 219570, 146920, 8347, 2139708, -234004, -179174, 714573, 234521, -792415, -311822, 1570791, 3304612, 572593, 353283, 2464534, -583354, -175366, -2218349, 422250, 246559, 442109, 330726, 799774, 329261, 780158, 184596, -26631, 1363478, -1829819, -606536, -997362, -856451, 1319430, 1642033, 930438, 529449, -499840, -613025, -371677, 471692, -160083, -163355, -451687, 635102, -934171, 360972, 846966, 964033, 1819832, -617804, 1476907, 1854445, 1082699, -832731, 520580]
6978A28687J218037f95020D76163f81303A424648h64676H51507i650j015939B407998
6967a551623G62566c53781A216996E69761B04883b061258A516268n18421m84797
6958E13050j69419e99457B766326h61372D17120i5142j14136j836576C19423Q7738
6948D07161a63546B53962J329805k48146k40164M21835P20771A65956f64098A59859
6937A59776K20636n0806J92002i6198j102445A804874a232476c88177G08200L40655
6927A048855a476794c92918a51572j20112k70863B160769j43481J245875c46368
6917A828452F32538B16385L98750d42278A432614c20912a9727H38427o1082K904305
6907C681650b62772o43588A043310J09535F6298b40643A429178E37048O71088
$$ y = [128687, 1346724, -695020, 476163, -681303, 1424648, -864676, 851507, -9650, -1025589, 2407998, -1551623, 762566, -353781, 1216996, 569761, 204883, -2061258, 1516268, 997847, 513050, 343631, -599457, 2766326, -861372, 417120, -95142, -209278, -2045854, 319423, 407161, -163546, 253962, 1583767, 1335621, 1095457, 1517292, 2238063, 165956, -664098, 159859, 159776, 380412, 329606, 521608, -96198, -1198643, 1804874, -1232476, -388177, 708200, 1048855, -1476794, -392918, -151572, -271684, -542547, 2160769, 2017288, 3263163, -346368, 1828452, 632538, 216385, 615135, -442278, 1432614, -320912, -19727, 838427, 777345, 3681650, -262772, -906360, 1043310, 1152845, 66298, -240643, 1429178, 537048, 1208136]
6898A208136e18086B22918J441459d30561B969568A322311k52348k37659a621373
6888a67072j648050g18607B282938a69910B503717a035859h6839B486987f16258
6878I53146D24732m6629N27645N71058J884246I11952P93722B53905K34971Q71099
6868A359975n00482J071066q03332b460232A763224b848228c51680B551000A024868
6858C17435O27730m69941B27138J330662K462149a446045J59073c34208A690484
6848A364630a474884C27096b08384j763122K31890B41514M22055j02938a220298
6838f11014E8143J114649J183823l12313b0666k23374J21071A064092A16653K187683
6828B304336I50514e36420l05895p0608J70420j68367b83297E09815J505956f45872
$$ y = [1208136, -518086, 222918, 1664377, -430561, 2969568, 1322311, 1069963, 832304, -1621373, -167072, -1815122, -718607, 2282938, -169910, 2503717, -1035859, -86839, 2486987, -616258, 953146, 424732, 378103, 905748, 1476806, 3361052, 911952, 1705674, 253905, 488876, 1359975, 859493, 1930559, 1127227, -2460232, 1763224, -2848228, -351680, 2551000, 1024868, 317435, 945165, 475224, 227138, 1557800, 4019949, -1446045, -1286972, -334208, 1690484, 1364630, -1474884, 327096, -208384, -1971506, -1739616, 241514, 663569, 560631, -1220298, -611014, 58143, 1172792, 2356615, 2044302, -20666, -244040, -122969, 1064092, 116653, 2304336, 950514, -536420, -842315, -912923, -742503, -910870, -283297, 509815, 2015771, -645872]
6817b187069A168271h36011Q1658B471350a217991A405942J406505k14579A088614
6807F01930j35161O57103J097365b31706a02870A501091p08809L63019E33470
6797a77034k454903A335839b83141A37943J243610o38932a90106A185409J59788
6788A345197O95203g91995M9615C53441L77965J103207q85557e82726A480512
6778E22405a330704A133851L64253E11899N73853B98989H2347Q66501a35937k44648
6768c80585A310532a384429A69338P2336J95655h49308D00482L83240d38757H24302
6757A141705m11406e90551F14491Q31428a31998A848081H60668a338639k39637
6748a578276B21220a959497F17774p1620J470761D72436Q76438O21288a241351
$$ y = [-2187069, 1168271, -836011, -754353, 2471350, -1217991, 1405942, 2812447, 2597868, 1088614, 601930, 466769, 1123872, 2221237, -231706, -102870, 1501091, 792282, 1155301, 533470, -177034, -2631937, 1335839, -283141, 137943, 1381553, 742621, -190106, 1185409, 1345197, 2040400, -791995, -742380, 353441, 731406, 1834613, 949056, -582726, 1480512, 522405, -1330704, 1133851, 1498104, 511899, 1085752, 298989, 82347, 948848, -135937, -380585, 1310532, -1384429, 169338, 241674, 437329, -849308, 400482, 783722, -438757, 824302, 1141705, 730299, -590551, 614491, 1445919, -131998, 1848081, 860668, -1338639, -1578276, 221220, -1959497, 617774, 546154, 2016915, 472436, 1348874, 1970162, -1241351]
6738h08961J73802B331878l85969F19628k44635O06114q627n2746f29122H23660
6727a700913B494961g24102m93585A12713M30304a24449k36443B657015F6934
6717A763158b002274B494227p67871M81534d23711E95375d75339k706893e85066
6707B294239G9237L39968A03511J082859J39949e53945C5703b105505I70271a236855
6696B632698c48197C836294G56964M40301g40152B063697c394924A280410R7727
6687A378137J669226D34442a699970A273107n75048J040721g66739A061677A39559
6677a67104A832930J370791F17702a573815J432D75197O07112d2140k72467k86595
6667f01202B40677J512263c2313A571317f73220G40995C4401b66792n00250b99054
$$ y = [-808961, -635159, 2331878, 1945909, 619628, 374993, 981107, 972480, 919734, -629122, 823660, -1700913, 2494961, -724102, -1217687, 112713, 543017, -124449, -360892, 2657015, 66934, 1763158, -2002274, 2494227, 1726356, 2207890, -423711, 595375, -475339, -3182232, -585066, 2294239, 79237, 419205, 103511, 1186370, 1326319, -553945, 35703, -2105505, 970271, -1236855, 2632698, -348197, 3836294, 756964, 1197265, -740152, 2063697, -3394924, 1280410, 1378137, 3047363, 434442, -1699970, 1273107, 698059, 1738780, -766739, 1061677, 139559, -167104, 1832930, 3203721, 617702, -1573815, -1572383, 475197, 1082309, -42140, -314607, -601202, 240677, 1752940, -32313, 1571317, -673220, 740995, 34401, -266792, -767042, -299054]
6656a285007M90895B50264N44095J620858E8668h6849n56448E17518d47762k32852
6646f80614b02895G53506a342864C01080p0125O62592C23135a095482A30620a75521
6635g00495A253882e72535A639785F07961O78823J48767n04390g6290B69497K4987
6625B94484N38101a49972j532903D71993e79449A061002f61809C29627O56510
6616I86137c76838o00988L85241a0480B175451C50491g5600A300146E52910J26115
6606F79025j61626j96687K534510C28182r6666d37657P4070a71252E8122K89859
6596C47981J505728d8962C22677M67334C78091f20179a79861o28718A171559e47590
6585A93413K89956B6047e3897H26491N74989h57206A851740G34023a145102d72669
$$ y = [-1285007, -794112, 250264, 794359, 2415217, 58668, -86849, -643297, 517518, -447762, -680614, -202895, 753506, -1342864, 301080, 230955, 893547, 323135, -1095482, 130620, -175521, -700495, 1253882, -572535, 1639785, 607961, 1286784, 1435551, 931161, -76290, 269497, 294484, 832585, -149972, -1682875, 471993, -579449, 1061002, -661809, 329627, 986137, -376838, -977826, -592585, -10480, 2175451, 350491, -75600, 1300146, 552910, 679025, 517399, 320712, 2855222, 328182, 231516, -437657, -363587, -171252, 58122, 347981, 1853709, -48962, 322677, 790011, 378091, -620179, -179861, -808579, 1171559, -547590, 193413, 483369, 26047, -53897, 826491, 1401480, -857206, 1851740, 734023, -1145102, -472669]
6574a273349B534323c79845o98259b00948G27064i42383B5319M46342d16229B2133
6563F01531J681806C10423c83316I09955A42849K096683J717017c08716H1488
6553H91389m24373K518102a490305P15882A325753i04804I97949R12942q25246
6544A085645k71936L73425A14860h09623F56289J292765D52041j16280a228640
6534B157084o85929l93786K48981E22146R37812C11244i13098l0609D56956N37474
6524I94430L56158a99737q93281A307881J110695H98868a350420L05048D83949
6514H72903h84518B28388R45620l31439a420535C00557g89144K9202D85262K159665
6504B644927g47910a99849o55291A177147l33393k3911C67797a728460C23367
$$ y = [-1273349, 2534323, -379845, -1078104, -200948, 727064, -942383, 25319, 471661, -416229, 22133, 601531, 2283337, 310423, -383316, 909955, 142849, 2239532, 3956549, -308716, 81488, 891389, 467016, 2985118, -1490305, -774423, 1325753, -904804, 997949, 1910891, 1085645, 813709, 1187134, 114860, -809623, 656289, 1949054, 452041, 335761, -1228640, 2157084, 1471155, 1077369, 1326350, 522146, 1459958, 311244, -913098, -943707, 456956, 994430, 1350588, -199737, -1093018, 1307881, 2418576, 898868, -1350420, -1045372, 483949, 872903, -884518, 228388, 1174008, 842569, -1420535, 300557, -789144, -759942, 485262, 2644927, -747910, -199849, -855140, 1177147, 843754, 819843, 367797, -1728460, 323367]
6494H11532O03472F87413c82020G50529N96693D09869a078001A969065J2465A61853
6483D83811i00357A83779B1557J400878a246338C083758H30628a23542p60629
6474h84171H93458a65917q48679A531976a833293F22351N44799C6803J559786
6465A596589Q58770c09920j065880A403962F8230M82453c39476A174649J551583
6456B726232F64568K7275J71016e16020A992240C61326H3337J126249E0556J062441
6446A112997a116260B174534r00514D54438k25210J631450p62541h33447B48011
6436G60526N66787J05801d27570A460014j65239D96196b33772F50120J605363
6427B255483p20616P97952E33257J225439h50715A414656J66977a005952B125937
$$ y = [811532, 1415004, 687413, -382020, 750529, 1347222, 409869, -1078001, 1969065, 1981530, 161853, 483811, -900357, 183779, 21557, 1422435, -1246338, 3083758, 830628, -123542, -884171, 893458, -165917, -1014596, 1531976, -1833293, 622351, 1167150, 36803, 1596589, 2455359, -309920, -1375800, 1403962, 68230, 550683, -339476, 1174649, 2726232, 664568, 691843, 862859, -516020, 1992240, 361326, 83337, 1209586, 50556, 1112997, -1116260, 2174534, 1274020, 454438, 229228, 1860678, 1098137, -833447, 248011, 760526, 1327313, 1433114, -427570, 1460014, 1294775, 496196, -233772, 650120, 2255483, 1534867, 2332819, 533257, 1758696, -850715, 1414656, 1581633, -1005952, 2125937]
6417I57436D54288f66232A784511H64752a840107D91739L62358o0898j50206b06897
6406a18843B74003J157939M11230A26R54364L65464n58677J031527O35079A92180
6395a163301Q8869a00547A227420n01589K026372i1322C936967F5276Q81447Q56328
6385A803051k74327L94j22650A32642J326812h79040L89738F97839a169517C43821
6374A148871J003976C85525a85763B279326C866P18248j51928d66596A619966
6364B085309F44701B83547J278244a204855D92988J638393n12978c86426j11782
6355d98208k64F88277k33053Q83999f35972b12017l86186q03348A57622K093060
6345B250682g09586A004697B26832N31448c44157F30196J104439b57231o35881
$$ y = [957436, 454288, -666232, 1784511, 864752, -1840107, 491739, 854097, 793199, 642993, -206897, -118843, 274003, 1431942, 1843172, 126, 954490, 1319954, 761277, 1792804, 2427883, 192180, -1163301, -1074432, -100547, 1227420, 725831, 2752203, -91322, 3936967, 65276, 946723, 1803051, 1528724, 1529118, 1406468, 132642, 1459454, -879040, -489302, 697839, -1169517, 343821, 1148871, 2152847, 385525, -185763, 2279326, 3866, 722114, 570186, -466596, 1619966, 2085309, 644701, 283547, 1561791, -1204855, 492988, 2131381, 1618403, -386426, -498208, -498472, 688277, 455224, 1339223, -635972, -212017, -598203, -1401551, 157622, 2250682, -709586, 1004697, 226832, 758280, -344157, 630196, 1734635, -257231, -893112]
6336h93112A594213o57255d23451A729003n77097a005230D08523A66890R2468
6327B59358b015E67427a222497A354135J521123j101135k99236o22737j59274
6318F92876a075694A93994J416889G42050O85626c19812F34835Q05032b6174B423269
6307a48097H48668a469714A77927Q16005c85177A324703B1754P64738J629484
6298B415976A084873J56091n72479C33136K251954j047617h15744F99341k88251
6289D11090N74221g23353A025451D65170K30054L43738j5549J212888o10631O17355
6279B243025r67709E73853j15381j94330G1887J162119a053791B170347f79454
6269G74610r0111J236766g81114A059623l6464l70544J113610g49217A926170
$$ y = [-893112, 1594213, 936958, -423451, 1729003, 1151906, -1005230, 408523, 166890, 259358, -2015, 567427, -1222497, 1354135, 2875258, 1774123, 1474887, 852150, 692876, -1075694, 193994, 1610883, 742050, 1427676, -319812, 634835, 1439867, -26174, 2423269, -148097, 848668, -1469714, 177927, 993932, -385177, 1324703, 21754, 786492, 2415976, 1084873, 1240964, 668485, 333136, 2585090, 1537473, -815744, 699341, 411090, 985311, -723353, 1025451, 465170, 695224, 1038962, 1023413, 2236301, 1625670, 2243025, 1275316, 573853, 458472, 264142, 71887, 1234006, -1053791, 2170347, -679454, 774610, 684499, 1921265, -781114, 1059623, 1023159, 652615, 1766225, -749217, 1926170]
6259E50671j85587G8602J913893L50043H63930l13128J402768j69742c44733B99674
6248G93390a330300G50255J831535n8992a243071D44463J39864O9552P36731n03922
6238H86688F4071Q64219k88173K94203f95490B388791H77992J724321a61876H11309
6227g03662D61718J377156h32117a6158l63149k308982A199617P29523J420722
6218C349862E30961K54586J472660g54117B112865d46071I70858L68844R6044
6209A435746F94711b13259A393541M425K40522p62009L97734J87767K51786D82142
6198A220834f76261B66754M8573a47300k52560A817884H15719N29069L5971r9112
6188A281647J080626h53558H03837J399956k06553j24060a397965I12613k83266
$$ y = [550671, 365084, 78602, 1992495, 2342538, 863930, 550802, 1953570, 1783828, -344733, 299674, 793390, -1330300, 750255, 2581790, 2522798, -1243071, 444463, 584327, 653879, 1390610, 886688, 64071, 928290, 640117, 934320, -695490, 2388791, 877992, 2602313, -161876, 811309, -703662, 461718, 1838874, -832117, -16158, -379307, -2688289, 1199617, 1929140, 3349862, 530961, 785547, 2258207, -754117, 2112865, -446071, 970858, 1339702, 1435746, 694711, -213259, 1393541, 1397966, 1638488, 876479, 1274213, 1461980, 1713766, 482142, 1220834, -676261, 266754, 315327, -147300, -399860, 1817884, 815719, 1344788, 1380759, 1281647, 2362273, -853558, 803837, 2203793, 1997240, 1873180, -1397965, 912613, 629347]
6179F29347O92919M35494d43760A683910E24284J871644a106174D19686a05852
6169c09688h2938F43339D8525J46071Q8671K799753g22501D1784O08975B7577
6158h2490p5490F42162A07669J551581J03799a333221B118209G19544H8568N38100
6148F26668o7796J227630J138452G74918l35639f88666A739496c64976a30799
6138c39171F38052c78491H60319L28073L13045j92726N37800c54091C64329O5994
6128D30323J67357a575554B114868R27019a186741A993359n76413A62822c3138
6118G40359b260843B369664A130352M06457f56959I29444j52141J322636n64619
6109A535320q2164m22508L10402n57591K674649H13837e91512A183191l2011j99229
$$ y = [629347, 1322266, 1757760, -443760, 1683910, 524284, 2395928, -1106174, 419686, -105852, -309688, -82938, 643339, 48525, 194596, 283267, 3083020, -722501, 41784, 650759, 27577, -82490, -157980, 642162, 107669, 1659250, 1763049, -1333221, 2118209, 719544, 88568, 626668, 558872, 1786502, 2924954, 774918, 439279, -688666, 1739496, -364976, -130799, -339171, 638052, -378491, 860319, 1188392, 1501437, 1308711, 1846511, -354091, 364329, 430323, 597680, -1575554, 2114868, 3041887, -1186741, 1993359, 1416946, 162822, -33138, 740359, -2260843, 2369664, 1130352, 1536809, -656959, 929444, 777303, 2099939, 1535320, 1453156, 1030648, 1341050, 783459, 3458108, 813837, -591512, 1183191, 1151180, 951951]
6099I51951l60402Q22219K95683N00447a123580H20335m0292j74997J979854g61895
6088D69140e81771A311651h90249A022982C90630L49924J5687p0680K73386a377244
6077b56471C028043l39224I94411M38458J37039D95399L95364R79185m07e51527
6066I46874O2092K18902e06766C19853L61920h57426a06501G92262O10975c89292
6055f30668A139486J022851q30246n43403O72955n71622M40083E17013J081095
6046A598108D89200K82293J447842C37759D7721P79016a359894c80564A463642
6036C43121J101629A17279g67384A091384f98024C823879G55316K656823F97219
6026a01091m15006F49986Q28729D50981i99384A255829J120210H36681J087383
$$ y = [951951, 591549, 1413768, 1709451, 2209898, -1123580, 820335, 780043, 605046, 2584900, -761895, 469140, -581771, 1311651, -890249, 1022982, 390630, 740554, 756241, 685561, 958947, -1377244, -256471, 3028043, 2688819, 994411, 1432869, 1569908, 495399, 890763, 1869948, 1869541, -551527, 946874, 1008966, 1227868, -506766, 319853, 681773, -857426, -106501, 792262, 1403237, -389292, -630668, 1139486, 2162337, 1332091, 788688, 1461643, 890021, 1330104, 517013, 1598108, 489200, 771493, 2219335, 337759, 47721, 826737, -1359894, -380564, 1463642, 343121, 1444750, 117279, -767384, 1091384, -698024, 3823879, 755316, 3412139, 697219, -101091, -516097, 649986, 1478715, 450981, -999384, 1255829, 2376039, 836681, 1924064]
6017A924064a26685I69948d8299F69719J424054R2084C46576c02966B575755n93913
6007A981842n27911J422722a136030A78476a36456A233730D79897B00656a75235
5997I0103N53839M5169A01749Q18793a372628F52767L65748B69774J381536k39736
5987A411574M10995J23802B33285K03976J142128D33212i50960H87057M52132
5978A339189i70345A457138P25154E26576J60798J92015O74164m36097D51161
5968d95783j639770A373973j12634L96883B27145L724303A419261h74916K25184
5959f49732D26415a126825B334871D91002Q93493J746033c50437B296809A011089
5949A887387A0765K775554c8031l77230A226876C94675O33322J8113K29889j60735
$$ y = [1924064, -126685, 969948, -48299, 669719, 2093773, 2185857, 346576, -302966, 2575755, 1981842, 1453931, 2876653, -1136030, 178476, -136456, 1233730, 479897, 200656, -175235, 90103, 643942, 689111, 101749, 920542, -1372628, 652767, 1018515, 269774, 1651310, 1411574, 1822569, 1946371, 233285, 437261, 1579389, 433212, -950960, 887057, 1339189, -970345, 1457138, 2182292, 526576, 687374, 879389, 1553553, 1117456, 451161, -495783, -2135553, 1373973, 1261339, 1658222, 227145, 3951448, 1419261, -874916, -649732, 426415, -1126825, 2334871, 491002, 1384495, 3130528, -350437, 2296809, 1011089, 1887387, 10765, 2786319, -38031, -415261, 1226876, 394675, 1027997, 1046110, 1275999, 1115264]
5939A115264c186r36113B404435h38546B131297b19807m69577q2581A916132n59797
5929A356335B27484J035767k18418C67248a57593E5017Q16897e849l57817D14614
5918B002196o8924r33427K40152e776j36834I81989C98416J962123D91248P41734
5908A232982n02269k26265R65255l58967C5206h2317B130030a021509J64674H24042
5897A363191B64910L2466R59033r3583M87718l02345k83217f60413C354312j286752
5887B067560G49048J691582j061518a36777G77375Q95528G31443j72282J427159
5878A986320L95386G10707M10864a044111E58684B17063K718440A382526b9596
5868G68658a342575A702750J31928m66058j91865n28842N08661J638259d63220
$$ y = [1115264, -3186, -939299, 2404435, -838546, 2131297, -219807, -689384, -771965, 1916132, 1356335, 227484, 1263251, 1044833, 367248, -157593, 55017, 871914, -5849, -363666, 414614, 2002196, 1933272, 999845, 1239997, -5776, -142610, 981989, 398416, 2360539, 491248, 1232982, 730713, 504448, 1469703, 1110736, 35206, -82317, 2130030, -1021509, -856835, 824042, 1363191, 264910, 297376, 1256409, 1162826, 1650544, 1348199, 1064982, -660413, 3354312, 2067560, 749048, 2440630, 1379112, -136777, 777375, 1672903, 731443, 559161, 1986320, 2381706, 710707, 1121571, -1044111, 558684, 217063, 2935503, 1382526, -29596, 768658, -1342575, 1702750, 1834678, 1368620, 1176755, 647913, 1156574, 2794833, -463220]
5858D67263b03205A535379a508087N52172I39855m27420j86338M95429C1858b57798
5847A37352K37842K98852M55713E13020e79855n47917B240467a967379C59072
5837A914306L17451G81757l11864K62225a46700j205989D40538B8562K357099
5828B385661d39492o14528E96572K9775K47823g77854A121062k92396f38999I97378
5817A437511D04032J10670e20870A107590N76117p14846l03955J442312a57581
5807B40553J167195a960043D97798N05845C04803N34743K31601J094319K10784
5798B376250E18571M049c55562B290182c81325C72449J32667J557019J51013j080107
5788A133041H4934J332834n05593J184940I48194k7207P47585K76815E53036J967121
$$ y = [467263, -203205, 1535379, -1508087, -955915, 939855, 512435, 326097, 821526, 31858, -257798, 137352, 375194, 674046, 1129759, 513020, -579855, -1127772, 2240467, -1967379, 359072, 1914306, 2231757, 781757, 469893, 732118, -146700, -1352689, 440538, 28562, 2385661, -439492, -1054020, 596572, 626347, 874170, -777854, 1121062, 828666, -638999, 997378, 1437511, 404032, 514702, -520870, 1107590, 1683707, 968861, 664906, 2107218, -157581, 240553, 1407748, -1960043, 497798, 1003643, 304803, 839546, 1071147, 2165466, 2376250, 518571, 522620, -355562, 2290182, -381325, 372449, 505116, 2062135, 2213148, 1133041, 84934, 1417768, 912175, 2097115, 948194, 920987, 1668572, 1945387, 553036, 2520157]
5778B520157F22593K436148j213462d794B369575A157740k17696B54051K586936
5769B840987d23045B045429n9695P3237n73886L8996o08922A33952a254814A408502
5758B035596j007431P56714A44826J499925J60022P59802D40638K770287A85971
5748A647488M40456I53039A3877J957182e96221m40903A589452N17583q5504H92181
5737f52760A875672n20368k04942B37400a668628I43888J88091b74405G5675K60658
5727C36333j15428n9644P82532l36749K560434A425560m48723R20784N60027j079716
5717A377932d96122A093084k14915l71129J536789F67420h82473A460966o88929
5708G72037k34110J883326j000841b12622A057992Q70104P05588C52439M00742
$$ y = [2520157, 622593, 3058741, 1845279, -4794, 2369575, 1157740, 940044, 254051, 2840987, -423045, 2045429, 1985734, 2058971, 1485085, 1524081, 915159, 133952, -1254814, 1408502, 2035596, 1028165, 1784879, 144826, 1644751, 1804773, 2564575, 440638, 3210925, 185971, 1647488, 2087944, 953039, 13877, 1971059, -596221, -1037124, 1589452, 2107035, 2021531, 892181, -652760, 1875672, 1355304, 1150362, 237400, -1668628, 943888, 1131979, -274405, 75675, 336333, 220905, 161261, 943793, 607044, 3167478, 1425560, 976837, 1897621, 2457648, 1377932, -496122, 1093084, 878169, 507040, 2043829, 667420, -882473, 1460966, 772037, 537927, 2421253, 1420412, -212622, 1057992, 1928096, 2633684, 352439, 753181]
5699G53181P29489h81057E08621M91124K33671J441282f58698B300032j15430
5690B184602j019401e22883O5715G6230J304126Q78160j45091l26188B66415K245707
5680B512122A118995j21802J033629G87183A84152o3053e41109I74512P74611
5671A749123M20264B59978J222588N49337a118359H24952g11698G45981l21733
5662D24248Q8879K321863A184327M32356P36322a77930B223305G72254a381739
5652A603929o65203k82512R50865E66575K88131b46973r14668c05417E09916K092235
5642B602151r93936f37279J54785A218611N64449E13258R21350i61710A32051
5632A412173F04875L7143j70690J613880H20812J296707B60097P19784a036896
$$ y = [753181, 1482670, -881057, 508621, 999745, 1233416, 2674698, -658698, 2300032, 2184602, 1165201, -522883, -457168, 76230, 1380356, 2258516, 2113425, 1787237, 266415, 2512122, 1118995, 997193, 2030822, 787183, 184152, 121099, -541109, 974512, 1749123, 2169387, 259978, 1482566, 2031903, -1118359, 824952, -711698, 745981, 424248, 513127, 2834990, 1184327, 1616683, 2353005, -177930, 2223305, 772254, -1381739, 1603929, 938726, 656214, 1607079, 566575, 854706, -246973, -1161641, -305417, 509916, 2602151, 1608215, -637279, -482494, 1218611, 1783060, 513258, 1434608, -961710, 132051, 1412173, 604875, 642018, 471328, 2085208, 820812, 2117519, 260097, 979881, -1036896]
5622B772717b38119A751496R82709a63344A151011A88994L8396f42731A167911
5612A372770b41942F4928J022667h20239A906478B34366J124009B01946J846570
5603B048516n85405h47079b48684B922126C76847K669504H23418a345497O27197
5594g18300H96046R2726K132884j043326A004791R35354f61113p30993E25536
5584A467229p15179J009602G86143p978J987742F18564K519294A189857B43418
5574A187750J428545E35219J147184D74194d4241A771581l01540C16056J047340
5565A363396k86774A81398J624912F16390J704429O6320b66174A850643a050614
5555E89853R67741e1025A274852A06941J697727L78163F33788k02445J94374K020616
$$ y = [2772717, -238119, 1751496, 2734205, -163344, 1151011, 188994, 227390, -642731, 1167911, 1372770, -241942, 64928, 1087595, -820239, 1906478, 234366, 1358375, 201946, 2048516, 1463111, -847079, -248684, 2922126, 376847, 3046351, 823418, -1345497, -718300, 896046, 988772, 3121656, 2078330, 1004791, 1940145, -661113, -1392106, 525536, 1467229, 752050, 1761652, 786143, 778165, 2765907, 618564, 3137858, 1189857, 243418, 1187750, 2616295, 535219, 1682403, 474194, -44241, 1771581, 1470041, 316056, 1363396, 1076622, 181398, 1806310, 616390, 2320819, 2387139, -266174, 1850643, -1050614, 589853, 1557594, -51025, 1274852, 106941, 1804668, 2182831, 633788, 431343, 625717, 2646333]
5545B646333r34180f728r02922G81672Q15729B40254M86453N14879K669116A087823
5534A643141e9325A493118O26773F56018K493344A162761C11138J655855j49719
5525A817274k56245m47605M3039n00228k45644M98427O90831A81219J317684K1112
5515A520015k888J96292k7475E43013J710386H14547K101858J297357D66626M25836
5505H92462J074216B47219K744904A237836D84472N31537e86419C416482E40838
5495a18330A761926c41281A281447J02369e13625B94664M38945g51092B63884
5485G28019J692100H94356a191570C76627f4351j50401B72106J690102G97389
5475A281999P3227l76295C96888J243245G35634i0385G52259K43594B87329J329305
$$ y = [2646333, 1712153, -6728, -909650, 781672, 1597401, 240254, 726707, 1241586, 3910702, 1087823, 1643141, -59325, 1493118, 2119891, 656018, 3149362, 1162761, 311138, 1966993, 1817274, 1561029, 1113424, 1156463, 656235, 410591, 909018, 1599849, 181219, 1498903, 1520015, 1517127, 1713419, 1685944, 543013, 2253399, 814547, 2916405, 4213762, 466626, 892462, 1966678, 247219, 2992123, 1237836, 484472, 1016009, -586419, 3416482, 540838, -118330, 1761926, -341281, 1281447, 1383816, -513625, 294664, 733609, -751092, 263884, 728019, 2420119, 894356, -1191570, 376627, -64351, -214752, 272106, 1962208, 797389, 1281999, 1355226, 978931, 396888, 1640133, 735634, -90385, 752259, 995853, 287329, 1616634]
5465A616634d07012A081367J39608J100392k45132b40622F43890O34327o27771
5456F50446L14083P92342M2428L57397f63798G80703K169290F75987J120005g45955
5445H05798Q33947c27620A933915B63502J521102o42321R12544l24014P54312
5436B485125D49104a04156D62402M67151Q89270H35493o3241a266340B194035
5426D86588J05226O42798O08754J254007r31504E24999P11536B31967J550359
5417A782326A80660J820592a96916A029002n6930J640925A079753K257055j251044
5408B085764l1030j08360G28715N94808F09840P4460K092760j247381j65020Q62879
5398B227538E9448i826A591813O44425C96024J560411o87835l01225b7038B547352
$$ y = [1616634, -407012, 1081367, 1220975, 2321367, 2076235, -240622, 643890, 1278217, 650446, 964529, 1756871, 1799299, 2156696, -663798, 780703, 2949993, 675987, 1795992, -745955, 805798, 1639745, -327620, 1933915, 263502, 1784604, 1142283, 2054827, 1730813, 2485125, 449104, -104156, 462402, 929553, 1818823, 835493, 772252, -1266340, 2194035, 486588, 591814, 1234612, 1843366, 3097373, 2165869, 524999, 1236535, 231967, 1782326, 180660, 2001252, -196916, 1029002, 972072, 2612997, 1079753, 3336808, 2085764, 2054734, 1946374, 728715, 1323523, 609840, 684300, 2777060, 1529679, 1364659, 2227538, 59448, -9826, 1591813, 2236238, 396024, 1956435, 1268600, 967375, -27038, 2547352]
5387H69198J475758g31549A884792D84073A57057J041455k9529R46507J001791
5378C117281r04920J41688k94974g8689B040655l3254p43772b24756B737250I54146
5367A620147a182077B136848r08611J250912P1202A241649l28319J868726J413178
5358D195234I86672J89041m36783K355405J86803D12716M04808K539469J595147
5349D952140A345361B24056L204280j069035j085090E65549K065356Q79342A287660
5339A911171I40627J425330j177047Q24418l55709E98507J808896G99021J150075
5330A949096C07852J408531J239896g44643C63753J973938A94489J936100p22740
5321A407849m55788M30953E41143i42654A596289J163269A129485J516152r04128
$$ y = [869198, 2344956, -731549, 1884792, 484073, 157057, 1198512, 1168983, 2115490, 3117281, 2212361, 2354049, 2059075, -78689, 2040655, 2007401, 1263629, -224756, 2737250, 954146, 1620147, -1182077, 2136848, 1228237, 2479149, 2550351, 1241649, 913330, 2782056, 4195234, 986672, 1175713, 738930, 3094335, 3281138, 412716, 817524, 3356993, 4952140, 1345361, 224056, 3428336, 2359301, 1274211, 565549, 2630905, 3510247, 1287660, 1911171, 940627, 2365957, 1188910, 2013328, 1657619, 598507, 2407403, 799021, 1949096, 307852, 1716383, 2956279, -744643, 363753, 2337691, 194489, 2130589, 1407849, 952061, 1383014, 541143, -942654, 1596289, 2759558, 1129485, 2645637, 1741509]
5312A741509h19294B051710r93619j58925J549656B24776J756995M09934k37263
5303B154442H385c16387A428569C07367I1097J00550J047246r404O34593d29140
5292B716444j221800j41213L482132A297469J31027j26540n45933J114306J025573
5283B895902G42443J258028N21998C42230a57625C510124A273482R84642l13515
5274A944609M55232E56352J989386A142520N9424J351222b31744C035500q88214
5265B147286L93284D11532J911820j13840e9673B618307A306982J817735G88787
5255A982752p05933j22201J796812A221220K856412j408753A109814l18931J446391
5246B237274l78153K99244j88109r42059N91896F44883O15924L55820M82960A21165
$$ y = [1741509, -819294, 2051710, 1058091, 899166, 2448822, 224776, 1981771, 2391705, 2154442, 8385, -316387, 1428569, 307367, 91097, 191647, 1238893, 1229489, 1864082, -429140, 2716444, 1494644, 1353431, 4835563, 1297469, 1428496, 1301956, 756023, 1870329, 2895902, 742443, 2000471, 2522469, 342230, -157625, 3510124, 1273482, 2258124, 1944609, 2399841, 556352, 2545738, 1142520, 1201944, 2553166, -231744, 3035500, 2147286, 2540570, 411532, 2323352, 2209512, -59673, 2618307, 1306982, 3124717, 788787, 1982752, 1276819, 1154618, 2951430, 1221220, 4077632, 2668879, 1109814, 790883, 2237274, 1859121, 2158365, 1970256, 1028197, 1620093, 644883, 1260807, 1616627, 2099587, 121165]
5235G51126m7788a027992I03512J297305m9846F79560L79379J879013r83267m09843
5225A544842J474824E95936J982292J218969e15852A490232o74608L139178E45710
5215A335833J721007A047096K191392j298309p12633j76797J934836E66044L5141
5206F01185J415338F12057K044871j029084F7449K993315q33415M009d0100H05749
5195C292313A528931J564511j486253K25778K92279P70545j365280J698854A569550
5185B40855L165803P17358A808340K105915A271667J820665A233497K442808A291776
5175D382226A006438J066101J032203j095106K1107J535432A190984L32322K288740
5166C812046j373717D29446M75274K486238j263329K70265J301108j528474I44164
$$ y = [751126, 703338, -1027992, 903512, 2200817, 2150971, 679560, 1058939, 2937952, 1954685, 1544842, 3019666, 595936, 2578228, 3797197, -515852, 1490232, 815624, 3954802, 545710, 1335833, 3056840, 1047096, 3238488, 1940179, 1227546, 1050749, 2985585, 566044, 601185, 2016523, 612057, 2656928, 1627844, 67449, 3060764, 2227349, 2231358, -40100, 805749, 3292313, 1528931, 3093442, 1607189, 1832967, 2125246, 2895791, 1530511, 3229365, 1569550, 240855, 3406658, 4124016, 1808340, 3914255, 1271667, 3092332, 1233497, 3676305, 1291776, 4382226, 1006438, 2072539, 3104742, 2009636, 2030743, 3566175, 1190984, 1523306, 3812046, 2438329, 429446, 904720, 3390958, 2127629, 2397894, 3699002, 2170528, 944164]
5156A303217M92596L531061k617637A050735K7091B42871J240972j83706L77482
5147A677619q13476P14842g8970A155159M98268k85243K44272l80324J37848K61959
5137A631939k94627K36918R84936j049153l5808L34601e58519A791117e59246
5127B558607N4257p42557a60314C86783d21026A219538m82708r634A35384K158995
5117B294379p48650Q79564A192252Q8608j71772J218694k21685n19942J521560
5108C107715r63538F70391l19354i46768B424121A90553J286082e04290A085437
5098A559975q1888K430075D01935L32829K036356m45293r38934n15179C62474
5088B281383n25543l24198P15816E48786J23371K33686A71298R01534k90780L82308
$$ y = [1303217, 1795813, 5326874, 2709237, 1050735, 1077826, 242871, 1483843, 1300137, 1677619, 864143, 1578985, -78970, 1155159, 1653427, 1368184, 1612456, 1232132, 1369980, 1631939, 1337312, 1574230, 2559166, 1510013, 1474205, 1808806, -558519, 1791117, -559246, 2558607, 2612864, 1870307, -160314, 386783, -421026, 1219538, 736830, 727196, 135384, 2294379, 1545729, 2425293, 1192252, 1280860, 1109088, 2327782, 2106097, 1586155, 3107715, 2144177, 670391, 351037, -946768, 2424121, 190553, 1476635, -504290, 1085437, 1559975, 1478087, 3908162, 401935, 734764, 2771120, 2325827, 1386893, 871714, 362474, 2281383, 1755840, 1431642, 2147458, 548786, 672157, 905843, 171298, 1072832, 782052, 1164360]
5078A164360B72898R40217J754808A188245P71721H98166N6151l27069J57326
5069G84574J064690J68595p48966j38430J195845j063186K02032O32284j77270
5060A920168E64247k6580J1638J007683k59412a064982A953936q53822P8801O86650
5050A865565A63534J939970J884310A023629O50457p31433J058477O99466j172483
5041A528113G64003Q28136m62884r7102J812921A391279P53326l75434b13360
5031B715890G28274h64081B027172H38419J985868j288858j64812P64858m16041
5022A719434O3200m18650J476775q74128L73128o33516P05564J781654g71190
5012B443667J74279J79320j235894J099021O1296j285825E54784K001524C59204
$$ y = [1164360, 272898, 1213115, 2967923, 1188245, 1959966, 898166, 954317, 627248, 784574, 1849264, 2017859, 1268893, 1130463, 2326308, 1263122, 1465154, 2097438, 1920168, 564247, 537667, 549305, 1556988, 1297576, -1064982, 1953936, 1100114, 1178915, 1865565, 163534, 2103504, 3987814, 1023629, 1674086, 942653, 2001130, 2700596, 1528113, 764003, 1592139, 1129255, 1032153, 2845074, 1391279, 2144605, 1769171, -213360, 2715890, 728274, -864081, 2027172, 838419, 2824287, 1535429, 1370617, 2135475, 1719434, 1782634, 1363984, 2840759, 1966631, 2339759, 1706243, 2411807, 4193461, -771190, 2443667, 2617946, 2797266, 1561372, 2660393, 2721689, 1435864, 554784, 2556308, 359204]
5002A216084m83329J345483K44413l37539n83389K59968n21121Q27815q78417
4993A089968J366524j62126a9360I45717O30646F52652K303608B20527K163905
4984B384432j74199J07591I20894K848167j502055O14798r84407H34146e59215
4974I14539i5039H49414O20565J303987I03222J486445F85380O48741A82097J413740
4964A595837K180877j359988G49842J564495J262300j773341C12229n9881K07211
4955D59559J298534O05777R46618k80289A334139J558055E13267K339706L40393
4946C193366A570689J09456p74547M77934K92683G54586B11670O06997k4421O05186
4936A399432K000214A616929k13502j54236m67258J504855n58644K301247j372220
$$ y = [1216084, 732755, 2078238, 2322651, 1985112, 1401723, 1661691, 1140570, 1968385, 1089968, 2456492, 2294366, -19360, 945717, 1576363, 652652, 2956260, 220527, 2384432, 2210233, 2317824, 920894, 3769061, 2267006, 2881804, 1897397, 834146, -559215, 914539, -95039, 849414, 1469979, 2773966, 903222, 2389667, 685380, 1334121, 182097, 1595837, 3776714, 2416726, 749842, 2314337, 3576637, 1803296, 312229, 252348, 459559, 1758093, 2363870, 3310488, 3030199, 1334139, 2892194, 513267, 2852973, 3193366, 1570689, 1680145, 905598, 1383532, 1676215, 754586, 211670, 818667, 794246, 1399432, 3399646, 1616929, 1403427, 1249191, 781933, 2286788, 1728144, 4029391, 2657171]
4927B657171M47967k22603J65928J390100J17461n59650J111799l65733r00929
4918C841511r65589k15818O39586H04932J463001q57841C21812K532279a786181
4908A687945M99815J150259A580123J078471o7055a424192F35569J856777j68213
4899B324133J0343n12578L83033R40085H30706L56058N91443J01854H90342A55624
4888A272601Q97841J200816o3258j176219p1313k53530Q27311o99118J713485
4879C648616A533288H7128J832266R09367j46662A152047R58189J219324j387365
4870A942195J059722j446087J313211H91449O6591J134984J211161j310782J360990
4861C354393j545058P77066j66433m77620J251106j467422a405495F85871J083837
$$ y = [2657171, 3105138, 2882535, 3048463, 4438563, 4556024, 3996374, 5108173, 4742440, 3841511, 2875922, 2660104, 3299690, 804932, 2267933, 1410092, 321812, 2854091, -1786181, 1687945, 2187760, 3338019, 1580123, 2658594, 2591539, -1424192, 635569, 2492346, 2324133, 2334476, 1821898, 2204931, 3145016, 830706, 1186764, 1778207, 1880061, 890342, 155624, 1272601, 2170442, 3371258, 3308000, 2131781, 2060468, 1806938, 2634249, 1935131, 3648616, 1533288, 87128, 1919394, 2828761, 2682099, 1152047, 2110236, 3329560, 1942195, 3001917, 1555830, 2869041, 891449, 958040, 2093024, 3304185, 1993403, 3354393, 1809335, 2586401, 2419968, 1942348, 3193454, 1726032, -1405495, 685871, 1769708]
4852A769708O41879k00261B34739J804893I47531R79900A36597L072415p80180
4843B428832J187160j106990k41q95434J093908n88038J132686r12797n12852
4834A826234J114622j023731J149937p31770J74925H62012J231367J686915j244917
4825B535377A240996Q71053J346779A425941R55536J054239A103609P49357K533548
4816D386514o33919j870066o59764J322884D54239K025955I30354J484952P8659
4807B493965n18719L82821p38166N84367J163094b014B759055j79494A150047
4797B411004J630042j196292o81215m15994K022683A167896R77478m89488L758869
4788E414755A515443J594797Q99546A876531J225532j431592J133855P09846n37084
$$ y = [1769708, 2411587, 2211326, 234739, 2039632, 947531, 1927431, 136597, 3209012, 2428832, 3615992, 2509002, 2508761, 1613327, 2707235, 2119197, 3251883, 2339086, 1826234, 2940856, 1917125, 3067062, 2335292, 2510217, 862012, 2093379, 3780294, 2535377, 1240996, 2112049, 3458828, 1425941, 2381477, 3435716, 1103609, 1852966, 4386514, 3752595, 1882529, 1222765, 2545649, 454239, 2480194, 930354, 2415306, 2493965, 1975246, 2358067, 1619901, 2204268, 3367362, -2014, 2759055, 2579561, 1150047, 2411004, 4041046, 2844754, 2163539, 1747545, 3770228, 1167896, 2145374, 1655886, 5414755, 1515443, 3110240, 4009786, 1876531, 3102063, 1670471, 2804326, 3514172, 2977088]
4779B977088K17623j46187q20828J465388j02840l74594C36047J578573K728463
4770D643083B091557k4722H82649J010973J97329I98928J01044J907369A186059
4760C601086r89257k08334j77067a31213A265792J084467J624730c44902B266941
4750A865069O3718Q7463l48522R86383D28022J665857P41894I04135J964916O50998
4740C520049H95579N95391J16270R80385R00778o24235r73857l33837J741456
4731C297930E01663L000076F16305K146999A270119E28872J811480J040152A461080
4721A775570E68642J165875O71970I03763J100639J377760A145531k63224K85937
4712A168244K803660j863679A017052R41114K215411j911851J266788j593514
$$ y = [2977088, 3194711, 3048524, 2227696, 3693084, 3590244, 3215650, 336047, 1914620, 4643083, 2091557, 2066835, 882649, 1893622, 2090951, 998928, 1099972, 3007341, 1186059, 3601086, 2611829, 2403495, 2226428, -131213, 1265792, 2350259, 3974989, -344902, 2266941, 1865069, 1928787, 2016250, 1667728, 2654111, 428022, 2093879, 2835773, 904135, 2869051, 3520049, 895579, 1490970, 1607240, 2587625, 3488403, 2864168, 1890311, 1556474, 3297930, 501663, 3501739, 616305, 2763304, 1270119, 528872, 2340352, 3380504, 1461080, 1775570, 568642, 1734517, 2406487, 903763, 2004402, 3382162, 1145531, 882307, 1168244, 3971904, 2108225, 1017052, 1958166, 4173577, 2261726, 3528514, 1935000]
4704A935000J286026j262100N48103r80746P75157J104675A226952J251721J013845
4695C492518n77560k70186l95805R74975L31890K401103B555687P19859K840259
4686F115805P68940J012260j060452j434773L162982Q84130k524124j264468m38874
4677E221426o36775k1375n70802r84692j40101A243256J983973j592161o03716
4668A031352K48677K68129c8193C114814k15194A023137R47433n58128L489055
4659D901497j234598A172286n72193o3135L38375J657713A016983K340614j678672
4650A678925A35241J494894M94318l53183D82010J694370J042178N15221m48012
4641C285767E126L351738j289392K28082K79608A031901f3336B081727J385107
$$ y = [1935000, 3221026, 1958926, 2507029, 1526283, 2301440, 3406115, 1226952, 2478673, 3492518, 2914958, 2644772, 2248967, 3223942, 3555832, 5956935, 2555687, 3275546, 6115805, 6884745, 7897005, 6836553, 5401780, 8564762, 9448892, 6924768, 5660300, 5221426, 4584651, 4563276, 3992474, 3007782, 2867681, 1243256, 3227229, 1635068, 1031352, 1280029, 1548158, -38193, 3114814, 2899620, 1023137, 1970570, 1412442, 4901497, 3666899, 1172286, 600093, 536958, 875333, 2533046, 1016983, 3357597, 1678925, 135241, 1630135, 2124453, 1771270, 482010, 2176380, 3218558, 3733779, 3285767, 5126, 3356864, 2067472, 2295554, 2575162, 1031901, -63336, 2081727, 3466834]
4632C466834j537591N00889M63726M35106D31216L578948r79601j217755O52228
4623B465036l55246L304509B604730r35282R18722q59470J474003o78581N28341
4614C052463K5878M42809n35574J631523A917036J461571j148870Q9291n69860
4605A749168J321909R88649m78842o06970N46732q62585J933214l04065A932839
4595C291804q90451J817244k94678j047871j349834L095423j805711o36742K029832
4586D209016j952542J428433P63443B114530L4491J166463J73464I83263K836758
4577C820021q22078L98056I50412J923390K21119j68643m50082O41042I70497
4567C119771j129322r93235P94818J108032q85404J001606o80794A164328J607470
$$ y = [3466834, 1929243, 2430132, 2893858, 3328964, 431216, 4010164, 3030563, 1812808, 2465036, 2109790, 5414299, 2604730, 1669448, 2588170, 1728700, 3202703, 2524122, 3052463, 3078341, 3521150, 2985576, 4617099, 1917036, 3378607, 2229737, 2319028, 1749168, 3071077, 4059726, 3580884, 2973914, 3520646, 2658061, 4591275, 4287210, 1932839, 3291804, 2401353, 4218597, 3923919, 2876048, 1526214, 4621637, 2815926, 2179184, 4209016, 2256474, 3684907, 4448350, 2114530, 2149021, 3315484, 3488948, 983263, 3820021, 2997943, 3395999, 950412, 2873802, 3094921, 2926278, 2476196, 3117238, 970497, 3119771, 1990449, 997214, 1792032, 2900064, 2014660, 3016266, 2335472, 1164328, 2771798]
4558B771798A030466L73286m85111Q11085K93275M60765k34724G52166J134269
4549A886435n19204J197443d32897B134519O18509h68953B922377r00606J315224
4540C336995k40337c6060B532534L27901k21305P99036j163738q88091J310100
4531B696437J273685j258444J277839j164769l21632J871086j179088A012994
4522D817680B159393l2309L057478B299318l4496F65754k48150K697589m47730
4513B667463j144584R56025j54453P18975Q34969o53725R53766r52122J480440
4504D706754l90232j320288O120A294492K403848O99442B120973L32050q7464
4495B365559q10492K307940j541537J130906J046868B139483L375980B372664
$$ y = [2771798, 1030466, 1403752, 918641, 1729726, 2023001, 2483766, 2249042, 752166, 1886435, 1367231, 2564674, -432897, 2134519, 2753028, -868953, 2922377, 2021771, 3336995, 3096658, -36060, 2532534, 2860435, 2639130, 3438166, 2274428, 1386337, 2696437, 3970122, 2711678, 3989517, 2824748, 2503116, 4374202, 3195114, 1012994, 4817680, 2159393, 2127084, 5184562, 2299318, 2264822, 665754, 417604, 3115193, 2667463, 1522879, 2478904, 2324451, 3043426, 3878395, 3224670, 4178436, 3226314, 4706754, 4316522, 2996234, 3002354, 1294492, 3698340, 4397782, 2120973, 2453023, 2365559, 1555067, 3863007, 2321470, 3452376, 4499244, 2139483, 5515463, 2372664]
4486C021770o64637J183498k24030K446863A907260Q98223r21638Q68507L69802
4477C122154M68494N76852A634213J848529j32905k8007j575915K558082F94802
4467C947312J717679k718923j60985R66619j739138J4728O83668J13400o93762
4458B130598K278579A193608M84843H2739J859382n90989K423901j266262J713176
4449D221947f08632B972014G74641K688314l12093m61638j59343O41098j240930
4440A930049K578155l01546B048409J435377L40947j830380J270306P28926j45028
4431C848557j05639K31799j063387J985225J611791j320189j84813P61291l03399
4422E461236P24950l069965J153141K4493j39663O94929m64662L13242r13500
$$ y = [3021770, 2357133, 3540631, 3316601, 5763464, 1907260, 2805483, 1883845, 2752352, 3122154, 3590648, 4167500, 1634213, 3482742, 3349837, 3321830, 1745915, 4303997, 694802, 3947312, 5664991, 2946068, 2785083, 3751702, 2012564, 2027292, 2710960, 2824360, 2130598, 4409177, 1193608, 1678451, 82739, 1942121, 1351132, 3775033, 2508771, 4221947, -608632, 2972014, 774641, 3462955, 3150862, 2689224, 2529881, 3170979, 1930049, 4508204, 4206658, 2048409, 3483786, 3824733, 1994353, 3264659, 3993585, 3848557, 3742918, 3974717, 2911330, 4896555, 6508346, 5188157, 5003344, 5764635, 5461236, 6186186, 3116221, 4269362, 4293855, 4154192, 4849121, 4384459, 4697701, 3784201]
4413C784201M11158m13713J15694O59407k106345R22921q54538K052505j149098
4404C422192r34918o66472K378073n7892K09142B157441l96342J55153K872618
4395D788870O9913A703150O54989M05783J170336o03459n40923K107596N1252
4386D948724m15665P84650j370128p52977Q87637B006868J937385j311789K650888
4377E283352J248114j966769J289188k465665K348447o28491r08933J562322q75242
4368D886323j621374j114511P51753J809439k237299m33129J700545j618290J682329
4359C805786j674752M07127K403093j436037q30100K3309A309701J791143L71548
4350C472392j168408K950493B495486J089938j682005L010579j948155P87386
$$ y = [3784201, 4195359, 3781646, 3897340, 4556747, 2450402, 3373323, 2518785, 4571290, 3422192, 2487274, 1820802, 4198875, 4140983, 4350125, 2157441, 1761099, 1916252, 4788870, 4858783, 1703150, 2358139, 2763922, 3934258, 3330799, 2789876, 4897472, 4948724, 4533059, 5317709, 3947581, 3194604, 4082241, 2006868, 3944253, 2632464, 5283352, 6531466, 4564697, 5853885, 3388220, 5736667, 5108176, 4199243, 5761565, 4886323, 3264949, 2150438, 2902191, 4711630, 2474331, 2041202, 3741747, 2123457, 3805786, 2131034, 2538161, 4941254, 3505217, 2675117, 2698426, 1309701, 3100844, 3472392, 2303984, 5254477, 2495486, 3585424, 1903419, 4913998, 2965843, 3753229]
4342C753229L77899j339935m80516o09604J1806K325460N65645j374301r07015
4333B322668J156803n13500K527119j076248k002488j078092L575035p99562j194851
4324B916884L81307j066118J750438A555534K214560p47549J826713j650250M48061
4315C647069R52713J7098j170273K930225B684403K890390j652904k25938J128338
4306D824289J028936k813137q28755J65158O40330J862782k281711M39582L369
4297C040843K780228k85117j884613o01027K3416J638966K306817m71508l225415
4288C322590J492227O48722j053763j270523k21185K693710K21270q26225k213083
4279B793740K851261O99581j993057l54024q42269J025270j212842K704850j144414
$$ y = [3753229, 4131128, 2791193, 2310677, 1701073, 1712879, 4038339, 4603984, 3229683, 2322668, 3479471, 2965971, 5493090, 4416842, 2414354, 1336262, 4911297, 4111735, 2916884, 3298191, 2232073, 3982511, 1555534, 3770094, 3022545, 4849258, 3199008, 3647069, 4599782, 4616880, 3446607, 6376832, 2684403, 5574793, 3921889, 3695951, 4824289, 5853225, 3040088, 2211333, 2376491, 3016821, 4879603, 2597892, 3037474, 3040843, 5821071, 5535954, 3651341, 3050314, 3073730, 4712696, 7019513, 6548005, 3322590, 4814817, 5463539, 4409776, 3139253, 2918068, 5611778, 5833048, 5006823, 2793740, 5645001, 6344582, 4351525, 3997501, 3155232, 4180502, 2967660, 5672510, 4528096]
4270D528096j107805O37092M69145r60638L2917K05454k75755m18258Q71978m91866
4260C490360M79842r04074L153119C025391J202957j856907J693095j897263J997911
4251D165184P70292j934742j85444m79102K369485B162041l10570K369545l32964
4242C888052A338626J718058j049699M004431B990968j38632J180033J6510R47528
4233D996407k137333L0915A156793K881714M63079N98818j178633O60939k56579
4224D326131J771708B662045K959533j432016J38923J318744j950019M60129p80569
4215C376770J110008J2903j747285J347340q63968k68491J258221M84898l62298
4206D348098A061951K407691r79358J731036r28737O03772j177000m18495J111379
$$ y = [4528096, 3420291, 4057383, 4526528, 3565890, 3598807, 3804261, 3528506, 3110248, 3982226, 3490360, 3970202, 3066128, 6219247, 3025391, 4228348, 2371441, 4064536, 2167273, 4165184, 4935476, 3000734, 2815290, 2336188, 4705673, 2162041, 1851471, 4221016, 3888052, 1338626, 3056684, 2006985, 6011416, 2990968, 2852336, 4032369, 4048879, 4996407, 2859074, 2889989, 1156793, 4038507, 4501586, 5100404, 3921771, 4582710, 4326131, 6097839, 2662045, 5621578, 4189562, 4328485, 5647229, 3697210, 4157339, 3376770, 4486778, 4499681, 2752396, 4099736, 3235768, 2967277, 4225498, 4710396, 4348098, 1061951, 3469642, 2490284, 4221320, 3292583, 3896355, 2719355, 2300860, 3412239]
4197C412239J739276j707813N62513j816314K335903j605256l40383O47029J441492
4188D668686J11169k366884L756428B054098K931844A684020J431429n31578N55936
4179C139807m0023R33921J15651R1418o83274J350910q81081J732018K6345p69218
4169E016474j196734j96593J627167m15860J090083O2592L79372j266556k365974
4160B733971L882613k520188k045779J467711l20141J115405A456702K353276
4152C809978J848247p76940k253580L15498L111001k280701m35126M9122m71950
4143B915549j353411P79851J964396O7857o91252J134005o91444o98365k98804
4134C128382l03824r47156J213419p82883K466943A732289L018048q12237O76397
$$ y = [3412239, 5151515, 3443702, 4006215, 2189901, 4525804, 2920548, 2580165, 3227194, 4668686, 4779855, 2412971, 6169399, 2054098, 4985942, 1684020, 3115449, 2583871, 3139807, 3099784, 4033705, 4149356, 4240774, 3557500, 4908410, 4027329, 5759347, 5785692, 5016474, 3819740, 3623147, 5250314, 4834454, 5924537, 5987129, 6366501, 5099945, 2733971, 6616584, 4096396, 2050617, 3518328, 3198187, 4313592, 1456702, 3809978, 5658225, 4881285, 2627705, 2943203, 6054204, 3773503, 3338377, 3387499, 2915549, 1562138, 2341989, 4306385, 4374242, 3682990, 4816995, 4125551, 3427186, 3128382, 2824558, 1877402, 3090821, 2307938, 4774881, 1732289, 4750337, 3938100, 4614497]
4125D614497L06442j345016O85798Q12843l15891j226402J723002j518524J091443
4116D828192N59236m09518q89325j478080P08323n44605O00191K0332R6845j037386
4106B454205j37578J965554m61460O8190j237841j034164K653421l34130A202300
4096E364901Q808530C179640J768780j640355J192494j609294j377319k26299
4088A287647J729021J692930j19122q91797O1780q25644O45426j499548J538415
4079C619108J081932k12281j787355K646963j062232j728223k56071K445481j900473
4070B846849J604550r05875j435815R65815n56075j094802J763279J671584o23681
4061D235829j004869l14366j3788M45692n18464K33744J93765p93162K467935
$$ y = [4614497, 4920939, 3575923, 4261721, 5074564, 4758673, 3532271, 5255273, 3736749, 4828192, 5387428, 4977910, 4088585, 2610505, 3318828, 2774223, 3374414, 3394746, 3491591, 2454205, 2316627, 4282181, 3820721, 3888911, 2651070, 1616906, 4270327, 3936197, 1202300, 5364901, 14173431, 3179640, 4948420, 3308065, 4500559, 2891265, 1513946, 1287647, 3016668, 4709598, 4590476, 3698679, 3760459, 2934815, 3580241, 2080693, 3619108, 4701040, 4488759, 2701404, 5348367, 4286135, 2557912, 2301841, 4747322, 2846849, 4451399, 3545524, 2109709, 3075524, 2519449, 1424647, 3187926, 4859510, 4235829, 3230960, 2916594, 2902806, 3348498, 2830034, 3063778, 3257543, 2464381, 4932316]
4052D932316k62197N72751k096276K61865j008783K172053E30604M391623j133339
4043C788888j114438K249000j749740J426990j151238J173763B251522R92655
4035C244177P8517K46914F94759P10542K815448k026552L149125k181110J026450
4026D188662k24315m92776j48614K04851n66369m60807J83215R66896A138696
4016G13580L289834J72320N62108B321154j63877R48644l54817N07735P02433
4007C961272k3992j545377k13825k86558m104K018586l77614p74434J690388Q34149
3997E278491B022054L386250A707161J248933J80558M9722J327096M15580o94306
3988D234744j138508N68268J70186m75254j127122K893651j707976A648337L504646
$$ y = [4932316, 4670119, 5242870, 3146594, 3408459, 2399676, 4571729, 530604, 4922227, 3788888, 2674450, 4923450, 3173710, 4600700, 3449462, 4623225, 2251522, 3244177, 3322694, 3569608, 694759, 1405301, 4220749, 2194197, 5343322, 3162212, 4188662, 3964347, 3471571, 3322957, 3527808, 2961439, 2500632, 2683847, 3650743, 1138696, 713580, 4003414, 4175734, 4737842, 2321154, 2157277, 3105921, 2751104, 3258839, 3961272, 3937280, 2391903, 2178078, 1891520, 1887416, 3906002, 3528388, 2753954, 4444342, 5278491, 2022054, 5408304, 1707161, 2956094, 3136652, 3186374, 4513470, 4929050, 4234744, 3096236, 3664504, 3834690, 3359436, 2232314, 5125965, 3417989, 1648337, 5152983]
3979E152983o85684j682754L16995r85599J362335J690974j816650J110450j038521
3970C424529O55106m061o47321N26921m57283A573614M310483k818099r90768
3961B075230Q71413J600264R88982k217163k64919K182237j504876J464046p22004
3952D473210k38815L8925r52143J421J219537r57298J435522K084694k361170
3943D743883J684408m99192M98576j289322J846743O09950j654107j19418J215950
3934G037471r25158j84525r44491Q92502j379593J123741Q10676C122145J742547
3925D864692j569340O51394l3962j269022J317871n75780J322714o91472r10685
3916C106410J135267K251490j429031R10893n97896K88924q55540O23039J32258
$$ y = [5152983, 4467299, 2784545, 3101540, 2115941, 3478276, 5169250, 3352600, 4463050, 3424529, 4079635, 4075574, 3428253, 3955174, 3497891, 1573614, 5884097, 3065998, 2075230, 2946643, 4546907, 5535889, 3318726, 3053807, 5236044, 3731168, 5195214, 4473210, 4234395, 4273320, 3321177, 3322598, 4542135, 3584837, 5020359, 7105053, 4743883, 6428291, 5929099, 6427675, 5138353, 6985096, 7595046, 5940939, 5821521, 7037471, 6112313, 5927788, 4983297, 5875799, 4496206, 5619947, 6430623, 3122145, 4864692, 3295352, 3946746, 3912784, 2643762, 3961633, 3385853, 4708567, 4017095, 3106410, 4241677, 6493167, 5064136, 5975029, 5377133, 5666057, 4810517, 5433556, 5565814]
3907E565814J89932k388305J534895l71648J722201k230111J269n18994m59150
3898C045903L22238K771289j558610l8379M77550j179102J233793j918632R01893
3889D057943p45264n06213r153K140421j693104p2164K69514N59668j407569J148692
3879C742771J369582j900739J326693J921226L32043j659647n62561P26762Q9980
3870E386110o929l74888r09037k72596J42295M05970n512N41441M01798N86940
3860E895592k99769j14987J852829j954442O08240J145217q99499p01142Q3468
3851E615507Q62047R57022j682647r14970o25827n46868q62858J594956L30721
3842D727083k037362J357309A836333J277196J062907j175058P43832O64067N89362
$$ y = [5565814, 5755746, 3367441, 4902336, 4530688, 6252889, 4022778, 4024047, 3505053, 3045903, 3368141, 6139430, 4580820, 4542441, 5019991, 3840889, 5074682, 3156050, 4057943, 3312679, 2806466, 2797313, 4937734, 3244630, 3172466, 3441980, 4001648, 2594079, 3742771, 5112353, 3211614, 4538307, 6459533, 6791576, 5131929, 4569368, 5296130, 5386110, 5379181, 5004293, 4095256, 3822660, 3964955, 4370925, 4365413, 4906854, 5308652, 5895592, 5595823, 5480836, 7333665, 5379223, 5987463, 7132680, 6233181, 5532039, 5615507, 6477554, 7434576, 5751929, 4836959, 4211132, 3664264, 2801406, 4396362, 4727083, 2689721, 4047030, 1836333, 3113529, 4176436, 3001378, 3745210, 4409277, 4998639]
3833D998639j902792J103478n22894L13739J22318k38771J293049j226210j515089
3824B425467K367403n80283j066074J283924o9898p73882J563938j270389K436159
3815F316365j182495L054081C377344J197385k254338J991648l11723K60981J889107
3806F150404k329769K96985j265338H24923M664384k077521K104696j518917K056472
3797F054037k680675J016094j808794K588172j787225L28358L66965J244284B246957
3787C200673N16529m76231m34977K54721J500940A972634J801748n78678p01773
3778B493931K797498J95109j136839n75543R13623M495M00591J32851p68994r96905
3768C459817K862448k102267O60493q62483M080547l747685M86375L22509J105961
$$ y = [4998639, 3095847, 4199325, 3676431, 3990170, 4112488, 3873717, 5166766, 3940556, 2425467, 4792870, 4212587, 3146513, 4430437, 4360539, 3586657, 5150595, 3880206, 6316365, 5133870, 8187951, 3377344, 4574729, 2320391, 4312039, 4000316, 4261297, 6150404, 3820635, 4117620, 2852282, 824923, 5489307, 3411786, 5516482, 3997565, 6054037, 3373362, 4389456, 2580662, 5168834, 3381609, 3709967, 4076932, 5321216, 2246957, 3200673, 3717202, 3240971, 2805994, 3060715, 4561655, 1972634, 3774382, 3195704, 2493931, 5291429, 5486538, 4349699, 3774156, 4687779, 4692274, 5092865, 5225716, 4456722, 3459817, 6322265, 4219998, 4880491, 4018008, 8098555, 4350870, 4837245, 5159754, 6265715]
3759F265715N00359j136687J014214M20140k058108Q33741j862048q96371K59404
3750C340359K315072j977020L73031K55530N32979q83245q63804K166982j717659
3741C542225P46646l36284K243993n30786B454727K356915J585788j964516L29932
3732D762846A280398M390424j999628j74521K425957K98542l034955K136073j845280
3723C477010K211955j756103A737886K901469o62522J067830A931982L811208
3715E743190j837483j32134J954762o17469o74808Q29433j034601l79583J998075
3706E849382n93908k448630L381213o20231j624653j26008N38396O65041P53591
3697E774193j990923J010463N91296o9904m51904k153486M238257l251797J568597
$$ y = [6265715, 6766074, 5629387, 6643601, 7063741, 5005633, 5839374, 3977326, 3080955, 3340359, 5655431, 3678411, 4051442, 4306972, 4839951, 3956706, 3092902, 5259884, 3542225, 4288871, 3952587, 6196580, 5665794, 2454727, 4811642, 6397430, 4432914, 4762846, 1280398, 5670822, 3671194, 3496673, 5922630, 6221172, 3186217, 5322290, 3477010, 5688965, 3932862, 1737886, 4639355, 3976833, 5044663, 1931982, 5743190, 3905707, 3773573, 5728335, 5110866, 4436058, 5265491, 4230890, 3851307, 5849382, 5255474, 2806844, 6188057, 5567826, 3943173, 3817165, 4355561, 5020602, 5774193, 3783270, 4793733, 5385029, 5315125, 4863221, 2709735, 6947992, 3696195, 5264792]
3688E264792j299974j795998L272602m49999r1871o28852O8574j39826p87012
3679C412436O10437l18264J395931Q79101j449907r57241K447804j740887L195677
3670G475087j540632k808590L218272o72644k222958K40385K187954j765097m14840
3661C696937K640228B643089R61977J274308K498629C680458J456990m63675J609802
3652F283575k171121J959902j591200j255687O80550n89686M307129l516134N02561
3643D609889k057J46771n59469j024923J987781r33362K513307J19076C385684
3633D624885J64039J392681j647058R53606j675635P35717J092312P80083k745430
3624C675200K121405N98239p68567r1591P45737j85413j755109m05033O32912
$$ y = [5264792, 3964818, 2168820, 5441422, 4991423, 4899552, 4270700, 4339274, 4199448, 3412436, 4022873, 3704609, 5100540, 5979641, 4529734, 3572493, 6020297, 4279410, 7475087, 5934455, 3125865, 6344137, 5671493, 3448535, 3688920, 5876874, 4111777, 3696937, 6337165, 2643089, 3605066, 4879374, 7378003, 3680458, 5137448, 4673773, 6283575, 4112454, 6072356, 4481156, 3225469, 3906019, 3316333, 7623462, 4107328, 4609889, 4607832, 4754603, 4195134, 3170211, 5157992, 4224630, 6737937, 6857013, 3385684, 4624885, 4788924, 6181605, 4534547, 5488153, 3812518, 4548235, 5640547, 6420630, 3675200, 5796605, 6394844, 5626277, 5534686, 6280423, 6095010, 4339901, 3934868, 4567780]
3615D567780J38831k06003P68501j555791K542715B968093L473834o17943j9004
3606E804980k370304K984879k16752K071867r76663j409985j68582R58716j284463
3597E393693J347511J659207j865743K167972l250759J735310p37028N47189m72012
3588F525340K224811k487490J841423j337802N27842K860291j810999j904964
3580F438452K008519O7970k49541R18334o8284J437826k597346K506417k890419
3571G571928L444677p74161j586400p97059K270924K2943K01627l249516J889138
3562H994101J87205P32689M12596k134068M86674J78732m44183j963097L217480
3553I668129j173152r78643K696939q34923j365139J853182O69j674352J016972
$$ y = [4567780, 4706611, 4500608, 5269109, 3713318, 6256033, 2968093, 6441927, 5823984, 5804980, 3434676, 6419555, 6202803, 8274670, 7298007, 5888022, 5719440, 6678156, 5393693, 6741204, 8400411, 6534668, 8702640, 5451881, 7187191, 6450163, 6997352, 6525340, 8750151, 6262661, 8104084, 6766282, 7294124, 10154415, 8343416, 6438452, 8446971, 8514941, 8265400, 9183734, 9115450, 10553276, 7955930, 10462347, 7571928, 11016605, 10242444, 8656044, 7858985, 10129909, 10152852, 10354479, 7104963, 8994101, 9181306, 9913995, 10326591, 8192523, 8679197, 8857929, 8413746, 6450649, 9668129, 8494977, 7516334, 10213273, 9378350, 8013211, 9866393, 9867062, 8192710, 9209682]
3544I209682k781846J844134N66345r86897r91047k53946l34075J419467j082294
3535F609523J817606q64710m6245J16719L16976N35981j505709j525620J425634
3526F880155l45490j899226K781533J84945J162646l131296O7721J688557j355376
3517F034169j898800J186907K29338n11939J180200J262878J654764o3Q81846
3508A0019300j1406k22003P05985j411385P81167J402713J561646p77677j552799
3499A0495541J946041j562935O89716P04089J760896j629329J821274j211736
3491A3013557P8667r8858K591383q2572l34540O49131N18593o34200L611925j787098
3481A7525988J720368K972036k189178J910250J685378n99518q50036K699530
$$ y = [9209682, 6427836, 8271970, 8838315, 7851418, 6860371, 6606425, 6272350, 7691817, 6609523, 8427129, 7562419, 7516174, 7632893, 7949869, 8485850, 6980141, 5454521, 6880155, 6534665, 4635439, 7416972, 7601917, 8764563, 5633267, 5700988, 7389545, 6034169, 4135369, 5322276, 5551614, 5039675, 6219875, 7482753, 9137517, 9137454, 10019300, 10007894, 9785891, 10491876, 9080491, 9861658, 11264371, 12826017, 12048340, 10495541, 12441582, 10878647, 11568363, 12272452, 14033348, 12404019, 14225293, 13013557, 13092224, 12993366, 15584749, 15502177, 15167637, 15816768, 16335361, 15701161, 19313086, 17525988, 19246356, 22218392, 20029214, 21939464, 23624842, 23025324, 22175288, 24874818]
3473B4874818L06128j860906K969403p77613K710178j340538m02247K628486n31743
3464B8575966m74154n41715n17555j706594r80378J280844k925696R30380l46180
3455B3294918r17098j874640j739366j389108j449899N0835l45524K335816j122027
3446A6843907J324888K678923J82556J122284L50176J541346m095065j053577
3438A8895438m246161J011632j464540j113218k11331J628429j144804J375081
3430A4730526R34017k602160J869054l39688o19265J739549k885588R80801J467727
3421A5274973Q66742j800104j399379K917112L88009l28229r50208o02256L106170
3412A7472830J190582L10930J315888l216852P51433j978058L73013n04243L73430
$$ y = [24874818, 25180946, 23320040, 26289443, 25511830, 28222008, 26881470, 26479223, 29107709, 28575966, 28101812, 27560097, 27042542, 25335948, 24355570, 25636414, 22710718, 23641098, 23294918, 22377820, 20503180, 18763814, 17374706, 15924807, 15975642, 15630118, 17965934, 16843907, 18168795, 20847718, 21030274, 22152558, 22502734, 24044080, 19949015, 18895438, 14649277, 15660909, 14196369, 13083151, 12871820, 14500249, 13355445, 14730526, 15664543, 13062383, 14931437, 14591749, 13972484, 15712033, 12826445, 13807246, 15274973, 16141715, 14341611, 12942232, 15859344, 16247353, 15919124, 14968916, 14366660, 17472830, 18663412, 18974342, 20290230, 17073378, 17824811, 15846753, 16219766, 15715523, 16088953]
3403A6088953k95753O86993j511558J057912j312315K318198K153464P35436J308188
3394B1229518l227292M372727j593375M235068p25202O56810Q97526K541201j529161
3385B6857820K733832J733101q71096P49379M419565k657186K541714J850684
3377C7357813L15917M074951J010264M595348Q521592M664183M650924J603528
3369F6794520N16204l268204m9420j797040o720536o538272q045951o687872j511604
3360C2691825o913610j740204k015085r92386R06316k424356R65453k358947J481593
3351A9600599M97349l858863K473683o15344L61996k254497J046452l1843Q66020
3342A8085552j555604n33118Q63088m00214J567418l005639L399401r06230j072216
$$ y = [16088953, 15793200, 16480193, 14968635, 16026547, 14714232, 17032430, 19185894, 19921330, 21229518, 18002226, 22374953, 20781578, 25016646, 24291444, 24948254, 25845780, 28386981, 26857820, 29591652, 31324753, 30453657, 31203036, 35622601, 32965415, 35507129, 37357813, 37673730, 41748681, 42758945, 47354293, 55875885, 60540068, 65190992, 66794520, 67310724, 64042520, 63993100, 62196060, 55475524, 48937252, 40891301, 34203429, 32691825, 25778215, 24038011, 22022926, 21030540, 21936856, 19512500, 20477953, 18119006, 19600599, 20097948, 16239085, 18712768, 18097424, 18459420, 16204923, 17251375, 17219532, 18085552, 16529948, 15996830, 16859918, 16459704, 18027122, 15021483, 18420884, 17514654, 16442438]
3333A6442438n74490N387784k783497J404761P03310O70196L24772J32938k122550
3324A9585662P63690L424164J13614l22633J038929M40470J20754J418681o99809
3315B5883522Q92248J537876L163329q03158Q80512J625010Q71342K230161J612655
3306C7893497O22836L004592j265964N009247K027396N243957L051587J260956
3298E6848104M965556R65348M886700M141440J730071M966937K909776L093943
3290H4507875M441912O428008O271079M644920M736551Q683976N844856R806176
3282A35365353R339231J0837024J3506927J7221248J6973422N354528j7871519
3275A90726214k9097727l4304966l0440159j7766591j3463775r324396j770759
$$ y = [16442438, 15867948, 21255732, 18472235, 19876996, 20580306, 21250502, 21575274, 21708212, 19585662, 20349352, 23773516, 23887130, 23564497, 24603426, 25043896, 25164650, 26583331, 25883522, 26775770, 28313646, 31476975, 30673817, 31554329, 33179339, 34050681, 36280842, 37893497, 38516333, 41520925, 40254961, 45264208, 47291604, 52535561, 55587148, 56848104, 61813660, 62779008, 67665708, 71807148, 73537219, 78504156, 81413932, 84507875, 88949787, 95377795, 101648874, 106293794, 111030345, 119714321, 125559177, 135365353, 144704584, 155541608, 169048535, 186269783, 203243205, 208597733, 190726214, 161628487, 127323521, 96883362, 79116771, 65652996, 56328600, 54557841]
3268E4557841q531393j864807l309528k521936J542340q75456r48156l38256K782552
3259D0493201k091940K03768j544392k635004j311746L60882j887118K142502
3251C3730153j988439P98723j208635J292158r26578n81050L49400K073396R26494
3242C4465622J48643K10340K326136k405188J959244Q76160j195700M200124r83247
3233C9602134O69139K00132J254377k11401K557708J831636j875404K269948K436223
3224D8734492J675037J298791R54429L053744K240767L224141M41499M200352
3216F5823252K213168N207559N444032K049968M857920N696176L995503N414328
3208A00701906N025936P631360L827888P034791O695032R148680J4151839J3470111
$$ y = [54557841, 46026448, 44161641, 40852113, 38330177, 39872517, 38997061, 38048905, 37710649, 40493201, 38401261, 38605029, 37060637, 34425633, 33113887, 33474769, 31587651, 33730153, 31741714, 32540437, 31331802, 32623960, 31697382, 31116332, 31465732, 33539128, 34465622, 34614265, 34824605, 37150741, 34745553, 36704797, 37580957, 36385257, 40585381, 39602134, 40271273, 40471405, 41725782, 41514381, 44072089, 45903725, 44028321, 46298269, 48734492, 50409529, 51708320, 52662749, 55716493, 57957260, 61181401, 61622900, 65823252, 68036420, 73243979, 78688011, 80737979, 85595899, 91292075, 95287578, 100701906, 105727842, 113359202, 117187090, 124221881, 130916913, 140065593, 154217432, 167687543]
3200A67687543J4887744J9507583K0766830K3206607K6960735L1710815L8578814
3193C43306671M6316382O4201660Q6682716J11793019J54662457K20481269K90297586
3186A317741760L19378802K61243634J19500923j12465787l31230064l98535917
3180A175633351l37431791k36954294j59560472j03974555o8935933n1254925
3174B17521381l0411839k8059502j7994624j4722967j1652224j0046519q981968
3167I5651738p919471p325223n904993o440367n951836l163155l388693l872888
3159E1685112r20559m40952m615352m67052k568332j683288k621508j076004p22916
3150C6569149o2896j367368o04768N31816J767416l778741Q72173R83488j594454
$$ y = [167687543, 182575287, 202082870, 222849700, 246056307, 273017042, 304727857, 343306671, 389623053, 453824713, 540507429, 652300448, 806962905, 1027444174, 1317741760, 1637120562, 1898364196, 2017865119, 1905399332, 1574169268, 1175633351, 838201560, 601247266, 441686794, 337712239, 268776306, 217521381, 187109542, 159050040, 141055416, 126332449, 114680225, 104633706, 95651738, 87732267, 80407044, 74502051, 68061684, 62109848, 58946693, 55558000, 51685112, 50764553, 50323601, 45708249, 45241197, 42672865, 40989577, 38368069, 37292065, 36569149, 36506253, 35138885, 34534117, 35065933, 36833349, 33054608, 33926781, 34910269, 33315815]
3141C3315815k345013K903667l886004K522882j306483p6402j271210j98738K880003
3132C2538517P29910O58703k280929J897231R38246J093983k30079K994427J515976
3123C9855985J100356K049628K493616L481044L213036L572603L30108M709388
3115F0805764J297088J553528J018808K142908O173532N9400L115160K492023
3107G8658211L271568N47416N260136M842440L020647M862384K646136M874591
3099A07983529P379280O893640L425504K176640m485496j621159j419321j695975
3091A18636642j562265o360263j1349872j5051287j1826415j1279040n868200
3084E5339300m563519o459020j575080p85604k229688m581700J069104J244616
$$ y = [33315815, 30970802, 33874469, 29988465, 32511347, 31204864, 31128462, 29857252, 29658514, 32538517, 33268427, 33927130, 31646201, 33543432, 34481678, 35575661, 35345582, 38340009, 39855985, 40956341, 43005969, 45499585, 48980629, 52193665, 55766268, 56096376, 60805764, 62102852, 63656380, 64675188, 66818096, 72991628, 73051028, 76166188, 78658211, 81929779, 82477195, 87737331, 92579771, 95600418, 100462802, 103108938, 107983529, 115362809, 122256449, 125681953, 127858593, 123373097, 121751938, 120332617, 118636642, 117074377, 110714114, 99364242, 84312955, 72486540, 61207500, 55339300, 50775781, 44316761, 42741681, 41956077, 39726389, 35144689, 36213793, 37458409]
3076C7458409n281570J147148L02970l612378J020991j407152j142965J449193
3068B9934646j439626q41456j967148m96560j441895N58007J174248k383128R42542
3059B4039630k875178J208432P81350N95004n47230M46746j458002M44590J350324
3050B3985666j230632k269756J082847J747535n61490q36864K244466k256542
3042B1905230J731316j588274K052640j082864O93616J927376j050046j362012
3034B3226982Q72236J082714k99715N43411j025688r81132L360533R97445K788738
3025C0565524j251139k27416K255136l671531K539442J657566J060556J839919
3017C4768057J590821J770576K973767j762660M069328K851223L407089J148104
$$ y = [37458409, 32176839, 33323987, 33626957, 30014579, 31035570, 29628418, 28485453, 29934646, 28495020, 27653564, 25686416, 25189856, 23747961, 24305968, 25480216, 23097088, 24039630, 21164452, 22372884, 23154234, 23749238, 23202008, 23648754, 22190752, 22635342, 23985666, 22755034, 20485278, 21568125, 23315660, 22754170, 21917306, 24161772, 21905230, 23636546, 22048272, 24100912, 23018048, 23711664, 25639040, 24588994, 23226982, 24099218, 25181932, 24882217, 25425628, 24399940, 23418808, 26779341, 27776786, 30565524, 29314385, 29086969, 31342105, 27670574, 30210016, 31867582, 32928138, 34768057, 36358878, 38129454, 41103221, 39340561, 43409889, 46261112, 49668201, 50816305]
3009E0816305R113099O148556Q984364L781487K020936m906696k795056n496295
3001F7666700J219848j083088N87520O309935L802544k524136k248919n171792
2993F8558612j2714912p535847j0735120k942000m448336n699332k189999m722584
2985A7570482Q10516l155114K744975l313463J357423R65419k464435j357937
2977A3157866L078058k467748Q8748P63958j925810o6048K256923o64227j811524
2968A2410196q32475p09947J044916j19750O44575o69738r57194J608575j061472
2959A1357686L326230o03855j361076j174775J810014L74781J21372q68895J220167
2950A4201649J05121o65661J337312j861o43111K81139O42583K41470O0265J277806
$$ y = [50816305, 59929404, 66077960, 75062324, 78843811, 80864747, 75958051, 73162995, 67666700, 68886548, 67803460, 68390980, 74700915, 78503459, 75979323, 73730404, 68558612, 55843700, 48307853, 37572733, 34630733, 30182397, 24483065, 22293066, 17570482, 18380998, 15225884, 17970859, 14657396, 16014819, 16980238, 14515803, 13157866, 16235924, 13768176, 13856924, 14620882, 12695072, 12629024, 14885947, 14221720, 12410196, 11577721, 10867774, 11912690, 11792940, 12437515, 11767777, 10810583, 12419158, 11357686, 14683916, 14080061, 12718985, 11544210, 13354224, 13729005, 13850377, 12981482, 14201649, 14306770, 13641109, 14978421, 14976560, 14333449, 14614588, 15257171, 15498641, 15558906, 16836712]
2940A6836712j758274J716256M96412K098422k850195J388813l61854K446562
2932B0012854K66424j609678J715056k59986J086938R97730k72852M42226L379535
2923B5758247j992081M7375R19705M81944m94064J652400J951919m53081K44166
2914B8116530j218948J371631k787649J803240j489970J213369l803605P06311
2906B3910909j139167n6397l52475j949820j40334k365058r0750L9336J19454
2897A7975698o87070k877630k346925L577557j998448l87874m59101O08165j806732
2888A1597640o816l42646J193047p15701p22933p21923K02657N06805Q26513j043171
2878A0773472r48245J925344J23762Q02577N24266r11469o63456k195152J600129
$$ y = [16836712, 15078438, 16794694, 17291106, 19389528, 16539333, 17928146, 17566292, 20012854, 20279278, 18669600, 20384656, 20124670, 21211608, 22209338, 21936486, 22378712, 25758247, 23766166, 23813541, 24733246, 25215190, 24721126, 26373526, 28325445, 27872364, 28116530, 26897582, 28269213, 25481564, 27284804, 25794834, 27008203, 23204598, 23910909, 22771742, 22715345, 22362870, 20413050, 20272716, 17907658, 17816908, 17856244, 17975698, 17288628, 14410998, 12064073, 15641630, 13643182, 13255308, 12796207, 13404372, 11597640, 11590824, 11248178, 12441225, 11725524, 11002591, 10280668, 10483325, 10990130, 11816643, 10773472, 9825227, 11750571, 11874333, 12676910, 13201176, 12289707, 11626251, 9431099, 11031228]
2869A1031228n13779K271181j538637K014934k594439R87079N95924J020209K02550
2860A3476250k160344L319864p33282J561806J56475k87393K792325k087050k77804
2851A5760847k101304J399640k605315J281577M2419j189527J495879K55140j502545
2842A2836811J198763m82084q9613J100561j821828j054737K914920o49852p58521
2833A3194420J759956j212900m21174N24962K61637O08636J010852O98085j108473
2824A5316001r12823k897593L147171m42822n59872j647112J597790j96016J6494
2815A3421218l55076J60437k089002J422526N95336J019013N02628k670546J195265
2806A3201799l239253N92293L310048k742450P85875m748709L035330j632324
$$ y = [11031228, 10517449, 12788630, 11249993, 13264927, 10670488, 11657567, 12253491, 13273700, 13476250, 11315906, 14635770, 13902488, 15464294, 15620769, 15333376, 18125701, 16038651, 15760847, 13659543, 15059183, 12453868, 13735445, 13777864, 12588337, 14084216, 14339356, 12836811, 14035574, 13553490, 13463877, 14564438, 12742610, 11687873, 14602793, 13952941, 13194420, 14954376, 13741476, 13320302, 13845264, 14106901, 14715537, 15726389, 16424474, 15316001, 14403178, 11505585, 14652756, 14209934, 13650062, 12002950, 13600740, 13404724, 13421218, 13066142, 13226579, 11137577, 12560103, 13155439, 14174452, 14677080, 12006534, 13201799, 9962546, 10554839, 13864887, 11122437, 11908312, 7159603, 10194933, 8562609]
2798H562609K182754j475069J228800P08311j866804k45078J439993l01955k09476
2789A0024085K671577l719763P01672N18381P27840r96695J233487j484410J057371
2780A0733545n64477J450692K07382K640128k281786j930002K159841O11223q33899
2771A2192647M68347K03044L663851L801273L908258P912646K050295j270454
2763C2929907K31934k042312m111101n485338q797457R80192m195080R72530N93127
2754A1076402j840694R98724j418359J466250j288880J754869Q95088j159293
2746A0484107o03730k93574j371640J747241J690142k332890N5975M72042J753058
2737A1600731j060538k359164K931650m25637o72659j427171K445289J44021r46570
$$ y = [8562609, 10745363, 9270294, 10499094, 11207405, 9340601, 9095523, 10535516, 10233561, 10024085, 12695662, 8975899, 9677571, 10195952, 10923792, 9927097, 11160584, 9676174, 10733545, 10169068, 11619760, 11827142, 14467270, 12185484, 10255482, 12415323, 13026546, 12192647, 12660994, 12864038, 16527889, 20329162, 24237420, 32150066, 34200361, 32929907, 33161841, 31119529, 27008428, 21523090, 12725633, 13705825, 9510745, 10483275, 11076402, 9235708, 10234432, 8816073, 10282323, 8993443, 10748312, 11643400, 10484107, 9880377, 9586803, 8215163, 9962404, 11652546, 9319656, 9375631, 9847673, 11600731, 10540193, 8181029, 11112679, 10687042, 10014383, 8587212, 11032501, 11176522, 10229952]
2728A0229952l35861J077239M87329Q17798l200243P04268j307972k55163J713710
2719I931057K00472k209435J621612j87304J443946k840102j77188J853117p16141
2710H920034J166084J253745k555263k84572K44147j453369K387638j582698o17468
2701G478278K657973j192237Q81571R32208k981996Q93734P97477j001072L030092
2692A1496028k619542K60027J418278n80233k205553J808737J81668j789053R41732
2683H912089M50229r0259J191672q18303K26667P85374j206069J486774j967615
2674H970559J830714q67138J747968j492026j710300K784236k15832n07968p74256
2665I765957j06769k97901q40320Q79121R71203k099277O72135J215777j449888
$$ y = [10229952, 9894091, 10971330, 11458659, 12276457, 9076214, 9780482, 8472510, 8217347, 9931057, 10131529, 7922094, 9543706, 9356402, 10800348, 7960246, 7783058, 9636175, 8920034, 10086118, 11339863, 8784600, 8500028, 8744175, 7290806, 9678444, 8095746, 7478278, 10136251, 8944014, 9825585, 10757793, 7775797, 8669531, 9467008, 8465936, 11496028, 8876486, 9136513, 10554791, 9974558, 7769005, 9577742, 9759410, 7970357, 8912089, 9362318, 9272059, 10463731, 9645428, 9872095, 10657469, 9451400, 10938174, 8970559, 10801273, 9934135, 11682103, 10190077, 8479777, 11264013, 11048181, 10540213, 9765957, 9659188, 9361287, 8520967, 9400088, 10371291, 8272014, 8944149, 10159926, 8710038]
2656H710038J977684j456833J68636O28218N82494l178176J078164J770653j052426
2647I228452M66521R76283P41060J49518O61831r51046P95249P06277L43945k550329
2637A0567761L35369j002235k96118p85264P48536j300112P92453o27458J702816
2628A0135748J476556k743345K049846j484114r10080J885907j913137N74172
2620I071553k59697J337827k395832J424342K054700k188408j886904K433964
2612I591545l904674L985042k241791j045556J447042k6181J102605M13701k056789
2603G264944o7832R1760K457934n55085n95126O82121j130326j1749M66896Q10115
2593I413652j748367J37463Q52520j318500j82764N76120l69602J298958k68042
$$ y = [8710038, 10687722, 9230889, 9399525, 10027743, 10610237, 7432061, 8510225, 10280878, 9228452, 9694973, 10671256, 11412316, 11561834, 12223665, 11272619, 12067868, 12774145, 13118090, 10567761, 10903130, 9900895, 9604777, 8819513, 9568049, 8267937, 9060390, 8432932, 10135748, 11612304, 8868959, 10918805, 9434691, 8524611, 10410518, 8497381, 9071553, 8811856, 10149683, 7753851, 9178193, 11232893, 9044485, 7157581, 9591545, 5686871, 9671913, 7430122, 6384566, 7831608, 7805427, 8908032, 9321733, 7264944, 7197112, 7288872, 9746806, 9191721, 8596595, 9278716, 8148390, 8136641, 8603537, 9413652, 7665285, 7802748, 8655268, 7336768, 7154004, 7730124, 7360522, 8659480, 8391438]
2584H391438J56969K191525j143669R14604R20892k445889K80791L22140j363235
2575H225566R59964l408478M527890j343886R43774j967146k30045J534N02481
2566H211654O88284j058085k21420o3912P94684K41778L04774J922061Q67077
2557A1686895j243070P46649n29476J818546K796484J486106K031158J640338
2549B0433630N323448J0285111Q749920Q938764j1029184j5790359q558210m193717
2541A4159403j180414p48344L447217l014085j523669K385156k106446P59554
2533A2178372o52272J13775J892793j894874K067529k912565m17615p14968J562206
2524A1222381j750642O3700J790737m45960j506318k50508n79848O2348k031108
$$ y = [8391438, 8548407, 10739932, 9596263, 10510867, 11431759, 8985870, 9266661, 9588801, 8225566, 9185530, 5777052, 10304942, 8961056, 9904830, 7937684, 7707639, 7709173, 8211654, 8899938, 7841853, 7620433, 7556521, 8351205, 8592983, 8897757, 10819818, 11686895, 10443825, 11190474, 10660998, 12479544, 15276028, 16762134, 18793292, 20433630, 25757078, 36042189, 44792109, 53730873, 42701689, 26911330, 18353120, 14159403, 12978989, 12230645, 15677862, 12663777, 11140108, 13525264, 11418818, 12178372, 11526100, 11639875, 13532668, 11637794, 13705323, 10792758, 10375143, 9660175, 11222381, 9471739, 9535439, 11326176, 10880216, 9373898, 9123390, 8543542, 8605890, 6574782]
2515F574782J380423J930257k535600K472761l78025J10628m717946K360446O95884
2506G893610J978141l711372p20274J068536n63884J099313P0940q15845m82370
2497E816795J216126k939608K422714J045374R5401m45555P73219k927582J326389
2488F383273K068001l376718K986000j206622J813344j563594K045685p23951
2480H425418j30659J008947j075688N51586k021496M01389J576987P52204k12414
2471I276274R99275q97069R03131J58793k04423L09750j18148L000400K44796
2462A3672779J742460M31476M956489J0510963J2709597J8393116P258595j1028430
2454E8647045k1011336j2761103n478324n21432J070148N584464R381411J0962156
$$ y = [6574782, 7955205, 9885462, 7349862, 9822623, 9444598, 9555226, 4837280, 7197726, 7893610, 9871751, 6160379, 5440105, 6508641, 5944757, 7044070, 7115010, 6299165, 5816795, 7032921, 4093313, 6516027, 7561401, 7656802, 7211247, 7984466, 5056884, 6383273, 8451274, 5074556, 8060556, 6853934, 8667278, 7103684, 9149369, 8425418, 8294759, 9303706, 8228018, 8779604, 6758108, 7159497, 8736484, 9488688, 9276274, 10275549, 9378480, 10281611, 10440404, 10235981, 10545731, 10427583, 13427983, 13672779, 15415239, 15846715, 20803204, 31314167, 44023764, 62416880, 69675475, 58647045, 37635709, 24874606, 19396282, 18874850, 19944998, 25529462, 34910873, 45873029]
2446D5873029M708043j2046263j1596757o216938j598188K766866Q724985J6120283
2438D6735060J3420600R034208j9781024j6629035j1573981l768120J480164O719936
2430B5637808O212958J2393683O002564j5775252j3264495o578062k950156j79525
2422A1499523L618163L834370N188416K079928n012628p473447n259653R34817
2414I409489k129585j309176N09210O11636j216098J820608j785955r33023L885177
2405H862283l988904K890696j588771J317122K00200J778140l2510M454965j539957
2396A2353264M04510j066512K268306n437997K718137k081341o58980j278083
2388G221304M77052J355448l045992J919907P29740J809725m140553L42078O13847
$$ y = [45873029, 50581072, 38534809, 26938052, 20721114, 19122926, 21889792, 30614777, 46735060, 60155660, 69189868, 49408844, 32779809, 21205828, 17437708, 18917872, 25637808, 31850766, 44244449, 50247013, 34471761, 21207266, 14629204, 11679048, 11499523, 15117686, 18952056, 24140472, 26220400, 21207772, 13734325, 8474672, 9409489, 7279904, 5970728, 6479938, 7091574, 5875476, 7696084, 5910129, 4977106, 8862283, 4873379, 7764075, 6175304, 7492426, 7692626, 9470766, 9438256, 13893221, 12353264, 12757774, 11691262, 13959568, 8521571, 11239708, 9158367, 8499387, 7221304, 7698356, 9053804, 6007812, 7927719, 8657459, 10467184, 6326631, 6668709, 7282556]
2379G282556r69996j783377K729881j781823J515027n27171J084346J855317k430825
2370F973935J248668p62069K251392k052083L428424l200743K228698m27000j905869
2361G783353J220690j156053J950659j055752p945k99922J003068j527413J737786
2352I648471j118179k218238J877827l44103j90349J599329j933486J93570Q32691
2343H347533R34724k064288o49931P97309L59278C575834K022793N16548Q90123
2334G005298j184048J794740k777658N20767N32558Q22373l84379j459332j291982
2325C578337K911273C034294M139225l268415L39822M39995p74109J029684j238889
2316C701607O95303o80602n04624K396515L83045o75688M66451j396496j028261
$$ y = [7282556, 6312560, 4529183, 7259064, 5477241, 6992268, 6465097, 7549443, 9404760, 6973935, 8222603, 7460534, 9711926, 7659843, 11088267, 7887524, 10116222, 9689222, 7783353, 9004043, 7847990, 9798649, 8742897, 8734952, 8435030, 9438098, 7910685, 9648471, 8530292, 6312054, 8189881, 7845778, 7655429, 9254758, 7321272, 7514842, 8347533, 9282257, 7217969, 6568038, 7365347, 7724625, 3575834, 5598627, 6115175, 7005298, 5821250, 7615990, 4838332, 5359099, 5891657, 6714030, 6329651, 4870319, 3578337, 6489610, 3034294, 7173519, 3905104, 4244926, 4684921, 3910812, 4940496, 3701607, 4396910, 3716308, 3211684, 5608199, 5991244, 5315556, 5782007, 4385511, 3357250]
2307C357250K83997P39106K52656J800547k266623J458956M78695p12215k348792
2298C043577R48606K68154J846151j439626K544733k95739k563653n52614K70647
2289D070236K60742M41427J560088j356165J208854j90812k040221K417189j633673
2280D737665J089885J719828k678226K949592k568514j534429L692865j458934
2272E949732O0376j421154J498400R05148P69614j473265J268109j94784j365388
2263E996788n58598P04585L339393j667682J21260J54463j665057l3910j123179
2254E268063N66426J46444J876890k358423J631505J044304j431614o13845l41254
2245E788496o12043P7759m5712M61506K8657p39545j193447J847839k74429j112749
$$ y = [3357250, 3641247, 4380353, 4633009, 6433556, 4166933, 5625889, 6104584, 5392369, 3043577, 3992183, 4260337, 6106488, 4666862, 7211595, 6915856, 4352203, 3799589, 4070236, 4330978, 4772405, 6332493, 4976328, 6185182, 5994370, 3954149, 6371338, 4737665, 5827550, 7547378, 4869152, 7818744, 5250230, 3715801, 7408666, 5949732, 6010108, 4588954, 6087354, 6992502, 7762116, 6288851, 7556960, 7362176, 5996788, 5438190, 6142775, 9482168, 7814486, 7935746, 8090209, 6425152, 6391242, 5268063, 5834489, 5980933, 7857823, 5499400, 7130905, 8175209, 6743595, 6129750, 5788496, 5176453, 5254212, 5208500, 5670006, 5698663, 4959118, 3765671, 5613510, 5339081, 4226332]
2235D226332l69705J548836o61611K26313A691266L345549n38977N15725R54168
2226E967731q31354P79767j123457n97841Q81096J116626r22199R95451j609312
2217D656508K77474k16171R53860j026895j096824J480637J39587K416292l083246
2208D501222J329174r57965L67146M49513l78110j158458J453910J351846o92332
2199F265946J036058q3904j097180Q80107j846223O56067J627328j828010K81780
2190E891969J059103l92497o20624N87001k024631K17528J477494P28290j646400
2181E277233N49295K338815k753648J593436J480875k111304N07551K270422k211835
2172F940840J320002j248344K762077l242193L38206R71634j214390l09811n29303
$$ y = [4226332, 3856627, 5405463, 4743852, 4970165, 1691266, 5036815, 4497838, 5013563, 5967731, 5136377, 5916144, 4792687, 4194846, 5075942, 6192568, 5270369, 6265820, 4656508, 4933982, 4717811, 5671671, 4644776, 3547952, 5028589, 5168176, 7584468, 4501222, 5830396, 4872431, 5239577, 5689090, 5310980, 4152522, 5606432, 6958278, 6265946, 7302004, 7218100, 6120920, 7001027, 5154804, 5810871, 7438199, 5610189, 5891969, 6951072, 6558575, 5937951, 6524952, 4500321, 4717849, 6195343, 6923633, 5277233, 5826528, 8165343, 5411695, 7005131, 8486006, 6374702, 6882253, 9152675, 6940840, 8260842, 7012498, 9774575, 6532382, 6870588, 7842222, 6627832, 6318021, 5788718]
2163E788718k72932j155242J903404j612347J990806m15560J562559k93151j149400
2154F346855Q30096k451123R39983J18865q4622J027016q44402o24628Q14089
2145F072129o4975j337146J008300K403740M98518k480846L27720N16654L08308
2136G252402l26726l64872m53497j051934J507977m74503n1817l2121p03262J570708
2126F872355N1722k709011O74217j38112J819433j081718n62879J071626M35856
2117F433489j658945K101821j627927K529798r46314j710231K486265l09589K32271
2108G530638k451432j31974J888830k62625N21057j180313J297154j71815j335942
2099E703578L52579n86083J424913k170472J38178O50183J142888j397834J961194
$$ y = [5788718, 5515786, 4360544, 6263948, 4651601, 6642407, 6226847, 7789406, 7496255, 6346855, 7176951, 4725828, 5665811, 5784676, 5700054, 6727070, 5882668, 5258040, 6072129, 6007154, 4670008, 5678308, 8082048, 8580566, 6099720, 6427440, 6944094, 7252402, 6925676, 6560804, 6107307, 5055373, 6563350, 6088847, 6037030, 6004909, 5301647, 6872355, 6924077, 4215066, 4889283, 4751171, 6570604, 5488886, 4926007, 5997633, 6433489, 4774544, 6876365, 5248438, 7778236, 6831922, 5121691, 7607956, 7298367, 7530638, 5079206, 4947232, 6836062, 6573437, 7094494, 5914181, 7211335, 7039520, 5703578, 6056157, 5470074, 6894987, 4724515, 4862693, 5512876, 6655764, 5257930, 7219124]
2090G219124j220999J932079l192090J181997Q0403j329457J81031l13271K176816
2081F715633l40444m04089k54428J25364J589136q07093K338131l941344L520571
2072H541437j553799J597155k642802K92499M48526O2412O95968j717786K416723
2063H140333j617061k16017k082586K080825K576335k894072J338933O7636m45068
2054F949258k31707K794311k340959J155038q85733p8230n67773J991420j261793
2045G523832L99888q46280J902054j118566q42490R7097j226521Q19425L069107
2036I777546k055401k85043k196090L198657k029487R98407q8487K56384R60454
2027H536940k726221R6778J520967r96898J543734P69064n71775o4272j2577J754582
$$ y = [7219124, 5998125, 7930204, 4738114, 5920111, 6000514, 4671057, 4852088, 4538817, 6715633, 6375189, 5971100, 5716672, 5842036, 7431172, 6624079, 8962210, 5020866, 8541437, 6987638, 8584793, 5941991, 6234490, 6683016, 6745428, 7441396, 5723610, 8140333, 6523272, 6307255, 4224669, 6305494, 8881829, 5987757, 7326690, 7394326, 6949258, 6717551, 9511862, 7170903, 8325941, 7440208, 7361978, 6794205, 8785625, 7523832, 7923720, 7077440, 8979494, 7860928, 7018438, 7115535, 5889014, 6708439, 9777546, 7722145, 7437102, 5241012, 8439669, 6410182, 7408589, 7320102, 7576486, 8536940, 5810719, 5907497, 7428464, 6431566, 7975300, 8744364, 8172589, 8108317, 8095740, 9850322]
2017I850322k426125m52290K265289k16789k697645K594329o47584J645642j051970
2008H863179j406563J248021k03523j157568J557831j054367q51042K597825j108307
1999H485486q795P79268j032649J466038Q99527j374446J237556j885034L419315
1990A1986266n36598r67789K78760M70032k116117J976238r43188J232140L3251
1981A1412995N005j144214J670776L86495L20327m234292J956955j357495J7463
1972I034015r5353R75485Q88776o30355K294480j582084K75094P65910l90110
1963A1535858p28817K058794j038555J92037L36746m58203j109116K218436r6060
1954A2911120Q1574j464826J532133l111561J430099N75792j674998J969612m64422
$$ y = [9850322, 7424197, 6971907, 9237196, 9020407, 6322762, 8917091, 8269507, 9915149, 8863179, 7456616, 8704637, 8501114, 7343546, 8901377, 7847010, 6995968, 9593793, 8485486, 8476691, 9255959, 8223310, 9689348, 10588875, 9214429, 10451985, 8566951, 11986266, 11449668, 10481879, 10760639, 11230671, 9114554, 11090792, 10147604, 11379744, 11412995, 11418000, 10273786, 11944562, 12331057, 12651384, 8417092, 10374047, 9016552, 9034015, 8938662, 9914147, 10802923, 10172568, 12467048, 10884964, 11160058, 11925968, 11535858, 10807041, 12865835, 11827280, 12019317, 12356063, 11897860, 10788744, 13007180, 12911120, 12992694, 11527868, 13060001, 9948440, 11378539, 11954331, 10279333, 12248945, 11784523]
1945A1784523j265972K936971k257240n12791Q95776o62929J475269p41987J4139
1936A1665759n56752j407412J871274k94830j280888J277116L2316R91717k281139
1927A0017161M28788J310985k81218J053778k118712R26773j744499K414480k29814
1918A1777722o19944J350185q24352J771932j479043q28167q12135J226879j044835
1909A0518242J243349j567415J121623j292371J102778J18283q34697r61862K044542
1900A1492472r35745R95171p59184n88632O06236r16145K94758L53437q19836
1891I722532N21135J407931R02922p38214P68301k49591p9958o60087J476257
1882A3071228j891921J558668L62359r0769R5428q58040J305447M13355k801000
$$ y = [11784523, 10518551, 13455522, 11198282, 10685491, 11581267, 10918338, 12393607, 11651620, 11665759, 11109007, 9701595, 11572869, 11278039, 9997151, 11274267, 11306583, 12298300, 10017161, 10445949, 11756934, 11475716, 12529494, 10410782, 11337555, 9593056, 12007536, 11777722, 11157778, 12507963, 11683611, 13455543, 11976500, 11148333, 10336198, 11563077, 10518242, 11761591, 10194176, 11315799, 10023428, 11126206, 11244489, 10409792, 9447930, 11492472, 10556727, 11551898, 10792714, 10204082, 10810318, 9894173, 10188931, 10542368, 9722532, 10243667, 11651598, 12554520, 11816306, 12584607, 12335016, 12255058, 11594971, 13071228, 11179307, 12737975, 13100334, 13009565, 13104993, 12246953, 13552400, 13965755, 11164755]
1873A1164755J824933j726927K630818k896257L65582J531237j004251j381294
1865A0508596N28074K647490j429777o42200J538822j541003J148551J30102Q0577
1856A2969232R65136k649060J897586k79603J609696L42332k080549K455958l81140
1847A4849588j100339J011186j295442M32294L76618J549565J83688J022292M49924
1838A7479374j620555N54516q45607j580478K133400j252904K020900j639648
1830A5248998k217536L006705r19763l28759R74324j512584J951981j004167J246962
1821A6446161J147747p78104k418649J062874r26996J833063k014596N65320L871208
1812A8788028m709722M997946k581710Q40673O63499o51190j456077r56723P00812
$$ y = [11164755, 12989688, 11262761, 13893579, 10997322, 11362904, 12894141, 11889890, 10508596, 11036670, 13684160, 12254383, 11612183, 13151005, 11610002, 12758553, 12888655, 12969232, 13934368, 11285308, 13182894, 12903291, 14512987, 14855319, 12774770, 15230728, 14849588, 13749249, 14760435, 13464993, 13897287, 14273905, 15823470, 16007158, 17029450, 17479374, 15858819, 16413335, 15567728, 13987250, 16120650, 14867746, 16888646, 15248998, 13031462, 16038167, 15118404, 14789645, 15763969, 14251385, 16203366, 15199199, 16446161, 17593908, 16815804, 14397155, 15460029, 14533033, 16366096, 14351500, 14916820, 18788028, 14078306, 19076252, 16494542, 17335215, 17998714, 17347524, 15891447, 14934724, 15635536]
1803A5635536J004822j966866J815139K071957j028278k686094q20045J999526
1795A6025697n92600k70846K21515k42370J879926j786675J317911n53695N71072
1786A6569935J057125Q285851L649114P482652k712144o141425p674371m158093
1778A6358644j585129j771417K895637j318935O27994k954091K390178l267998
1770A1374883J554991p95269j408510L061685k038294J339826p64882K6593j342021
1761A1009002Q85163K036644J440679k268250l489023K351855R25093R98493k1910
1752A3867746r13296n84626J250209l54830j489943O53322J145047R00178j278528
1743A3195279J102129Q0104O708K64120n87755r55828J207192k675363L786869
$$ y = [15635536, 16640358, 14673492, 16488631, 18560588, 17532310, 14846216, 14026171, 16025697, 15433097, 15162251, 15383766, 15141396, 17021322, 15234647, 16552558, 15998863, 16569935, 17627060, 25912911, 29562025, 37044677, 34332533, 28191108, 20516737, 16358644, 14773515, 13002098, 15897735, 14578800, 15206794, 12252703, 14642881, 11374883, 12929874, 12134605, 10726095, 13787780, 11749486, 13089312, 12324430, 12351023, 11009002, 11894165, 13930809, 15371488, 13103238, 9614215, 11966070, 12891163, 13889656, 13867746, 12954450, 12369824, 13620033, 13265203, 11775260, 12428582, 13573629, 14473807, 13195279, 14297408, 14377512, 14384220, 14648340, 14060585, 13104757, 14311949, 11636586, 15423455]
1734A5423455k797389o92791J010016l48277r2079K082969l622933J018257R61518
1725A2942746q6949M84679j059443J375511o62303O72942o53201j659658L230296
1716A4584620o20873j522863J517070L43339k5250k030674l65452K622709j236055
1707A3266571K34738j031026p82194R53671L3532J668358l0329k360023K612512
1698A4565810j012553j057413J90380J553467R63375l224952J355903j165007
1690A2169010P14149J30386j059144J764470J479704l989827J154116M76487m30472
1681A2408879K49921J91908J087978k393211J019682J296772j223839R78600j029541
1672A2587149J04009L264321k896411P382K603310l57289o69298K401283k603380
$$ y = [15423455, 12626066, 11933275, 12943291, 12595014, 12502935, 14585904, 10962971, 11981228, 12942746, 12855797, 13340476, 12281033, 13656544, 12994241, 13667183, 13013982, 11354324, 14584620, 13963747, 12440884, 13957954, 14301293, 14276043, 12245369, 11879917, 14502626, 13266571, 13501309, 12470283, 11688089, 12641760, 12675292, 14343650, 14313321, 11953298, 14565810, 13553257, 12495844, 12686224, 14239691, 15203066, 11978114, 13334017, 12169010, 12883159, 13013545, 11954401, 13718871, 15198575, 11208748, 12362864, 12839351, 12408879, 12658800, 12850708, 13938686, 11545475, 12565157, 13861929, 12638090, 13616690, 12587149, 12691158, 15955479, 13059068, 13066450, 15669760, 15312471, 14643173, 17044456, 14441076]
1663A4441076j56603K554647n5810l07834m9321o88716J840397m2450j043187
1654A6492199q22830m88588J896673O24926j48629P05421j805946N711330m237968
1645A7926588J263922P63200M16064j386878K279220j913591j91991J424474J332887
1636B1913895j21471J5186m91668J146358r058J150677M53683J04716J841819
1627B6004137k35177q66828M70968p31806l01250r8806J676000k55302l283655
1618B2378281J092879J159688l826082J374452j527522J120504l110744J447884
1610B0109340J523306L1206r59248j636378M96277J239783r11796j323638m68060
1601A8100792R37194L8646J714140l376755K372839J32291K87609j873844j9572
$$ y = [14441076, 14284473, 16839120, 16783310, 16475476, 16426155, 15737439, 17577836, 17535386, 16492199, 15669369, 15180781, 17077454, 17702380, 17553751, 18259172, 16453226, 22164556, 17926588, 19190510, 19953710, 20369774, 18982896, 21262116, 19348525, 19156534, 20581008, 21913895, 21792424, 21807610, 21315942, 22462300, 22453242, 23603919, 24057602, 24162318, 26004137, 25768960, 24902132, 25373100, 24641294, 24340044, 24241238, 25917238, 25661936, 22378281, 23471160, 24630848, 20804766, 22179218, 20651696, 21772200, 18661456, 20109340, 21632646, 21663852, 20704604, 19068226, 19564503, 20804286, 19892490, 18568852, 18100792, 19037986, 19076632, 20790772, 17414017, 19786856, 19919147, 20206756, 18332912, 18313340]
1592A8313340J471164n63004O46886j070892K367898j676146J602404j785250
1584A9306400J42652j207042J947486j155425p43003K520502j212122k815846
1576A6783602J904320n75820J586624n47566l61736O65890J749256j557158n66008
1567A9081404j12720j398768L301532j376218o35579l36433L083710k642626L235770
1558B2200072j964528M14190j44724L993550m651200K922396K32095l10429J637877
1549B4329299j686079l69862P54402J866176m64270n43232O228O07066J325002
1540B5824730O24155P85597q70923L424840P21017q20112O73825o52051q12410
1531B8898668R30422l637762Q48917k549473n11226j435350p66838p34318K3698
$$ y = [18313340, 19784504, 19221500, 19868386, 18797494, 21165392, 19489246, 21091650, 19306400, 19449052, 18242010, 20189496, 19034071, 18291068, 20811570, 19599448, 16783602, 18687922, 18112102, 19698726, 19151160, 18789424, 19455314, 21204570, 19647412, 19081404, 18968684, 17569916, 20871448, 19495230, 18859651, 18523218, 21606928, 18964302, 22200072, 20235544, 20649734, 20505010, 24498560, 19847360, 22769756, 23001851, 22691422, 24329299, 22643220, 22273358, 23027760, 24893936, 24429666, 23886434, 23892662, 24499728, 25824730, 26448885, 27234482, 26363559, 29788399, 30509416, 29689304, 30363129, 29711078, 28898668, 29829090, 26191328, 27040245, 24490772, 23979546, 22544196, 21777358, 21043040, 21066738]
1522B1066738l02702J312572k442594l889022K982756q34760M78694q79027m11273
1513A7081382J457826n0624O76710o00590k75740p42974K920290j858042J318464
1504A9926702q3816q57806k16909J992687j509184p33198K303952P31520K80678
1495B1834626J005828O82699k71265m44644L14986q77258K414561l07723m89436
1486B3862374K170752k15451L24635P55744M38857J543888L78901O94310K269618
1477C2223628Q98995P66782L365104q76072L052592J218484J025728K271352K915519
1468D6862112J975168J489989K281632j090844L328767L252977k395984j310325
1460E4393492j29624L708368N27984P11720J669385J02395N989216l0565L624272
$$ y = [21066738, 20764036, 22076608, 19634014, 15744992, 18727748, 17892988, 18371682, 17492655, 17081382, 18539208, 18488584, 19165294, 18564704, 18288964, 17545990, 20466280, 18608238, 19926702, 19842886, 18985080, 18768171, 20760858, 19251674, 18518476, 20822428, 21553948, 21834626, 22840454, 23523153, 23251888, 22807244, 23122230, 22244972, 24659533, 24351810, 23862374, 26033126, 25817675, 26142310, 26898054, 27336911, 28880799, 29259700, 29954010, 32223628, 33122623, 33889405, 37254509, 36378437, 39431029, 40649513, 41675241, 43946593, 46862112, 48837280, 50327269, 52608901, 51518057, 54846824, 58099801, 55703817, 54393492, 54263868, 57972236, 58500220, 59211940, 60881325, 60983720, 66972936, 66942371, 70566643]
1451G0566643K788272K741328O441168N043992L650880O200439O746880J0965336
1443A15144938Q894119J1130759J0413504J0084127P695073r8785q405535r006432
1435A45851768j2559639j2637575j5414449j6581102j2835064j3254751r404803
1428E3164385o320392o761452k407304l697967k373357j661656k670229j623349
1420B5648679p54781j443724k84648J326108m062288K211996n3366m411666J234526
1411A9410836K40636j509024p79390j95911P43157K71634j221026l44444Q26290
1402A7442758L53414K22676m57596m69760k01348O94434j106320j211517J346291
1393A6613032j365638Q03697J47731M28182L19564p93326J490816l204540J837660
$$ y = [70566643, 73354915, 76096243, 82537411, 87581403, 91232283, 97432722, 104179602, 115144938, 124039057, 135169816, 145583320, 155667447, 163362520, 163263735, 154858200, 145851768, 133292129, 120654554, 105240105, 88659003, 75823939, 62569188, 53164385, 46843993, 40082541, 37675237, 33977270, 31603913, 29942257, 27272028, 25648679, 24893898, 23450174, 23165526, 24491634, 20429346, 22641342, 22587976, 18176310, 19410836, 19651472, 18142448, 17363058, 17167147, 17910304, 18181938, 16960912, 16616468, 17442758, 17796172, 18018848, 17561252, 17091492, 16890144, 17584578, 16478258, 15266741, 16613032, 15247394, 16051091, 16198822, 16627004, 16946568, 16153242, 17644058, 14439518, 16277178]
1384A6277178J161457r38233j336469L525646K46811k032182K458030k681044
1376A6681194K985834k57502j715332j233074J70267K118824p52155P8510J027886
1367A9104452J717332l068746L38822J621130M08678J23364j191460O04038J90755
1358A9848365O41447N06356p23420M88038J30204J92308J410808p77780M13400
1349B2129726o29653j408931N33810r71928J314697J431141l979378j26754l37610
1340A7955120j625724r71908M15790k038384o47019k174094J036699O39752l08251
1331A2281981J019366r49140k079372J158394J60204J17139j025028J034498j439164
1322A0278878K97941O0305J371609j469324P15177j026589n49358K841651j44384
$$ y = [16277178, 17438635, 16500402, 15163933, 18689579, 18936390, 16904208, 19362238, 16681194, 19667028, 19409526, 17694194, 16461120, 16631387, 18750211, 17998056, 18076566, 19104452, 20821784, 17753038, 18091860, 19712990, 20121668, 20245032, 19053572, 19657610, 19848365, 20489812, 20996168, 20272748, 20760786, 20890990, 21083298, 22494106, 21716326, 22129726, 21500073, 20091142, 20624952, 19653024, 20967721, 22398862, 18419484, 18292730, 17955120, 16329396, 15357488, 15773278, 13734894, 13087875, 10913781, 11950480, 12590232, 12281981, 13301347, 12352207, 10272835, 11431229, 11591433, 11708572, 10683544, 11718042, 10278878, 10576819, 10637124, 12008733, 10539409, 11254586, 10227997, 9678639, 12520290, 12375906]
1313A2375906N45579l659945K865656J144528k250275K342046K78773j795158
1305A1847110M68542J023619J981811J39625q29363p70806j018490L243984j759049
1296A4326983J277194j356393J507904N69487J097621J263266n7654L327934L516300
1287B5472642l80465J196729l471428m67434k255604J650888q16530p41282p03202
1278A9484314j301527l95211J446424r58294N56882L67464O9148j347776Q27988
1269A8749412j418956N05330J174498j086902K82999L683649k053783Q54279p0726
1260B0619800m71624k29816J578778p1086J560865j415720J703185m21140J955388
1251B4808630n31228J687530j632422m04400J908276j989821R71915j888410k230006
$$ y = [12375906, 12921485, 9261540, 12127196, 13271724, 11021449, 13363495, 13642268, 11847110, 12315652, 13339271, 15321082, 15460707, 14631344, 13860538, 12842048, 16086032, 14326983, 15604177, 14247784, 15755688, 16325175, 17422796, 18686062, 18628408, 21956342, 25472642, 25092177, 26288906, 22817478, 22350044, 20094440, 21745328, 20928798, 20187516, 19484314, 18182787, 17787576, 19234000, 18275706, 18832588, 19200052, 19269200, 17921424, 18749412, 17330456, 17835786, 19010284, 17923382, 18206381, 21890030, 19836247, 20690526, 20619800, 20148176, 19918360, 21497138, 21426052, 22986917, 21571197, 23274382, 22853242, 24808630, 24277402, 25964932, 24332510, 23928110, 25836386, 23846565, 24818480, 22930070, 20700064]
1242B0700064j229360k850585j641369M84919k020111k52101j321696p40161K876932
1233A4006532m352622K735649P45056k680724J860451q50220j86795M81291j568854
1224A0189764K069238J080476l44614N17053K125945J109261m52198j852540L429133
1215A7871518m758051p62576o8029J529685j438078o44741J07734j462668K59466
1206A0634260o64519j528420K933029r46062j182110l13425J35756j1956R48721
1197A0005274k299015Q78045L73208j261651J502684j418519j842655L586506
1189I523877j206077k189847K616828j69364j453395p25252R32641j986951L569069
1180H911529q87307p7867q62260L86998j583440J41882k01421M71219j25121o8968
$$ y = [20700064, 19470704, 16620119, 14978750, 15463669, 13443558, 13191457, 11869761, 11129600, 14006532, 9653910, 12389559, 13134615, 10453891, 12314342, 11464122, 11277327, 11758618, 10189764, 12259002, 13339478, 12994864, 13511917, 15637862, 16747123, 16294925, 14442385, 17871518, 13113467, 12350891, 12282862, 13812547, 12374469, 11729728, 11837462, 10374794, 10634260, 9969741, 8441321, 11374350, 10428288, 9246178, 8932753, 9068509, 9056553, 10005274, 7706259, 8584304, 8957512, 7695861, 9198545, 7780026, 5937371, 9523877, 8317800, 6127953, 8744781, 8575417, 7122022, 6396770, 7329411, 5342460, 8911529, 8024222, 7946355, 7084095, 7471093, 5887653, 6029535, 5828114, 6299333, 6174212, 6105244]
1170F105244N71565J896954k568749j11301Q30587J23548q19107J642572N64860
1161H236173o52631n39730j512567J949200j641042l09176R26067k083974K427160
1152F799480k930852J302564j164687R03913l60862j111009P82799K887411k835667
1143D273090M29244P44123j92284j24462o98476n8721j59353j327559O91500K912216
1133F489318j611181j166885L37029L18010K412100k311033n25339J425967l75968
1124D992018o83181r64636L108977J660k887868J643860j415591L687412l702041
1115C780610j11678J711362k29714m23265q20469L19196p69219Q65726k77571
1106D044978K612897j966749n23150J569725n44422j192299P48568J510350j407840
$$ y = [6105244, 6676809, 8573763, 6005014, 5893713, 6724300, 6847848, 6028741, 7671313, 8236173, 7583542, 7043812, 5531245, 7480445, 5839403, 5530227, 6456294, 4372320, 6799480, 3868628, 5171192, 4006505, 4910418, 4549556, 3438547, 4221346, 7108757, 4273090, 4702334, 5446457, 5254173, 5129711, 4431235, 4372514, 4213161, 2885602, 3577102, 6489318, 4878137, 3711252, 4048281, 4366291, 6778391, 4467358, 3942019, 5367986, 4992018, 4308837, 3344201, 6453178, 6454838, 3566970, 5210830, 3795239, 7482651, 3780610, 3668932, 5380294, 5150580, 4727315, 3906846, 4226042, 3456823, 4322549, 4044978, 6657875, 4691126, 4167976, 5737701, 5193279, 4000980, 4749548, 6259898, 4852058]
1097D852058j083332J343196p45653q5215L66375o00750P23205J026209k103925
1088C692168p27728L219102j532581n8271Q09027o32206o6747Q55875k191865
1079C366774m00902J2852J291145l99418n87163J198809j300775J827715o75967
1070D333070p24108R3521J38063q10120R42346j832161J676019J22209A704512
1060C930960K11580j218376m75360M72181q10334J343629q03349O50378j554813
1051A746496J174191j418248P08992o46838J864830r45471L12815G81276J802359
1042B583635L22040r93362m92413J873643j602931L223454G23599K425585m66348
1033B682836J00358L76603l3881j24559j30189p57545l72486J783849l68709J395130
$$ y = [4852058, 3768726, 5111922, 4366269, 4281054, 4647429, 4046679, 4769884, 5796093, 3692168, 2964440, 6183542, 4650961, 4592690, 5401717, 4769511, 4702764, 5558639, 3366774, 2965872, 2978724, 4269869, 3870451, 3283288, 4482097, 3181322, 5009037, 4333070, 3608962, 3702483, 3840546, 3030426, 3972772, 2140611, 3816630, 3938839, 1704512, 3930960, 4142540, 2924164, 2448804, 2920985, 2110651, 3454280, 2650931, 3301309, 1746496, 2920687, 1502439, 2211431, 1564593, 3429423, 2483952, 2796767, 781276, 2583635, 2905675, 1912313, 1419900, 3293543, 1690612, 4914066, 723599, 3149184, 2682836, 2783194, 3159797, 3125916, 3001357, 2871168, 2113623, 1741137, 3524986, 3156277, 4551407]
1023D551407j307815P65835A37748J467207J046886K63857r17044J512987H1707
1013B511296p58060J443917M60274l45093j167093L94648k73504K967501B081984
1003B972359p05728q46008K395112j734465p41893J865152m09652J055776J180596
994E031249k210357J492752l09783j289479L018443j301784j65817K81433j547522
985B999135L651708A675100L255957F84034J190034G95732K324680j235786K584878
976D469504A598637R65208A086703J907847H86348J756566D87793K91841J418155
967B197789m90779F32682j27631J908085l76232K688965A684582K89390m74878
958A499094m93007D459K127164K034620E1924L557055A137655J880732O17081
$$ y = [4551407, 3243592, 4009427, 137748, 1604955, 2651841, 2915698, 1998654, 3511641, 81707, 2511296, 1753236, 3197153, 3657427, 3312334, 2145241, 2539889, 2266385, 5233886, 2081984, 2972359, 2266631, 1420623, 3815735, 2081270, 1339377, 3204529, 2794877, 3850653, 5031249, 2820892, 4313644, 4003861, 2714382, 5732825, 4431041, 4265224, 4546657, 2999135, 6650843, 1675100, 4931057, 684034, 1874068, 795732, 3120412, 1884626, 4469504, 1598637, 2563845, 1086703, 2994550, 886348, 2642914, 487793, 779634, 2197789, 1707010, 632682, 505051, 2413136, 2036904, 4725869, 1684582, 1973972, 1499094, 1006087, 4459, 2131623, 4166243, 51924, 3608979, 1137655, 3018387, 3635468]
949C635468j509461H01691K076845k95778k14238J866663G26716J515919J033060
940C275695m36414Q7465a48964D247108j761066n57000O42000l14716N67289M450
930B828065L28688J129996j080804m55832G20834K914969H48852J082485j87877
921A743460K275855j280474P3758O17648j64023A379192K973779k13503j054994
912C084474J749254j690140J690000j493259K528379k138250J368697j243608
904C855547J237772o88681M129319k191124m34433M72233L225421K056322j317977
895A0344399L263102F712229j345129B390701R69003j546027H18022L180985o67845
886C331162A173258J054502A31017O41466K161662m81887N20281p7934K68219
$$ y = [3635468, 2126007, 801691, 2878536, 2582758, 2368520, 4235183, 726716, 2242635, 3275695, 2839281, 2926746, -148964, 4247108, 2486042, 1929042, 2571042, 2256326, 2823615, 2828065, 3156753, 4286749, 3205945, 2750113, 720834, 3635803, 848852, 1931337, 1743460, 4019315, 2738841, 2812599, 3430247, 3266224, 1379192, 4352971, 4139468, 3084474, 4833728, 3143588, 4833588, 3340329, 5868708, 3730458, 5099155, 3855547, 5093319, 4404638, 8533957, 6342833, 5908400, 6380633, 9606054, 11662376, 10344399, 13607501, 6712229, 5367100, 2390701, 3359704, 1813677, 818022, 3999007, 3331162, 1173258, 2227760, 131017, 772483, 2934145, 2452258, 2972539, 2894605, 3162824]
877C162824o29478o79115J357027A264824Q85391K90391Q46841j553970J139850
868B873327D98982B02007J370922n40278K40406L17049J316023o32733M01966
859B675362I59151C71684P01659K41911H4884L260137J58875q28838A193271m99602
849F93669C06323J347732N96888j123114J026033M73115k9390K48654P08996N345
839C560582j445829B38212J304055j0026J750488j321346O94727j85649j91021
830B279440J316788j744542K701038j213572J107510R06879o13577p59584K879302
821F859682J517434D074291L31018o3730J451520J60084K115893p35337k95394
812G038345R53582M244422m91114N293627L600792K777129J8362518M1900630
$$ y = [3162824, 2533346, 1854231, 3211258, 1264824, 2150215, 2440606, 3287447, 1733477, 2873327, 498982, 202007, 1572929, 1032651, 1273057, 1590106, 2906129, 2273396, 2675362, 959151, 371684, 1073343, 1315254, 84884, 3345021, 3503896, 2675058, 1193271, 693669, 306323, 1654055, 2250943, 1127829, 2153862, 2626977, 2597587, 2846241, 3555237, 3560582, 2114753, 238212, 1542267, 1532241, 3282729, 1961383, 2656110, 2470461, 2279440, 3596228, 1851686, 4552724, 3339152, 4446662, 5353541, 4739964, 3980380, 6859682, 8377116, 4074291, 4405309, 4341579, 5793099, 5953183, 8069076, 7333739, 7038345, 7991927, 12236349, 11745235, 17038862, 20639654, 23416783, 41779301, 83679931]
804H3679931L7655646L5022430n1512805E2343540B1807657r238815n584668L333787
796A0317961m960565K96043p05757J66334m74136F35656L101749A800927K532893
787D333820j46374J500029M98945j463087l93969J08401j456878I58248J395095
778B353343Q13052q50455J804368j013751H73180J109916J119831B59991J808216
769B068207k8266D35591P39727J177927l1374A84640K152548J223926o49602A141287
758A188584K15194n48463J583054I13426P50011M47274l01818H65722L99651N22731
748A788104J782577A122800i265B106893r10207C15069J799951K207733r00270
739C422483r86228R15819J444139B095383q10945K732294R53478j771760m21617
$$ y = [83679931, 121335577, 156358007, 104845202, 52343540, 21807657, 12568842, 6984174, 10317961, 5357396, 5653439, 4947682, 5114016, 4639880, 635656, 3737405, 1800927, 4333820, 4187446, 5687475, 6186420, 4723333, 4329364, 4437765, 2980887, 958248, 2353343, 3166395, 2315940, 4120308, 3106557, 873180, 1983096, 3102927, 259991, 2068207, 2039941, 435591, 1175318, 2353245, 2321871, 184640, 2337188, 3561114, 2911512, 1141287, 1188584, 1403778, 855315, 2438369, 913426, 1663437, 2110711, 1808893, 865722, 1265373, 1788104, 3570681, 1122800, -9265, 2106893, 1196686, 315069, 2115020, 4322753, 3422483, 2436255, 3352074, 4796213, 2095383, 1284438, 4016732, 4970210, 3198450, 2776833]
730B776833j164613P242K380254j279804J30324R8698Q42175j084544J347164
721D053729j245931K178293o45507O28363R86575m1869J443652j319490M30288
712F468103j210860m45009J802491j490121j203474j568049j03007H22279K507016
703C329295p31970n43865J238605j407985d84579B684841j032654O7400l25374
694A394213J996589m00383G25537M7936J277690J6888a306919A261246R64590
685B225836K30105m63118p41493Q91378k10097J92257l15789R1357G61907R40986
675A702893D01654J262825L02681a531430A46094K361424J288057H1483K273757
666B355240H77200K199674f24743A073081G5063K751689F73670c42889F99508
$$ y = [2776833, 1612220, 1619462, 3999716, 2719912, 2850236, 2948934, 3791109, 2706565, 4053729, 2807798, 4986091, 4340584, 4968947, 5955522, 5913653, 7357305, 6037815, 6468103, 5257243, 4812234, 6614725, 5124604, 3921130, 2353081, 2250074, 822279, 3329295, 2597325, 2053460, 3292065, 1884080, -484579, 2684841, 1652187, 1719587, 1394213, 3390802, 2990419, 725537, 773473, 2051163, 2068051, -1306919, 1261246, 2225836, 2455941, 1992823, 1251330, 2142708, 1932611, 2124868, 1809079, 1900436, 761907, 1702893, 401654, 1664479, 1967160, -1531430, 146094, 2507518, 3795575, 81483, 2355240, 877200, 3076874, -624743, 1073081, 75063, 2826752, 673670, -342889, 699508]
656G52400R00515l51133P1292L72976K96725A69090K437571Q58255o44243a496100
645A444447M57688C80309P32709b8674B710446A5672J125009c57100A328730e33376
634D299847A766718J460307o59573l74143l67069L55984m85034J95979K376644
625D269813J460974o08709o93385l46545n80542j107168J92534P09820A516480
615C330952J077034N72656k380497j148603Q80740j2928a227462A269031D90763
605A128172J41683J284248a389896A14454L49739J33418h97246A829090L72611
596B201701F39764J228666r1001C17476N31948j48367j40678G8657K964016j321096
586A721577a175138A354278F20367J394773p06973k97554k26650b59209B03264
$$ y = [752400, 1652915, 1301782, 1373074, 1746050, 2042775, 169090, 2606661, 3464916, 2820673, -1496100, 1444447, 1902135, 380309, 1113018, -28674, 2710446, 15672, 1140681, -357100, 1328730, -533376, 4299847, 1766718, 3227025, 2567452, 2193309, 1826240, 2182224, 1697190, 1893169, 4269813, 5730787, 5122078, 4428693, 4082148, 3501606, 2394438, 2586972, 3296792, 1516480, 3330952, 4407986, 4980642, 2600145, 1451542, 2332282, 2319354, -1227462, 1269031, 490763, 1128172, 1269855, 2554103, -1389896, 114454, 464193, 597611, -897246, 1829090, 2201701, 639764, 1868430, 1777429, 317476, 849424, 701057, 560379, 78657, 3042673, 1721577, -1175138, 1354278, 620367, 2015140, 1308167, 1010613, 783963, -259209, 203264]
576A548830d31495j567172A264416J479250I93876O42474r5555D42708A19622
566A68375b58146B390803E17679g89875K42406C46259J383371D00226j84683P21340
556I36883r118M3539l01800K969659A582060m79414i76160b98769E26488r9314
546D27174K471485H06091P29605B26131J034418C59085Q09250n68358J927831
537B527808M7221D63176K067196A83890J432696k87105k22527J361250H95645
527c77723A304256i0163E94015M87385a235066d83745N5657J37090C624567g20863
516A24762a445761a76091F65256R00854C01586J623702B58514J55566R62765l41946
506A034899i84667a09253j335936C95773f1975B625000j050187A43702O45442
$$ y = [1548830, -431495, -1998667, 1264416, 2743666, 993876, 1636350, 1540795, 442708, 119622, 168375, -258146, 2390803, 517679, -789875, -547469, 346259, 1729630, 400226, 215543, 936883, 927765, 971304, 669504, 3639163, 1582060, 1102646, -976160, -298769, 526488, 427174, 2898659, 806091, 1535696, 226131, 1260549, 359085, 1168335, 599977, 2527808, 2575029, 463176, 2530372, 183890, 1616586, 1329481, 1106954, 2468204, 895645, -377723, 1304256, -90163, 594015, 1081400, -1235066, -483745, -428088, -290998, 3624567, -720863, 124762, -1445761, -176091, 665256, 1566110, 301586, 1925288, 258514, 414080, 1376845, 1034899, -984667, -109253, -1445189, 395773, -61975, 2625000, 1574813, 143702, 789144]
497G89144P30294a430821P11235B709211j56984C9582J042732C1676J259231K41045
487A531952J63251M30248G24902J491847a098903B899650p21139o63408k03675
478A311428P48525D06880J18120J800065D60948P01809m5826M3376i29960B601284
467C41292J290466R55532l96604j072249M08966O26101c01163H21788A35327J210478
457A345805b43158g0688A078642i10938B872686i65328B761040G67465M19439
448A186904O00064N2807F75655M29417j11705O54909o34424C41923J731763r86169
438A087517k17425O54000D50410R21230L0099M6395a739407e94315A542426A7053
427B072904k68113H70674q1947j71381d90147R144B66664J079974A16085d87859
$$ y = [789144, 1519438, -1430821, -719586, 2709211, 2552227, 39582, 1082314, 31676, 1290907, 1531952, 1695203, 2125451, 724902, 2216749, -1098903, 2899650, 2178511, 1515103, 1311428, 2059953, 406880, 525000, 2325065, 460948, 1162757, 1116931, 1160307, -929960, 2601284, 341292, 1631758, 2587290, 2190686, 1118437, 1527403, 2153504, -301163, 821788, 135327, 1345805, -243158, -70688, 1078642, -910938, 2872686, -965328, 2761040, 767465, 1186904, 1786968, 1839775, 675655, 1105072, 993367, 1648276, 1013852, 341923, 2073686, 1087517, 870092, 1524092, 450410, 1371640, 1401739, 1448134, -1739407, -594315, 1542426, 17053, 2072904, 1804791, 870674, 788727, 617346, -490147, -481003, 266664, 1346638, 116085, -487859]
416G56772k31600P20363n9340l87011J164660e75054F51656r5844K88408a124125
405B096553E67705J222409o20993i03901C428a880735G2386N01091e34327A192477
394A525730m16866j15445O21041F97852A61507a528554A793859q53997b89355
384G23752c05465C8240R771K845241b095771B401466a291016H55263b22229A347788
373I38409k0176R34221B00437J193714l13443D33078J31292A45589K25277L53990
363G24856J087625a589686A018311a164414M38734A495255l66150j54584N21067
354A495588l87785g1464I08731K3130a56803I92582k74347j52626K58591e82497
343C422336A002331e957D99121A14082K363889G80908B25214J30652O21183K311573
$$ y = [756772, 525172, 1245535, 1186195, 799184, 1963844, -575054, 651656, 555812, 844220, -1124125, 2096553, 567705, 1790114, 1169121, -903901, 3428, -1880735, 72386, 573477, -534327, 1192477, 1525730, 1108864, 993419, 1614460, 697852, 161507, -1528554, 1793859, 939862, -289355, 723752, -305465, 38240, 48011, 2893252, -2095771, 2401466, -1291016, 855263, -222229, 1347788, 938409, 918233, 1852454, 200437, 1394151, 1080708, 433078, 564370, 145589, 370866, 724856, 1812481, -1589686, 1018311, -1164414, -725680, 1495255, 1129105, 974521, 1495588, 1107803, -71464, 908731, 931861, -156803, 992582, 718235, 565609, 824200, -582497, 3422336, 1002331, -5957, 499121, 114082, 2477971, 780908, 225214, 355866, 977049, 3288622]
333C288622G32183J322811A94358J027523O27629F75594j12338M99087e93380
323B074645G56395e91088I03956C49292j12661K162782J44999b10316A079944
313C66934a191484k93384A146165j00632D93508a780815C67404A7414J79190J145626
303A342230g25518D08616a200435B076850k61338b38060Q6950H63013C11402J219183
293A530585M11286D95031b339767B088372g33589r16861A182141C35728O93105
284A028833C14730a653791G34168g7701A436063O01152H995K38498d30609A816205
273a149706D85590a12781B439277H87147R76513G19222C04798J340767a1697r38649
263i50346k73164E31618M12302a963770A901074B95083N55962g31513q1328b72513
$$ y = [3288622, 732183, 2054994, 194358, 1221881, 1849510, 675594, 563256, 1062343, -593380, 2074645, 756395, -591088, 903956, 349292, 236631, 2399413, 2544412, -210316, 1079944, 366934, -1191484, -1484868, 1146165, 1045533, 493508, -1780815, 367404, 17414, 196604, 1342230, -725518, 408616, -1200435, 2076850, 1815512, -238060, -151110, 863013, 311402, 1530585, 1941871, 495031, -2339767, 2088372, -733589, -1650450, 1182141, 335728, 1028833, 314730, -1653791, 734168, -77701, 1436063, 2037215, 8995, 247493, -430609, 1816205, -1149706, 485590, -112781, 2439277, 887147, 1863660, 719222, 304798, 1645565, -11697, -950346, -1223510, 531618, 943920, -1963770, 1901074, 295083, 851045, -731513, -812841, -272513]
252A244048C04516c19819G22953P08450A90731D0918O84851K52594r5849k27656
242F54858k76348a304837F84640a228141G11728e061F48936g92624L47980A897161
231A871774D09940a362806A268303B94844e25798A95006C7696O96949a37233q12519
221i49752I09946O75479F89145c52759a62848A447373J088457e11245A788540
211h14174P4736E08296l6253R24119h21377K15836C70501r6899N12326f9136r3779
200a62915C95905K62192A69931N2583j00855g99799G94635J323299E95995g837
189f37665A35575a66451I90567l7953B75040L85315e19443A94557b5923l91863
179d17786j88343j73066A095162b07300j43155G82282A7005L44919g30959B30878
$$ y = [1244048, 304516, -319819, 722953, 1431403, 190731, 40918, 725769, 978363, 882514, 654858, 378510, -1304837, 684640, -1228141, 711728, -5061, 648936, -792624, -444644, 1897161, 1871774, 409940, -1362806, 1268303, 294844, -525798, 195006, 37696, 734645, -137233, -949752, 909946, 1585425, 689145, -352759, -162848, 1447373, 2535830, -511245, 1788540, -814174, -739438, 508296, 472043, 1396162, -821377, -605541, 370501, 273602, 785928, -69136, -162915, 395905, 658097, 169931, 222514, 121659, -799799, 794635, 2117934, 595995, -7837, -637665, 135575, -166451, 990567, 952614, 275040, 660355, -519443, 194557, -25923, -417786, -606129, -779195, 1095162, -207300, -350455, 782282, 17005, 361924, -730959, 230878]
168A123750l81709e45777A382931k059o50375c46551A45179K38967d5300p9918
158a25218A34751J08618J498902j76173k4872E97342J52248b83503A514338b299614
147H99117J067187j16650j51973f92787A563209G07659J13054f3347C70423q7237
137B83186R74480h02029j217097B846616J22743I23941R16551N39603C51644a523546
126C81398J28050N76515J194542q94681o3248h78217l978J04375c81327p83523
116a164850B254752E95616O93254c83304A873446H28855R14432a308837k40518
107a549355e24837B117067A052360K38844n34930J17895d7054j077144M55508
98f68690K12747n20087B862243b66637C9318K92368F0469K183954a597087A408037
$$ y = [1123750, 742041, -545777, 1382931, 1380872, 730497, -346551, 145179, 384146, -45300, -125218, 134751, 243369, 1742271, 1566098, 1541226, 597342, 749590, -283503, 1514338, -2299614, 899117, 1966304, 1849654, 1697681, -692787, 1563209, 707659, 820713, -63347, 370423, 283186, 1257666, -802029, -2019126, 2846616, 2969359, 923941, 1840492, 2380095, 351644, -1523546, 381398, 509448, 1085963, 2280505, 1385824, 1322576, -878217, -882195, -777820, -381327, -1164850, 2254752, 595616, 1288870, -383304, 1873446, 828855, 1743287, -1308837, -1549355, -524837, 2117067, 1052360, 1291204, 756274, 874169, -47054, -1124198, -668690, -455943, -976030, 2862243, -266637, 39318, 331686, 60469, 2244423, -1597087, 1408037]
87C28638j13800J44783L89324J564774a065505C78033j53953J146980a004347
77B052307C19227a731110F85883A38645k1954R78914m59291O32664A96273a52128
66g46938K81476A323723o17891a01654l09489A026309j99388O44916g37156P8924
56f58232A421655b08510A115551m52193e96584A078990A51370N97069j7857B49105
45C50665c0098j72622j437962C73637i65090E31464B63830L09501j71466J021233
35A423098B16866Q65211a691054I90467J006302a238029B176954G79761k69676
26E10085a207511C92593e79009A134449b156687P80490D19947a497307L57573
17a139734d97786A641841d79777m06361B28717a70356q13q43662A124195C81987
$$ y = [328638, 214838, 359621, 748945, 2313719, -1065505, 378033, 224080, 1371060, -1004347, 2052307, 319227, -1731110, 685883, 138645, 116691, 1095605, 636314, 1268978, 196273, -152128, -746938, -465462, 1323723, 705832, -101654, -411143, 1026309, 826921, 1471837, -737156, -658232, 1421655, -208510, 1115551, 663358, -596584, 1078990, 151370, 748439, 730582, 249105, 350665, -30098, -202720, -1640682, 373637, -965090, 531464, 263830, 573331, 401865, 1423098, 216866, 1082077, -1691054, 990467, 1996769, -1238029, 2176954, 779761, 510085, -1207511, 392593, -579009, 1134449, -2156687, -1376197, 419947, -1497307, -1139734, -497786, 1641841, -479777, -886138, 228717, -170356, -171169, -1014831, 1124195, 381987]
6A117319e01733j450705i18845c80681A835143A20671
$$ y = [1117319, -501733, -1952438, -918845, -380681, 1835143, 120671]
##END=
