##TITLE=1364
##JCAMPDX= 6.0         $$ Bruker NMR JCAMP-DX V2.0
##DATA TYPE= NMR SPECTRUM
##DATA CLASS= XYDATA
##ORIGIN= NUTS EXPORT
##OWNER= Administrator
$$ 1.72 TOPSPIN		Version 2.1
$$ 2016-02-23 12:21:24.293 -0800  Administrator@X
$$ Compression mode = diff/dup
##.OBSERVE FREQUENCY= 90.275459
##.ACQUISITION MODE= SIMULTANEOUS (DQD)
##.ACQUISITION SCHEME= undefined
##.AVERAGES= 16
##.DIGITISER RES= 22
##SPECTROMETER/DATA SYSTEM= 
##.PULSE SEQUENCE= zg30
##.SOLVENT NAME= None
##.SHIFT REFERENCE= INTERNAL, None, 1, 14.34409
##AUDIT TRAIL= $$ (NUMBER, WHEN, WHO, WHERE, PROCESS, VERSION, WHAT)
$$ ##TITLE= Audit trail, TOPSPIN		Version 2.1
$$ ##JCAMPDX= 5.01
$$ ##ORIGIN= Bruker BioSpin GmbH
$$ ##OWNER= Administrator
$$ $$ E:/data/jwist/nmr/1364/1/pdata/1/auditp.txt
$$ ##AUDIT TRAIL=  $$ (NUMBER, WHEN, WHO, WHERE, PROCESS, VERSION, WHAT)
(   1,<2016-02-23 09:05:44.324 -0800>,<Administrator>,<X>,<jcamp>,<TOPSPIN 2.1>,
      <fromjdx created from
       E:\data\jwist\nmr\uniandes\1364
       data hash MD5: 8K
       FD 98 B6 63 83 38 0C CE BB BD 61 A4 B4 7E A9 76>)
$$ ##END=
$$ 
$$ $$ hash MD5
$$ $$ 35 24 B5 EB E0 E9 43 56 84 85 31 06 3D 9A 4F 0C
##$RELAX= 
$$ Bruker specific parameters
$$ --------------------------
##$DU= <E:>
##$EXPNO= 1
##$NAME= <1364>
##$PROCNO= 1
##$TYPE= <nmr>
##$USER= <jwist>
##$ACQT0= 0
##$AMP= (0..31)
100 100 100 100 100 100 100 100 100 100 100 100 100 100 100 100 100 100
100 100 100 100 100 100 100 100 100 100 100 100 100 100
##$ANAVPT= 1
##$AQSEQ= 0
##$AQ_mod= 3
##$AUNM= <au_zg>
##$AUTOPOS= <>
##$BF1= 90.275459
##$BF2= 400.02
##$BF3= 400.02
##$BF4= 400.02
##$BF5= 400.02
##$BF6= 400.02
##$BF7= 400.02
##$BF8= 400.02
##$BYTORDA= 0
##$CFDGTYP= 0
##$CFRGTYP= 0
##$CHEMSTR= <none>
##$CNST= (0..63)
1 1 145 1 1 1 1 1 1 1 1 1 1 1 1 1 1 1 1 1 1 1 1 1 1 1 1 1 1 1 1 1 1 1 1
1 1 1 1 1 1 1 1 1 1 1 1 1 1 1 1 1 1 1 1 1 1 1 1 1 1 1 1 1
##$CPDPRG= <>
##$CPDPRG1= <>
##$CPDPRG2= <>
##$CPDPRG3= <>
##$CPDPRG4= <mlev>
##$CPDPRG5= <mlev>
##$CPDPRG6= <mlev>
##$CPDPRG7= <mlev>
##$CPDPRG8= <mlev>
##$CPDPRGB= <>
##$CPDPRGT= <>
##$D= (0..63)
0 1 0 0 0 0 0 0 0 0 0 0 0 0 0 0 0 0 0 0 0 0 0 0 0 0 0 0 0 0 0 0 0 0 0 0
0 0 0 0 0 0 0 0 0 0 0 0 0 0 0 0 0 0 0 0 0 0 0 0 0 0 0 0
##$DATE= 0
##$DBL= (0..7)
120 120 120 120 120 120 120 120
##$DBP= (0..7)
150 150 150 150 150 150 150 150
##$DBP07= 0
##$DBPNAM0= <>
##$DBPNAM1= <>
##$DBPNAM2= <>
##$DBPNAM3= <>
##$DBPNAM4= <>
##$DBPNAM5= <>
##$DBPNAM6= <>
##$DBPNAM7= <>
##$DBPOAL= (0..7)
0.5 0.5 0.5 0.5 0.5 0.5 0.5 0.5
##$DBPOFFS= (0..7)
0 0 0 0 0 0 0 0
##$DE= 6.5
##$DECBNUC= <off>
##$DECIM= 2432
##$DECNUC= <off>
##$DECSTAT= 4
##$DIGMOD= 1
##$DIGTYP= 12
##$DL= (0..7)
0 120 120 120 120 120 120 120
##$DP= (0..7)
150 150 150 150 150 150 150 150
##$DP07= 0
##$DPNAME0= <>
##$DPNAME1= <>
##$DPNAME2= <>
##$DPNAME3= <>
##$DPNAME4= <>
##$DPNAME5= <>
##$DPNAME6= <>
##$DPNAME7= <>
##$DPOAL= (0..7)
0.5 0.5 0.5 0.5 0.5 0.5 0.5 0.5
##$DPOFFS= (0..7)
0 0 0 0 0 0 0 0
##$DQDMODE= 0
##$DR= 22
##$DS= 2
##$DSLIST= <SSSSSSSSSSSSSSS>
$$ [...]
##$SPOFFS= (0..31)
0 0 0 0 0 0 0 0 0 0 0 0 0 0 0 0 0 0 0 0 0 0 0 0 0 0 0 0 0 0 0 0
##$SUBNAM0= <"">
##$SUBNAM1= <"">
##$SUBNAM2= <"">
##$SUBNAM3= <"">
##$SUBNAM4= <"">
##$SUBNAM5= <"">
##$SUBNAM6= <"">
##$SUBNAM7= <"">
##$SUBNAM8= <"">
##$SUBNAM9= <"">
##$SW= 20.5580556627758
##$SWIBOX= (0..15)
0 0 3 4 0 0 0 0 0 0 0 0 0 0 0 0
##$SW_h= 8223.68421052631
##$SWfinal= 0
##$TD= 65536
##$TD0= 1
##$TE= 300
##$TE2= 300
##$TE3= 300
##$TEG= 300
##$TL= (0..7)
0 120 120 120 120 120 120 120
##$TP= (0..7)
150 150 150 150 150 150 150 150
##$TP07= 0
##$TPNAME0= <>
##$TPNAME1= <>
##$TPNAME2= <>
##$TPNAME3= <>
##$TPNAME4= <>
##$TPNAME5= <>
##$TPNAME6= <>
##$TPNAME7= <>
##$TPOAL= (0..7)
0.5 0.5 0.5 0.5 0.5 0.5 0.5 0.5
##$TPOFFS= (0..7)
0 0 0 0 0 0 0 0
##$TUNHIN= 0
##$TUNHOUT= 0
##$TUNXOUT= 0
##$USERA1= <user>
##$USERA2= <user>
##$USERA3= <user>
##$USERA4= <user>
##$USERA5= <user>
##$V9= 5
##$VALIST= <valist>
##$VCLIST= <CCCCCCCCCCCCCCC>
##$VD= 0
##$VDLIST= <DDDDDDDDDDDDDDD>
##$VPLIST= <PPPPPPPPPPPPPPP>
##$VTLIST= <TTTTTTTTTTTTTTT>
##$WBST= 1024
##$WBSW= 4
##$XGAIN= (0..3)
0 0 0 0
##$XL= 0
##$YL= 0
##$YMAX_a= 1185643264
##$YMIN_a= -1582594.048
##$ZGOPTNS= <>
##$ZL1= 120
##$ZL2= 120
##$ZL3= 120
##$ZL4= 120
##$ABSF1= 10
##$ABSF2= 0
##$ABSG= 5
##$ABSL= 3
##$ALPHA= 0
##$AQORDER= 0
##$ASSFAC= 0
##$ASSFACI= 0
##$ASSFACX= 0
##$ASSWID= 0
##$AUNMP= <proc_1d>
##$AXLEFT= 0
##$AXNAME= <>
##$AXNUC= <off>
##$AXRIGHT= 0
##$AXTYPE= 0
##$AXUNIT= <>
##$AZFE= 0.1
##$AZFW= 0.1
##$BCFW= 1
##$BC_mod= 2
##$BYTORDP= 0
##$COROFFS= 0
##$CY= 15
##$DATMOD= 1
##$DC= 2
##$DFILT= <>
##$DTYPP= 0
##$F1P= 0
##$F2P= 0
##$FCOR= 0.5
##$FTSIZE= 0
##$FT_mod= 4
##$GAMMA= 1
##$GB= 0
##$INTBC= 1
##$INTSCL= 1
##$ISEN= 128
##$LB= 0.3
##$LEV0= 0
##$LPBIN= 0
##$MAXI= 10000
##$MC2= 0
##$MEAN= 0
##$ME_mod= 0
##$MI= 0
##$NCOEF= 0
##$NC_proc= -9
##$NLEV= 6
##$NOISF1= 0
##$NOISF2= 0
##$NSP= 1
##$NTH_PI= 0
##$NZP= 0
##$OFFSET= 14.34409
##$PC= 1
##$PHC0= 0
##$PHC1= 0
##$PH_mod= 0
##$PKNL= yes
##$PPARMOD= 0
##$PPDIAG= 0
##$PPIPTYP= 0
##$PPMPNUM= 2147483647
##$PPRESOL= 1
##$PSCAL= 4
##$PSIGN= 0
##$PYNMP= <proc.py>
##$REVERSE= no
##$SF= 90.2741640989655
##$SI= 8192
##$SIGF1= 0
##$SIGF2= 0
##$SINO= 400
##$SIOLD= 32768
##$SPECTYP= <>
##$SREGLST= <1H.CDCl3>
##$SSB= 0
##$STSI= 0
##$STSR= 0
##$SW_p= 1497.18866228788
##$SYMM= 0
##$S_DEV= 0
##$TDeff= 0
##$TDoff= 0
##$TI= <>
##$TILT= no
##$TM1= 0
##$TM2= 0
##$TOPLEV= 0
##$USERP1= <user>
##$USERP2= <user>
##$USERP3= <user>
##$USERP4= <user>
##$USERP5= <user>
##$WDW= 1
##$XDIM= 8192
##$YMAX_p= 1185643008
##$YMIN_p= -1582592
##$CURPLOT= <PDFCreator>
##$CURPRIN= <$PDFCreator>
##$DFORMAT= <normdp>
##$LAYOUT= <+/1D_H.xwp>
##$LFORMAT= <normlp>
##$PFORMAT= <normpl>
##$SURQMSG= 1
$$ End of Bruker specific parameters
$$ ---------------------------------
##XUNITS= HZ
##YUNITS= ARBITRARY UNITS
##XFACTOR= 0.182762287876938
##YFACTOR= 1
##DELTAX= -0.182762287876938
##NPOINTS= 8192
##FIRSTX= 1497.0059
##FIRSTY= 60416
##LASTX= 0
##MAXY= 1185643008
##MINY= -1582592
##XYDATA= (X++(Y..Y))
8191F0416J61280k3040q2944b02752n27872C56864g42400a94048F88640H0896
8180H02816d22912B03264e73440A50528b32960I43616k10432a51552G85920l43040
8170D42880k03776d61824c6864F13888c66592F32320l3280a54624l15392A89440
8159H51456l62496J24928n632A84320f72768E38112J22880l00032K97984a76128
8148G19872b28864G79264c07712H52480b08384n79072B9696P26528C56864c34336
8137A97632q9600R24672A16736Q83712f60480G08608n1200F9120f6048n6320G91552
8125b01728D20352e63200A102336g38816D65408A97120M06016c51232m72576B25792
8114a36192k37568K048B84672j6384a31072A76640N53472l16416n8368a28512
$$ plain form
8191 60416 221696 198656 115712 -202752 -730624 356864 -742400 -194048 688640 80896
8180 802816 -422912 203264 -573440 150528 -232960 943616 733184 -151552 785920 442880
8170 442880 239104 -461824 -36864 613888 -366592 632320 599040 -154624 -470016 189440
8159 851456 488960 613888 608256 184320 -672768 538112 660992 360960 658944 -176128
8148 719872 -228864 779264 -307712 852480 -208384 -787456 29696 756224 356864 -334336
8137 197632 108032 1032704 116736 1000448 -660480 708608 657408 69120 -66048 -122368 791552
8125 -201728 420352 -563200 1102336 -738816 465408 197120 603136 -351232 -823808 225792
8114 -136192 -373760 -371712 284672 268288 -131072 176640 730112 413696 355328 -128512
8103B75456A00864a92000B3040Q6016f11328D77184n4272b76480k2528C57888
8092D21888b62656j32096F41536P79776a7408B36544J13664f58432K69824A229824
8081F42560G6288a26976n03808C75808a166848c37408m57216G14752o2976c45600
8070I07264g7312j65376A091072C72224j32096K73920B35520e29408j49504b59584
8059B29376a74592o22592d4544k09408F62528j95072j7408a59232k25792A8944
8048G16288n4784c44064m92032A84320p2704d22400H89344l14368d08576J79712
8038b28864A27488M44416e16608a04960C7376M95104c52256m0448C56864c00032
8027F66624B19648B8160e2736A40800b96448r5744A03424k0992c29216j84320
$$ plain form
8103 275456 100864 -192000 23040 109056 -611328 477184 422912 -276480 -299008 357888
8092 421888 -262656 -394752 641536 1421312 -17408 236544 350208 -658432 -388608 1229824
8081 642560 76288 -126976 -630784 375808 -1166848 -337408 -794624 714752 651776 -345600
8070 907264 -77312 -242688 1091072 372224 240128 514048 235520 -529408 -678912 -259584
8059 229376 -174592 -797184 -44544 -253952 662528 467456 450048 -159232 -385024 18944
8048 716288 661504 -344064 -836096 184320 111616 -422400 889344 574976 -408576 -228864
8038 -228864 127488 571904 -516608 -104960 37376 532480 -352256 -392704 356864 -300032
8027 666624 219648 28160 -52736 140800 -296448 -392192 103424 82432 -329216 -513536
8017e13536H60160e88800D38272n8880A71520b27328B17600l7888K71360h7552
8006b11968k12992o78912E50912f144q94976H70912C80416h3968A21856J365504
7996A487360l53280C4816L76320P88992k85696C16416N97504a52064j81248G45472
7985d08576m81280B41664d3008A60256h24320C70176o7072c23072A37728K27840
7975C65568i728p44448L4304B11968H5504b65728l49184b47296j84320A87904
7964F36416P3728I7280M62848B66752B4064a88416C33312M62848A9968h2432p04512
7953g86944C73760P37280A04448L4304a03936A734144A56672d22400i2672A262080
7942a529856a48480p2704C85024l6352c93216G94624a76640A173504k15552b97472
$$ plain form
8017 -513536 860160 -588800 438272 379392 171520 -227328 217600 179712 451072 -87552
8006 -211968 -424960 -1103872 550912 -6144 -901120 870912 380416 -83968 121856 1487360
7996 1487360 1134080 34816 411136 1200128 914432 316416 913920 -152064 -333312 745472
7985 -408576 -889856 241664 -43008 160256 -824320 370176 303104 -323072 137728 365568
7975 365568 -9728 -754176 -719872 211968 85504 -265728 -614912 -247296 -431616 187904
7964 636416 710144 97280 560128 266752 24064 -188416 333312 796160 19968 -82432 -786944
7953 -786944 373760 1111040 104448 138752 -103936 1734144 156672 -422400 -92672 1262080
7942 -1529856 -148480 -221184 385024 348672 -393216 794624 -176640 1173504 957952 -297472
7931f49728H43776N14048d20864C25632b31936r12384A11104K49856L22048l16928
7921C66080b73920J26464A154048D29056j40800L76320i7792n50912K86720J06496
7911b55488O7072m48512B98496c03104E59616q0384F5536a59232l63008Q5504
7901d36736H18176L4304a21344n36576k70848d18304b08896l93728H30976d20864
7890g20896L04640j56160E40672d34176a65376c0720j23904O2464P680J2288C27168
7878b90816R0112H07936a99680I97888Q7040C06176O6048b80576i8816F72256
7867A82784J62816a189888b17088r2160M608k92352j16736c42528B68800a13152
7856D64384Q17152m95104q0896c51232B03776c74272a39776F32832o4512P01952
$$ plain form
7931 -649728 843776 1357824 -420864 325632 -231936 -1144320 111104 360960 683008 366080
7921 366080 -273920 -147456 1154048 429056 288256 664576 -97792 -648704 -361984 -255488
7911 -255488 -188416 -636928 298496 -303104 559616 479232 65536 -159232 -522240 -436736
7901 -436736 818176 852480 -121344 -657920 -928768 -418304 -208896 -602624 830976 -420864
7890 -720896 -416256 -572416 540672 -434176 -165376 -30720 -154624 -92160 -84480 -72192 327168
7878 -290816 -200704 807936 -199680 997888 1084928 306176 372224 -280576 -98816 672256
7867 182784 345600 -1189888 -217088 -309248 -304640 -596992 -713728 -342528 268800 -113152
7856 464384 1281536 786432 705536 -351232 203776 -374272 -139776 632832 568320 1270272
7846A270272B95936O0928g2704k25792C03616L83488c80928E03296I7792a006592
7835a68448k11456F08256O8608A51040a40288C13856g8336A83296K32960c42528
7824c2768a2288G19360A77664P00928c39968B6624a84832E03296f91712c12832
7813D35200M1984a62304p84384E81120R27232m59264C38944I7792J87904J2288
7803B97984J411072b72896I3696d2496B08896H2944c97312A889280F6048b25280
7792g90016C71712I7792a71520m13696B21184J62816c48160a69472o20544L91680
7782c98336B14016h75520h4480k3040B24256M70016A7920K27840L88608b14016
7771F99904i9328B37568J46944O0928f02112C90144B7648K31936c1232A035776
$$ plain form
7846 1270272 295936 356864 -72704 -298496 303616 687104 -380928 503296 97792 -1006592
7835 -168448 -379904 608256 676864 151040 -140288 313856 -78336 183296 416256 -342528
7824 -32768 -12288 719360 177664 878592 -339968 26624 -184832 503296 -691712 -312832
7813 435200 477184 -162304 -946688 581120 1508352 1049088 338944 97792 285696 297984
7803 297984 1709056 -272896 93696 -42496 208896 82944 -397312 1889280 66048 -225280
7792 -790016 371712 97792 -171520 -585216 221184 384000 -348160 -169472 -790016 -398336
7782 -398336 214016 -875520 -84480 -107520 224256 694272 17920 245760 634368 -214016
7771 699904 -99328 237568 384512 445440 -602112 390144 27648 259584 -31232 1035776
7760G16800Q4480D6080J62304b34496D22912a67936A46432P75168C10272e72928
7749b54976A28000i17504b94912j44896E05344D6592N87776J0240K29376l27680
7739E46304b65216A217536D34176g19360H6016Q81664a73056F25664B23744P01952
7729I25696i0112E16096O93248i5232j021440g0656k80064A2288c02592j30048
7719d32640n39136H47360B37568m608N25312A49504K27328e80096e8368D74112
7708G31136e05856D38272j69984l8912L06688A80224A8432K38592k6624N1712
7698B82112H8576c57888B7648N6320b23232A17760f37952C13856g13728r0112
7688h03840F16960g26016m40832c64544A99168O17984B35008d20352B47808N03296
$$ plain form
7760 716800 801280 46080 208384 -234496 422912 -167936 146432 921600 310272 -572928
7749 -254976 128000 -917504 -294912 -439808 505344 46592 634368 644608 873984 546304
7739 546304 -265216 1217536 434176 -719360 86016 967680 -173056 625664 223744 925696
7729 925696 -90112 516096 1209344 -95232 -1116672 -70656 -350720 12288 -302592 -432640
7719 -432640 -971776 847360 237568 232960 758272 149504 376832 -580096 -58368 474112
7708 731136 -505856 438272 268288 229376 536064 180224 18432 257024 230400 282112
7698 282112 88576 -357888 27648 83968 -223232 117760 -637952 313856 -713728 -803840
7688 -803840 616960 -726016 -1166848 -364544 199168 817152 235008 -420352 247808 751104
7678G51104f38976h4992o69696j71008a86880E07392A13152L34848b14016H24832
7667G26528G680b49344D39808k16064r728M70016G0656J120256i7280b560j56672
7656a59232B59584c60448C29728g23456N4784H6528a37216m5568d0960E50400
7645B49344K13504j61280J12128O34880K87744j11104g11168a17248j40800r2160
7635c50208H72960e92896H75520h57088I6256d21376F44608B22720J45408J67424
7625E35552c48160A99680d4032C89632Q3968q9600J36192K19136n12j76128d89984
7613A79200J89440G5264d10624A284096h3456r2160i216j58208n36576j00864
7603h04864c93216m62848M14720B39104a67936B75456O2976Q57088k97984e46304
$$ plain form
7678 751104 -638976 -84992 -754688 -925696 -186880 507392 113152 448000 -214016 824832
7667 726528 7680 -249344 439808 223744 214016 684032 70656 1190912 -97280 -2560 -159232
7656 -159232 259584 -360448 329728 -723456 -668672 86528 -137216 -182784 -40960 550400
7645 249344 462848 301568 413696 1048576 1336320 1225216 -711168 -117248 -258048 -350208
7635 -350208 872960 -592896 875520 -857088 96256 -421376 644608 222720 368128 535552
7625 535552 -348160 199680 -44032 389632 473600 384000 520192 739328 738816 562688 -489984
7613 179200 368640 75264 -410624 1284096 -83456 -175616 -9216 -167424 -704000 -804864
7603 -804864 -393216 -856064 -441344 239104 -167936 275456 338432 1195520 897536 -546304
7592a51552r17504H704c17440F47680A25440b20160E51424a226752F0928L07200
7582C68128A21344C9424M82816A69472d83840j10592b03776k60608I20576b73920
7571A202176f2976B20672J10080M45952J06496D04480c98848b8160D53632A09568
7560e78048b86720C39968J23392d58752Q9600F23616L75296C67104b52416k26816
7550d79232A82784e53984A4336K67264c67104D21376j68448J87392a051136E1200
7539b49344J024F33856B83648A29024J84832f79936L36896J46432E60128L02592
7529H62720A58720P48544h94464B89792q4480L70176b66752G66464l45088M04480
7519H25856d12672a94048k33472Q3968m13184H21760C28704Q4480e18656D74112
$$ plain form
7592 -151552 -1069056 8704 -317440 647680 125440 -220160 551424 -1226752 60928 368128
7582 368128 121344 39424 522240 169472 -483840 -594432 -203776 -464384 920576 -273920
7571 1202176 -62976 220672 330752 776704 883200 404480 -398848 -28160 453632 109568
7560 -578048 -286720 339968 463360 -458752 -369152 623616 998912 367104 -252416 -479232
7550 -479232 182784 -553984 14336 281600 -367104 421376 252928 440320 -1051136 51200
7539 -249344 -248320 633856 283648 129024 313856 -679936 -343040 -196608 560128 862720
7529 862720 158720 907264 -894464 289792 205312 575488 -266752 766464 421376 825856
7519 825856 -412672 -194048 -427520 -343552 -756736 821760 328704 413184 -518656 474112
7508b89792n57568C48672a08032E01248B04288J196544D27520M33152E6320P60320
7498H16640K11456d21888c072D21888l7376J46944J18784d11136M0960I08800
7487D40832A31072f75840H0384L50720h38144L77856C8400N55520c68128B03264
7476b83648B37056d11648H76544J99680m22912a99680l86560k32960K9696I66144
7465a33632B52928J00352L4816A37216b7136B07360c46112C79392A26976b27840
7454B06848M71552g6288k42688D46464r728a74592I66144C65056e99040B58560
7443D5568e42208I2160M27520e76000D11136B02752c16416E20192c74784o0416
7433d35200A75616M97152e84192A211392D20864j72032P94624A83808O13376l072
$$ plain form
7508 -289792 -847360 348672 -108032 501248 204288 1400832 427520 860672 56320 816640
7498 816640 1028096 -421888 -3072 421888 384512 531456 650240 -411136 -370176 908800
7487 440832 131072 -675840 80384 431104 -838144 -460288 38400 593920 -368128 203264
7476 -283648 237056 -411648 876544 1076224 653312 -199680 -586240 -819200 -789504 966144
7465 -133632 252928 353280 388096 137216 -27136 207360 -346112 379392 126976 -227840
7454 206848 678400 -76288 -318976 446464 436736 -174592 966144 365056 -599040 258560
7443 45568 -542208 92160 519680 -576000 411136 202752 -316416 520192 -374784 -435200
7433 -435200 175616 672768 -584192 1211392 420864 248832 1043456 183808 797184 794112
7423G94112H704L70688J30560f09280B78016K05824j08032b67776A91488M43392
7413F34880b72896D46464i6256j97120G19360B72896O25152D1984a08544A015808
7402B2016K21696a53088k52928H9088M91520L81952l54816K05824f14400A017344
7391b95936C18464K07872j80224O01600D40320M09600B59584c04128H8064e11488
7380F96832n4784L584f62528E06880c40480k84672D73600d73088B71360H7040
7369F16960b35008A18272R74336E22240a22368F36416a53088G06560K99520D47488
7358H19712B40128M81792k80064j12128c5840k04288C8400Q26880d23936n632
7348d29568G94112A43872J29536p1680g680l91680J20832I26208d68480F77376
$$ plain form
7423 794112 8704 379392 509952 -609280 278016 483840 375808 -267776 191488 634880
7413 634880 -272896 446464 -96256 -293376 719360 272896 898048 41984 -108544 1015808
7402 22016 243712 -153088 -406016 89088 580608 962560 607744 813568 -614400 1017344
7391 -295936 318464 526336 346112 947712 440320 849920 259584 -304128 88064 -511488
7380 696832 642048 645632 -662528 506880 -340480 -625152 473600 -473088 271360 87040
7369 616960 -235008 118272 1092608 522240 -122368 636416 -153088 706560 1006080 447488
7358 819712 240128 721920 441856 329728 -35840 -240128 38400 865280 -423936 -429568
7348 -429568 794112 143872 273408 201728 -7680 -399360 -278528 926208 -468480 677376
7337D90496d5568A33120O71232j20320e05856A040384C43552F9632c85024H58112
7326h8576G8336a052672a96096F62528A61280L27680k25792K40128c43552O9120
7316b74432A729024G39840a76128m8640m6080I3696M32128A19808J73568i40544
7305a51040I83552k42176D7104g0144B14016J190912B62656g00928L38944H30976
7294B03776K7136K30400c26144H0384J10592Q2944M33664a39776N7344k15552
7284b97984B01216R216q3968b17088M4032B36544l4304J38752m096O92224a94560
7272a389056K40640F7584J124864n78048J71520A66400K67264N79584r6768k44736
7262F71744a88416A1264d0960D66944K73920F0928K3040N46816E5296a89952L8912
$$ plain form
7337 490496 -45568 133120 804352 684032 -505856 1040384 343552 69632 -385024 858112
7326 -88576 78336 -1052672 -196096 662528 161280 488960 263168 503296 -343552 -274432
7316 -274432 1729024 739840 -176128 -224768 -270848 93696 525824 119808 293376 -940544
7305 -151040 983552 741376 47104 -70144 214016 1404928 262656 -700928 -361984 830976
7294 203776 230912 461312 -326144 80384 190976 273920 707584 -139776 -82432 -297984
7284 -297984 201216 210432 126464 -217088 -173056 236544 202240 340992 336896 1029120 -194560
7272 -1389056 -1148416 67584 1192448 614400 785920 166400 433664 1013248 916480 671744
7262 671744 -188416 11264 -40960 466944 740864 60928 83968 630784 55296 -189952 -151040
7251a51040E41696h20736c6864G81312B02752e02784C52768J086464d6592K0480
7241b6112C08224Q5504j21856g39328i728B63680d21888H54016A16736M75136
7231E91872L14368k75456J5872B74432k1504L50720B45760K12992J69984j1776
7221F16960Q70400o91712B45248G4240c18464D43392g4752A040896D88960c00544
7210H09984a68960D43904J46944G3728N65760L33824e42208H21760l91680n12
7200D29568K68288J75104b47296G42400n4784e9392F77376A83808N78560A13152
7189I42592M608K50880A79712a31584A88416f93760H91904B97984L05152n9392
7179E43744K76480K44224B18624R728J18272I2160L9936P36256b89280E58080
$$ plain form
7251 -151040 541696 -820736 -36864 781312 202752 -502784 352768 1439232 -46592 -26112
7241 -26112 308224 393728 271872 -739328 -9728 263680 -421888 854016 116736 591872
7231 591872 906240 630784 646656 274432 252928 603648 245760 458752 628736 616960
7221 616960 1487360 795648 245248 74240 -318464 443392 -74752 1040896 488960 -300544
7210 809984 -168960 443904 590848 73728 639488 973312 -542208 821760 430080 429568
7200 429568 697856 872960 -247296 742400 687616 -59392 677376 183808 762368 113152
7189 942592 947200 1198080 179712 -131584 188416 -693760 891904 297984 603136 543744
7179 543744 820224 1064448 218624 228352 346624 92160 132096 868352 -289280 558080
7168a11104o11840J23904E14560c70688B47296B3040b9184o78400G680d06016
7157A74080P90016a29024I04192M76672C33824P5264k7648J06496L63520h22784
7146E05856a18272r58976A072640D43392r4720A21856c1744l6864E55520e09952
7135F87104k58560M08576k76992j3824J09568J81248C06176b72384B18112R7280
7125C15392k1504N82144D16768A93536O80960L95776l48672B18112J70496i216
7114A568256n69856e3760A20832g16288F77376J057792A43360M91008K9696O02624
7104A266688c88096I8304a08032F88640D0960O65600e50400j08544E89824i06240
7093B27328J275904J96096g0144H01280L85536b34496C6352Q89344A9456e79584
$$ plain form
7168 -111104 -722944 -599040 514560 -370688 247296 23040 -29184 -707584 7680 -406016
7157 174080 964096 -129024 904192 1380864 333824 409088 381440 487936 851456 -822784
7146 505856 -118272 -1077248 1072640 443392 348672 121856 -31744 -68608 555520 -509952
7135 687104 428544 837120 560128 546304 655872 837120 306176 -272384 218112 315392
7125 315392 293888 876032 416768 193536 874496 1270272 921600 218112 388608 -9216
7114 1568256 998400 -53760 120832 -716288 677376 1735168 143360 634368 664064 1266688
7104 1266688 -388096 98304 -108032 688640 40960 706560 -550400 -658944 589824 -906240
7093 227328 1503232 1699328 -70144 801280 1186816 -234496 36352 925696 19456 -579584
7082i31328B220544E4784M13696K57024k84672H4992L61984A75616l9424L06176
7072D42368j41824M01920B81088b75456o15424A1264M53632A79200N24288B20672
7061F31808k01728c6864k20672P8336A147904a47456G68000h56064a75104A19808
7050D88448N74976C02592d33152A62304d90496A048576M6080D39808A73568R06752
7040A080320d01408G04512A71008K65216j09568e99552A689088G03488h31488
7030A229312D2496d08064A714176B44736J35680N00224N53472a62304h704C01568
7019C31776J08032b78528B69824c46112o4512a536o20544D34176J69472j61280
7009D42368j69472d14208a83296G6800O77888M67456B19648c11296B81088M92032
$$ plain form
7082 -931328 2220544 54784 468480 725504 440832 84992 446976 175616 136192 442368
7072 442368 300544 702464 281088 -275456 -890880 11264 464896 179200 703488 220672
7061 631808 430080 -36864 -257536 -179200 1147904 -147456 768000 -856064 -175104 119808
7050 488448 1063424 302592 -433152 162304 -490496 1048576 1094656 439808 173568 1080320
7040 1080320 -401408 704512 171008 436224 326656 -599552 1689088 703488 -831488
7030 1229312 42496 -408064 1714176 244736 380416 880640 1434112 -162304 -8704 301568
7019 331776 439808 -278528 269824 -346112 -410624 -1536 -622080 434176 603648 442368
7009 442368 272896 -414208 -183296 76800 754688 1222144 219648 -311296 281088 773120
6999G73120j51552b82112B91840Q50944A84320M01920g168l34336k560j69472
6989e13536a3312j53088I0112O15424a19296D91008L89120A73056J62304J71520
6979E06880j19296c52768A285632E67808J45408J13152A22368M21376N22240J0240
6969A076224b7648H91392b62144l07200E26848J63328l43040A32608R73312c63008
6958G9872M99200g3728B79040M8128K78528k78016j18272d65920b31424B58560
6947A255936l99360b89280F74304l28704R4720e1200I71776a219584D20864J017344
6937A438208b93376O8608E09440L64032l9424j88416j53600M01408b70848C72736
6926E35040K20160k03264a81760j16224E70368E4784P32672d81280I14432d99712
$$ plain form
6999 773120 621568 -282112 291840 1142784 184320 586240 -7168 -341504 -344064 -513536
6989 -513536 -13312 -166400 90112 705536 -119296 491008 880128 173056 335360 506880
6979 506880 387584 -352768 1285632 567808 713216 826368 122368 543744 1065984 1076224
6969 1076224 -27648 891392 -262144 -569344 526848 690176 347136 132608 1105920 -363008
6958 79872 579072 -73728 279040 327168 605696 327680 209408 -465920 -231424 258560
6947 1255936 856576 -289280 674304 345600 440320 -51200 971776 -1219584 420864 1438208
6937 1438208 -293376 -224768 509440 873472 834048 645632 492032 893440 -270848 372736
6926 535040 755200 551936 -181760 -297984 570368 54784 787456 -481280 914432 -499712
6915A558528a83296H9600h192F87616k17600J13152g2192b4064n70368I48736
6904d29568A201664l58912d95616E34528N7344k76480P95648A03424J402368I728
6893D06528a73568o02624i0112G79776l7888g5264C19488G3216N02272l0720L89632
6882I34400o0928j14176P5264a187328D51072h2432D62848O78912a28000G74656
6871D06528B03264a99680P4240E52448i5744G48544b20672m97152a25440A005056
6860A232896i75872H35072f27200d7104A61280M95616P94624E89824i7792I60000
6849A145344j67424m74112M8640A37728P40352e15584A431040n16096l04640J85856
6839G96160B73408L16928J435136D48512c36896B02752l9936d09600a1264A13664
$$ plain form
6915 1558528 -183296 89600 -8192 687616 470016 583168 -72192 -24064 -594432 948736
6904 -429568 1201664 842752 -495616 534528 591872 315392 1111040 103424 1505792 9728
6893 406528 -173568 -776192 -90112 779776 741888 -75264 319488 73216 575488 544768 934400
6882 934400 873472 759296 834560 -1187328 451072 -82432 462848 1141760 -128000 774656
6871 406528 203264 -199680 -125440 552448 -95744 748544 -220672 -717824 -125440 1005056
6860 1232896 -975872 835072 -627200 -47104 161280 656896 1451520 589824 -97792 960000
6849 1145344 977920 503808 552448 137728 878080 -515584 1431040 914944 610304 796160
6839 796160 273408 590336 2025472 448512 -336896 202752 162816 -409600 -11264 113664
6828H6528P16800b05824E13536j73568j38752K73920a75616A243648D77184a16224
6817E65760A38240h82176G39840d9152C04128J39776f11328A10592o656O75328
6807G79264d41344b0992A93024P57248c40480F9632L07712O656A67936J90976
6797C58912P36768m50560d62336B07872d01920G82848g36256F86080b16064C80928
6786e26848F34880A29536N40672Q79616m96128q1920c14368D3520i7792F92224
6775A385984k51392m57216G9360g65440H45824j63840j06496J69984B18624J91488
6765D10112k6624P37280j79200c15392I63072c09760A202688J9968l20000a78688
6754D36224M06016C60448J96608f0928C18976e0688j05472A178112N1200C26656
$$ plain form
6828 86528 803328 -205824 513536 339968 201216 475136 -175616 1243648 477184 -116224
6817 565760 138240 -882176 739840 -49152 304128 443904 -611328 110592 103936 779264
6807 779264 -441344 -20992 193024 950272 -340480 69632 377344 384000 167936 358912
6797 358912 1095680 645120 -462336 207872 -401920 782848 -736256 686080 -216064 380928
6786 -526848 634880 129536 670208 1549824 1053696 971776 -314368 43520 -97792 692224
6775 1385984 1134592 677376 79360 -765440 845824 681984 575488 745472 218624 410112
6765 410112 383488 1120768 941568 -315392 963072 -309760 1202688 1222656 902656 -178688
6754 436224 842240 360448 557056 -60928 318976 -50688 -156160 1178112 1229312 326656
6743E82656N58592j61792C55328J160192a01376A142784l78368j76128B19136
6733A229824D5056J146880G5264j3312L97312J37728j75616M28544a51040g4240
6722F93760g43424B11968b560D58240j29024L77344a40288I07776a11616E30432
6711A043456n8880k48320c22048A080832L89632I0624L76832j39264l5328Q59136
6701A152000j64864b8160H90880L73248E72416k49856c34848A7920R22112D64384
6690F70208A03936N62176P95136a37728j68448A21344J096192C88608g1168A5872
6679e632G30112b05312n3760e3760B75456m4032J01888O52800A22368J113088
6669A235456B00192J245696F07744k32448J69984a82272D16768K9184e33504D27520
$$ plain form
6743 582656 1141248 979456 355328 1515520 -101376 1142784 764416 588288 219136
6733 1229824 45056 1191936 75264 61952 459264 596992 421376 849920 -151040 -74240
6722 693760 -743424 211968 -2560 458240 329216 706560 -140288 907776 -111616 530432
6711 1043456 984576 736256 -322048 1080832 1470464 90624 467456 328192 292864 1152000
6701 1152000 987136 -28160 890880 1264128 572416 322560 -334848 17920 940032 464384
6690 670208 103936 666112 1461248 -137728 -306176 121344 1217536 388608 -71168 15872
6679 -5632 730112 -205312 -259072 -53760 275456 231424 333312 986112 122368 1235456
6669 1235456 200192 1445888 607744 375296 545280 -182272 416768 445952 -533504 427520
6658e30944E79584M11136f46656a8432A100800b51904N1200B6624L39456K46272
6648F12352k43712K62144J64352j85856j58720A24416K74944j73568L2768O55872
6638I14432b0992H73472l66592b82624B048N5808e23776A39776J17760j1776I7792
6626E79072k5600J66400K93376C29216a65376D34688a123840E74464b65216A208320
6615E42208b17088B01216M06528I7792Q00256c03616f5024j47456H62720D07040
6604b37568H8064L1232J175552a23392C30240O53312E8368K35520P19872a07520
6593A395712A32608J50528J234944d78720A6384Q62208b41152C10272A16224L19488
6583D35712R56416C80928O86592r0112@F04672k04800J231360D86912K87744a80736
$$ plain form
6658 -530944 579584 990720 -646656 -18432 1100800 -251904 -200704 26624 366080 612352
6648 612352 368640 630784 795136 609280 450560 124416 399360 225792 258560 914432
6638 914432 -20992 873472 506880 -282624 2048 57856 -523776 139776 257536 245760 97792
6626 579072 553472 719872 1013248 329216 -165376 434688 -1123840 574464 -265216 1208320
6615 542208 -217088 201216 607744 97792 898048 -303616 -65024 -212480 862720 407040
6604 -237568 88064 119296 1294848 -123392 330240 983552 58368 293888 1013760 -107520
6593 1395712 132608 283136 1518080 -478720 16384 878592 -241152 310272 116224 435712
6583 435712 1392128 380928 1067520 977408 0 604672 399872 1631232 486912 774656 -180736
6571B35520A9968J371648n15072D25984i216o33344I7280J84832p168n9392Q1920
6560B97472N49888O62528C42528J40800N76512D71040a36704A070592D62848J46944
6550F09792M72576C86048M85888l2768j33632K99520l76832K62656j41312d096
6539C07200b560A516544a00352c4816m58752A41824J055744C58912O28736j34656
6529H52992c12320A241088m1984p6288A83808n7856J34144b64704E51424B45760
6518F83008C23072b8672A120768D29568N73440o5024l45088j60256R22112K31424
6508A586176o69184C20512b24768C03104O49728l86048c30240A206272l36896
6499H69376K06848l55328m6080K48832J017344E5296R61536l3792L92192E27872
$$ plain form
6571 235520 19968 1391616 876544 425984 -9216 -642560 97280 282112 274944 215552 297472
6560 297472 847360 1509888 342528 483328 1059840 471040 -136704 1070592 462848 609792
6550 609792 1082368 386048 871936 839168 705536 1005056 628224 890880 749568 -4096
6539 307200 -2560 1516544 -100352 -34816 -493568 141824 1197568 358912 987648 852992
6529 852992 -312320 1241088 1199104 1122816 183808 125952 260096 -264704 551424 245760
6518 683008 323072 -28672 1120768 429568 1003008 937984 592896 432640 1354752 1586176
6508 1586176 916992 320512 -224768 303104 952832 566784 -330240 1206272 869376
6499 869376 1076224 720896 674816 923648 1940992 55296 1016832 983040 1375232 527872
6488A092608d57216F8096e1200G59296J202176E39648J098240G34720k25280P34720
6478A244160l83488a4336D68480b69824C52256A05984l6352N83680B16064J87904
6468D03968J53600J84320N88288l82464C57376K33472M17792c7888I79456n632
6458I73824D07552J157120C71712b16576I65120k45760b52928A755136D24448
6448A302528k35520q4480C47648N48352E2736K97472L13344b32960I68704l21024
6438F47680q7552R44128D73600a71520A21344O13376j36704b82624I51296D49536
6427H38144j33120C40992R54368I6256N6320Q97024a78176I7792J095680l56864
6417H36608J43360R4208m83840p168A58720M3008J071616A14688R14944J81760
$$ plain form
6488 1092608 -457216 68096 -51200 759296 1961472 539648 1637888 734720 509440 1244160
6478 1244160 860672 -14336 468480 -269824 352256 105984 69632 653312 216064 403968
6468 403968 557568 741888 1330176 947712 357376 590848 1008640 -37888 979456 973824
6458 973824 407552 1564672 371712 -216576 965120 719360 -252928 1755136 424448
6448 1302528 1067008 982528 347648 896000 52736 350208 663552 -232960 968704 647680
6438 647680 560128 1504256 473600 -171520 121344 734720 598016 -282624 951296 449536
6427 838144 705024 340992 1295360 96256 152576 1049600 -178176 97792 1193472 836608
6417 836608 979968 1074176 590336 583168 158720 201728 1273344 114688 1029632 1211392
6407A211392k94912h3968A3312M55168R66656e3248A09568L3280L33312A64864
6396F4512O55872L59424k43200k51904d5568m5056F92736e02784C03616J132544
6386A436160m46976O99904A84832J81248j54624p7312M45440b57024C54816Q43264
6376A198080E70880L04128C94752J372160B51392a07008C75808Q5504M33152a76640
6365H192M47488r3696F3488J261568c32800J54624E02784M3008J56672O80960
6355A383424d63360G90016B47296Q73984E25312O90688D46976A68960J216512
6346A385472Q8064j74080A31584J28000L06688b47296F44096A42848K20672J61792
6336E25312Q704c71712E87264P4240M28032K24256C31264K71872M60288B04800
$$ plain form
6407 1211392 916480 -83968 13312 468480 1435136 -53248 109568 142848 476160 164864
6396 64512 720384 1079808 836608 584704 -45568 -90624 692736 -502784 303616 1436160
6386 1436160 989184 1689088 184832 366080 211456 134144 579584 -257024 354816 1198080
6376 1198080 570880 875008 394752 1766912 251392 -107008 375808 461312 894464 -176640
6365 8192 455680 361984 63488 1325056 -332800 -178176 502784 545792 702464 1383424
6355 1383424 -463360 790016 247296 1121280 525312 1216000 446976 168960 1385472
6346 1385472 1473536 1299456 131584 259584 566272 -247296 644096 142848 363520 525312
6336 525312 534016 -371712 587264 661504 1089536 1313792 331264 603136 1063424 204800
6325A057792A31072K85696J3824a77664A56672R9328k7648a69984A785344H39680
6314e7344A191424J01888q6528K09920n45792d22400A461248F05184A33632O74816
6304H08448k15040j32096j00352N94432k52928P19872F46656A54112R30816K62144
6294A347072R8816F99392h2944D64384J067520C71712A03424J009152G2192L25632
6284C97824j85344J82272R84064o58432r7792M6592K93376e42720B83136L14880
6274E98016P33696B71872R9840R96352c67616D62848N07392Q5504m50048M73088
6264A078784A03936N69856N1712c6864D76672a21856F64064J09056o5024k21696
6254D86400P44960K47296M98688E14048K93888O21568J29536i0112E79584j83296
$$ plain form
6325 1057792 131072 416768 430592 -177664 156672 256000 228352 -169984 1785344 839680
6314 -57344 1191424 1293312 1206784 1416704 870912 -422400 1461248 605184 133632 808448
6304 808448 593408 461312 360960 955392 702464 1422336 646656 154112 1084928 1347072
6294 1347072 1445888 699392 -82944 464384 1531904 371712 103424 1112576 72192 397824
6284 397824 212480 394752 1378816 720384 622592 669184 962560 -542720 283136 598016
6274 598016 1331712 271872 371712 1368064 -367616 462848 970240 1055744 605696 1078784
6264 1078784 103936 673792 725504 -36864 476672 -121856 664064 773120 708096 486400
6254 486400 1231360 1478656 1977344 514048 807936 1429504 1559040 -90112 579584 396288
6244C96288K82112d28544a46432G86432m1472L44576E19680j45920A74080Q68864
6234A042944C65568M59264J4848l44064j94048L31264B57024N86240k21184J88416
6224H10496d95104A196032m6592c7888D20864L36896l41504L90656o5024J00864
6214H42752k80064N65760D3520Q69888A536M78208J20320O43584a28000A80736
6203A17760a89952D27520d38272e9392F19520J03936N39136E92384a74592A317376
6192b59072A007104C70688J080832c59936A239040m82304K27328L73760l87072
6183I70752K10432D71040J21856A86368P65952e95968e120D89984K89280A73568
6172D47488P29600I7792J303040D85376l584c21536a58720A299968A47456O51776
$$ plain form
6244 396288 678400 -428544 -146432 786432 744960 1089536 519680 373760 174080 1042944
6234 1042944 365568 824832 839680 495616 301568 632832 257024 843264 622080 810496
6224 810496 -495104 1196032 1149440 -37888 420864 757760 416256 806912 741888 842752
6214 842752 562688 1128448 43520 913408 1536 479744 600064 1243648 -128000 180736
6203 117760 -189952 427520 -438272 -59392 619520 723456 1262592 592384 -174592 1317376
6192 -259072 1007104 370688 1451520 -359936 1239040 756736 984064 1357824 970752
6183 970752 1181184 471040 592896 186368 952320 -595968 -5120 489984 779264 173568
6172 447488 1177088 97792 1400832 485376 481792 -321536 -158720 1299968 147456 799232
6162G99232l17952N62176f8608A146880C13856B4576J034752D64384e87776D81792
6151I63584K65216D88960L73760O40000F21568Q28928m61312n4784J53600a32608
6140A302528j04448B36032M64384M0960O36416n63712Q15104B19136e2736F14400
6129A361920L35872G29600c8912A116672E02272L19488M56704D24448J419264
6120A843712G14240B91840L36384o1952J4848B14528J13152O38464N74464G69024
6109F49216K7136e61152I45664j56160N42208n53472J54624j62816k94912J018368
6099A493504C93728K39616J08032J62304@D63360I9328J313280A32096P97184
6089I29280j33120L072M33152k83136m13696N71392D8128K36032L73760l3280
$$ plain form
6162 799232 481280 1043456 -68608 1146880 313856 24576 1059328 464384 -587776 481792
6151 963584 1228800 488960 862720 1502720 621568 1450496 989184 934400 1088000 -132608
6140 1302528 1198080 236032 700416 741376 1377792 814080 1629184 219136 -52736 614400
6129 1361920 1697792 729600 -38912 1116672 502272 821760 1278464 424448 1843712
6120 1843712 714240 291840 628224 566272 581120 214528 327680 966144 1540608 769024
6109 649216 676352 -561152 945664 789504 1331712 778240 932864 770048 475136 1493504
6099 1493504 393728 633344 741376 903680 0 463360 99328 1412608 132096 929280
6089 929280 796160 799232 1232384 949248 535552 1106944 48128 284160 657920 624640
6079F24640k87232j35168P41888D21888J78688c072B05824B1504M27520J63328
6069F12352K39104P3216B88768M29568B69824M59776M38272n12000M50560D41856
6058A093120E40672O09792R42592p68000A68960N26336k39616J90464J017344
6049A663488B46272F5536M70528k54976N82144D22400A14176R7792J569280p37792
6039A043456k18112A66912J197568E56544K25280B86208J142784a28000A051648
6029E47840O46144m41856k37056N34016b60608B97984J009152D37248a01376I07264
6018H28928e01760E64736K54976k39616g1680C66592e1200A548800F8096K76992
6008C45088L58400c17952c8912F89664j55648A20832N36576k52928J310208J21344
$$ plain form
6079 624640 337408 202240 944128 421888 600576 -3072 205824 21504 449024 612352
6069 612352 851456 924672 288768 718336 269824 729600 1167872 655872 1106432 441856
6058 1093120 540672 1150464 2093056 1325056 168960 695296 455680 646144 1663488
6049 1663488 246272 65536 536064 281088 863232 422400 114176 211968 1781248 1043456
6039 1043456 825344 166912 1364480 556544 781824 286208 1428992 -128000 1051648
6029 547840 1193984 752128 515072 1049088 -260608 297984 1307136 437248 -101376 907264
6018 828928 -501760 564736 819712 580096 -71680 366592 -51200 1548800 68096 345088
6008 345088 703488 -317952 -38912 689664 534016 120832 657408 404480 1714688 1836032
5998A836032E99552O98880F22080L29216k51904b7136A31072J171968J25952G6800
5987F32320A04448M54144Q44288m41856J58208k52416L73248h6528F10816N63712
5977A174528D89472N76000K07872j52576q6528m67456J483264D27520o656d6592
5966F07232O63040J33632m56704l71712J80736l29216J40288P1680J97632J05472
5956I42080L64544n53472M6080B74944Q23808j64352M1984l20000A96096L12832
5946E08928o3488N55008m24448a90976D23936O43584K89280@F68160J99168L82464
5935A249792m43904N8368P23456k048p56736k39104g7824A197056m09600m3008
5925G44448j07520N29920K99008J58720E29920K20672J21856J82784J6384j10592
$$ plain form
5998 1836032 599552 1298432 622080 951296 699392 -27136 131072 1303040 1428992 76800
5987 632320 104448 558592 1402880 961024 1119232 866816 1240064 -86528 610816 1174528
5977 1174528 489472 1065472 1273344 1120768 1034240 566784 2050048 427520 420864 -46592
5966 607232 1270272 1403904 947200 575488 756224 427008 567296 638976 836608 942080
5956 942080 1306624 753152 799232 274944 1098752 934400 976384 656384 196096 508928
5946 508928 445440 1000448 576000 -190976 423936 1067520 1356800 0 668160 867328 1249792
5935 1249792 805888 864256 1587712 1585664 828928 589824 -77824 1197056 787456 744448
5925 744448 636928 1166848 1465856 1624576 529920 750592 872448 1055232 1071616 961024
5915I61024N05856l24608r4208l27168M8128K1504L01056p0656J4848m76672N85728
5904A144832E29920J69984J636864C08224P05024m64384N36576D57728L97824
5895H55552j93536N45280D74624a05472H00256j99168k57536L83488a81760E32480
5884A195008n37600G6800Q16128k0480a66912I68704k27328O15936E20704Q1408
5874F02112M21376a47968A720832C24096K86720L6864k60096K284032B89280Q23808
5864A113088L584E46304K2016o2976J657344F85568l11296N24800e90336D27520
5853H65280P1168J270272B65216m1984J71008M97152j20832J50528B83136P06048
5843I89184D89472J048064A70496J059328J78176o63040k39104J93536L37920
$$ plain form
5915 961024 1466880 1142272 1048064 720896 769024 790528 1091584 1020928 1035776 559104 1144832
5904 1144832 529920 699904 2336768 308224 1013248 548864 1085440 457728 855552
5895 855552 662016 1207296 474624 -105472 800256 601088 343552 727040 -181760 532480
5884 1195008 657408 76800 892928 872448 -166912 968704 741376 1357312 520704 602112
5874 602112 1023488 -147968 1720832 324096 610816 647680 387584 2671616 289280 1113088
5864 1113088 1116672 546304 568320 505344 2162688 685568 374272 899072 -590336 427520
5853 865280 936448 2206720 265216 223232 394240 891392 770560 921088 283136 989184
5843 989184 489472 1537536 170496 1229824 1408000 744960 505856 699392 1037312
5834A037312D29568F4000N10976k9184Q35584n73440A5872J34144R94304m98688
5824F45632R1648L96800A40800d15744A88928J513984E70880o1440K69312I5744
5813D57216N9392O91200l89632k89280Q63232j50528l62496K71872I2672O52288
5803G44960l48672K23232M096R26720p05536L58912R61536I95840b10944A048576
5792D23424Q35072n22752A20320O00064j09568Q89344k33984N82144h3456A007104
5781A273856L3280A54112M72064m096J027584E96992R03168l14880A95072J042432
5771A237504N24288O15936F87616N13024P7312n6832m38784R8304I3184J462784
5761A555968j20320D68480J477120A96608J707520k79040A11616M71552P99744
$$ plain form
5834 1037312 429568 64000 574976 545792 1381376 807936 15872 150016 1144320 645632
5824 645632 737280 1134080 140800 -415744 188928 1702912 570880 509440 778752 95744
5813 457216 516608 1207808 818176 528896 1392128 1241600 879104 1150976 92672 744960
5803 744960 396288 619520 623616 1550336 844800 1203712 2165248 995840 -210944 1048576
5792 423424 1258496 735744 120320 720384 610816 1500160 1266176 1848320 -83456 1007104
5781 1273856 1307136 154112 626176 622080 1649664 596992 1500160 1185280 195072 1237504
5771 1237504 1761792 2377728 687616 1200640 1277952 1221120 782336 880640 93184 1555968
5761 1555968 1435648 468480 1945600 196608 1904128 1625088 111616 583168 1382912
5752A382912J79712F77376K05312k38592P96160F71232Q37120o27200B03776e53472
5741F63552N69344m38272b89280E78048J102336m12672q704F06208N94944A66400
5730A057792P22432m81280l92192j53088c3792A100288m48000M18304I728J587200
5720A596928G87968J357824C94752J155584g90016E30432L48672b4064A126912
5710H55552k34496k76480O69184L31776m93568j35168K50368O5024k59584k21184
5700E51424P99744E21728M92032L9936H3968Q72448J68960l5328o4000K63168
5690A289216o7072k58560j4848m30592L27168J15712R2160L5840p3728D92544
5679A544192D59264J20832L13344l05152J025536p64416J53088M76160E87264
$$ plain form
5752 1382912 1562624 677376 882688 644096 1440256 671232 1508352 881152 203776 -553472
5741 663552 1232896 794624 -289280 578048 1680384 1267712 1259008 606208 1201152 166400
5730 1057792 1780224 1298944 906752 753664 -33792 1100288 652288 1070592 9728 1596928
5720 1596928 787968 2145792 394752 1550336 -790016 530432 879104 -24064 1126912
5710 855552 621056 344576 1013760 1345536 851968 716800 967168 1032192 772608 551424
5700 551424 1351168 521728 1013760 1053696 83968 956416 1125376 1090048 1026048 1289216
5690 1289216 1222144 963584 948736 518144 845312 961024 1053184 1089024 1015296 492544
5679 1544192 459264 580096 893440 588288 1613824 849408 1002496 1478656 587264
5669F21056J039872q9088k90304m4032L2768N32992n52960O66624o90176K29376
5659A456128N81632j50528Q94976A275392J032704l06688l64032Q56576p45984
5650A747968R80480j212416k74944N93920J05472j77152J35168J19296q66304
5641A151488j74592K26304o8096C60448N23776k66752J92000l76320a67936A544192
5630G71584P95136L47648F35392j44384K67264K70336j09056k22208h9088a536
5619D86400J273344k76480J72544L50720E55520J038848p22944k67776L37408
5610I41056k9696R39008j05984H70912j21856j72032J605632H15616N08416L01056
5600A625088p72096A93024L4304J184768o76864O48704m34176M14720O2976J62816
$$ plain form
5669 621056 1660928 1571840 1281536 1237504 1270272 1803264 1250304 1916928 1226752 1456128
5659 1456128 2037760 1887232 2782208 1275392 2308096 2001408 1637376 2493952 1747968
5650 1747968 2728448 1516032 1241088 1835008 1940480 1763328 1898496 2017792 1151488
5641 1151488 976896 1203200 1135104 360448 884224 617472 809472 433152 -167936 1544192
5630 771584 1566720 1914368 635392 491008 758272 1028608 919552 697344 -89088 -1536
5619 486400 1759744 1483264 1655808 2006528 555520 1594368 871424 603648 941056
5610 941056 911360 1850368 1744384 870912 749056 577024 2182656 815616 1324032 1625088
5600 1625088 852992 193024 227328 1412096 735232 1383936 949760 1364480 1427456 1590272
5590A590272E89312J134080b01728A220096K3552L31264A90976J64864J005568
5581A361408o07744J125376H85248J37216N9904j77152N16096l6352N53984q62208
5571A076736m8128l73248M61312n04320J51040r0624J354240K20672E43744L46112
5561H89856C52768P36768O08256n47840L37920j18272k71360k09408a3312A387520
5550A118208q0384M58240k8672j88416k81600J00864Q72448r33888P19872J095168
5540B851840I55392J45408O45120o08256l22048j55648R03680m93056M48000k61120
5530A257472P48032J2800G71584J664000I57952P45472r9840j92000M00384J014272
5520B826240G34720J222144F12352O24128K19648K85696E87264J280000E64736
$$ plain form
5590 1590272 589312 1723392 -201728 1220096 1243648 1574912 190976 355840 1361408
5581 1361408 753664 1879040 885248 1022464 1082368 905216 1421312 1384960 1938944 1076736
5571 1076736 1028608 655360 1116672 612352 763392 672768 2027008 2247680 543744 889856
5561 889856 352768 1089536 1697792 1149952 1487872 1369600 1098240 888832 -13312 1387520
5550 1118208 1037824 1496064 1467392 1278976 997376 1098240 1970688 1036800 1756672 2851840
5540 2851840 955392 1100800 1745920 1137664 815616 659968 1563648 1070592 1518592 1257472
5530 1257472 2005504 2018304 771584 2435584 957952 1703424 1603584 1411584 1811968 2826240
5520 2826240 734720 1956864 612352 1236480 1456128 1741824 587264 1867264 564736
5510I22112k82112K34496k46272O53312m94080J692672A230848m3520%M60288
5500A647616J08544J094144j421824M04480o37952J005056H82176k37568J427968
5491B072576k10432k83648j66912M73088O37440j7408q65792l4304O67136p03488
5481A568256J23392o59456J571328c50720H24832J458176j46944m22912p94112
5472I19040l84000J641472E72416K81600M13696l73760J538048j213952j75616
5463A042432R02656H63232o9632M54144J15712K63168j11104m18816M35712m096
5453A528320J32096p13216P47520D5568P42400D4032K72896R25184C77344K63168
5443F40512N24288l42528K76992l3280N10464n90336N9904J626624G70048k04800
$$ plain form
5510 922112 640000 874496 628224 1281536 787456 2480128 1230848 1187328 1187328 1647616
5500 1647616 1756160 2850304 1428480 1832960 1195008 2200064 882176 644608 2072576
5491 2072576 1862144 1578496 1411584 1884672 2522112 2504704 1638912 1604608 2271744 1568256
5481 1568256 1691648 1032192 2603520 -350720 824832 2283008 2136064 1713152 919040
5472 919040 535040 2176512 572416 854016 1267712 893952 2432000 1218048 1042432
5463 1042432 1945088 863232 793600 1247744 1363456 1626624 1515520 1096704 1532416 1528320
5453 1528320 1660416 947200 1694720 45568 787968 44032 316928 1242112 377344 640512
5443 640512 1164800 822272 1099264 1065984 1576448 986112 1046016 2672640 770048 565248
5433E65248Q79104m96128n5808O23616n74976Q7552M30080p4240O3488G05024
5422I94816n1712L41504K23232l99360C45600Q35584b74944A505792o75840J307136
5412B137088F53824P90528J89440B76480N58592N53472D10112M42368K48832N47840
5402A649152m63872E52448M09600K76992k48832Q02304m59264N632r1648l53792
5392H93440l75808P42400J4336j48992n60128M50560Q4992n9904l79392O08768
5382A270272L90144k94912N11488n39648Q704K19136j84320l07200D27008Q85248
5372A312256K0992l22560k08896J190400I11360j28512Q7040c48672A147392K07872
5362A355264L3280n04832M01920O71232l00544K05312r09824R88160l00544F69184
$$ plain form
5433 565248 1444352 948224 892416 1516032 941056 1028608 1458688 1384448 1447936 705024
5422 994816 943104 1284608 1507840 1108480 345600 1181184 -274944 1505792 829952 2137088
5412 2137088 653824 1444352 1633792 276480 835072 1388544 410112 852480 1101312 1649152
5402 1649152 1185280 552448 962048 1239040 990208 1792512 1333248 1338880 1247232 893440
5392 893440 517632 1260032 1274368 1125376 565248 1015808 1100800 1040896 661504 1270272
5382 1270272 1660416 1365504 1876992 1337344 1346048 1565184 1380864 1073664 427008 1312256
5372 1312256 1333248 1010688 801792 1992192 911360 782848 869888 -348672 1147392 1355264
5362 1355264 1388544 883712 1285632 1956864 1656320 1861632 951808 1939968 1639424 669184
5351G50080R26208l46112j21856K7648D51584K149888I48224J031680M23424I73824
5340G15776L92192d1472B47808M49024P51104E83168J39264M92544j80224P60320
5330A795072q72448A53088N45280L38944M62336m74112D72576J84320J165824
5321A822720k0992p04000K8160L07712K84160H29952L48160J059840A096192l23072
5311G73120K57536L79904C20512N47840P86944j94048p29088N38624j92512J3824
5301A092096R95328q88320J58208k18112n8880k8160M80256B98496R70240j72544
5291A096192M28544J22880p17824M77696o30784O00064n77536N9904P1680O80448
5281A611264M6592o57920k45248L94752R07264R3696n93408n37088K0992J272832
$$ plain form
5351 750080 1676288 1330176 1208320 1235968 451584 2601472 948224 1979904 2403328 973824
5340 715776 1107968 -41472 247808 696832 1447936 583168 722432 1214976 1034752 1795072
5330 1795072 922624 153088 698368 1037312 1499648 1025536 472576 656896 1822720
5321 1822720 1801728 1097728 1125888 1433600 1717760 829952 1178112 2237952 1096192 773120
5311 773120 1030656 1410560 320512 868352 1655296 1461248 732160 1270784 1078272 1092096
5301 1092096 2087424 1199104 1357312 1139200 1080320 1052160 1532416 298496 1268736 1096192
5291 1096192 1524736 1647616 929792 1407488 776704 1376768 799232 859136 930816 1611264
5281 1611264 1657856 999936 754688 1149440 2056704 2150400 1556992 1019904 1040896 2313728
5271B313728n09440k88768L93728k60608D87936J025536O18496M59264m6592p02464
5261A842176O41024m83328N50400M00384r62048n00224J13664j08544K91328q02816
5251I82016J126400k97472j94560K8672n98528r5232o4512P55200j83808N37600
5241A995776D67456N73440J5360K62144K16576L24096p60832J75104m87936M54144
5231A239552Q16128C26656N22752J419776r50272M25984q3456q19200R12896q03840
5221I51296l79392J027584K66240I05728k96448O79424k67264K91328J017856
5212B330624A135104L93216G04512O58432n0176j31584J69472k89792L88096o93248
5202G55712J157120n0176E96480O49216B59584J436672p67488k53440O58944A93024
$$ plain form
5271 2313728 1804288 1515520 1909248 1648640 487936 1513472 2131968 2591232 2544640 1842176
5261 1842176 2483200 1999872 2550272 2950656 1988608 1488384 1602048 1493504 1784832 982016
5251 982016 2108416 1810944 1616384 1645056 1046528 951296 886784 1641984 1458176 1995776
5241 1995776 467456 1040896 1056256 1318400 1534976 1859072 1098240 1273344 785408 1239552
5231 1239552 2055680 326656 849408 2269184 1318912 1744896 1661440 842240 1755136 951296
5221 951296 571904 1599488 1865728 905728 609280 1288704 1021440 1312768 2330624
5212 2330624 1135104 1528320 704512 1362944 1312768 1181184 1350656 1060864 1448960 755712
5202 755712 1912832 1862656 596480 1245696 259584 1696256 928768 675328 1334272 193024
5191A846784B70848P41888J161728H73472J64864D49536N78560l77344J414656
5182B065408E95968A09056Q18688C99872J335808M4544n85216K78528O95808n88288
5172A581056B3552J675264m55168M85888k46272j08544P168K80576k65216J145344
5162B542592H89856O11328D76672Q65792L60448Q2432l18976j55136K06848D49024
5151H08448R22112H64256j16736J820672j075200R04704A085440J68960D32640
5141B536448B69824K366464p04512I27744J636352j164288J94560M46464k91840
5132A748992n99040L23584k07360R32864m6080n57568Q49408m77696l23072P5264
5122A719296J417728j157632k60608k15040J281024j243648k83136k30912J1264
$$ plain form
5191 1846784 270848 1012736 2174464 873472 1038336 449536 1028096 650752 2065408
5182 2065408 595968 109056 927744 399872 1735680 1780224 1195008 1473536 2169344 1581056
5172 1581056 23552 1698816 1243648 1729536 1483264 1374720 1381888 1662464 1397248 2542592
5162 2542592 889856 1501184 476672 1342464 1702912 1785344 1466368 1311232 1518080 449024
5151 808448 1730560 864256 747520 2568192 1492992 2397696 1085440 1254400 432640
5141 2536448 269824 2636288 1931776 927744 2564096 1399808 1594368 2040832 1748992
5132 1748992 1149952 1473536 1266176 2199040 2152960 1595392 2444800 1967104 1644032 1719296
5122 1719296 3137024 1979392 1718784 1503744 2784768 1541120 1257984 1027072 1038336
5113A038336P88480L0720R58976j287168L38944n40672Q94976r5744M84864j164800
5103A446912K40128o7072J16224P18848j073152N40672M00384k63168k16064n9904
5093A783808N68832j053184n98016J202176L42016n61664j66912N9392l86048
5084A190400L59936L04640j21856M40320O28224C64032R25696P30112p53664n79584
5074F86592K165760p77728q66816L35872m23936m096J267200D97664Q84736L93728
5064A776128k90816p5264P76704L81440A267200m95616K22720K56512N65760M53120
5054B269696l59424j23904n78560E23264J262080j6896R18016j302528N49376
5045A933312l64544R74336p10656n79072M21376q704G32160N07904k07360J466368
$$ plain form
5113 1038336 1826816 1857536 2816512 1529344 1868288 1327616 2222592 2126848 2611712 1446912
5103 1446912 1687040 1619968 1736192 2455040 1381888 1922560 2322944 2059776 1843712 1783808
5093 1783808 2352640 1299456 701440 1903616 2245632 1683968 1517056 1576448 1190400
5084 1190400 1550336 1854976 1733120 2173440 2801664 364032 1289728 2019840 1266176 686592
5074 686592 2852352 2074624 1207808 1543680 1119744 1115648 2382848 497664 1382400 1776128
5064 1776128 1485312 1410048 2186752 2568192 1267200 771584 994304 1250816 1816576 2269696
5054 2269696 1910272 1786368 1207808 523264 1785344 1768448 2686464 1383936 1933312
5045 1933312 1568768 2543104 1832448 1253376 1674752 1666048 732160 1240064 1032704 2499072
5035B499072j078272K048K90304m76160K81088C56352M80768J552384M9664m58752
5025A980416P20384k80064l0720j131008k41152K36544L71712p76192J914368
5016B764288A074176O37440H13056J037824L34848A089536N06880Q93952j124864
5007A365504K99008J127424n53472l53280O22080n31456P34720n12000q2944k4064
4997B091520L55328J99168J99168o65600J703424Q00256j367040J928704j022976
4988D221952m87424J304064O42560n22752O60992r42592r75872o72256q26880
4979B401792N55520r08288r91744R08800q88832L04128l03104P41376j21856k23232
4969A474560P21920q45312J8944F11328R15968N48864n28384N19168K07872o57408
$$ plain form
5035 2499072 1420800 1422848 1713152 1236992 1518080 356352 837120 2389504 2439168 1980416
5025 1980416 2700800 2420736 2390016 1259008 1017856 1254400 1626112 849920 2764288
5016 2764288 1074176 1711616 813056 1850880 2185728 1089536 1596416 2490368 1365504
5007 1365504 1664512 2791936 2238464 1885184 2507264 1975808 2710528 2198528 2115584 2091520
4997 2091520 2446848 2646016 2845184 2179584 3883008 4683264 3316224 5244928 4221952
4988 4221952 3734528 5038592 5681152 5158400 5819392 4876800 3900928 3228672 2401792
4979 2401792 2957312 2049024 1057280 1966080 1077248 1381376 1078272 1819648 1697792 1474560
4969 1474560 2196480 1351168 1370112 611328 1527296 2076160 1547776 2066944 2274816 1617408
4959A617408J10080k12480O08256j83808l33824j78176K60096L87584k36032m85376
4949A353728n91872J93536J466368A174016L79392k5600Q09472r7792j102336
4940A137152Q41728A54112K308608A116160J043456q16640M47488k6112p32672
4931A031680J50528P03488j30560M19328m96128q0384M23424K05312o15936q04864
4921H05888J061888j31072K01216l40992j14688M11648P9872p58272M19840J69984
4911A805312P8336j18784m61824j54112m06528K07872j02400R38496N44256l15904
4901B014720p9360m06528Q03840C04128J217024J036288A130496J552384p72096
4892A910784l03104M99200k65216l74784J069568l78368H33024O47680K57024
$$ plain form
4959 1617408 1727488 1515008 2123264 1939456 1605632 1427456 1687552 2075136 1839104 1353728
4949 1353728 761856 955392 2421760 1174016 1553408 1527808 2337280 2239488 1137152
4940 1137152 1978880 154112 2462720 1116160 2159616 1342976 1790464 1764352 1031680
4931 1031680 1182208 1885696 1755136 2174464 1678336 1597952 2021376 2226688 1610752 805888
4921 805888 1867776 1736704 1937920 1596928 1482240 1893888 1973760 1215488 1635328 1805312
4911 1805312 1883648 1764864 1303040 1148928 742400 950272 847872 1786368 2330624 2014720
4901 2014720 1935360 1528832 2332672 304128 1521152 2557440 1130496 2682880 1910784
4892 1910784 1607680 2106880 1841664 1466880 2536448 2158080 833024 1480704 1737728
4883A737728K33472I26720J510400j60256k30400p38816O144R76384O2976l49696
4873B003456l63008P34208l74272l28704P33184m06528m79232n95456J389568
4864B313216r7280m54656N5808K73408q30464N72416o34880K17600J27488k40640
4854A302016J2288o5536K79040O96832m29568Q40192q69888o36416J291776L1232
4844B451968n81632o37440J523712o64576J53600k99008k02752L16416l51232
4835A709056L1232L34848P11168A283072J57184Q98048K25280q51968J287168
4826B998784r68704j82784P74144n59616p68512J168384n85216K048L13856m07040
4816A785344Q05888M94592j359360H59648J595392O88640l99872l68640j96608
$$ plain form
4883 1737728 1971200 926720 2437120 2276864 2046464 1307648 1313792 2290176 2353152 2003456
4873 2003456 1640448 2374656 2000384 1671680 2404864 1998336 1519104 923648 2313216
4864 2313216 2215936 1761280 1817088 2090496 1260032 1832448 1197568 1415168 1542656 1302016
4854 1302016 1314304 1248768 1527808 2224640 1795072 2635264 1765376 1128960 2420736 2451968
4844 2451968 1870336 1232896 2756608 2092032 2245632 1946624 1743872 2060288 1709056
4835 1709056 1740288 2075136 2786304 1283072 1440256 2338304 2563584 1711616 2998784
4826 2998784 2030080 1847296 2621440 2061824 1293312 2461696 1876480 1878528 2192384 1785344
4816 1785344 2591232 3085824 1726464 859648 2455040 3143680 2743808 2375168 2178560
4807B178560K21696m03968P71072l6352j024J241600r32864A435648J192448n90848
4797B037248O11840M48000p23968J59744L09760j096704N26336l99360M50048
4788B322944Q85760n84704k20672P28064A522688J568256r64608K78528O63552
4779C068416l03616l03616O88640j350144J284096q3968K24768n45792K08896
4770B887680j181696J262592r83552m08576P84384k7136l19488L3280j04960R23648
4760B866176r15968L98336R2160P25504m22912m61824l36896l59936O19520L22048
4750B526208p80288O56896o0928N44256n68832m05504J049088k83648l70688J72032
4740B478592n55008N66272P66464j019392N47840j087488M35712J203200J6384
$$ plain form
4807 2178560 2400256 1996288 2767360 2731008 2729984 3971584 3038720 1435648 2628096 2037248
4797 2037248 2649088 3097088 2373120 2532864 2842624 1745920 2272256 1872896 2322944
4788 2322944 3208704 2624000 2403328 3131392 1522688 3090944 2126336 2404864 3068416
4779 3068416 2764800 2461184 3149824 1799680 3083776 2999808 3224576 2678784 2887680
4770 2887680 1705984 2968576 1985024 1576448 2360832 2333696 2014208 2047488 1942528 2866176
4760 2866176 1950208 2348544 2440704 3166208 2743296 2281472 1944576 1584640 2204160 2526208
4750 2526208 1745920 2402816 2341888 2886144 2317312 1911808 2960896 2677248 2306560 2478592
4740 2478592 1923584 2489856 3256320 2236928 2784768 1697280 2132992 3336192 3352576
4731C352576k00192p35744L44064P71072p2192q06400J547776q17152m09600l58400
4721B615808q96512K025984o54848A373184K586624K04800j146368l69152l24608
4712B324480P0656P20384j391616P16288l33824M76672m19840O50752m18304M37760
4702B833408N9392k20672J034752m88960j65888P91040j247232M8640J000448
4693C644928Q3968O1952o09280N96480K84160P15776K50368j607680K27328O4512
4683C712512N08416K57024q09984R98912N45792j352704o4512o52288K83648m68480
4673B958336k23232j8944L66080k18624m52096o45120O4512P01440O48704j28000
4663C053056j55648q88320M68992n01760j37216J293312k71360k32960m63360
$$ plain form
4731 3352576 3152384 2416640 2760704 3531776 3459584 2653184 4200960 3383808 2974208 2615808
4721 2615808 1719296 3745280 3090432 1373184 3959808 4164608 3018240 2649088 2324480
4712 2324480 2395136 3115520 1723904 2440192 2106368 2583040 2163200 2813952 2395648 2833408
4702 2833408 2892800 2672128 3706880 3217920 3052032 3843072 2595840 2644480 3644928
4693 3644928 3728896 3790848 3181568 3778048 4062208 4777984 5028352 3420672 3648000 3712512
4683 3712512 4220928 4477952 3667968 4666880 5212672 3859968 3795456 3143168 3426816 2958336
4673 2958336 2735104 2716160 3082240 2863616 2411520 1766400 1830912 2532352 3181056 3053056
4663 3053056 2897408 2009088 2478080 1976320 1839104 3132416 2861056 2628096 2164736
4654B164736P91552K08896r04192q00256Q03328l46624N43744j084928K158080
4645C534336j023488M74112k67264j268736J334784j205248j02912R05216p65440
4636A615360J36704K10944L10784L30752K72896m29056A102848J267200q48384
4627A521664Q40192j055232J045504N94432k63168o67648M74624j04960K60608
4618B646016Q25344J50016j379840L33824l29728Q73984j138688J361408J4848
4609C357184p95648J21856j23392l0720l89632J201152o75840k78016P63904q72448
4599B278400O94784k88768J59744n79072J302528n79584L81952o87616Q02304
4590C484672j0240n00736m75136K70848J327104j196032j067520Q66304j74080
$$ plain form
4654 2164736 2956288 3165184 2260992 1460736 2264064 1917440 2461184 1376256 3534336
4645 3534336 2510848 2984960 2717696 1448960 2783744 1578496 1475584 2380800 1615360
4636 1615360 1752064 1963008 2273792 2604544 2877440 2448384 1102848 2370048 1521664
4627 1521664 2361856 1306624 2352128 2946560 2683392 2015744 2490368 2385408 2646016
4618 2646016 3471360 3621376 2241536 2575360 2245632 3119616 1980928 3342336 3357184
4609 3357184 2561536 2683392 2560000 2529280 2139648 3340800 2664960 2386944 3150848 2278400
4599 2278400 2973184 2684416 2844160 2265088 3567616 2988032 3369984 2682368 3484672
4590 3484672 3474432 2973696 2498560 2769408 4096512 2900480 1832960 2699264 2525184
4581B525184R97376j135616M73088K4576R01120j055232o71744K68288n25824
4572A801216Q73472L82464J150976j637888l35360R90720n36576m608p2704m08064
4562B203648K54976R95840j55648p03488j53088K82624k75968L12832p48544J131008
4552C144192j257472J024P98720j73568j70496N67808l31264j86880N4784L04640
4542B751488n24800l35872R09312O27200j206784J208832j298944N21728J38240
4533B790400J034752m52096O21056j95072r11360p67488P86944N93920K00704
4524C701760J46432l52256j481728R93280m34176K04800j7408k5088K88256o46144
4514B377728N6320P11680q03840l8912N9392L99360P23456j067008J700864j448448
$$ plain form
4581 2525184 3522560 2386944 2860032 2884608 3785728 2730496 2058752 2327040 1801216
4572 1801216 2674688 3057152 4208128 2570240 2234880 3225600 2689024 2684416 2611712 2203648
4562 2203648 2458624 3454464 3298816 2595328 2442240 2724864 2448896 2761728 2013184 3144192
4552 3144192 1886720 1887744 2686464 2512896 2342400 2910208 2578944 2392064 2446848 2751488
4542 2751488 2226688 1890816 2800128 3427328 2220544 3429376 2130432 2652160 2790400
4533 2790400 3825152 3373056 3994112 3799040 2887680 2120192 2907136 3501056 3701760
4524 3701760 3848192 3495936 2014208 3007488 2573312 2778112 2760704 2735616 3023872 2377728
4514 2377728 2434048 3145728 2341888 2302976 2362368 2761728 3485184 2418176 4119040 2670592
4504B670592R92768j771008J227264r54880J543168r00608o34880J230848q56576
4495B546688J07008o656K23744j20320J061376j59744P6800j42336L63520j609216
4485B340864J259008L56352o38464j25440m16768J020416m37760J94048J489408
4476E041664r92768p76704J022464q704n96480Q64256j86880k48832n7856l20512
4466C739648M61312m00384L32288M29568m01920p85920O24640O05696j188352
4457C416576J039872O16960k063360J471488n1200O36416q86272J416704j777664
4448C819520L9424O59968q54016J413120r26208k17088k05312N20704P82336r5232
4438D937216j403904K32448k57536J40288k62144P48032J72544r87136l02080
$$ plain form
4504 2670592 3663360 1892352 3119616 2164736 3707904 2807296 2172416 3403264 2546688
4495 2546688 2653696 2647040 2870784 2750464 3811840 3652096 3728896 3586560 3950080 2340864
4485 2340864 3599872 3956224 3317760 3192320 2775552 3795968 3358208 3552256 5041664
4476 5041664 4048896 3272192 4294656 4285952 3689472 4553728 4366848 4118016 4060160 3739648
4466 3739648 4200960 3800576 4132864 4562432 4160512 3374592 3999232 4604928 3416576
4457 3416576 4456448 5073408 3010048 4481536 4430336 5066752 4180480 5597184 3819520
4448 3819520 3858944 4518912 3664896 5078016 4151808 3934720 3729408 4250112 5032448 4937216
4438 4937216 3533312 3765760 3508224 3648512 3386368 4134400 4306944 3319808 3017728
4429C017728L45088N79584o08768Q8576k39616J651712j834496M64384L34848
4420C799040K35520j079296J007104j323520J079296k47808j12128j249792Q12544
4411B920960L15392J32608O08256K81600K44736o88640k28352p1168n71904o42560
4401B300928J732096P8336j181184N42720j26464o81472O2464m71552J859584
4392D115456r14432o78400N00224r9328M30592M096L40992r09312l20000L40992
4382B810880p71584J867264k38080m79232N46816j125376J761792n29408j853952
4373A989120J510400P83360j643008q3968J383936q38656m00384L59936o90688
4364B370048P2192m4544M32640M07040p52128J57696j55648K90304K41152k44736
$$ plain form
4429 3017728 3362816 3942400 3333632 3422208 3182592 4834304 2999808 3464192 3799040
4420 3799040 4034560 2955264 3962368 2638848 3718144 3470336 3358208 2108416 2920960
4411 2920960 3236352 3368960 3977216 4258816 4503552 3814912 3586560 3515392 2943488 2300928
4401 2300928 4033024 4111360 2930176 3472896 3346432 2664960 2727424 2255872 4115456
4392 4115456 3201024 2522624 3022848 2923520 3354112 3358208 3699200 2789888 2469888 2810880
4382 2810880 2039296 3906560 3668480 3189248 3736064 2610688 4372480 3843072 1989120
4373 1989120 3499520 4282880 2639872 2555904 3939840 3101184 2700800 3060736 2370048
4364 2370048 2442240 2397696 2830336 3237376 2485248 2642944 2487296 2777600 3018752 2774016
4354B774016M32128Q5504m85888M66944l74784l15392M20864K40128j092608L97312
4344B548224L86048Q88832j424896O656K20160O30784k97984m74112J93024K560
4334B679296K64192O54848A435648Q33024O57920O45120j427968P7824N15584
4325B737152M99712l04128l26144j99680P2704N06880p94112Q63232p69024P16288
4315C002880M10112n08928K45760q82176L68640o62528j82784J295872m59776
4306B627072j78688J449472q54016l80928Q30464j070080M51072N63200o58432
4297B779136j017856P93600O75840o30272N46816n13024N47328K41152k56000
4288C166720j52064r6768O07232k4576M608m83328O59968j060352P72608p11168
$$ plain form
4354 2774016 3206144 3291648 2805760 3272704 2897920 2582528 3003392 3243520 2150912 2548224
4344 2548224 2934272 3823104 2398208 2404864 2625024 3255808 2957824 2483712 2676736 2679296
4334 2679296 2943488 3598336 1435648 2268672 2926592 3571712 2143744 2221568 2737152
4325 2737152 3236864 2932736 2606592 2406912 2479616 2986496 2192384 3055616 2286592 3002880
4315 3002880 3412992 2904064 3149824 2267648 2636288 1973760 1790976 3086848 2627072
4306 2627072 2448384 3897856 3043840 2662912 3493376 2423296 2874368 3437568 2779136
4297 2779136 1761280 2554880 3230720 2600448 3147264 2634240 3181568 3422720 3166720
4288 3166720 3014656 2917888 3525120 3500544 3505152 3021824 3681792 2621440 3394048 2682880
4278B682880m96128J520640p90016Q07936q44288N1712m31104M34688K33984l06688
4268B863616K78016J19808K41664j41312m00896R27744o25664N00736k86208j10592
4258C366912o08768J510912K25792j092096m90496j69984O86592P81824o39488
4249C571200J043968r54880n74976J276928l03104k77504J81760J275392j418752
4240C820032J050112j127424L06176k9184N79072l82464o55360N12000L66592
4231D439552q13568M34176o15424M58240l13856L38432p79776O20544k33984k86720
4221C247616p21920J733632r48736k62144N57056P75168j075712J305088r97376
4212C612672Q70400m76160P7312m99712J83296l46624N45280L71200j031168M38272
$$ plain form
4278 2682880 2186752 3707392 2917376 3725312 2881024 2932736 2501632 2936320 3170304 2863616
4268 2863616 3141632 3261440 3503104 3361792 2960896 3888640 3262976 3763712 3477504 3366912
4258 3366912 2758144 4269056 4494848 3402752 2912256 2742272 3428864 4210688 3571200
4249 3571200 4615168 3660288 3085312 4362240 4059136 3781632 3963392 5238784 3820032
4240 3820032 4870144 3742720 4048896 4019712 4598784 4216320 3560960 4072960 4439552
4231 4439552 3625984 4060160 3444736 3902976 3589120 3927552 3147776 3768320 3534336 3247616
4221 3247616 2525696 4259328 3310592 3048448 3605504 4380672 3304960 4610048 3612672
4212 3612672 4483072 4006912 4084224 3584512 3767808 3421184 3966464 4337664 3306496 3744768
4202C744768r1136J52576J677824j253376J302528l01568j859072J74080O07232
4193D153856J17248l55840k71360O16448n05856R86624L15392k61632j50016P77216
4183E422080O68160l75808J496064J23904N06368q80128l96800j093632J005568
4174F475776p27040J546752k33984L89632r9328J462784q00256m21376N31968
4165H124928j000960J030656q25856r12384Q82176J351680l93216l42528J03936
4156H018432O59968j65376m608j85344l05152P39328m33152j07008J080832l71200
4146H926720j1776J198592J315840r70752o18496N06880K59072Q82688J98656
4137A1687424l75808K03776J04448J603584r99424J766912k54976l79392J172480
$$ plain form
4202 3744768 3653632 3806208 5484032 4230656 5533184 5231616 3372544 3546624 4153856
4193 4153856 4271104 3915264 3643904 4260352 3754496 4741120 5056512 4794880 4644864 5422080
4183 5422080 6090240 5714432 7210496 7334400 7840768 6960640 6563840 5470208 6475776
4174 6475776 5748736 7295488 7061504 7451136 7351808 8814592 8014336 7592960 8124928
4165 8124928 7123968 8154624 7328768 6416384 7298560 8650240 8257024 7914496 8018432
4156 8018432 8678400 8513024 8508416 8323072 8017920 8757248 8324096 8217088 9297920 8926720
4146 8926720 8914944 10113536 11429376 10458624 9840128 10347008 10606080 11488768 11687424
4137 11687424 11311616 11515392 11619840 13223424 12224000 13990912 13735936 13356544 14529024
4128A4529024O4000L02080Q7552J009152O78912J766400l59424P51104n47328
4119A8281472k523648k062848j954304j800192q88320j522176j106432j291264
4111E132288O144o0416r728j45920K02240K95936j80736j166848O80448J34144
4101D887552j084928J211392l56352L46112m21888K677760k432000N61664k51392
4092E137920L27680k368000J197056n56032N95968J235456j177088q6016J53600
4083D460544K12992K81088j054208P57760O656n24800j80736J090048j789952
4074C259392J547264l50208K27840o30272Q41728j99680O16960q56576M08064
4065D864512N01760j93024m07040j11104L35872k32960K6112k3552n04320L17952
$$ plain form
4128 14529024 14593024 14895104 14982656 15991808 16670720 18437120 18077696 18828800 18281472
4119 18281472 15757824 13694976 11740672 9940480 9052160 7529984 6423552 5132288
4111 5132288 5138432 5078016 5068288 4922368 5124608 5420544 5239808 4072960 4753408 4887552
4101 4887552 3802624 5014016 4657664 5003776 4581888 7259648 4827648 5389312 5137920
4092 5137920 5465600 3097600 4294656 3738624 4334592 5570048 4392960 4306944 4460544
4083 4460544 4673536 4954624 3900416 4658176 4664832 4140032 3959296 5049344 3259392
4074 3259392 4806656 4456448 4684288 4054016 4895744 4696064 5313024 4456448 4864512
4065 4864512 5366272 5173248 4766208 4655104 4990976 4758016 4784128 4760576 4256256 4574208
4055D574208m7616m23936J35168N55520p47520R04704m45440l78368j134080J079808
4045D072448r05728J427456r10336Q4480q40704J857536j885696R15968k12480
4036C602944j73056K04288o6048K15040J98144n42208O52800K80576P1168q73472
4026C570176P48032p05536N18656n27360l56864P0144J886720j775616Q33536
4017D261888O53312r78432n77024J198080P8336j8432r72800N43232k75968M75648
4007D387840l04640R82016r91744n45792J324032o57408o70720O91712n87776
3998C627520P18848n91872L12320K70848m36224k44736K60096q9600J92000P63392
3988D782592m06528l47136J34656O07744r30816N83168r58464O46144j098240
$$ plain form
4055 4574208 4526592 4102656 4237824 4793344 4045824 4950528 4505088 4126720 2992640 4072448
4045 4072448 3166720 4594176 3683840 3768320 2927616 4785152 2899456 3815424 3602944
4036 3602944 3429888 3634176 3568128 3783168 3981312 3439104 4091904 4372480 4443648 3570176
4026 3570176 4318208 3612672 4131328 3603968 3247104 3317248 5203968 3428352 4261888
4017 4261888 4915200 3936768 3359744 4557824 4636160 4617728 3644928 4188160 3912192 4387840
4007 4387840 4083200 5065216 4073472 3527680 4851712 4194304 3523584 4215296 3627520
3998 3627520 4346368 3754496 4066816 4337664 3901440 3656704 3916800 3827200 4019200 4782592
3988 4782592 4376064 4028928 4163584 4771328 3840512 4423680 3465216 4111360 3013120
3979C013120J404416K26816j22880M98176l08736j151488R36448L12320j139712
3970C668480R42080K29888n32992r56928P30112o13888N45280j33632J075200
3961D953600m80256J52064n05856N46304o79936r57952J48992J300480q44800
3952C632640O22080j371136J865728p30112J129984K56000j029120j063936q1408
3943C230720O74304l92192j58720P49056p56736J292800o74816j11104n12000
3934C341312J326080L85536o10304O62528m30592L09760j083904k0480J014272
3925D894208j325568J304576k17088m53120p8848J47456M62848o65600O32832
3916D701696j193984P63904R5232o34368K48832Q6528N50400O16960j157632K41664
$$ plain form
3979 3013120 4417536 4644352 4521472 5019648 4710912 3559424 4495872 4808192 3668480
3970 3668480 4610560 4840448 4307456 3350528 4080640 3466752 4012032 3878400 4953600
3961 4953600 4473344 4625408 4119552 4665856 3985920 3027968 3176960 4477440 3632640
3952 3632640 4254720 2883584 4749312 4019200 5149184 5405184 4376064 3312128 3230720
3943 3230720 3905024 3512832 3354112 4103168 3346432 4639232 3964416 3853312 3341312
3934 3341312 4667392 5052928 4442624 5105152 4674560 4984320 3900416 3879936 4894208
3925 4894208 3568640 4873216 4656128 4203008 4124160 4271616 4734464 4068864 4701696
3916 4701696 3507712 4271616 4366848 3732480 3981312 4067840 4618240 5235200 4077568 4319232
3906D319232p87968J977856j171968m44416M71040j10592J189888J15712n45280
3897E013504l63008J30560K7648R29792r07264m64896n18656J561600r66144Q20736
3887E263872m17792o32832J752064q65280r62048Q06912p18848O57920K11456
3878E095424M74112Q4480o75328q90880J100288O42560p32672J30048P52128o93248
3868E286912K73920P84384r04192k20672J71008P17824R728Q61184k3552j177088
3858E779456n46304J674752l9936n50400J186304j647616R70752L00544m41344
3849F686208K88256N99040Q26880q68352O46656J171456j077760O14912j37728
3840H749568p8336m62848J230336O45120P57760p4240K048p21920J078272J370112
$$ plain form
3906 4319232 3531264 5509120 4337152 3892736 4363776 4253184 5443072 5558784 5013504
3897 5013504 4650496 4781056 4808704 5738496 4831232 4366336 3847680 5409280 4443136 5263872
3887 5263872 4846080 4213248 5965312 5100032 4137984 4944896 4226048 4883968 5095424
3878 5095424 5569536 5654016 4978688 4087808 5188096 5830656 5097984 5228032 5980160 5286912
3868 5286912 5560832 6345216 5441024 5220352 5391360 6109184 6118912 6980096 6956544 5779456
3858 5779456 5233152 6907904 6867968 6317568 7503872 5856256 6827008 7127552 6686208
3849 6686208 6974464 7573504 8400384 7532032 8178688 9350144 8272384 8887296 8749568
3840 8749568 8671232 8208384 9438720 10083840 10841600 10767360 10769408 10047488 11125760 12495872
3830A2495872q25856K750976j22880P68000J309696P12192K92864J997824o01600
3821A8777088m79232R27232J035264p3728l584M37760Q64256O01088J018368j06496
3811B2998016J522688J041920M55168J993728J453568n47840r25184j474048k047488
3802B4470528m414976l298304l079680j741312k024448R16992o54848m66944j048064
3793H658944O5536j145344J65376J022464n01248l18464K10944J02912p75680
3784G485440J077248P8848j111040J731072l02592O58944M49024j15712l27168
3775I624064L81952q51968L42528n29408o11328K2016J2800J150464m51072K81088
3765I371136P46496j399808j14176O47168j181184J380352o17472J236480q7552
$$ plain form
3830 12495872 11670016 14420992 14298112 15066112 16375808 17088000 17380864 19378688 18777088
3821 18777088 18297856 19225088 20260352 20186624 20183040 20620800 21485056 22086144 23104512 22998016
3811 22998016 24520704 25562624 26017792 28011520 29465088 28917248 27992064 26518016 24470528
3802 24470528 20055552 16757248 13677568 11936256 9911808 10828800 10173952 9707008 8658944
3793 8658944 8724480 7579136 7744512 8766976 8265728 7947264 8158208 8261120 7485440
3784 7485440 8562688 8641536 7530496 9261568 8958976 9617920 10066944 9951232 9624064
3775 9624064 10006016 9154048 9496576 8967168 8355840 8377856 8390656 9541120 9090048 9371136
3765 9371136 10117632 8717824 8603648 9250816 8069632 9449984 8832512 10068992 9981440
3756I981440j320448m35712J438208l78880M39296L85536J611776P95648J158656
3747A3675520j108992J503744P43936k623488q73472p91552o69184j65888j678848
3738H011776J2288O43072r09824P29088j45408J392128j372672L03104j60768
3729H502784l31776M58240J35680k7136K71360j233920Q70400n1200p54688J044992
3719H884736r83552P72096L8400K28864n66272Q15616m8640o93248K95424j633792
3709G109632R12384J27488j269760J99680N14048j199616Q40704q43264m92032
3700E899264J638400j34656J13664j23904R77920j128960R7792N15072k395648
3691E458944K057728n7856j67936o43584J265152j103360M25472r08288J344512
$$ plain form
3756 9981440 8660992 8225280 9663488 9284608 9723904 10109440 11721216 12516864 13675520
3747 13675520 12566528 14070272 14814208 12190720 11317248 10525696 9856512 9690624 8011776
3738 8011776 8024064 8667136 7757312 8486400 8340992 9733120 8360448 8663552 8502784
3729 8502784 8171008 8629248 8764928 8737792 9009152 7775232 8645632 8594432 7839744 8884736
3719 8884736 7901184 8673280 8711680 8940544 8374272 9189888 9141248 8448000 8743424 7109632
3709 7109632 8022016 8149504 6879744 7079424 7593472 6393856 7234560 6391296 5899264
3700 5899264 7537664 7403008 7516672 7392768 8370688 7241728 7339520 7854592 5458944
3691 5458944 7516672 7458816 7290880 6647296 7912448 6809088 7234560 6326272 7670784
3682G670784j077760K72384J007104k26304J67936j80736R2672J10080l45088
3673G491072q54528J012736p2192L82464N61152k82624M04992k61120P41888j592320
3663G531520J235456k97984k12480q8064J74592j302528J542144p96672J038848
3654H824832L78880J85856j899008L61472K1504K79552O4000J4336n10976m90496
3644G229952R20064j34144J051648j192960J114112o67648R36448j75104m49536
3635H632832q09472J170432q6016j124864J809920p83872R94816r92256K59584
3626I071104J89952l47648J088000l8400n44256J2288L45600K54464j682432K460672
3616A0809344j387520M31616P18848m99200M83328n03808J88928P85408j3312
$$ plain form
3682 7670784 6593024 6865408 7872512 7646208 7814144 7633408 7726080 7836160 7491072
3673 7491072 6636544 7649280 7577088 7959552 8520704 8238080 8643072 8381952 9123840 7531520
3663 7531520 8766976 8468992 8256512 8168448 8343040 7040512 8582656 7785984 8824832
3654 8824832 9203712 9389568 7490560 7852032 7873536 8153088 8217088 8231424 7720448 7229952
3644 7229952 8150016 8015872 9067520 7874560 8988672 8321024 9257472 9082368 8632832
3635 8632832 7823360 8993792 8907776 7782912 9592832 8808960 9803776 8811520 9071104
3626 9071104 9261056 8913408 10001408 9963008 9418752 9431040 9776640 10031104 8348672 10809344
3616 10809344 9421824 9853440 10572288 10073088 10556416 10052608 10241536 11026944 11013632
3607A1013632m43904n43232K32960N41696N73952j784832J402880n16608N69856
3598A1046400P6288J263104p15264m14720O10816j116672Q61696J234432M02432
3589A3248512j618944P75680O5024Q32512m87424M85376q97536Q13056l4816N23776
3579A3705216k19136R85088r9840J097728k02752o9120m4544O25664K8672q00768
3569A5006208J065472l12320O82496J164288o01088R11360P6288J317376n49888
3560A8760192l11296L75296m80768j70496O73280R20064j362944R87648k62656
3551A9128320J004032M20352J491456r9840O50752J931776K60096j09056R70240
3542B5648128L15392Q51968J903104j74080O65088O43072J585664J47456R40032
$$ plain form
3607 11013632 10569728 10026496 10259456 10801152 11375104 9590272 10993152 10476544 11046400
3598 11046400 11122688 12385792 11670528 11255808 11866624 10749952 11611648 12846080 13248512
3589 13248512 11629568 12405248 12470272 13302784 12815360 13300736 12403200 13216256 13181440 13705216
3579 13705216 13486080 14471168 14371328 15469056 15266304 15197184 15152640 15778304 15806976 15006208
3569 15006208 16071680 15759360 16441856 17606144 17005056 17916416 17992704 19310080 18760192
3560 18760192 18448896 18824192 18343424 18172928 18846208 19766272 18403328 19390976 19128320
3551 19128320 20132352 20552704 22044160 21944320 22595072 24526848 24786944 24677888 25648128
3542 25648128 25963520 26815488 28718592 28544512 29209600 29852672 31438336 31585792 32525824
3533C2525824K006016L54304J245696M67456J780736J722368K117120J890816
3525D4110336K844160l23072M206592K628096J799168L694592J776640M300800
3517F5037312M140032M081152O152704O949376N980672Q152576P749632Q259072
3509A16502528R248256R251840J0418176J1628032J0629120J2956160J5431680
3502A96065792J7728512J9515904K3650816K7531264L4221568M2651648N5710720
3495D17076224P2665088J00601856J31167744J69231872J76268288J18631936
3489A185643008o457344j31470336j97142016k00429568j65906944j23366912
3483C60869888q9695744o2241280m3182080l1088640k3008768j7533440j1946496
$$ plain form
3533 32525824 34531840 34886144 36131840 36599296 38380032 40102400 42219520 44110336
3525 44110336 46954496 46631424 50838016 53466112 55265280 58959872 60736512 65037312
3517 65037312 69177344 73258496 79411200 86360576 92341248 100493824 108243456 116502528
3509 116502528 125750784 135002624 145420800 157048832 167677952 180634112 196065792
3502 196065792 213794304 233310208 256961024 284492288 318713856 361365504 417076224
3495 417076224 489741312 590343168 721510912 890742784 1067011072 1185643008
3489 1185643008 1179185664 1047715328 850573312 650143744 484236800 360869888
3483 360869888 271174144 208932864 165750784 134662144 111653376 94119936 82173440
3476H2173440j2381184o697472q293888n527552m155904m217856k001920j139200
3468C7758464k348544l136000j060352k059776j753088j787904k095104o37440
3460B2880256L11296k091520n42720k688512Q08448p30112r69728m36224K15040
3451A6756224j991680P50080j300992J23904n21216l75808r06752j77152N48352
3442A2904960j467904j96608j61280L78368j170432K15040j036800N72928o34368
3433I403904l35872L56352o80960N16608j166848k49856J423360n5808n49376
3424H661504q26368O85568j1776m83328j902592L36384J52064m9664p08096j230848
3414D622848L29728L42528q94976P52640p41376P07584p30624O28224o77376k15040
$$ plain form
3476 82173440 69792256 63094784 54800896 49273344 45117440 40899584 38897664 37758464
3468 37758464 35409920 32273920 31213568 29153792 27400704 25612800 23517696 22880256
3460 22880256 23191552 21100032 20557312 17868800 18677248 17947136 16977408 16541184 16756224
3451 16756224 14764544 15514624 14213632 14337536 13816320 13440512 12533760 12356608 12904960
3442 12904960 11437056 11240448 11079168 11457536 10287104 10502144 9465344 10038272 9403904
3433 9403904 9068032 9424384 8743424 9260032 8093184 7843328 9266688 9210880 8661504
3424 8661504 7835136 8520704 8508928 8025600 6123008 6459392 6611456 6561792 5853696 4622848
3414 4622848 4952576 5295104 4400128 5152768 4411392 5118976 4388352 5016576 4339200 4124160
3404D124160R79456l2768L45600j10592p59808k67776J210368P6288o91712K53440
3394E126656r85088P75680j33632r8816L63008k77504n29920N15072l89120o32832
3384C733504J509376j159168m49024m11648O97856q1408l6864K4576m63360K85696
3374C649536M28544l32288q98048O53824j191424J285120o37440P85408r65632
3365B777600M35712N2736P67488p79264j22880O1952P59296j609216J416192J53088
3355C912704j389056m21888J074176j202176J34656P41376l0208l38432R10848
3346C392000J00864r01632N62176p16288J025024K42688r87648m62336O88640
3337B943488J5872J024M0448j49504l10784O02624L61472l86048Q19712l66592
$$ plain form
3404 4124160 5103616 5070848 5416448 5305856 4546048 4278272 5488640 5564928 4873216 5126656
3394 5126656 4141568 4917248 4783616 4684800 5047808 4770304 4240384 4755456 4366336 3733504
3384 3733504 5242880 4083712 3634688 3223040 3920896 3839488 3802624 3827200 3363840 3649536
3374 3649536 4078080 3745792 2847744 3501568 2310144 3595264 2957824 3743232 2777600
3365 2777600 3213312 3266048 4033536 3254272 3131392 3193344 3952640 2343424 3759616 3912704
3355 3912704 2523648 2101760 3175936 1973760 2108416 2849792 2819584 2481152 3392000
3346 3392000 3492864 2591232 3153408 2437120 3462144 3704832 2717184 2254848 2943488
3337 2943488 2959360 2960384 3000832 2851328 2540544 3143168 3504640 3118592 3938304 3571712
3327C571712k13504k27840l17440l6864p23456O10304K82112j35168k66240L38432
3317B882048q75008K21184P60832o1440Q62208j163264p9360J215488j059840
3308B702848Q704M10112L4304k76480R57952p67488R95328R34400O54848J381888
3298G036416j064960P57248J120768n74464l88096j324544k34496Q3968O02624
3289F014464j872384k0480o15936j05472O36928q72960M20864j285120N83168
3280B883072R28768o49728o20032M31616p16800J147904j046016j99680Q27904
3271B987008m17280L00544j94048N1712n27360O45120k71872n66272L34848J42848
3261B485248L10272j03424R4208K74432L26656r84576J220096n56032N25824n16096
$$ plain form
3327 3571712 3358208 3130368 2812928 2776064 2052608 2662912 2945024 2809856 2543616 2882048
3317 2882048 2007040 2228224 2989056 2927616 3789824 2626560 2547200 3762688 2702848
3308 2702848 2711552 3121664 3155968 2879488 3837440 3069952 4065280 4999680 5654528 7036416
3298 7036416 5971456 6728704 7849472 7275008 6886912 5562368 5327872 5411840 6014464
3289 6014464 4142080 4121600 3505664 3400192 4037120 3164160 3585024 2299904 2883072
3280 2883072 3811840 3162112 2542080 2973696 2256896 3404800 2358784 2159104 2987008
3271 2987008 2569728 2870272 2676224 2727936 2200576 2845696 2573824 2007552 2342400 2485248
3261 2485248 2795520 2692096 2786304 3060736 3387392 2402816 3622912 3066880 3592704 3076608
3251C076608K41664N19680j29536N74976j739264P37792J351680l47136l94240
3242C892224k82112q84736K355200l5840N30944N27360k005504K260480M74624
3233F832640R35424L6864n9392J110016L09248J124864J16736m67456P33696J128960
3223A1801600O6048N21728P44448p680Q63232O03648M00896k43200R07264n42208
3213A5115776O59968J113088j030144o97856P93088J50528J08544m77184n46304
3204A5189504J687040r75360j337856Q23808p6288M13184J024K72384n4784m5056
3194A5897600j37728J384448R55392r15456J909248n94432P78240M94592p11168
3185A9060736J153536L60448L51232M95616J580032k54464O97344Q82688J414144
$$ plain form
3251 3076608 3318272 3837952 3708416 4283392 2544128 3281920 4633600 4286464 3892224
3242 3892224 3610112 2725376 5080576 5044736 5575680 6103040 4097536 6358016 6832640
3233 6832640 7768064 7804928 7745536 8855552 9164800 10289664 10406400 9938944 10672640 11801600
3223 11801600 11867648 12389376 13133824 13126144 13989376 14593024 14993920 14750720 15657984 15115776
3213 15115776 15775744 16888832 15858688 15160832 15953920 16104448 16212992 15735808 15189504
3204 15189504 16876544 15901184 14563328 15387136 15310848 15724032 15725056 15997440 15942656 15897600
3194 15897600 15759872 17144320 18099712 17184256 19093504 18499072 19277312 19771904 19060736
3185 19060736 20214272 20574720 20925952 21421568 23001600 22747136 23444480 24327168 25741312
3176B5741312j7408J040896p02464r5744j983488k318848l025920j627136k113024
3167A4898176k557440j319936j266176j801728j12640k72896n40672m68480j08544
3158F449664N42720o94784q20224R05216n6832P91040p77728R69216l48672o71744
3148F287872L83488l74784O13888L18976J24416j413632N632j81760K80064P15264
3138F759424o5536j213440n04320J316864o19520M80768K50880p2704j82272J08032
3128F258176P65440L91168r99424j02912k56000l6352o35904n3248M38784J28512
3118E898240n60640J16224k61120m19328j13152J145856q56064P29088j43872
3109E535232j127936k27840J106432k560L63008r29792N26848Q35584r45664l46112
$$ plain form
3176 25741312 25723904 26764800 26062336 25966592 23983104 21664256 18638336 17011200 14898176
3167 14898176 12340736 11020800 9754624 7952896 7840256 7567360 7026688 6558208 6449664
3158 6449664 6992384 6297600 5477376 6382592 6325760 7116800 6339072 7308288 6959616 6287872
3148 6287872 6671360 6296576 6910464 7229440 7353856 5940224 5945856 5764096 6044160 6759424
3138 6759424 6693888 5480448 4976128 6292992 5673472 6154240 6405120 6332416 6150144 6258176
3128 6258176 7023616 7414784 6415360 6312448 6056448 6020096 5384192 5330944 5769728 5898240
3118 5898240 5337600 5453824 5192704 4773376 4660224 5806080 4950016 5679104 5535232
3109 5535232 4407296 4179456 5285888 5283328 5646336 4716544 5243392 6078976 5133312 4787200
3099D787200K37056l6352j58720m3520K30912K4064j02400p0656M42368r26720
3089D383232K010624j175552k7136J92000J143808q47360Q81664k76480N08416
3080F793216m61312P20896O77376j345024J120768J417216K11968J445376L536384
3071A4116864K087936L512832O27200J491456Q85248k663424k808832l786752
3063A3462528k285056l886592j423872J76128p98720J455616k664960R14432p12704
3054D236800J49504o39488P23968o17472J284096l69152R4208l81952k0480K11456
3044D671488n91360R216M0960j274368Q21760P38816k68800m13696M93568o38976
3034C588608M92032j42848Q42752R4720P59296j676800M70528J47456o96832J49504
$$ plain form
3099 4787200 5024256 4987904 4829184 4785664 5016576 5040640 4938240 4867584 5309952 4383232
3089 4383232 6393856 5218304 5191168 5383168 6526976 5679616 6561280 6284800 6793216
3080 6793216 6331904 7052800 7730176 6385152 7505920 8923136 9135104 10580480 14116864
3071 14116864 16204800 19717632 20344832 21836288 22721536 20058112 17249280 13462528
3063 13462528 11177472 7290880 5867008 6043136 5244416 6700032 4035072 4949504 4236800
3054 4236800 4386304 3746816 4470784 3853312 5137408 4768256 4862464 4480512 4460032 4671488
3044 4671488 4080128 4089344 4130304 2855936 3677696 4416512 4147712 3734016 4227584 3588608
3034 3588608 4080640 3937792 4780544 4875264 5634560 3957760 4428288 4575744 3878912 4028416
3024D028416m39808n83168J059840m65408R08800j353216L57888N46304l00032
3015C759616p22432R07264Q9600N14560p45984J12128m44416N50912m03968o34368
3005B982912O12864p21920J563136o38464k65216J207296j122816N18656o79936
2996C456512Q84736n4272n27872M9152P39328p81824L63520L88096n73440r3184
2986C850752p35232J177088l47136p68000O76352J008640j016320l17952j12640
2977C415552M4032k64192N56032O144L20000l61984P31136j100288K14528K64192
2967C825152M79232M63360j452032K83136J052672l95264q47872K32960J230336
2958D871680j070592j017856J099264o1952j28512K74432o38976O01088N2736
$$ plain form
3024 4028416 3588608 3005440 4065280 3599872 4508672 3155456 3513344 4059648 3759616
3015 3759616 3037184 3944448 4034048 4548608 3802624 3914752 3470336 4021248 3617280 2982912
3005 2982912 3595776 2873856 4436992 3798528 3533312 4740608 3617792 4136448 3456512
2996 3456512 4341248 4286976 3759104 3808256 4547584 3765760 4129280 4517376 3943936 3850752
2986 3850752 3115520 4292608 3945472 3177472 3853824 4862464 3846144 3528192 3415552
2977 3415552 3459584 3195392 3751424 3757568 4077568 3715584 4446720 3346432 3560960 3825152
2967 3825152 4304384 4767744 3315712 3598848 4651520 4256256 3408384 3641344 4871680
2958 4871680 3801088 2783232 3882496 3820544 3692032 3966464 3327488 3928576 3981312
2949C981312n6832M41344L4304k25792K66752P75680j289728j37216Q05888O2976
2939D658688L37920j060864L30240N87264p80800O23616q78080L26144N01760
2930D645888k39616o42048P41376Q02304j104896K59584o81472P5776K75968M12672
2920D545536q12544L49696J43872j828864K597888r93280k79040P42400p20384
2911C745280M40320j271296J130496O15936Q11008j124352J011712n72928L9936
2902D826112K51904J317376l34336k26816J86368l65056j175552P11168P69536
2893E960704n07392K59584n79584L86560R56928p23968J828352r58464M62848
2884G085568J253888j231360Q88320P68000J328640K81600J870336j386496J099264
$$ plain form
2949 3981312 3924480 4365824 4400128 4174336 4441088 5216768 3927040 3789824 4595712 4658688
2939 4658688 4996608 3935744 4265984 4853248 4072448 4696064 3817984 4144128 4645888
2930 4645888 4406272 3764224 4505600 5307904 4203008 4462592 3781120 3856896 4132864 4545536
2920 4545536 3732992 4082688 4226560 2397696 4995584 4002304 3723264 4465664 3745280
2911 3745280 4185600 2914304 4044800 4660736 5471744 4347392 5359104 4786176 4826112
2902 4826112 5078016 6395392 6061056 5834240 6020608 5655552 4480000 5191168 5960704
2893 5960704 5453312 5712896 5133312 5519872 6476800 5752832 7581184 6622720 7085568
2884 7085568 8339456 7108096 7996416 8764416 10093056 10374656 12244992 10858496 11957760
2875A1957760M74112L59936N11488N51424k22720l66592R99936J35168Q86272
2866A5286784o46656J604608L9936J50016K353664k89792K998272J223680N21728
2857B3242240n61152N84704j576960k09920J238016M915200M794368J50016n896704
2848B6679808m462592m720128n862400k967040j012736p50080O7584r87136o89664
2839E295616Q06912o23104l69152l97312p680N41696o47168N30432p81312R14944
2829E263872j87904o78400M90496n60640M74624j293312J404928l95776N82656
2820E100544M62848m16768n45792n7856r24672O84544k7136Q78592k14016J45920
2810E086208n62688l36896M72576n92384J31072O63040r06752l06688j44384L86560
$$ plain form
2875 11957760 12431872 12791808 13303296 13854720 13632000 13265408 14265344 14400512 15286784
2866 15286784 14640128 16244736 16284672 16434688 18788352 18498560 21496832 22720512 23242240
2857 23242240 22681088 23265792 21688832 21478912 22716928 27632128 32426496 32576512 26679808
2848 26679808 22217216 17497088 11634688 8667648 7654912 6904832 6972416 5985280 5295616
2839 5295616 6102528 5479424 5110272 4712960 4705280 5246976 4599808 5130240 4348928 5263872
2829 5263872 5075968 4397568 4888064 4327424 4802048 3508736 4913664 4517888 5100544
2820 5100544 5563392 5146624 4600832 4542976 3618304 4302848 4275712 5154304 4940288 5086208
2810 5086208 4523520 4186624 4659200 4066816 4197888 4860928 3954176 3647488 3503104 3889664
2800C889664p71072J021952l31264l25632j02912Q64768J73568k32448j247744
2791B938880K640384j152512J43360l3792k14016M20352j75616l55328N49888
2782D761600P84384K14016m22400p4240j56672R79456j13664P15776n56544o39488
2772E492224J285120J094144p2192J159168K21184R18016M93568J421824L595264
2763A5608320M982784R293312P673856J064960n432320n821952n732352o577664
2755A5058944r40032j28000L664896M814848K150400l05664k730496k420736l488256
2746A5675904r46176m4544N778432Q667136K905600j916928l628544m352512o322688
2737A5815680l138048K17088J977344N522432J544192m20864m280320k682880
$$ plain form
2800 3889664 3118592 4140544 3809280 3483648 3380736 4245504 4419072 4186624 2938880
2791 2938880 5579264 4426752 4570112 4536320 4322304 4742656 4567040 4211712 4761600
2782 4761600 5545984 5760000 5337600 5263360 5106688 6086144 5972480 6688256 6131712 5492224
2772 5492224 6777344 7871488 7799296 8958464 9179648 10097664 10591232 12013056 15608320
2763 15608320 20591104 29884416 37558272 38623232 33190912 27368960 21636608 15058944
2755 15058944 14118912 13990912 17655808 22470656 24621056 24315392 21584896 19164160 15675904
2746 15675904 14729728 14685184 20463616 29130752 32036352 30119424 26490880 22138368 15815680
2737 15815680 12677632 12894720 14872064 20394496 21938688 21517824 17237504 14554624
2729A4554624m041728k615296j536P16800L317760L49184j261568q60160j240576
2720H917504k954752m16256j079808o17472l08736J2288o99904J476096j143296
2711C185664k90304j76128Q73984K62656L34336j34656k62656R5744k64192j04448
2701C520000O49728O67648o34880M23424j09568m37248n02272O96832m78208J310720
2691E106176r85088L32288L90656n69344m11648k24256j526272J56160N8880k42176
2681B085376J475584q32512o21568l3792O68160j221120J183232j129984N1712
2672A625088k47296J646080o96832R25696j252864n23776N96992M5568j55136
2663A963520O97856l52768I51808Q89344J22880P5264P74656j340928L67616R04192
$$ plain form
2729 14554624 10512896 7897600 7896064 8612864 11930624 12279808 11018240 10158080 8917504
2720 8917504 5962752 5546496 4466688 3849216 3540480 3552768 2852864 4328960 3185664
2711 3185664 2895360 2719232 3593216 3855872 4190208 4055552 3792896 3888640 3624448 3520000
2701 3520000 4169728 4837376 4202496 4625920 4516352 4079104 3576832 4273664 3795456 5106176
2691 5106176 4121088 4453376 4844032 4274688 3863040 3638784 2112512 2268672 2327552 2085376
2681 2085376 3560960 2728448 2106880 2073088 2741248 1520128 2703360 1573376 1625088
2672 1625088 1377792 3023872 2327040 3252736 1999872 1476096 2073088 2118656 1963520
2663 1963520 2661376 2308608 951808 1841152 1964032 2039296 2813952 1473024 1840640 2744832
2653B744832j1776l52768n25824L16416J78176K60608J54112n95456N88800r46688
2643A810432j90464L24608p69024N29920M1984J13152o92736Q27392J1264M13696
2633B420224k96448n95968J783808o98368A168896J018880L7376j30048n38624
2624A556480P72608l90656R34912j047040o0928m49536R04704m60800K14016L44064
2614B317824o79936M32128N85216N51424j484288J96608M49024n01760k27840
2605A638400J184768p58784J17760P08096o20032k88256Q78592p92064J07008
2596B175488j53088J174016n51424L8400j221632J164800l53280J987072p14752
2587C545600j145856J04448m1984Q48384j608704J133568O03136p79264L22048
$$ plain form
2653 2744832 2733056 2380288 1854464 2170880 2349056 2609664 2763776 2168320 2757120 1810432
2643 1810432 1619968 1944576 1175552 1705472 1747456 1860608 1167872 1995264 2006528 2420224
2633 2420224 2123776 1527808 3311616 2613248 1168896 2187776 2225152 2095104 1556480
2624 1556480 2329088 1938432 2873344 1826304 1765376 1315840 2220544 1759744 1973760 2317824
2614 2317824 1637888 2070016 2655232 3206656 1722368 1918976 2368000 1866240 1638400
2605 1638400 2823168 2064384 2182144 2890240 2270208 1981952 2860544 2068480 2175488
2596 2175488 2022400 3196416 2644992 2683392 1461760 2626560 2273280 4260352 3545600
2587 3545600 2399744 2504192 2462208 3310592 1701888 2835456 3438592 2659328 2981376
2578B981376k30912K76480O8096m93056P22432m4544j24928J114112j452544N00224
2568C316736J95584l84512l43552j56160P88480r0624N09952k44224L35360r70752
2558B956288L50720m40832J226240M30592r54880l9936J57696q24320J548288
2549D409856o10304J68448m73088q9088M0448R94816j157120L16416m87936N24288
2539C636736O74304p17312j118720O72768J77152m19840J380352p04000q59648
2530B721792j42848J17760r2160M61312m2496J86368k66240L09760j87904p37792
2520B327552O22592L81952N02784l40992O20544l43040Q22784j070592K95424
2511C819008j64864M76672L48672m41856j51040j99168P4240K45760k10944K6112
$$ plain form
2578 2981376 2750464 3026944 3095040 2601984 3324416 3279872 3154944 4269056 2816512 3316736
2568 3316736 3512320 3127808 2784256 2628096 3416576 3325952 3835904 3591680 3927040 2956288
2558 2956288 3307008 2866176 4092416 4523008 3568128 3528192 3685888 2861568 4409856
2549 4409856 3799552 3968000 3494912 3405824 3446272 4441088 3283968 3600384 3112448 3636736
2539 3636736 4311040 3593728 2475008 3147776 3324928 2905088 4285440 3581440 2721792
2530 2721792 2578944 2696704 2604544 3065856 3023360 3209728 2943488 3253248 3065344 2327552
2520 2327552 2950144 3332096 3834880 3493888 4114432 3771392 4594176 3523584 3819008
2511 3819008 3654144 4130816 4479488 4037632 3886592 3687424 3761664 4007424 3796480 3822592
2501C822592q07936O30272m71552R13920m46464r32352J226752m27520L42016
2492C849728K66752k52928j73568l23072J665536Q6016n38624l71712j86368M86400
2482D508160M00896l33824j8432J768448j291776Q21248l5328r69216k36544l4816
2472D578816M76160J63328q90880l87584Q07936j049600M36224L90656J165312
2463E690368j800704M31616J051648m03968l67104k87744J859072j719296R57440
2454E411328j112064Q39168m86912M37248l73248L57376P5776l76320l1744L40992
2444E081600m62848j80224L75296l46624K04288Q68352q62208k44736J552896
2435E985792k78528j891840J638912j028608k16064Q38656r54368K35520J446400
$$ plain form
2501 3822592 3014656 3644928 3173376 4087296 3640832 2708480 3935232 3507712 3849728
2492 3849728 4116480 3863552 3689984 3366912 5032448 5118464 4579840 4208128 4021760 4508160
2482 4508160 4909056 4575232 4556800 6325248 5033472 5854720 5819392 4850176 4613632 4578816
2472 4578816 5054976 5218304 4327424 3939840 4747776 3698176 4134400 4525056 5690368
2463 5690368 3889664 4321280 5372928 4968960 4601856 4314112 6173184 4453888 5411328
2454 5411328 4299264 5138432 4651520 5088768 4715520 5072896 5148672 4772352 4740608 5081600
2444 5081600 4618752 4438528 4813824 4467200 4671488 5539840 4677632 4432896 5985792
2435 5985792 5707264 3815424 5454336 4425728 4209664 5048320 4093952 4329472 5775872
2426E775872j596928J754112o87104p94624L84000L76320O04160p41376r09312
2417D165120J703936j24416o10304M45440n18144l51744R91744q65280J82272
2408E018624O04160n76000P96672q22784Q51456L34336j83296p44960P54688L53280
2398F386176j686016N77024J90976N24800k47808o92736J406464p92576K12992
2389E879296m97152J07008R20064l63008j321472L56352J114112r18016J41824
2380E419008M0960K53952J297920j293824Q13568k89792P41376n89824m23936
2371E969408J025024m03968j403392K56512j41824l18464m23936L82976l06176
2362D636160J169920j007104K26304r2672j50016k71360K43712l85024R88160
$$ plain form
2426 5775872 4178944 5933056 5245952 4451328 4835328 5211648 5815808 5074432 4165120
2417 4165120 5869056 5744640 5134336 5579776 5061632 4709888 5701632 4836352 5018624
2408 5018624 5622784 5046784 5843456 5020672 5872128 6206464 6023168 5278208 6032896 6386176
2398 6386176 4700160 5277184 5468160 5992960 5745152 5052416 6458880 5666304 5879296
2389 5879296 5382144 5489152 6409216 6046208 4724736 5081088 6195200 5277184 5419008
2380 5419008 5459968 5713920 7011840 5718016 6531584 6241792 6983168 6393344 5969408
2371 5969408 6994432 6590464 5187072 5443584 5301760 4983296 4559360 4942336 4636160
2362 4636160 5806080 4798976 5025280 4932608 4782592 4511232 4754944 4369920 5358080
2353E358080j20320m70528j672704O01088Q72960J26976j47968q80640O23104
2344D290048l65056j033728J251840N58592r53344R21088j152512J45408N61664
2335D224000P69536j798144M43904O01088k79552o9120m61312R49248N57568q28928
2325D108288L23072N49888j047552K06848L74784J78688M22400K5088l0208K79552
2315E390848r42080J504768j421824J221632j55648j070592J196544j026560J053696
2306E750784K18112p25504J64864K32960l05152O93248j242624J903104n61152
2297F128640j76128M42880k30912o68672J858048o74816j315840J618432N4272
2288G035904k048r42592J596928J88416L84512P95136j46944n37600L59936q8064
$$ plain form
2353 5358080 5237760 4767232 3094528 3695616 4568576 4695552 4547584 3666944 4290048
2344 4290048 3924992 2891264 4143104 4701696 3748352 4669440 3516928 3662336 4224000
2335 4224000 4993536 3195392 3639296 4240384 3960832 3891712 3430400 4379648 4937216 4108288
2325 4108288 4431360 4981248 3933696 4140544 4515328 4694016 5116416 5141504 5111296 5390848
2315 5390848 4448768 5953536 4531712 5753344 5597696 4527104 5723648 4697088 5750784
2306 5750784 5968896 5243392 5408256 5641216 5336064 6029312 4786688 6689792 6128640
2297 6128640 5952512 6395392 6164480 5495808 7353856 6679040 5363200 6981632 7035904
2288 7035904 7033856 6091264 7688192 7876608 8261120 9056256 8909312 8371712 8731648 8643584
2278H643584j072640m67456J117184j256960M02432k67264M3008n82144P93600
2269G353344l79904J199616j98144r5744O49728j85344j440256L1232o8608P11168
2259G577088Q86784j526784J530368r43616l76832M97152j140224J730560n57568
2250G676928k57536P33696o78400k85184R79456j211392P35232j401856J789952
2241H080896m64384m04992K94912p71584N83680J38752k06848P60832j283584
2232F727680M11648J429504p90528J58720K01728N97504j411072M79232M92544
2223H296960j876480P80288R35424l72736j349632P00416l1744j511936J198592
2214F769152j397760m3008P32672q61696P59296p0144l5840l66080O30784K25280
$$ plain form
2278 8643584 7570944 7103488 8220672 6963712 7366144 7098880 7141888 6559744 7353344
2269 7353344 6973440 8173056 7974912 7879168 8528896 8343552 6903296 6934528 6865920 7577088
2259 7577088 8463872 6937088 8467456 7523840 7147008 7644160 6503936 8234496 7676928
2250 7676928 7419392 8153088 7474688 7189504 8168960 6957568 7692800 6290944 8080896
2241 8080896 7616512 7211520 7506432 6734848 7318528 7457280 7250432 8011264 6727680
2232 6727680 7139328 8568832 7778304 7937024 8138752 8736256 7325184 7804416 8296960
2223 8296960 6420480 7200768 8136192 7763456 6413824 7114240 7082496 5570560 6769152
2214 6769152 5371392 5328384 6061056 5199360 5958656 5888512 5852672 5486592 6117376 6342656
2204F342656p69536K29376k95424O84032l18976Q90368j34656o73792r99424J728512
2194F683136j318400J220608j43872K60608K49344l37920j68960K66240j91488
2185F519296J29024J166848o2976j083904o75840J410560k86720J130496j085440
2176G161344M75648l99360n10464K62144N20704L43552k00192m4032Q84224r01632
2166G591936q65792R82016K68288J165824q98560n88800l9424J305088p5264J202176
2156A0047488j616896J147392o77376l46624J193472n21216J159680Q36096j133568
2147A0088448O69184r53344J293824r40544j220608J700352o95808M6080N87264
2138A0574848P37280j562112M93056o86592R25184K20160K60608J22368l7888
$$ plain form
2204 6342656 5573120 5802496 5507072 6191104 5872128 6762496 6627840 5954048 4954624 6683136
2194 6683136 5364736 6585344 6441472 6702080 6951424 6613504 6444544 6710784 6519296
2185 6519296 6648320 7815168 7752192 6668288 5992448 7403008 7116288 8246784 7161344
2176 7161344 7636992 7237632 6727168 6989312 7510016 7853568 7653376 7609344 8493568 7591936
2166 7591936 6726144 7708160 7976448 9142272 8243712 7654912 7615488 8920576 8845312 10047488
2156 10047488 8430592 9577984 8900608 8553984 9747456 9226240 10385920 11222016 10088448
2147 10088448 10757632 9804288 11098112 10157568 8936960 10637312 9941504 9987584 10574848
2138 10574848 11312128 9750016 10243072 9556480 10481664 10701824 10962432 11084800 11046912
2129A1046912Q64256k363392R04192N60128m24448P95648M01408j095168j41312
2120A0548224K70848K2528q60160J573376K33472j62304N74464j054208J146880
2111A2293120o81984j55648L88608l25632K83136l69152O11328l7376j56672R8816
2101A1948544N9392j373184J520128j596928J014272o08256L24608k40640K18624
2092A1266560K08384J042944m39296n632K453504M255744M536320J505280k258944
2083B2564864l390464k671616l308544j272320j516032q66816N71392N76000p96160
2074I890304k99008m2496N81632j449984P38816n57056P88992K45248o77888K91840
2064I510400j44896M1472M34688j55648l42016m61312k09408M84864o91200m10112
$$ plain form
2129 11046912 11911168 9547776 10451968 11012096 10587648 11383296 11784704 10689536 10548224
2120 10548224 10819072 10841600 9981440 11554816 11788288 11625984 12200448 11146240 12293120
2111 12293120 11611136 11455488 11844096 11518464 11801600 11432448 12043776 12006400 11849728 11948544
2101 11948544 12007936 10634752 12154880 10557952 11572224 10963968 11288576 11047936 11266560
2092 11266560 11474944 12517888 12078592 12072960 14526464 18782208 23318528 24823808 22564864
2083 22564864 19174400 16502784 13194240 11921920 10405888 9539072 10110464 10686464 9890304
2074 9890304 9591296 9548800 10130432 8680448 9419264 8862208 9651200 9896448 9218560 9510400
2064 9510400 9365504 9406976 9841664 9686016 9344000 8882688 8673280 9158144 8466944 8056832
2054H056832J037312j534464m54144O0928m43392j050624J364992j355776J73056
2045E854720M20864K92352N04320o81472J1776r8304L79392q01792L16928n47840
2035E650944N37600p99232J264640m39808M15744q13056O12864l73248j286656
2026D769792J692160j467904K97472K37568Q57088o74816L0208r09824J596416
2017F428160K3552m41344J37216P7312n2736k0480N86240n85216J383424r07776
2007F628352j88416j98656p4240R05728r31840M49536l91680Q43776p43424K03776
1997F502912P16800l85024o42048q72448J435648l45088j09056O61504k10944
1988F752256p06048J863680j587712N30432m41856M81792P16288L79904m19328
$$ plain form
2054 8056832 9094144 7559680 7105536 7166464 6723072 5672448 7037440 5681664 5854720
2045 5854720 6275584 6567936 7072256 6390784 6402560 6304256 6683648 5881856 6198784 5650944
2035 5650944 6188544 5389312 6653952 6214144 6629888 5816832 6429696 6056448 4769792
2026 4769792 6461952 4994048 5291520 5529088 6386176 5711360 5741568 4831744 6428160
2017 6428160 6451712 6010368 6147584 6224896 6172160 6151680 6737920 6152704 7536128 6628352
2007 6628352 6439936 6241280 6167040 7072768 6140928 6590464 6198784 7042560 6299136 6502912
1997 6502912 7219712 6834688 6192640 5320192 6755840 6410752 6301696 6963200 6752256
1988 6752256 6046208 7909888 6322176 6852608 6410752 6892544 7608832 7988736 7569408
1979G569408n85216O97856M98688P44960j81760j19296j19296j41312M85376m57216
1969H392192N39648n66272Q73472o87104J534464j353728P50080O78912L73248
1960A0534912K83136o32320N57568m57216o77888J317888j273344J562624o34880
1951A0580480M13696j37728q12544R77408N88800Q7040P16800m81792M45952L64032
1941A2742144k96960m7104J014784o95296R94304m04480q8064J354240O71744
1932A5245312j23392O59968j13152l02592J785856k427392P43936R40544j426432
1923A4982656n51936N39648j312256O91200j33632L12832j149952o28736J004032
1914A3753856r6256o78400j94048R67680q04352P44448l77344j412608N98528
$$ plain form
1979 7569408 6984192 7682048 8180736 8925696 8743936 8624640 8505344 8364032 8849408 8392192
1969 8392192 8931840 8365568 9239040 8551936 10086400 8732672 9482752 10161664 10534912
1960 10534912 10818048 10185728 10743296 10286080 9608192 10926080 9652736 11215360 10580480
1951 10580480 10994176 10856448 10043904 11021312 11610112 11697152 12413952 11932160 12378112 12742144
1941 12742144 12445184 12398080 13412864 12717568 13711872 13307392 13219328 14573568 15245312
1932 15245312 15121920 15781888 15668736 15366144 17152000 14724608 15468544 16409088 14982656
1923 14982656 14430720 14970368 13658112 14349312 14215680 14528512 13378560 12749824 13753856
1914 13753856 13657600 12979200 12785152 13752832 12948480 13692928 13315584 11902976 12501504
1905A2501504j05984m28032Q75520L69664l36896n67296Q13568k82624k93888
1896A2545536N30432n50400O72256m52096n4784P680K4576P07072j454080k25280
1886A1750912p0144L36896J94048j30048p23456K42688j721344J485824n17632
1877A0847744l97824l38944K47808P95648k347008P58784m84352J734144j148928
1868I667072l14368q5504J00864m10624L81440J24928q22784k05312J1776k38080
1858H209408J150976j510912R58464o75840L05664l63520n3760K5088m19328l0720
1848G595520J222144N66272j572864K50880l69152M87936L70688r64608J696256
1839I283072j191936J011200p19360m35712j89952Q46848n82656N98528K20160
$$ plain form
1905 12501504 12395520 11967488 12843008 13212672 12875776 12308480 13122048 12839424 12545536
1896 12545536 13075968 12525568 13197824 12745728 12690944 12698624 12723200 13430272 11976192 11750912
1886 11750912 11680768 12017664 12211712 12081664 11358208 11600896 9879552 11365376 10847744
1877 10847744 10449920 10110976 10358784 11154432 8807424 9566208 9081856 10816000 9667072
1868 9667072 9352704 9267200 9368064 8957440 9338880 9463808 8641024 8435712 8447488 8209408
1858 8209408 9360384 7849472 8807936 8132096 8437760 8074240 8020480 8045568 7626240 7595520
1848 7595520 8817664 9383936 7811072 8061952 7692800 8180736 8551424 7586816 9283072
1839 9283072 8091136 9102336 8382976 7947264 7757312 8604160 8021504 8620032 8840192
1830H840192k92864m43904J94048P35744N13024k18624J750016j538048M11648
1821I951232q55040Q18176J137152K84160o59456l55840J081344O9632J16224
1812A1587584M04480J33632O01600p06560k30912R13920j77152Q09472J000448
1803A4336512o34368J59744N5296P08608M05504O83520l5328K60608O99904j065472
1793A5574528K124800K10944m57216J400320l25120P94112J099776O34880K8160
1784B1085184N77536J789440J031680k75968K124288J464320R06752J870336O90688
1775C1264256J273344J006080J862144K558464O30272J140736J772032N83680
1767D2091008R46176K156032L11296M6080K680320l23584J530368K059776J220096
$$ plain form
1830 8840192 8547328 8103424 8297472 9033216 9546240 9327616 11077632 9539584 9951232
1821 9951232 9096192 9914368 11051520 11335680 10676224 10320384 11401728 11471360 11587584
1812 11587584 11992064 12125696 12727296 12020736 11789824 12703744 12526592 13336064 14336512
1803 14336512 13702144 13861888 13917184 14625792 15031296 15714816 15679488 15940096 16640000 15574528
1793 15574528 17699328 17910272 17453056 18853376 18528256 19322368 20422144 21057024 21085184
1784 21085184 21662720 23452160 24483840 24207872 26332160 27796480 28703232 30573568 31264256
1775 31264256 32537600 33543680 35405824 37964288 38594560 39735296 41507328 42091008
1767 42091008 43037184 45193216 45504512 45550592 48230912 47907328 49437696 51497472 52717568
1758E2717568K607616R91232K226688L347968K618880L667968L342336M366336
1750G5886592M490752N491200O872064P884800R144320R694720P504896M343296
1742A31312640K973696j304064p629312r015808j3302784j4013952j3830144j3919744
1734F1270528j0517504q713216o660096n609984l075072l577344j834496k292224
1726A8990592p84896j259520j087488r57952o51264n94432L64544k573312J490944
1717A2937216j319936J80736m23424n05856j315840J233920j65376j589248R07776
1708I939968J56672p5776J04448j866752P52640q84736O53312j368064R67680
1699H379392L92704j695744J057792k309632K025472j001472p69536O91200j053696
$$ plain form
1758 52717568 55325184 56316416 58543104 61891072 64509952 68177920 71520256 75886592
1750 75886592 80377344 85868544 92740608 100625408 109769728 119464448 126969344 131312640
1742 131312640 134286336 132982272 125352960 116337152 103034368 89020416 75190272 61270528
1734 61270528 50753024 42039808 35379712 29769728 26694656 23117312 21282816 18990592
1726 18990592 18205696 16946176 15858688 14900736 14249472 13655040 14019584 11446272 12937216
1717 12937216 11617280 11798016 11374592 10868736 9552896 10786816 10621440 9032192 9939968
1708 9939968 10096640 10020864 10125312 8258560 9011200 8126464 8779776 7411712 8379392
1699 8379392 8772096 7076352 8134144 5824512 7849984 6848512 6078976 6770176 5716480
1690E716480K351104j403904M30592o63552q48384R99424o74304n16096r0624
1681E300736M92032k89792o19520O91712m23936J98656r16480k26304N95456j33632
1671D668928L4816L54816k69312l66592j103360R93280j78688P86944j434112
1662C486720O71232o42048N54496m81792j68448m54144L01568J84320N48864J005568
1652E006336j393664l51744J344000j191424Q78592m17792m60800p32160J375744
1643D057088m26496J28512n73952M13184L3280j1264l57888P39328K79552k36032
1633D045312R27744j120768l21024J224704o90176r8816j22880M22400o20544
1624C645952Q33024r18016J83296J463808j271296R60512q53504R85088n08928
$$ plain form
1690 5716480 8067584 6663680 7094272 6430720 5582336 6581760 5907456 5391360 5300736
1681 5300736 5792768 5502976 4883456 5575168 5151232 5349888 4433408 4207104 4802560 4668928
1671 4668928 4703744 5058560 4789248 4422656 3319296 4312576 4133888 4920832 3486720
1662 3486720 4157952 3515904 4070400 3588608 3420160 2966016 3267584 3451904 4000768 5006336
1652 5006336 3612672 3260928 4604928 3413504 4292096 3874304 3413504 2681344 4057088
1643 4057088 3630592 3759104 3185152 3598336 3631616 3620352 3262464 4001792 4281344 4045312
1633 4045312 4973056 3852288 3531264 4755968 4065792 3966976 3844096 4266496 3645952
1624 3645952 4478976 3560960 3744256 5208064 3936768 4897280 4043776 5028864 4519936
1615D519936q9088K24256K70336N96992J51552K23744m10112K568704j702912
1606F353408j40800L71712r06240J279488R83552O144n48352M06016J8432J51552
1596G974912M01920Q34048J531904J41312M92032J220096K05824q20736m21376
1587A1559936J5360j903616J357824j088000j021952K91840q34560M76672R35936
1578I789440r44640Q64768j168896L49184k63168J25952p97696j01888J111552
1569H964608j047040R14944L65056j24928k86720l32800J567744j656832R67680
1560I331712m00384J302528J216000j01888M18816O15936K078720q6016k78528
1551A4096896M54144J8944p47520P17824k92864k872320k46784j091072m49024
$$ plain form
1615 4519936 4430848 4655104 4925440 5522432 5673984 5897728 5487616 8056320 6353408
1606 6353408 6212608 6584320 5678080 6957568 7941120 7947264 7398912 7804928 7823360 7974912
1596 7974912 8376832 9210880 10742784 10884096 11376128 12596224 12802048 11981312 11559936
1587 11559936 11575296 9671680 11029504 9941504 8919552 9211392 8376832 8853504 9789440
1578 9789440 8844800 9709568 8540672 8889856 8626688 8752640 7954944 7853056 8964608
1569 8964608 7917568 8832512 9197568 9072640 8785920 8453120 10020864 8364032 9331712
1560 9331712 8931328 10233856 11449856 11347968 11766784 12382720 14461440 14375424 14096896
1551 14096896 14551040 14569984 13822464 14540288 14247424 11375104 11128320 10037248 9588224
1542I588224J49504j463808j985536J396736k33472M83840M60800j491968J175552
1533H079872m08576K21184M60288M80256m58752J289728n7856P58272J139712
1524A1504128J513472r87648P29088L67616j065984o45120j676800K82624o84032
1515I337344j806848J94048l82976l57888j42848O5536j548288p77728O77888
1506E258240j427456P02464M12160j578496M17280O24128n08416N65760k006528
1497B459136J312256m82304j12640l96288N79072o45120K29888k81600P56224
1488C418624j522176J956352j04960o10304o75328M56704j20832k11456J346560
1479C933184q88320K93888p73632k63680J799168q7040m01920Q43264j637888
$$ plain form
1542 9588224 9737728 8273920 6288384 7685120 7451648 7935488 8396288 6904320 8079872
1533 8079872 7671296 7892480 8352768 8833024 8374272 9664000 9606144 10364416 11504128
1524 11504128 13017600 12029952 12759040 13126656 12060672 11415552 9738752 10021376 9337344
1515 9337344 7530496 7724544 7341568 6983680 6840832 6906368 5358080 4580352 5258240
1506 5258240 3830784 4533248 4945408 3366912 3784192 4408320 3899904 4465664 2459136
1497 2459136 3771392 3289088 3176448 2780160 3359232 2714112 2944000 2662400 3418624
1488 3418624 1896448 3852800 3747840 3137536 2462208 2918912 2798080 2586624 3933184
1479 3933184 3044864 3338752 2565120 2301440 4100608 4013568 3611648 4454912 2817024
1470B817024R24672k28864k08384K06336K64192o49216J279488p71072P79776
1461D413952o33344J04448Q72960j440256M56704N28896p94112R8304J174016
1452D781568j25440o33856K87744o52288O22080l9424r60512J159680N04320k5600
1442D918272p22432p40864J879040r4208p95136M096q48896J325568n2224M79232
1432E352448m57216J158656o51264j020928J618944j022976K5600L10272o48192
1423D665344Q94464p80288r32864m06016O1440p26016n37600p98208O79424q71936
1413A247744l12832J257472Q25344k28352r12384k42688L17952l84000R2672N30432
1403B191360I29280O69696K09408k08896E03296R38496C52768J359872o06208
$$ plain form
1470 2817024 3741696 3512832 3304448 3510784 3774976 3125760 4405248 3634176 4413952
1461 4413952 3780608 3885056 4758016 3317760 3774464 4303360 3509248 3607552 4781568
1452 4781568 4656128 4022272 4310016 3657728 4279808 4240384 3279872 4439552 4943872 4918272
1442 4918272 4195840 3454976 5334016 5239808 4444672 4448768 3599872 4925440 4873216 5352448
1432 5352448 4895232 6053888 5402624 4381696 6000640 4977664 5003264 5313536 4665344
1423 4665344 5559808 4779520 3846656 3440640 3502080 2776064 2238464 1440256 2119680 1247744
1413 1247744 934912 2192384 3017728 2789376 1876992 1634304 1952256 1568256 1660928 2191360
1403 2191360 929280 1598976 1808384 1599488 503296 1441792 352768 1712640 1106432
1394A106432K04800O69696K18112l25632E31968L54816M608J123328k49344D63360
1383A072640q7040J23392m89472R21600E50912O94272i0112G29600M91520M00384
1373A621504p61856C91168J674752G56736P27552m37248m5568K22208A64352a26464
1362A122304l00032N24288n89824e43232H99072p2192M94592B53440O29760f656
1351A345024A44384J315840E28896M15232N62176n78048b57024A169408E76000
1341A074176k0480r7280J93024R3184j65376J88416A76640M76160K85696m0448
1331H98048j34656O80448K31424J19296j96096C32288J192448K69312D44928J74592
1321F19520J024000D23424J199104k52928F28736O12352b58560H35584j91488
$$ plain form
1394 1106432 1311232 1980928 2199040 1873408 531968 886784 891392 2014720 1765376 463360
1383 1072640 985600 1108992 619520 1541120 550912 1245184 -90112 729600 1221120 1621504
1373 1621504 859648 391168 2065920 756736 1484288 1047040 1001472 1223680 164352 -126464
1362 1122304 822272 1346560 756736 -543232 899072 826880 1321472 253440 883200 -6656
1351 1345024 144384 1460224 528896 944128 1506304 928256 -257024 1169408 576000
1341 1074176 1053696 956416 1149440 1242624 1077248 1265664 176640 652800 938496 898048
1331 898048 763392 1443840 1675264 1794560 1598464 332288 1524736 1794048 444928 619520
1321 619520 1643520 423424 1622528 1369600 628736 1241088 -258560 835584 644096
1312F44096K35520C26144n2224O22592C39456J93536K08896K86720D39808L87584
1302H27392O2976l63520J21344M56192J87904N61664p69024j55648L25632J32608
1292A387520F70720J947648A231872O57920G99232J008640F65600a20320A733632
1282H82688j51552O31296Q5504n01248N73440l7888n02272M45440D91520P09120
1272A200640j08032O0928P42400p03488R8304M11136q21760P74656J54624F68672
1261A993728E09440P36768P78240p81312D21888J319936D62336O11840L12832
1252A387008N99040r88672L17952K46272J87904k27840l09248j59744l70176l02592
1242C79904P00416J050624n70880o68672P67488k37056M10624q74496L52256E69344
$$ plain form
1312 644096 879616 326144 273920 896512 339456 532992 741888 1028608 439808 827392
1302 827392 890368 526848 648192 1104384 1292288 1853952 1084928 929280 1254912 1387520
1292 1387520 670720 2618368 1231872 1889792 799232 1807872 665600 -120320 1733632
1282 882688 731136 1362432 1447936 946688 1520128 1482240 979968 1425408 491520 1200640
1272 1200640 1092608 1153536 1895936 1192448 1290752 1701888 880128 1654784 1809408 668672
1261 1993728 509440 1246208 2024448 1243136 421888 1741824 462336 1074176 1387008
1252 1387008 1986048 997376 1315328 1561600 1749504 1521664 1212416 1052672 682496 379904
1242 379904 1080320 2130944 1560064 891392 1658880 1421824 1832448 957952 1310208 569344
1231A713152p14752D31104M45440P52640m43392N87264m53632E14560K12480N43232
1221A270272l10784j30048l19488Q31488E00224k06336J51040N28896M18816F20032
1210A207296Q57088I50272J5360N73952m3520Q2944n51424l93728L36896n6320
1200I14432C57888N94944M6592m53120Q56576C54304L13344J454080a12640B87232
1189A046016C1232R65120m06528P77728D28032N39648J11616L18976D82304N25824
1179A008128N32480G23456n2224R33888C70688j80736P62880M45440A29024N10976
1169F40000O05696m36736P71072p07584J23904k25792B53440J085440L00032j0752
1159A628160G58784N58592M16768o91200P65440k82624O14912N52448F13888Q25344
$$ plain form
1231 1713152 998400 431104 876544 1629184 1185792 1773056 1319424 514560 727040 1270272
1221 1270272 959488 829440 509952 1341440 500224 293888 444928 973824 1392640 620032
1210 1207296 2064384 950272 965632 1539584 1496064 1579008 1027584 633856 970752 914432
1200 914432 357888 952832 999424 546304 1402880 354304 667648 2121728 -112640 287232
1189 1046016 31232 996352 589824 1367552 428032 967680 1079296 1398272 482304 1008128
1179 1008128 1540608 723456 671232 1605120 370688 189952 952832 1398272 129024 640000
1169 640000 1245696 808960 1580032 872448 996352 770560 253440 1338880 1638912 1628160
1159 1628160 758784 1317376 1734144 1042944 1808384 1525760 2140672 2693120 613888 1439232
1149A439232M53632j05984k7136k0480J424384j214976j45920K63168J413120
1140C479040j07520j019904P22944o55360J099776l50208K71360j11104K21696
1131C550720L86048P42912J54112Q94976J754112R71264n36576p91040O36928
1122G763456M13184k09920K02752k43712J921024K16576R62560Q40192K951168
1113A4817280J209344K048000P242752J3811712L1407616J8851840k638336j7836032
1105F8914176j5256064k0277248j4876672q038400j818112k007040j603072j449472
1097C588096n22240P3216J57184q78592j80736Q74496j09056P17312n0176N25824
1087D195328p90528n89312n84704K80576l36896o71232K048j76640o7584m36736
$$ plain form
1149 1439232 1892864 1786880 1759744 1739264 3163648 1948672 1802752 2065920 3479040
1140 3479040 3371520 2351616 3074560 2419200 3518976 3168768 3440128 3329024 3550720
1131 3550720 3936768 4679680 4833792 5728768 7482880 8454144 7917568 7126528 7763456
1122 7763456 8176640 7966720 8169472 7925760 9846784 10063360 11025920 11866112 14817280
1113 14817280 16026624 18074624 25317376 39129088 70536704 89388544 86750208 68914176
1105 68914176 53658112 33380864 18504192 10465792 8647680 6640640 5037568 3588096
1097 3588096 3065856 3139072 3296256 2417664 2236928 3111424 3002368 3719680 3669504 4195328
1087 4195328 3404800 2815488 2230784 2511360 2174464 1503232 1505280 1328640 1261056 824320
1077H24320J71008N74976O69696p22432j41824E35552P17824L00032M0960o83008
1067I11360d3520A198080N12C45088J078272P7824o51264J117184p38304B46784
1056A168896O92736G34208A15200J119232C01056a67936A009664D96640Q04864
1047A301504o14912j52576O57408j31072Q24832o52288m46976L03104J84320i3184
1036c36896n7856A017856B52928K78016O4000n2224P74144l74784m35712a33120
1025b61120A168896E12512J146880D03968b84160F26176g88480H02304B3552K62656
1015B86208A31584O42560c27680D56704B18624D9664L76320O2976K02240Q192
1005F99392K62656B38080g20896A437696f8096E55008b64704a24928A82272P16288
$$ plain form
1077 824320 995328 1570304 2240000 1517568 1375744 535552 1253376 1553408 1594368 911360
1067 911360 -43520 1198080 1198592 345088 1423360 1501184 849920 1967104 1228800 246784
1056 1168896 1861632 734208 115200 1234432 301056 -167936 1009664 496640 1301504
1047 1301504 686592 534016 1191424 1060352 1885184 1232896 785920 1089024 1273344 -93184
1036 -336896 -394752 1017856 252928 530944 594944 542720 1316864 942080 506368 -133120
1025 -261120 1168896 512512 1659392 403968 -284160 626176 -788480 802304 23552 286208
1015 286208 131584 774144 -327680 456704 218624 49664 425984 488960 691200 699392
1005 699392 962048 238080 -720896 1437696 -68096 555008 -264704 -124928 182272 898560
995H98560D1472h33536A165824k05824C20000h192G92064c0208E20192M22400
985I42592a80224Q1408G06560C31776K46272j63328j44896J169920C15392N41184
975H56576O43584e28384D27520n7856M32640O02624H1920b43712F45120j97632
965D47488c072D41344P75168n05344K04288a011200d07040A249792F04672a23392
954H7552J76128H1920L39968A81248M07552a31584D30080A23904L5840L44576
944E04320A39776M29056n4784j02912p3728P82336k18624k68288r5232b68288
933D72064L65056c50208I46176g0144A482240k7648m35200a80224j45920O5536
923b60608o144A015296p6800c52256C38432L94240k51904H1920M89984K68288
$$ plain form
995 898560 41472 -833536 1165824 960000 320000 -8192 792064 -30208 520192 942592
985 942592 -180224 -98816 706560 331776 578048 414720 269824 1439744 315392 856576
975 856576 1500160 -528384 427520 369664 802304 1404928 81920 -243712 645120 447488
965 447488 -3072 441344 1216512 711168 915456 -1011200 -407040 1249792 604672 -123392
954 87552 263680 81920 421888 181248 588800 -131584 430080 123904 159744 504320
944 504320 139776 568832 514048 411136 337408 1119744 901120 632832 537600 -268288
933 472064 837120 -350208 946176 -70144 1482240 1454592 1019392 -180224 -326144 -260608
923 -260608 -266752 1015296 938496 -352256 338432 732672 480768 81920 571904 840192
913H40192k82624g2704D76160c15904f7072D38272O05184l80416M31104m95104
903E99040L34848m38784J32096C12320N12j27488J164288G168J201152j96096
893A012224A3824R29280c79392G44448K13504J35168B46272f0416A136128I9328
882D96640A17760J20832a66912G69024K37568m9152d89472E91360m2496J03936
872F52800B53952P680R89696B28864c1744A318400j94048e1712k44224G14240
861D83840K68288G0656e77024b26304A144320A20832Q68864m77696j58208I6768
850A99168M55168a0240G87456d36224G43936A04960O87616I9328b60096C78368
839E57568J132544G76704j00352j13152N33504B26304l6352o1440K56512J108992
$$ plain form
913 840192 557568 -72704 476160 -315904 -67072 438272 1043456 663040 1094144 599040
903 599040 933888 495104 627200 312320 312832 185344 1349632 7168 1208320 1012224
893 1012224 13824 943104 -379392 744448 957952 1093120 246272 -60416 1136128 99328
882 496640 117760 238592 -166912 769024 1006592 957440 -489472 591360 548864 652800
872 652800 253952 261632 1251328 228864 -31744 1318400 1124352 -51712 -295936 714240
861 483840 752128 70656 -577024 -226304 1144320 120832 989696 512000 353792 96768
850 199168 654336 -10240 787456 -436224 743936 104960 792576 99328 -260096 378368
839 557568 1690112 776704 676352 563200 1096704 226304 189952 128512 385024 1494016
829A494016B85184N95968m28544A42848b90816I41056J091584A33632P94624k32448
819F95808N86752L73248H21248N72416c1232F72256n0688J083392D34176J468416
809A902592j40800C56352J481216H17664N87776E79584J210880o88128j90464
800I11872B33472K66240J166848E96480N17120J425920j233408J062912m68992
791A900032B45760J088512l54816M21376K84160E89824B89792R53344N81120p37792
781A086464l98336K65216l40480j15712P97696F30784a104384I3184a64352G49568
770e7856q4992C61984A3824b39616h4992D12672P17824m26496j79712b44224j46944
759c91168n89824B21184e92384a15712J0240E36064d07040D32640I4720e85216
$$ plain form
829 1494016 285184 881152 452608 142848 -290816 941056 2032640 133632 928256 695808
819 695808 1282560 1655808 821248 1393664 -31232 672256 621568 1704960 434176 1902592
809 1902592 1761792 356352 1837568 817664 1405440 579584 1790464 1102336 911872
800 911872 233472 499712 1666560 596480 1113600 2539520 1306112 2369024 1900032
791 1900032 245760 1334272 979456 1400832 1684992 589824 289792 1243136 1824256 1086464
781 1086464 688128 953344 612864 497152 1294848 630784 -1104384 93184 -164352 749568
770 -57856 -142848 361984 13824 -239616 -84992 412672 1130496 704000 524288 -244224 -391168
759 -391168 -980992 221184 -592384 -115712 -105472 536064 -407040 432640 94720 -585216
748D50560b91840B62144I2160c85536I85088A6384b16576A03936f37952E45280
737B89280A38240e3760q6528j40800B24768J025024h13568E00224N07904i0624
726C17952A55648N02784k27328d30080F22080C10272f53824F86592r2160h24832
715i68192a22368I07264C6864a536D83328K69824D5056A4336a88416E42208K49344
704G91552a59232A427456A16736i5744G44448b11456E5296e6832m0960B87232
693A77664g34208L11296b10944o54336A90976L41504k38080j14176J34656A48480
682H0384L27168f05696G83872r5744J96096B65728J85856K37056d16768C13856
671e91360d2496A39264P0144J00352e32992o51264C4304P42912e12q44288a66400
$$ plain form
748 450560 -291840 262144 92160 -385536 985088 16384 -216576 103936 -637952 545280
737 289280 138240 -53760 -140288 -281088 224768 1249792 -813568 500224 1008128 -90624
726 317952 155648 658432 431104 -430080 622080 310272 -653824 686592 594432 -824832
715 -968192 -122368 907264 36864 -1536 483328 753152 45056 14336 -188416 542208 791552
704 791552 -159232 1427456 116736 -95744 744448 -211456 55296 -56832 -97792 287232
693 177664 -734208 -422912 -210944 -865280 190976 532480 294400 180224 314880 148480
682 80384 407552 -605696 783872 688128 884224 265728 451584 688640 -416768 313856
671 -591360 -42496 139264 209408 309760 -532992 -1184256 34304 777216 -512 -844800 -166400
659a79200H66304k24256p5264M4544e28384b10944g1168l46112B19136P70560
649I89696a08032E30944j79712J12640g8336B19136j9456J41824B3552J2288c32288
637F03136e23264j059328A50528K55488b06848p58784B32960E8368f7072F1440
626E62176b4576B36544c38944a50528A08544f32320a98656A95072m3008K55488
616D07552a17760o1952k80576e120j28000j151488b82624B05824K78016A51552
605D11648A14688K14016i5232F50240j03936b25792C12832L9424A64864c20512
594I92768C9424r728c68640D09600c18976a1264o88128A403392g7824F52800b19648
582E90336B03776R09824d74624D26496b60096H5504J20320K27328b38080l20000
$$ plain form
659 -179200 866304 642048 566784 611328 -528384 -210944 -71168 -417280 219136 989696
649 989696 -108032 530944 351232 463872 -78336 219136 199680 341504 23552 35840 -332288
637 603136 -523264 -1582592 150528 406016 -206848 -965632 232960 58368 -67072 61440
626 562176 -24576 236544 -338944 -150528 108544 -632320 -198656 195072 152064 407552
616 407552 -117760 -179712 -460288 -5120 -133120 -1284608 -282624 205824 483840 151552
605 411648 114688 328704 -95232 650240 546304 -225792 312832 352256 164864 -320512
594 992768 39424 29696 -368640 409600 -318976 -11264 -699392 1403392 -77824 652800 -219648
582 590336 203776 1113600 -474624 426496 -260096 85504 205824 433152 -238080 -558080
572e58080I2672L40480E2224K37056d78208E31456d50560J02912D78720b84160
561f51776o61504D19328k04800e50400B09920b73408E12d04992J47456A149440
550c53792N6320G168d96128A110016D55168q8064L30240a88416D45952J05472
540E51424g58784R216K03264q4992F31296B07872a74592B74432d88448E5808a22368
528F4512a271808e12j60768b5600l67616J45408m30080a82272A31072b51904F74304
516G33184f93760F4512M05504a01888E25824M02432i4720E48352M74624c59424
505C0720K97472D5056L20000P3216j59232j11616K61120h21248A29536R0112J230336
494A449984L73248B94400a9968m17280F67648B1504J53600M14720A39264N94944
$$ plain form
572 -558080 92672 433152 52224 289280 -478208 531456 -450560 -347648 478720 -284160
561 -651776 -1313280 419328 214528 -550400 209920 -273408 512 -404992 -257536 1149440
550 -353792 -297472 7168 -496128 1110016 455168 367104 697344 -188416 445952 551424
540 551424 -758784 -749568 -546304 -631296 631296 207872 -174592 274432 -488448 55808 -122368
528 64512 -1271808 -512 -161280 -25600 -393216 -247808 -677888 -182272 131072 -251904 674304
516 733184 -693760 64512 470016 -101888 525824 928256 -94720 548352 1022976 -359424
505 30720 328192 45056 365056 438272 279040 167424 428544 -821248 129536 219648 1449984
494 1449984 1823232 294400 -19968 -437248 667648 21504 175104 589824 139264 734208
484G34208e82656E24288a04960M2496F99904K28864M87936n03808O89664F05696
473A341952A16736J82784m0448J349632E90848A13152O24128d71552F86592a90976
462c00032C69664e69344Q9088h8576F47680B65216E4784J697280f42048j62304
452h04352K71872B19136P47520m00896B34496n1712a500160A033216m05504a97632
441B78016f79424G21920a82272C34336f00576G37792b5088j31072f2976D23936
430G63392C38944K01728b70848J16736F38976J66400B65728f46144d1984j73056
420b15040a07520D70528P57760H7552a61280A8432J033216e49888a58720j00352
410b59072C75296d65920A28000O04160c23072G6288b5600G26528a024A70496a61792
$$ plain form
484 734208 -582656 524288 -104960 -62464 699904 928768 1416704 912896 1602560 605696
473 1341952 116736 299520 259072 1608704 590848 113152 737280 -471552 686592 -190976
462 -300032 369664 -569344 -480256 -88576 647680 265216 54784 1752064 -642048 -804352
452 -804352 -532480 219136 966656 565760 234496 182784 -1500160 1033216 627712 -197632
441 278016 -679424 721920 -182272 334336 -600576 737792 -25088 -156160 -62976 423936
430 763392 338944 540672 -270848 -154112 638976 805376 265728 -646144 -41984 -215040
420 -215040 -107520 470528 1228288 87552 -161280 18432 1051648 -549888 -158720 -259072
410 -259072 375296 -465920 128000 732160 -323072 76288 -25600 726528 -1024 170496 -161792
398I13920d1472j87904i1648L1232l3792D64896K46784b92352b8672B01728a94048
386i44128a95584k88256A86368R2160d51072B7648d24960I06752a6896H85248
375B00704E9904O24640A71520j4848d76160H6016a5872o97856A32096Q4992M89984
364G07072i5744A20320h81664C16416L7376c72736A024g6288D40320a220096a99168
352g2192B05824R71264f36416C59424A024c12832H86272B48832b11456E07392
341G72608f27712J08544H94976j48480L4816l58400d43904D07040R4720d78720
330A9968e95968B18112b80576A52064a26464D97664B09408e81632b18624D66432
319F39488b62656B96960J74080m4544A93536A0752f47680C14368J75616c61472
$$ plain form
398 913920 -41472 -229376 -91648 -60416 -94208 464896 711680 -292352 -28672 201728 -194048
386 -944128 -195584 -483840 186368 278528 -451072 27648 -424960 906752 -16896 885248
375 200704 59904 684544 171520 156672 -476160 86016 -15872 -713728 132096 217088 707072
364 707072 -95744 120320 -881664 316416 353792 -372736 1024 -76288 440320 -1220096 -199168
352 -72192 205824 1177088 -636416 359424 1024 -312832 886272 248832 -211456 507392
341 772608 -627712 -519168 894976 746496 781312 422912 -443904 407040 501760 -478720
330 19968 -595968 218112 -280576 152064 -126464 497664 209408 -581632 -218624 466432
319 639488 -262656 296960 471040 426496 193536 10752 -647680 314368 489984 -361472
308A13152N33504r3184M30592a88416L6352E78560d71040r77408a36192f144F68160
296H82176D13696j2288a101312H8064a59744E7856c59936A27488j8432g2704G30624
284c56352B6624C072h05888C75808a126400B65216N48864a62304A80736a84320
273h24832E77536B35008b60096J10592o86080K89792A56672K45760a00352k20160
263c20512B8160L39968O63040c49184j79712A30560K23744d63360a024A60256
252G52640k20672m9664N47840a292800A566720D70528b42176C43040b70848d096
241A207296D34688a77664C55840C0208J83296d29056j62304j65888H41728C25632
230C94240j09568b88256A96096q0896Q0896R57952A87904K7136E5808Q8064L60448
$$ plain form
308 113152 646656 553472 984064 -188416 -152064 578560 -471040 -1448448 -136192 -6144 668160
296 882176 413696 401408 -1101312 88064 -159744 57856 -359936 127488 109056 -72704 730624
284 -356352 26624 3072 -805888 375808 -1126400 265216 814080 -162304 180736 -184320
273 -824832 577536 235008 -260096 -149504 -835584 -545792 156672 402432 -100352 -320512
263 -320512 28160 368128 1031168 -349184 -528896 130560 354304 -463360 -1024 160256
252 752640 531968 482304 1030144 -1292800 1566720 470528 -242176 343040 -270848 -4096
241 1207296 434688 -177664 355840 30208 213504 -429056 -591360 -757248 841728 325632
230 394240 284672 -288256 196096 115200 196096 1154048 187904 215040 55808 143872 504320
219E04320G8848M5568O58944A23392d0960A391104B56512d40832G1680J24416
209A96096a17248A41312R38496m29056c14880E43744P31136a30560m94080J99680
199d24960p0656A200128a9968j277440c04640E79584a59744E29920e1200r6768
189a47968k34496F75328k72384L01568B27840K64704a36192B73408p2704f7584
178H5504i64608H37632g19872B45248C6864f60992j99680A68448N44768L85024
168A098240e37088J04448E77024p4752J06496E632N62688H9600e43744B39616
157G01440a146368H8064i83040L94752a66912A13152e40672j01376E55520g09120
146C96800a97120A25952i57440a08032B95936a19808H38656a367552E25312a55648
$$ plain form
219 504320 78848 124416 783360 123392 -40960 1391104 256512 -440832 71680 196096
209 196096 -117248 141312 1079808 650752 -314880 543744 1274880 -130560 -624640 -424960
199 -424960 -495616 1200128 -19968 -1297408 -304640 579584 -159744 529920 -51200 -147968
189 -147968 -382464 675328 402944 704512 227840 492544 -136192 273408 200704 -67584
178 85504 -964608 837632 -719872 245248 36864 -660992 -860672 168448 713216 1098240
168 1098240 -537088 -432640 577024 502272 608768 5632 568320 89600 -543744 239616
157 701440 -1146368 88064 -983040 -588288 -166912 113152 -540672 -642048 555520 -709120
146 396800 -197120 125952 -957440 -108032 295936 -119808 838656 -1367552 525312 -155648
135G82848d08064G99744e50400m8640A26976f01088A412096f4000F60992b44224
124D86912f23616C68640N82656e03296q0896c6864j346560G10656J080832A20320
113C16416g11168C3280c98848k7648C14880F2464h74496A24928K89792f4512q19200
102h83712H90368r2672B33472b50368j96608k33472B61120c41504l89120H9088
91F81472i8816C17952h71424L90656a69472p6288l02592F82496G9872Q3456K81088
80D44416p6800c55328E26336c5840G49056a343488B38080c0208A45408h65280
69C13856c93216a5872g168E9904a95584K4064D18816J56672j22880A10080c07712
57C01056i3184k48832N5808C1744K06848d25472p9872B49344Q15616d91008n73952
$$ plain form
135 782848 -408064 799744 -550400 -599040 126976 -601088 1412096 -64000 660992 -244224
124 486912 -623616 368640 951296 -503296 -584192 -36864 -1383424 710656 1791488 120320
113 316416 -711168 33280 -398848 -426496 314880 62464 -874496 124928 414720 -64512 -883712
102 -883712 890368 797696 233472 -250368 -446976 -680448 261120 -341504 -730624 89088
91 681472 -98816 317952 -871424 -480768 -169472 -245760 -548352 682496 79872 163328 444416
80 444416 367616 -355328 526336 -35840 749056 -1343488 238080 -30208 145408 -865280
69 313856 -393216 -15872 -7168 59904 -195584 -171520 418816 575488 452608 110080 -307712
57 301056 -93184 -342016 -286208 31744 238592 -425472 -505344 249344 1064960 -491008 -1064960
46a064960B47808l3792M10112b87744f7584k22208j114112a50528A004544a60256
35a171968C99360j20832e64736B19136A09056g15264E36064b79552I22112m23424
25D98688i55392a47456o32320D48000a504768b49856l20000R8304k30400n1200
15g53152C32800d66944a51040E09952c4816I4208M53120b18624j45920J37216
5b27328H44800a63840C9936J00352a45408
$$ plain form
46 -1064960 247808 214016 624128 -287744 -67584 -289792 -1403904 -150528 1004544 -160256
35 -1171968 399360 278528 -564736 219136 109056 -715264 536064 -279552 922112 498688
25 498688 -955392 -147456 -779776 448000 -1504768 -249856 -569856 -471552 -701952 -753152
15 -753152 332800 -466944 -151040 509952 -34816 94208 547328 -218624 -364544 -227328
5 -227328 844800 -163840 39936 140288 -145408
##END=
