##TITLE=1377
##JCAMPDX= 6.0         $$ Bruker NMR JCAMP-DX V2.0
##DATA TYPE= NMR SPECTRUM
##DATA CLASS= XYDATA
##ORIGIN= NUTS EXPORT
##OWNER= Administrator
$$ 1.72 TOPSPIN		Version 2.1
$$ 2016-02-23 12:21:34.261 -0800  Administrator@X
$$ Compression mode = diff/dup
##.OBSERVE FREQUENCY= 90.275459
##.ACQUISITION MODE= SIMULTANEOUS (DQD)
##.ACQUISITION SCHEME= undefined
##.AVERAGES= 16
##.DIGITISER RES= 22
##SPECTROMETER/DATA SYSTEM= 
##.PULSE SEQUENCE= zg30
##.SOLVENT NAME= None
##.SHIFT REFERENCE= INTERNAL, None, 1, 14.65649
##AUDIT TRAIL= $$ (NUMBER, WHEN, WHO, WHERE, PROCESS, VERSION, WHAT)
$$ ##TITLE= Audit trail, TOPSPIN		Version 2.1
$$ ##JCAMPDX= 5.01
$$ ##ORIGIN= Bruker BioSpin GmbH
$$ ##OWNER= Administrator
$$ $$ E:/data/jwist/nmr/1377/1/pdata/1/auditp.txt
$$ ##AUDIT TRAIL=  $$ (NUMBER, WHEN, WHO, WHERE, PROCESS, VERSION, WHAT)
(   1,<2016-02-23 09:07:19.636 -0800>,<Administrator>,<X>,<jcamp>,<TOPSPIN 2.1>,
      <fromjdx created from
       E:\data\jwist\nmr\uniandes\1377
       data hash MD5: 8K
       C2 B2 11 DA 0E 91 E5 8B 58 33 F0 59 A7 63 35 8E>)
$$ ##END=
$$ 
$$ $$ hash MD5
$$ $$ AA 69 06 DE FA EC 67 52 49 28 26 2F B4 77 88 65
##$RELAX= 
$$ Bruker specific parameters
$$ --------------------------
##$DU= <E:>
##$EXPNO= 1
##$NAME= <1377>
##$PROCNO= 1
##$TYPE= <nmr>
##$USER= <jwist>
##$ACQT0= 0
##$AMP= (0..31)
100 100 100 100 100 100 100 100 100 100 100 100 100 100 100 100 100 100
100 100 100 100 100 100 100 100 100 100 100 100 100 100
##$ANAVPT= 1
##$AQSEQ= 0
##$AQ_mod= 3
##$AUNM= <au_zg>
##$AUTOPOS= <>
##$BF1= 90.275459
##$BF2= 400.02
##$BF3= 400.02
##$BF4= 400.02
##$BF5= 400.02
##$BF6= 400.02
##$BF7= 400.02
##$BF8= 400.02
##$BYTORDA= 0
##$CFDGTYP= 0
##$CFRGTYP= 0
##$CHEMSTR= <none>
##$CNST= (0..63)
1 1 145 1 1 1 1 1 1 1 1 1 1 1 1 1 1 1 1 1 1 1 1 1 1 1 1 1 1 1 1 1 1 1 1
1 1 1 1 1 1 1 1 1 1 1 1 1 1 1 1 1 1 1 1 1 1 1 1 1 1 1 1 1
##$CPDPRG= <>
##$CPDPRG1= <>
##$CPDPRG2= <>
##$CPDPRG3= <>
##$CPDPRG4= <mlev>
##$CPDPRG5= <mlev>
##$CPDPRG6= <mlev>
##$CPDPRG7= <mlev>
##$CPDPRG8= <mlev>
##$CPDPRGB= <>
##$CPDPRGT= <>
##$D= (0..63)
0 1 0 0 0 0 0 0 0 0 0 0 0 0 0 0 0 0 0 0 0 0 0 0 0 0 0 0 0 0 0 0 0 0 0 0
0 0 0 0 0 0 0 0 0 0 0 0 0 0 0 0 0 0 0 0 0 0 0 0 0 0 0 0
##$DATE= 0
##$DBL= (0..7)
120 120 120 120 120 120 120 120
##$DBP= (0..7)
150 150 150 150 150 150 150 150
##$DBP07= 0
##$DBPNAM0= <>
##$DBPNAM1= <>
##$DBPNAM2= <>
##$DBPNAM3= <>
##$DBPNAM4= <>
##$DBPNAM5= <>
##$DBPNAM6= <>
##$DBPNAM7= <>
##$DBPOAL= (0..7)
0.5 0.5 0.5 0.5 0.5 0.5 0.5 0.5
##$DBPOFFS= (0..7)
0 0 0 0 0 0 0 0
##$DE= 6.5
##$DECBNUC= <off>
##$DECIM= 2432
##$DECNUC= <off>
##$DECSTAT= 4
##$DIGMOD= 1
##$DIGTYP= 12
##$DL= (0..7)
0 120 120 120 120 120 120 120
##$DP= (0..7)
150 150 150 150 150 150 150 150
##$DP07= 0
##$DPNAME0= <>
##$DPNAME1= <>
##$DPNAME2= <>
##$DPNAME3= <>
##$DPNAME4= <>
##$DPNAME5= <>
##$DPNAME6= <>
##$DPNAME7= <>
##$DPOAL= (0..7)
0.5 0.5 0.5 0.5 0.5 0.5 0.5 0.5
##$DPOFFS= (0..7)
0 0 0 0 0 0 0 0
##$DQDMODE= 0
##$DR= 22
##$DS= 2
##$DSLIST= <SSSSSSSSSSSSSSS>
$$ [...]
##$SPOFFS= (0..31)
0 0 0 0 0 0 0 0 0 0 0 0 0 0 0 0 0 0 0 0 0 0 0 0 0 0 0 0 0 0 0 0
##$SUBNAM0= <"">
##$SUBNAM1= <"">
##$SUBNAM2= <"">
##$SUBNAM3= <"">
##$SUBNAM4= <"">
##$SUBNAM5= <"">
##$SUBNAM6= <"">
##$SUBNAM7= <"">
##$SUBNAM8= <"">
##$SUBNAM9= <"">
##$SW= 20.5580556627758
##$SWIBOX= (0..15)
0 0 3 4 0 0 0 0 0 0 0 0 0 0 0 0
##$SW_h= 8223.68421052631
##$SWfinal= 0
##$TD= 65536
##$TD0= 1
##$TE= 300
##$TE2= 300
##$TE3= 300
##$TEG= 300
##$TL= (0..7)
0 120 120 120 120 120 120 120
##$TP= (0..7)
150 150 150 150 150 150 150 150
##$TP07= 0
##$TPNAME0= <>
##$TPNAME1= <>
##$TPNAME2= <>
##$TPNAME3= <>
##$TPNAME4= <>
##$TPNAME5= <>
##$TPNAME6= <>
##$TPNAME7= <>
##$TPOAL= (0..7)
0.5 0.5 0.5 0.5 0.5 0.5 0.5 0.5
##$TPOFFS= (0..7)
0 0 0 0 0 0 0 0
##$TUNHIN= 0
##$TUNHOUT= 0
##$TUNXOUT= 0
##$USERA1= <user>
##$USERA2= <user>
##$USERA3= <user>
##$USERA4= <user>
##$USERA5= <user>
##$V9= 5
##$VALIST= <valist>
##$VCLIST= <CCCCCCCCCCCCCCC>
##$VD= 0
##$VDLIST= <DDDDDDDDDDDDDDD>
##$VPLIST= <PPPPPPPPPPPPPPP>
##$VTLIST= <TTTTTTTTTTTTTTT>
##$WBST= 1024
##$WBSW= 4
##$XGAIN= (0..3)
0 0 0 0
##$XL= 0
##$YL= 0
##$YMAX_a= 1131526784
##$YMIN_a= -1677091.84
##$ZGOPTNS= <>
##$ZL1= 120
##$ZL2= 120
##$ZL3= 120
##$ZL4= 120
##$ABSF1= 10
##$ABSF2= 0
##$ABSG= 5
##$ABSL= 3
##$ALPHA= 0
##$AQORDER= 0
##$ASSFAC= 0
##$ASSFACI= 0
##$ASSFACX= 0
##$ASSWID= 0
##$AUNMP= <proc_1d>
##$AXLEFT= 0
##$AXNAME= <>
##$AXNUC= <off>
##$AXRIGHT= 0
##$AXTYPE= 0
##$AXUNIT= <>
##$AZFE= 0.1
##$AZFW= 0.1
##$BCFW= 1
##$BC_mod= 2
##$BYTORDP= 0
##$COROFFS= 0
##$CY= 15
##$DATMOD= 1
##$DC= 2
##$DFILT= <>
##$DTYPP= 0
##$F1P= 0
##$F2P= 0
##$FCOR= 0.5
##$FTSIZE= 0
##$FT_mod= 4
##$GAMMA= 1
##$GB= 0
##$INTBC= 1
##$INTSCL= 1
##$ISEN= 128
##$LB= 0.3
##$LEV0= 0
##$LPBIN= 0
##$MAXI= 10000
##$MC2= 0
##$MEAN= 0
##$ME_mod= 0
##$MI= 0
##$NCOEF= 0
##$NC_proc= -9
##$NLEV= 6
##$NOISF1= 0
##$NOISF2= 0
##$NSP= 1
##$NTH_PI= 0
##$NZP= 0
##$OFFSET= 14.65649
##$PC= 1
##$PHC0= 0
##$PHC1= 0
##$PH_mod= 0
##$PKNL= yes
##$PPARMOD= 0
##$PPDIAG= 0
##$PPIPTYP= 0
##$PPMPNUM= 2147483647
##$PPRESOL= 1
##$PSCAL= 4
##$PSIGN= 0
##$PYNMP= <proc.py>
##$REVERSE= no
##$SF= 90.2741358977423
##$SI= 8192
##$SIGF1= 0
##$SIGF2= 0
##$SINO= 400
##$SIOLD= 32768
##$SPECTYP= <>
##$SREGLST= <1H.CDCl3>
##$SSB= 0
##$STSI= 0
##$STSR= 0
##$SW_p= 1497.18866228788
##$SYMM= 0
##$S_DEV= 0
##$TDeff= 0
##$TDoff= 0
##$TI= <>
##$TILT= no
##$TM1= 0
##$TM2= 0
##$TOPLEV= 0
##$USERP1= <user>
##$USERP2= <user>
##$USERP3= <user>
##$USERP4= <user>
##$USERP5= <user>
##$WDW= 1
##$XDIM= 8192
##$YMAX_p= 1131526656
##$YMIN_p= -1676800
##$CURPLOT= <PDFCreator>
##$CURPRIN= <$PDFCreator>
##$DFORMAT= <normdp>
##$LAYOUT= <+/1D_H.xwp>
##$LFORMAT= <normlp>
##$PFORMAT= <normpl>
##$SURQMSG= 1
$$ End of Bruker specific parameters
$$ ---------------------------------
##XUNITS= HZ
##YUNITS= ARBITRARY UNITS
##XFACTOR= 0.182762287876938
##YFACTOR= 1
##DELTAX= -0.182762287876938
##NPOINTS= 8192
##FIRSTX= 1497.0059
##FIRSTY= -96768
##LASTX= 0
##MAXY= 1131526656
##MINY= -1676800
##XYDATA= (X++(Y..Y))
$$ plain form
8191 -96768 641024 531968 -468480 -630784 586752 207872 754176 482816 228352 85504
8180 -744448 -905728 273920 -479232 -465408 104448 827392 677888 -285696 -687104 839168
8169 -712704 678400 599040 200192 581632 -231424 555008 91648 487936 33792 686080
8159 686080 259584 382464 206848 867840 877056 556032 73216 861184 220160 1064960
8149 1064960 -97792 878080 158720 834560 763392 -341504 -109056 135680 361472 275456
8139 275456 -66048 -139264 -22528 222208 131072 1252352 139264 -205312 228352 346624
8129 346624 1123328 409088 -209408 -402432 665088 153600 758272 574976 711168 -124416
8118 741888 325632 701440 1110016 324096 463872 87552 354816 1132544 1031168 70656
$$ packed form
8191i6768F41024j09056d68480j62304E86752B07872N46304k71360B28352H5504
8180g44448j61280B73920d79232J3824A04448P22944j49504b85696m01408H39168
8169g12704F78400p9360B00192L81440b31424E55008I1648L96288C3792O52288
8159F86080B59584J22880j75616O60992R216l21024G3216P87968B20160Q44800
8149A064960i7792H78080A58720O75840p1168c41504a09056A35680K25792q6016
8139B75456f6048p3216b2528B22208r1136J121280A39264b05312B28352J18272
8129C46624P76704D09088b09408j93024F65088A53600O04672j83296J36192a24416
8118G41888C25632L75808M08576C24096J39776H7552K67264P77728j01376G0656
$$ plain form
8107 -598016 -51712 154112 390144 -491008 758784 -381440 256512 139264 953856 715776
8097 715776 582144 974336 -101888 1233920 -9216 224256 1100800 -600064 954368 22016
8086 171008 239616 242688 113664 175104 460288 125952 1073664 91648 -407040 55808 -171520
8074 -725504 1030656 1072128 17920 -179712 830976 342016 849408 423424 -83968 256512
8063 967680 -579072 835072 113152 1411584 323072 -78848 395776 -69120 -96768 972288
8052 1576448 107008 245248 406528 126976 210944 -11264 243200 356864 -359936 1042432
8041 -125952 730112 577536 44544 819712 832512 402432 1102848 367616 442368 179712
8030 827904 -184832 -315392 776704 193024 629760 195072 -19968 -333824 -220160 1439744
$$ packed form
8107e98016e1712A54112K36032d91008G58784c81440B56512j17248Q14592k38080
8097G15776j33632L92192a01888A233920i216B24256Q76544f00064I54368B2016
8086A71008O8608L072A13664O1440K85184A25952R47712I1648d07040E5808a71520
8074g25504A030656M1472A7920a79712H30976C42016N07392D23424h3968B56512
8063I67680e79072H35072A13152J298432C23072g8848C95776f9120k7648I72288
8052A576448A07008J38240J61280A26976Q3968a1264B43200J13664c59936A042432
8041a25952G30112j52576D4544P75168J2800D02432P00416C67616P4752A79712
8030H27904a84832j30560G76704A93024M36736A95072a9968l13856J13664A439744
$$ plain form
8019 -214528 -256000 -415744 -220672 -516608 -630272 611840 473088 472576 -219136 263168
8008 -69120 771072 132608 -285696 859648 955904 -197120 1062400 713216 921088 762880
7998 762880 699392 211456 22528 591360 667648 1280000 1122304 888832 5632 -625664 288256
7986 533504 374272 -77312 356352 1056256 -257024 -3584 154624 270848 640512 -1179648
7975 553984 428544 -313344 627712 228352 1050624 163328 383488 692224 -600576 -552960
7965 -552960 1061376 298496 60928 -49152 1507328 898560 98304 -202752 818688 1340928
7955 1340928 583680 -17920 1104384 129536 -721408 820736 1009664 -95744 -825856 317440
7944 559616 110080 -191488 674304 757248 111616 462336 1693696 241152 -176640 363520
$$ packed form
8019b14528m1472j59744J95072k95936j13664F11840j38752n12b19136B63168
8008f9120G71072A32608b85696H59648R6256a97120A062400l49184K07872j58208
7998G62880o3488B11456B2528N68832P6288O12352j57696k33472E632f25664B88256
7986E33504j59232g7312C56352O99904b57024c584A54624J16224L69664a179648
7975E53984j25440c13344F27712B28352Q22272A63328K20160L08736f00576M7616
7965e52960A061376B98496F0928d9152A507328o08768I8304b02752H18688N22240
7955A340928E83680a7920A104384A29536g21408H20736J88928i5744p30112C17440
7944E59616A10080a91488F74304Q2944A11616L50720J231360B41152a76640C63520
$$ plain form
7933 360448 -54784 -331264 360960 760320 1111040 347136 1178624 1307648 1326592 -235520
7922 1196544 -919040 1465856 -265216 548864 757248 -120832 -5120 -316416 -47104 -464896
7912 -464896 998400 506368 98304 681984 -139776 -518656 -106496 327168 -85504 454656
7901 691200 577024 -630784 220160 395776 -1244160 -80384 -215552 764416 -369152 640512
7890 581120 408064 1411584 484864 -2048 457728 993280 370688 959488 185856 601088
7880 601088 -436736 -218112 776704 295424 1316352 923136 1222144 779776 1081856 208896
7869 480768 -246784 562176 827392 395264 -53248 630784 -721408 1297408 16384 -201728
7858 163328 1354240 542208 1122304 451584 -556032 -454144 70144 -352256 590848 495104
$$ packed form
7933C60448e4784k76480C60960L99360L50720C47136Q31488J29024J8944b35520
7922A196544i19040A465856b65216E48864K08384a20832e120l11296d7104m17792
7912d64896I98400m92032I8304N83680a39776l78880a06496C27168h5504D54656
7901F91200j14176f30784B20160J75616a244160h0384j35168G64416c69152F40512
7890E81120j73056J003520D84864b048D57728N35552C70688N88800A85856M15232
7880F01088d36736b18112G76704B95424J020928l93216K99008m42368L02080B08896
7869D80768b46784E62176K65216C95264e3248F30784g21408A297408A6384b01728
7858A63328J190912E42208N80096D51584e56032J01888G0144c52256E90848r5744
$$ plain form
7848 495104 1061888 1722880 369664 872448 482816 -64000 -396800 631296 670208 592896
7838 592896 563200 -69632 576512 -39936 335872 1715712 319488 576512 -1025024 1108480
7827 -114176 720896 327168 1448448 762368 -102400 -1024000 287232 1302016 397312
7817 954880 236032 29696 -301568 362496 36864 43520 45568 1281536 -209920 72704 953856
7806 953856 -306688 1042432 271360 145408 268800 -180736 654336 -71168 473600 -342528
7795 276992 450048 332800 -108544 742400 485376 -277504 -29184 -40960 -17920 -211968
7785 -211968 -60416 58368 510976 588800 376832 357888 -581120 65536 69120 515072 206848
7773 -346112 191488 396288 413696 -744960 849920 312320 -176640 -1253888 193536 136704
$$ packed form
7848D95104N66784O60992C69664N02784l89632f4000l32800F31296L8912p7312
7838E92896k9696f9632E76512c9936C35872J379840C19488K57024a025024A108480
7827a14176G20896C27168J121280o86080a02400r21600B87232J014784C97312
7817I54880B36032B9696c01568C62496C6864O656K048J235968b09920G2704Q81152
7806I53856c06688A042432B71360j25952J23392a80736F54336g1168D73600c42528
7795B76992J73056j17248a08544G42400k57024b77504b9184j1776a7920j94048
7785b11968f0416E8368M52608P7824k11968j8944e81120F5536L584M45952B06848
7773c46112A91488K04800J7408g44960H49920C12320a76640j077248A93536n6832
$$ plain form
7763 136704 -111616 541184 257024 346112 766976 633344 180736 75264 -395776 485376
7752 790016 636928 409600 804864 -25600 490496 -247808 260096 439296 78336 60928
7742 60928 397824 1037824 758784 -41984 1013248 587776 748544 -98304 671232 -218112
7731 337920 186368 -164864 174080 316416 -216576 241152 236544 457728 1413632 435200
7720 244736 -373760 766464 262656 356864 615424 392704 -478208 1067008 579584 249344
7709 1541120 -1676800 903168 228864 -967168 634368 2369536 -28160 773632 426496
7700 426496 481792 1020928 226304 321024 986624 184320 370688 -194560 643072 395776
7690 395776 910848 254976 -473088 308224 -576512 719872 1116160 100864 1179136 -563200
$$ packed form
7763A36704a11616E41184B57024Q9088M20864j33632A80736G5264c95776D85376
7752G90016j53088k27328L95264b5600D90496b47808B60096J79200G8336j7408
7742F0928L36896O40000k79040d1984A013248m25472J60768i8304F71232b18112
7731C37920j51552a64864A74080J42336b16576B41152m608K21184R55904D35200
7720B44736c73760G66464B62656R4208K58560k22720d78208A067008m87424B49344
7709A541120a676800I03168B28864i67168F34368J735168b8160G73632l47136
7700D26496N5296N39136B26304R4720O65600A84320J86368a94560F43072k47296
7690C95776N15072B54976d73088C08224e76512G19872L96288A00864J078272e63200
$$ plain form
7679 680448 249344 -795648 251392 1135616 182784 189952 579584 3072 1923072 -71168
7668 439808 622592 471040 612352 368128 744448 -111616 276992 195584 -392704 693760
7657 -650240 1120768 -505856 193024 -318976 139264 -234496 -146944 369664 -246784 471040
7646 491008 205312 -650240 -333312 -905216 533504 551936 -1158144 1338880 698368 435712
7636 435712 -432128 -281600 -104960 -222720 892928 486400 656896 670208 110080 791552
7626 791552 406016 -78848 -273920 -240128 -951296 -479232 -809472 869888 -1085440 520192
7615 -292864 208384 28672 1446400 1042432 -305152 129536 -220160 222720 755200 -917504
7604 568832 88064 105472 1079808 318464 -524288 -780800 304640 -592384 67072 405504
$$ packed form
7679F80448B49344g95648B51392Q84224A82784P168L89632C072J920000g1168
7668D39808J82784j51552J41312k44224L76320a11616B76992q1408c92704F93760
7657f50240A120768e05856A93024c18976A39264b34496Q7552C69664b46784D71040
7646D91008B05312f50240L16928n71904E33504J8432a158144A338880o40512k62656
7636D35712d32128J50528a04960j17760H92928m06528J70496J3312A10080O81472
7626G91552l85536g8848j95072L3792p11168M72064l30240H69888a085440E20192
7615b92864B08384B8672J417728m03968c05152A29536b20160B22720N32480i17504
7604E68832H8064J7408R74336C18464e24288k56512C04640e92384F7072L38432
$$ plain form
7594 405504 244736 282112 662016 -657408 -525312 -126464 -531456 -4608 -129536 39936
7583 474112 1120256 228352 1155584 737792 283136 56320 -46080 -97792 684032 122880
7572 545792 316928 484352 -297984 58880 -455168 -116224 -166400 477696 -124928 -129024
7562 -129024 -320512 691712 1451008 108544 -379904 1181184 610304 1126912 -510976 138240
7551 437248 -597504 -320000 1563136 72192 -28672 -151552 -670720 82944 1724416 195072
7540 80896 320000 482816 499712 70656 -348672 721920 373248 474624 217088 347136
7530 347136 -38912 104448 129024 -254976 1095168 226304 614400 409600 -199168 309760
7519 -658432 -157696 858624 603648 30208 -477696 -157696 577024 972800 841728 518144
$$ packed form
7594D05504j60768L7376L79904f57408J32096a26464m04992d608j24928C9936
7583D74112O46144B28352R27232m17792B83136E6320d6080n1712F84032A22880
7572E45792k28864J67424b97984E8880d55168a16224n0176D77696a24928m096
7562a29024j91488F91712P59296A08544c79904A181184n70880N16608e10976A38240
7551D37248e97504K77504A563136G2192b8672j22880n19168H2944J641472A95072
7540H0896K39104J62816J6896G0656c48672G21920l48672J01376B17088J30048
7530C47136c8912A04448K4576b54976A095168B26304L88096k04800a99168C09760
7519f58432a57696H58624k54976C0208d77696a57696E77024L95776j31072l23584
$$ plain form
7509 518144 -4608 74240 -473088 493056 -211456 -54784 184832 134656 272896 334336 -44544
7497 1321472 200704 -347648 -559616 328192 -897536 1129472 646656 -133120 1088000
7487 1276416 1068032 47104 612864 168448 757248 734720 371200 550912 -25088 -124928
7477 -124928 820736 -595456 -380416 -206336 -944128 859136 -359936 -453632 724480 385024
7467 385024 678912 -1434624 1354752 -224256 45056 -705536 772608 189440 830976 481280
7457 481280 427008 401408 591872 -228352 179712 -677376 2560 607232 295936 -417792
7446 72704 -112128 734208 -760320 14336 76288 134144 992256 1179648 -95744 -53760 -580096
7435 -580096 -186880 248832 602112 376320 693248 -704512 -7168 1388544 -31744 -83968
$$ packed form
7509E18144d608G4240d73088D93056b11456e4784A84832n0176J38240O1440d4544
7497A321472B00704c47648k11968C28192h97536A129472m82816a33120A088000
7487A276416k08384D7104N65760A68448N88800k2528l63520J79712b5088r9840
7477a24928H20736e95456K15040J74080p37792H59136c59936r3696G24480l39456
7467C85024K93888a434624A354752b24256D5056g05536G72608A89440O41536l49696
7457D81280n4272k5600J90464b28352A79712f77376B560O04672B95936d17792
7446G2704a12128G34208g60320A4336O1952N7856Q58112J87392i5744M1984n26336
7435e80096a86880B48832L53280k25792L16928g04512g168A388544c1744n2224
$$ plain form
7425 -83968 -68608 257536 -38912 -413696 906240 429056 687616 459264 866816 635904
7415 635904 287232 324608 434688 491008 119808 -1214464 -444928 589312 347648 1134080
7405 1134080 -623616 141824 443904 -1114624 381440 700416 536576 -380416 333824
7395 587264 -630272 -347136 -87040 734208 -1548800 -33280 815104 532992 -27648 -581632
7385 -581632 580608 -439808 1131520 -475136 646656 555520 -118784 -242688 409088 982528
7375 982528 -62976 637440 274432 274944 800256 59904 9728 668160 -86016 454656 426496
7364 426496 -56832 -374784 1093632 58880 943104 169984 880128 32256 3072 -265216
7353 -29696 204800 88576 389120 1426944 378368 -33280 111104 1031680 -210432 -70656
$$ packed form
7425h3968J5360B57536c8912l74784I06240D29056K58560k28352M07552k30912
7415F35904B87232L7376J10080N6320A19808a214464d44928E89312k41664P86432
7405A134080f23616A41824L02080a114624C81440L18976j63840c80416C33824
7395E87264f30272K83136h7040G34208a548800c3280H15104k82112b7648n53984
7385e81632E80608d39808A131520d75136F46656r1136a18784j23904D09088N73440
7375I82528f2976F37440B74432N12N25312E9904I728O58432h6016D54656k8160
7364D26496e6832l17952A093632E8880Q84224A69984P10144C2256C072b65216
7353b9696B04800H8576L00544J037824C78368c3280A11104R20576b10432g0656
$$ plain form
7342 666112 995840 1306112 116224 744960 685568 273408 63488 -199168 1089024 199680
7331 473088 -322048 248320 328192 838656 -323072 -859648 1200128 1140224 357376 1206784
7321 1206784 900608 -338432 877568 -22016 358912 -344064 -578048 1125376 640000 863232
7311 863232 -264704 457216 48640 900608 392704 655872 -148480 150016 -1001472 714240
7300 -140800 -626688 -367616 1206272 524288 350720 601088 507392 435200 504320 1186304
7290 1186304 717312 566272 -16384 -458240 71168 -150528 139264 180224 269824 1224192
7280 1224192 -433664 -116736 1182720 -119296 130560 -285184 -781312 328192 247808 1767936
7270 1767936 -36864 836096 1177600 -138752 400896 816640 49152 -282624 983040 941056
$$ packed form
7342F66112L29728L10272A16224O28736n9392B73408F3488a99168A089024A99680
7331D73088c22048B48320P9872N10464c23072n36576A200128n9904C57376Q49408
7321A206784l06176c38432H77568b2016C58912c44064k33984A125376m85376K23232
7311H63232b64704D57216D8640Q51968C92704K63168a48480A50016a001472G14240
7300a40800m85888K59072A206272E24288j73568K50368r3696p2192O9120O81984
7290A186304m68992j51040a6384m41856G1168a50528A39264M0960Q9600R54368
7280A224192d33664a16736A182720a19296A30560b85184m96128C28192q0384J520128
7270A767936c6864H36096L41504a38752D00896M15744D9152b82624I83040m1984
$$ plain form
7260 941056 679936 -403968 359424 93696 -8192 -93184 -265216 1150464 -118272 980480
7249 178688 459776 -474112 956416 44032 -496128 369664 91648 74752 162816 177152 1146880
7238 1146880 571904 -104448 -160256 170496 -938496 -681472 326144 349696 443392 -1398784
7227 189440 310272 1213952 -670208 305664 862208 -292352 546304 650752 1329664 274944
7216 415232 187392 -1355776 -346112 767488 249344 -427008 1113088 -349184 835584
7206 -69632 707072 -218112 271360 424448 174592 783872 1084416 -143872 92160 312832
7196 312832 340480 318976 274432 265728 209408 16896 263680 353280 884224 503296 140288
7184 126976 608256 -347136 602624 750592 -496640 88064 -163328 477696 960000 -442880
$$ packed form
7260I41056k61120d03968C59424I3696h192q4992j72032A150464a18272I80480
7249A78688K81088d74112I56416D4032d96128C69664I1648j6896Q8064J4336R69728
7238A146880E71904a04448n5808A70496i38496K57024C26144K3552R3696a398784
7227A89440J20832R03680f70208C05664N56544b92352E46304J04448O78912B74944
7216D15232A87392a355776c46112G67488B49344d27008A113088c49184H35584
7206f9632G07072b18112B71360J53088A74592O09280L00544a43872I2160K20672
7196C12832K7648k1504m4544q704n6320A6896K46784Q9600N30944l80928A40288
7184A26976M81280c47136F02624J47968d96640H8064a63328D77696M82304d42880
$$ plain form
7173 656384 -276992 792576 325120 697856 475136 -6656 186368 -222208 315392 -1536
7162 1025536 143360 546816 117760 237568 389120 1371136 -348672 335360 -171008 210944
7151 457216 240640 307712 -119296 1198080 1387008 539648 463872 163328 318976 484864
7141 484864 1028608 1032704 931840 618496 296960 80896 -228352 1069056 -1167872 466432
7130 -50176 -231936 786432 238592 504832 652288 394240 276480 375808 91136 470528
7120 470528 304128 -338944 976896 -152576 178176 -75264 -424960 284672 -188928 333824
7109 1249280 755200 -178688 671232 636416 882688 870400 -142848 -655872 459264 445952
7099 445952 -88576 1067520 -73728 -876544 766976 -112128 -757248 1078784 982016 222208
$$ packed form
7173F56384b76992G92576C25120L72736k22720f656A86368b22208C15392a536
7162A025536A43360M03456A17760J19808J51552R82016c48672C35360a71008B10944
7151D57216k16576O7072a19296A198080J88928E39648p5776A63328J55648J65888
7141D84864N43744M096j00864l13344B96960H0896b28352A069056a167872D66432
7130e0176j81760G86432B38592K66240J47456k58048j17760R9328I1136L79392
7120D70528j66400c38944I76896a52576A78176g5264l49696B84672a88928C33824
7109A249280m94080a78688F71232l4816K46272j2288a42848n13024D59264j3312
7099D45952h8576A067520g3728q02816G66976a12128o45120A078784r6768B22208
$$ plain form
7088 803328 313344 49152 911360 243200 -285184 349696 1199104 134144 771072 1411584
7078 1411584 -717312 50688 -91648 1089024 818176 193024 560640 819712 -268800 659456
7067 1082368 630272 -247808 -47616 510976 69632 641536 -799744 677376 641024 233472
7056 188416 137728 337408 223744 566784 -454656 310272 1021440 575488 299008 9728
7045 431616 1091584 1218048 -74752 593408 1292800 698368 110080 1024 26624 756736
7035 756736 416768 -318464 164864 645120 -504320 -157184 454656 -133120 194560 588800
7025 588800 659456 256512 598016 295424 517632 428544 886272 89600 413184 -588800
7014 437760 -73216 -85504 335360 933888 555008 -473600 942080 212992 -245760 1173504
$$ packed form
7088H03328C13344D9152Q62208B43200b85184C49696Q49408A34144O36928O40512
7078A411584g17312E0688i1648A089024k70848A93024L67616K59072b68800F59456
7067A082368m52096b47808d7616E10976F9632N71904g99744F77376l6352B33472
7056A88416n0688J99680j13664L43040d54656C10272P11168m45952k76480I728
7045D31616O59968J26464g4752E93408O99392n94432A10080A024K5600P30112
7035G56736l39968c18464A64864M80256e04320a57184D54656a33120A94560L94240
7025E88800P0656B56512L41504B95424K22208q9088M57728H9600L23584e88800
7014D37760g3216j2288C35360N98528l78880d73600I42080B12992b45760A173504
$$ plain form
7003 -24064 176640 -221184 553472 284672 33792 -348160 344576 -381952 528896 -383488
6992 -528896 759296 103936 -601600 329728 -283136 -565248 481792 -679936 71680 370688
6982 370688 -609792 76800 -471552 -219136 462848 199680 270848 293376 -363520 -73216
6971 1297408 982528 291328 548864 1153536 231424 817664 -563712 -436736 546816 489472
6961 489472 -20992 512000 -237056 665600 -732160 102912 -73728 359424 770560 621056
6951 621056 632832 424960 1124352 1190912 560640 596480 352256 -114176 974336 879104
6941 879104 601600 -33792 52224 64512 327168 270336 47104 90112 716288 1246208 -196096
6929 1014784 -432128 331776 10240 -199168 -34304 501760 1036288 354304 442880 173056
$$ packed form
7003b4064A76640b21184E53472k68800C3792c48160C44576c81952E28896c83488
6992e28896G59296A03936f01600C29728b83136k82112D81792f79936G1680K99008
6982C70688f09792G6800d71552b19136D62848A99680P1168K2528c63520g3216
6971A297408l14880B91328K57536O04672B31424N86240e63712J26976E46816n7344
6961D89472b0992E12000b37056F65600g32160A02912g3728C59424M11136j49504
6951F21056J1776k07872O99392O6560E60640L5840k44224a14176I74336r5232
6941H79104k77504c3792E2224J2288K62656n6832D7104M3008O26176N29920a96096
6929A014784d32128C31776A0240a99168c4304E01760N34528C54304Q8576A73056
$$ plain form
6918 681472 1674752 -118272 750080 -644608 -74752 712192 518656 203264 725504 -572928
6907 -317952 259072 504832 -250368 426496 587264 517120 685568 -113664 -187904 412672
6896 757248 96768 1037824 409088 194048 502272 595968 1299968 707072 697856 1253376
6886 1253376 327680 -63488 -455168 287232 -563712 79360 379904 698368 -84480 639488
6875 1032704 121344 -137728 1103872 925696 591872 16896 485888 1276416 -627712 806912
6864 346624 -258048 0 262656 982528 -320512 933888 1447424 276480 354816 260096 -992768
6852 869376 523776 516096 546304 702464 -344064 -545792 187904 998400 -543232 209408
6841 1171456 -432128 -197120 -55296 328192 -107008 714240 -128512 110080 201216 315392
$$ packed form
6918F81472R93280a18272G50080f44608g4752G12192j93536B03264N22240e72928
6907c17952B59072K45760b50368D26496J60768p0144J68448a13664p4240D12672
6896G57248I6768R41056D09088A94048L08224R3696P04000n92896r216N55520
6886A253376C27680f3488l91680B87232e63712G9360L00544L18464h4480F39488
6875A032704A21344a37728A103872j78176l33824A6896M68992P90528f27712H06912
6864C46624b58048@B62656P19872c20512I33888N13536B76480P8336r4720i92768
6852H69376l45600p680L0208J56160c44064k01728A87904Q10496e43232B09408
6841A171456d32128a97120e5296C28192a07008G14240a28512A10080R1136J14176
$$ plain form
6831 315392 -195072 517632 270336 -95232 561664 95232 592384 1029632 3072 667136
6821 667136 1083392 -700416 325120 16896 -308224 -113152 -51200 -599552 -364032 325632
6810 702464 589824 566784 780288 424960 44032 1075200 339456 45568 -133120 1022976
6799 795648 898560 1490944 147968 1048064 -1022464 -27648 549888 -996864 1112576 738304
6789 738304 605696 61952 448000 -118272 -202752 567808 -524288 793088 758272 601600
6779 601600 -576000 -281600 111104 246784 505856 -299008 240640 707072 845824 289280
6768 711168 -39424 -568320 688128 1452544 -385536 530432 -80896 242688 913408 579584
6758 579584 -63488 1249280 -369152 632832 270336 -988160 -14848 308736 1054208 619008
$$ packed form
6831C15392a95072E17632k47296i5232E61664I5232M97152M37248C072O64064
6821F67136M16256g00416C25120A6896c08224a13152e1200n48352K35520C25632
6810G02464j12640k3040K13504l55328D4032J031168C39456D5568a33120A022976
6799G95648J02912N92384A47968R00096a022464b7648E49888i96864A112576l74272
6789G38304j32608F1952L86048a18272q4480E67808e24288G93088l4816j56672
6779F01600e76000b81600A11104J35680K59072b99008B40640M66432J38752B89280
6768G11168c9424n28896F88128P64416c85536E30432h0896B42688O70720l33824
6758E79584f3488A249280c69152F32832B70336i88160a4848C08736P45472m35200
$$ plain form
6748 619008 375808 1352192 -708096 314368 112640 -754688 184832 -426496 190976 282112
6738 282112 881152 -678400 569344 -111616 838656 578048 439808 714240 -313344 624640
6727 1573376 595456 270336 295424 632832 23552 -364032 1321472 458752 -128512 1195520
6716 516608 310784 -108544 -531456 476672 116224 808960 409600 -215552 33792 107520
6706 107520 628224 -300032 312320 -165376 736256 -71168 -199168 688128 270848 -345088
6695 281088 716288 73216 198656 -219648 321536 -736256 491520 702976 310784 550912
6685 550912 168960 180224 -117248 1072128 515072 -24576 1353216 226304 -25600 903168
6674 1054208 -79360 171520 301056 763392 1278976 -370688 509952 -3072 331776 -186880
$$ packed form
6748F19008k43200R76384g08096C14368A12640g54688A84832d26496A90976R1136
6738B82112N99040f78400E69344a11616H38656k60608j38240K74432c13344F24640
6727A573376E95456B70336K5088L37408B3552c64032A321472D58752a28512A195520
6716E16608k05824a08544m22912D76672A16224O92736l99360b15552C3792P3728
6706A07520N20704c00032C12320a65376G36256g1168j28000F88128B70848c45088
6695B81088M35200G3216J25440b19648C21536g36256D91520K11456C10784K40128
6685E50912A68960J1264a17248A072128E15072b4576A353216B26304b5600I03168
6674A054208g9360A71520J29536M62336N15584c70688E09952c072C31776a86880
$$ plain form
6663 -308224 -20992 244224 592896 450048 327680 603136 315904 537600 -397312 721408
6652 1196032 954368 -208384 144896 -44032 432640 299008 -836096 29696 99840 415744
6642 415744 669696 537088 -101376 411648 -471552 -346624 -430592 148992 -281600 972288
6631 677888 -160768 1260032 253952 -56832 -227328 -85504 -273920 185344 -36352 707072
6620 343040 -125440 -247808 264192 931328 404992 627712 1316352 -321024 600064 1297920
6610 1297920 41984 64512 1111552 67584 430080 15360 754688 1538048 72192 730624
6600 730624 1039360 -388608 -541696 -61440 88576 -273408 1200128 71680 1651712 1152512
6590 1152512 1226240 1501696 -8192 344576 87040 -270336 -46592 -128512 823808 -512000 -21504
$$ packed form
6663c08224b0992B44224L48672j42848j22368K75456k87232K21696c97312G21408
6652A196032k41664b08384A44896d4032D32640j33632h36096B9696P0144L15904
6642D15744K53952j32608a01376D11648d71552J24928q3968A48992b81600I72288
6631F77888a60768A260032B53952e6832j70496h5504j88416A85344c6352G07072
6620C43040a25440j22368B64192O67136D04992K22720O88640c21024F00064O97856
6610A297920D1984K2528J047040F7584L62496A5360P39328P83360G2192O58432
6600G30624L08736c88608j53088f1440H8576b73408A200128G1680J580032m99200
6590A152512P3728K75456h192C44576H7040b70336d6592q1920H23808e12000b1504
$$ plain form
6578 -760832 798720 640512 411648 -702464 -80896 -94720 634880 -823808 -91136 -664576
6568 -664576 -77312 187904 998912 -429056 485376 761344 751616 -259584 430592 890368
6558 890368 479232 -653824 129536 243200 372736 924160 -229376 375808 -374784 687104
6547 -155136 -553984 -507904 893440 158208 178176 948224 188928 -108544 58368 1264128
6537 1264128 481280 577024 254464 1220096 629760 -156672 -394752 260608 70144 288768
6527 288768 -114176 631296 -369152 584192 -214016 -695808 430592 243712 -1242112 115200
6516 208384 205312 1595904 462848 1052160 889344 -99328 -84992 -685568 -125952 -698368
6506 -698368 94208 146944 976384 1272832 437248 287232 913408 587776 941568 667136
$$ packed form
6578g60832G98720j58208k28864g02464h0896j3824F34880h23808i1136n73440
6568f64576g7312A87904Q11008d29056D85376K75968r728b59584D30592M59776
6558H90368m11136f53824A29536J13664J29536N51424b29376C75808c74784F87104
6547a55136l98848M6080H93440A58208J9968P70048A88928a08544E8368J205760
6537A264128D81280R5744B54464R65632n90336a56672k38080B60608G0144K18624
6527B88768a14176F31296c69152E84192b14016m81792D30592j86880a242112A15200
6516B08384l072J390592D62848N89312j62816i9328J4336o00576a25952n72416
6506f98368I4208N2736Q29440K96448D37248j50016O26176l25632L53792k74432
$$ plain form
6496 667136 -27136 1061888 262144 -534016 237568 263168 612352 -388608 131072 1005568
6486 1005568 -153088 -198656 674816 -712192 -74752 868864 740352 880640 479232 -200704
6475 192512 -91648 178176 585728 509952 415744 -140800 101376 -37888 -226304 53760 447488
6464 447488 -138752 14848 406016 371200 73728 695296 453120 503808 298496 20480 353792
6453 353792 385024 376320 -125952 197632 -121344 914432 487936 722944 -533504 -220672
6442 91648 -215040 -487424 -812032 563200 -49664 960000 528896 182784 336384 -121856
6431 875008 -55808 -404480 -93696 706048 852992 135680 -204800 -107520 731648 175616
6420 194560 650240 -279552 -115712 -474112 -420864 822272 23552 259584 286208 -20480
$$ packed form
6496F67136b7136A061888B62144e34016B37568K5600L49184c88608A31072Q74496
6486A005568a53088m5568F74816g12192g4752H68864j28512J40288m01408b00704
6475A92512i1648A78176M07552p5776r4208a40800A01376c7888j88416E3760L93728
6464D47488a38752A4848L91168l4816G3728O21568k42176N0688k05312B0480L33312
6453C53792L1232q704a25952A97632a21344I14432m26496K35008e33504b20672
6442I1648b15040k72384l24608E63200d9664I60000m31104A82784J53600a21856
6431H75008e5808l48672i3696G06048J46944A35680b04800R7280G31648A75616
6420A94560M55680b79552a15712l58400N3248H22272B3552K36032K6624b0480
$$ plain form
6409 159744 243200 599552 -311808 115712 -15872 -18432 64000 -668160 470528 664064 1277440
6398 1277440 -922112 -229888 336896 468480 58368 168448 -38912 499712 -318464 0 75776
6386 1341952 29696 -172544 -24064 883712 -226816 -90624 -161280 311808 257536 -44032 -309248
6375 -309248 -900608 1120768 459264 554496 667648 813568 268288 198144 258048 1332224
6365 1332224 -560128 528384 0 1028608 -290304 427008 438272 -16896 -159232 -36352 1127936
6353 617472 837120 -613888 951296 869888 236544 1289728 378880 -671232 541184 857600
6343 857600 330752 167424 750080 1007104 -323072 184320 479232 -573440 1169408 906752
6333 906752 1505280 1329152 59904 -564736 -109568 216064 785408 610816 815104 1521664
$$ packed form
6409A59744Q3456L56352c11808A15712a5872k560F4000f68160D70528J93536O13376
6398A277440i22112b29888C36896J31584E8368J10080c8912D99712c18464@G5776
6386A341952B9696a72544b4064H83712b26816i0624p0656C11808n4272d4032k65216
6375c09248n91360A120768D59264R5232J13152J45920B68288p0144N9904J074176
6365A332224e60128E28384@A028608b90304D27008J1264a6896j42336c6352A127936
6353F17472K19648f13888I51296q1408B36544J053184C78880f71232E41184L16416
6343H57600C30752j63328N82656K57024c23072A84320K94912e73440A169408k62656
6333I06752N98528j76128E9904e64736a09568B16064N69344j74592K04288P06560
$$ plain form
6323 1521664 681984 787456 950784 582144 -205312 817664 -62464 -169984 991232 1190912
6313 1190912 740864 -341504 462848 528896 678400 47616 633344 494080 1050624 464384
6302 489472 410112 594944 235520 369152 918528 -104960 -123904 38912 198656 257536
6292 257536 343552 595456 224768 492032 425984 922624 440320 327168 308736 43520
6281 -235520 340992 271360 777728 -454656 117760 510464 -38912 879616 837120 198144
6270 -379392 1204224 1311232 585216 -358400 1101824 -451584 163328 -540672 -1380352
6261 -1380352 -273920 243712 967168 969728 143872 474624 1216512 838656 97792 273920
6251 273920 -242688 -280576 1302528 860160 302080 116224 620032 1058816 333824 214016
$$ packed form
6323A521664F81984J05472J63328l68640b05312H17664f2464j07520I91232J99680
6313A190912m50048c41504D62848O6048J49504D7616N85728j39264N56544D64384
6302D89472p9360J84832B35520J33632N49376a04960j8944C8912J59744N8880
6292B57536Q6016K51904B24768K67264o6048M96640D40320j13152j8432D3520
6281b35520C40992o9632N06368d54656A17760L92704c8912H79616m2496A98144
6270c79392A204224J07008E85216c58400A101824d51584A63328e40672q39680
6261a380352b73920B43712P23456K560A43872L30752P41888l77856I7792J76128
6251B73920b42688l7888A302528m42368C02080A16224N03808M38784C33824j19808
$$ plain form
6241 214016 886272 842752 -40448 12800 536064 -913408 -164864 248320 591360 537600
6231 537600 -392704 993280 820224 494592 335872 412160 -273920 61440 693248 323584
6220 -178688 -190464 152576 1348608 1221120 71680 1824256 1200128 -2048 59904 335872
6210 335872 530944 181248 691712 -55296 357888 -240128 947200 -452096 -350720 -188928
6200 -188928 92160 285184 -637952 202240 387072 389120 117760 -105472 167936 575488
6190 575488 -598016 -633856 -392192 119296 222720 -16896 417792 -505856 626688 908288
6180 908288 378880 180224 6656 133120 637440 138240 606720 455680 296960 562688
6170 562688 29696 -222720 -372736 -175104 -1238016 -120832 1119232 -138240 1537536
$$ packed form
6241B14016O72256m3520d0448A2800N23264i13408a64864B48320L43040n3760
6231E37600c92704I93280j73056l25632j58720P6288b73920F1440O31808C23584
6220a78688j1776A52576J196032j27488G1680J752576o24128b048E9904K75968
6210C35872J95072A81248N10464e5296C57888b40128I47200d52096J01376J61792
6200a88928I2160J93024f37952B02240J84832K048A17760a05472A67936M07552
6190E75488e98016l5840K41664A19296J03424a6896D17792e05856F26688K81600
6180I08288C78880A80224F656J26464N04320A38240M68480j51040j58720K65728
6170E62688B9696b22720j50016a75104j062912a20832A119232a38240A537536
$$ plain form
6160 -165888 -39936 -290304 427520 -783360 -266240 354816 884224 1417728 829952 502272
6150 502272 -574976 507392 470016 516608 -112128 -131072 542720 114688 -321536 475136
6139 503808 1051648 1465344 160256 15360 458240 468992 763392 -18944 -704000 123392
6128 459776 260096 -333312 475136 402432 463872 365056 320000 977408 -61440 317440 -73728
6116 -188928 666112 -63488 -372224 -626176 880640 631808 1189376 717824 112640 68608
6106 68608 -178176 -143360 546816 469504 1022464 270336 -509952 -255488 -88576 734720
6095 1142272 223744 604160 711680 960000 941568 -275456 49664 1084928 -154624 -338432
6085 -338432 201728 -100352 -679424 1500160 -81920 1556480 741376 141312 413184 -221184
$$ packed form
6160a65888c9936k50368D27520g83360b66240C54816N29408N33504n87776l27680
6150E02272e74976E07392l7376M6592a12128j8944E42720A14688c21536D75136
6139E03808N47840M13696A60256A5360M42880J0752K94400a8944o85056A23392
6128D59776j99680c33312D75136p2704O1440r8816m5056O57408f1440C17440g3728
6116a88928F66112f3488l08736k53952H80640k48832N57568m71552A12640m4032
6106F8608a78176L4816E46816p7312N52960B70336e09952K54464h8576G34720
6095A142272B23744L80416J07520K48320j8432b75456D9664J035264a54624j83808
6085c38432B01728a00352n79072A500160h1920A556480G41376A41312K71872b21184
$$ plain form
6074 391680 279552 935936 610304 1158656 -348672 202752 714752 -512 381440 881152
6064 881152 435200 -151552 846848 976896 -256000 -179712 316416 1285120 1057792 505344
6053 1056768 529920 83456 117760 -845312 617472 24576 -170496 366080 374272 587264
6043 587264 -196096 323584 47616 -301568 -273920 304128 246784 733184 1195520 1197056 720896
6032 720896 -517120 -646656 503808 162816 563712 -118272 443392 1312768 231936 552448
6022 552448 571904 312320 -193536 775168 493056 205824 791040 422912 -512 328192
6011 618496 765952 431616 -263680 -86016 -553472 518656 453632 542720 744448 858624
6001 858624 259584 -272384 663040 -42496 388096 -336896 919040 294912 1233920 797696
$$ packed form
6074C91680j12128O56384l25632N48352c48672B02752N12000e12C81440M99712
6064H81152D35200a51552H46848J30048b56000P6288C16416R68704k27328E05344
6053A056768n26848H3456L4304h45312F17472B4576a70496C66080Q192K12992
6043E87264a96096C23584D7616c01568K7648C04128n7344M86400M62336J536m76160
6032G20896e17120j29536E03808A62816M00896a18272D43392Q69376B31936L20512
6022E52448J9456k59584a93536G75168k82112B05824N85216l68128e12C28192
6011F18496J47456l34336b63680h6016m67456E18656o5024Q9088K01728J14176
6001H58624B59584b72384F63040d2496C88096c36896I19040B94912R39008m36224
$$ plain form
5991 797696 54784 -537600 327680 119808 593920 90624 863744 1637376 -2560 637952
5980 962048 326656 581120 -849920 897024 1709056 924160 1670144 165376 -512000 46080
5969 -287744 -348672 55808 338432 -286208 -196096 767488 475648 -160256 1125376 929792
5959 929792 686592 47616 -17408 803328 1198080 153088 176640 -14848 116736 295424
5949 295424 965120 539648 156672 358400 -537088 889344 523776 233984 92672 1362432
5939 1362432 110080 642048 1336832 1022464 570880 -1060352 939008 -15872 584192 1007104
5929 1007104 -668160 202752 1295360 -136192 279040 453632 102400 483840 654336
5920 654336 309248 716800 524288 -4608 58368 547328 -662528 577536 1095680 1014272
$$ packed form
5991G97696E4784e37600C27680A19808M74112I0624P73120P73632b560F37952
5980I62048C26656K54464h49920H97024Q12032p84896P45984A65376e12000D6080
5969b87744o0928E5808K82624b86208R0112G67488k91840a60256A125376j95584
5959I29792k43200D7616a7408H03328L94752A53088K3552a4848A16736J78688
5949B95424O69696m25472A56672K01728e37088H89344l65568B33984I2672J269760
5939A362432A10080N31968O94784l14368m51584a060352I39008a5872E84192M22912
5929A007104f68160B02752J092608a36192B79040J74592A02400L81440J70496
5920F54336C09248M07552j92512d608E8368M88960f62528E77536N18144q1408
$$ plain form
5910 1014272 1077248 1097216 40960 -568832 568320 -227840 53760 -559616 -158720 309248
5899 -430592 -89600 230912 26112 806400 163840 -188416 -445440 1163776 1015296 -37888
5888 797184 809984 1048064 1517056 206336 -132608 470016 1071616 284672 -234496 -439808
5878 -439808 -442880 -351232 408064 664576 681472 625152 461824 203264 1230848 1055232
5868 1055232 -210944 600576 893440 397312 510976 -939008 143872 -371200 709120 -389120
5857 288768 470016 -5632 14336 -25600 531968 263680 464384 -267776 -470016 1220096
5846 638976 1253376 -889344 711168 515072 -77824 918528 1053696 487936 679936 361984
5836 361984 873984 553984 -36864 25088 966144 1192448 1525760 372224 1232896 1137152
$$ packed form
5910A014272O2976J9968D0960e68832E68320b27840E3760e59616a58720C09248
5899d30592h9600B30912B6112P80288A63840a88416k57024A163776j48480c7888
5888G97184J2800K38080M68992B06336a32608D70016O01600B84672b34496k05312
5878d39808l072R1648D08064K56512J6896n6320j63328B03264J027584j75616
5868A055232b10944F00576K92864C97312J13664i39008A43872c71200G09120c89120
5857B88768J81248e632A4336b5600E31968B63680K00704b67776k02240A220096
5846F38976O14400h89344G11168j96096g7824I18528J35168D87936J92000l17952
5836C61984N12000l20000c6864B5088R41056K26304L33312C72224Q60672r5744
$$ plain form
5826 1137152 927744 977408 -99840 -161792 586752 -66560 297472 -144896 1112576 -526848
5815 320512 602112 298496 198656 143872 -289280 -102400 1121792 629760 565760 1013760
5805 1013760 -424960 51712 585216 -679936 92160 -420864 79872 281088 -695808 69632
5794 792064 464896 -147968 751616 1031168 -227328 256000 -132096 366592 1066496 1079296
5784 1079296 686080 399360 -57344 -405504 500736 793088 528896 42496 1140224 616448
5774 616448 1664000 820736 797184 552960 609280 130048 1039872 809984 -627200 442880
5763 39936 609280 162304 518144 -187904 379392 718848 -17408 -556032 1342976 259584
5752 751104 120832 572416 915456 -521216 -242176 603136 337408 576000 1029632 -14336
$$ packed form
5826A137152k09408M9664i9840o1952E86752f6560B97472a44896A112576e26848
5815C20512K81600B98496r9840n4784b89280a02400A121792m92032o4000M48000
5805A013760d24960E1712N33504f79936I2160d20864G9872K01216f95808F9632
5794G92064l27168a47968G51616K79552b27328B56000a32096C66592O99904J2800
5784A079296l93216k86720e7344l48160E00736K92352k64192D2496J097728n23776
5774F16448J047552H20736k3552k44224N6320A30048R09824k29888f27200D42880
5763C9936N69344A62304L55840a87904C79392L39456a7408n38624A342976B59584
5752G51104A20832M51584L43040e21216b42176F03136k65728K38592M53632a4336
$$ plain form
5741 214016 -299008 1059328 290816 512512 728576 1567744 -356352 1014272 210432
5731 481792 193024 655360 176640 1374720 1681920 669696 701440 36352 632832 -8704
5720 752640 94720 22016 892416 643072 365568 414208 -858112 -131072 1295360 -545792
5709 -62464 140288 792064 1831424 1166336 287232 89600 351744 203776 1165824 -679936
5698 740864 -118784 987648 851968 547328 832000 494592 839680 -836096 -235008 1009664
5687 408064 61440 1501696 1728000 -156160 978944 -127488 134144 460288 27136 -158720
5676 187904 1007616 849408 1564672 -34816 437248 -139264 1255424 1563648 1292800 -840704
5665 794624 357376 117248 571392 -322048 -404480 103424 11264 643584 942592 1124864
$$ packed form
5741B14016b99008A059328B90816K21696K16064Q39168c56352A014272B10432
5731D81792A93024M62336A76640J198080L07200F69696L1744C6352N96480h704
5720G52640I4720B2016Q70400k49344k77504M8640h58112a31072A295360e45792
5709f2464A40288O51776J039360o65088B87232H9600K62144j47968R62048f79936
5698G40864a18784I87648j35680l04640K84672l37408L45088h36096b35008A009664
5687D08064F1440J440256K26304a56160I78944a27488A34144L26144B7136a58720
5676A87904Q19712j58208P15264c4816D37248a39264A255424L08224k70848h40704
5665G94624C57376A17248M54144c22048q2432A03424A1264O32320K99008J82272
$$ plain form
5655 1124864 1163776 672256 -504320 -6144 691712 555520 640512 -203776 562176 86528
5644 -215552 499712 502272 -119296 238592 803328 456192 1387520 -525824 -488448 14336
5633 426496 385024 -205824 -338944 8704 -337920 666112 0 180736 308224 698368 1460224
5622 1460224 134144 332800 379392 840704 -5120 567296 714240 909312 -550912 -140288
5611 548864 1363968 209408 253440 -98816 285696 485888 654336 379392 359424 274432
5601 274432 881152 -16384 65024 381952 474112 488960 616448 -327680 451584 -22528 -331264
5590 -331264 510976 329728 706560 104960 512 442880 560640 893440 1261056 966144
5580 966144 215040 850432 -667648 414208 328192 446976 1426944 -62976 -1132032 650240
$$ packed form
5655A124864L8912m91520e04320f144F91712j36192Q4992b03776E62176H6528
5644b15552D99712K560a19296B38592N64736l47136R31328e25824L7376A4336
5633D26496m1472b05824j33120H704c37920F66112@A80736J27488L90144P61856
5622A460224A34144J98656M6592M61312e120E67296J46944J95072e50912a40288
5611E48864Q15104B09408M4032i8816B85696K00192J68448k74944j9968q4992
5601B74432O06720a6384F5024L16928R2160J4848J27488c27680D51584b2528l08736
5590c31264E10976j81248L76832A04960E12M42368J17760L32800L67616k94912
5580I66144B15040O35392f67648D14208q6016J18784R79968f2976j069056F50240
$$ plain form
5569 -379904 745472 806400 199680 645632 426496 -360448 946176 266752 357888 -818688
5558 815104 -200192 461312 750592 549888 168448 463360 790016 -664064 700928 -436736
5547 774656 103936 -203264 287744 758272 633344 -231936 83456 1420288 391680 671232
5537 671232 966656 347136 1243648 -646656 754688 878592 -431104 592384 579584 463360
5527 463360 671744 809984 -109056 283648 300544 500224 -47616 281600 586240 361472
5517 361472 200704 22016 -13824 731648 771072 -89088 175616 -54784 530432 -161280 104448
5505 226304 952832 1518080 -157696 558592 768512 807936 828928 1620480 1329664 1010688
5495 1010688 713216 1117184 1175552 1588736 1079808 -5120 556544 162304 -478208 385536
$$ packed form
5569c79904G45472O0928A99680M45952k19136c60448I46176B66752R1136h18688
5558H15104b00192D61312K89280k00704A68448K94912L26656f64064G00928d36736
5547G74656A03936b03264B87744M70528j24928b31936H3456J336832C91680K79552
5537F71232K95424C47136Q96512f46656G54688J23904d31104E92384j2800j16224
5527D63360K08384J38240a09056B83648J6896J99680d7616B81600L04640k24768
5517C61472j60768B2016a3824G31648L9424h9088A75616e4784E30432a61280A04448
5505B26304P26528N65248a57696E58592K09920L9424K0992P91552k90816l18976
5495A010688k97472M03968N8368M13184n08928e120E56544A62304d78208C85536
$$ plain form
5484 332288 1273344 646144 366592 228352 500736 -145920 800256 919552 -706048 1238016
5473 220160 821248 555008 488448 824320 899584 951296 932864 466944 -31232 219136 966144
5462 966144 243712 1288192 440320 -95232 602112 939008 509952 621568 370176 846848
5452 846848 -206848 348672 1639424 -12288 128512 1135616 502272 -89088 124928 424960
5442 424960 351744 324096 18432 -130560 -370176 1172992 445440 -353792 1390592 832512
5432 832512 555520 1092096 466432 86016 417792 600576 84992 578048 236032 1205248
5422 1205248 -134656 987648 65536 317440 1293824 88064 485376 1187328 643584 -493568
5411 -109568 776704 23552 -895488 304128 371200 804864 165888 -105472 277504 649216
$$ packed form
5484C32288R41056o27200k79552j38240K72384a45920H00256J19296g06048A238016
5473B20160O01088k66240o6560L35872P5264N1712j8432m65920c1232B19136P47008
5462I66144B43712J044480D40320i5232F02112L36896m29056J11616k51392M76672
5452H46848b06848C48672J290752a2288A28512J007104E02272h9088A24928L00032
5442D24960p3216k7648A8432a30560k39616A172992D45440c53792A390592n58080
5432H32512k76992N36576D66432H6016L31776J82784H4992M93056B36032R69216
5422A205248a34656I87648F5536K51904R76384H8064L97312P01952n43744d93568
5411a09568G76704B3552h95488C04128O7072M33664A65888a05472B77504L71712
$$ plain form
5401 649216 299520 -227840 1059840 38400 432128 730112 1143808 107520 108032 505856
5391 505856 535552 1016320 400384 454656 1349632 1049600 1785344 1618944 656896 1039360
5381 1039360 -436736 -193536 728064 1705472 882176 363008 202240 1213952 -205824
5371 1400320 1023488 1769984 771072 837120 647168 1080832 786944 815104 1920000 688128
5360 973312 382976 -208896 572416 785408 1036800 675328 742400 1336832 569856 307200
5350 307200 521728 1039360 1335808 2116608 1390592 1251840 2123264 1334272 679424 920064
5340 920064 1344512 1298432 808448 929792 1136640 1717760 1890304 1299968 218624 1952256
5330 1952256 -185344 950784 961024 474624 1331712 742912 560128 1660416 -342016 1521664
$$ packed form
5401F49216B99520b27840A059840C8400L93728K97984M13696A07520N12L97824
5391E05856K9696M80768D00384N4272Q94976l00032P35744j66400F56896L82464
5381A039360d36736a93536G28064R77408q23296C63008j60768J011712b05824
5371A400320l76832P46496G71072O6048j89952M33664k93888K8160J104896F88128
5360I73312C82976b08896E72416K12992K51392l61472O7072N94432E69856k62656
5350C07200K14528N17632K96448P80800p26016j38752Q71424p88992o54848K40640
5340I20064M24448m6080m89984J21344K06848N81120J72544n90336B18624J733632
5330A952256a85344I50784J0240D74624Q57088n88800j82784J100288c42016A521664
$$ plain form
5319 873984 690176 257024 1182720 1261568 1211392 488448 848896 1358336 1455616 1724928
5309 1724928 773120 1384960 637440 1424896 311808 808960 691200 596992 157184 596992
5299 596992 657408 47104 480768 1060864 -447488 657408 701440 1353728 142336 -265728
5288 789504 267776 696320 225280 794112 622080 -122368 759296 594944 268288 698368
5278 698368 848896 292864 933888 1208832 746496 747008 996352 634368 63488 352256
5268 352256 757248 382976 -522240 1155072 1027584 1036800 163840 338432 1003008 378880
5257 443392 462336 708608 802816 420864 875008 1287680 189440 740352 439296 -336384
5246 948224 1689088 -470528 870912 928256 -492032 1031680 1240064 517632 1044480 1166848
$$ packed form
5319H73984j83808B57024R25696P8848n0176D88448L60448N09440R7280K69312
5309A724928G73120O11840F37440P87456C11808M97152j17760r4208A57184M39808
5299E96992O0416D7104M33664N80096d47488F57408M4032O52288A42336b65728
5288G89504B67776M28544B25280N68832j72032a22368G59296j64352B68288M30080
5278F98368J50528B92864O41024K74944m62336N12K49344l61984F3488K88768
5268C52256M04992l74272e22240A155072j27488R216A63840J74592O64576C78880
5257D43392J8944K46272R4208l81952M54144M12672A89440N50912l01056c36384
5246I48224P40864d70528H70912N7344d92032A031680K08384E17632N26848J22368
$$ plain form
5236 1166848 945664 468992 -111104 -492032 1195008 141824 927232 382464 193536
5227 193536 241664 729088 1366016 569344 825344 696832 110592 -30208 963072 65024
5216 446976 -227840 346624 190976 332288 421888 696832 -423424 1069056 532992 397824
5206 397824 928256 428032 141312 950272 514560 164864 1261568 597504 1340928 558592
5195 981504 1021440 1731584 -114688 769024 711168 544768 898048 1247744 436224 267264
5185 267264 230400 721408 1064448 532992 1485312 1040896 1032704 193024 1509888 258048
5174 135168 993792 -207872 1185792 472576 775168 531968 382464 -171520 1138688
5164 1249280 952832 426496 1050624 886272 807424 520192 -60416 -305664 1084416 916992
$$ packed form
5236A166848k21184D68992a11104l80928A195008A41824P85408C82464j88928
5227A93536M8128M87424O36928E69344K56000j28512A10592c0208I63072F5024
5216D46976b27840C46624j55648J41312Q9600K74944d23424A069056E32992j35168
5206C97824N30432D28032A41312Q08960m35712A64864J096704E97504P43424E58592
5195I81504L9936P10144a14688G69024n7856j66400L53280L49696D36224j68960
5185B67264l6864M91008L43040n31456R52320m44416q192A93024J316864B58048
5174A35168Q58624b07872A185792D72576L02592k43200j49504a71520A138688
5164A249280k96448D26496O24128j64352p8848k87232f0416k45248A084416j67424
$$ plain form
5154 916992 463360 1584128 -539648 761856 195584 -343040 1147904 -269312 736768
5144 -13824 205824 476672 126464 423936 -436736 763904 737792 -515584 861184 749056
5134 749056 59904 -84480 381952 776704 1217536 364032 2434048 687616 537088 699904
5124 699904 313856 1175552 538624 1017856 1292800 1464832 -943616 862208 776704 79872
5113 1129472 34816 877056 1405952 828928 1570304 2099712 2549248 1253376 2310144
5104 2310144 1990656 1044480 1005568 1773568 719360 270336 1440256 765952 1147904 988672
5094 988672 783872 1899008 -25600 591872 833024 918528 956416 282624 386560 -235520
5083 594432 890880 658944 -27648 320000 1639936 851456 484864 86016 1502720 175104
$$ packed form
5154I16992m53632J120768e39648G61856A95584c43040A147904b69312G36768
5144a3824B05824K70848A26464K97472d36736G63904k6112e15584H61184j12128
5134G49056E9904h4480C81952L94752M40832C64032K070016F87616j50528J62816
5124F99904C13856Q61696E38624M79232K74944J72032i43616H62208q5504G9872
5113A129472C4816Q42240N28896n77024P41376N29408M49536A253376J056768
5104B310144l19488r46176l8912P68000G19360B70336J169920o74304L81952j59232
5094I88672k04800J115136b5600E91872K41152Q5504L7888B82624J03936b35520
5083E94432K96448k31936b7648C20000J319936p88480l66592H6016J416704A75104
$$ plain form
5072 1083904 856576 960512 -1282048 967168 480768 329728 331776 589824 1107456 650240
5062 650240 -176640 -503808 95232 -763392 336384 488960 122368 607744 259584 1787392
5052 1787392 -147456 879616 904704 48128 884224 291328 810496 728064 307200 -418304
5041 1480704 494080 -67072 -167424 438784 616960 -161792 638976 -84992 526848 1007616
5031 1007616 783360 710144 1547776 300544 563200 701952 70656 -789504 560640 848384
5021 848384 1134592 676864 112128 360448 947200 823808 803328 -202240 1104384 453632
5010 1671680 596480 -225792 887808 767488 442880 601600 287744 630784 1680896
5001 1680896 1622016 322560 948736 1035264 -256512 1033216 21504 769024 1039872 -342528
$$ packed form
5072A083904k27328J03936a282048I67168D80768j51040K048K58048N17632m57216
5062F50240a76640l27168I5232g63392C36384J52576A22368M85376B59584J527808
5052A787392a47456H79616K5088D8128Q36096B91328N19168q2432C07200d18304
5041A480704D94080f7072j00352D38784J78176a61792F38976h4992E26848M80768
5031A007616k24256p3216Q37632C00544K62656J38752G0656g89504E60640K87744
5021H48384K86208m57728A12128K48320N86752j23392k0480b02240A104384D53632
5010A671680E96480b25792H87808j20320l24608J58720B87744L43040J050112
5001A680896n8880C22560O26176Q6528b56512A033216B1504P47520K70848c42528
$$ plain form
4990 1142272 2261504 1196032 373760 110592 1328128 -172544 1734144 647168 3072
4980 -267264 -1111040 186880 1592320 48640 546304 1580544 1130496 257024 912896 272896
4969 1404416 1380352 1767424 730112 1568768 686080 1207808 -17920 840192 1105408 283648
4958 142848 747520 506368 519168 1252864 1261056 1069056 779776 1256448 1596416 403968
4947 883712 1043456 1341952 611328 2049536 558592 1103872 856064 328192 1205248 1561600
4937 1561600 1703424 1112064 1477632 1783296 843776 -37376 1797120 1664000 718336 1159168
4927 1159168 1551872 1638912 1481216 1256448 1100288 210944 737280 1070592 1556992 1433600
4917 1433600 593920 1181184 1791488 1019392 1391616 835584 -145408 1349120 1359872 1524224
$$ packed form
4990A142272J119232j065472C73760A10592J217536a72544A734144F47168C072
4980b67264q43776A86880J405440D8640M97664J034240m50048B57024O55872B72896
4969A404416k4064L87072G30112Q38656F86080N21728a7920H40192K65216B83648
4958A42848O04672k41152J2800P33696Q192j92000k89280M76672L39968D03968
4947H83712J59744K98496F11328J438208E58592N45280k47808C28192Q77056L56352
4937A561600J41824n91360L65568L05664H43776c7376A797120j33120G18336M40832
4927A159168L92704Q7040j57696k24768j56160B10944N26336L33312M86400j23392
4917A433600E93920N87264O10304p72096L72224n56032a45408A349120J0752J64352
$$ plain form
4907 1524224 1574400 1059840 954368 787968 358400 1139200 87552 353792 1900032 1200640
4897 1200640 354304 536064 1328128 235520 1070592 1211392 1533952 1757184 403968 282624
4887 282624 344576 405504 362496 436736 185344 -454144 818688 275456 1055744 537088
4877 537088 1051136 -223744 1442304 1100288 846848 -22016 123904 1097728 994816 1924608
4867 1924608 1140736 1632256 1786880 1140224 747520 463872 624128 523776 1123840 576000
4857 576000 1328128 1193472 963584 2266112 1355264 909824 1421312 -93696 1275392 971264
4847 971264 1676800 794112 2187264 2397184 821248 1775616 1740800 1064448 1935360 2171392
4837 2171392 2621440 2885632 3625984 4120064 4926464 5250560 4957696 4241408 3754496 2932224
$$ packed form
4907A524224N0176n14560j05472j66400C58400P80800H7552K66240J546240o99392
4897A200640C54304J81760P92064B35520Q35072J40800L22560K23232D03968j21344
4887B82624O1952O0928m3008P4240A85344d54144H18688B75456P80288n18656
4877E37088N14048b23744A442304l42016k53440b2016A23904R73824j02912R29792
4867A924608p83872M91520J54624o46656l92704k83648J60256j00352O00064n47840
4857E76000P52128j34656k29888J302528r10848m45440N11488i3696A275392l04128
4847I71264P05536G94112J393152K09920H21248R54368l4816o76352Q70912K36032
4837B171392M50048K64192P40352M94080Q06400L24096k92864p16288m86912q22272
$$ plain form
4827 2932224 4348416 2381312 2825216 1417728 1434112 1270272 1295360 1007104 608768
4818 608768 916992 2098176 853504 403968 1395712 394752 1019904 765440 885248 1372672
4808 1372672 502784 943616 910336 1316352 1035776 897536 220160 -152576 1565696 1052672
4798 1052672 800768 216576 827904 585216 1479680 230400 967680 483328 1051648 1168384
4788 1168384 1761792 1649664 184320 1095680 1105920 1059328 1390592 509952 1024512 1100288
4778 1100288 341504 827392 -279040 799232 665600 1067520 317440 92672 852480 17408
4767 1017344 900096 713216 709120 270848 1814016 1447424 1427968 898560 1055232 614912
4757 614912 -8704 627712 606720 116736 233984 1042432 1259008 832512 804352 1541120
$$ packed form
4827B932224J416192j967104M43904j407488J6384j63840K5088k88256l98336
4818F08768L08224J181184H53504D03968R91744C94752O25152k54464J19808M87424
4808A372672E02784M40832l3280M06016k80576j38240B20160a52576A565696n13024
4798A052672k51904B16576O11328k42688Q94464B30400P37280D83328N68320J16736
4788A168384N93408j12128A84320R11360J0240m6592L31264E09952N14560P5776
4778A100288C41504M85888b79040G99232j33632M01920C17440I2672P59808A7408
4767A017344j17248j86880m096B70848J543168l66592j9456n29408J56672m40320
4757F14912h704F27712k0992A16736J17248Q08448K16576m26496k8160P36768
$$ plain form
4747 1541120 876032 839168 225280 752640 429568 1064448 1427456 1733632 753664 1072128
4737 1072128 549888 1132544 1448448 999424 873984 271872 234496 1505792 399872 948224
4727 948224 1894912 -51200 503296 270848 1059328 1106944 95232 1244672 1649152 772608
4716 745984 1318400 1009664 1261568 477696 578048 -146432 915456 1004032 716800 403456
4706 403456 694272 468480 1741824 309248 744960 1238528 855040 1589248 1775104 705024
4695 486912 558080 1432576 1576448 1082880 993792 1554432 1868800 894976 1279488 1274880
4685 1274880 784384 582656 1224704 409600 2391040 1413120 1831936 761344 40448 744960
4675 744960 1779200 464384 1197056 1508864 1474048 1253376 768000 1567232 474112 1600000
$$ packed form
4747A541120o65088l6864B25280N27360l23072O34880L63008L06176G53664L18464
4737A072128n22240N82656L15904m49024j25440B71872l7376J271296C99872N48352
4727I48224R46688e1200E03296k32448P88480M7616I5232J149440M04480G72608
4716G45984N72416l08736K51904D77696J00352a46432I15456Q8576k87232l13344
4706D03456K90816k25792J273344C09248M35712M93568l83488P34208J85856G05024
4695D86912P1168Q74496J43872m93568q9088N60640L14368H94976L84512m608
4685A274880m90496k01728O42048D09600J981440r77920M18816G61344D0448P04512
4675G44960J034240D64384P32672L11808l4816k20672m85376P99232D74112J125888
$$ plain form
4665 1600000 991744 1617920 1590272 1388544 1610240 1769984 1133568 1382912 569856 1945088
4655 1945088 905216 1292288 1254912 687616 1382912 865792 1535488 896512 2046976 1281536
4645 1281536 452608 1117696 1821184 1038848 651776 858112 1443328 1729024 743936 1167872
4635 1167872 1196544 864768 1351680 111616 457728 1341440 2008576 1346048 1463296 2270208
4625 2270208 2406912 1181696 1345024 391168 1456128 964096 1488896 1463296 893952
4616 893952 370176 1224192 1959424 370688 2608128 604160 1547776 1185280 23040 1223680
4606 1223680 508416 1260544 2296320 1551872 1277440 1236480 401408 1085440 1207808 1304064
4596 1304064 623104 464384 418304 1371648 1670144 882176 922112 1286144 1915392 337408
$$ packed form
4665A600000o08256O26176k7648k01728K21696J59744o36416K49344E69856J375232
4655A945088I05216L87072l7376n67296O95296n17120O69696o38976J150464p65440
4645A281536D52608O65088P03488p82336l87072K06336N85216K85696G43936M23936
4635A167872K8672l31776M86912A11616L46112Q83712O67136o62528J17248Q06912
4625B270208J36704A181696J63328C91168J064960m92032N24800k5600n69344
4616H93952C70176Q54016P35232C70688K237440F04160R43616l62496B3040J200640
4606A223680E08416P52128J035776p44448k74432m0960D01408O84032J22368R6256
4596A304064F23104j58720m6080R53344K98496p87968L9936L64032O29248C37408
$$ plain form
4585 1265152 -29184 718336 1784832 1377280 1021440 883200 2699264 1493504 1199616
4576 1199616 2824704 3030016 2050560 2265600 1624064 2529280 2858496 1334272 1435136
4567 1435136 1893888 2409984 1737216 2569216 1664000 1476608 1787904 981504 1467904 1991680
4557 1991680 2020864 2440704 979456 1232384 1227264 1595392 1000448 1286144 1432064 545280
4546 1797632 2405376 1482240 2000384 1620992 1330176 2652672 3098112 2390016 1785344
4537 1785344 1950720 3079680 1435648 3014144 3265536 3426816 2065408 3617792 1931776
4528 1931776 2418176 1777152 1540096 1949184 2875904 2067456 1631744 2124800 1356288 2519040
4518 2519040 1649152 1846272 1765376 2744320 989696 863744 2288640 986624 1771520 1782784
$$ packed form
4585A265152b9184G18336J066496m07552l55840j38240J816064j205760k93888
4576A199616J625088K05312r79456K15040o41536R05216L29216A334272J00864
4567A435136M58752N16096o72768Q32000r05216j87392L11296q06400M86400N23776
4557A991680K9184M19840I79456K52928n120L68128n94944K85696J45920E45280
4546A797632O07744r23136N18144l79392k90816J322496M45440p08096o04672
4537A785344J65376J128960A435648J578496K51392J61280j361408J552384j686016
4528A931776M86400o41024k37056M09088R26720q08448m35712M93056p68512J162752
4518B519040q69888J97120q0896R78944I89696j25952J424896I86624P84896J1264
$$ plain form
4508 1782784 1823744 1528320 1818112 1506304 691712 867328 729088 1938944 1136128 1812992
4498 1812992 1677312 988672 -166400 587264 907264 662016 1174016 1197056 1763840 1552384
4488 1552384 1077760 1888768 888832 265728 1413632 1144832 258560 1299968 833536
4479 833536 717824 876032 731136 1687552 1404416 1168896 1239040 1253376 707584 2117632
4469 2117632 1892864 1490432 480768 1863680 1263104 2595328 1759744 1904128 567296
4459 1776640 1383424 1623552 882176 2198528 1695232 426496 849408 678912 1496064
4450 1496064 1823232 1163264 1492480 1070592 1060352 2087936 1715200 1554944 2869760
4441 2869760 1567232 1563136 1935360 2284032 2224128 2080768 2187264 2201088 2259456 2176512
$$ packed form
4508A782784M0960k95424K89792l11808F91712J75616j38240J209856q02816O76864
4498A812992j35680o88640a66400E87264L20000k45248N12000K3040N66784k11456
4488A552384m74624Q11008H88832B65728J147904k68800B58560J041408m66432
4479H33536j15712J58208j44896R56416k83136k35520P0144J4336n45792J410048
4469B117632k24768m02432D80768J382912o00576J332224q35584J44384E67296
4459A776640l93216K40128p41376J316352n03296D26496M22912j70496Q17152
4450A496064L27168o59968L29216m21888j0240J027584l72736j60256J314816
4441B869760j302528m096L72224L48672n9904j43360J06496J3824N8368q2944
$$ plain form
4431 2176512 1731072 3167744 876032 3133952 2241536 1761280 1857536 2189312 1813504
4422 1813504 2058240 1313792 2515456 1875968 1043456 1335808 2399744 1085440 1668608
4413 1668608 888320 1868800 1610240 2067968 1778176 2321408 1530368 1984000 814592 991744
4403 991744 1310720 28160 990720 1523200 732160 2209280 528896 1595904 1640448 1015296
4393 1015296 1397248 1107456 2170880 885760 1852416 1455616 2198016 2044416 1397248
4384 1397248 1224704 2506752 2319872 2680832 2689024 1856512 2021888 1915392 1687552 1394176
4374 1394176 2115584 1949696 1098240 1798656 2120192 2713088 1937408 850944 1700864 2128896
4364 2128896 1881088 1340416 2696192 1806336 1571840 2494464 243200 1520640 1390592
$$ packed form
4431B176512m45440J436672H76032K257920q92416m80256R6256L31776l75808
4422A813504K44736p44448J201664o39488q32512K92352J063936A085440N83168
4413A668608p80288R80480k58560M57728k89792N43232p91040M53632H14592J77152
4403I91744L18976B8160R62560N32480G32160J477120E28896J067008M4544o25152
4393A015296L81952k89792J063424H85760R66656l96800P42400j53600o47168
4384A397248j72544J282048j86880L60960Q192q32512J65376j06496k27840k93376
4374A394176P21408j65888q51456P00416L21536N92896p75680H50944Q49920M28032
4364B128896k47808n40672J355776q89856k34496R22624B43200J277440j30048
$$ plain form
4355 1390592 2109952 1715712 1046016 1605632 552960 2137600 2519040 1096704 1808896
4346 1808896 648192 1079808 1063424 936960 1725952 1210880 1793024 895488 2851840 960000
4335 1340928 1831936 1050112 1455104 1814528 1311232 1655808 1965056 732160 649216 607744
4325 607744 1170432 1522688 2200576 1333760 1667584 2070528 1455616 2991104 2071040 2529280
4315 2529280 1479680 1987584 2053632 1639936 1203200 1278464 940544 2065408 1191936 1556992
4305 1556992 1915904 531968 1977856 1194496 1552384 1011712 880640 1672704 1494016
4296 1494016 1748992 781312 1761792 1538048 1631232 1660928 2034688 2095616 1037312 1371648
4286 1371648 2074112 2509824 1794560 2013184 2211328 1051136 2615808 2207744 2037248
$$ packed form
4355A390592P19360l94240o69696N59616E52960J584640L81440A096704P12192
4346A808896F48192M31616j6384j26464P88992n15072N82144H95488J956352I60000
4335A340928M91008p81824M04992L59424n03296L44576L09248G32160q2944m1472
4325F07744N62688L52256O77888q66816L33824M02944o14912J535488r20064M58240
4315B529280j049600N07904O6048m13696m36736P5264l37920J124864q73472L65056
4305A556992L58912E31968J445888p83360L57888n40672j31072P92064j78688
4296A494016K54976G81312R80480k23744R3184K9696L73760O0928A037312L34336
4286A371648P02464M35712p15264K18624J98144A051136J564672m08064j70496
$$ plain form
4277 2037248 2082816 2648064 1999360 2119168 2160128 2171392 1870848 1911808 2432000 1018880
4266 2264064 1456128 1256960 2146816 1467392 -134656 846336 2139136 1277440 2169856
4257 2169856 1638912 2405376 1412096 1785344 1324032 1354752 2328064 1541120 917504 1263616
4247 1263616 2145792 1782784 1384448 1349120 873984 1810432 2288640 914432 2031616 1826304
4237 1826304 1799680 1406976 920064 1133056 2249728 1118720 1833472 2178048 984576
4227 2485248 1308160 1282560 2259456 1069056 2774016 1292288 2352640 1546240 564224
4217 1775616 720896 939008 1124352 633344 1390080 860160 910848 879104 1191936 1188864
4207 1188864 1167872 798720 1037312 1748480 1053184 634880 872960 1152512 2232320 1261568
$$ packed form
4277B037248M5568N65248o48704J19808M0960J1264l00544M0960N20192A018880
4266B264064q07936j99168Q89856o79424a34656H46336J292800q61696Q92416
4257B169856n30944P66464r93280L73248m61312L0720R73312p86944o23616L46112
4247A263616Q82176l63008l98336l5328m75136R36448M78208I14432J117184k05312
4237A826304k6624l92704m86912K12992J116672A118720P14752L44576I84576
4227B485248j177088k5600R76896A069056J704960A292288J060352q06400E64224
4217A775616G20896K18112J85344m91008P56736n29920N0688l1744L12832l072
4207A188864k0992l69152K38592P11168o95296m18304K38080K79552J079808r70752
$$ plain form
4197 1261568 1885696 635392 209408 1112064 2041856 1261568 1766912 1765888 1891840 811008
4186 1992704 1249792 1700864 1338368 1393664 978432 1588736 1288704 890880 2011648 2339328
4176 2339328 1203712 2537984 2202112 1604608 2154496 947200 2116608 1919488 1496064
4167 1496064 1926144 1950720 1429504 623104 2273792 839168 1414144 1755648 1598976 1403904
4157 1403904 2992128 1407488 2049536 2109440 2153472 894464 2630144 744448 1697792
4148 1697792 2291712 1118208 1165312 2785280 3218944 1112576 2252288 2142208 1237504
4139 1237504 2640384 3350528 2510848 2007040 2002432 2546688 3365376 2460672 1809408 1836544
4129 1836544 3054080 2869760 2669056 2104832 1850368 2452480 1480704 2305536 1742336
$$ packed form
4197A261568O24128F35392B09408R02656R29792p80288N05344j024J25952H11008
4186A992704p42912M51072l62496N5296m15232O10304l00032l97824J120768L27680
4176B339328j135616J334272l35872n97504N49888I47200J169408j97120m23424
4167A496064M30080K4576n21216F23104J650688H39168N74976L41504j56672j95072
4157A403904J588224A407488O42048N9904M4032H94464J735680G44448R53344
4148A697792N93920A118208M7104J619968M33664A112576J139712j10080r04704
4139A237504J402880P10144q39680n03808m608N44256Q18688r04704o51264K7136
4129A836544J217536j84320k00704n64224k54464O02112r71776Q24832n63200
$$ plain form
4120 1742336 3186176 2529280 1973760 1865728 2139136 2064384 1606656 1695744 1930752 1862656
4110 1862656 1166848 1815552 1449472 2336768 1827840 2798080 2256384 3212800 2381312 2323968
4100 2323968 1978368 2445824 1958912 1974272 6940672 2919936 3671040 2817024 2355712
4091 2355712 2294272 3056128 3172864 3787776 2875904 3206656 1915904 2627072 2746368 3312640
4081 3312640 2148352 2350592 2453504 1977344 3422720 2025472 2227200 2040832 1068032
4072 1068032 2352640 2111488 2521088 883200 1884160 1935872 1337856 1996288 1862144
4063 1862144 2203136 2477056 2392064 2028032 1645568 1615360 2545152 3205120 1783808 2663936
4053 2663936 1966080 1558528 2220544 2100736 1205248 1098240 1356800 1157120 3027456
$$ packed form
4120A742336J443840o56896n55520j08032K73408p4752m57728Q9088K35008o8096
4110A862656o95808O48704l66080Q87296n08928R70240n41696R56416q31488n7344
4100B323968l45600M67456m86912J5360M966400B919936P51104q54016m61312
4091B355712o1440P61856J16736O14912r11872L30752j290752P11168J19296N66272
4081C312640j164288K02240J02912m76160J445376j397248K01728j86368r72800
4072A068032J284608k41152M09600H83200J000960N1712n98016O58432j34144
4063A862144L40992K73920q4992l64032l82464l0208R29792O59968j421312Q80128
4053B663936o97856m07552O62016j19808q95488j07008K58560j99680J870336
$$ plain form
4044 3027456 1600512 2353664 1829376 1488384 1078272 2203136 644608 1933312 1775104
4035 1775104 1734144 2808320 2260992 2287616 2630656 2451456 2530304 1669120 2637824 2942464
4025 2942464 3317248 2765824 3522560 3001344 2029056 2146816 2271232 2852352 2633216 3366400
4015 3366400 3917312 4113920 2223616 2129408 2708480 3360256 2334720 2423296 2525184 2789376
4005 2789376 2286080 2619392 2594304 3703808 1645568 2280448 2070528 1877504 1452032
3996 1452032 893952 1289728 1895936 1916416 1860096 2534400 2220544 1230336 1427968 1646080
3986 1646080 1638400 1212928 1271808 1426944 2303488 1404416 1485312 2021888 2108416 1516032
3976 1516032 1862144 1233920 1880064 1506816 1377792 965120 1111040 1395200 1596928 1329664
$$ packed form
4044C027456j426944P53152n24288l40992m10112J124864F44608J288704j58208
4035A775104m0960J074176n47328K6624L43040j79200P8848q61184R68704L04640
4025B942464L74784n51424P56736n21216r72288J17760J24416N81120k19136P33184
4015C366400N50912J96608j890304r4208N79072O51776j025536Q8576J01888K64192
4005B789376n03296L33312k5088J109504A645568O34880k09920j93024m25472
3996A452032n58080L95776O06208K0480n6320O74304l13856r90208J97632K18112
3986A646080p680m25472N8880J55136Q76544q99072Q0896N36576Q6528n92384
3976A516032L46112o28224O46144l73248j29024m12672J45920K84160K01728k67264
$$ plain form
3966 1329664 1110016 1828352 1945600 2077184 1746432 1790464 877568 1530368 1725952 1853440
3956 1853440 2296832 2206720 1659904 1449984 2416640 2239488 879616 1171456 2115584 2387968
3946 2387968 2253312 1804800 1450496 1577472 467456 1209856 1006592 1686016 2127872 1539072
3936 1539072 1226240 2044416 1902592 1496064 2416640 2129920 1500160 2078208 1761792 3663872
3926 3663872 1986048 1958912 2655744 1524736 1868800 2774528 2825216 3440128 2053632
3917 2053632 3044864 3072512 2503168 2892800 3250176 4064256 3121664 3805696 3850752 4147712
3907 4147712 3748864 4244992 4157952 4043776 4633600 3416064 3762176 4924416 4244992
3898 4244992 4637184 4451840 4188672 5030912 2781184 3207680 3765248 3741696 4268544 3629056
$$ packed form
3966A329664k19648P18336J17248J31584l30752M4032H77568O52800J95584J27488
3956A853440M43392r0112n46816k09920R66656j77152H79616K91840R44128K72384
3946B387968j34656m48512l54304J26976D67456P42400k03264O79424M41856n88800
3936A539072l12832Q18176j41824m06528R20576k86720o29760N78048l16416J902080
3926C663872j677824k7136O96832j131008L44064R05728N0688O14912j386496
3917B053632R91232K7648n69344L89632L57376Q14080r42592O84032M5056K96960
3907D147712l98848M96128q7040j14176N89824j217536L46112J162240o79424
3898D244992L92192j85344k63168Q42240k249728M26496N57568k3552N26848o39488
$$ plain form
3888 3629056 3985408 5025280 4700672 5507584 4789760 4277248 4661248 4238336 5407232
3879 5407232 5090816 5605888 6547456 4958720 5729792 5122560 5874176 6991872 6475264
3870 6475264 6582784 6223360 7416832 7391744 7963648 7182336 6751232 7310336 7781376 9159168
3860 9159168 8527872 9125888 10676736 10915840 11832320 11330048 11872256 11181056 9350144
3851 9350144 8708096 7325184 6087168 4944384 4798976 3132416 4641280 4045824 3559936
3842 3559936 2894848 2685952 2747392 2292224 2275328 2842624 3166208 3082240 3034624 1945600
3832 1945600 3197440 2555904 1788928 3517440 2319360 1799680 1879552 2361856 1507840
3823 1507840 2575360 3090944 1945600 1673216 2762752 1983488 1434624 2572800 3155456
$$ packed form
3888C629056L56352J039872l24608Q06912p17824n12512L84000m22912J168896
3879E407232l16416N15072R41568j588736P71072o07232P51616J117696n16608
3870F475264J07520l59424J193472k5088N71904p81312m31104N59104M71040J377792
3860I159168o31296N98016J550848K39104R16480n02272N42208o91200j830912
3851I350144o42048j382912j238016j142784j45408j666560J508864n95456m85888
3842C559936o65088k08896O1440m55168j6896N67296L23584q3968m7616j089024
3832A945600J251840o41536p66976J728512j198080n19680P9872M82304q54016
3823A507840J067520N15584j145344k72384J089536p79264n48864J138176N82656
$$ plain form
3814 3155456 2425856 1931776 2105856 3362816 3069952 1719296 2463744 1771008 2361344
3805 2361344 2802688 2629632 2293760 2371072 1526272 1958400 3027456 2501120 2099712 2078208
3795 2078208 2552832 2792960 673280 821760 3157504 1729024 2466304 1857024 2664448
3786 2664448 2284032 2207232 2542080 2995712 2582528 1672192 2276352 2381824 1417728 1990656
3776 1990656 1920000 3120640 2427392 565760 3054592 1796608 2201088 1006080 1976320
3767 1976320 2409984 2384384 2775552 1337344 2399744 1845248 2417664 1943552 2658304
3758 2658304 1405440 1717248 1886720 1385984 2187264 1605632 3480064 2074112 1495552
3749 1495552 1165824 2088960 2311680 2263552 1564160 1708544 2956288 2403840 2532352 1090048
$$ packed form
3814C155456p29600m94080J74080J256960k92864j350656P44448o92736N90336
3805B361344M41344j73056l35872P7312q44800M32128J069056n26336m01408k1504
3795B078208M74624K40128F73280J48480K335744j428480P37280o09280Q07424
3786B664448l80416p6800L34848M53632m13184r10336O04160J05472r64096N72928
3776A990656p0656J200640o93248E65760K488832j257984M04480A006080R70240
3767A976320M33664k5600L91168A337344J062400n54496N72416m74112P14752
3758B658304j252864L11808J69472n00736Q01280n81632J874432j405952n78560
3749A495552l29728R23136K22720m8128o99392J44384J247744n52448J28512A090048
$$ plain form
3738 1316864 1440768 2148864 1777152 2114048 2315776 1974272 2303488 1707008 3065344
3729 3065344 2030592 1881600 1540096 1903104 2178560 2416128 1385984 2207744 1667584
3720 1667584 2512896 1489408 2098688 1422848 1670144 2189312 2443264 2478080 2378240 1202176
3710 1202176 2199552 1922560 2076672 1461760 2534912 2234880 2274304 2186240 2198016 1379328
3700 1379328 1892864 3083264 1659904 1895936 1630208 2484736 1500672 2293248 1810944
3691 1810944 947200 2506752 1305088 2567168 2384896 2167808 2412032 2481152 2233856
3682 2233856 1403904 1742336 1708544 2742784 2317824 821760 2982912 2239488 2253824 1620992
3672 1620992 2537472 2440192 2763776 1466368 2404352 3140608 1872384 2534912 2055680
$$ packed form
3738A316864J23904P08096l71712L36896K01728l41504L29216n96480J358336
3729C065344j034752j48992l41504L63008K75456K37568j030144Q21760n40160
3720A667584Q45312j023488O09280o75840K47296N19168K53952L4816r9840j176064
3710A202176R97376k76992J54112o14912J073152l00032L9424q8064J1776q18688
3700A379328N13536J190400j423360K36032k65728Q54528r84064P92576m82304
3691A810944q63744J559552j201664J262080j82272k17088K44224O9120k47296
3682B233856q29952L38432l3792J034240m24960H21760K161152p43424J4336o32832
3672A620992R16480r7280L23584j297408R37984P36256j268224O62528m79232
$$ plain form
3663 2055680 1859584 1995776 2194944 2551808 2960896 2563072 2373120 3180544 3562496 3217920
3653 3217920 4268544 4143104 5425152 4590080 4042752 4322816 4530176 4783616 5227008
3644 5227008 4803584 5757440 4880896 5416960 5681664 5787648 6726144 5824512 5728768 6125568
3634 6125568 6615040 6623232 7691776 6579200 7432192 7720960 7957504 8602624 8866304 11029504
3624 11029504 9876480 10373632 10806784 11200512 10688512 11504640 12600832 11692544 13609984
3615 13609984 13911552 14258176 15097856 15742976 16274944 16625664 15703040 15105024 16241152
3606 16241152 18334720 18180096 18702336 19552768 18530816 19686400 21438976 21068288 23238144
3597 23238144 25063936 25062400 28609024 30508032 30826496 29045760 26489344 21869056 18215424
$$ packed form
3663B055680j96096J36192J99168L56864M09088l97824j89952Q07424L81952l44576
3653C217920J050624j25440J282048q35072n47328K80064K07360K53440M43392
3644E227008m23424R53856q76544N36064K64704J05984R38496r01632r5744L96800
3634F125568M89472Q192J068544j112576Q52992K88768K36544O45120K63680K163200
3624A1029504j153024M97152M33152L93728n12000Q16128J096192r08288J917440
3615A3609984L01568L46624Q39680O45120N31968L50720r22624n98016J136128
3606A6241152K093568j54624N22240Q50432j021952J155584J752576l70688K169856
3597B3238144J825792j536L546624J899008L18464j780736k556416m620288l653632
$$ plain form
3588 18215424 15307776 13194240 10681344 9800192 8954880 7884288 9044480 8432128 7783424
3579 7783424 8759296 7153152 7254528 6696960 7356928 6575616 7519232 6216192 7788544
3570 7788544 6337024 5303808 6214144 6450176 6594048 6242816 6617600 6325248 7529472
3561 7529472 6979584 6628864 7022080 6475264 5000704 6733312 5557760 4757504 5414912
3552 5414912 4805120 5106688 3852800 3997184 3235328 4137984 2639872 5355520 3598336
3543 3598336 3099136 4802560 3517440 5009920 4595200 4227072 3907584 4238848 5149184
3534 5149184 4579840 3367424 4363776 3722752 2694144 4465664 4224512 3532288 4182016
3525 4182016 3746816 3729408 3747328 4111872 4207104 3072000 3248128 3965440 3964928 4310528
$$ packed form
3588A8215424k907648k113536k512896q81152q45312j070592J160192o12352o48704
3579G783424R75872j606144J01376n57568O59968p81312R43616j303040J572352
3570G788544j451520j033216R10336K36032J43872l51232L74784k92352J204224
3561G529472n49888l50720L93216n46816j474560J732608j175552q00256O57408
3552E414912o09792L01568j253888J44384p61856R02656j498112K715648j757184
3543C598336m99200J703424j285120J492480m14720l68128l19488L31264R10336
3534E149184n69344j212416R96352o41024j028608J771520k41152o92224O49728
3525D182016m35200j7408J7920L64544R5232j135104J76128P17312n12L45600
$$ plain form
3515 4310528 3203072 4829184 3810816 3183104 4403200 3891712 4737536 3692032 4717568
3506 4717568 4125184 4498432 4882944 3950080 4246016 3955712 3103744 4092928 3781632 2789888
3496 2789888 4847616 3326464 3238912 4488192 4224512 3440128 4146176 3609088 4341760
3487 4341760 3642880 4491264 4293120 3749376 3680256 4451328 5021184 3549696 3653120 4175872
3477 4175872 4397568 3981824 3942912 3992576 4612096 3572736 4064256 3586560 3819520 3893248
3467 3893248 4229632 4598784 4462592 4200960 4030976 4867584 4382720 4194816 5319168
3458 5319168 4842496 4745216 3973120 4981760 5205504 5309440 5618176 4385792 4717568
3449 4717568 4773888 4339200 4130304 3730944 4698112 4753408 5131264 5156864 5544448 5362688
$$ packed form
3515D310528j107456J626112j018368o27712J220096n11488Q45824j045504J025536
3506D717568n92384L73248L84512r32864K95936k90304q51968R89184l11296r91744
3496B789888K057728j521152q7552J249280k63680p84384P06048n37088P32672
3487D341760o98880Q48384j98144n43744o9120P71072N69856j471488J03424N22752
3477D175872K21696m15744l8912M9664O19520j039360M91520m77696K32960P3728
3467C893248L36384L69152j36192k61632j69984Q36608m84864j87904J124352
3458E319168m76672r7280p72096J008640K23744J03936L08736j232384L31776
3449D717568N6320m34688k08896l99360R67168N5296L77856K5600L87584j81760
$$ plain form
3439 5362688 5882368 5671424 6329344 6002176 4931072 5173248 5240320 4244480 4748288 5825024
3429 5825024 5251584 6194688 6327296 5721088 5567488 5763072 5451264 5307904 5563392 5104640
3419 5104640 5698048 3969024 4315136 3979776 4743680 3755008 4539904 3758592 3481088
3410 3481088 3832832 3845632 5252608 5751808 7216640 9044992 10045440 9664512 10329600
3401 10329600 9535488 9052672 10610176 10302976 9710080 9703936 10925056 10613248 11831808
3392 11831808 10951168 11499008 12186112 12449280 12179456 13787648 12998144 14098432 14876672
3383 14876672 16567808 15408128 15041536 16673280 15953920 16225280 17699328 17430016 18808320
3374 18808320 19581952 21242368 20595712 22628864 22554624 23947264 25401856 26926080 26590720
$$ packed form
3439E362688N19680k10944O57920l27168j071104K42176O7072r95840N03808J076736
3429E825024n73440R43104J32608o06208j53600J95584l11808j43360K55488m58752
3419E104640N93408j729024L46112l35360P63904r88672P84896p81312k77504
3410C481088L51744J2800J406976M99200J464832J828352J000448l80928O65088
3401A0329600p94112m82816J557504l07200n92896o144J221120l11808J218560
3392A1831808q80640N47840O87104K63168k69824J608192p89504J100288P78240
3383A4876672J691136j159680l66592J631744p19360K71360J474048k69312J378304
3374A8808320P73632J660416o46656K033152p4240J392640J454592J524224l35360
$$ plain form
3365 26590720 29169664 31010304 35419648 35300352 38972416 43397120 48123392 52760576
3357 52760576 58808832 66979840 73647616 79806976 84837376 92468224 99976192 106736128
3349 106736128 115240448 125138432 134221824 144309760 157715968 173416448 190817792
3342 190817792 211161088 238253568 270957568 314890240 372496896 452675072 564636160
3335 564636160 712134656 888944128 1049406464 1131526656 1074589696 900688384 703663616
3328 703663616 536720384 408978944 317968384 251701248 203267072 170413568 144040448
3321 144040448 126024192 110572032 98557440 88514048 80199680 74247168 67880448
3314 67880448 62997504 59366400 55241216 51847168 49647616 46843904 44400640 42463232
$$ packed form
3365B6590720K578944J840640M409344j19296L672064M424704M726272M637184
3357E2760576O048256Q171008O667776O159360N030400P630848P507968O759936
3349A06736128Q504320R897984R083392J0087936J3406208J5700480J7401344
3342A90817792K0343296K7092480L2704000M3932672N7606656Q0178176J11961088
3335E64636160J47498496J76809472J60462336Q2120192n6936960j73901312j97024768
3328G03663616j66943232j27741440r1010560o6267136m8434176l2853504k6373120
3321A44040448j8016256j5452160j2014592j0043392q314368n952512o366720
3314F7880448m882944l631104m125184l394048k199552k803712k443264j937408
$$ plain form
3306 42463232 40652288 40395264 38045696 37140992 35640832 33961472 32980480 32525312 31909376
3297 31909376 30670848 29626880 29009408 26727936 25946112 24867840 24596480 23738880 22360064
3288 22360064 23065600 21692928 21074432 20166144 19995136 19978240 18844672 18397184 16223232
3279 16223232 17272832 17140736 17600512 17396736 16345600 16640000 14911488 14984704 15593984
3270 15593984 14854144 15137280 14070272 13558272 14519296 13390336 13652480 12421120 13513728
3261 13513728 12680704 12824576 12755456 13094400 14649856 14635008 15524864 14431744 14338048 13549056
3251 13549056 12359680 13879808 13451776 12324352 11941376 11227648 11760128 10872832 10665472
3242 10665472 9407488 10222592 9895936 9548800 10274304 10016256 10034688 8403968 8446464
$$ packed form
3306D2463232j810944k57024k349568r04704j500160j679360r80992m55168o15936
3297C1909376j238528j043968o17472k281472p81824j078272k71360q57600j378816
3288B2360064P05536j372672o18496r08288j71008j6896j133568m47488k173952
3279A6223232J049600j32096M59776k03776j051136K94400j728512P3216O09280
3270A5593984p39840K83136j067008n12000R61024j128960K62144j231360J092608
3261A3513728q33024J43872o9120L38944J555456j4848Q89856j093120r3696p88992
3251A3549056j189376J520128m28032j127424l82976p13728N32480q87296k07360
3242A0665472j257984Q15104l26656l47136P25504k58048J8432j630720M2496
$$ plain form
3233 8446464 9679360 8605184 8111616 8195584 10089472 8395264 8465408 8376832 7564288
3224 7564288 8272896 7599616 8301568 8661504 8139776 7974400 9577984 8713728 8635392 7735296
3214 7735296 7581184 8353280 6737408 6719488 6384128 5602816 6962688 7054336 6574080 6123008
3204 6123008 7131648 6758912 5452288 6731776 5848064 7022592 6479360 6709248 6027264
3195 6027264 6835200 6128640 6147072 7208448 6372352 6225408 5491200 6313472 6000640 7697920
3185 7697920 5562368 7610880 5966336 6275584 6735872 6467584 7536640 6177792 6881792
3176 6881792 7594496 8200704 7074816 7073792 5928960 5171712 5894656 6075392 6467584 5001728
3166 5001728 5832192 6615040 5871104 5751808 5118464 6373376 5300736 5488640 5652992
$$ packed form
3233H446464J232896j074176m93568Q3968J893888j694208P0144q8576q12544
3224G564288P08608o73280P01952L59936n21728j65376J603584q64256p8336r00096
3214G735296j54112P72096j615872j7920l35360p81312J359872R1648m80256m51072
3204F123008J008640l72736j306624J279488q83712J174528n43232K29888o81984
3195F027264Q07936p06560J8432J061376q36096j46944p34208Q22272l12832J697280
3185G697920k135552K048512j644544L09248M60288k68288J069056j358848P04000
3176F881792P12704O06208j125888j024j144832p57248P22944J80736L92192j465856
3166E001728Q30464P82848p43936j19296o33344J254912j072640J87904J64352
$$ plain form
3157 5652992 5496320 5564928 5216256 6302208 5787648 6296064 6671872 7443968 6875648 6844416
3147 6844416 6826496 7910400 9210880 8987136 11016704 10381824 11086336 11811328 12051968
3138 12051968 10190336 10227712 10732032 9796608 9708544 11018240 9653248 9842688 10769920
3129 10769920 10084352 10860544 10394624 10053632 9643520 9872896 11714048 11409920 10872832
3120 10872832 10287616 10732544 11450368 10376192 11670528 11662336 12171776 12603392 12765696
3111 12765696 12523520 12165632 13440000 11616256 12968448 12642304 13805056 14908928 14051840
3102 14051840 13779456 14441472 14605824 15604736 16367104 16514560 16784896 18099712 17128448
3093 17128448 19057664 21293568 19575296 19930112 20080128 22123008 21809664 22777344 20933120
$$ packed form
3157E652992j56672O8608l48672J085952n14560N08416L75808P72096n68320l1232
3147F844416j7920J083904J300480k23744K029568o34880P04512P24992K40640
3138A2051968j861632L7376N04320r35424q8064J309696j364992J89440R27232
3129A0769920o85568P76192m65920l40992m10112K29376J841152l04128n37088
3120A0872832n85216M44928P17824j074176J294336q192N09440M31616J62304
3111A2765696k42176l57888J274368j823744J352192l26144J162752J103872q57088
3102A4051840k72384O62016J64352R98912P62368J47456K70336J314816r71264
3093A7128448J929216K235904j718272L54816J50016K042880l13344R67680j844224
$$ plain form
3084 20933120 23923200 24344576 23883264 24900096 26113536 26102272 26173952 26469888 27812864
3075 27812864 30173696 30437376 31888896 32840704 33131008 33369600 32353280 29397504 26116608
3066 26116608 23392256 19628544 19046400 17624576 15784960 13751296 13662720 13766656 13471232
3057 13471232 12857856 11568640 12102656 11528704 11648000 10971136 11238400 10429440 9980416
3048 9980416 9275904 8935424 9277440 7900160 8095744 7443968 6929920 7647232 7073280
3039 7073280 6733824 6066176 6467584 6436864 6685184 6047744 5401088 5080576 6979072 4668416
3029 4668416 5609472 6413824 5053440 5888512 6287872 5848064 5781504 5097472 5794304 4696064
3019 4696064 5236224 5697024 5487616 5242880 4838400 5848576 5308416 5428224 6194176
$$ packed form
3084B0933120K990080M21376m61312J016832J213440j1264P1680K95936J342976
3075B7812864K360832K63680J451520R51808K90304K38592j016320k955776l280896
3066B6116608k724352l763712n82144j421824j839616k033664q8576J03936k95424
3057A3471232o13376j289216N34016n73952J19296o76864K67264q08960m49024
3048I980416p04512l40480L42016j377280J95584o51776n14048P17312n73952
3039G073280l39456o67648M01408l0720K48320o37440o46656l20512J898496k310656
3029D668416R41056Q04352j360384Q35072L99360m39808o6560o84032O96832j098240
3019D696064N40160M60800k09408k44736m04480J010176n40160J19808P65952
$$ plain form
3010 6194176 5705728 6321152 6338560 6455808 6045696 7003648 6922240 7847936 7930368 7779840
3000 7779840 6769152 6446592 6626816 6356992 7120896 6155776 6577152 6765568 6631424
2991 6631424 5929472 6062080 7133696 6708224 4823040 5551616 7094784 5869056 5919744
2982 5919744 5211136 4958720 6479360 6315520 5212160 7418368 7216128 6602240 6453248
2973 6453248 6117376 6631424 5897728 6438400 6071808 6378496 4461056 6132224 4663296
2964 4663296 5190144 4822016 6033920 6662656 5203456 5229056 5166592 4208128 5583360
2955 5583360 5556224 5071360 5666304 5981696 4826112 5137408 4389376 4643328 4951040 4989952
2945 4989952 4413440 4213248 4921344 5427200 4227584 4017152 6023168 5120512 5423104
$$ packed form
3010F194176m88448O15424J7408J17248m10112R57952q1408R25696Q2432j50528
3000G779840j010688l22560J80224k69824P63904r65120M21376J88416j34144
2991F631424p01952J32608J071616m25472j885184P28576J543168j225728N0688
2982E919744p08608k52416J520640j63840j103360K206208k02240o13888j48992
2973F453248l35872N14048p33696N40672l66592L06688j917440J671168j468928
2964D663296N26848l68128J211904O28736j459200K5600o2464r58464J375232
2955E583360k7136m84864N94944L15392j155584L11296p48032K53952L07712L8912
2945D989952n76512k00192P08096N05856j199616k10432K006016r02656L02592
$$ plain form
2936 5423104 4409856 4801024 5928960 4229120 5749760 4802048 5764096 5522944 5687808
2927 5687808 5320704 6279168 7258112 7430144 7111168 8284672 7405568 8371200 10110464
2918 10110464 10582016 15182336 19606528 23308800 21554176 21593600 22137344 19425792 12727296
2909 12727296 10445312 9062912 8335872 6525952 6835712 5783040 5083136 5162496 4419584
2900 4419584 5261312 5268480 5649408 4654080 4608512 4855296 5180928 5615104 4843008 4335104
2890 4335104 3857408 4819456 4900864 4668416 4144640 5429760 5043200 5031424 4444160 5643776
2880 5643776 5201920 5569024 5752320 6042624 6347776 7436800 5449728 4803072 4259840
2871 4259840 4717056 5945856 4395520 6090240 6584320 5529088 5557760 5127168 5195776
$$ packed form
2936E423104j013248L91168J127936j699840J520640r47712R62048k41152J64864
2927E687808l67104R58464R78944J72032l18976J173504q79104R65632J739264
2918A0110464M71552M600320M424192L702272j754624L9424N43744k711552o698496
2909A2727296k281984j382400p27040j809920L09760j052672o99904P9360p42912
2900D419584Q41728P168L80928r95328m5568K46784L25632M34176p72096n07904
2890D335104m77696R62048Q1408k32448n23776J285120l86560j1776n87264J199616
2880E643776m41856L67104J83296K90304L05152J089024j987072o46656n43232
2871D259840M57216J228800j550336J694720M94080j055232K8672m30592O8608
$$ plain form
2862 5195776 5186048 5630464 5214208 5382656 4739584 5290496 5171200 5331456 5303296 5578752
2852 5578752 5961216 5644800 5573632 5173248 5045248 4870144 5404672 5447168 5632512 5655552
2842 5655552 5903872 5362176 4647424 6223872 5818368 5827584 6649344 5243904 5725184 5144064
2832 5144064 5511168 6529536 5373440 6803456 7032832 5703168 5588992 5593088 5139968
2823 5139968 6408192 6213632 6466560 6495232 7314944 6099968 6755328 6491136 7431168
2814 7431168 7526912 8042496 8524800 8666112 9482752 10688512 10521088 11073024 10442240 8795136
2804 8795136 8812032 7729664 7522816 7443968 6152704 5693952 5386752 5730816 6148608 5637632
2794 5637632 6678016 5187072 5446144 5936640 5679104 6098432 5122560 5423616 5727232
$$ packed form
2862E195776r728M44416m16256J68448o43072N50912j19296J60256k8160K75456
2852E578752L82464l16416p1168m00384j28000j75104N34528M2496J85344K3040
2842E655552K48320n41696p14752J576448m05504R216Q21760j405440M81280n81120
2832E144064L67104J018368j156096J430016K29376j329664j14176M096m53120
2823E139968J268224j94560K52928K8672Q19712j214976O55360k64192R40032
2814G431168R5744N15584M82304J41312Q16640J205760j67424N51936o30784j647104
2804H795136J6896j082368k06848p8848j291264m58752l07200L44064M17792n10976
2794E637632J040384j490944K59072M90496k57536M19328r75872L01056L03616
$$ plain form
2785 5727232 5723136 6011392 5009920 4793344 4834304 5177344 5212672 3994624 5455872 4314624
2775 4314624 4750848 4808704 4662272 5881856 3837952 4161536 4930048 4436480 4652544
2766 4652544 5265408 3082240 5002752 4986880 4765184 5375488 5015040 4481536 4928512
2757 4928512 5319168 4371968 3573760 5449728 4784640 5476864 4254720 4946944 4590592
2748 4590592 5997568 5052928 5315072 5220352 5426176 4811264 4842496 4866048 5030400 4059648
2738 4059648 4392448 3979264 4216832 3918848 4602880 4260864 4690432 4992512 5138432 5162496
2728 5162496 4122112 4439040 4429824 4094464 4451840 5162496 3877376 4699136 5174272 5629952
2718 5629952 4709376 5438976 5599232 3983360 4631040 4773888 5311488 4358144 5616640
$$ packed form
2785E727232m096K88256j001472k16576M0960L43040L5328j218048J461248j141248
2775D314624M36224N7856j46432J219584k043904L23584P68512m93568K16064
2766D652544O12864k183168J920512j5872k21696O10304l60448n33504M46976
2757D928512L90656r47200p98208J875968o65088O92224j222144O92224l56352
2748D590592J406976r44640K62144r4720K05824o14912L1232K3552J64352r70752
2738D059648L32800m13184K37568k97984O84032l42016M29568L02080J45920K4064
2728E162496j040384L16928r216l35360L57376P10656j285120Q21760M75136M55680
2718E629952r20576P29600J60256j615872O47680J42848N37600r53344J258496
$$ plain form
2709 5616640 5123072 5374976 6351872 5941760 5351424 6817792 7633408 7772672 7361024
2700 7361024 9986560 12894208 19300864 25342464 33320448 28943360 17774592 13147136
2692 13147136 8657920 6833152 6283264 5480448 5684736 5610496 5265408 3916288 4844032
2683 4844032 4761088 3819008 4269056 3681280 4366848 5110272 4372480 3585024 4007936 4692992
2673 4692992 4320256 4195328 3828224 3970560 4232192 3890176 4087296 4040704 3394048 3787776
2663 3787776 4175360 3916288 4237824 3980800 4369920 4409344 5722112 4767744 4858368 5194240
2653 5194240 4676608 3820544 3761664 3084800 3729920 3833344 2775040 2890240 4090880
2644 4090880 2690560 3196928 3182592 2959872 4093952 3426304 3348992 4474880 2782208
$$ packed form
2709E616640m93568K51904R76896m10112n90336J466368Q15616J39264m11648
2700G361024K625536K907648O406656O041600P977984m377088j1168768m627456
2692A3147136m489216j824768n49888q02816K04288p4240l45088j349120R27744
2683D844032q2944r42080M50048n87776O85568P43424p37792p87456M22912O85056
2673D692992l72736j24928l67104J42336K61632l42016J97120m6592o46656L93728
2663C787776L87584k59072L21536k57024L89120L9424J312768r54368R0624L35872
2653E194240n17632q56064n8880o76864O45120J03424j058304J15200J200640
2644D090880j400320N06368j4336k22720J134080o67648p7312J125888j692672
$$ plain form
2635 2782208 2366976 3607040 3481600 4233728 3292672 5210624 4303872 4690944 4293120
2626 4293120 4825600 5159936 5671936 5147648 4919296 6017024 5505536 6017024 6720000
2617 6720000 7116800 7082496 7398912 7396352 8158208 9469440 10572800 12893184 19542528
2608 19542528 27885568 35278336 44598272 37257216 27021312 20066304 15382016 13308416
2600 13308416 14057472 15928320 22576640 28133888 33818624 26463232 19511808 17326080
2592 17326080 15376384 15553536 20200960 28453888 35774976 45613568 35045376 23108096
2584 23108096 16497152 14552576 13535232 15571456 20632064 25081856 32168448 24349184
2576 24349184 16167936 12924416 10130944 10212352 11112448 12722176 15596544 18504704 14302720
$$ packed form
2635B782208m15232J240064j25440P52128r41056J917952r06752L87072l97824
2626D293120N32480L34336N12000n24288k28352J097728n11488N11488P02976
2617F720000L96800l4304L16416k560P61856J311232J103360K320384O649344
2608A9542528Q343040P392768R319936p341056j0235904o955008m684288k073600
2600A3308416P49056J870848O648320N557248N684736p355392o951424k185728
2592A7326080j949696J77152M647424Q252928P321088R838592j0568192j1937280
2584B3108096o610944j944576j017344K036224N060608M449792P086592p819264
2576B4349184q181248l243520k793472Q1408R00096J609728K874368K908160m201984
$$ plain form
2567 14302720 9995264 7370752 5853184 6722048 6537728 5825536 4684800 4989440 4753920
2558 4753920 4639232 4238848 4064768 5555712 4342272 4746752 5757440 5306880 6871040
2549 6871040 5843968 7182848 6534144 6915584 6754304 7202816 5933056 6337024 5808640
2540 5808640 6427136 6060544 6157312 5883392 5548032 4864512 5845504 4014592 5087232
2531 5087232 3823104 3609088 3080704 2984960 2876416 2568192 3452928 2648576 3674624
2522 3674624 2580992 4467200 3167232 2046976 2856448 3755520 2647040 2785792 2803712
2513 2803712 3707904 2400768 1468928 3930624 2843648 2892288 2979840 3494912 2902016
2504 2902016 3104768 2738688 3294208 3502080 3827200 2452480 3317248 2978816 3195904
$$ packed form
2567A4302720m307456k624512j517568Q68864j84320p12192j140736L04640k35520
2558D753920j14688m00384j74080J490944j213440M04480J010688m50560J564160
2549F871040j027072J338880o48704L81440j61280M48512j269760M03968n28384
2540E808640O18496l66592R6768k73920l35360o83520R80992j830912J072640
2531E087232j264128k14016n28384r5744j08544l08224Q84736q04352J026048
2522C674624j093632J886208j299968j120256Q09472Q99072j108480J38752J7920
2513B803712R04192j307136r31840K461696j086976M8640Q7552N15072n92896
2504B902016K02752l66080N55520K07872L25120j374720Q64768l38432K17088
$$ plain form
2495 3195904 2560512 3396096 3528704 2928640 3589632 3108352 2509312 2497024 2252288 3898368
2485 3898368 1788928 3637248 2629120 2871808 3341824 3001344 2570752 2285568 3342336
2476 3342336 2914304 2852352 2814464 3740160 2468864 2368000 2397696 3975168 2360832 2431488
2466 2431488 2434560 2436608 1993216 2900992 2497536 2557440 3109376 2819072 2947072 3188224
2456 3188224 2428928 3641856 2649600 2122240 2152960 3139072 2672128 2879488 2518528 2695680
2446 2695680 2070016 2230784 2873344 2907136 2930176 2522624 2803712 3064832 2796544 3137024
2436 3137024 1988096 2291712 2487296 1937408 2586112 2130432 3011072 3447296 1722880
2426 2351616 2762752 2954240 1740800 2598912 2734080 2775040 2212864 2799616 3416576 2723328
$$ packed form
2495C195904o35392Q35584J32608o00064O60992m81280n99040j2288k44736J646080
2485C898368A788928J848320j008128K42688M70016l40480m30592k85184J056768
2476C342336m28032o1952l7888R25696j271296j00864K9696J577472j614336P0656
2466B431488L072K048m43392R07776m03456N9904N51936k90304J28000K41152
2456C188224p59296J212928r92256n27360L0720R86112m66944K07360l60960J77152
2446B695680o25664J60768O42560L3792K3040m07552K81088K61120k68288L40480
2436C137024j148928L03616J95584n49888O48704m55680Q80640M36224A722880
2426B351616M11136J91488j213440Q58112J35168M0960n62176N86752O16960o93248
$$ plain form
2416 2723328 2975232 1836032 3452928 2003968 2583552 2347008 2729472 2544128 1073152
2406 3214336 2402304 2186240 2097664 2658304 2904064 2094080 2828800 3746816 2855424 4296704
2396 4296704 2741760 2856960 2491392 3128832 3022336 3420672 2043904 2647552 3030528
2387 3030528 3658240 1700864 3118592 3401728 3458560 2924544 3756032 2923008 4851200
2378 4851200 3293184 4134400 3859968 3961344 4071424 3959296 3439104 2741760 3144192
2369 3144192 3706880 4423680 4660224 4476416 4444672 3978240 4372992 3151872 4355072
2360 4355072 4903936 4622848 3910656 4059136 4403712 4449280 6114816 4027392 4339200
2351 4339200 5131264 4563968 5334528 4247040 4893184 4923392 4203520 4719104 4670464 5334528
$$ packed form
2416B723328K51904j139200J616896j448960N79584k36544L82464j85344A073152
2406C214336q12032k16064q8576N60640K45760q09984P34720R18016q91392J441280
2396D296704j554944J15200l65568O37440j06496L98336j376768O03648L82976
2387C030528O27712A700864J417728K83136N6832n34016Q31488q33024J928192
2378D851200j558016Q41216k74432J01376J10080j12128n20192o97344M02432
2369C144192N62688P16800K36544j83808l1744m66432L94752j221120J203200
2360D355072N48864k81088p12192J48480L44576M5568J665536k087424L11808
2351D339200P92064n67296P70560j087488O46144L0208p19872N15584m8640O64064
$$ plain form
2341 5334528 5642752 4217344 5652992 4969472 4333056 5851648 5909504 5562880 5575680
2332 5575680 5740544 5397504 5692416 5538304 6366720 4925952 5736960 5511680 5769216
2323 5769216 6423040 6349312 6595072 6672896 5224448 4592640 5577216 5040640 4432896 4935168
2313 4935168 4240896 3317248 3651072 3730944 4471296 4324352 3511296 4496384 4347392 4303872
2303 4303872 4802048 3188224 3349504 4507648 3593216 3731456 3989504 4945408 4386304
2294 4386304 4344832 4853248 5029376 4122624 4168192 3280896 4341760 3247104 3658752 5088768
2284 5088768 4663296 4274688 4220416 4127232 4133888 2702336 3090432 3167232 2958336 3232768
2274 3232768 3973632 3950080 2954752 3307008 3640832 3492352 3675648 3493888 2874368 3580416
$$ packed form
2341E334528L08224j425408J435648o83520o36416J518592N7856l46624J2800
2332E575680J64864l43040K94912j54112Q28416j440768Q11008k25280K57536
2323E769216O53824p3728K45760P7824j448448o31808R84576n36576o07744N02272
2313D935168o94272r23648L33824P9872P40352j46944q13056R85088j48992m3520
2303D303872M98176j613824J61280J158144r14432J38240K58048R55904n59104
2294D386304m1472N08416J76128r06752M5568q87296J060864j094656M11648J430016
2284E088768m25472l88608n4272r3184O656j431552L88096P6800k08896K74432
2274C232768P40864k3552r95328L52256L33824j48480J83296j81760o19520P06048
$$ plain form
2264 3580416 3191296 4012032 3354624 3377152 2312192 4241408 3571200 3172352 3182592 3698688
2254 3698688 4426752 4657152 4242432 2908672 3879936 3435520 4333056 4839424 4013568
2245 4013568 3591168 3107840 4324352 3826176 4337152 3092480 3821056 4078080 4251136
2236 4251136 3050496 3964928 3250688 3593728 4270592 4006400 2935808 4076544 3156480
2227 3156480 3075584 3727360 3467776 4377600 4190720 3346432 2955264 4325376 3778048 3082240
2217 3082240 3838464 4077056 3646976 5155328 4324352 5209088 4377088 3783168 4313600
2208 4313600 4336128 4089856 3821568 3528704 3215360 5130240 4636160 4781056 4616704 4006912
2198 4006912 3783680 5270528 4295680 4275200 4730368 4738048 4405760 3988480 3708416 4907520
$$ packed form
2264C580416l89120Q20736o57408K2528j064960J929216o70208l98848J0240N16096
2254C698688P28064K30400m14720j333760R71264m44416Q97536N06368q25856
2245D013568m22400m83328J216512m98176N10976j244672P28576K57024J73056
2236D251136j200640R14432p14240L43040O76864k64192j070592J140736r20064
2227C156480q0896O51776k59584R09824j86880q44288l91168J370112n47328o95808
2217C082240P56224K38592m30080J508352q30976Q84736q32000n93920N30432
2208D313600K2528k46272k68288k92864l13344J914880m94080J44896j64352o09792
2198D006912k23232J486848r74848k0480M55168P680l32288m17280k80064J199104
$$ plain form
2188 4907520 4018176 3554816 4759552 3870208 2490368 4794880 3499520 3779072 4395008
2179 4395008 3726336 3388416 3866112 4156928 4304384 4277760 4343296 3828736 4813312 5370368
2169 5370368 5180928 5096960 5235712 4336128 5804032 5602816 5449728 5298688 5185024 3707904
2159 3707904 5521920 5325824 4124160 4796928 4618240 4746752 5486080 6127616 5998592
2150 5998592 6142976 6591488 6151680 6311424 5737984 5844992 5790208 4920320 7279104 6006784
2140 6006784 6357504 5880832 6588928 6673920 6776320 6753280 7107584 7481856 7309312 7297536
2130 7297536 8722944 9017856 8767488 8741888 8471552 9426432 8815616 7824896 7555072 8448512
2120 8448512 7133696 6724096 7560192 8099840 8462848 8641024 8115200 7880192 8697344
$$ packed form
2188D907520q89344m63360J204736q89344j379840K304512j295360K79552O15936
2179D395008o68672l37920M77696K90816J47456k6624O5536n14560R84576N57056
2169E370368j89440q3968J38752q99584J467904k01216j53088j51040j13664j477120
2159C707904J814016j96096j201664O72768j78688J28512P39328O41536j29024
2150E998592J44384M48512m39808J59744n73440J07008n4784q69888K358784j272320
2140F006784L50720m76672P08096Q4992J02400k3040L54304L74272j72544j1776
2130G297536J425408K94912k50368k5600k70336R54880o10816r90720k69824Q93440
2120H448512j314816m09600Q36096N39648L63008J78176n25824k35008Q17152
$$ plain form
2111 8697344 8308736 8490496 8521216 8600064 8720896 8085504 7668736 7597568 8347136 7712768
2101 7712768 7650304 8109056 8001024 8908288 6857728 6802432 7384064 7453696 7421952 7340544
2091 7340544 6600704 6736896 7799808 7504896 8385536 6476800 6742528 7285248 6417920
2082 6417920 7836672 6959104 7300608 6613504 6733824 6362624 7923200 7608832 7407104
2073 7407104 6806016 7529984 7697408 6701568 6448640 7169024 7505920 5877760 7360512
2064 7360512 7615488 7241728 6812160 5471232 5405696 5963776 5554688 6095360 5059072
2055 5059072 5953024 5210112 4928512 5143552 4705280 5835776 6659072 5345792 5556736
2046 5556736 6492672 6361088 6868992 5771776 5550080 6799872 6232576 6387712 6616064
$$ packed form
2111H697344l88608J81760L0720P8848J20832o35392m16768p1168P49568o34368
2101G712768o2464M58752j08032R07264k050560n5296N81632O9632l1744q1408
2091G340544p39840J36192J062912k94912Q80640j908736K65728N42720q67328
2082F417920J418752q77568L41504o87104J20320l71200J560576l14368k01728
2073G407104o01088P23968J67424r95840k52928P20384L36896j628160J482752
2064G360512K54976l73760m29568j340928o5536N58080m09088N40672j036288
2055E059072Q93952p42912k81600K15040m38272J130496Q23296j313280K10944
2046E556736R35936j31584N07904j097216k21696J249792n67296J55136K28352
$$ plain form
2037 6616064 7074816 6495232 6735872 7911424 6881792 7092224 6724608 5408256 6922240
2028 6922240 6309376 6686208 6810112 6731776 6536192 6355456 7660032 6505472 8117760
2019 8117760 6856704 7145984 5687808 7004672 6519296 6888960 6541312 7442432 7619584
2010 7619584 8117760 7857152 7715840 7463936 7151104 8083456 8221184 8242688 8239104 8922112
2000 8922112 9049088 8508416 8299008 8880128 9220608 8574464 8914432 9469952 10631168
1991 10631168 9444864 9253376 9644544 9052160 10595840 8739840 9943552 9533440 9712128
1982 9712128 9515520 9219584 9111552 9843200 9801728 10172928 10378752 9204224 8869888 8991232
1972 8991232 9741824 9922048 10017792 9267200 9544192 9708032 9622016 9210880 10027520 8516608
$$ packed form
2037F616064M58752n79584K40640J175552j029632K10432l67616j316352J513984
2028F922240o12864L76832J23904p8336j95584j80736J304576j154560J612288
2019H117760j261056K89280j458176J316864m85376L69664l47648R01120J77152
2010G619584M98176k60608j41312k51904l12832R32352J37728K1504l584O83008
2000H922112J26976n40672k09408N81120L40480o46144L39968N55520J161216
1991A0631168j186304j91488L91168n92384J543680j856000J203712m10112J78688
1982I712128j96608k95936j08032P31648m1472L71200K05824j174528l34336J21344
1972H991232P50592J80224R5744p50592K76992J63840q6016m11136Q16640j510912
$$ plain form
1962 8516608 10130944 9821184 10319872 9700352 10207744 10228224 11060224 10443264 9608704 11112448
1952 11112448 10518528 10285568 10156544 9564160 10702336 11011072 10775040 10256896 10479104
1943 10479104 10287104 9716736 9149440 10158592 9506816 8821760 10568192 9906688 11022848
1934 11022848 12048384 16186368 20173824 24643072 29966336 23527424 14963200 12128256
1926 12128256 10823680 9805312 9983488 8754688 9081344 8272896 8640000 8539136 7523328
1917 7523328 8343040 7533568 8219648 7853056 8299520 8353792 7607808 8061952 7287808 8107008
1907 8107008 7198720 6888960 7486464 8305664 7398400 7309824 7469056 7001600 6350336 7333376
1897 7333376 6384128 6974464 8113152 6903808 7264768 7200768 8115712 7069184 7303680
$$ packed form
1962H516608J614336l09760M98688o19520N07392K0480Q32000o16960q34560J503744
1952A1112448n93920k32960j29024n92384J138176L08736k36032n18144K22208
1943A0479104j92000n70368n67296J009152o51776o85056J746432o61504J116160
1934A1022848J025536M137984L987456M469248N323264o438912q564224k834944
1926A2128256j304576j018368J78176j228800L26656q08448L67104j00864j015808
1917G523328Q19712q09472O86080l66592M46464N4272p45984M54144p74144Q19200
1907H107008r08288l09760N97504Q19200r07264q8576J59232m67456o51264R83040
1897G333376r49248N90336J138688j209344L60960o4000R14944j046528K34496
$$ plain form
1888 7303680 6691840 7536640 8327168 7168000 7287808 7516160 6960128 6342656 6895616
1879 6895616 6120960 6714880 7153664 6604288 6942720 6336512 6212608 7640576 8202752
1870 8202752 7283712 7366656 7248896 7996928 9194496 7600640 8840192 7940608 7651328
1861 7651328 7603712 9295872 8355840 8039936 8653824 9370112 10253824 7998464 9104896
1852 9104896 9545728 9483776 8933888 8929280 8548352 9526272 8015872 8387584 8039936 7233536
1842 7233536 7765504 6480384 7934464 6821376 7323136 6569984 6217728 6292480 5882368
1833 5882368 7124992 7202816 6560768 5857792 6612992 7507456 7847424 7703040 8031232 7849472
1823 7849472 7433728 7891968 8193536 8210432 7870976 8999424 7279616 10028544 8333824
$$ packed form
1888G303680o11840Q44800P90528j159168J19808K28352n56032o17472N52960
1879F895616p74656N93920M38784n49376L38432o06208j23904J427968N62176
1870H202752r19040Q2944j17760P48032J197568j593856J239552q99584k89280
1861G651328m7616J692160r40032l15904O13888P16288Q83712k255360J106432
1852I104896M40832o1952n49888m608l80928R77920j510400L71712l47648q06400
1842G233536N31968j285120J454080j113088N01760p53152l52256P4752m10112
1833E882368J242624P7824o42048p02976P55200Q94464L39968j44384L28192j81760
1823G849472m15744M58240L01568J6896l39456J128448j719808K748928j694720
$$ plain form
1814 8333824 8513536 8480768 9331712 9728512 9739264 8771072 9149952 9880576 9809920 9651712
1804 9651712 8880128 8622080 9792000 9970176 8960000 10605568 10527232 10120704 9868800
1795 9868800 10776064 10741248 11429376 11835904 11880960 11096576 10789888 13049344 12198400 12039680
1785 12039680 12194816 11791872 12175360 13194752 12803072 13854720 13620224 13531136 13312000
1776 13312000 14259200 13806080 13018624 13961216 13056000 14316544 14378496 14141952 13560320
1767 13560320 13593088 14386688 12569600 12172800 13275136 13005312 13246976 12961280 13020672
1758 13020672 13450752 12909056 12174336 12608000 13374976 12527616 12451328 12656640 12041728 12711936
1748 12711936 11686912 11704320 13286912 12339200 11638272 12078592 12340224 11965440 12299264
$$ packed form
1814H333824J79712l2768Q50944L96800J0752r68192L78880P30624p0656j58208
1804I651712p71584k58048J169920J78176j010176J645568p8336m06528k51904
1795I868800R07264l4816O88128M06528M5056p84384l06688K259456q50944j58720
1785A2039680J55136m02944L83488J019392l91680J051648k34496q9088k19136
1776A3312000R47200m53120p87456R42592r05216J260544O1952k36544n81632
1767A3560320L2768P93600j817088l96800J102336k69824K41664k85696N9392
1758A3020672M30080n41696p34720M33664P66976q47360p6288K05312o14912O70208
1748A2711936j025024J7408J582592r47712p00928M40320K61632l74784L33824
$$ plain form
1739 12299264 12588544 11827712 11589120 12097536 11722240 13041152 10948096 11169280 10898944
1730 10898944 12215808 10109440 10735104 10646016 11639296 11126784 10813952 9648128 10081792
1721 10081792 10322432 8664064 9463296 9812992 9819648 8997376 9286656 9912320 9010176 9922048
1711 9922048 8409088 8080896 8696320 8163840 8489984 8463360 8720384 8087040 7685120 8788480
1701 8788480 7323136 9251328 7669248 9656320 7925248 7638016 7591424 8258560 7836672
1692 7836672 7938048 7477248 6140928 8080384 7682560 7849472 7780352 7001600 8110080
1683 8110080 8097792 6560256 7803392 7567360 8724992 7415808 8854528 8275968 8628224
1674 8628224 8495104 7840768 8422912 9114112 8882688 8820224 9179648 9042944 9471488 8646656
$$ packed form
1739A2299264K89280p60832k38592N08416l75296J318912k093056K21184k70336
1730A0898944J316864k106368O25664q9088R93280n12512l12832j165824M33664
1721A0081792K40640j658368P99232L49696O656q22272K89280O25664r02144R11872
1711I922048j512960l28192O15424n32480L26144k6624K57024o33344m01920J103360
1701H788480j465344J928192j582080J987072j731072k87232m6592O67136m21888
1692G836672J01376m60800j336320J939456l97824J66912o9120p78752J108480
1683H110080j2288j537536J243136k36032J157632j309184J438720n78560L52256
1674H628224j33120o54336N82144O91200k31424o2464L59424j36704M28544q24832
$$ plain form
1664 8646656 9355776 9911808 9722880 9742848 9572864 10150400 10723328 9999360 11611648 10533376
1654 10533376 9917440 10254848 11684864 11690496 11277824 13131776 12904448 12250624 12892160
1645 12892160 12824064 13217280 13586944 15938048 15244288 14659072 15496704 15996928 16655872
1636 16655872 16105472 16488448 17602048 17628672 18987008 18595840 19687936 20734976 21471232
1627 21471232 21785088 23600640 24376832 25426432 26058752 28527616 29028352 31369728 32636928
1618 32636928 34239488 36086272 36853248 38259200 39119360 39499264 41027584 42063872 42444800
1609 42444800 43859968 45132288 47283712 48106496 49021952 50314240 53664256 54313984 57146880
1600 57146880 60136960 63905792 67334656 70422016 75213824 82271232 88591872 96238592
$$ packed form
1664H646656P09120N56032j88928J9968j69984N77536N72928p23968J612288j078272
1654A0533376o15936L37408J430016N632m12672J853952k27328o53824O41536
1645A2892160o8096L93216L69664K351104o93760n85216Q37632N00224O58944
1636A6655872n50400L82976J113600K6624J358336l91168J092096J047040P36256
1627B1471232L13856J815552P76192J049600O32320K468864N00736K341376J267200
1618C2636928J602560J846784P66976J405952Q60160L79904J528320J036288L80928
1609D2444800J415168J272320K151424Q22784R15456J292288L350016O49728K832896
1600E7146880K990080L768832L428864L087360M791808P057408O320640P646720
$$ plain form
1592 96238592 106112000 116847616 126275584 131714560 134595584 130314240 123020800 112956928
1584 112956928 100409344 87969280 74719232 62387200 53417984 46036992 40045056
1577 40045056 34439168 31566848 28486656 26021888 24274432 23368704 23121920 21405696
1569 21405696 19862528 20113408 18749440 17527808 17785344 16925184 16607232 15903744 14490624
1560 14490624 14588416 14636032 14496768 15182336 13792768 13316608 12509696 13136896 13379584 11799040
1550 11799040 12465152 12316160 12203520 11968000 11296256 10785792 9435136 11466240 8911360
1541 8911360 10276864 10312704 10130432 9198592 9555968 9554432 8977408 9236992 8507904 9164800
1531 9164800 7947264 8942080 9090560 8031744 8286208 9281536 8260096 8616960 7759872
$$ packed form
1592I6238592R873408J0735616R427968N438976K881024m281344p293440j0063872
1584A12956928j2547584j2440064j3250048j2332032q969216p380992n991936
1577D0045056n605888k872320l080192k464768j747456r05728k46784j716224
1569B1405696j543168K50880j363968j221632K57536q60160l17952p03488j413120
1560A4490624R7792M7616j39264O85568j389568m76160q06912O27200K42688j580544
1550A1799040O66112j48992j12640k35520o71744n10464j350656K031104k554880
1541H911360J365504L5840j82272r31840L57376j536n77024K59584p29088O56896
1531I164800j217536R94816J48480j058816K54464R95328j021440L56864q57088
$$ plain form
1522 7759872 7236608 6907904 7670784 7964672 6876160 7030784 7164416 7143936 6970880 6520832
1512 6520832 6888448 6562816 7458304 7345664 6568960 6716416 6168064 6346752 7191552 5996032
1502 5996032 6055424 6276096 5648384 6167552 6405120 6385152 6073344 6321152 6039040 4733440
1492 4733440 7213568 5014016 5912064 6330368 5103104 6270464 6472704 6592512 5931520
1483 5931520 6000640 5581824 5111808 7099904 5235712 6642688 6048768 6000640 5556736
1474 5556736 5662720 5985280 6083584 4945920 4655616 4738560 5080064 5396480 5935104 5803008
1464 5803008 6196736 6048768 5838848 5733888 6818816 7122944 6765568 6195200 7010816
1455 7010816 6888448 7398912 7883776 8001536 7603712 8652800 7089664 7629312 8947712
$$ packed form
1522G759872n23264l28704P62880K93888j088512J54624J33632k0480j73056m50048
1512F520832L67616l25632Q95488j12640p76704J47456n48352J78688Q44800j195520
1502E996032N9392K20672o27712N19168K37568j9968l11808K47808k82112j305600
1492D733440K480128k199552Q98048M18304j227264J167360K02240J19808o60992
1483E931520O9120m18816m70016J988096j864192J406976n93920m8128m43904
1474E556736J05984L22560R8304j137664k90304Q2944L41504L16416N38624j32096
1464E803008L93728j47968k09920j04960J084928L04128l57376n70368Q15616
1455G010816j22368N10464M84864J17760l97824J049088j563136N39648J318400
$$ plain form
1446 8947712 8576000 8965120 9507328 8843776 10475520 10685952 10789888 11608576 13136384
1437 13136384 13426176 13422592 13487616 12641792 12075008 11933184 11340288 10754560 11856896 10929664
1427 10929664 10791424 10956800 10288640 11340800 11217408 11115520 11913728 10736640 10974720
1418 10974720 10940928 10482688 10394624 10808320 10891776 9585152 11170304 10905600 11122688 9961472
1408 9961472 10300416 11315200 11470848 12032000 12111360 12602368 14242816 14463488 15859712
1399 15859712 16342528 16847360 16876544 17022976 17514496 16381952 15880192 13080064 12476416
1390 12476416 12710912 11884544 12069888 9942528 10807808 9766912 9978880 12030464 9971712
1381 9971712 10107392 10214400 11680256 9704448 11106816 10946560 10339328 11551232 11115008
$$ packed form
1446H947712l71712L89120N42208o63552J631744K10432J03936Q18688J527808
1437A3136384K89792l584O5024q45824n66784j41824n92896n85728J102336r27232
1427A0929664j38240J65376o68160J052160j23392j01888P98208j177088K38080
1418A0974720l3792m58240q8064M13696Q3456j306624J585152k64704K17088j161216
1408I961472L38944J014784J55648N61152P9360M91008J640448K20672J396224
1399A5859712M82816N04832K9184J46432M91520j132544n01760k800128o03648
1390A2476416K34496q26368J85344k127360Q65280j040896K11968K051584k058752
1381I971712J35680J07008J465856j975808J402368j60256o07232J211904m36224
$$ plain form
1372 11115008 13060608 13795840 14278656 14690304 15832064 14488064 13726208 14066688 13052416
1363 13052416 12577792 12111360 11133952 10632704 9086464 10572288 10192896 9816576 9747968
1354 9747968 10180608 8817664 7470080 7876608 8685056 8498176 7868416 7257600 8178176
1345 8178176 7702016 8270848 8975872 7759360 8596480 8498688 6870016 7574528 7585280 7126528
1335 7126528 7526912 8000000 7435776 7465472 8288256 7219712 6309888 7645184 6736384
1326 6736384 6504960 6529536 6144512 6464512 5712896 5905408 5029888 4647936 4784128 4017152
1316 4017152 5147136 4273152 4196864 4343296 3139072 4105216 3588608 3780608 4066816
1307 4066816 3031552 3557888 4371456 2381824 3641856 4606976 3770368 4194304 3512320
$$ packed form
1372A1115008J945600P35232M82816M11648J141760j344000p61856L40480j014272
1363A3052416m74624m66432r77408n01248j546240J485824l79392l76320o8608
1354I747968M32640j362944j347584M06528Q08448j86880o29760o10816R20576
1345H178176m76160N68832P05024j216512Q37120r7792j628672P04512J0752m58752
1335G126528M00384M73088n64224K9696Q22784j068544r09824J335296r08800
1326F736384k31424K4576l85024L20000p51616J92512q75520l81952J36192p66976
1316D017152J129984q73984p6288J46432j204224R66144n16608J92000K86208
1307D066816j035264N26336Q13568j989632J260032R65120q36608M23936o81984
$$ plain form
1298 3512320 3037184 3132928 3243008 1916416 3322880 2601472 2617344 2091008 3682816
1289 3682816 2744320 2426368 3012608 2256896 3648000 3484160 3529728 3132416 2429440 1613312
1279 1613312 2315264 3146752 1870848 2978304 2555904 3189248 2487296 2478080 2095104 3027456
1269 3027456 1936896 1605632 3567104 2344960 2483200 2663936 2686976 2341376 1383936
1260 1383936 2499072 1964032 2300928 2821632 1828352 3289088 3955712 2001920 2604544
1251 2604544 2604544 2476544 1398272 2861568 1968640 2283520 2203136 3065344 2628608 2299392
1241 2299392 2758656 2578944 2331136 1515520 2054144 2373120 2244096 2651136 1534464
1232 1534464 2662912 3309056 2188800 1892352 1346048 1280512 2227712 3321856 2429952
$$ packed form
1298C512320m75136R5744J10080j326592J406464p21408J5872n26336J591808
1289C682816r38496l17952N86240p55712J391104j63840M5568l97312p02976q16128
1279A613312P01952Q31488j275904J107456m22400O33344p01952r216l82976R32352
1269C027456j090560l31264J961472j222144J38240J80736K3040l45600r57440
1260A383936J115136n35040L36896N20704r93280J460736O66624j953792O02624
1251B604544%j28000j078272J463296q92928L14880q0384Q62208m36736l29216
1241B299392M59264j79712k47808q15616N38624L18976j29024M07040j116672
1232A534464J128448O46144j120256k96448n46304o5536R47200J094144q91904
$$ plain form
1223 2429952 3866112 2182144 2355200 3176960 3296256 2130432 2877440 3184128 2270720
1214 2270720 1874944 2794496 3136512 2826752 2888704 2982912 2086400 2572288 1860608 2089984
1204 2089984 1758720 2064896 2555392 2443776 1757696 2430976 3335168 2590720 1943040 1832960
1194 1832960 2386944 1750528 1812992 1680384 1945600 1996288 2405888 3015168 1664512 1681920
1184 1681920 2549760 1828864 1278464 1647616 1830912 2006528 1901056 437760 2740736
1175 2740736 2647040 2118144 631296 2165760 2171392 2373120 2527744 1334784 1908224 1106944
1165 1106944 1093120 1814016 1330176 1760768 1185280 1484288 539136 2561536 1881600 2735616
1155 2735616 1596416 2357248 2067456 2425344 2045952 1760256 1637888 1779712 1944576
$$ packed form
1223B429952J436160j683968J73056Q21760J19296j165824P47008L06688r13408
1214B270720l95776R19552L42016l09760O1952R4208q96512M85888p11680K29376
1204B089984l31264L06176M90496j11616o86080O73280R04192p44448o47680j10080
1194A832960N53984o36416O2464j32608K65216N0688M09600O09280j350656J7408
1184A681920Q67840p20896n50400L69152J83296J75616j05472D37760K302976
1175B740736r3696n28896F31296J534464N632K01728J54624j192960N73440q01280
1165A106944j3824P20896m83840M30592n75488K99008E39136K022400o79936Q54016
1155B735616j139200P60832k89792L57888l79392k85696j22368J41824J64864
$$ plain form
1146 1944576 1824768 2053120 2967040 2439680 1654784 2072576 2632192 1216512 1539584
1137 1539584 2482688 2273280 1509888 1688064 2127360 1565184 2955776 1233408 2310144
1128 2310144 1933312 672256 818688 1822208 1345024 1482240 1233408 2287616 3302400
1119 3302400 2463744 1757696 1572864 1593344 1598976 2010112 2562048 2325504 1278976 1837568
1109 1837568 1431040 2010112 1874432 1615872 1113600 2344448 2004992 1654272 1780224
1100 1780224 1495040 1569280 781824 1441792 2296320 1814528 1623040 1317888 2304000 1214976
1090 1214976 2256896 2231296 1291776 1776640 2162176 605696 2101248 1990144 1293312
1081 1293312 1628672 2849280 1455104 1600000 2095104 696320 1365504 572416 1497088
$$ packed form
1146A944576j19808K28352R13920n27360p84896M17792N59616A216512L23072
1137A539584R43104k09408p63392J78176M39296n62176J390592A233408J076736
1128B310144l76832F72256J46432J003520m77184J37216k48832J054208J014784
1119C302400q38656p06048j84832K0480N632M11136N51936k36544j046528N58592
1109A837568m06528N79072j35680k58560n02272J230848l39456l50720J25952
1100A780224k85184P4240G81824O59968Q54528m81792j91488l05152R86112j089024
1090A214976J041920k5600r39520M84864L85536F05696J495552j11104o96832
1081A293312L35360J220608j394176J44896M95104F96320O69184E72416R24672
$$ plain form
1072 1497088 1777664 2447360 1513984 1633280 1922560 1668096 1966080 1032704 1693696 2456576
1062 2456576 2074624 1947648 2687488 2009088 1373184 1224192 1205248 1482240 1784320 932864
1052 932864 1545216 2062848 1537024 1541632 1387520 1137152 651264 1151488 1678336 751104
1041 1426944 1717760 814592 575488 768000 1040896 242176 268800 1654784 1144832 409088
1030 262144 528384 1683456 1199104 994304 1561600 868864 1401344 1356288 999936 340480
1019 1581056 1233408 1102336 1994240 2343936 1033728 591872 2552320 820224 1344512
1010 1344512 1582592 109568 1060352 262656 1991680 1146880 1463296 1277440 1055232
1001 1055232 598528 1906688 281088 428544 1011712 1189376 1542144 770560 728576 980480
$$ packed form
1072A497088K80576O69696r33376J19296K89280k54464K97984r33376O60992P62880
1062B456576l81952j26976P39840o78400o35904j48992j8944K76992L02080q51456
1052I32864O12352N17632n25824M608j54112k50368m85888N00224N26848G51104
1041A426944K90816H14592k39104J92512K72896B42176K6624J385984n09952D09088
1030B62144K66240J155072m84352k04800N67296o92736N32480m5056l56352C40480
1019A581056l47648j31072Q91904L49696A033728m41856J960448H20224N24288
1010A344512K38080A09568R50784B62656J729024q44800L16416j85856k22208
1001A055232m56704J308160B81088J47456N83168J77664L52768G70560m1984K51904
$$ plain form
991 980480 803328 250880 2089472 1673216 867840 694784 1252864 1648128 932864 2196480
981 2196480 2312704 2998784 1887232 2158592 3372544 2046464 3640320 4222976 2862080
972 2862080 4473344 6176256 5851136 4396544 5020672 3795968 5514240 4857856 5429248
963 5429248 5699072 6457856 6532608 7822848 10194944 11240960 13014528 22982144 42817024
954 42817024 61959680 96298496 65930240 33175040 22319104 14914048 11343360 9328128
946 9328128 6590464 5768192 5331456 4181504 4686336 5120000 3916800 3373056 2979840
937 2979840 4303360 4270080 5008896 5296128 4302336 3052032 2964480 3256832 2211840 3360256
927 3360256 1771008 1833984 1869312 2372608 2373632 1568256 2334720 2386432 2037248 2087936 2084864
$$ packed form
991I80480j77152B50880J838592m16256q05376j73056N58080L95264p15264J263616
981B196480J16224O86080j111552K71360J213952j326080J593856N82656j360896
972B862080J611264J702912l25120j454592O24128j224704J718272o56384N71392
963E429248K69824P58784P4752J290240K372096J046016J773568R967616J9834880
954D2817024J9142656L4338816l0368256l2755200j0855936p405056l570688k015232
946I328128k737664q22272m36736j149952N04832M33664j203200n43744l93216
937B979840J323520l3280P38816K87232r93792j250304q7552K92352j044992J148416
927C360256j589248O2976L5328N03296J024q05376P66464N1712l49184N0688l072
$$ plain form
916 2084864 2073600 985088 602624 1631232 1481728 1761280 1610240 1634816 1360896 1155584
906 1155584 1255424 1423360 2905600 539136 1532416 1490944 1416704 1090560 1463296 1588736
896 1588736 3200512 1555456 1751552 1035264 1350656 1632256 656896 1698304 1898496
887 1898496 1574912 1485312 1544704 1541120 1420288 1524736 1443328 946688 819712 1851904
877 1851904 1533440 883200 2102272 1819648 2343424 200704 502784 2298368 964608
867 1154048 922112 1821184 1456640 940544 999936 296448 942592 1841152 1588736 1346560
857 1346560 1508352 1031680 584192 304640 450048 813056 390144 1168384 1262592 792064
847 792064 132096 1899520 1822208 1652224 1656320 1265152 1547776 697856 1036800 862208
$$ packed form
916B084864j1264I85088l82464J028608j49504K79552j51040K4576k73920k05312
906A155584R9840J67936J482240E39136R93280m1472p4240l26144L72736J25440
896A588736J611776A555456J96096p16288L15392K81600F56896J041408K00192
887A898496l23584q9600N9392l584j20832J04448q1408m96640j26976J032192
877A851904l18464o50240J219072k82624N23776B00704L02080J795584I64608
867A154048k31936Q99072l64544n16096N9392B96448O46144Q98560k52416k42176
857A346560J61792m76672m47488k79552J45408L63008C90144P78240R4208m70528
847G92064A32096J767424p7312j69984M096l91168K82624F97856L38944j74592
$$ plain form
837 862208 835072 1135104 846336 2148352 1034752 893440 948736 758272 969728 667136
827 667136 1225728 1451520 1400320 632320 458752 1377280 768000 1097728 1097216 1629184 1525248
816 1525248 668160 1686528 843264 1422848 643072 585216 1075200 1467904 1123328 1147904
806 1147904 1652736 538624 891904 1590784 1489920 732672 390656 174080 33280 377344
796 377344 -894976 632832 551424 152064 1250816 117760 1361408 850432 25600 1862144
786 1862144 1463296 966656 805888 732160 494080 110080 745984 2465792 612352 980992
776 980992 412160 -431104 474624 518656 419328 1430016 1169920 -351232 1571328 223744
765 1434112 218112 76288 403456 1171456 1542656 1099776 687616 325632 799232 726528
$$ packed form
837H62208k7136L00032k88768J302016A034752j41312N5296j90464K11456l02592
827F67136N58592K25792n1200F32320j73568R18528o09280L29728n12N31968j03936
816A525248F68160J018368H43264N79584F43072n7856M89984L92704l44576K4576
806A147904N04832E38624L53280O98880j00864G32672l42016A74080C3280L44064
796C77344h94976F32832q1408A52064J098752A17760J243648n10976B5600J836544
786A862144l98848m96640j60768p3728k38080A10080O35904J719808F12352L68640
776I80992D12160d31104D74624M4032r9328J010688k60096c51232A571328B23744
765A434112B18112G6288L27168P68000L71200m42880m12160C25632M73600p2704
$$ plain form
755 726528 1288704 63488 -129536 680448 1494528 510464 1635840 -302080 1033216 1587200
745 1587200 357888 344576 809984 509440 1122304 -685056 462848 1335808 1047552 1515520
735 1515520 -50176 245248 286208 575488 774144 971264 1176064 1610752 1796096 -9216
724 2045952 1182208 1099776 1191936 995840 1469440 1905152 896000 2237440 1411072 155136
713 1042944 1462272 939520 1575936 1485312 2043392 1406976 1192960 1391104 1012224 2334208
703 2334208 598528 2072064 2328576 1411072 1342464 1627136 2284032 1455616 1974272 2620416
693 2620416 878080 1896448 2523136 2363392 1566720 231424 1544704 2145792 871936
683 709120 978944 -5632 1024512 111616 751616 979456 1284096 1352704 1306112 -181248
$$ packed form
755G26528N62176F3488a29536F80448Q14080E10464J125376c02080A033216N53984
745A587200C57888j3312M65408l00544O12864f85056D62848Q72960k88256M67968
735A515520e0176B45248M0960K89280J98656J97120K04800M34688J85344i216
724B045952q63744q2432R2160j96096M73600M35712H96000J341440q26368A55136
713A042944M19328n22752O36416r0624N58080o36416k14016J98144l78880J321984
703B334208E98528J473536K56512r17504o8608K84672O56896q28416N18656O46144
693B620416H78080J018368O26688j59744p96672B31424J313280O01088H71936
683G09120K69824e632A024512A11616O40000K27840L04640O8608m6592a81248
$$ plain form
672 1259520 249344 635904 32256 356864 400896 488960 510464 1531904 1122304 97280
661 156672 921600 951296 113152 1073152 268800 1591296 1326592 -157184 1086976 1158656
651 1158656 951808 38400 442368 737792 349184 171008 1250304 508928 452608 451584
641 451584 1286144 710144 118272 928256 827904 -640000 985088 565248 1085952 1427456
631 1427456 1742848 852992 704000 940544 876032 -54784 1025536 32768 216064 306688
621 306688 1012736 842240 1202688 663552 1149440 480768 1018368 548352 1310208 1143296
611 1143296 48640 712192 946688 333824 889856 439296 289280 293376 345600 357888 -890880
599 1555456 937472 1130496 91136 662528 489984 942592 650240 -192512 1009664 -261632
$$ packed form
672A259520B49344L86560C2256L24608M4032Q8064K1504J021440m09600I7280
661A56672P64928K9696A13152R60000B68800J322496k64704a57184A086976P1680
651A158656k06848C8400M03968K95424C49184A71008J079296E08928n6320j024
641D51584Q34560n76000A18272Q09984j00352f40000I85088m19840N20704L41504
631A427456L15392H52992j48992K36544o4512e4784A025536C2768J83296R0624
621C06688P06048j70496L60448n39136M85888D80768N37600m70016P61856j66912
611A143296D8640O63552K34496C33824N56032D39296j50016M096N2224J2288h90880
599A555456o17984J93024I1136N71392j72544M52608k92352a92512A009664b61632
$$ plain form
588 919552 752128 544768 106496 -592896 -164864 161792 691712 -246784 1071104 562688
578 562688 -343040 987136 498176 323072 381952 432640 1276928 351232 108032 555008
568 555008 -23552 1253376 540672 -203264 500736 -448512 352256 884736 -645120 233984
557 348672 592384 143360 147968 513024 -159744 646656 743424 968192 840704 148992
546 218624 466432 555008 745472 268800 142336 1230336 -486912 392192 730112 1447424
536 1447424 411648 312832 -544256 982528 -250368 778240 779776 -118784 561664 446464
526 446464 1150976 127488 281600 565248 -646656 237056 76288 568832 335872 1269760
516 1269760 30208 -626688 682496 -688640 1401856 1337856 158208 672768 126976 270848
$$ packed form
588I19552j67424k07360A06496e92896a64864A61792N29920b46784A071104n08416
578E62688c43040I87136m88960j75104N8880N0688Q44288C51232A08032M46976
568E55008b3552A253376E40672b03264E00736d48512C52256N32480f45120B33984
557C48672K43712A43360M608L65056a59744F46656R6768K24768j27488A48992
546B18624K47808Q8576J90464B68800j26464J088000d86912C92192L37920P17312
536A447424D11648r8816e44256I82528b50368G78240J536a18784E61664j15200
526D46464P04512A27488J54112K83648f46656B37056G6288M92544k32960R33888
516A269760C0208f26688F82496f88640A401856o4000A58208N14560A26976J43872
$$ plain form
506 270848 614912 720384 -621056 -324096 282624 440832 -391680 413696 670208 -139264
495 335360 1930752 524288 34304 476672 348672 359936 842240 763904 200192 1040896
485 1040896 263680 -32768 -68096 457728 472064 10240 697856 -276992 1221120 376832
474 295936 253952 979456 507904 757760 600064 984064 579584 1247232 704000 491520
464 491520 1057792 1254912 638976 378880 -16384 734720 16384 947200 761344 -537088
453 313856 323072 681984 1404416 961536 -315392 791552 1577984 -381440 362496 1342976
443 1342976 -297472 716288 -592896 1275392 839680 1073664 -494592 1202688 276992
433 1158144 1341440 -215552 393216 1165824 624128 10240 871936 813056 342528 -279552
$$ packed form
506B70848L44064J05472f21056K96960B82624J58208c91680D13696K56512a39264
495C35360J595392E24288C4304M42368j28000J1264M82304p8336B00192Q40704
485A040896B63680c2768l5328D57728J4336A0240O87616b76992A221120C76832
474B95936m1984P25504m71552K49856j57696L84000m04480O67648n43232k12480
464D91520N66272J97120o15936k60096a6384G34720A6384R30816j85856e37088
453C13856R216L58912P22432m42880c15392G91552P86432c81440C62496R80480
443A342976b97472G16288e92896A275392m35712K33984d94592A202688B76992
433A158144J83296b15552C93216P72608n41696A0240Q61696n8880C42528b79552
$$ plain form
422 685056 -17408 388608 1280000 163840 1244160 1070592 833024 -17920 1036800 91648
411 783872 -98816 -243200 199680 563712 479744 -324608 756224 473600 463360 -105472
400 -311808 -429056 97792 -182784 492544 429568 -263680 794624 -64000 41984 1110528
390 1110528 1244672 -78848 -281088 685056 -491008 333824 -342016 822272 -303104 -270336
380 -270336 165376 111104 23040 -152064 1087488 1308160 694784 321024 563200 482304
370 482304 969728 -218112 950272 1241088 791040 -313344 484864 103936 128000 387584
360 387584 -112640 11776 -539648 708096 209408 -446976 1074176 741376 501760 659456
350 659456 177664 630272 1029632 -122368 -44032 944640 240640 -25600 824832 354304
$$ packed form
422F85056a7408C88608Q91392A63840J080320j73568k37568a7920A036800I1648
411G83872i8816j44384A99680L64032q3968c24608G56224k82624j0240a05472
400c11808j17248I7792a82784D92544o2976b63680G94624f4000D1984J068544
390A110528J34144g8848k02240F85056d91008C33824c42016H22272c03104L2768
380b70336A65376n4272B3040a52064A087488K20672o13376C21024K42176q0896
370D82304M87424b18112I50272K90816m50048c13344D84864A03936K4064K59584
360C87584a12640A1776e39648G08096B09408d46976A074176l32800k39616J57696
350F59456A77664M52608L99360a22368d4032I44640B40640b5600H24832C54304
$$ plain form
339 630272 57344 -594944 -498176 58880 269824 6144 -635392 973824 2172928 273408 258560
328 258560 -553472 1762816 -208384 799232 988672 -84992 854528 702464 355840 665088
318 665088 -173568 388096 201216 -283648 151552 -202752 322048 -84992 866304 1712128
308 1712128 208384 53248 610304 1297920 125952 1098240 -466432 -164864 456192 658432
298 658432 1192448 766464 200704 -393728 987136 740864 164864 581632 9216 220672
288 220672 -225280 165888 100352 -119296 -119296 -11264 565760 -181248 827392 978432 236032
276 755200 624128 1367040 860160 654848 -24064 -674304 -500224 -1013248 299008 -146944
265 -136192 -462336 69120 -97792 142848 -144896 158208 724480 -585728 -235008 238592
$$ packed form
339F30272E7344e94944R6768E8880K10944F144f35392I73824J199104B73408j4848
328B58560e53472A762816b08384G99232J89440h4992H54528j52064l46624L09248
318F65088a73568C88096j86880b83648A51552b02752C22048h4992H66304Q45824
308A712128B08384E3248N57056O87616A25952R72288d66432a64864D56192K02240
298F58432N34016m25984B00704c93728I87136k46272A64864M16768I216K11456
288B20672b25280A65888o5536a19296%a1264E65760a81248H27392J51040B36032
276G55200j31072P42912n06880k05312b4064o50240J74080n13024B99008a46944
265a36192l26144F9120i7792A42848a44896A58208N66272e85728b35008B38592
$$ plain form
254 613888 -429056 696320 -95744 -991232 552448 1345024 348160 -98304 -94208 188928 543232
243 543232 -7680 172032 534016 -749056 269312 1427968 1056256 457728 163840 84480
233 84480 602624 8192 283136 186368 52224 -617984 -162816 186368 765440 753664 -237056
221 179200 -57344 959488 -481280 679936 -204288 70144 633856 109568 356864 688640
211 688640 117248 289792 319488 182272 -89600 778752 785408 -355840 600064 -141824 22528
199 -25600 126464 113664 -375808 -193024 -686080 333312 1028096 87040 670720 92160 623104
188 623104 -448000 -349184 -219648 214016 395264 -553472 547840 -136704 351232 -200192
177 -343040 343040 516096 509440 -351232 771584 -33792 487424 -481280 496128 -652288
$$ packed form
254F13888d29056F96320i5744q95488E52448P92576C48160i8304M096A88928L54304
243E43232g680A72032L61984g49056B69312J158656l71712D57728A63840p9360
233H4480N18144H192K74944r6768E2224f17984a62816A86368N79072j1776b37056
221A79200e7344I59488d81280F79936b04288G0144N63712A09568K47296L31776
211F88640A17248J72544K9696j37216h9600G78752O656c55840F00064a41824B2528
199b5600A26464j2800c75808J82784m93056C33312O94784H7040N83680I2160N30944
188F23104d48000R8816J29536B14016J81248e53472E47840a36704C51232b00192
177c43040C43040J73056o656c51232G71584c3792D87424d81280D96128f52288
$$ plain form
166 -14336 -667648 -7680 411648 1436160 -250880 295936 192512 287744 -173056 -231424 -809472
155 -809472 -971776 1057280 274944 316416 445952 -485376 -283648 469504 -150528 227328
144 -351232 379904 -119808 -1129472 -444928 877056 -720896 754176 19456 1069568 747008
134 747008 -509440 28160 -247808 -165888 344576 392192 295424 1442816 283136 -922624
123 -362496 -1186816 235008 452096 61440 381440 346112 -474624 19456 -797696 546304
112 1171456 -602624 -1536 -445440 748032 -286208 -142336 248832 -176128 -787456 1081856
101 296960 -102912 -443392 39936 1106944 -314368 249856 -340480 -512512 237568 326144
91 326144 -521728 -139776 287744 412672 -898048 -498688 727040 201728 943104 -157184
$$ packed form
166a4336o53312g680D11648J024512b50880B95936j03424R5232a73056n8368n78048
155h09472j62304A057280B74944M1472J29536d85376K01728D69504a50528B27328
144c51232C79904a19808j009664d44928H77056g20896G54176A9456J050112l22560
134G47008e09440B8160b47808Q1920C44576M7616r6768J147392B83136i22624
123c62496q24320B35008K17088F1440L20000l5328d74624A9456g97696E46304
112A171456f02624a536m43904G48032b86208a42336B48832a76128o11328A081856
101B96960a02912l40480C9936J067008c14368B49856c40480j72032B37568Q8576
91C26144e21728a39776B87744J24928h98048L99360G27040B01728P41376a57184
$$ plain form
80 -317440 -305664 214528 -848384 -97280 485376 236032 -225792 -325632 -600576 171008 125440
69 125440 73728 499200 1058304 440320 426496 -163840 431104 923136 50176 -80896 -762880
58 -762880 -241664 543744 522752 1285120 1497600 495616 -189440 786944 3584 374272 47616
46 924160 460800 -314880 -477184 -330240 -624640 -13312 988160 -119296 820224 -787968
35 182784 786944 1358336 -637440 990208 410624 306688 -312832 -425472 -505344 -350720
25 -350720 52736 88576 619008 144384 649728 155648 124928 -247808 645120 -48128 -17920
13 -223744 83968 50176 -216064 -457216 84992 234496 -224768 -353280 145920 496640 574464
2 574464 668160 -800256
$$ packed form
80c17440J1776B14528h48384i7280D85376B36032b25792r9840k74944A71008m5568
69A25440n1712M25472N59104D40320j3824a63840D31104M92032E0176h0896o81984
58g62880b41664E43744k0992P62368K12480D95616a89440G86944C584L70688D7616
46I24160D60800c14880j62304J46944k94400a3312I88160a19296H20224g87968
35A82784O04160N71392f37440I90208D10624j03936c12832j12640p9872J54624
25c50720E2736L5840N30432A44384N05344A55648l0720b47808F45120d8128a7920
13b23744H3968l3792b16064k41152H4992J49504b24768j28512A45920L50720P7824
2E74464R3696h00256
##END=
