##TITLE=1379
##JCAMPDX= 6.0         $$ Bruker NMR JCAMP-DX V2.0
##DATA TYPE= NMR SPECTRUM
##DATA CLASS= XYDATA
##ORIGIN= NUTS EXPORT
##OWNER= Administrator
$$ 1.72 TOPSPIN		Version 2.1
$$ 2016-02-23 12:21:42.402 -0800  Administrator@X
$$ Compression mode = diff/dup
##.OBSERVE FREQUENCY= 90.275459
##.ACQUISITION MODE= SIMULTANEOUS (DQD)
##.ACQUISITION SCHEME= undefined
##.AVERAGES= 16
##.DIGITISER RES= 22
##SPECTROMETER/DATA SYSTEM= 
##.PULSE SEQUENCE= zg30
##.SOLVENT NAME= None
##.SHIFT REFERENCE= INTERNAL, None, 1, 14.79515
##AUDIT TRAIL= $$ (NUMBER, WHEN, WHO, WHERE, PROCESS, VERSION, WHAT)
$$ ##TITLE= Audit trail, TOPSPIN		Version 2.1
$$ ##JCAMPDX= 5.01
$$ ##ORIGIN= Bruker BioSpin GmbH
$$ ##OWNER= Administrator
$$ $$ E:/data/jwist/nmr/1379/1/pdata/1/auditp.txt
$$ ##AUDIT TRAIL=  $$ (NUMBER, WHEN, WHO, WHERE, PROCESS, VERSION, WHAT)
(   1,<2016-02-23 09:11:14.418 -0800>,<Administrator>,<X>,<jcamp>,<TOPSPIN 2.1>,
      <fromjdx created from
       E:\data\jwist\nmr\uniandes\1379
       data hash MD5: 8K
       23 8D 26 7D 33 06 61 6F 47 90 55 29 63 37 F4 05>)
$$ ##END=
$$ 
$$ $$ hash MD5
$$ $$ 51 38 97 CB A4 D9 C1 4B ED B6 E9 8A 15 D3 09 D5
##$RELAX= 
$$ Bruker specific parameters
$$ --------------------------
##$DU= <E:>
##$EXPNO= 1
##$NAME= <1379>
##$PROCNO= 1
##$TYPE= <nmr>
##$USER= <jwist>
##$ACQT0= 0
##$AMP= (0..31)
100 100 100 100 100 100 100 100 100 100 100 100 100 100 100 100 100 100
100 100 100 100 100 100 100 100 100 100 100 100 100 100
##$ANAVPT= 1
##$AQSEQ= 0
##$AQ_mod= 3
##$AUNM= <au_zg>
##$AUTOPOS= <>
##$BF1= 90.275459
##$BF2= 400.02
##$BF3= 400.02
##$BF4= 400.02
##$BF5= 400.02
##$BF6= 400.02
##$BF7= 400.02
##$BF8= 400.02
##$BYTORDA= 0
##$CFDGTYP= 0
##$CFRGTYP= 0
##$CHEMSTR= <none>
##$CNST= (0..63)
1 1 145 1 1 1 1 1 1 1 1 1 1 1 1 1 1 1 1 1 1 1 1 1 1 1 1 1 1 1 1 1 1 1 1
1 1 1 1 1 1 1 1 1 1 1 1 1 1 1 1 1 1 1 1 1 1 1 1 1 1 1 1 1
##$CPDPRG= <>
##$CPDPRG1= <>
##$CPDPRG2= <>
##$CPDPRG3= <>
##$CPDPRG4= <mlev>
##$CPDPRG5= <mlev>
##$CPDPRG6= <mlev>
##$CPDPRG7= <mlev>
##$CPDPRG8= <mlev>
##$CPDPRGB= <>
##$CPDPRGT= <>
##$D= (0..63)
0 1 0 0 0 0 0 0 0 0 0 0 0 0 0 0 0 0 0 0 0 0 0 0 0 0 0 0 0 0 0 0 0 0 0 0
0 0 0 0 0 0 0 0 0 0 0 0 0 0 0 0 0 0 0 0 0 0 0 0 0 0 0 0
##$DATE= 0
##$DBL= (0..7)
120 120 120 120 120 120 120 120
##$DBP= (0..7)
150 150 150 150 150 150 150 150
##$DBP07= 0
##$DBPNAM0= <>
##$DBPNAM1= <>
##$DBPNAM2= <>
##$DBPNAM3= <>
##$DBPNAM4= <>
##$DBPNAM5= <>
##$DBPNAM6= <>
##$DBPNAM7= <>
##$DBPOAL= (0..7)
0.5 0.5 0.5 0.5 0.5 0.5 0.5 0.5
##$DBPOFFS= (0..7)
0 0 0 0 0 0 0 0
##$DE= 6.5
##$DECBNUC= <off>
##$DECIM= 2432
##$DECNUC= <off>
##$DECSTAT= 4
##$DIGMOD= 1
##$DIGTYP= 12
##$DL= (0..7)
0 120 120 120 120 120 120 120
##$DP= (0..7)
150 150 150 150 150 150 150 150
##$DP07= 0
##$DPNAME0= <>
##$DPNAME1= <>
##$DPNAME2= <>
##$DPNAME3= <>
##$DPNAME4= <>
##$DPNAME5= <>
##$DPNAME6= <>
##$DPNAME7= <>
##$DPOAL= (0..7)
0.5 0.5 0.5 0.5 0.5 0.5 0.5 0.5
##$DPOFFS= (0..7)
0 0 0 0 0 0 0 0
##$DQDMODE= 0
##$DR= 22
##$DS= 2
##$DSLIST= <SSSSSSSSSSSSSSS>
$$ [...]
##$SPOFFS= (0..31)
0 0 0 0 0 0 0 0 0 0 0 0 0 0 0 0 0 0 0 0 0 0 0 0 0 0 0 0 0 0 0 0
##$SUBNAM0= <"">
##$SUBNAM1= <"">
##$SUBNAM2= <"">
##$SUBNAM3= <"">
##$SUBNAM4= <"">
##$SUBNAM5= <"">
##$SUBNAM6= <"">
##$SUBNAM7= <"">
##$SUBNAM8= <"">
##$SUBNAM9= <"">
##$SW= 20.5580556627758
##$SWIBOX= (0..15)
0 0 3 4 0 0 0 0 0 0 0 0 0 0 0 0
##$SW_h= 8223.68421052631
##$SWfinal= 0
##$TD= 65536
##$TD0= 1
##$TE= 300
##$TE2= 300
##$TE3= 300
##$TEG= 300
##$TL= (0..7)
0 120 120 120 120 120 120 120
##$TP= (0..7)
150 150 150 150 150 150 150 150
##$TP07= 0
##$TPNAME0= <>
##$TPNAME1= <>
##$TPNAME2= <>
##$TPNAME3= <>
##$TPNAME4= <>
##$TPNAME5= <>
##$TPNAME6= <>
##$TPNAME7= <>
##$TPOAL= (0..7)
0.5 0.5 0.5 0.5 0.5 0.5 0.5 0.5
##$TPOFFS= (0..7)
0 0 0 0 0 0 0 0
##$TUNHIN= 0
##$TUNHOUT= 0
##$TUNXOUT= 0
##$USERA1= <user>
##$USERA2= <user>
##$USERA3= <user>
##$USERA4= <user>
##$USERA5= <user>
##$V9= 5
##$VALIST= <valist>
##$VCLIST= <CCCCCCCCCCCCCCC>
##$VD= 0
##$VDLIST= <DDDDDDDDDDDDDDD>
##$VPLIST= <PPPPPPPPPPPPPPP>
##$VTLIST= <TTTTTTTTTTTTTTT>
##$WBST= 1024
##$WBSW= 4
##$XGAIN= (0..3)
0 0 0 0
##$XL= 0
##$YL= 0
##$YMAX_a= 1217258368
##$YMIN_a= -4327101.952
##$ZGOPTNS= <>
##$ZL1= 120
##$ZL2= 120
##$ZL3= 120
##$ZL4= 120
##$ABSF1= 10
##$ABSF2= 0
##$ABSG= 5
##$ABSL= 3
##$ALPHA= 0
##$AQORDER= 0
##$ASSFAC= 0
##$ASSFACI= 0
##$ASSFACX= 0
##$ASSWID= 0
##$AUNMP= <proc_1d>
##$AXLEFT= 0
##$AXNAME= <>
##$AXNUC= <off>
##$AXRIGHT= 0
##$AXTYPE= 0
##$AXUNIT= <>
##$AZFE= 0.1
##$AZFW= 0.1
##$BCFW= 1
##$BC_mod= 2
##$BYTORDP= 0
##$COROFFS= 0
##$CY= 15
##$DATMOD= 1
##$DC= 2
##$DFILT= <>
##$DTYPP= 0
##$F1P= 0
##$F2P= 0
##$FCOR= 0.5
##$FTSIZE= 0
##$FT_mod= 4
##$GAMMA= 1
##$GB= 0
##$INTBC= 1
##$INTSCL= 1
##$ISEN= 128
##$LB= 0.3
##$LEV0= 0
##$LPBIN= 0
##$MAXI= 10000
##$MC2= 0
##$MEAN= 0
##$ME_mod= 0
##$MI= 0
##$NCOEF= 0
##$NC_proc= -9
##$NLEV= 6
##$NOISF1= 0
##$NOISF2= 0
##$NSP= 1
##$NTH_PI= 0
##$NZP= 0
##$OFFSET= 14.79515
##$PC= 1
##$PHC0= 0
##$PHC1= 0
##$PH_mod= 0
##$PKNL= yes
##$PPARMOD= 0
##$PPDIAG= 0
##$PPIPTYP= 0
##$PPMPNUM= 2147483647
##$PPRESOL= 1
##$PSCAL= 4
##$PSIGN= 0
##$PYNMP= <proc.py>
##$REVERSE= no
##$SF= 90.2741233803908
##$SI= 8192
##$SIGF1= 0
##$SIGF2= 0
##$SINO= 400
##$SIOLD= 32768
##$SPECTYP= <>
##$SREGLST= <1H.CDCl3>
##$SSB= 0
##$STSI= 0
##$STSR= 0
##$SW_p= 1497.18866228788
##$SYMM= 0
##$S_DEV= 0
##$TDeff= 0
##$TDoff= 0
##$TI= <>
##$TILT= no
##$TM1= 0
##$TM2= 0
##$TOPLEV= 0
##$USERP1= <user>
##$USERP2= <user>
##$USERP3= <user>
##$USERP4= <user>
##$USERP5= <user>
##$WDW= 1
##$XDIM= 8192
##$YMAX_p= 1217257984
##$YMIN_p= -4326912
##$CURPLOT= <PDFCreator>
##$CURPRIN= <$PDFCreator>
##$DFORMAT= <normdp>
##$LAYOUT= <+/1D_H.xwp>
##$LFORMAT= <normlp>
##$PFORMAT= <normpl>
##$SURQMSG= 1
$$ End of Bruker specific parameters
$$ ---------------------------------
##XUNITS= HZ
##YUNITS= ARBITRARY UNITS
##XFACTOR= 0.182762287876938
##YFACTOR= 1
##DELTAX= -0.182762287876938
##NPOINTS= 8192
##FIRSTX= 1497.0059
##FIRSTY= -4326912
##LASTX= 0
##MAXY= 1217257984
##MINY= -4326912
##XYDATA= (X++(Y..Y))
8191 -4326912 -833536 1054720 264192 555520 503296 -123392 57856 883200 1232896 -47616
8180 81408 -156160 980992 147456 -225792 212992 1051648 1263104 1225728 323584 1191936
8170 1191936 943104 558080 83456 -423424 260608 -21504 612352 23552 -743936 569856
8159 1048576 160256 157696 752128 -66048 18432 180736 781824 -195584 729600 499200
8149 499200 586240 837120 774656 296448 -366080 27648 1023488 514048 897024 286720
8138 22016 706560 471552 528384 495104 -248320 -161792 244736 931840 869888 423424 456704
8127 456704 1140736 215552 526336 638464 317952 1741824 -265728 205824 610304 612352
8117 612352 1561088 470016 1045504 708608 529920 505856 1016320 -113152 542720 343040
8107 343040 521216 577024 471040 507392 842752 190464 587776 -458240 93696 592896
8097 592896 171008 38912 1079808 177664 837632 956928 434176 -162816 -532480 107008
8086 -111616 535552 643072 757248 158720 163328 741376 200704 448512 1402368 770048
8076 770048 -61952 248320 553984 731136 -775680 1271808 -163840 636928 -431616 680448
8065 143872 1416704 -302592 363008 477184 1305088 1431552 -156160 -4608 132608 -29184
8054 205312 462336 217088 834048 883200 773632 1574912 112640 -408576 553472 278016
8044 278016 349696 1256960 -423936 -80384 -164352 676864 232448 -268800 115200 -278016
8033 266752 -281600 -359424 79360 -154624 814080 794624 -104960 520192 -184320 1203200
8022 288768 65024 390144 -413696 1006592 -75776 249344 0 423936 952832 358400 607232
8011 607232 -372736 1593856 1376256 290304 635392 629248 470016 -98304 -10752 262144
8000 -483840 605696 183808 -334848 523776 401408 -200704 557056 -295936 700416 -291328
7989 914432 930816 368640 727552 1022464 339456 1366016 397312 33792 422912 783872
7979 783872 -289280 749056 607232 -306176 675840 349696 1409536 411648 340992 1242624
7969 1242624 231424 1693696 -1018880 285696 841728 453120 803328 1496576 1006592
7960 1006592 291328 245248 223232 1310720 1336832 860672 482816 104960 925696 -287232
7949 822784 157184 1071616 5120 -20480 719872 -641536 559104 -41984 671232 2063872
7939 2063872 451584 -183296 1529344 467968 -590336 239616 803328 441344 593920
7930 593920 792064 210944 795648 1235968 204288 951296 1271296 685568 510976 -61440
7919 662016 -380416 558592 183296 1150976 282624 -480256 76800 219648 970240 529408
7909 529408 -55808 962048 863744 1315840 638976 -479232 1542656 1079296 14848 224768
7899 224768 1409536 -328192 442368 187904 939008 552960 729088 236032 1370112
7890 1370112 785408 581632 -103936 912896 1013248 408576 -322560 773632 341504 1004032
7880 1004032 527360 -435712 231936 1350656 888320 30208 -122880 375808 1062400 1883136
7870 1883136 653824 667136 -31744 -134656 1200640 604672 430592 1360384 1166336 914944
7860 914944 964096 1110016 24576 1749504 478208 246272 737792 1483776 943616 629248
7850 629248 1073152 704000 258048 -538112 -556032 963072 524800 755712 529408 769024
7840 769024 467968 1120256 240640 1239040 957952 598528 1353728 230912 531968 303104
7830 303104 845824 532480 312832 543232 910848 391680 566272 1094144 109056 815104
7820 815104 -499200 410112 480768 939008 1401856 901120 -8192 848384 919040 882688 619008
7809 619008 771584 321024 488448 642560 884224 856064 1242624 811520 1780224 1530880
7799 1530880 109568 958976 445952 501760 1178624 1155072 636928 711680 682496 218624
7788 1087488 1030656 729600 434176 899584 1231360 297472 1702400 1314304 1902592 496128
7777 746496 953856 845312 729088 1132032 -372736 387584 -80896 1242624 -16384 1212928
7766 681984 1338880 -272896 1353728 616448 -210944 1212416 750080 -749568 1382912
7756 616448 186880 1514496 2120704 1156608 405504 567296 1053696 -392704 -18944 595456
7745 818688 563200 873472 1505792 130560 217600 846848 1279488 1048064 817664 151040
7734 798720 1441792 1089024 91648 638464 1083392 1419776 1032704 806912 833536 1550336
7724 1550336 44032 202240 857600 1102848 261120 414208 589824 281088 -24576 1023488
7713 758272 718336 943616 906240 52736 131584 1032704 -150016 -16384 497152 746496 403456
7702 403456 1299456 677888 1899008 152576 783872 1231872 685568 -244224 1634816
7692 538112 2159616 149504 326144 1037312 1120768 671232 32768 932864 1979392 1844736
7682 1844736 250880 472576 317952 199680 -246272 919040 836096 509440 493568 796160
7672 796160 1012224 976384 -300544 939008 869376 1444864 72192 902144 627712 1710592
7662 1710592 1248768 1264640 714240 1340416 628224 270848 107008 613888 1198592 737792
7652 737792 491520 299008 -122368 1546240 1864704 833536 644608 2063360 247296
7642 936960 1825792 1245696 429568 960512 1585664 371712 1081856 315904 680448 536064
7632 536064 932864 623616 868352 848384 116736 885760 674304 428544 697856 1192448
7622 1192448 657408 662528 1360384 646656 1321472 355840 424960 1315840 1143808 240128
7611 1379840 721920 755200 758784 1234432 866816 1144320 890880 639488 1068544 902656
7601 902656 293376 379904 1357824 1147904 -75264 98816 768000 742400 154112 1080320
7591 1080320 1179136 594944 896512 584192 281600 90112 120832 747520 924672 117760
7580 865792 186880 1257984 294912 417792 671232 1272832 791552 297472 824320 816640
7570 816640 -156160 918528 862720 11264 1411072 638976 1264128 120832 1498624 401408
7559 712704 241664 1265664 1630720 572928 1103360 971264 1389056 1047552 506368 -105472
7548 1000448 735744 351744 26624 1175552 1505280 388096 290816 488448 729600 719872
7538 719872 1557504 229888 710656 564224 1179136 115712 -85504 1258496 713728 1216000
7528 1216000 1064448 1422848 15360 1179136 400896 1388544 1498112 907776 1327104 924160
7518 924160 50176 -23552 642560 883200 1140224 710144 977408 1498112 947712 1314304
7508 1314304 1216000 132608 -577024 1460224 802304 952832 1352192 935424 771584 46592
7497 1736192 510464 356352 1665536 701440 618496 305664 1345024 1089536 1148416 -155136
7486 566272 -201216 973824 435200 142848 699392 993792 1275392 1087488 1055232 831488
7476 831488 727552 1540096 460800 1597952 1331712 404992 468480 1510912 -63488 1483776
7465 1115136 604672 1038848 684544 1428992 696832 989696 -346624 640512 465408 1003520
7455 1003520 168960 513536 860160 -74240 623104 2087424 287744 29696 1584128 819712
7445 819712 874496 404480 1050624 1345536 -39424 1335808 770048 842752 31232 805376
7435 805376 1395712 1316352 1061376 517120 2226176 -525312 857088 1346048 1510912 615936
7424 1298944 91648 699392 1126912 1113600 401408 997376 -142336 97792 843776 1645568
7414 1645568 1501184 718848 422400 1608192 467456 2560 812032 879616 1319936 1873920
7404 1873920 546816 1423872 663040 838144 402944 1321984 944640 152576 1804288
7395 1804288 1222144 855552 457728 1001472 1113088 897536 1253888 83968 267776 577024
7385 577024 702464 955904 928768 581632 783872 1321984 398336 859136 -135168 963584
7374 1842688 -294912 1156096 1028096 733696 1278976 1005056 1492992 1686528 1015808
7365 1015808 574464 516096 1229312 1047040 217088 1037824 501760 1383424 1083392 296960
7354 407552 928256 565248 839168 1125888 574976 -95232 1512448 628736 1257472 1542656
7344 1542656 1537024 65536 692224 950784 249344 911872 867840 1736192 430592 676352
7334 676352 1352192 633856 672768 1360896 1132544 824320 852480 -349696 714752 674816
7324 674816 28672 1092096 599040 416768 783360 1821184 898560 922624 160256 907776
7314 907776 185856 1673728 663040 -206848 580608 1281024 1643520 1288704 886272 624128
7304 624128 643584 1298944 1491456 452096 899584 2019840 1775616 1448960 1143808 1282048
7294 1282048 1321984 1448960 591872 1136128 794112 877056 1619456 451072 1369600 1222656
7284 1222656 1604096 1627648 1563136 1031168 1619456 1209344 1131008 1169408 1917440 1328640
7274 1328640 1348096 1124352 252416 1037312 1159680 1268736 1060864 1132544 844800 1255424
7264 1255424 371200 2603008 925184 1124352 1581056 606208 1625600 1454080 240128
7254 203776 1419776 1117184 1217536 736768 1849344 1297920 1054720 1432576 1491968 1553408
7244 1553408 857088 532992 690688 754688 809472 1855488 539136 562688 1068032 269824
7233 1268224 232448 1223680 1746944 1191936 1079808 1471488 653824 617984 941568 1242112
7223 1242112 1101312 766976 -539136 2035200 -92672 1379840 1635328 631296 1909760
7214 1909760 765952 1425408 235520 1288192 775680 493568 1364480 2125312 900608
7204 1058816 -61440 387072 939008 926720 1679872 1572352 1736192 1230848 1270784 1347584
7194 1347584 797184 951808 1473024 1515008 1105920 357888 565248 1129472 440832 541184
7184 541184 1355776 832000 913920 210944 1595392 605184 961536 1286656 1699328 906752
7174 906752 2464768 566272 238592 552448 948224 1768448 267776 1259008 1766400 1100288
7164 1100288 1103360 1700352 603648 861696 806400 1005056 941568 634368 464384 494080
7154 494080 1325568 1406976 750080 761344 1737216 969216 2352128 1360896 531456 1440256
7144 1440256 772608 1666560 1339392 1997824 495616 883200 477184 913408 306176 1446400
7134 1446400 1798144 516608 595968 420864 950272 1545216 705024 922112 1193984 1400832
7124 1400832 671232 568320 950272 1450496 1284608 -434176 761344 1774080 1344512
7115 1344512 856576 962048 974848 942592 1649664 1453056 723456 1366528 691712 524288
7105 524288 1311744 1088000 1401856 673792 1100800 1666048 50688 51712 2304512 1422336
7095 1422336 929280 1367552 1181696 615936 1218560 1310720 503296 1281024 3415040 1403392
7084 840704 1954816 1281536 644608 28672 1312768 1428992 1482240 1297920 1087488 2225664
7074 2225664 928256 1253888 1266688 196608 983040 675328 1818112 1017344 921088 562688
7064 562688 1219072 1183232 1994752 1331712 747520 1373696 69632 1763840 365568 614400
7054 614400 476672 1692672 1361408 1427968 913408 832000 1839616 1721344 415232 1454592
7044 1454592 610816 1010176 1235456 1388032 769536 1202176 1737216 1349120 1002496 1507840
7034 1507840 1090048 454144 1885184 871936 1441792 949760 1268736 1386496 466944
7024 2045952 497664 2717184 1248256 1807360 1761792 1509888 1449984 1446400 1031168 1614848
7014 1614848 1601536 1048064 1371648 1363968 393216 2020864 1848320 438272 908288 716800
7004 716800 1156608 1004032 1454080 1706496 905216 1897984 0 910336 1720832 1531904 2300928
6993 2300928 346112 503296 1226240 1522688 2133504 980480 1112576 1070592 1512448 1519104
6983 1519104 1097216 1868800 1020928 1102848 1404928 747520 568320 1216000 1910272 1206784
6973 1206784 786432 1389568 960000 845312 1193984 1251328 1482752 1717760 1538048 1545728
6963 1545728 1863680 1785856 1817600 1328640 1221632 1353728 1323520 694272 1517056 1080832
6953 1080832 1293824 185856 1845248 60416 1270784 658944 830976 817664 632832 1029120
6943 1029120 1869312 1693184 940032 1240064 840704 1194496 1373696 1046528 591360 1690624
6933 1690624 908800 1297408 466432 1145344 799232 986624 659456 2179584 1813504
6924 1813504 935424 730624 642560 1296384 1426432 1533952 657408 1245184 677888 1799680
6914 1799680 1079808 908288 851456 1445888 912896 1351168 1099264 1118208 1731072 1038336
6904 1038336 350208 2101760 1032192 497664 1769472 456192 1821696 1196032 1581568
6895 1581568 1021952 2635264 1706496 2134016 1159168 736256 1177600 1208320 1183744 1598464
6885 1598464 999424 2667520 969728 -643584 1591296 1476608 908288 903168 1162240 623104
6875 623104 108544 1788928 1564160 271872 1102336 1814528 599552 1342464 860160 1047040
6865 1047040 657920 1261568 927744 22016 1932288 779264 1014272 1133056 -358400 754176
6854 2212864 775168 605184 2002944 1149440 1648640 1022464 129536 1012736 1542144
6845 1542144 1148416 723968 1355776 2077696 1313280 961024 1571840 2190336 484352 805376
6835 805376 1804800 1358336 1668096 1248256 1317888 1043456 1800192 1440768 1118208 807424
6825 807424 1296896 569856 431616 1695232 2475008 -184832 271360 1246720 1043456 765440
6815 765440 1807360 1399296 1249280 541696 904192 554496 1377280 1024000 503296 410112
6805 410112 1570816 1613824 1037312 486400 911360 1595392 169984 772096 786432 1937920
6795 1937920 1126912 1822720 1036288 1602048 1034752 1498112 1661440 1519104 1548288 1564672
6785 1564672 839680 722944 1883136 1006080 1688576 848384 608256 502784 1514496
6776 1514496 1069056 1085440 1248256 30208 800768 1610240 2223104 1975808 1528832 1596416
6766 1596416 2158080 1437696 665600 1473024 1178624 1311744 754176 1336320 1117184 1270784
6756 1270784 1937920 921088 1961472 1896448 758272 1567232 2263040 874496 1983488
6747 1983488 513536 988160 1324544 2242560 1769472 315904 681984 1627648 1807360 1136640
6737 1136640 1425920 1668608 438784 1009152 2031104 1347072 1067520 561664 1150464
6728 1150464 1881088 574464 802816 292864 851968 1164800 330240 1406464 483840
6718 815616 1628672 1851392 1246208 1154560 257536 2348544 1446400 784896 1046016 1119744
6708 1119744 1316352 1766400 1260032 623104 1435136 462336 1627648 1762816 1398784
6699 1398784 2136576 607744 1350656 2184704 1339904 510464 1011200 2270720 2054656
6690 2054656 139264 2276864 1321984 1638912 650752 1756160 1166336 818688 1772032
6681 1772032 1300480 63488 1624576 1849344 1213952 549376 1227264 1966592 902144 1413120
6671 1413120 1440256 1565184 1571328 547840 1529344 1980928 1424896 950784 809984 791552
6661 791552 688640 1687552 1769472 227328 2065408 761856 1427968 2487808 1293824
6652 1293824 1799168 613376 474112 525312 861696 1374720 1804288 1010688 1447936 695296
6641 1507840 1474560 1056256 1581568 603136 2064384 1069568 1547776 1028608 572928 1250304
6631 1250304 756736 1154048 1317888 1179648 1910272 1944064 1484800 1208320 -308736 1427968
6620 1484800 17408 1856512 783872 1006080 1680896 1231360 557056 1199616 1915904 1488896
6610 1488896 2357248 1138688 1480192 1059328 1549312 -23552 869376 1061376 847360 300032
6599 1047040 988160 1273344 1299968 1104384 954368 874496 2009600 705536 1959424 1735680
6589 1735680 2180096 -498688 1769472 874496 989696 2363392 805888 2075136 1590272
6580 1590272 1648640 1694720 821760 1881600 1020416 878080 2359296 944128 871936 786944
6570 786944 2205184 1839616 1747968 1132544 1395200 2064384 1180160 989184 1760768 1252864
6560 1252864 881152 1108992 1345536 2647552 1997312 988160 1630720 1838080 832512
6550 1585664 1916928 1291264 2321920 1220096 565760 1161728 1140736 662016 1544192
6541 1544192 1369088 1383936 1736192 1815552 1183744 1864192 1255936 244224 1998848 1300480
6531 1300480 1722368 2049024 617984 1239040 1605632 1193984 1619968 1574912 1837056 2245632
6521 2245632 920576 1437184 -6656 1063936 1192960 1621504 956416 1160192 1839616 1569280
6511 1569280 1091072 1319424 973312 962048 1119744 2562048 2296320 1337344 1625600 1039360
6501 1039360 1990144 1352704 1637376 1041920 1497088 561152 1043456 2891264 1411584
6491 496640 1009152 1313792 1501696 757760 1148928 1980928 976896 65536 1390592 1195520
6481 1195520 1270784 1374720 928256 650752 377856 2159616 2313728 1119232 1564672
6472 1564672 1626624 1291264 1177600 1955328 2443264 956928 1593344 1603072 1825792 2102784
6462 2102784 1796096 1235456 877568 932352 1120256 1676800 812544 1814528 1380352 995840
6452 995840 1027072 1893888 1585664 1797120 1852416 1744384 1088000 1061376 2232320 361984
6441 1270784 1167360 1849856 507392 965632 2059776 1382400 2014208 1017344 987648 781312
6431 781312 2015232 1096704 1801216 1500160 1421312 1371136 793600 1210368 846848 1431040
6421 1431040 1752064 1532416 1318400 818176 1286144 2174976 19968 680960 840704 1294848
6411 1294848 1234944 1718272 1173504 1781248 928256 2300928 2266112 1479680 2058752 823296
6400 358400 1820672 2331136 1229824 1190400 2301440 2625024 833536 1545216 1372160
6391 1372160 1155072 642048 963584 2148352 1435648 1469440 763904 1951232 1746944
6382 1746944 1953792 1214464 968192 1367040 1581568 2031616 852992 1190912 1060864 1402368
6372 1402368 783872 2040320 1182720 2172928 2456576 904192 1764864 485888 3140096
6363 3140096 1767424 1356800 1690624 1070080 1445376 1575936 1421312 1907200 1472512
6354 1472512 663040 1437696 1305600 1576960 818176 1623552 844800 1964032 728064
6344 657920 1575424 1278464 689152 1728512 1259008 1195008 324096 392704 2316800 2279424
6334 2279424 219136 1295872 881152 1783296 1256448 2162688 2008576 2499072 649728
6324 1214464 1574912 1517568 1234432 899584 1248768 1067008 1054720 1594880 961024 804352
6314 804352 1787904 1889280 1774080 2107392 1273856 2599936 2457600 155136 1937920
6305 1937920 1504256 1638912 2063872 759296 53760 2100224 1712128 1183744 1827328 291328
6294 3056640 939008 293888 285696 2673664 942080 1644544 1680896 1830912 2456576 628736
6283 1680384 858624 752640 565248 1140736 817664 1220096 820736 2567168 2152960
6274 2152960 950784 1234944 2246144 1631744 1332736 1524736 1098752 1096192 835072 2395136
6264 2395136 848896 1015808 1444864 2021888 1341952 1920512 1728512 1524224 1104896 1792512
6254 1792512 934400 1965568 2612224 1373184 1657856 2067968 1445376 1428992 1443328 1782784
6244 1782784 1341952 2110464 270848 922112 1452032 1861632 1080832 1454592 941056 1928192
6234 1928192 565760 2592256 61440 1574912 2368000 2023936 1218560 1434112 1845760
6225 1845760 1825280 1419776 1875456 1833984 867328 804352 1626112 1064448 2049024 1239552
6215 1239552 1949184 1146880 1151488 1937408 824320 1251840 1809920 2221568 1871872 1380864
6205 1380864 832512 1760768 1821184 1035776 1207808 2171392 849920 894976 1065984 1097216
6195 1097216 2196992 1670656 1827840 1414656 2137600 1831424 1702912 2915840 1681408
6186 1681408 1509376 717824 1090560 1974784 2105344 2361856 263168 1971200 1150976
6177 1150976 2234880 1507328 1220096 1055744 2075136 1351168 1589248 1987584 1772544
6168 1772544 896512 1814528 1900032 1372160 1904640 1690624 2541568 1777664 1524224 1161728
6158 1161728 1766912 1737216 1036288 1954816 1595392 1634304 1655808 1842176 1173504 1733632
6148 1733632 2040320 2021376 2540544 1724928 1142272 1809408 1883648 1432576 1504768 1291264
6138 1291264 1169920 1317376 1305088 1485312 640512 410624 1586176 1256448 700928 1351680
6128 1351680 1943040 1114112 748032 1880064 1055232 1794560 1430528 195072 1939456
6119 1939456 969728 2226176 1033728 2481664 2201600 1355264 1222656 1570816 1718784
6110 1718784 1935872 1070080 1021952 1502208 1248768 2071040 1505792 1140224 1977856 1545216
6100 1545216 2129408 1216000 2448896 2062848 995840 1229312 2033664 1662976 1030144
6091 1030144 2044416 1717248 890368 1245696 1568256 1410560 1568768 1067008 1491456
6082 1491456 2027008 642560 1129984 932352 1399296 956416 2003968 2893312 797696
6072 1218048 454144 1677824 2752000 900608 2220032 1699328 1973248 1270784 1647616
6063 1647616 1390080 1841152 863232 1292800 788480 578048 2241536 2042368 919552
6053 1033216 808448 356352 1580032 1679360 2160640 1479168 1453056 1399296 2177536 1183232
6043 1183232 1202176 1189376 2593280 1321984 2107392 1816576 2082816 910848 1146880 2406912
6033 2406912 1763328 1879552 1207296 1507328 1446400 1215488 2135040 1613312 1139712 1608192
6023 1608192 1800192 1880576 839680 1963008 1166848 1440768 1200128 1893376 932864 1082880
6013 1082880 1859584 1915392 1085952 1896448 1816064 1616384 2243072 2358784 1153024 1049600
6003 1049600 1902592 592384 1493504 1851904 105984 1498624 1142784 2345472 1600000
5994 1600000 1476096 1446912 1810432 480768 775680 1214976 1754112 1792512 1243648 928768
5984 928768 848896 2457088 1690112 2262528 325632 1478144 597504 1473536 2074112 1597952
5974 1597952 1583616 1155584 1268736 1713152 1482752 1110528 1610752 1495040 2202112 1084416
5963 702976 1468928 2072064 2670080 1625088 1837056 1962496 2011136 1891328 2257408 1149440
5953 1149440 1946624 1096704 1266176 2381824 2129408 1228288 649216 749056 455680 1874944
5943 1874944 2301440 1961472 140800 2272256 1283584 2130432 1738752 1713152 893440 2105856
5933 2105856 463872 996352 622080 1387008 883712 565248 805376 1240064 1647616 1325568
5923 1325568 2663424 2105856 1642496 1759744 1188352 643584 925696 1589760 1432576
5914 1432576 1628160 1713664 1401344 2187776 1387008 2512384 1678848 2264576 2908672 1259008
5903 1659904 756736 1192448 1654784 1378816 1251840 1129472 2635776 1752064 1520640
5894 1520640 2019328 2625024 1492992 1054720 1242112 864256 1442304 816640 1005056
5885 1005056 2157568 1677312 1574400 1239552 1460736 899072 1779200 1722880 1381888 684032
5874 1725952 2297856 589312 2667008 1934848 1807872 1324544 2045952 1498112 1499136 1471488
5864 1471488 1645056 1263616 2187776 1294336 970240 747008 1885696 691712 290816
5854 1935872 2112512 993792 1225216 2493952 1744384 1382400 1053696 2064896 2359296
5845 2359296 1840640 1166848 1135104 1836544 2520064 1272320 1461248 898048 1468416 1021952
5835 1021952 1421312 665600 1579008 1166848 702976 1750016 970240 1211904 1267200 1890304
5825 1890304 1762304 1295872 1436672 1238016 1323008 2176000 2341888 2382336 1448448 1481728
5815 1481728 1629184 2319360 2338304 2392576 1115136 781312 1722368 1432576 2046464 2835456
5805 2835456 1100800 862720 2331136 1631744 1498112 1416192 1853440 1280000 1807360
5796 1807360 3030528 1043968 845824 1654784 995840 944640 1458688 1645056 592384
5786 1903616 1809408 1155584 2604032 1342464 2233344 1722368 1076736 1340928 1012224
5777 1012224 1506304 1919488 2097664 1843712 1001472 1049088 1753088 1973248 1928704 1325568
5767 1325568 707072 1582080 2390016 2195456 1569280 1278976 830976 2453504 1462784
5758 1462784 1394176 2165760 2292224 1658368 2896896 2162176 2150912 1500672 1064960 1364480
5748 1364480 2614784 1852416 1178112 1327616 1248256 1746944 1134592 1588224 2459648 925696
5737 1941504 1692160 1315840 2249728 2065408 1834496 2294784 2139136 1368064 1694208 1013760
5727 1013760 1997824 1081856 1364992 1473536 1539584 987648 1147904 1884160 1281024 534016
5716 1580032 2662912 1980928 872960 2203136 1973760 1146368 2507776 871936 949760
5707 949760 1994240 1396736 1515520 1113600 1502720 1581568 1264128 1515520 2183168 1382912
5697 1382912 1908224 1730560 1848832 2109440 2817536 1506304 1992192 1254400 1985024
5688 1985024 1289728 1165824 1400320 953344 2171392 2854400 1283584 1869824 1643520
5679 1643520 1961472 1097216 1674752 1491968 1534976 1461248 1528832 2549248 1742848 1168896
5669 1168896 1691648 1905152 2417664 1998848 1218560 1715200 2008576 767488 815104 1178112
5659 1178112 2707456 2057728 1755136 1963008 1636864 2432000 1554432 1962496 2381312
5650 2381312 1364480 1875456 1639936 1277440 1042432 1871872 1321472 2131456 1192960
5641 1192960 1523712 1218560 1392128 1934848 2067456 2262528 1608192 1992704 1405952 1205760
5631 1205760 1652736 1156608 1955328 2300928 1686528 2562048 1913344 2189824 2554880 1836544
5621 1836544 2738688 1583616 2415104 1840128 1795584 1380864 1392128 1350144 2346496 538112
5610 2167296 1867264 944640 662528 544256 2194432 1878528 2533376 2122752 1293312
5601 1293312 1670144 1550848 2529280 1240064 1220096 1770496 1656320 1789440 1560064 1540608
5591 1540608 1522176 2183680 2452992 1860608 1309184 2516992 1477120 1386496 2121728 1824768
5581 1824768 1179648 922112 2546688 1638912 2006016 1942528 1121280 1146368 2942976 2661376
5571 2661376 1816064 1646592 1822720 1873920 740864 1966080 1228800 344064 1654784
5562 1654784 1945600 1682944 1174016 2181632 1966592 1196544 2544640 2288128 1384960
5553 1384960 2019840 2100224 2343424 2334208 1485312 2125824 1876480 398336 1759744 2531840
5543 2531840 1519616 1667584 1975808 1221632 1511424 2349056 1736192 1928704 1395200
5534 1395200 1905664 1777664 1013248 1327104 788992 1438208 2174464 2561536 1097216
5524 1973248 1701376 1655808 1802240 1127424 2296832 2088960 2203136 625664 2426880
5515 2426880 1611264 1523712 1662464 1460736 1500160 1263104 1627648 2247168 1145856 1609728
5505 1609728 1277440 1974784 1413120 1707008 1412096 1446912 751616 735232 2221056 464384
5494 1560064 1010688 2021376 1662976 630272 1564672 2299904 2267648 1043456 1055232 1325568
5484 1325568 1830912 1941504 -125440 1313280 1147904 1506304 2017792 1484288 1704448
5475 1704448 2328064 2530816 2151936 1556992 1216000 2367488 1564672 2197504 1748480
5466 1748480 2236928 1316352 1175552 1845248 1586688 1848320 2050560 2402816 1951232 2623488
5456 2623488 2128896 1977856 1522176 1083392 2588672 2227200 2011136 2299392 2395136 1383936
5446 1383936 1581056 1711616 2793472 1639936 1831936 1393664 1470976 1751040 2101760
5437 2101760 3059712 2073088 2294272 2101760 3153920 2859520 1902080 1224704 2784256
5428 2784256 2486784 2530304 2561024 3274240 2912256 2383360 2917376 2004992 2562560 904192
5417 1793024 1560576 1224192 1880064 1957376 2009600 1131520 1329664 1972736 2763776 1399808
5407 1399808 1753088 1169408 1272832 1605632 2105856 2760192 1815552 1691648 2530304 1522176
5397 1522176 2191872 1566208 1383936 1187328 1867264 1801728 2161664 2673664 1211392 1309696
5387 1309696 1823744 2637824 1983488 801280 2693632 1536000 1048576 2394112 1360896
5378 1360896 1980928 2456576 1412096 2269184 2085888 2506752 1565184 1108480 2418176
5369 2418176 1448448 833024 1124352 1420288 1554944 1321472 951808 1831424 2138112 2632192
5359 2632192 1260032 1532416 1705984 1123328 1324032 1797120 2362368 1787904 1790464 1633792
5349 1633792 2521088 1020416 1360384 1909248 1668096 2221568 775168 1155584 2295296
5340 2295296 1444352 1345536 2994688 1072128 1574400 1114624 2270208 2755584 1717248
5331 1717248 2401792 2198528 2249728 2886656 2209280 2474496 2358784 2611712 2826240 2031616
5321 2031616 1693696 2097664 2005504 3108864 3566080 1622528 1895424 1597440 1519616 923648
5311 923648 3356160 1783808 3467776 1132544 2326528 2064384 3198976 2012160 2605568
5302 2605568 2365440 2678784 2263552 2583040 3079168 2438656 2072064 2936320 2323968 1699840
5292 1699840 1202176 1614848 1805824 2204672 1735168 2535936 2690560 2488832 2439168 3180544
5282 3180544 1865728 2949120 1560576 2696192 2535424 2836480 2621440 1730560 3348992
5273 3348992 2424832 2690560 2481664 1218048 2437632 2314240 1960448 2747904 1991168
5264 1991168 1739264 2926080 2117632 693248 1936384 2376192 2657280 2424832 2815488
5255 2815488 2947584 2480640 1650688 1784832 2049536 2549760 1118208 1438208 3203584
5246 3203584 1665024 3112448 1416704 1897984 1642496 2713088 2018304 1516544 2437120
5237 2437120 2430464 1591808 2156032 1019392 606208 1912832 1737216 1895936 835072 1353728
5227 1353728 1839616 1409024 654336 1131008 2320384 711680 2488832 2120192 1997312
5218 1997312 691712 1363456 1252864 1917952 791040 2744832 1966080 1472000 2131456
5209 2131456 1601536 1094656 2064896 2144256 894464 2220544 2104320 2290688 1641472 1798656
5199 1798656 1593856 1708544 1488384 1494528 1508352 1293312 1688064 2674688 1428480 1573888
5189 1573888 1558016 1735680 1126912 1857536 1164288 1731584 1269760 1295360 1290240 1546752
5179 1546752 622592 764416 1338368 1903104 1157632 1708544 1543168 1132544 837120 2629632
5169 2629632 2267648 1405440 1965568 1358336 1544192 1293824 1975808 1469952 1750528 219136
5158 2058240 2031616 2064896 1560064 2422784 1497088 1695232 1572352 1549312 1748480 1259008
5148 1259008 1750016 2486272 1988096 2047488 1423360 1955840 1089536 1758720 2031104 2165760
5138 2165760 1134592 3080192 2187264 1226240 1509376 1495552 2207744 709632 2441216
5129 2441216 1595392 1482752 1463808 1067008 2544640 1723904 2433024 2554880 1280000
5120 1280000 1982464 1289728 2480128 1774592 2326528 621568 1274368 2179072 1843712
5111 1843712 1446400 1710592 2710016 3033600 1590784 1675776 1534976 2254848 1847296 1481728
5101 1481728 790528 1734144 2563584 1181696 1140736 2292224 1999360 2046464 2475520 2852352
5091 2852352 2634240 2088960 1284608 1105920 1767424 2866176 1718272 2024448 1830400
5082 1830400 949760 2216448 2658304 1658880 2144256 1484800 1179648 1320960 1782272
5073 1782272 2301952 1858048 1537536 828416 2476544 1332736 1705984 2769408 2700800
5064 2700800 2650112 2514432 1695744 1402368 1594880 1792512 1589760 1766400 678912 2184704
5054 2184704 2369024 2178560 2764800 2214400 1896448 1726464 1556992 1561088 1972736 2236416
5044 2236416 876032 2514944 2433536 2589184 1197568 1232384 2770944 1672704 1159168
5035 1159168 2825728 2045440 2272256 2927616 2059776 1847296 2219008 3421696 3085312
5026 3085312 2642432 3464704 2881024 3566080 3439616 2545152 3314688 2030592 3805696
5017 3805696 2455552 2298880 1796608 450048 1780736 1931264 2058752 2171392 1654272
5008 1654272 1571328 2280448 1709568 2048512 1110528 1606144 1735680 1398784 1297920 1361920
4998 1361920 2569728 1291264 765440 908800 1852928 1665024 2236416 1972224 1957888
4989 1957888 2560000 1690112 2540032 1095168 1038336 1198080 1461760 3030016 1836544
4980 1836544 1010176 1510912 2367488 1628672 1276416 1788928 1292800 2450944 1022464
4970 2290688 1144832 2400768 1116672 1964032 1661440 2239488 1702912 1513472 1473024
4961 1473024 1260544 1671168 2216448 1773568 1755136 2185728 1784320 1338368 2017792 2113024
4951 2113024 1764864 2075136 1590784 2481664 2289152 1595392 2567168 1460224 2012672
4942 2012672 1384960 2026496 3061248 2337792 2804736 1962496 1794560 2127360 2193920 2243584
4932 2243584 2691072 2199040 913408 1188864 1530880 2393088 1885184 2203648 2203136 1974784
4922 1974784 1831424 1623552 2582016 1699328 2625024 1875968 1845248 2506752 1916928 2087424
4912 2087424 2339328 2910208 2415616 2145792 1530880 1792512 1949696 2471936 2059776 1672192
4902 1672192 2205184 1918976 2553344 2711040 1888256 2114560 1862656 2251776 2685952 2936320
4892 2936320 1572352 1767424 1793536 2319872 1460736 2643968 3076096 1142272 1375232
4883 1375232 2392576 723456 1136128 2970112 2052608 2597376 2449408 2729472 2143744
4874 2143744 2576384 1338880 2145792 2555392 1571840 1675264 1733632 2650624 2031104 2564096
4864 2564096 3265536 1241600 2356224 2665984 3130368 2335232 1287168 2483200 1336832
4855 1336832 1691648 1620480 1385984 2257408 239616 2101248 1931264 1478656 1908224 1800704
4845 1800704 1693184 2275328 1636864 1457152 1859584 2298880 2774528 3194880 1524224
4835 2717696 1953280 2496512 1989632 3048960 2952192 2122752 2140160 1584640 2073088 420352
4824 2034176 1200640 1096192 1591808 1558528 2670080 2734592 2583552 1796096 1154048 2599936
4814 2599936 840192 1701376 1273344 1680384 2095104 2424320 2460160 2434560 1654272 1782272
4804 1782272 2320896 1448960 1614848 2445824 1094656 2193408 3153920 1315840 1329152
4795 1329152 2317312 2169344 2776064 2820608 1911808 2213888 2462720 2264064 3128832 2472960
4785 2472960 3066368 2585088 1681408 2553344 1308672 2978304 2567168 2748416 2911744
4776 2911744 3524096 3009536 2422272 3839488 2910720 3128320 3640832 4657152 5371392
4767 5371392 4910080 5457408 6124032 5902336 6242816 5825536 4970496 4835840 4502528 4180992
4757 4180992 3148800 2950656 2270208 2581504 1469440 2217984 1471488 2094080 2651648
4748 2651648 1184768 1079296 1812480 1734656 1311232 1890816 2157568 1493504 1287168 1682944
4738 1682944 1164800 1597952 1417728 1909248 2722816 2262528 971776 1465344 1090048 2243584
4728 2243584 1231872 2293760 1298432 1673728 584192 1725440 2349056 2637824 2107392
4719 2107392 1837568 1565184 1718784 2028544 1966080 2011648 2117632 1961472 2112000 1275392
4709 1275392 2292736 1069568 1927680 2102784 3130368 1587200 2456064 2785792 1120768
4699 2015744 2414080 2025984 1390592 980480 1144320 1933312 1195008 2305536 1576960
4690 1576960 2162176 1570304 1032192 2561024 1234432 2510336 2500096 1706496 2415616
4681 2415616 1823744 1988096 1624576 1505280 1833472 1692672 2001920 2982912 2259456 2130432
4671 2130432 1888256 1152000 2937344 1288704 1544192 2291200 2502656 1556480 2433024
4662 2433024 1890304 1409536 1644032 2166784 2017792 1713152 1629184 1691648 1861632 2544128
4652 2544128 1331200 2062336 2294272 2905088 2099712 2040832 1977344 1164288 892928 1918464
4642 1918464 1794048 2394624 2433024 2440704 2185728 1542656 2473472 1895936 790016 1095680
4632 1095680 1937920 1714176 1557504 1882112 1044992 1993728 1128960 2075136 2362880 2706944
4622 2706944 1379328 1527808 1863168 2154496 2247680 2088448 1274368 1352704 3055104 2141184
4612 2141184 3409408 1911296 2169344 2137600 776704 2647040 2930688 2009600 1824256
4603 1824256 2227200 2392064 2537984 1321984 1163264 1908224 1721344 1973760 1838592
4594 1838592 3240448 2348544 1698304 2143232 2409472 1798144 2357248 2001408 2496000
4585 2496000 2523136 1968640 2907136 1903616 2554880 2038272 2076672 1776128 2216960 2036224
4575 2036224 2109952 2513920 2020864 2807808 1777152 1757696 3678720 2750464 2974208 2359808
4565 2359808 3422208 2563072 2021888 2693632 2094080 1804800 2630656 2759168 1649664
4556 1649664 1909248 1325056 1921024 1903104 2601984 2372096 3038208 2078208 1816064 1742848
4546 1742848 1336320 2108928 1976832 2266112 2758656 1620992 1906176 1807360 1874944 2475008
4536 2475008 1842688 2314240 2150400 1759744 2391040 2012160 1666560 2781184 2396160
4527 2396160 1830912 1962496 1757184 2361344 1977344 1791488 2133504 2217472 1818624 3173888
4517 3173888 1895936 2270208 2985984 2519040 1911808 2032128 2999808 2459136 2869760
4508 2869760 3198976 3561984 3040256 3183616 3566592 2956288 2880512 2898944 2870272 2978816
4498 2978816 2800128 3108352 3586560 3558400 3461632 2904064 1718272 1849856 2162688 2451968
4488 2451968 1883136 2413568 1996288 2414592 2237440 2554368 2394112 2686976 2540544 3273216
4478 3273216 2800640 3740160 3692032 2145792 3700224 2667520 3372544 2696192 2879488
4469 2879488 4102144 3332608 3164672 4597248 3288064 2959360 3867648 2823680 3383296
4460 3383296 2916864 2909696 1866240 3183104 2992640 3008512 2951168 2778112 2132992 2750464
4450 2750464 2838528 2383360 1912320 1500672 2750464 2149888 1666560 1769472 1530368 2442240
4440 2442240 3165184 3446784 2455552 1466880 2349568 2052096 1758720 1325568 2278912 1289728
4430 1289728 3403776 1627136 2781696 2169856 2028032 2378240 2328064 2324992 1758720 2760704
4420 2760704 1909248 1981952 1184256 2475520 1715200 2106880 1605120 1858048 1878016 2380288
4410 2380288 3538944 2270208 3273728 1370624 1120256 1327616 712704 2463744 1439232
4401 1439232 2333184 2105856 1140736 2574336 2303488 1588224 2078208 2486784 2458624 2036736
4391 2036736 2636800 2381312 1964544 1224704 2385920 1469440 1207808 1675264 2831360
4382 2831360 2122752 2848768 1311744 2733568 1671680 2995712 2611200 3060736 3529216
4373 3529216 3855872 3308544 3537408 2775552 2717184 3287040 3427328 2630144 3501056 3341824
4363 3341824 2330624 3525632 2917376 3851264 2830848 2811904 2618368 2556928 3042304
4354 3042304 2757632 2761728 2604544 2417152 3022336 3726848 3240448 2394112 1805312 1978880
4344 1978880 2184704 1287680 1549824 2563072 2754048 2457600 2504704 2811392 2651648 1814528
4334 1814528 2311168 2214912 1773056 1870848 2007040 1793024 2670592 2376192 1518592 1306624
4324 1306624 2031616 1665024 2532352 2124800 1998336 2551296 1965056 2329600 2576384 1765376
4314 1765376 2254336 2543104 2237440 2012672 1761280 2695168 3348992 3095040 2285568 2424832
4304 2424832 2985472 2648576 2580480 2900992 3536384 2900480 3149312 2051584 1384960 2060288
4294 2060288 1358336 2135040 3258368 2970112 2953728 1742848 2552832 2483200 1123328
4284 2724864 1693184 1524224 1396224 1863168 2492928 1948672 2423808 2165760 1496576
4275 1496576 1128960 2255360 2457088 2707968 2820608 1982976 2304000 1754112 2241024
4266 2241024 2422272 2891776 3231232 2416128 2377728 2256896 2760192 1669632 2466304 1885696
4256 1885696 3403264 3476992 2227712 2623488 3294720 2550272 2268160 2756096 3772416
4247 3772416 3332608 2943488 3430400 2511360 2913280 1319936 2029568 3179520 2818048
4238 2818048 1137152 2091520 2179072 2680320 1876992 2304000 1762304 2166272 3213824
4229 3213824 1254912 2273280 1845760 2336256 2816512 2291200 2033152 2437632 2692608
4220 2692608 2069504 3128832 2289664 1782272 2278400 2142208 2903040 2184192 3028992
4211 3028992 2457088 2392576 2007552 2589696 1935872 2911744 3769856 2772480 2541568 1479680
4201 1479680 2775040 2386944 1900032 2125312 3274752 2472448 2271744 1316352 1604096
4192 1604096 1943552 2239488 1999872 2412544 1675264 1452032 1594368 2675200 1061376
4182 2310144 1899520 2029568 2148352 2023936 2377728 2019840 3120128 2383360 2082816
4173 2082816 2400256 1833984 2234368 1595904 2472960 2370048 2199552 2486272 1766912 1909760
4163 1909760 1782784 2720768 2452992 1914880 2326528 1349120 2698752 975360 1504768
4154 1504768 2570752 1975296 1580544 1979392 2035712 1863680 1903616 2515456 1383424 1833472
4144 1833472 1626112 2328064 1647616 1815552 2302976 2325504 2159616 1422336 1442816 1544704
4134 1544704 1465344 1650688 1635840 1961472 2097664 1790464 1820160 1688576 2094592 2111488
4124 2111488 1458688 2127872 2687488 2397696 1609728 1127936 2136064 1255424 2360320
4115 2360320 1856000 1897472 893952 1168896 2172416 2189824 1429504 834560 2420736 2052096
4105 2052096 1763840 2009088 1922560 2187264 1627648 1786368 1242112 1350656 1198080 4988928
4095 4988928 1822720 1913856 2649600 2266624 2443776 2158080 2392576 1419264 1710592 1753088
4085 1753088 1869824 2574848 1007616 1697280 377344 999936 2071552 2981376 1795584
4076 1795584 2392576 2034176 1313792 1497600 1540608 1963520 3019264 1720832 1842176
4067 1842176 760832 1855488 1934848 2918400 2228736 2430464 1127424 2891776 2535424
4058 2535424 1787392 1218560 2034176 1886720 2501120 1966592 2118144 2321408 2320384 1123328
4047 2425344 2264064 2598912 2616832 1738752 2364416 2698240 2917888 3091968 2822144 2911232
4037 2911232 3209728 3933184 3486720 2692096 3449344 4364288 3678720 2321408 3789824
4028 3789824 3444736 3430400 3397120 3562496 3050496 3948032 4179456 3359232 3317760 3960832
4018 3960832 4140032 4641792 4200448 3966464 3660288 3880960 3829760 3804160 3485696 3099648
4008 3099648 4018176 3089408 2728448 2670592 2984960 2212864 2369024 2179072 2576896 2813952
3998 2813952 1346048 2215424 3086848 2625536 2301440 2549760 2770432 3029504 1284608
3988 2047488 2797056 2046464 2358272 2602496 1700352 2570752 1983488 2332672 3055104 1743872
3978 1743872 1973760 2314240 2122752 2844160 2343936 2838528 2974208 2521600 1981952 2702848
3968 2702848 2563072 2258944 2557952 2372096 1986048 2393088 2369536 2493952 3407872 1921536
3958 1921536 4608512 3931136 3747328 3807232 3277824 2403840 3546112 2820608 2903040 4074496
3948 4074496 4123136 3458048 3832320 3646464 3304448 4147712 3646976 3358720 2650112 3359232
3938 3359232 3309056 2868224 2185728 3202048 3514368 2328064 2412544 2822144 1895424 1899008
3928 1899008 1965568 1246720 1911808 1124352 1717760 865792 1993216 2577408 2031104 1706496
3918 1706496 1203712 836096 2207744 1247744 1367040 1077248 2380800 2466816 1168896
3908 1587200 1842176 1723392 1727488 710656 1288704 1825280 1061376 2001920 2091008 1659392
3898 1659392 1372160 885760 1443328 1677312 2364928 1048576 1271808 1491456 759296
3889 759296 1643520 1545728 1326592 765440 892928 1091584 1997312 1482752 2103808 1292800
3879 1292800 1143808 2171904 991232 1278976 1550848 2387968 744960 1918464 2300416
3870 2300416 1419264 1371648 794112 1769984 1146880 2468352 2292224 1864192 1460224 977920
3860 977920 1951744 1461760 2173440 759808 1231360 2370560 1247744 756224 2281984
3851 2281984 2001408 2510848 1646080 1949184 2895872 2367488 2184192 2639360 3723776
3842 3723776 3072000 2643456 3274752 2409984 2988032 3420160 1714688 2798080 2256384
3833 2256384 1408512 1618432 2100736 1773568 2894336 1498112 1674752 2903552 1594368
3824 1594368 2039296 1816064 996352 1164800 1657344 2162176 2160640 2280960 2199040 951296
3813 1266688 1219072 2284032 2515456 1675776 2847744 922624 2418176 3101184 2607616
3804 2607616 2440704 2542592 3424256 2377216 2523136 1990144 2044416 2754048 2573824 3045376
3794 3045376 2597376 3272192 4456448 4447744 5004800 4173312 4964352 5057536 4513280 4908032
3784 4908032 4591616 6190592 5296128 4871168 5906432 5122048 5122048 5091840 5163520 5788160
3774 5788160 6429184 5912576 7385600 7085568 9510400 10009088 11312640 11676672 11159040
3765 11159040 10293760 9518592 7339008 5581312 5676032 4817920 4215296 2835456 3711488
3756 3711488 1763840 2946048 2995200 3909632 2102784 2245120 1976320 3339776 2275328
3747 2275328 2937344 1363968 3086848 1906688 2024960 956416 2763776 1491968 1772544
3738 1772544 2291200 2087936 1739264 2314752 1963520 2584064 2329600 2113536 3665408
3729 3665408 2084352 2277376 2652160 2537472 1253376 2070528 2185216 2022400 1394176
3720 1394176 1625600 2384896 1421824 2069504 1765376 1282560 861696 1686016 2676224 1810944
3710 1810944 2012672 988160 1994240 1545728 1324544 1545728 1547776 1367040 2222080 567808
3699 684544 812544 1327616 2226688 2359296 1810944 1931776 2329600 1745920 2203136 1527808
3689 1527808 2397184 1410560 2773504 1402880 1951744 1288704 2873856 1286656 1229824
3680 1229824 957440 737280 1182208 1352192 756736 1122816 1978880 2239488 1595392 1243136
3670 1243136 2530304 1958400 1756160 1055232 896000 787968 2349568 1821184 1781760
3661 1781760 1949184 1553408 504832 1713664 2026496 2305024 1436160 1276416 1843200
3652 1843200 1088512 1740800 1343488 1602560 2306560 1217024 479232 1542144 1519104
3643 1519104 1226752 1541632 2600960 1372160 1400832 1699840 478720 2011136 1329664
3634 1329664 1662464 1710592 3058176 2206208 1805312 1149952 1137664 1104896 1140224 1835008
3624 1835008 1719808 1993728 1824256 1701376 1351168 2358272 2524160 2928640 2793984
3615 2793984 2307584 3389952 2025984 1734144 1348096 711680 2250240 2406912 1833472
3606 1833472 2526720 1581568 1536000 2435584 2039808 2348544 2477568 3463680 1362432 3333632
3596 3333632 2459648 3020800 1285120 1887232 1359360 1997824 2750464 3309056 1642496
3586 4033536 3288064 2992640 2502144 3244032 3257344 2446848 3499520 2734592 2533888 3235840
3576 3235840 2836992 3625472 4630528 4375040 4404224 5232640 5131264 4654080 4773376 6156288
3566 6156288 6007808 5412864 6176768 6732288 6807040 6526464 7750144 8163840 9016320 8948736
3556 8948736 9768448 9835520 9762816 10420224 9443328 9863680 10470912 9923072 10139648 10336256
3546 10336256 11941888 12875264 13687296 13499392 14427136 14389248 15179776 15572992 15647232 16356352
3536 16356352 16915456 18420224 18386944 18587136 20055552 18405888 20114944 20979200 22844416
3527 22844416 24029696 25563136 26988544 29018112 29134336 29556736 29916160 29576704 28661760
3518 28661760 28167680 28025856 25992704 23996416 21767680 18148864 16798208 15503872
3510 15503872 13206528 12318720 10920960 10622976 11282944 9400320 9406976 9508352 7330816
3501 7330816 9544704 7396864 7642112 7537664 8307712 7151616 7879168 8592896 8488960
3492 8488960 7793152 7388672 8549888 6522880 6532608 6151168 5115904 5999616 5581312
3483 5581312 6048256 5131264 4472320 4226560 5095424 5264384 3360768 5628416 5036544
3474 5036544 4704256 5056512 5635584 4040192 4739072 4230144 4527104 4358144 4295168 3902976
3464 3902976 3943424 4421632 4337664 3168256 4793344 3982848 3210240 3368448 2939392 3433984
3454 3433984 3502592 3622912 3902976 2809856 3374592 2927616 3587072 3186176 3349504 3410944
3444 3410944 2561024 3128320 3026432 4012032 3153920 2753024 4099072 2430976 3725312
3435 3725312 3684864 3124736 3517440 2486272 3355648 3678720 3373056 2751488 3754496
3426 3754496 3182592 2369024 1766400 2951168 2218496 2488320 3126784 3460096 3211264
3417 3211264 2366464 1971200 3180544 2057216 2542080 3276800 2836480 2301952 2981888
3408 2981888 3019776 2333696 2356736 3216384 2428928 1764352 2876928 1506304 3665408
3399 3665408 2663936 2670080 2251776 1786368 1998848 2712064 2350080 1789952 2841088 1786880
3389 1786880 2250240 3366912 2887168 3279872 2456576 2175488 3034624 3089920 3037696 3447296
3379 3447296 2519040 3416064 4391424 3974144 3059712 3104768 3441664 3351040 3791360 2952192
3369 2952192 2609152 2539008 2915840 1574912 3052544 3709440 2613248 3899904 3471872
3360 3471872 4697600 3453440 3983360 4858368 6019072 5832192 5967872 6061568 7037952
3351 7037952 6825472 7370240 7073792 7716864 7898624 9082880 10472448 9725952 12552192
3342 12552192 11920896 10533376 9806848 7484416 5555200 5156352 6189056 6030336 6984192
3333 6984192 5730304 5192192 5371904 5784064 6578176 7345664 6764544 6695936 6729728 7077888
3323 7077888 8991232 8100864 9477120 8958976 9007616 10766336 12123648 12548096 11934720
3314 11934720 13464576 12732416 15684096 14819328 15997952 16754176 17168896 18130432 19084800
3305 19084800 20356096 21531648 23400448 25397248 26683392 28591104 31236608 33153536
3297 33153536 36794368 40493568 45624320 48798720 54722048 60444160 66587136 72950784
3289 72950784 80944640 87956992 95090176 102912512 112741888 121005056 132830720 144493568
3281 144493568 157468672 172854784 190826496 211595776 237851136 269730304 311542784
3274 311542784 369684992 446773248 554990080 700798976 878874624 1064846336 1198844928
3267 1198844928 1217257984 1104692224 931846656 757506048 603843072 470899200
3261 470899200 368030720 294236672 242434560 205922816 178433024 155378176 138720768
3254 138720768 126230528 114311168 105120256 96786432 90054656 85228544 81887744 76251648
3246 76251648 73229312 71658496 67276800 65161216 62911488 59598336 58070016 54573568
3238 54573568 52704768 51531776 48661504 48800768 47037952 45691392 43977216 42183680
3230 42183680 41149440 40605696 38053376 37960192 38290432 36954624 35190784 34673152 33604096
3221 33604096 32147968 32097280 30289920 30684672 30198784 29450752 28584448 29326848 28079616
3212 28079616 28969472 27162624 26802688 26489856 25198080 24388096 23751680 21392896 21648384
3203 21648384 20703232 19769856 20336640 20598784 19836416 18068480 18956288 19077120 18734592
3194 18734592 17756672 16548864 15612928 14851072 13663744 14084608 14086656 14488064 15168000
3185 15168000 14806528 14859776 15180288 15698432 16035328 16802816 16633344 15753216 15872000 15374848
3175 15374848 16245248 16383488 15673344 15906304 16148480 15374848 14635008 15696384 15459328
3166 15459328 13471232 14929920 14786048 15056384 13914112 15159296 13589504 13521408 13485568
3157 13485568 13534208 13519872 13514752 13345792 11876864 12183040 11743744 12796928 12115456 13124608
3147 13124608 12190720 12712448 12728832 12539392 11971072 12170240 11664896 12825088 11661824
3138 11661824 11293696 11438080 11384832 10623488 11904512 11401728 11702272 11430400 11226624
3129 11226624 10772992 11836928 11535360 10249728 10263040 9724416 9384960 11044352 9924608
3120 9924608 10856960 10498560 10643456 10603520 10929152 9686016 9600512 10516992 10173952 10394112
3110 10394112 10601984 10969088 10994688 11238400 11079168 10691072 10279424 9833984 9912832 9783296
3100 9783296 9210880 10074112 10257920 9860608 10121216 9164800 8094720 10339840 8823296
3091 8823296 9795072 10533888 9817088 9369088 9367552 8407040 8110592 10296832 9673728 9415168
3081 9415168 9796608 9923584 10971648 11134464 11395584 12361216 12782080 13698560 13702656 12844544
3071 12844544 12703232 13058560 13337600 11415552 11908608 10957824 10841088 10382848 11188736
3062 11188736 11500032 10821632 10370560 11402240 11551232 11078144 10650624 10555904 10470912 12013568
3052 12013568 11662336 12313088 11642880 12223488 11686912 12537344 14164480 14619648 14963712
3043 14963712 15511552 16798720 16933376 17042432 17609728 18337792 18728448 18875392 20117504
3034 20117504 20740608 20521984 19429888 21229568 21987840 22244352 21908992 25250816 25183232
3025 25183232 23969792 24847360 26300928 26186752 26996224 28663296 29435392 27982336 26913280
3016 26913280 26592768 23623168 22172160 20012544 19533312 17384960 18198016 15590400 15803392
3007 15803392 15236096 16134144 14301184 14884864 14689280 14407168 14846976 14945792 15268864
2998 15268864 15190016 16064512 15885312 15355904 16232448 15822336 14791168 15633920 16067072
2989 16067072 14608896 13613056 13594112 14170112 13895680 13544448 12936192 12448256 12636672
2980 12636672 12341248 11095552 10901504 10414592 10612224 10331136 10088448 9850368 10050048
2971 10050048 10122752 9247744 8847872 9408000 9793536 9563136 8476160 9767936 9240576
2962 9240576 8724480 8051712 8560640 8455680 7739392 8791040 9186304 8083456 7730688
2953 7730688 9216512 9009664 8460800 9100288 8700928 8181248 8716800 8511488 8174080
2944 8174080 9013760 8012800 8104448 7424000 7356416 8001024 7343616 8014848 7694336 7604224
2934 7604224 8421888 7640064 7788544 7044096 8915968 6753792 7313920 7603712 6795776
2925 6795776 8346624 7808512 7864320 9218560 8133120 7839232 8437760 6355968 7677952
2916 7677952 7110144 7079936 7437824 6584320 6982656 6555136 7675904 8932352 7629312
2907 7629312 8892416 8715264 8864256 8164352 7418368 7452160 8088064 8364032 7355904
2898 7355904 7261184 6257152 7497728 7309312 6242816 7725056 6798336 6779904 6845952
2889 6845952 6982656 6699520 6919680 7156736 7683072 5834752 6064640 6678016 6944256
2880 6944256 6173184 6585856 6214656 5419008 6569472 6204416 5580800 6014976 6176256
2871 6176256 6790656 5706752 7240192 6300160 6170624 7430144 6341632 6981632 7054336
2862 7054336 7446016 5927936 8199168 7180800 7630336 8080896 7874560 6717952 8042496
2853 8042496 9298944 8758272 10000384 11440128 14742016 19445760 25137152 24111616
2845 24111616 23492608 25766912 24406528 18107392 13551616 12361728 9707008 9257984
2837 9257984 8216576 6938112 7948288 7079424 7124992 6548480 6943232 7463936 6348800
2828 6348800 5710848 7433216 6291968 7655424 6213120 6968320 5898240 7714816 7413760
2819 7413760 6663680 6525952 5870080 7278080 6984704 6794240 6467072 7510528 6829056
2810 6829056 6303744 7532544 6912000 7686144 7639040 6857216 7018496 7451648 7675904 7118848
2800 7118848 7769088 7495168 7371264 7673856 7898624 8048128 7715328 7625728 7815680 8372224
2790 8372224 10227200 9066496 8593408 9231360 9678848 9100800 8896512 8527360 10345984
2781 10345984 10162176 9558016 9249280 11306496 10589696 10983424 12120576 12012032 12706304
2772 12706304 14386176 15215104 16980992 18113024 17964032 18153472 16495616 15430144 13983232
2763 13983232 12496384 10810880 9577472 9938944 8321024 7766016 8227840 8228352 7411200
2754 7411200 7610368 6971904 8423936 7172096 7884288 7227904 7094784 6457344 7029760
2745 7029760 6897152 6654464 7881728 6775296 6574080 6352896 7265280 6749696 7026176
2736 7026176 6243328 5540864 6412288 6597120 5418496 6055424 6992896 5721600 5807616
2727 5807616 5981184 5989888 6657536 6598656 5830656 5866496 5736448 6111232 5622272 4964864
2717 4964864 6456320 5194240 5591040 5748224 5198336 4886016 6163456 5519872 6603776
2708 6603776 5277696 6406656 5609472 6124032 5668864 6273024 5665280 5600768 5003264
2699 5003264 5325824 4751360 4140544 5692416 6117376 5765632 5574656 4913152 4793344
2690 4793344 5117952 5250048 5162496 5337088 3984384 5199360 5783040 6078976 4880384
2681 4880384 4693504 4964352 5114880 5510144 6259200 5088256 6145024 5403136 5878272
2672 5878272 6164480 4788224 5116928 5026304 5037568 4158464 4419584 5258752 4981248 4355584
2662 4355584 5727744 4366848 4638208 4229632 4488192 4364288 4643840 5236224 5272576
2653 5272576 4942336 5350912 4838400 5367296 5678080 4234240 5371392 4807168 3749888
2644 3749888 4476928 4851200 4436992 5657088 4006912 5684224 6057984 5537792 6065664
2635 6065664 6018048 6782464 5828608 8690176 9084928 14196736 20512768 31662080 35532288
2626 35532288 23219200 16305664 14297600 9934848 8378880 7243776 6979584 6872576
2618 6872576 6797824 6066688 6985728 6529536 6032384 6443008 5075968 5136896 4409856 4659200
2608 4659200 5038592 5895680 4794880 5676544 4532736 5295104 4784640 3783680 4971008
2599 4971008 4742656 4672512 3732480 4072960 4668928 4560384 3484160 5605376 5868544
2590 5868544 4493312 4775424 4370432 4210688 4606464 5139968 4359168 4197376 4311552
2581 4311552 3230208 4274176 3579904 4132864 3933696 3247616 3795968 4801024 2929152
2572 2929152 2707456 2562048 2775040 3613696 2895872 4004864 2997248 3666432 3942912
2563 3942912 4105728 3751424 4606464 4588544 4182016 3544064 4358656 5495296 4661248 5606912
2553 5606912 4166144 5458944 4911104 5292032 5052416 5933568 6071808 6921728 7292416
2544 7292416 7699456 8542720 10601984 13633024 18882048 30889984 47996416 47104000
2536 47104000 33475584 25597952 19934720 15967232 15790080 16984576 20598272 29226496
2528 29226496 39094272 31974912 22646784 21123072 17158144 16994816 19921408 25831936
2520 25831936 38171136 52022784 44403200 29953024 25934848 20721664 17932288 18240512
2512 18240512 21407232 29124096 37192704 31599104 22626304 19167744 15896064 13501952
2504 13501952 13615104 15028736 18020352 23742464 20329984 14721024 13546496 10783232
2496 10783232 9492480 9207296 8727040 8396288 8318976 7970304 7804928 8004096 6887936
2487 6887936 8107008 8514048 7798272 7640064 7961088 7716864 8251392 8961536 8564224
2478 8564224 9161728 9133056 8434688 9460736 8979456 8051200 8343552 7647744 7518208 7921152
2468 7921152 7415808 6310912 6486528 6291456 6246400 5854208 6245888 5317120 4828160 5356544
2458 5356544 4532224 5063168 4886528 5716992 4738048 4576256 5316096 4646400 4995072 4983808
2448 4983808 3437568 4153344 4121088 5043200 4167680 3625984 3857408 4110336 5549568
2439 5549568 4322816 3869696 3960320 3855872 3633664 4021760 4135936 4674048 3395072
2430 3395072 3581952 3236864 4321792 3949056 3142656 4495872 3807232 3035136 3868160
2421 3868160 4045824 3187712 3746304 4086272 4301824 3984896 3665920 3810816 3929600 3075072
2411 3075072 3758592 2552320 4150784 3708928 3342848 2903552 3702272 3767296 4037120
2402 4037120 4305408 4272640 3629568 3613184 3855872 3446272 2992128 3981312 5187584 2867712
2392 2867712 2718208 3267584 3676160 3589632 2590720 4026880 2541568 3552256 3412480
2383 3412480 2532864 3807744 2271232 3289088 2750464 3791872 3516928 3124224 3391488
2374 3391488 3728384 3278336 3587072 3102208 2468864 3309568 3878400 3126784 3185664 3002880
2364 3002880 3162624 3749888 3174912 2902016 2660352 2913280 1993216 3171840 2689024
2355 2689024 3670528 3904000 3125248 2441728 3782656 3104768 3319808 3715072 3377152
2346 3377152 3614720 2493952 2663424 3046400 1457152 2471936 2331136 2739712 2688000
2337 2688000 2494464 3046400 2267136 2312192 2950656 2828800 2721280 3233280 3202560 2066944
2327 2066944 3147264 3824128 1897984 2465280 3883520 3056128 3125248 2754560 2765824
2318 2765824 3403776 2233344 3489280 2469376 3313664 3814912 3309056 2412032 1880576
2309 1880576 2948608 1953280 3460096 3729408 3180032 3613184 4177408 4123648 2950144
2300 2950144 3473408 3446272 3532800 4125184 3348992 2959360 3353088 4852224 3558912 4226048
2290 4226048 4560384 4056064 5105152 4108800 4449792 4524032 4466176 4020224 3468800 4873728
2280 4873728 5172736 3711488 4657152 5444096 4574720 3534848 4634112 4383232 4904960
2271 4904960 5240832 4807680 5564928 5198848 4619264 5443072 4437504 5647360 4789248
2262 4789248 4836352 4958720 4831232 4087296 5955584 5153792 4599808 5675520 5437952
2253 5437952 5104128 5428736 4874752 4839936 4507136 4471808 4137472 3569664 3421696 3571712
2243 3571712 4227584 4459008 3971072 4273152 4113408 4573184 3902464 4410880 3055104
2234 3055104 4827136 4028416 3895296 3395072 4241920 3932160 4836864 3971072 3911680 3979776
2224 3979776 4055040 5075456 4237312 3944960 4205568 3886592 3997184 5006848 4496384
2215 4496384 3792384 4296192 3785728 4078080 2872832 3544064 2407936 3598848 3043840
2206 3043840 3483648 3493376 2614272 3400192 4301312 3781120 3565056 4114432 3088384 3520512
2196 3520512 4627456 2641920 3606528 3499520 4123648 2789888 3443200 3322880 3991552
2187 3991552 4023808 4222464 3562496 4239872 3433984 2667008 3671040 4826624 3243008
2178 3243008 3983872 2411520 3904000 2798592 3753984 2827776 2576384 3438592 3628032
2169 3628032 4040192 3913216 3819520 2904576 4044288 4407808 4303360 3975680 3086336 3261952
2159 3261952 3936256 2940416 2929152 3307520 3644416 3765248 3174400 3132416 3689472 3069952
2149 3069952 4137472 4166144 3927552 3783680 4031488 3972096 4237312 4078592 4730368 4098560
2139 4098560 2387968 4345856 4036096 4047872 4007424 4489728 4108288 3840000 3731456 4334592
2129 4334592 3687424 4151808 3696128 4977152 4206080 4842496 3775488 4171776 3825152
2120 3825152 3786240 4445696 3463168 4033536 3227648 2539520 4017152 3312640 2922496 3228160
2110 3228160 2930176 3037696 4082688 2935808 2300416 2606080 3558400 3245568 4097536
2101 4097536 3702272 3378688 2875904 2635264 3983360 4201472 4101632 3188736 2403840 3468288
2091 3468288 3628032 3739136 3745792 3213312 2868224 3494400 3647488 3136000 4643328 4209152
2081 4209152 3474944 3644416 4462592 3840000 4097024 4827648 4261376 3964928 4468224 4873216
2071 4873216 4058624 4515328 4548096 4475904 5363712 5306880 5790720 5543936 6325760 6729728
2061 6729728 6640128 7760384 6625280 6870528 6813184 6899200 6204416 6656000 4833280 5831680
2051 5831680 5787648 6662144 5516288 5958656 5339136 7015424 6806528 5989888 5937664 6302208
2041 6302208 6118912 7889408 7550976 7223296 7428608 7817216 7591936 7607296 7241216 7291392
2031 7291392 7038464 7748608 6332416 7488000 6439936 7422464 6966272 6773760 8344064
2022 8344064 7062528 7809024 8944640 6513152 6927360 6716928 6371328 6406144 5926912
2013 5926912 6545920 6355968 6089728 5677568 6047232 7029248 6763520 6279168 5679104 5319168
2003 5319168 5086720 6084608 5148160 6108160 6080512 6317056 4891136 5712384 5548544 6462464
1993 6462464 5534720 5385728 5534720 5678080 5078016 3774976 4460032 4745728 5335552
1984 5335552 4233216 5113344 4567040 5962752 4187648 5491712 3813888 6026240 4849664
1975 4849664 4960768 5041664 4875776 5089280 5179392 5145088 4732416 5047296 5097472 5677056
1965 5677056 4542464 5697536 5965824 5799936 5581312 5746176 5245440 6044672 5376512
1956 5376512 5364224 4922368 6235136 5778944 6450176 5470720 4941824 5660672 5824000 5591552
1946 5591552 6245888 6146560 6337536 6275072 5367296 6131712 5834240 6339584 6138368 6746112
1936 6746112 6907392 7772160 7089152 6142976 7108608 7720960 7601664 7695872 8494080 8419328
1926 8419328 7313920 8887296 8503296 8628736 8924672 8497152 7931904 8537088 8409600
1917 8409600 8204288 8035328 8912896 8782336 8386048 8334336 8670720 8227328 8321024 8768512
1907 8768512 8287744 9460736 7673856 8840192 8502784 8681984 8141312 8938496 8170496
1898 8170496 8417280 8345600 7790592 9052160 9239552 9046528 9017344 8043520 8536576 8771584
1888 8771584 9778176 9545216 10125312 8740352 8940032 8981504 9394176 9259520 9198080 9041920
1878 9041920 8931328 9157632 9625600 9929216 8365568 8904704 8905216 8811520 8797184 8553472
1868 8553472 7638528 9755136 10933760 13883392 20852736 27330560 20960768 15286784
1860 15286784 15003136 11816960 9337856 9364992 8074752 9046528 9103872 8538112 7200256
1851 7200256 7090688 7486976 7673344 7084544 7586304 7214080 6753792 7820288 7286784
1842 7286784 7319552 6037504 5765120 7412224 5718016 6454784 6334976 6462976 5813248
1833 5813248 5498368 6348288 5658624 5561856 5890048 5119488 5222912 5962240 4567040 6343680
1823 6343680 6288896 5269504 5127680 5593088 5458432 5795840 5215744 5300224 4739072 6431232
1813 6431232 5112832 6208000 5416448 5745152 5554176 5088768 4896768 6000640 5594624
1804 5594624 5949952 6169088 5481984 5800448 6947328 5702656 6597120 5456896 5468672
1795 5468672 6623232 5434368 6728192 5850112 6984704 5982720 6791680 6656512 6171648
1786 6171648 6178816 7503872 6433792 8092672 7497728 7912448 7004672 7208960 6814208
1777 6814208 7611392 7776256 7155200 7759872 8591360 8302592 7725568 8104448 8345088 6961664
1767 6961664 8119808 7477760 7259136 6644736 6779392 6784512 6458368 5610496 5763072 6166528
1757 6166528 5954560 5787648 6260736 6734336 6177280 7437312 6769664 5913088 7010816
1748 7010816 6574592 7424512 7411712 8006656 7771648 7207936 8191488 8222208 7246848 8342016
1738 8342016 8107520 8731136 7709184 8216576 7849984 8199680 6855680 8823808 8399872
1729 8399872 8644608 9261056 7807488 8647168 8546304 9154560 8400384 9425920 9375744
1720 9375744 9511424 9238016 9538560 10101248 9039360 9588736 10181632 10401280 11201024
1711 11201024 10122240 11646464 12314624 11380224 11397120 13015552 12905472 13005824 12054016
1702 12054016 12836864 12805632 13207552 12189184 12184064 11969536 11807232 10694656 11222016 11193344
1692 11193344 10247680 11004928 9483264 10560000 10397184 10304512 10302976 10006016 10880512 11642880
1682 11642880 11240960 10794496 11112960 11062784 10332672 11012096 11300352 9948160 10442240
1673 10442240 9253888 11078656 9437696 10904064 11113984 10779648 9485312 9758720 9742336
1664 9742336 10568192 10108416 8590848 9460736 10303488 9439232 9098752 9509376 9284608
1655 9284608 8681984 8052736 7954432 8859648 7854080 8584704 7351808 7350272 7768064 8040960
1645 8040960 7250944 6224384 7413248 7080448 6534144 6932992 6580736 6279168 6935552
1636 6935552 6001664 6483456 5652992 5752320 5398528 5739520 4659200 4998144 5308416 5556736
1626 5556736 5547008 5081088 5292544 3840000 4301824 5050880 5626880 5277184 4228608 4936704
1616 4936704 5316096 5210112 4537856 4981248 4563968 4034048 4606976 3345920 5284352
1607 5284352 4767232 4482560 4907008 5262336 5355520 4936192 5522944 6009856 5655552 5965824
1597 5965824 6297600 6255616 5660160 5780480 5198848 6133248 5943296 6171648 5539328 5337600
1587 5337600 6321664 5725184 6663168 6392832 6285312 7563776 6865920 6747136 5957632
1578 5957632 6585856 8400896 6659072 8019968 8436736 7581184 8914432 9488896 7661568
1569 7661568 8448512 8303104 9026048 9660928 10105344 10123776 10708992 10612736 12337664 11771904
1559 11771904 14317056 13494272 14839808 15843328 16495616 17722880 18696192 19937280 22745600
1550 22745600 23076352 25431040 26684416 27593728 29483008 29388800 31291392 32710144 32235008
1541 32235008 33240064 33361920 33583104 35937792 36658688 38106624 40495104 39845888 42331648
1532 42331648 45615616 47238656 50274304 55347712 57575424 60774912 66830848 75139072
1524 75139072 81956864 89654784 100178944 109635584 115705344 118610432 116930560 114874368
1516 114874368 109574144 101410304 92272640 81501696 70846464 62746112 55767552 50192384
1508 50192384 45946368 43121664 41005568 37953536 35134464 34274816 32936960 31028736
1500 31028736 30104576 28980736 28130816 26037248 26412032 25536000 24607744 24267776 23569408
1491 23569408 22889472 23070208 21948928 21586944 22223872 21069824 20062720 20075520 19583488
1482 19583488 20524544 18963968 18288640 18232320 17964544 18136576 18035200 17428992 16492544
1473 16492544 15884288 15543296 16402944 16454144 14172672 14838272 13939712 14779904 14209536
1464 14209536 14025728 14895104 14121472 13606912 14028800 13153280 14540288 13160960 13536256
1455 13536256 12966400 12645888 12817408 12152832 11940864 12284416 11569664 10697728 10798080
1446 10798080 11060736 9718784 9516032 10178560 10671616 10404352 10311680 9598976 10092032
1437 10092032 10243584 9348608 10423808 10506240 9918976 9163264 9117184 9389056 9478656 10183680
1427 10183680 9641984 9707520 8546816 8711680 8909312 9108480 8321024 8949248 9722368
1418 9722368 8905216 8434176 7787520 8053760 8409600 8818688 8483328 8824320 8087040 8175104
1408 8175104 9024000 8104448 8321536 7945216 9290752 8951296 8287744 7776768 7084032
1399 7084032 8050688 6563328 7214080 6744064 8448512 8257024 9045504 8080384 8664064
1390 8664064 8752128 8813568 8898560 7945216 10174464 9450496 8722944 9742848 9630720 8376832
1380 8376832 9893888 10111488 9169408 9670144 9962496 9561088 9972224 11082752 11222016
1371 11222016 12441088 13155328 15043584 16341504 16236544 15634944 14786048 14157824 14852608
1362 14852608 14130688 13270016 12960256 12339200 12673536 12623872 13514752 12649984 12709888 12193792
1352 12193792 12313088 12683776 12187136 12590592 12040704 11367424 11958784 12121600 11923968
1343 11923968 11645952 11827200 11883008 12792832 11640832 12208128 12545024 12162560 13733888
1334 13733888 14691328 15230976 15649280 16706560 16393728 16694272 17839616 18885120 18294784
1325 18294784 18105344 16802304 16650240 14983680 14377472 13818368 14015488 13321728 13733376
1316 13733376 13423104 13107712 13285376 11796992 12772864 12872192 12665344 13635072 11631104
1307 11631104 12072448 12945920 13504512 13339648 14782464 15822336 17115136 17393664 17545216
1298 17545216 18507264 17893888 18518528 16206336 16733184 14763520 15504384 13999104 13679616
1289 13679616 13556224 13121536 14084608 14181888 12685312 13089792 12331520 11756544 12122112
1280 12122112 13003776 12130816 12777984 10857472 11823104 11574272 11154944 11290112 11482624
1271 11482624 11789312 9972224 10018816 10511872 10530304 10698240 8667648 10118144 9350144
1262 9350144 8651776 7512576 8265216 8188416 8470016 8591360 8903168 7127552 8351232
1253 8351232 8508928 7990272 8817152 8084480 7717888 8334848 7065088 7431168 8065024
1244 8065024 7597568 6961152 7669760 7204864 7969280 7265792 7565312 5774848 7037952
1235 7037952 6735360 8215552 6659584 6750208 7053824 6614016 6590976 7074816 5590528
1226 5590528 7237120 5716992 6660608 6608896 6699520 5873152 5511680 5740544 5938688 6256640
1216 6256640 5980160 5935104 5473792 5601280 5463552 5929472 5781504 6526464 5640704 5714432
1206 5714432 5868032 5003264 6924800 5285376 6175744 5137408 5696000 5570560 5889024
1197 5889024 5435904 4501504 6052352 5207040 5354496 4727808 5647360 5294592 4651520
1188 4651520 5969408 5495296 5326848 5346304 5196800 4716032 4962816 4975104 5282304 4655616
1178 4655616 5753856 4826624 4725760 5560832 5104128 3564544 4652032 3965952 4660224
1169 4660224 5040128 4734464 4538880 4657152 5627392 3716608 4698112 4822016 5213184
1160 5213184 4586496 3637248 4054016 6269440 5652480 5065728 5018624 4431872 5979648
1151 5979648 5421568 4661760 4306432 4772352 5742592 5235200 5875712 5274112 3558912
1142 3558912 4579328 5466112 5005824 4603392 5739008 4852224 5200384 5591552 5172224
1133 5172224 5193216 4502016 4379136 4445696 5180928 4414464 4125696 4695552 4097536 4658176
1123 4658176 4069888 4235776 4349952 4207104 5149696 4957184 4397568 3603968 4447744 3922432
1113 3922432 4115456 3744256 3724288 3567616 4282368 3244032 3934720 4157440 4534784 3564032
1103 3564032 3481600 3856896 4890624 4495872 3644416 4815360 3404288 4767232 4289536
1094 4289536 4376576 3957248 3069440 4449792 4696064 3655680 3618816 4455424 4369408 4513280
1084 4513280 4073984 4954624 3683328 3896832 2608128 4208128 4084224 3936768 4145152
1075 4145152 4383744 4292096 4302848 4413440 3180544 4001280 4929024 3467776 4296192 3933184
1065 3933184 4739072 3868672 3016704 4268032 4343808 4815360 3476992 3459584 3218944 4820480
1055 4820480 4193280 3355648 3823104 3799552 3145216 3579904 2976768 4353024 4346368 2811904
1045 2811904 4414464 4226048 4511744 3294208 4187136 3711488 3892736 3599872 5372928
1036 5372928 3864576 3428352 3891200 4679168 4389888 3273216 3578880 3845120 3817984
1027 3817984 4005888 4186112 4277248 3997184 4390912 4364800 4022784 4887552 5131776 3503104
1017 3503104 3771392 3506176 3730944 3443200 4499456 4279296 3044352 3596800 3193856
1008 3193856 3261952 3296768 3052032 2183680 2372608 2415616 2784256 1899008 2987008 2311168
998 2311168 3496960 3490304 4261376 2119680 3547648 3276800 3003904 2945536 2846720 2595840
988 2595840 2680832 3686400 2836480 1992192 2258432 2830848 2238976 2688000 2615808 2372608
978 2372608 3133440 2753536 3436544 1726464 2220544 2497024 2664960 1807360 3645952
969 3645952 2830336 3019776 2859520 2726912 1966592 2094592 2408960 1671680 2425856 2567168
959 2567168 4293632 2696192 2724864 1430016 2407936 1434112 2441216 1495552 1200128
950 1200128 2161664 2369024 1413632 1164288 2061312 2186752 2160128 1448448 1269248 1339904
940 1339904 769536 778240 2351616 1725440 1517056 1722368 1212928 2591744 1388544 2109440
930 2109440 1917952 2145792 1379840 1014784 1636864 923648 233472 772608 655872 937984
920 937984 1632768 973824 1056256 -404992 770560 1214976 -72192 70656 368128 1272320
910 1272320 1222656 1289728 1394176 1372672 2631680 1005568 3039744 4145152 4298240 2267648
900 2267648 2996736 1931776 2084352 2180608 2275840 2286080 2097152 2842112 2993664 2839040
890 2839040 3621888 5286400 8313344 19492352 42025472 84667392 81204736 48697344
882 48697344 42161152 29409792 20325376 17527808 15121408 13113856 12116480 11243008
874 11243008 9111040 9733632 9027072 8397312 9117696 7523840 8605696 8915968 9091072
865 9091072 9090048 7592960 7816192 7493632 6300160 5703168 5615616 6036480 5781504 5047296
855 5047296 5724160 6065664 5350912 5311488 5021184 5623808 5933056 5413888 4950528 4566528
845 4566528 5406720 5289984 4876288 4855296 3638272 5606912 5038592 5344256 5016576 4587008
835 4587008 4924416 4626944 5294592 4443136 4028416 4526592 4299264 4455936 4943360 4658688
825 4658688 3591168 4274688 4163584 3530752 3860992 3707392 3474432 3163136 3880960 3757568
815 3757568 3731456 3165696 4212224 3809792 3691520 4556800 3355136 3738624 3742720 3133440
805 3133440 3584000 2709504 4223488 3801600 3986432 3378688 2605568 2117632 3653120
796 3653120 3506176 4540928 3749888 2683904 2943488 3149824 2907136 2956800 2997248 2391040
786 2391040 3494400 3660800 3029504 3281408 3404288 2497536 3575296 3096576 3392512
777 3392512 3270656 1478144 4256256 3063808 2128896 2393600 3439104 3049472 2333696
768 2333696 2987008 2785280 3479552 2421248 3418112 3679744 2098176 2424832 2398720 2972160
758 2972160 2574336 1728000 3020288 2470912 3694592 2617344 2416640 1724416 3704832
749 3704832 2199040 4020224 2647040 3215872 3484160 2381312 2337280 2564096 2518528
740 2518528 2037760 3110400 2464256 2961408 1493504 3225600 1883136 2860032 2958336
731 2958336 1565696 3303936 2658304 2999808 2746368 2530816 1416192 2432000 2679808
722 2679808 2546176 1426432 3193344 3214336 2795520 2512896 2974720 2935296 2976768 1886208
712 1886208 2741760 2186240 3358208 1603072 2552320 1777664 2210816 2074112 2369536
703 2369536 2393088 2532352 2019328 2494976 1751040 2348544 1846272 1991168 3204608 3125760
693 3125760 2468352 1612800 2675712 2006016 2411520 2686976 3053568 1670144 2576384
684 2576384 2857984 1764864 1416192 2393088 2479104 3109888 2589696 2421760 1656320 2097664
674 2097664 2077184 2293248 2289664 1934336 709632 1890304 1865216 3123712 989184 2137600
664 2137600 2694656 2435584 1014784 2897920 2056192 2721792 1546752 2194944 2650624
655 2650624 1850880 1692672 2468352 2900480 2391040 1341952 1694720 2383360 1837056 2859008
645 2859008 3028992 2167296 2448384 2576384 3114496 3362304 3048448 3558912 3366400 2260480
635 2260480 3129856 2623488 2916864 2314240 2683392 2530816 2473472 2349568 2221056 2637824
625 2637824 3177984 2461184 2448384 2355200 1873920 2490368 2050560 2436096 1369088 1966592
615 1966592 2057216 1909248 1480192 1476608 2556928 2016768 1991680 1866752 2136064 2518528
605 2518528 1809408 1936896 2365440 1777664 1818112 1312256 2355712 1916928 2691072 2374144
595 2374144 1724928 1357824 1901056 2841600 1479168 1712640 1733632 2196480 1103360 1692160
585 1692160 1867776 2264064 1662976 2187264 2341888 1864192 2376192 2422784 2104832 2869248
575 2869248 1909760 1844224 2091520 2091008 1713152 1943552 2107392 2046976 -118272 2321920
564 2300928 2604544 1352192 1987072 2407936 2427392 1158144 1458176 1071104 641536 2134016
554 2134016 2705408 1700864 1483776 2389504 2798080 1535488 1833984 2494976 939520
544 1962496 1352192 1436160 1609728 2009088 2003456 1353728 1882624 1837056 2314752 2002432
534 2002432 1391616 2631680 1867776 1891840 2134528 1339392 2758144 2216448 1504768 1191936
524 1191936 1662976 879616 964096 1701376 1337344 897024 431616 1832960 2036224 266752
513 1336832 168960 1191424 2564096 1540096 1405952 2144768 1489920 958976 2096128
504 2096128 1373696 2352128 1329152 593408 1783296 1470976 1326080 1148928 1187840 940544
494 940544 1090048 1547776 1917952 1067520 1758720 1691136 1800704 1250816 1206272 1542656
484 1542656 1942016 1267200 916992 1230336 1546240 529408 1460736 1363456 541696 1425920
474 1425920 1757696 1415168 703488 903168 1766912 1408512 714240 1112064 1024000 818176
464 818176 2258432 1510400 1997312 1986048 2554368 2088960 1175552 1288192 -123904 1661440
453 1550336 2055680 1636352 1611264 1182208 734208 1491968 1157632 1212416 2000384 975872
442 1110528 1380864 1428480 479232 328704 1502208 1401344 1673728 1132544 1083392 1336320
432 1336320 1855488 1339904 1693184 918016 1655296 706560 908288 1099264 2274304 1401344
422 1401344 1369088 960512 1332736 1985536 1608192 1541120 903168 913408 510464 1519616
412 1519616 2589184 1573376 1017856 1328640 2171392 795136 195072 1275904 2527232
403 2527232 1698304 1205248 1118208 702976 1424896 1943040 632832 1516032 1004032 1051136
393 1051136 2010624 1734656 1516032 1878528 1134080 1850368 1374208 1880576 1778688 2607104
383 2607104 1644544 1587200 1486336 999936 1389056 1711616 1733632 2317312 1482752 1636864
373 1636864 1651712 73728 1476608 1763840 830464 1186304 391168 1615360 1138688 1670144
363 1670144 899072 294400 1075712 1091072 1181184 1609216 1111040 1842688 1482752 823296
353 823296 347648 1829888 1215488 1321984 1249280 1156096 291840 -40960 1081344 631808
343 631808 2212864 1051136 928768 1733120 1026048 1584640 1118720 808960 1698816 191488
332 1777152 915456 1398272 477696 1404416 1510400 1860608 593408 1324032 941568 818688
322 818688 1162240 1269760 402432 1576960 1119744 -203776 782848 1515008 885760 601088
312 601088 -157696 635904 660480 1567744 1718272 880128 326656 985088 566272 1186816
302 1186816 1018368 1141760 1305088 1820672 307200 1475584 393216 537088 1125888 562176
291 685568 1007104 1850368 1085440 270848 -66048 1719296 -14336 1132032 805888 404480
281 404480 1508352 1367552 1276928 432640 911360 1315840 676864 1602560 1279488 165888
270 586240 1089024 1636864 728576 1954304 621056 660480 2209792 1354752 1559040 1576960
260 1576960 90112 1186816 508416 998912 -335360 1228800 730624 781312 289792 1223168
250 1223168 -94208 974848 1236480 825344 1090560 443904 413696 694272 624128 1124864
240 1124864 629248 797184 1468416 1433600 247808 1047552 868352 788992 349696 318976
230 318976 1158656 863744 118272 728576 312320 1398784 806400 1519104 878080 676352
220 676352 1535488 1386496 -131584 511488 -4608 31744 830976 965120 1150976 159744
209 941568 228352 -520704 940544 1810432 943616 274432 337408 749056 1976832 1389056
199 1389056 356352 1574912 800768 446976 873472 918528 1126912 591360 931840 966656
189 966656 -205824 150528 621056 410112 1226752 481792 502272 599040 894976 443392
178 126976 1204224 917504 1107456 965632 495104 216576 843264 171008 745984 234496
167 -157184 48640 778752 -144384 773632 702464 882688 -941056 824832 1067520 -211968
156 -857600 718336 715776 1318400 -197632 1031680 922624 1333760 1196544 -60416 58368
145 1144832 501760 437248 437760 1072640 412672 777216 1058304 704000 299008 -165376
134 88064 365056 -59392 236032 881152 1369600 1027072 990720 220160 345600 102912
123 714240 -45056 -263680 475136 799232 205312 1147904 -119296 1485312 1223680 -601600
112 41472 -327168 171008 -287744 387584 84480 -29696 133632 97280 -350208 663040 545792
101 545792 -230400 747520 600576 -632832 -172032 574976 1249792 38400 196096 69120
90 166400 420352 537600 1338368 583168 -694784 99328 379904 669184 275968 455680
80 455680 1903104 484864 250368 -7680 1158144 129024 -897536 -177152 -780288 1117696
69 -259072 -561664 820736 111616 1014272 -117248 199680 277504 -13312 195584 858624
59 858624 -465408 449536 910336 1428992 989184 375808 -105984 223744 70144 -336896
48 222208 437760 342528 350208 -15872 -720896 422400 629248 21504 1162240 519168 524800
37 524800 882688 266752 278016 357376 655872 -418304 136704 70144 665088 -759296 -75264
25 -227840 606208 487936 -525824 598528 -958464 674304 -665600 158208 -538624 -783872
15 -783872 303616 446464 1221632 -801280 -64512 -529920 -326144 147456 905728 661504
5 661504 -268800 133120 191488 -613376 -586752
0 -586752
##END=
