##TITLE=1380
##JCAMPDX= 6.0         $$ Bruker NMR JCAMP-DX V2.0
##DATA TYPE= NMR SPECTRUM
##DATA CLASS= XYDATA
##ORIGIN= NUTS EXPORT
##OWNER= Administrator
$$ 1.72 TOPSPIN		Version 2.1
$$ 2016-02-23 12:21:55.246 -0800  Administrator@X
$$ Compression mode = diff/dup
##.OBSERVE FREQUENCY= 90.275459
##.ACQUISITION MODE= SIMULTANEOUS (DQD)
##.ACQUISITION SCHEME= undefined
##.AVERAGES= 16
##.DIGITISER RES= 22
##SPECTROMETER/DATA SYSTEM= 
##.PULSE SEQUENCE= zg30
##.SOLVENT NAME= None
##.SHIFT REFERENCE= INTERNAL, None, 1, 14.72299
##AUDIT TRAIL= $$ (NUMBER, WHEN, WHO, WHERE, PROCESS, VERSION, WHAT)
$$ ##TITLE= Audit trail, TOPSPIN		Version 2.1
$$ ##JCAMPDX= 5.01
$$ ##ORIGIN= Bruker BioSpin GmbH
$$ ##OWNER= Administrator
$$ $$ E:/data/jwist/nmr/1380/1/pdata/1/auditp.txt
$$ ##AUDIT TRAIL=  $$ (NUMBER, WHEN, WHO, WHERE, PROCESS, VERSION, WHAT)
(   1,<2016-02-23 09:16:47.308 -0800>,<Administrator>,<X>,<jcamp>,<TOPSPIN 2.1>,
      <fromjdx created from
       E:\data\jwist\nmr\uniandes\1380
       data hash MD5: 8K
       B0 71 3F 34 53 19 C2 08 34 C4 07 6E 39 77 3C 69>)
$$ ##END=
$$ 
$$ $$ hash MD5
$$ $$ F5 F4 66 7B A2 7B DA F0 F8 B6 32 A0 AF A0 1A 00
##$RELAX= 
$$ Bruker specific parameters
$$ --------------------------
##$DU= <E:>
##$EXPNO= 1
##$NAME= <1380>
##$PROCNO= 1
##$TYPE= <nmr>
##$USER= <jwist>
##$ACQT0= 0
##$AMP= (0..31)
100 100 100 100 100 100 100 100 100 100 100 100 100 100 100 100 100 100
100 100 100 100 100 100 100 100 100 100 100 100 100 100
##$ANAVPT= 1
##$AQSEQ= 0
##$AQ_mod= 3
##$AUNM= <au_zg>
##$AUTOPOS= <>
##$BF1= 90.275459
##$BF2= 400.02
##$BF3= 400.02
##$BF4= 400.02
##$BF5= 400.02
##$BF6= 400.02
##$BF7= 400.02
##$BF8= 400.02
##$BYTORDA= 0
##$CFDGTYP= 0
##$CFRGTYP= 0
##$CHEMSTR= <none>
##$CNST= (0..63)
1 1 145 1 1 1 1 1 1 1 1 1 1 1 1 1 1 1 1 1 1 1 1 1 1 1 1 1 1 1 1 1 1 1 1
1 1 1 1 1 1 1 1 1 1 1 1 1 1 1 1 1 1 1 1 1 1 1 1 1 1 1 1 1
##$CPDPRG= <>
##$CPDPRG1= <>
##$CPDPRG2= <>
##$CPDPRG3= <>
##$CPDPRG4= <mlev>
##$CPDPRG5= <mlev>
##$CPDPRG6= <mlev>
##$CPDPRG7= <mlev>
##$CPDPRG8= <mlev>
##$CPDPRGB= <>
##$CPDPRGT= <>
##$D= (0..63)
0 1 0 0 0 0 0 0 0 0 0 0 0 0 0 0 0 0 0 0 0 0 0 0 0 0 0 0 0 0 0 0 0 0 0 0
0 0 0 0 0 0 0 0 0 0 0 0 0 0 0 0 0 0 0 0 0 0 0 0 0 0 0 0
##$DATE= 0
##$DBL= (0..7)
120 120 120 120 120 120 120 120
##$DBP= (0..7)
150 150 150 150 150 150 150 150
##$DBP07= 0
##$DBPNAM0= <>
##$DBPNAM1= <>
##$DBPNAM2= <>
##$DBPNAM3= <>
##$DBPNAM4= <>
##$DBPNAM5= <>
##$DBPNAM6= <>
##$DBPNAM7= <>
##$DBPOAL= (0..7)
0.5 0.5 0.5 0.5 0.5 0.5 0.5 0.5
##$DBPOFFS= (0..7)
0 0 0 0 0 0 0 0
##$DE= 6.5
##$DECBNUC= <off>
##$DECIM= 2432
##$DECNUC= <off>
##$DECSTAT= 4
##$DIGMOD= 1
##$DIGTYP= 12
##$DL= (0..7)
0 120 120 120 120 120 120 120
##$DP= (0..7)
150 150 150 150 150 150 150 150
##$DP07= 0
##$DPNAME0= <>
##$DPNAME1= <>
##$DPNAME2= <>
##$DPNAME3= <>
##$DPNAME4= <>
##$DPNAME5= <>
##$DPNAME6= <>
##$DPNAME7= <>
##$DPOAL= (0..7)
0.5 0.5 0.5 0.5 0.5 0.5 0.5 0.5
##$DPOFFS= (0..7)
0 0 0 0 0 0 0 0
##$DQDMODE= 0
##$DR= 22
##$DS= 2
##$DSLIST= <SSSSSSSSSSSSSSS>
$$ [...]
##$SPOFFS= (0..31)
0 0 0 0 0 0 0 0 0 0 0 0 0 0 0 0 0 0 0 0 0 0 0 0 0 0 0 0 0 0 0 0
##$SUBNAM0= <"">
##$SUBNAM1= <"">
##$SUBNAM2= <"">
##$SUBNAM3= <"">
##$SUBNAM4= <"">
##$SUBNAM5= <"">
##$SUBNAM6= <"">
##$SUBNAM7= <"">
##$SUBNAM8= <"">
##$SUBNAM9= <"">
##$SW= 20.5580556627758
##$SWIBOX= (0..15)
0 0 3 4 0 0 0 0 0 0 0 0 0 0 0 0
##$SW_h= 8223.68421052631
##$SWfinal= 0
##$TD= 65536
##$TD0= 1
##$TE= 300
##$TE2= 300
##$TE3= 300
##$TEG= 300
##$TL= (0..7)
0 120 120 120 120 120 120 120
##$TP= (0..7)
150 150 150 150 150 150 150 150
##$TP07= 0
##$TPNAME0= <>
##$TPNAME1= <>
##$TPNAME2= <>
##$TPNAME3= <>
##$TPNAME4= <>
##$TPNAME5= <>
##$TPNAME6= <>
##$TPNAME7= <>
##$TPOAL= (0..7)
0.5 0.5 0.5 0.5 0.5 0.5 0.5 0.5
##$TPOFFS= (0..7)
0 0 0 0 0 0 0 0
##$TUNHIN= 0
##$TUNHOUT= 0
##$TUNXOUT= 0
##$USERA1= <user>
##$USERA2= <user>
##$USERA3= <user>
##$USERA4= <user>
##$USERA5= <user>
##$V9= 5
##$VALIST= <valist>
##$VCLIST= <CCCCCCCCCCCCCCC>
##$VD= 0
##$VDLIST= <DDDDDDDDDDDDDDD>
##$VPLIST= <PPPPPPPPPPPPPPP>
##$VTLIST= <TTTTTTTTTTTTTTT>
##$WBST= 1024
##$WBSW= 4
##$XGAIN= (0..3)
0 0 0 0
##$XL= 0
##$YL= 0
##$YMAX_a= 1334202112
##$YMIN_a= -2381483.52
##$ZGOPTNS= <>
##$ZL1= 120
##$ZL2= 120
##$ZL3= 120
##$ZL4= 120
##$ABSF1= 10
##$ABSF2= 0
##$ABSG= 5
##$ABSL= 3
##$ALPHA= 0
##$AQORDER= 0
##$ASSFAC= 0
##$ASSFACI= 0
##$ASSFACX= 0
##$ASSWID= 0
##$AUNMP= <proc_1d>
##$AXLEFT= 0
##$AXNAME= <>
##$AXNUC= <off>
##$AXRIGHT= 0
##$AXTYPE= 0
##$AXUNIT= <>
##$AZFE= 0.1
##$AZFW= 0.1
##$BCFW= 1
##$BC_mod= 2
##$BYTORDP= 0
##$COROFFS= 0
##$CY= 15
##$DATMOD= 1
##$DC= 2
##$DFILT= <>
##$DTYPP= 0
##$F1P= 0
##$F2P= 0
##$FCOR= 0.5
##$FTSIZE= 0
##$FT_mod= 4
##$GAMMA= 1
##$GB= 0
##$INTBC= 1
##$INTSCL= 1
##$ISEN= 128
##$LB= 0.3
##$LEV0= 0
##$LPBIN= 0
##$MAXI= 10000
##$MC2= 0
##$MEAN= 0
##$ME_mod= 0
##$MI= 0
##$NCOEF= 0
##$NC_proc= -9
##$NLEV= 6
##$NOISF1= 0
##$NOISF2= 0
##$NSP= 1
##$NTH_PI= 0
##$NZP= 0
##$OFFSET= 14.72299
##$PC= 1
##$PHC0= 0
##$PHC1= 0
##$PH_mod= 0
##$PKNL= yes
##$PPARMOD= 0
##$PPDIAG= 0
##$PPIPTYP= 0
##$PPMPNUM= 2147483647
##$PPRESOL= 1
##$PSCAL= 4
##$PSIGN= 0
##$PYNMP= <proc.py>
##$REVERSE= no
##$SF= 90.2741298952294
##$SI= 8192
##$SIGF1= 0
##$SIGF2= 0
##$SINO= 400
##$SIOLD= 32768
##$SPECTYP= <>
##$SREGLST= <1H.CDCl3>
##$SSB= 0
##$STSI= 0
##$STSR= 0
##$SW_p= 1497.18866228788
##$SYMM= 0
##$S_DEV= 0
##$TDeff= 0
##$TDoff= 0
##$TI= <>
##$TILT= no
##$TM1= 0
##$TM2= 0
##$TOPLEV= 0
##$USERP1= <user>
##$USERP2= <user>
##$USERP3= <user>
##$USERP4= <user>
##$USERP5= <user>
##$WDW= 1
##$XDIM= 8192
##$YMAX_p= 1334201856
##$YMIN_p= -2381312
##$CURPLOT= <PDFCreator>
##$CURPRIN= <$PDFCreator>
##$DFORMAT= <normdp>
##$LAYOUT= <+/1D_H.xwp>
##$LFORMAT= <normlp>
##$PFORMAT= <normpl>
##$SURQMSG= 1
$$ End of Bruker specific parameters
$$ ---------------------------------
##XUNITS= HZ
##YUNITS= ARBITRARY UNITS
##XFACTOR= 0.182762287876938
##YFACTOR= 1
##DELTAX= -0.182762287876938
##NPOINTS= 8192
##FIRSTX= 1497.0059
##FIRSTY= -1529344
##LASTX= 0
##MAXY= 1334201856
##MINY= -2381312
##XYDATA= (X++(Y..Y))
$$ plain form
8191 -1529344 -515584 716288 803328 -322560 -220672 303616 -297984 -627712 380416 100864
8180 -245760 654336 230912 -110080 694272 -787456 -664064 587264 -102912 270848 -356864
8169 -134656 -347136 -38912 -31744 298496 466432 72704 -376832 -472064 -633856 602624 658944
8158 658944 902144 -263168 298496 631296 -2048 541696 89600 -145920 64512 26112 -858624
8146 -580096 -39936 -1074176 -243200 137728 129024 22528 -581120 -668160 -1027072 373248
8135 388096 -28672 656896 267264 -734208 132608 -548352 -545792 313856 -479232 -561664
8125 -561664 386560 -521216 754688 -60928 207360 -29696 -1091584 -976896 -1273856 595456
8114 865280 -126976 -34304 71168 -1018880 -547328 300544 -221184 144384 -139776 -320000
$$ packed form
8191a529344e15584G16288Q7040c22560J01888C03616b97984l29728C80416A00864
8180b45760F54336B30912a10080F94272g87456J23392E87264a02912B70848c56864
8169a34656k12480c8912P168B98496J67936G2704c76832r5232j61792F02624N6320
8158F58944K43200b63168B98496L32800b048E41696H9600a45920F4512B6112h58624
8146e80096c9936j034240b43200A37728q704B2528e81120q7040l58912C73248
8135C88096b8672F56896B67264g34208A32608e48352K560C13856d79232q2432
8125e61664C86560e21216G54688f0928B07360b9696j061888J14688k96960E95456
8114H65280a26976c4304G1168a018880M71552C00544b21184A44384a39776j80224
$$ plain form
8104 -320000 479232 400896 268800 -558080 -218624 -485376 856576 -76288 -14336 -215040
8094 -215040 -652800 24576 268288 -609792 -51712 701440 318976 -1206784 21504 243712
8084 243712 354816 15360 48640 -760832 644608 47616 -602112 450048 -1301504 -398848
8073 213504 479232 604160 -520192 617472 1231360 269824 -68096 -188928 -371200 356352
8062 -109568 600576 -660992 652288 -66048 -581120 -1281024 672768 154624 -900096 288256
8051 282624 -694272 -736768 -307200 -1372672 383488 300544 585728 593920 474112 -562176
8040 620032 141312 -46080 -693248 -49152 20480 -285184 128000 1431040 1012736 -66560
8029 457216 574464 -593408 157696 220672 975360 439808 -390144 -329216 -276480 222720
$$ packed form
8104c20000D79232p8336j32096e58080b18624k66752H56576g6288a4336k00704
8094b15040m37760B4576K43712f09792e1712G01440C18976a206784B1504K22208
8084B43712J11104A5360L3280g60832F44608D7616f02112D50048a301504c98848
8073B13504K65728J24928e20192F17472O13888B69824f8096j20832j82272C56352
8062a09568F00576f60992F52288f6048n15072o99904F72768A54624i00096B88256
8051B82624f94272m2496c07200j065472C83488q2944K85184Q192j19808e62176
8040F20032A41312d6080o47168d9152B0480b85184A28000J303040m18304f6560
8029D57216J17248e93408A57696O2976P54688D39808c90144O0928N2736B22720
$$ plain form
8018 -397824 -622080 18432 -902656 479232 -1186304 25600 -547328 -722944 -909824 233472
8007 414720 -170496 -597504 59904 73216 -211456 -622080 183808 645632 -351744 -1399296
7997 -1399296 390656 -268288 -384000 -99840 883200 601600 -778752 408576 54272 316928
7987 316928 -1147392 174080 -647168 -544256 -188416 -488960 894976 -721920 -699392 -153088
7976 -711168 -636416 315392 -829952 686592 -119808 400896 847360 -63488 -779264 -294400
7965 -481280 -311808 102400 16896 -1097728 626688 -400384 -14848 -365568 -612352 -510976
7955 -510976 153088 -163840 867840 -142336 150016 -681472 -943616 -652800 -466432 -245760
7945 -245760 483840 -471552 380416 -442368 478720 -268800 789504 556032 423424 -1050624
$$ packed form
8018c97824k24256A8432i02656D79232a186304B5600e47328j75616j86880B33472
8007D14720a70496m27008E9904J3312b11456m10624A83808M61824c51744j047552
7997a399296C90656b68288j15712i9840H83200k81600g78752D08576E4272K62656
7987C16928a147392A74080f47168J02912a88416l00544H94976g21920K2528a53088
7976g11168P4752C15392h29952F86592a19808D00896M46464f3488p15776b94400
7965d81280J69472A02400A6896a097728F26688d00384a4848l50720k46784J01376
7955e10976A53088a63840H67840a42336A50016f81472k62144K90816J86368K20672
7945b45760D83840d71552C80416d42368D78720b68800G89504k33472j32608a050624
$$ plain form
7934 -226816 -265728 -100352 0 1172992 155136 -731648 307200 -513024 18944 -610816 788992
7922 -294400 -489984 -204800 932352 -4096 -357376 -376320 -149504 -169472 1204224 -789504
7911 -300032 1055232 53248 371200 115200 -254464 -436224 -158720 379392 -72192 -752128
7901 -752128 72704 110592 455168 -461824 2560 429056 456192 -179200 222208 468992 855552
7890 855552 877568 -87040 -235520 193024 -86528 -42496 119296 -886272 -713216 -1303552
7880 -1303552 517632 122368 -308224 -788992 -109056 207872 -28160 -347136 52736 -521728
7869 309248 -638464 445952 -105984 102400 1041920 181760 -475136 -162816 -465408 1068032
7858 125952 -391680 -511488 -354304 631296 40960 -728064 -653312 -14336 928768 355328
$$ packed form
7934b26816l8912a00352@A172992A55136g31648C07200e13024A8944f10816G88992
7922b94400j95584b04800I32352d096l53280j8944a49504j9968A204224g89504
7911c00032A055232E3248L17952A15200b54464j81760a58720C79392g2192o79936
7901g52128G2704L7888L44576d61824B560M26496K7136a79200B22208K46784L86560
7890H55552K2016h7040j48480A93024h6528d2496A19296h86272J73056n90336
7880a303552E17632A22368c08224m80768a09056B07872b8160l18976E2736e21728
7869C09248f38464D45952a05984A02400R39520A81760d75136a62816l02592A068032
7858A25952c91680j19808J57184F31296D0960g28064P4752a4336I28768C55328
$$ plain form
7847 -1232384 -171008 446464 355328 -1014784 201728 500736 -444416 -155648 556544 30720
7836 -77312 -592384 528384 419328 316416 -100352 239616 182784 -696832 -20992 683008
7825 185856 -122880 636416 -13824 510976 -483328 470528 -1342976 435712 380928 290816
7815 290816 671232 -22528 219648 612352 -95232 1124352 295424 -628736 -591360 -480256
7805 -480256 223232 -379904 -221184 74752 -47104 418304 952832 -290816 343552 242688
7795 242688 -367104 424960 40960 -334336 -48640 -89600 220160 591872 -324608 199168
7784 -99840 898048 -430592 117248 655360 -393728 -643584 507392 635392 495104 -315904
7773 848896 146432 -467968 -702976 -946176 -12800 52224 -250880 -628736 -470016 -1007104
$$ packed form
7847a232384a71008D46464r1136a014784B01728K99008d44416a55648E56544C0720
7836g7312n15072E28384j09056j02912a00352B39616n6832f96832b0992F83008
7825A85856a22880F36416a3824E10976d83328D70528a342976D35712n4784r0112
7815B90816L80416b2528B19648L92704i5232A124352B95424f28736L7376J11104
7805d80256B23232c79904J58720G4752d7104D18304N34528b90816C43552j00864
7795B42688c67104D24960D0960c34336d8640m0960B20160L71712c24608A99168
7784i9840H98048d30592A17248N38112c93728k49856E07392J28000j40288c15904
7773H48896A46432d67968k35008k43200a2800E2224b50880l77856J58720n37088
$$ plain form
7763 -1007104 178688 -650752 -575488 -146944 -240128 -410112 448512 1090560 230912 199168
7753 199168 -898560 1137664 -283136 440320 149504 757248 147968 430080 -508416 -575488
7743 -575488 -951808 -242688 -322048 -316416 -379904 7168 -389120 -1210880 -278528 668160 -528896
7731 -1006592 354816 358912 -49664 -613376 463360 -313856 -172544 -165376 -1046016 -785920
7721 -785920 -267776 -131584 14848 98816 515584 210432 -28672 -218624 -185856 702976
7710 115200 59392 377856 -576000 -73728 798208 -443392 425984 367104 81408 -283136
7699 -375296 -970240 133120 -550912 388096 24064 1454080 852480 -403968 -381440 -679936
7689 -679936 1026560 -211456 302080 -636928 260096 953856 165376 -947200 637952 37376
$$ packed form
7763a007104A78688f50752P5264a46944r3184j69984D48512O42048B30912l1744
7753A99168h98560A137664b83136D40320A49504O07744A47968K82112e08416o7072
7743e75488l76320b42688p9360N632o3488G168c89120q21760b78528F68160e28896
7731a006592C54816M096d9664n63712D63360c13856J41312P168q80640K60096
7721g85920b67776a31584A4848Q3968M16768B10432b8672j89952L2768G02976
7710A15200n5808L18464e76000g3728G98208d43392D25984n8880H1408b83136
7699c75296n94944A33120e50912C88096B4064J430016o01600d03968K2528k98496
7689f79936A026560b11456C02080f36928B60096O93760A65376i47200F37952C7376
$$ plain form
7678 -123904 -635392 962048 644608 -601600 675840 -899072 538112 -376832 -375296 -663040
7668 -663040 160256 -518656 -643584 12288 85504 -59904 385024 -358400 -468480 -195072
7657 -184832 1150464 198656 -20992 -1479168 -251392 -428032 -399360 -956416 -210944 258560
7646 97792 -718848 -16896 488448 497664 -433152 -285184 1352192 -365568 799232 357376
7635 -343552 127488 -133632 1541120 241664 561152 227840 488960 -14336 -536576 -500736
7625 -500736 249344 -694784 -154624 462848 644608 -164864 -154624 1029120 -267776 278016
7614 -15360 494080 -1103360 878080 315392 327168 447488 -76288 479744 382464 467968
7604 467968 -122880 32256 305152 614912 314368 -881664 265728 -138752 -265216 720384
$$ packed form
7678a23904n11488I62048l17440f01600F75840h99072E38112c76832J536k87744
7668f63040A60256e18656j24928A2288P3216e9904C85024c58400j10080a95072
7657a84832A150464A98656b0992j458176b51392j76640K8672n57056b10944B58560
7646I7792g18848a6896D88448R216d33152J47968A352192c65568G99232C57376
7635c43552A27488a33632A541120B41664L19488B27840K61120a4336n22240L5840
7625e00736B49344f94784a54624D62848J81760a64864J0240A029120b67776B78016
7614a5360D94080a103360H78080C15392J1776J20320g6288D79744r7280Q5504
7604D67968a22880C2256K72896L09760l00544h81664B65728a38752j26464G20384
$$ plain form
7593 -823296 289280 548864 133632 168448 484352 550400 161280 239104 -475136 -475136 -205824
7581 589824 -887808 1020928 184320 -1026560 -77312 359936 -178688 307200 -306688 -520192
7571 -520192 10240 357888 206848 -510976 -172032 562176 -112128 100352 438784 284672
7561 284672 377344 -643584 -82944 -528896 322560 -508928 64000 -593408 -524800 -254976
7550 125440 386560 405504 633856 795136 545280 848896 -47104 500736 250880 778240
7540 778240 -668672 -588800 -201728 498688 -613376 320000 171008 -299520 -197632 -647168
7530 -647168 491008 -907776 611328 1068544 -757760 -20480 280576 -32768 1014272 -149504
7519 33792 368128 69120 939520 1386496 -624128 64512 -500224 -951808 -242688 -113152
$$ packed form
7593h23296B89280K59584A33632L4816L15904O6048A61280P7824d75136%b05824
7581E89824h87808A020928A84320a026560g7312C59936a78688C07200c06688k13504
7571e20192A0240L47648j51040e10976a72032E62176a12128A00352L38432j54112
7561B84672R2672f43584h2944m45952C22560e08928F4000e93408O8608b54976
7550A25440K61120J8944K28352J61280k49856L03616d7104E00736k49856N27360
7540G78240f68672P9872b01728D98688f13376C20000j48992b99520J01888m49536
7530f47168D91008i07776F11328M57216g57760b0480B80576c2768A014272a49504
7519C3792L34336F9120Q70400M46976f24128F4512e00224m51584b42688a13152
$$ plain form
7508 411136 -458240 -758272 -961024 69120 1075712 783360 761856 -667136 -250880 220672
7497 -635904 227328 -1100288 334848 -521728 -429056 128512 199680 288256 18432 -198144
7486 -1227264 187392 1454080 -242176 63488 619520 324096 50176 -636416 564736 -879104
7475 80896 208384 289280 502272 73728 184832 28160 909824 -87040 532480 -756736 1414144
7463 -1612288 546304 -648192 -73216 -209920 16384 853504 423936 -400384 -107008 -1089536
7453 -1089536 -549376 752128 134144 1244672 -600576 -166912 338944 -323072 -965120
7444 -965120 88064 -765952 -475136 -178176 71168 690688 -1044480 639488 -473600 43008
7433 -847872 -893440 603136 369664 668160 354304 -291328 374272 147968 90112 -507392
$$ packed form
7508D11136d58240l00032k02752F9120J006592k92352k1504f67136b50880B20672
7497f35904B27328a100288C34848e21728R2672A28512P1168Q8576A8432a98144
7486a227264A87392J266688b42176F3488N56032k95424E0176f36416E64736h79104
7475H0896J27488Q0896K12992G3728J11104B8160Q81664h7040E32480g56736A414144
7463a612288E46304f48192g3216j36704A6384Q37120D23936d00384a07008r82528
7453a089536N40160G52128A34144J110528f00576a66912C38944c23072o42048
7444i65120H8064g65952K90816a78176G1168O19520a044480F39488d73600D3008
7433h47872m5568F03136k33472K98496l13856b91328C74272A47968n7856e07392
$$ plain form
7422 -426496 967680 705536 136192 168448 304640 -372224 229888 668160 174080 310784
7412 310784 419328 481792 -787968 569856 -358400 -623616 -11776 -281600 314368 665600
7402 665600 563712 -580096 -681984 348160 525824 902144 230400 -103936 -250880 -152064
7392 -152064 393728 151552 330752 -398336 -101888 -738816 131072 -215552 -175104 -695808
7382 -695808 1070080 104960 1538560 -133632 -263680 -243200 332288 -1012224 27648 430592
7372 430592 -1039360 -708608 -326656 -534016 680960 418816 281088 193024 -266752 1472000
7361 461312 -126976 183808 939008 147456 -484352 -176128 46592 -509952 478720 12288
7350 -888832 -542208 -1435648 415232 -750080 228352 1177600 82432 601088 -450048 246784
$$ packed form
7422d26496I67680k62144A36192L2256J36192c72224B29888M38272A74080J36704
7412C10784J08544O2464g87968E69856c58400k65216a1776k69824C14368L51232
7402F65600j01888e80096j01888C48160J77664L76320B30400a03936j46944R8816
7392a52064C93728A51552J79200c98336a01888o36928A31072b15552M0448n20704
7382f95808A070080A04960J433600a33632j30048K0480C32288a012224B7648M02944
7372D30592a039360L30752c26656k07360F80960k62144j37728q8064b66752A472000
7361D61312a26976A83808P55200A47456d84352a76128D6592e09952D78720A2288
7350h88832L46624q93440D15232g50080B28352R49248H2432N18656d50048B46784
$$ plain form
7339 214528 320000 385536 -684544 136704 -635392 -335360 -41472 -671744 131584 949760
7329 949760 -132096 23040 445952 -245248 233984 -304128 222720 -138240 -98816 590848
7318 -75264 -350720 548352 109056 137728 -42496 177152 548864 162816 596480 793600
7308 793600 542208 875008 -562688 38912 657408 -517632 -461824 387584 177664 -166912
7297 -194560 -920064 -77312 1472512 -632832 -128000 1074688 354816 40960 13312 -409600
7286 28672 -526336 -752128 199680 15872 202240 932352 914944 -341504 83968 -539648
7275 -847360 137728 130560 506368 215552 -412160 -925696 -119296 790016 524288 -517120
7264 672768 -86016 -114176 194048 117248 -187904 978944 -401920 143872 849920 196096
$$ packed form
7339B14528J05472O5536f84544A36704f35392L00032d1472o30272A31584Q18176
7329I49760a32096B3040M22912b45248B33984c04128B22720a38240L9424E90848
7318g5264k75456E48352A09056K8672d2496A77152L71712A62816M33664J97120
7308G93600k51392L32800e62688C8912O18496e17632N5808C87584A77664a66912
7297a94560p25504g7312A472512f32832a28000A074688C54816D0960A3312d09600
7286B8672e26336k25792A99680A5872J86368P30112j7408c41504H3968e39648
7275h47360A37728p168L75808B15552d12160n13536a19296G90016k65728e17120
7264F72768h6016k8160A94048p6800a87904I78944d01920A43872P06048A96096
$$ plain form
7253 113664 809984 143360 15872 -530432 563712 18944 717824 -40448 -484864 314368
7242 -291328 4096 871936 -276992 320512 196608 -95232 -1067520 201728 150528 -406528
7231 652288 491008 905216 -186880 299520 -553472 386560 -741888 457216 -250368 -15872
7220 -1003008 73216 284672 -144384 -169472 -966656 502272 750592 126976 -250368 -407040
7210 -407040 190976 984576 -600576 784896 778752 478208 -563200 274944 -96256 211456
7199 -1057280 -79872 360448 470016 260608 247808 -131584 479232 212480 -798208 -538624
7189 -538624 314880 -625152 187392 684544 264704 -12800 495104 157184 185344 68096
7178 -375808 -283648 -184320 240128 14848 -1001984 -274944 835072 291840 659968 -678912
$$ packed form
7253A13664O96320A43360A5872e30432E63712A8944O98880d0448m44416C14368
7242b91328D096Q67840b76992C20512j23904i5232r72288B01728n1200d06528
7231F52288j61280M14208a86880B99520e53472C86560g41888D57216b50368a5872
7220a003008G3216K11456a44384k5088p97184E02272K48320A26976b50368j56672
7210d07040A90976P93600f00576G84896o144l00544e63200B74944i6256B11456
7199a057280g9872C60448J09568k09408j2800a31584D79232B12480g98208K59584
7189e38624C14880f25152A87392M97152B64704a2800D95104A57184K8160F8096
7178c75808R2160R9328B40128A4848a001984b74944H35072B91840L68128f78912
$$ plain form
7167 -1008128 -788480 593920 -51200 -357376 560128 1272320 -573952 -698880 -742400 391168
7156 767488 -98816 324096 -102912 97792 -448000 -324096 1326080 1644032 187392 425984
7146 425984 340480 1459712 328192 -681472 422400 -809984 15872 -59904 -133120 295936
7135 -558592 76800 156672 -131072 835072 -19456 670720 217088 -75264 207360 -254976
7124 218112 -302080 -345088 -241152 -393216 -506880 -122880 -144896 116736 -22016 -564736
7114 -564736 -628736 261120 185344 480256 601088 280576 287232 301568 562176 -203264 365568
7102 548352 -820224 1102336 -156672 -363008 -617984 -276480 -236032 565760 605696 -526336
7091 -141824 -416768 659968 -63488 967680 -387584 -161280 -13312 -128000 -615936 575488
$$ packed form
7167a008128K19648E93920e1200l06176E60128P12192e73952j24928m3520C91168
7156G67488i8816C24096a02912I7792d48000J23904A326080L17952A87392K38592
7146D25984q5504J119232C28192f81472D22400h09984A5872e9904p3216B95936
7135e58592G6800P9872a31072H35072a9456F70720B17088g5264B07360b54976
7124B18112c02080m3008J03936j52064j13664a22880k2016A16736b2016n42720
7114e64736o4000B61120p5776K94912J20832B80576O656J4336K60608b03264C65568
7102E48352h20224A102336a56672k06336k54976b76480M0448E65760L9936e26336
7091a41824k74944F59968f3488I67680c87584a61280a3312j14688m87936E75488
$$ plain form
7080 -97792 523776 -702464 -713728 139264 -955392 -504320 -858624 -394752 -34304 156672
7069 587776 633856 -345600 109056 -134656 -533504 -901632 -503296 736256 105984 8704
7058 309248 -141312 421888 -304640 193024 -334336 -6144 -1018880 995840 456192 502784
7048 502784 320000 155648 -531968 220160 -484864 60416 -579072 83456 438272 364032
7038 364032 77312 108032 734208 121856 415232 303104 337408 2045440 -529920 -279040
7028 -279040 -272384 531968 -26624 -269824 388608 -250368 122368 988672 842752 -604160
7017 661504 -364032 -173056 494592 1199104 654336 -591360 57856 -381952 -45568 42496
7006 14848 -195072 24576 177664 -66560 -212992 -124416 639488 -55808 -456192 27136 -3584
$$ packed form
7080i7792E23776g02464j1264A39264i55392M51072l54304c94752c4304A56672
7069E87776M6080c45600A09056a34656l98848l68128L98336G36256A05984H704
7058C09248a41312D21888c04640A93024c34336f144j012736I95840D56192M6592
7048E02784j82784A55648e31968B20160d84864F0416e79072H3456L54816p4240
7038C64032G7312L0720O26176A21856K93376j12128L4304J708032e29920K50880
7028b79040O656E31968b6624k43200C88608b50368A22368Q66304j45920f04160
7017F61504c64032a73056D94592P04512n44768e91360E7856c81952d5568D2496
7006A4848a95072B4576J53088f6560j46432Q8576F39488e5808m00384B7136c584
$$ plain form
6994 555520 403968 226816 423936 91648 126464 613888 -602624 -505856 -4608 253440 -561152
6982 123392 327168 580608 1488896 -59392 1444864 -1112064 -854528 607744 -776192 224768
6971 825856 788992 -271360 -827392 45056 183808 212992 -843776 16896 -331776 723456
6960 15872 -84480 282112 -273920 374784 466944 1374208 -59392 1129472 375296 40960
6949 -363520 753664 45568 295424 71168 924160 -11264 378368 94720 64512 326656 -467968
6937 539648 -708608 184320 211456 370176 -504832 100864 -151040 260096 454144 -257024
6926 75264 -99840 696832 774144 611328 -290304 480256 -721408 296448 -371712 1015808
6915 -109568 238592 273408 -499712 -421888 441856 288768 -7680 339456 -69632 -478720 776192
$$ packed form
6994E55520j51552j77152J97120I1648L4816M87424f02624R6768d608B53440e61152
6982A23392K03776K53440R08288e9392A444864a112064K57536F07744g76192B24768
6971H25856l6864b71360n56032D5056J38752K9184h43776A6896c31776G23456
6960A5872h4480B82112b73920C74784R2160R07264e9392A129472C75296D0960
6949c63520G53664D5568K49856G1168Q52992a1264C78368I4720l0208K62144d67968
6937E39648g08608A84320K7136J58720e04832A00864a51040B60096J94048b57024
6926G5264i9840F96832P7312j62816b90304D80256g21408B96448c71712A015808
6915a09568B38592L4816d99712P7824D41856j53088g680C39456f9632m09088G76192
$$ plain form
6903 -522752 352256 788480 -365056 247808 747520 -338944 203264 81920 -8704 -691200
6893 -691200 -44032 -716288 -40448 560128 455680 -16896 468992 -55296 422912 743936
6883 743936 208896 800256 -414720 -42496 -419328 232960 925184 -1110528 -318976 393728
6872 1538048 148992 420352 312320 -637440 -252416 144896 660480 506368 5120 -327680
6861 646144 489984 386048 -310272 -519168 293888 -45056 -607744 -1101824 565248 -374784
6850 -334848 -43520 469504 76800 -472576 480768 941568 -180224 -172032 1360896 -720896
6839 339968 876544 -443392 -190464 -267264 -830976 649728 571904 109568 -687616 -236544
6828 -247296 436736 1378304 297984 409088 -819712 300544 -429056 254464 -384512 58880
$$ packed form
6903e22752C52256M36224c65056B47808M99712c38944B03264H1920h704o82496
6893f91200d4032o72256d0448E60128j04448a6896D68992e5296D22912L21024
6883G43936B08896N91360d14720d2496l76832B32960O92224a110528c18976C93728
6872A538048A48992K71360j08032f37440b52416A44896N15584j54112E120c27680
6861F46144j56160j03936c10272k08896B93888d5056n62688m94080E65248c74784
6850c34848d3520D69504G6800d72576D80768M60800a80224Q192A360896g20896
6839C39968N36576d43392a90464p6800n63712F49728p7824A09568f87616b36544
6828b47296D36736R41568B97984J11104h19712C00544d29056B54464c84512E8880
$$ plain form
6817 123904 294912 340480 -136704 -88064 -153600 -82944 -41472 -240640 26112 578048 333312
6806 333312 -577536 1272832 554496 359424 700416 269824 -225280 1199616 1331712
6797 1331712 167936 157696 -187392 6144 -101376 1056768 -391680 310784 -384512 1084416
6786 -741376 660480 582144 568832 -34816 322048 -79872 -696832 43520 397824 265728 940032
6775 940032 -360960 223232 586240 686080 291840 -125440 -421888 878592 219136 216064
6765 216064 -164864 -1272320 284672 196096 364544 62976 1015296 -194560 50688 32256
6755 32256 -31744 487424 345088 -332288 -614400 272384 -848384 1165824 133120 552960
6745 552960 -16384 75776 120832 673280 -448000 -325120 -1091072 -224256 1391616 550912
$$ packed form
6817A23904J71008M5568a36704M8640o5536P0656d1472j99168B6112N51936k44736
6806C33312e77536A272832E54496j95072L40992B69824b25280A199616J32096
6797A331712A67936j0240a87392F144a01376A056768c91680C10784c84512A084416
6786g41376F60480p8336j3312c4816C22048g9872o16960D3520L54304j32096O74304
6775I40032c60960B23232L63008R9840B91840a25440k96448H78592B19136l072
6765B16064a64864j107456B84672q8576J68448F2976R52320a94560E0688j8432
6755C2256c1744D87424j42336c32288k82112B72384h48384A165824A33120M19840
6745E52960a6384G5776M5056N52448d48000J22880p65952b24256A391616E50912
$$ plain form
6734 -652288 478720 677376 608256 68608 844800 1298944 -155136 -266240 -157696 717824
6723 -465408 -526848 744960 434176 -198656 666624 250880 751104 679424 256512 -359424
6712 -313856 -563200 351232 -689664 277504 611328 -34816 -436736 278016 1099776 188928
6701 -16384 591360 199680 374784 675328 -74240 -365568 869376 711168 -691200 -50176
6690 770560 -1105408 363008 -138240 -495616 322560 745984 -417280 187904 1128960 437760
6679 738304 -702464 772608 -654336 656384 -425984 272384 -283648 -122880 -554496 -599552
6669 -599552 498176 -165376 -573952 223744 404992 346624 1159168 -30720 954880 1255424
6659 1255424 -254464 278016 429568 397824 1013760 -310272 712192 204800 420864 494592
$$ packed form
6734f52288D78720J98656o9120F8608P76192M54144a55136j11104J08544G17824
6723d65408o1440G44960l10784a98656F66624B50880N00224p1680B56512c59424
6712c13856k49344C51232f89664B77504L33824c4816m01920B78016Q21760A88928
6701a6384E91360A99680J75104L00544g4240k91328H69376j58208f91200e0176
6690G70560a105408C63008a38240l57376C22560M23424d17280A87904R41056D37760
6679G38304g02464G72608f54336F56384d25984B72384b83648a22880m31616m5056
6669e99552D98176a65376m08576B23744J81248n8368Q12544c0720I54880L00544
6659A255424b54464B78016J51552l1744O15936c10272G12192B04800K16064P3728
$$ plain form
6649 494592 -265728 -60416 114176 444928 175616 733696 109056 661504 -452608 759808
6638 -22016 251904 1088000 -153088 796672 450048 -689664 -53760 98304 1186816 -805376
6627 223744 367616 1036800 111616 449024 -1025024 -7168 397824 206848 -316416 895488
6616 218624 234496 -28672 668672 502784 -399872 -611328 10240 713728 -371200 366080
6605 462848 -830464 492032 195072 -18944 -114176 984064 -248320 374784 580608 -623616
6594 207872 1583104 -610816 1145344 -219136 -83968 -46080 -152064 -711168 837120 466432
6584 466432 887808 116224 333824 481280 -241664 750592 1568768 -296448 -348160 623616
6573 633344 -43520 -408576 292352 398336 671744 260096 843264 429568 30720 -722432
$$ packed form
6649D94592b65728f0416A14176L30752A75616N58080A09056N52448d52608G59808
6638b2016B51904Q36096a53088G96672l46624f89664e3760I8304J088512h05376
6627B23744J43872O69184A11616L37408a025024g168C97824j90976c16416H95488
6616B18624J5872b8672F68672j65888c99872k11456A0240P03488c71200C66080
6605D62848h30464D92032A95072a8944r5232I84064b48320C74784K05824f23616
6594B07872J375232f10816A145344b19136h3968L7888j05984n59104H37120l70688
6584D66432M21376A16224K17600J47456b41664G50592Q18176b96448n1712F23616
6573F33344d3520l65056B92352J05984K73408B60096N83168m13696C0720g22432
$$ plain form
6562 -71168 253440 -256000 211968 -128000 -176640 516096 771584 534528 247296 353792
6552 353792 660992 579072 -29696 4096 639488 396800 -274432 307712 1610752 -642048
6541 1340928 -271872 1231872 -581632 639488 -408064 555520 626176 61440 678912 -1028096
6530 -136192 570880 -571392 649728 836608 771584 -588800 -745984 80384 -61952 832512
6519 207360 173568 620032 84992 -58880 -653312 -1417216 190464 366592 -681472 401920
6508 860672 -918528 388608 1132544 146944 -65536 -287744 819200 268288 -118784 -188416
6498 -188416 -404480 -288768 256512 602112 897024 -166912 -276480 -407552 618496 863744
6488 863744 389632 374784 336896 749568 -222720 91648 249856 -30720 633344 -333312
$$ packed form
6562g1168B53440b56000B11968a28000m8640E16096K55488k37056B47296J06496
6552C53792L07200q1920b9696D096O35392k42688b74432C07712J303040f42048
6541A340928b71872A231872e81632F39488d08064E55520P0656F1440O17472a028096
6530a36192E70880e71392F49728J86880o5024e88800j57184H0384f1952H32512
6519B07360l3792M46464H4992e8880n94432p63904A90464J76128f81472D01920
6508H60672i18528C88608P43936A46944f5536k22208H19200B68288a18784o9632
6498a88416k16064J15712B56512L45600K94912a66912j09568j31072F18496K45248
6488H63744C89632j4848l7888M12672b22720I1648J58208c0720F33344c33312
$$ plain form
6477 513536 594944 416256 -434176 -409088 764928 -464896 473088 -150016 292352 417792
6467 417792 -111104 132608 -521216 1091584 653824 -317952 733184 573440 -190976 989696
6456 -1402880 359936 530944 1152512 154112 780288 -379392 67584 674304 542720 -342528
6445 505856 411648 -50688 -273408 -129536 148480 1477632 27136 673792 265216 -331776
6434 -160256 -29184 572416 1239552 836608 906752 765952 529408 -2560 330752 -552960
6423 -301056 -43008 -1445376 454656 345088 368640 18944 507392 494592 651264 177664
6412 -313856 401920 -865280 387584 -80896 816128 354816 611328 -224256 -176640 -475136
6402 -475136 496640 783872 -286208 361984 106496 158208 567296 565248 1070592 -187392
$$ packed form
6477E13536Q1408j78688d34176K5088G64928d64896D73088a50016B92352J25440
6467D17792a11104A32608e21216A091584m37760c17952G33184j59744a90976I89696
6456a402880C59936J71008O21568A54112O26176c79392F7584O06720j31584c42528
6445E05856r4208e0688k22720a29536A48480J329152B7136O46656B65216c31776
6434a60256b9184E72416O67136m02944P0144j40800k36544b560C30752e52960
6423c01056d3008j402368D54656j09568K3552A8944M88448j2800J56672A77664
6412c13856D01920h65280C87584h0896H16128C54816K56512b24256M7616k98496
6402d75136D96640K87232b86208C61984A06496N1712M09088k048N05344a87392
$$ plain form
6391 482816 -858112 47616 894464 -1049088 558080 -645120 -395264 -29696 119296 223744
6381 223744 1068544 -617472 -645632 701952 -507392 1067008 499712 310272 117248 -759808
6370 342528 -54272 35328 -54272 499200 1232384 480256 265216 -2381312 330240 22016
6359 513536 734720 -520192 -46592 460288 -1517568 -914432 -23552 978944 -349696 1216512
6348 99840 -303616 -69632 611328 1367552 885760 -23040 370176 445440 -259584 765952
6337 -117760 1845248 687104 1326592 390656 -822272 -114176 348672 -556544 248320 -265216
6326 422912 119808 936960 -498176 -77824 623104 534528 430592 447488 -47104 598528
6315 857600 444928 1118208 505344 10240 -25600 -944128 143872 554496 34304 428544
$$ packed form
6391D82816h58112D7616Q46848a049088E58080f45120K49856b9696A19296J04448
6381B23744Q44800f17472k8160G01952e07392A067008D99712j89440A17248g59808
6370C42528e4272C5328e4272D99200P33184D80256k15040b381312C30240B2016
6359E13536K21184e20192d6592D60288a517568O03136b3552I78944c49696A216512
6348I9840c03616f9632F11328P56224m81792b3040C70176P5264b59584G65952
6337a17760A845248F87104O39488C90656h22272a14176C48672e56544B48320b65216
6326D22912A19808Q17152d98176g7824F23104q8576j03936J6896d7104E98528
6315H57600m12672O73280E05344A0240b5600r18528A43872M10624C4304L94240
$$ plain form
6305 428544 22016 754176 -139264 -418816 -145408 -550912 539648 699904 -16896 551936
6294 -104448 1245696 1132032 558592 587264 752128 -124416 1040896 1314304 170496 189952
6284 189952 637440 368128 16896 -3584 566784 659456 1357824 -234496 106496 38400 14848
6272 772096 147968 -733184 -962048 -100352 -3584 251904 51200 997376 -35328 -484864
6262 -484864 -154112 777728 -670720 316416 -369152 -226304 824320 -317440 612352 268800
6251 1125376 -577536 1050112 560640 131584 359936 -1287680 866304 -373248 292864
6241 472576 545792 -298496 -46592 684032 730624 -26624 474624 -187392 211456 -79872 794624
6229 -764416 799232 518144 -164864 -297472 814592 58368 120320 -126464 405504 932864
$$ packed form
6305D28544B2016P32160a39264k79552a45408m05504E39648J60256a6896E51936
6294a04448A245696j13664E58592K8672J64864a24416A040896K73408A70496J9456
6284A89952M47488k69312A6896c584E66784R2672O98368b34496A06496C8400A4848
6272G72096A47968g33184k28864a00352c584B51904E1200R46176c5328m49536
6262d84864a54112G77728f70720C16416c69152J42848H24320c17440F12352B68800
6251A125376e77536A050112m89472A31584K28352a287680H66304c73248B92864
6241D72576P3216b98496d6592F84032M6592b6624D74624a87392B11456g9872G94624
6229g64416G99232k81088a64864j32608H14592E8368O1952a26464D05504N27360
$$ plain form
6219 932864 -240128 671744 606208 267264 245248 468480 -540160 433152 -361472 1077760
6208 -985600 50176 934912 695296 377856 -466944 806912 472064 368640 355328 651264
6198 651264 864256 727040 759808 313856 260608 1199616 -123392 -58880 -103936 275968
6187 206848 -353280 -236544 -302080 74240 -12800 -137728 -512512 -136704 288256 1275904
6177 1275904 422912 446464 -149504 -90112 895488 926208 603648 756224 482816 286720
6167 286720 583680 893952 198144 258048 67584 -70656 40960 48640 612864 416256 982016
6156 982016 -237056 230400 386560 -401920 274432 590848 -78336 -235520 -1197056 948736
6145 955904 721920 -179712 1139200 546816 531968 1031168 130560 1018880 518656 141824
$$ packed form
6219I32864b40128F71744o5536B67264k2016K23232e40160D33152c61472A077760
6208i85600E0176Q84736k39616l17440d66944H06912l34848j03424j3312K95936
6198F51264K12992j37216L2768C13856n3248R39008a23392e8880m5056B75968
6187B06848c53280J16736o5536G4240a2800j24928l74784a36704B88256R87648
6177A275904D22912K3552a49504N9392H95488L0720l22560J52576k73408j96096
6167B86720K96960L10272A98144N9904F7584g0656D0960P680N64224j96608N65760
6156I82016b37056B30400J56160d01920B74432L16416g8336j57184r61536I48736
6145I55904k33984a79712A139200E46816j4848M99200A30560Q88320n00224A41824
$$ plain form
6134 377344 38912 -227328 582144 807424 37376 36864 -203776 317952 771584 -1174016
6123 -227328 74752 -129536 816640 -271360 505856 1214464 -761856 1088000 791552 670208
6113 670208 110080 566784 37888 60416 -10752 -175104 356864 29184 526848 -150016
6102 1022464 328704 121856 489984 701440 456192 845824 534016 1119232 883200 0
6091 -213504 56832 -660992 -669696 399360 248320 157696 530432 -30720 894464 481792 452096
6080 452096 1065984 -829440 9216 394240 897536 1313280 1787904 916480 -230400 263168
6069 511488 295424 526336 -155136 570880 337408 526336 -328704 -71680 1275392 334336
6058 -30208 379904 71680 182272 -666624 -212480 140800 -71680 764416 -276992 813056
$$ packed form
6134C77344C8912b27328E82144K25280C7376n12b03776C17952M53632a174016
6123b27328G4752a29536H16640b71360E05856P08608g61856A088000k96448j21344
6113F70208A10080M56704C7888K2528a0752j64352C56864B9184M97664a50016
6102A022464C28704A21856L68128K11456k45248L89632l11808N85216k36032@
6091b13504E6832f60992q704C99360j51040r0624L72736c0720H94464m12672k9696
6080D52096O13888h29440I216L85024N03296M15744M74624q71424b30400B63168
6069E11488k16064K30912a55136E70880k33472J88928c28704g1680A275392C34336
6058c0208C79904G1680J10592f66624b12480A40800g1680G64416b76992H13056
$$ plain form
6047 1349632 451072 374272 -709632 957440 146432 716288 398848 313344 218112 257024
6037 257024 1067520 935936 -107520 -126464 -408576 256512 124416 524800 373248 -510464
6026 -219136 403968 129024 501248 -264192 313344 375296 285696 -153600 1042944 863232
6016 863232 242688 836096 -64000 750592 549376 347648 -320000 -570880 92160 622080
6006 622080 -38912 -71680 6656 -275456 1033728 888832 -129024 -593920 -64000 776192
5995 338432 1000448 1357824 -179712 1300992 -813056 1510400 -222208 -136192 5632 587264
5985 587264 1761280 902144 985600 -606720 549376 724480 1163776 108032 -74240 45056
5974 1082880 441856 -40960 -465408 885248 82944 671744 643072 -237056 773632 451072
$$ packed form
6047A349632D51072p6800g09632I57440A46432N69856l17440q5504r5232L8912
6037B57024Q10496j31584a07520j8944k82112B56512A24416M00384j51552e10464
6026b19136D03968A29024L72224b64192C13344O1952q9600a53600A042944j79712
6016H63232B42688N93408f4000G50592k01216k01728c20000k50880I2160N29920
6006F22080c8912l2768F656b75456A033728j44896a29024m64896f4000G76192
5995C38432O62016L57376a79712A300992h13056A510400b22208Q6016E632N81632
5985E87264J174016q59136Q3456f06720E49376J75104M39296A08032g4240D5056
5974A082880D41856d0960m24448H85248H2944N88800k8672b37056G73632l22560
$$ plain form
5964 451072 -113152 461824 610816 -31744 594944 466944 -1468416 497152 630784 621568
5954 621568 1070080 205312 -677888 343040 1486336 1817600 249344 -175104 928768 310784
5943 -50688 -1000960 117248 107008 1082368 -110592 -166912 -34304 -213504 185344 1319424
5933 1319424 362496 996864 822784 -508416 640512 855040 640000 126464 1018880 824832
5923 824832 897536 1309184 -5632 -601088 556032 83968 -379904 967168 1227264 873984
5913 873984 384512 400896 529408 -165376 785920 368640 485888 314880 725504 939008
5903 939008 445952 579584 679424 994304 47616 120320 -48640 178688 -499200 10752 117248
5892 117248 447488 -273408 -258048 763904 -8192 891904 693248 556032 -262144 962560
$$ packed form
5964D51072a13152D61824J48992c1744E94944j28000a468416D97152J33632r216
5954F21568M48512B05312f77888C43040J143296L31264B49344a75104I28768C10784
5943e0688r50272A17248j0240R75360a10592n6320c4304j79200A85344J134080
5933A319424C62496O34368j74080e08416F40512K14528k15040A26464Q92416j94048
5923H24832P2704M11648e632n95456E56032H3968c79904I67168K60096l53280
5913H73984C84512J6384J28512a65376G85920C68640J17248j71008M10624K13504
5903I39008D45952J33632R9840L14880D7616P2704d8640A78688d99200A0752J06496
5892A17248L30240b73408J5360G63904h192H91904j98656j37216b62144I62560
$$ plain form
5881 1627648 -71680 627712 -423424 406016 657408 1870848 840192 215552 146432 223744
5871 223744 587264 -157696 562176 258560 1012224 1613312 230912 -215552 460288 -679936
5860 1165824 1739264 313856 158720 766464 -219136 271872 110080 552448 635392 -331264
5849 312832 953344 -430592 331264 379392 673280 414720 359936 356352 454656 829952 995840
5838 995840 220672 197120 407040 -13312 1356800 269312 -69632 -67072 409600 497152 258560
5827 258560 176128 -213504 371712 179200 140288 882176 249344 171008 203264 598528
5817 598528 427008 582656 -519168 -98816 775680 851968 -17408 319488 -246272 1276416
5806 612352 617472 399872 759296 375296 1220096 -137728 162304 971776 348160 1078784
$$ packed form
5881A627648g1680F27712d23424D06016K51392J213440H40192B15552o9120P7312
5871B23744L63520a57696E62176B58560P53664O01088B30912b15552D60288f79936
5860A165824N73440C13856j55136O07744b19136B71872A10080M42368Q2944c31264
5849C12832O40512d30592C31264M8128K93888k58560n4784l584R8304L75296J65888
5838I95840B20672k3552K09920a3312A356800B69312f9632K560D09600Q7552k38592
5827B58560q2432b13504C71712A79200l8912P41888B49344p8336L2256L95264
5817E98528j71520J55648e19168i8816G75680P6288a7408C19488b46272A276416
5806F12352N120k17600L59424C75296Q44800a37728A62304Q09472C48160P30624
$$ plain form
5796 1078784 621568 357376 631808 -430592 1298432 813056 1081344 350720 258048 955392
5786 955392 -14336 -16384 -517120 187392 -42496 921088 957440 729600 706048 784384 -378368
5774 -220672 671744 -171008 -167936 628736 1084928 -229888 1455616 -352768 535552 893440
5764 893440 380928 23040 -467968 171520 959488 461824 136704 984064 446464 617472
5754 617472 612864 1601536 339968 47616 2070528 251392 87552 723456 266752 966656
5744 966656 -83968 432640 62976 1358848 -477184 1107456 1467904 117760 -1021440 829952
5733 641536 504320 761856 287744 88064 -337408 995840 281600 844800 635904 206848
5722 504320 -116736 -31232 1675264 1284608 -78848 -120832 -125440 628224 -866816 852480
$$ packed form
5796A078784m57216k64192K74432d30592A298432m85376K68288C50720r2672O97344
5786I55392a4336k048n00736A87392d2496I21088L6352k27840k3552P8336c78368
5774b20672F71744a71008L072F28736M56192b29888A455616c52768E35552L57888
5764H93440C80928B3040d67968A71520P87968D61824A36704Q47360D46464J71008
5754F17472m608R88672C39968D7616K022912B51392H7552O35904B66752O99904
5744I66656h3968D32640F2976J295872d77184A107456L60448A17760a021440H29952
5733F41536j37216K57536B87744H8064c37408I95840B81600N63200k08896B06848
5722E04320a16736c1232A675264l90656g8848m1984m608F28224h66816H52480
$$ plain form
5711 549376 807936 279040 -568832 2112000 491008 701440 458240 453120 114176 623616
5701 623616 311296 -49152 601600 863744 743936 2200064 629248 1189888 596480 669184
5691 669184 924672 904704 836608 541696 -59392 -4608 1083392 876032 911360 126464 1235456
5680 1235456 353280 593408 567808 922624 381440 1016320 243712 542720 1354752 395776
5669 -261120 242176 209408 814080 2048 980480 1128960 484352 384000 229888 -280064
5658 1241600 20480 1121280 -110080 735232 396800 332800 1252352 353792 66048 1098752
5648 1098752 1424896 -40960 368128 309248 1399808 7680 1135104 202752 840704 803328
5638 803328 613376 359936 678400 -116224 1248256 445440 755712 787456 1460224 1460736
$$ packed form
5711E49376K58560B79040e68832B112000D91008K10432k43200n120A14176N09440
5701F23616C11296d9152F01600K62144j19808J456128F29248N60640n93408P2704
5691F69184K55488j9968o8096k94912e9392d608A083392k07360L5328A26464J108992
5680A235456C53280K40128k5600L54816C81440O34880B43712K99008Q12032C95776
5669b61120B42176l2768O04672B048R78432J48480D84352j00352j54112b80064
5658A241600B0480J100800a10080G35232l38432o4000R19552C53792F6048J032704
5648A098752L26144d0960C68128n8880J090560G680J127424B02752O37952l7376
5638H03328j89952k53440L18464a16224A248256D45440L10272L1744O72768N12
$$ plain form
5628 1460736 116736 8192 539648 837632 496128 84992 553472 1082368 -148480 -518656
5618 -518656 898560 1415680 460800 813056 737280 -188928 -34304 671744 1152512 -263680
5607 821248 766976 1567232 -671232 734720 281600 533504 910336 277504 963072 386048
5596 148480 -152064 667136 765952 1026048 -152064 626688 1637888 1083904 577024 135680
5585 1511424 1331200 994304 505344 527360 511488 702464 502784 -50176 614400 1277952
5575 1277952 1001984 -121856 1032704 1036800 -819200 -90624 -169984 275456 1566720 292864
5564 208896 1458176 1392128 387072 1316864 610816 793088 452608 422400 1640448 806912
5553 964608 2173952 -130048 294912 -12800 1128448 -238080 959488 1270784 -551424 -170496
$$ packed form
5628A460736A16736H192N31456K97984l41504H4992M68480N28896a48480l70176
5618e18656H98560N17120D60800L52256p5776a88928c4304F71744M80768b63680
5607H21248n4272Q00256f71232G34720B81600K51904L76832B77504O85568C86048
5596A48480a52064F67136R8816K60096a52064F26688J011200n53984n06880A35680
5585A511424j80224l36896m88960K2016j5872J90976j99680e0176F14400O63552
5575A277952k75968a21856A032704M096h19200i0624p9360B75456J291264B92864
5564B08896J249280o6048C87072R29792F10816J82272l40480l0208J218048H06912
5553I64608J209344a30048B94912a2800A128448b38080I59488L11296e51424a70496
$$ plain form
5542 1447424 1117184 1112064 817664 482816 602624 95232 611840 329216 1401344 -105984
5531 252416 681984 318464 330240 747008 735744 410112 780288 -506368 1746944 253952
5520 784896 118272 415744 75776 709120 792576 1107456 -173568 8704 2041856 1313280
5510 1313280 -13312 579584 1218560 456192 389632 115200 139776 1388544 573440 324096
5500 324096 -217600 -441856 1187328 525824 612864 1152000 744448 -163840 483328 1851392
5490 1851392 687616 1811968 1009664 798720 1252864 1267712 508416 280064 46080 1696768
5480 1696768 369664 659456 1321984 1574912 1349632 1297408 192000 583168 1213952 798720
5470 798720 848384 1771520 1742336 1001984 1128448 348672 1050112 1500672 1578496 977920
$$ packed form
5542A447424l30240n120k94400l34848J19808I5232N16608k82624J072128a05984
5531B52416M29568C18464J1776M16768j1264l25632L70176e06368A746944B53952
5520G84896A18272K97472G5776O33344Q3456L14880a73568H704K033152p28576
5510A313280a3312E79584O38976D56192o6560A15200K4576J248768E73440k49344
5500C24096b17600k24256A187328E25824Q7040N39136m07552a63840D83328J368064
5490A851392F87616J124352q02304k10944M54144J4848E08416k28352D6080J650688
5480A696768C69664K89792O62528K52928k25280n2224A92000L91168O30784m15232
5470G98720M9664R23136k9184p40352J26464C48672P01440M50560P7824o00576
$$ plain form
5460 977920 1675264 1435136 1993728 259584 602624 837120 1133568 340992 432128 -73728
5449 1431552 1477120 699392 39936 583680 342016 105984 1455104 326144 1037312 858112
5439 858112 21504 635392 -398848 1328128 -464896 681472 948736 -184320 -72192 524800
5428 1375744 -3584 665088 1438208 911360 693760 462848 782336 -399872 344064 -266752
5417 -336896 -624640 -145920 188928 700416 1636352 697856 186880 641024 -334848 889856
5406 1101824 345600 769536 1764352 881664 -73216 1481216 818176 940544 68096 798720
5396 798720 754176 831488 1147904 410112 475648 1820672 1489408 1489408 1239040 1374720 -135680
5384 734720 1525248 272384 683008 94720 403968 818688 1537024 -48640 584704 804864
$$ packed form
5460I77920O97344k40128N58592B59584L43040K34496K96448C40992R1136g3728
5449A431552M5568F99392C9936N43744k41664A05984J349120C26144P11168j79200
5439H58112B1504O13888c98848A328128d64896F81472K67264a84320g2192E24800
5428A375744c584F65088P73120n26848k17600k30912L19488c99872C44064b66752
5417c36896k87744a45920A88928N11488R35936F97856A86880M54144c34848H89856
5406A101824C45600M23936R94816H81664g3216A481216o63040J22368F8096P30624
5396G98720m4544P7312L16416D10112O5536J345024l31264%k50368J35680a35680
5384G34720P90528B72384M10624I4720L09248M14720P18336d8640E84704K20160
$$ plain form
5374 804864 328192 571904 138240 474112 1813504 1238016 568832 838656 711168 957952
5364 957952 890368 1065472 916480 953856 878080 1270784 1645568 584704 1019392 446976
5353 511488 1216512 1098752 1398784 734208 688128 343552 -313856 506368 1225216 1004032
5343 1004032 800256 1278464 1123328 1378816 1610752 1196032 1741824 1397248 904192 1097728
5333 1097728 1755648 1470464 2132480 638464 970752 1370624 448512 1531904 1287168
5324 1287168 982528 1926656 57856 791552 1714176 1842176 1043456 1631744 609792 1589248
5314 1589248 190976 612864 1213440 1377280 1628672 1243648 1087488 1155584 795648 964096
5304 964096 2003968 1752576 1939968 973312 2084352 256512 1680896 778240 1189376
$$ packed form
5374H04864C28192K43712A38240L35872J339392n75488E68832K69824j27488K46784
5364I57952o7584J75104j48992L7376p5776L92704L74784E84704M34688D46976
5353E11488P05024j17760L00032o64576m6080C43552c13856E06368P18848k21184
5343A004032k03776M78208j55136K55488K31936m14720N45792l44576m93056J93536
5333A097728O57920k85184O62016F38464L32288L99872D48512J083392k44736
5324A287168l04640R44128E7856P33696R22624J28000p98720N88288F09792R79456
5314A589248A90976M21888O00576J63840K51392l85024j56160O8096l59936J68448
5304I64096J039872k51392J87392r66656J111040B56512J424384G78240M11136
$$ plain form
5295 1189376 1449984 567808 1152512 1318400 957952 419328 1448448 1157632 1059840 886272
5285 886272 2220544 752640 -237056 1942528 260096 834560 1259520 892416 1102336
5276 1102336 934400 871424 983552 1067008 1718272 -217600 770560 422400 965632 866304
5266 866304 557568 1080320 -134144 379392 1085952 1359872 299008 2038784 972288 159744
5255 391680 1710080 1169920 1063424 401408 692736 1069568 794112 452608 2080768
5246 2080768 918528 263168 1442304 1152000 454656 -190464 564224 1303552 801792
5237 801792 334336 -252928 718848 -531456 968192 1006592 -57344 132608 1369088 438784
5226 58368 527360 -299008 763392 685568 1079296 683008 726528 50176 1332736 1431040
$$ packed form
5295A189376K60608E67808N84704J65888l60448D19328J029120k90816r7792j73568
5285H86272J334272G52640b37056A942528B60096N74464M24960l67104K09920
5276A102336j67936o2976J12128Q3456O51264b17600G70560l48160N43232r9328
5266H66304l08736N22752a34144C79392P06560K73920B99008J739776I72288A59744
5255C91680J318400n40160j06496D01408K91328L76832k75456l41504J628160
5246B080768I18528B63168J179136k90304D54656a90464E64224P39328n01760
5237H01792C34336b52928G18848e31456I68192L8400e7344A32608J236480D38784
5226E8368M68992b99008G63392p7824L93728l96288M3520E0176J282560R8304
$$ plain form
5216 1431040 8192 1444864 526336 901632 1226240 994816 618496 768512 1741312 1296384
5206 1296384 339968 1743360 995840 1024512 1038336 394752 185344 229376 -82944 867328
5195 1006592 1181184 -798720 2003456 233984 451072 536576 974848 625152 174080 921600
5185 921600 1683456 1747968 70144 749056 1012736 2269696 32256 421376 560640 228352
5174 730624 1123328 580096 1535488 629760 651264 698880 1346560 -141824 794624 1619968
5164 1619968 287744 1134592 571904 259072 591360 889856 359424 333312 552448 1145856
5154 1145856 485376 1402880 401920 1249280 666112 1428992 1189888 557568 -753152 1020928
5143 968704 104448 751616 248320 751104 565248 729088 632832 1641984 670208 503808
$$ packed form
5216A431040H192J436672E26336L75296L24608k31424l76320J50016R72800m44928
5206A296384C39968J403392p47520K8672J3824C94752A85344M4032h2944H67328
5195A006592J74592g98720B003456B33984K17088Q5504M38272l49696A74080P47520
5185I21600P61856O4512G0144O78912K63680J256960C2256L89120J39264B28352
5174G30624L92704n43232R55392F29760K1504M7616O47680a41824G94624Q25344
5164A619968B87744Q46848n62688B59072L32288K98496C59424k6112K19136N93408
5154A145856D85376R17504D01920Q47360n83168P62880k39104E57568g53152A020928
5143I68704A04448O47168B48320N02784j85856J63840r6256J009152F70208j66400
$$ plain form
5133 503808 993792 568320 335872 928256 1829888 1270272 1403392 -310784 740864 538624
5123 538624 742400 1154048 1288704 1145856 174592 934400 840192 -26624 1119232 1190400
5113 1190400 1759744 557568 -399872 1162752 178688 1164800 1291776 1074688 1342976
5104 1342976 2550272 697344 838656 328192 860160 902144 324096 141824 681984 2095104
5094 2095104 1469440 721408 1094656 882176 453632 610816 2141696 1169920 840704
5085 840704 415744 1137664 2124800 265728 893440 310272 1015296 1088512 1061376 808960
5075 808960 1255936 797184 1499136 1789440 689664 1062912 1337344 165888 827392 1325568
5065 1325568 1186816 1559040 426496 716288 1845248 1869312 1985024 2057728 1716224 2264576
$$ packed form
5133E03808M89984m25472k32448N92384R01632n59616J33120c10784G40864k02240
5123E38624K03776M11648J34656j42848A74592P59808r4208b6624A119232P1168
5113A190400N69344E57568c99872A162752A78688R86112J26976k17088K68288
5104A342976J207296F97344J41312C28192N31968M1984C24096A41824N40160J413120
5094B095104o25664G21408L73248k12480m28544J57184J530880r71776l29216
5085H40704D15744P21920R87136B65728O27712C10272P05024P3216k7136k52416
5075H08960M46976m58752P01952K90304F89664L73248K74432A65888O61504M98176
5065A325568j38752L72224D26496K89792J128960K4064J15712P2704l41504N48352
$$ plain form
5055 2264576 2528768 2570240 1539072 1790464 2276864 2249216 792576 1227776 1077760 981504
5045 981504 1228288 647168 157184 1214464 1312256 998912 1860096 1772544 949760 1519104
5035 1519104 -91136 1929728 1637888 -150016 910848 1063936 581120 1757696 1102336
5026 1102336 1039360 1814528 1595904 444928 325632 1675264 -44032 291328 164864 950784
5016 950784 819200 165376 -60928 1130496 -70144 800768 -218112 1966592 809984 69120
5005 1078272 1179648 839168 713216 1282048 973312 1395200 787968 1963520 776192
4995 1085952 548352 1011712 1280512 1496576 521216 962048 1078272 988160 738816 1699840
4985 1699840 345088 536576 1174528 135168 862720 632320 1354752 153600 1033216 1075712
$$ packed form
5055B264576K64192M1472j031168K51392M86400k7648G92576M35200j50016r6256
5045I81504K46784n81120A57184J057280R7792l13344Q61184q7552q22784N69344
5035A519104i1136A929728k91840a50016I10848J53088m82816J176576o55360
5026A102336o2976P75168k18624D44928j19296J349632d4032B91328j26464P85920
5016I50784j31584A65376f0928A130496g0144H00768b18112A966592H09984F9120
5005A078272J01376l40480j25952N68832l08736M21888o07232J175552G76192
4995A085952n37600M63360K68800K16064E21216M40832J16224r0112k49344R61024
4985A699840C45088J91488O37952A35168P27552k30400P22432A53600Q79616M2496
$$ plain form
4975 1075712 119808 919552 276992 407552 872448 1090048 1273344 694784 957440 1117184
4965 1117184 1666560 1033216 2045440 2238464 898560 945152 1434624 1490944 1056768 553984
4955 553984 1377792 593408 1977344 1704448 760832 949760 715776 1149952 1612288 476160
4944 1496064 1189376 714752 1079808 147456 1184256 1246720 1389056 1926144 935936 1958400
4934 1958400 939008 1068544 748544 2165760 1459712 900096 1643520 1548800 1298944 1682432
4924 1682432 1000448 862720 823808 1230336 998400 1319936 2144768 1158656 1792000 1167872
4914 1167872 1045504 498176 422400 1273856 -84992 1411584 1252864 1526272 455168 1167872
4904 1167872 1681408 2270208 1111552 1865216 1858560 1565184 1406976 1914368 842240 230400
$$ packed form
4975A075712A19808P99744B76992J30560M64896K17600J83296n78560K62656J59744
4965A117184N49376o33344J012224J93024H98560M6592M89472N6320m34176n02784
4955E53984Q23808E93408J383936k72896G60832J88928k33984M34176M62336D76160
4944A496064l06688m74624L65056A47456J036800O2464J42336N37088I35936J022464
4934A958400I39008J29536l20000J417216p06048n59616P43424r4720k49856L83488
4924A682432o81984j37728l8912M06528k31936L21536Q24832r86112O33344o24128
4914A167872j22368D98176p5776Q51456h4992A411584j58720K73408D55168P12704
4904A167872N13536N88800A111552P53664o656k93376j58208N07392H42240B30400
$$ plain form
4893 1551872 1368576 492544 1117696 1837568 2219008 929280 1504256 720384 702976 1320448
4883 1320448 1449984 955904 1238528 746496 872960 496640 1494528 2538496 1098240
4873 -29184 525824 1445888 1172992 1112064 1585152 1217536 1191424 2127872 1283584 1961472
4863 1961472 1523712 253952 1139712 1915904 1281536 2252800 2056192 1346048 1945088 1165824
4853 1165824 1659904 344064 -259584 -263680 609280 1205760 1884672 2215936 1365504 884224
4843 884224 1269760 1829888 385024 1709568 388096 1140736 112640 1730560 1648640 873984
4833 873984 1163776 1189888 1072128 1109504 1646080 1270784 1182208 720896 1542144 1252352
4823 1252352 1820160 558592 1542656 1295872 1356288 970240 1419264 2109952 614400 2162688
$$ packed form
4893A551872j83296D92544O25152P19872L81440I29280N74976G20384j7408O17472
4883A320448J29536m94080K82624m92032J26464l76320R97888J043968A098240
4873b9184E25824R20064k72896o0928M73088l67616k6112R36448q44288O77888
4863A961472m37760B53952Q85760P76192o34368R71264j96608p10144N99040p79264
4853A165824M94080C44064b59584m096F09280N96480O78912L31264q50432m81280
4843H84224L85536N60128C85024J324544C88096P52640A12640J617920q1920p74656
4833H73984K89792K6112j17760L7376N36576l75296q8576m61312Q21248k89792
4823A252352N67808E58592R84064k46784O0416l86048M49024O90688F14400J548288
$$ plain form
4813 2162688 1346560 2719744 1796608 1595904 1933312 2917888 3874816 3140096 3248128
4804 3248128 3832832 3523072 5748224 4796928 5232640 5129728 4760576 4961280 4097024
4795 4097024 3589632 2253824 2338816 2422272 1865216 1689088 1402368 1866752 1569280 1470976
4785 1470976 1911808 1034240 674816 1158656 675328 903680 1114112 236032 622080 614912
4775 614912 1148928 1299968 1316352 2788352 1510400 886784 615424 1226240 1867264 823808
4764 1024000 2033152 418304 1043968 1332224 1217024 1169920 1129984 641024 1640448 998912
4754 998912 41472 1045504 1404416 1044992 1802752 1582592 1022976 1199104 737280 1462272
4744 1462272 1343488 1362432 1091584 1746432 1006080 996352 1238016 1830912 1382912 2017280
$$ packed form
4813B162688q16128J373184r23136k00704L37408R84576R56928p34720J08032
4804C248128N84704l09760K225152r51296M35712j02912l69152K00704q64256
4795D097024n07392j335808Q4992Q3456n57056j76128k86720M64384k97472r8304
4785A470976M40832q77568l59424M83840m83328K28352K10432B36032L86048p168
4775F14912N34016J51040J6384J472000j277952o23616k71360O10816O41024H23808
4764A024000J009152D18304O25664K88256j15200m7104l9936m88960R99424o41536
4754I98912D1472J004032L58912l59424P57760k20160n59616J76128m61824P24992
4744A462272j18784J8944k70848O54848p40352r728K41664N92896m48000O34368
$$ plain form
4734 2017280 1064448 2118144 1534976 239616 1117696 1819648 2019840 1879040 747008
4724 679424 1322496 2188800 927232 953344 1267200 1714688 626688 928256 1459200 1203200
4714 1203200 818688 1677824 1493504 2358272 1108992 1049088 953856 989696 -39936 1047552
4703 1792000 1870848 2141696 1275392 1337856 1420800 2002432 1738752 1213440 1065984 1959424
4693 1959424 357888 2240512 1854464 1875456 1862656 1221632 833024 1402368 869888 930304
4683 930304 1976832 1350656 1386496 1571840 587264 847872 1309696 1266688 1325568 3027456
4673 3027456 1250304 1349632 1745920 1404928 1485824 1340928 1031680 1254400 1435136 878080
4663 878080 831488 1330688 207360 1084416 664576 1227264 1485824 1677312 1032704 1357312
$$ packed form
4734B017280r52832J053696n83168B39616Q78080P01952K00192j40800G47008
4724F79424O43072Q66304I27232K6112L13856M47488F26688L01568N30944k56000
4714A203200l84512Q59136j84320Q64768A108992n9904r5232L5840c9936A047552
4703A792000P8848K70848q66304O2464Q2944N81632k63680n25312j47456Q93440
4693A959424C57888J882624l86048K0992j2800o41024l88608N69344n32480O0416
4683I30304J046528o26176L5840J85344E87264K60608M61824m3008N8880J701888
4673C027456A250304R9328L96288l40992Q0896j44896l09248K22720J80736n57056
4663H78080m6592M99200B07360Q77056m19840N62688K58560J91488o44608L24608
$$ plain form
4653 1357312 1008640 1217536 1774080 1998848 1694720 2166784 2301952 1446400 1586176 1977856
4643 1977856 1618944 1437184 2112000 1506816 1655808 803328 1269248 2183680 1226752 1745408
4633 1745408 952320 572416 687616 1318400 193024 1707008 1988608 1000960 1933312
4624 1933312 1622528 1457664 2939392 941568 1649152 1160192 1930752 105984 1888256
4615 1888256 1510400 1659392 1607680 1894400 1830400 1575424 1243136 1112576 930304 2045440
4605 2045440 2466816 1685504 2391552 2026496 557056 1927680 1394176 1757696 1388032
4596 1388032 1129472 1635840 1689088 1715200 1962496 1751040 1661440 811520 2349568 2099200
4586 2099200 1770496 1470976 1995776 1089536 2449920 1971200 1973760 1625600 1329664 989184
$$ packed form
4653A357312l48672K08896N56544K24768l04128M72064J35168q55552J39776L91680
4643A977856l58912j81760O74816o05184J48992H03328M65920R14432r56928N18656
4633A745408p93088l79904J15200O30784A93024J513984K81600r87648R32352
4624A933312l10784j64864J481728I41568P07584m88960P70560A05984J782272
4615A888256l77856J48992n1712K86720o4000k54976l32288j30560j82272J115136
4605B045440M21376p81312P06048l65056E57056J370624n33504L63520l69664
4596A388032k58560N06368N3248K6112K47296k11456q9600H11520J538048k50368
4586B099200l28704k99520N24800r06240J360384m78720K560l48160k95936l40480
$$ plain form
4576 989184 1955840 798208 2402304 1875456 1645568 729600 2321920 2915328 1247232
4566 931840 1582080 2407424 505856 1817088 1354752 1648640 949248 2408448 1891840
4557 1891840 1549312 1327104 1635328 2221056 1888768 2400256 2049024 1488896 1604096 1077248
4547 1077248 1432064 1380864 2550272 2636800 1802752 2760704 3202048 2485760 1888768 1218560
4537 1218560 1800704 2796032 1861632 2654720 1120768 2608640 2210816 2398720 2199552
4528 2199552 2424320 2634240 1879552 1163776 877056 1940480 1316352 880640 1908736
4519 1908736 1586176 2731008 1992704 2565120 1650688 1915392 2500096 1689600 1728512 1565184
4509 1565184 2629632 2629632 1726976 1969152 1676800 2177024 2791424 2984960 3209728 2418176
$$ packed form
4576I89184R66656G98208J604096n26848k29888G29600J592320N93408A247232
4566I31840O50240Q25344E05856J311232m62336K93888o99392J459200n16608
4557A891840l42528k22208L08224N85728l32288N11488l51232n60128J15200n26848
4547A077248L54816n1200J169408Q6528q34048R57952M41344p16288n96992o70208
4537A218560N82144R95328r34400P93088A120768J487872l97824J87904j99168
4528B199552K24768K09920p54688p15776k86720J063424o24128m35712J028096
4519A908736l22560J144832p38304N72416r14432K64704N84704q10496L8912j63328
4509A565184J064448%r02656K42176k92352N00224O14400J93536K24768p91552
$$ plain form
4499 2418176 2576896 2660864 991232 2409984 2829312 2401280 2925568 2651136 3111424 1641472
4489 1641472 2639360 2618368 2865152 3121152 2668544 1264128 2219520 2490368 1874944 2509824
4479 2509824 1433600 2208768 1554944 2673152 1476608 759808 1445376 314368 1709568
4470 1709568 1400320 1892864 1731072 2202624 648192 2765312 1630208 2690560 1307648
4460 2684416 1395200 2659840 1683456 1055744 1443328 1934848 1603584 1566720 1304064
4451 1304064 1243648 967168 1564160 1693184 1559040 1380864 1999360 2536448 1373696 2314752
4441 2314752 1063424 1375232 2649600 372736 1681408 1936896 2382848 1959424 1545728
4432 1545728 2298880 2313728 1290752 1534976 1639424 2056704 1282560 2131456 1857024 2920960
$$ packed form
4499B418176J58720Q3968I91232J418752M19328m28032N24288k74432M60288j469952
4489A641472R97888k0992K46784K56000m52608A264128R55392K70848o15424O34880
4479B509824j076224P75168o53824J118208j196544p16800O85568C14368J395200
4470A709568l09248M92544j61792M71552F48192K117120j135104J060352A307648
4460B684416j289216J264640r76384o27712L87584M91520l31264l6864k62656
4451A304064o0416k76480N96992J29024j34144j78176O18496N37088j162752R41056
4441B314752A063424L11808J274368C72736J308672K55488M45952m23424m13696
4432A545728P53152J4848j022976K44224J04448M17280p74144Q48896k74432J063936
$$ plain form
4422 2920960 2718720 2080768 2094080 3223552 1628160 2916352 2681344 2570752 2924544
4413 2924544 2443264 2229248 2951680 3310080 3022848 3718144 3045888 1795584 2513920
4404 2513920 2435584 3450368 2865152 2663936 3633664 3042816 2712576 2931200 3164160 2706944
4394 2706944 2383872 2478080 3479040 2809344 2009088 1743872 2255872 2164736 2936832 3046400
4384 3046400 2403840 1865728 2780672 2761728 1990656 2078208 2504704 2537984 2127872 3400704
4374 3400704 1616384 2103296 1264128 3116032 1710080 2301952 1068032 3182080 1606656
4365 1606656 1346560 2141696 1589248 1478656 1546752 2098176 1601536 3102208 1696256
4356 1696256 1461248 2522624 2591232 2441728 1958400 2852864 1755136 2092032 2362368
$$ packed form
4422B920960k02240o37952J3312J129472j595392J288192k35008j10592L53792
4413B924544m81280k14016P22432L58400k87232O95296o72256j250304P18336
4404B513920p8336J014784n85216k01216R69728n90848l30240K18624K32960m57216
4394B706944l23072R4208J000960o69696q00256k65216N12000r1136P72096J09568
4384C046400o42560n38112R14944j8944p71072Q7552M26496L3280m10112J272832
4374C400704A616384M86912q39168J851904j405952N91872A068032K114048j575424
4365A606656k60096P95136n52448j10592O8096N51424m96640J500672j405952
4356A696256k35008J061376O8608j49504m83328Q94464j097728L36896K70336
$$ plain form
4347 2362368 2885632 2738176 2418688 1740800 2125312 1691136 2156032 1603584 3117568
4338 3117568 3165696 2715648 2936320 1544704 3066880 2852352 2612224 1649152 2106880
4329 2106880 2268672 2190336 2372096 2352640 1626112 2332672 1632256 3736064 1424896 2223616
4319 2223616 1050624 2365440 3086848 1027584 2553344 2065408 1699840 1824768 2106368
4310 2106368 2579968 1454592 1838080 3014144 2621440 2428928 2310144 1397760 2007040
4301 2007040 2118144 2330624 1453056 2959360 2269696 1488384 1304576 1763840 3041280
4292 3041280 2816512 2660352 2857984 2638848 2707968 3030016 3322368 2922496 2873344 4118528
4282 4118528 3226624 2660864 2530816 2940928 2919936 2430976 1662464 2638336 2534400 2515968
$$ packed form
4347B362368N23264j47456l19488o77888L84512m34176M64896n52448J513984
4338C117568M8128m50048K20672j391616J522176k14528k40128r63072M57728
4329B106880J61792p8336J81760j9456p26528P06560p00416K103808A424896P98720
4319B223616A050624J314816P21408A027584J525760m87936l65568J24928K81600
4310B106368M73600j125376L83488J176064l92704j92512j18784r12384O09280
4301B007040J11104K12480q77568J506304o89664p81312j83808M59264J277440
4292C041280k24768j56160J97632k19136O9120L22048K92352l99872m9152J245184
4282D118528q91904n65760j30048M10112k0992m88960p68512R75872j03936j8432
$$ plain form
4272 2515968 558080 2617856 1289216 2433536 2316288 724480 2760704 1788928 1989120
4263 1989120 2267648 2976768 2578432 2532352 2501120 2938880 2070528 2128896 2969600 1783296
4253 1783296 2347520 2536960 2283520 1389056 2379264 1864192 2261504 2449920 3091968 2529280
4243 2529280 2597888 3000320 1801216 2884608 2461184 2445824 2620416 1831936 2820608 3055104
4233 3055104 1947136 3389952 2272256 2117120 2430464 2156032 2403840 1783296 3624960
4224 3624960 2050048 2916864 2256896 1760768 3005952 2354688 1590784 1462784 2133504
4215 2133504 2898944 2075648 1815040 2086400 2692608 1584640 1172480 1820672 1973248
4206 1973248 2203648 1782272 1867264 2124800 2529280 2141696 953344 1997824 2125824 1946112
$$ packed form
4272B515968E58080K059776A289216J144320j17248G24480K036224r71776K00192
4263A989120K78528P09120l98336m6080l1232M37760q68352N8368Q40704j186304
4253A783296N64224J89440k53440q94464R90208n15072L97312J88416O42048n62688
4243B529280O8608M02432j199104J083392m23424j5360J74592p88480R88672K34496
4233C055104j107968J442816j117696j55136L13344k74432K47808o20544J841664
4224C624960j574912Q66816o59968m96128J245184o51264p63904j28000O70720
4215B133504P65440q23296k60608K71360O06208j107968m12160O48192J52576
4206A973248K30400m21376Q4992K57536M04480l87584I53344J044480J28000j79712
$$ plain form
4196 1946112 1217024 1923584 2572800 2724352 714240 2809856 2501120 2290176 2874880
4187 2874880 2570752 2825216 1795072 2562048 1675264 2947072 2222080 3489280 1611264
4177 2961408 2606592 2701312 2063872 2161664 2309120 2918400 1939968 1697280 1928704 2391552
4167 2391552 1369088 2884096 2209280 2483200 2255872 2200064 3144704 2878464 2255872
4158 2255872 1996288 3430400 3081728 2658816 1965568 1899520 2019840 2867712 1531904
4149 1531904 3051520 3092480 2706432 2947072 2410496 3640832 2417152 2374656 3495936
4140 3495936 3270144 2357760 3654144 3172864 2775040 3291136 2490880 3620352 3484160
4131 3484160 3309056 3941376 3557888 2550272 2277376 2533888 2906624 2247168 3284480
$$ packed form
4196A946112p29088P06560O49216J51552G14240K095616l08736k10944N84704
4187B874880l04128K54464j030144P66976q86784J271808p24992J267200A611264
4177B961408l54816R4720o37440R7792J47456O09280r78432k42688K31424M62848
4167B391552j022464J515008o74816K73920k27328n5808R44640k66240o22592
4158B255872k59584J434112l48672m22912o93248o6048J20320Q47872j335808
4149A531904J519616M0960l86048K40640n36576J230336j223680m2496J121280
4140C495936k25792r12384J296384m81280l97824N16096q00256J129472j36192
4131C484160j75104O32320l83488j007616k72896K56512L72736o59456J037312
$$ plain form
4122 3284480 3230720 2549760 2970624 3526144 3480064 2646016 4134400 2872832 3330048 3382272
4112 3382272 3087872 3400192 3065344 4124672 3791360 3460096 3911168 4107264 3371520
4103 3371520 2883584 3069440 2099200 2996736 2726912 3265024 2618368 7437312 2747904
4093 3214848 3048448 3371008 4120576 1590784 2492928 2060288 2518016 1755136 2511360
4084 2511360 3322880 2419712 2749952 3326976 2464768 3430400 2726912 3307008 2152448
4075 2152448 3276288 3183104 3376640 3123712 3573760 3209216 2930688 2859520 2496512 3796480
4065 3796480 2830336 3120640 2891264 3619840 3736576 3998208 3226624 4169216 3412480 2373632
4055 2373632 3514368 3521024 3702272 3467264 2756096 3089920 3419648 3228672 3016704 3229184
$$ packed form
4122C284480n3760o80960M20864N55520m6080q34048J488384j261568M57216N2224
4112C382272k94400L12320l34848J059328l33312l31264M51072J96096p35744
4103C371520m87936J85856r70240Q97536k69824N38112o46656M818944B747904
4093C214848j66400L22560P49568A590784R02144m32640M57728p62880P56224
4084B511360Q11520r03168L30240N77024q62208R65632p03488N80096j154560
4075B152448J123840r3184J93536k52928M50048l64544k78528p1168l63008J299968
4065C796480r66144K90304k29376P28576J16736K61632p71584R42592p56736j038848
4055B373632J140736O656J81248k35008p11168L33824L29728j90976k11968K12480
$$ plain form
4045 3229184 3194880 3185152 2832896 3235328 1303040 2995712 3451904 2367488 3206144 2393088
4035 2393088 3233792 2207744 2951168 2540544 3316224 2814976 3045888 3088384 3904000 3196928
4025 3196928 2569216 3562496 3799552 3072512 2683392 3289088 2727424 3845632 3167744
4016 3167744 3758592 3505664 3645440 2875392 2979328 3565568 2629120 1937408 2498560 3062272
4006 3062272 2250240 1443328 2289664 3239424 3253760 2788352 2034176 3236352 2229248
3997 2229248 2848256 3825664 2956288 3634176 4261888 2850816 3395072 3294208 3624960
3988 3624960 3381760 3588096 3155968 4169728 3694080 3820544 3079680 3881472 3048960
3979 3048960 4451328 3389952 3774976 3582976 3353088 3302400 3151360 3135488 3109888 2579456
$$ packed form
4045C229184l4304r728l52256M02432A303040J692672M56192j084416Q38656q13056
4035B393088Q40704j026048P43424m10624P75680n01248K30912M2496Q15616p07072
4025C196928o27712R93280K37056p27040l89120O05696n61664J118208o77888
4016C167744N90848k52928J39776p70048J03936N86240r36448o91712N61152N63712
4006C062272q12032q06912Q46336R49760J4336m65408p54176J202176j007104
3997B229248O19008R77408q69376O77888O27712j411072N44256j00864L30752
3988C624960k43200K06336m32128J013760m75648J26464p40864Q01792q32512
3979C048960J402368j061376L85024j92000k29888n0688j51040j5872k5600n30432
$$ plain form
3969 2579456 2609152 3264000 3263488 3708928 2825728 2427904 2006016 3345408 2876928 2247168
3959 2247168 2703872 2343424 2450432 1793024 2162688 2923008 3364864 1677824 3035136
3950 3035136 2440192 2531840 2042880 3058688 2202112 3187200 2242048 2597376 3109888 2825728
3940 2825728 2485248 2021888 2797568 2983424 2576896 3426816 3577856 2272256 2006528
3931 2006528 2769920 3220992 3347456 2241536 3503104 2484736 3262976 2155008 2913792
3922 2913792 1485312 1721856 2591232 2784256 3397120 4040704 2970112 3045888 2359808
3913 2359808 3523072 3881984 3493888 2667008 3702272 3655168 3282432 3923968 3955712 4495360
3903 4495360 3864064 4820480 5129728 3929600 4904960 4166656 3662848 4682752 4741632
$$ packed form
3969B579456K9696O54848n12M45440q83200l97824m21888J339392m68480o29760
3959B247168M56704l60448J07008o57408L69664P60320M41856A677824J357312
3950C035136n94944R1648m88960J015808q56576R85088r45152L55328N12512k84160
3940B825728l40480m63360P75680J85856m06528Q49920J51040j305600k65728
3931B006528P63392M51072J26464j105920J261568j018368P78240j107968P58784
3922B913792j428480K36544Q69376J93024O12864O43584j070592P5776o86080
3913B359808J163264L58912l88096q26880J035264m7104l72736O41536L1744N39648
3903D495360o31296R56416L09248j200128R75360p38304n03808J019904N8880
$$ plain form
3894 4741632 5479936 4763648 4824064 5734400 4951040 5196800 5535744 5713408 6336512 4296704
3884 4296704 6090240 6259712 5877248 5957120 6566912 6785024 6633472 7025152 7026688 5974528
3874 5974528 5474816 6061056 5740544 7104512 7068672 7081472 7994368 7118336 7819264 7664640
3864 7664640 7995904 6832640 8447488 7987712 8514560 7609856 7730176 7915008 7823872
3855 7823872 8561152 9183232 8829952 9276928 8350208 10166272 11411968 9154560 9619456
3846 9619456 9766912 11106304 11319296 12028416 12402176 13003776 14533632 12935680 12994048
3837 12994048 12191744 11472384 10890240 9306112 9143808 6258688 5404160 5713920 5269504
3828 5269504 5307392 5248000 5175296 4754944 3652096 4799488 4561408 3640320 4521472 5202432
$$ packed form
3894D741632P38304p16288O0416R10336p83360K45760L38944J77664O23104k039808
3884D296704J793536J69472l82464P9872O09792K18112j51552L91680J536j052160
3874E974528m99712N86240l20512J363968l5840J2800R12896q76032P00928j54624
3864G664640L31264j163264J614848m59776N26848r04704J20320J84832r1136
3855G823872P37280O22080l53280M46976r26720J816064J245696k257408M64896
3846I619456J47456J339392K12992P09120L73760O01600J529856j597952N8368
3837A2994048q02304p19360n82144j584128j62304k885120q54528L09760m44416
3828E269504L7888n9392p2704m20352j102848J147392k38080r21088Q81152O80960
$$ plain form
3818 5202432 4480000 4919296 3451392 4236800 4124672 4312576 3198464 3233280 4646912
3809 4646912 4290560 3068928 3784704 3773952 3802112 3721728 3524096 3995648 4490240 3970048
3799 3970048 2814976 4018176 3988992 3177984 3900928 3315712 3436032 2649088 5146112
3790 5146112 3764224 3602944 3203072 3179008 3165184 3143168 2768384 3122176 4273664 3251712
3780 3251712 3877888 3210240 3040768 2635264 3115520 3515904 3692032 3524608 3459584 3978752
3770 3978752 3495936 3387904 3240448 3886592 3120128 3134976 3404288 4070912 3828224 4401152
3760 4401152 3528704 3011584 3848192 4220416 3215872 2350592 4090368 3791360 4314624
3751 4314624 3230208 3506176 3305472 3776000 4206080 4085760 3195392 2950656 3302400
$$ packed form
3818E202432p22432M39296j467904P85408j12128J87904j114112L4816J413632
3809D646912l56352j221632P15776j0752K8160q0384j97632M71552M94592n20192
3799C970048j155072J203200k9184q11008P22944n85216J20320p86944K497024
3790E146112j381888j61280l99872k4064j3824k2016l74784L53792J151488j021952
3780C251712O26176o67648j69472m05504M80256M00384J76128j67424o5024N19168
3770C978752m82816j08032j47456O46144p66464J4848K69312O66624k42688N72928
3760D401152q72448n17120Q36608L72224j004544q65280J739776k99008N23264
3751D314624j084416K75968k00704M70528M30080j20320q90368k44736L51744
$$ plain form
3742 3302400 4121600 3740160 3012608 2766336 3579904 3177472 4101632 3462656 3449344 3314688
3732 3314688 3514880 3713536 3035136 4129280 3798528 4149760 3937792 3151872 3737088
3723 3737088 3929088 4066816 3826176 2948096 3271680 4426752 3876864 3918336 4690432 3402240
3713 3402240 3683840 4475392 3625472 3324416 4637184 3056640 3642368 3885568 3529728
3704 3529728 4238336 2888192 3853824 3348992 3982336 3576320 3449344 4701696 2960384
3695 2960384 4815360 3333120 4087808 3626496 3620352 3815424 3760640 4014080 3294720 3794944
3685 3794944 4131840 4206592 4782592 5346816 3386880 3106816 3408384 4206592 4974592 4557312
3675 4557312 4144128 3774464 3972608 5177856 4427264 3192320 4941824 4441600 3697664
$$ packed form
3742C302400Q19200l81440p27552k46272Q13568m02432R24160o38976j3312j34656
3732C314688K00192J98656o78400J094144l30752L51232k11968p85920N85216
3723C737088J92000J37728k40640q78080L23584J155072n49888M1472P72096j288192
3713C402240K81600P91552q49920l01056J312768j580544N85728K43200l55840
3704C529728P08608j350144R65632n04832O33344m06016j26976J252352j741312
3695B960384J854976j482240P54688m61312o144J95072n4784K53440p19360N00224
3685C794944L36896P4752N76000N64224j959936k80064L01568P98208P68000m17280
3675D557312m13184l69664J98144J205248p50592j234944J749504n00224p43936
$$ plain form
3666 3697664 4094976 3979264 4247552 3682816 3076096 3853312 4361728 3881984 4545024 4503040
3656 4503040 4290048 4325888 5838848 4701184 5356032 5306368 5703680 4683264 5227520
3647 5227520 4675584 5592576 4458496 5214208 4804096 5803520 5854208 5057024 5695488 6093312
3637 6093312 6412800 6562816 6280704 6555648 6316032 6565888 6470144 6396928 7001600 8258048
3627 8258048 7314432 6814720 7077376 8212992 7486976 8816640 7832576 8251904 8860672
3618 8860672 8394240 7918080 8752128 9061888 9027584 8629248 9418752 9279488 9869824 9048064
3608 9048064 10482176 9804288 11224064 11255808 10790912 11390976 12224512 12123648 12907520
3599 12907520 13123584 12957696 15639040 15086592 16159744 17929728 18442752 18964480 20060160
$$ packed form
3666C697664L97312j15712K68288n64736o06720P77216N08416m79744O63040m1984
3656D503040k12992L5840J512960j137664O54848m9664L97312j020416N44256
3647E227520n51936R16992j134080P55712m10112R99424N0688p97184O38464L97824
3637F093312L19488J50016k82112K74944k39616K49856r5744p3216O04672J256448
3627H258048r43616m99712K62656J135616p26016J329664r84064M19328O08768
3618H860672m66432m76160Q34048L09760l4304l98336P89504j39264N90336q21760
3608I048064J434112o77888J419776L1744m64896O00064Q33536j00864P83872
3599A2907520K16064j65888K681344n52448J073152J769984N13024N21728J095680
$$ plain form
3590 20060160 22040064 20719616 20589568 21059072 20475392 22035968 23078400 23653888 24420352
3581 24420352 25568768 26048512 27071488 27609088 28900864 29920256 31111680 30646784 32817152
3572 32817152 32219136 31209984 29079040 25919488 22482432 19629056 16795648 15393280
3564 15393280 14235136 14647808 14791680 15417344 16570368 16325632 16511488 14982144 12729344
3555 12729344 11206144 10613760 9655296 9673728 9136128 8491008 9716224 8841216 8615424
3546 8615424 9210880 8498688 8889344 8766464 8286208 8664576 9950720 8913408 9045504
3537 9045504 9400832 8398848 7999488 8357888 9105408 8060928 8761344 8767488 9020928 8545792
3527 8545792 9030144 9653248 8303104 7626752 8476160 8287744 7381504 7153152 6347264
$$ packed form
3590B0060160J979904j320448j30048M69504n83680J560576J042432N75488P66464
3581B4420352J148416M79744J022976N37600J291776J019392J191424m64896K170368
3572C2817152n98016j009152k130944l159552l437056k853376k833408j402368
3564A5393280j158144M12672J43872O25664J153024k44736J85856j529344k252800
3555A2729344j523200n92384r58464J8432n37600o45120J225216q75008k25792
3546H615424N95456p12192L90656j22880m80256L78368J286144j037312J32096
3537I045504L55328j001984l99360L58400P47520j044480P00416O144K53440m75136
3527H545792M84352O23104j350144o76352Q49408j88416r06240k28352q05888
$$ plain form
3518 6347264 6934016 7115776 6926848 6002688 6908928 6242816 7577088 5952000 6962176
3509 6962176 6589440 6182400 7384064 6085632 6531072 6431744 7721472 6257152 6569984
3500 6569984 6090752 6967296 7597568 6456832 7175168 7288320 6143488 7006720 6783488
3491 6783488 6534656 6593024 7136256 6749184 6617600 7753728 6802944 6576640 7222784 8337408
3481 8337408 7235584 7244800 7684608 5914624 7186944 7889920 7077888 7639040 7394816
3472 7394816 7069184 7830016 8086016 6979584 7900672 8924160 7632384 7025152 7320576
3463 7320576 7801344 7153664 7296000 7172096 7624704 6671360 7754240 6694400 7948800
3454 7948800 7984640 6294528 6929920 7558144 7219712 8176128 8260608 7340544 7109632 7862784
$$ packed form
3518F347264N86752J81760j88928r24160R06240o66112J334272j625088J010176
3509F962176l72736m07040J201664j298432M45440r9328J289728j464320L12832
3500F569984m79232Q76544O30272j140736P18336J13152j144832Q63232k23232
3491F783488k48832N8368N43232l87072j31584J136128r50784k26304O46144J114624
3481H337408j101824R216M39808j769984J272320P02976q12032N61152k44224
3472G394816l25632P60832K56000j106432R21088J023488j291776o07232K95424
3463G320576M80768o47680J42336j23904M52608r53344J082880j059840J254400
3454G948800L5840j690112O35392O28224l38432R56416Q4480r20064k30912P53152
$$ plain form
3444 7862784 7457792 7823360 8212480 7540224 7867904 8328704 8829440 8742912 9277440 8103936
3434 8103936 8001024 9015808 8788992 9046528 8816128 9738752 9614848 8686592 9225728
3425 9225728 9396224 8629760 9661952 8947712 8629760 8458240 9005056 7659520 10243072
3416 10243072 9158656 9647616 9611264 11260928 9661952 10403328 10117120 8954880 9576448
3407 9576448 9569792 10793984 9863680 8908288 10512384 9879552 9605120 9130496 9118208 9846272
3397 9846272 10118656 9521152 9880576 10272256 11190272 12724736 11118592 11388928 10818048
3388 10818048 10821632 11821056 12697600 13359616 12822016 12049920 12496896 14665216 13109248
3379 13109248 13407232 15140352 15527424 17203200 16854528 16791040 16320512 17180672 17154560
$$ packed form
3444G862784m04992L65568L89120o72256L27680M60800N00736q6528N34528j173504
3434H103936j02912J014784k26816K57536k30400R22624j23904r28256N39136
3425I225728J70496p66464J032192p14240l17952j71520N46816j345536K583552
3416A0243072j084416M88960l6352J649664j598976P41376k86208j162240O21568
3407I576448o656J224192r30304r55392J604096o32832k74432m74624j2288P28064
3397I846272K72384n97504L59424L91680R18016J534464j606144K70336n70880
3388A0818048L584R99424Q76544O62016n37600p72096M46976K168320j555968
3379A3109248K97984J733120L87072J675776l48672o3488m70528Q60160k6112
$$ plain form
3370 17154560 18238464 16044544 18308608 18219008 19017216 18610176 18203136 20199424 19848704
3361 19848704 20182528 21644800 22627328 22907904 23646208 23578624 25615872 25791488 25810944
3352 25810944 27531264 28332032 27128832 29458432 29397504 31763456 33145344 33186816 34772480
3343 34772480 36559360 37707264 40492032 41080832 42509312 45295616 47601664 50673664
3335 50673664 54554112 55973888 60767744 65544192 69433344 75215872 81722880 89440768
3327 89440768 97407488 106908672 117635072 126112768 136450048 147539968 160132096 172072448
3319 172072448 184813056 200925184 216726016 235807232 259877376 287753728 320025088
3312 320025088 360308736 410265600 475867136 564941312 690234880 858167296 1056310272
$$ packed form
3370A7154560J083904k193920K264064q9600P98208m07040m07040J996288l50720
3361A9848704L33824J462272R82528K80576P38304o7584K037248J75616J9456
3352B5810944J720320Q00768j203200K329600o0928K365952J381888M1472J585664
3343C4772480J786880J147904K784768N88800J428480K786304K306048L072000
3335E0673664L880448J419776M793856M776448L889152N782528O507008P717888
3327H9440768P966720R501184J0726400Q477696J0337280J1089920J2592128J1940352
3319A72072448J2740608J6112128J5800832J9081216K4070144K7876352L2271360
3312C20025088M0283648M9956864O5601536Q9074176J25293568J67932416J98142976
$$ plain form
3305 1056310272 1243179520 1334201856 1271584256 1084104192 859062784 657181696
3299 657181696 501060608 386272768 301725696 240052736 196319232 163016192 139858432
3292 139858432 120579584 107619328 95892992 87183872 78960128 72541696 68842496 63461376
3284 63461376 59468800 56936448 54802944 51456000 48348672 45918208 42891264 41260032
3276 41260032 39266304 36422144 35867136 33835008 32393216 32334848 30407168 29760000 29633024
3267 29633024 27309568 26550272 25674240 24380928 23596032 23560704 23023104 21717504 20896256
3258 20896256 19919360 19195392 18392064 17356800 18378752 17514496 16885248 15630848 14986752
3249 14986752 15882752 14268416 14444032 14256128 14647296 13428736 13446144 13488128 12857344
$$ packed form
3305A056310272J86869248R1022336o2617600j87480064k25041408k01881088
3299F57181696j56121088j14787840q4547072o1672960m3733504l3303040k3157760
3292A39858432j9278848j2960256j1726336q709120q223744o418432l699200n381120
3284F3461376l992576k532352k133504l346944l107328k430464l026944j631232
3276D1260032j993728k844160n55008k032128j441792n8368j927680o47168j26976
3267B9633024k323456p59296q76032j293312p84896l5328n37600j305600q21248
3258B0896256r76896p23968q03328j035264J021952q64256o29248j254400o44096
3249A4986752Q96000j614336J75616j87904L91168j218560J7408M1984o30784
$$ plain form
3240 12857344 13135360 11812864 12290048 11662336 11464192 11671040 10424320 10788864 10160640
3231 10160640 9880064 10330112 10535936 10006016 11203072 10784256 10447360 11125760 11971584
3222 11971584 10988032 11136000 10817024 9687040 10355712 9309696 9287680 10316288 9370112
3213 9370112 9716736 9990656 10812928 9501184 9354752 9012224 9400320 7340032 8581120
3204 8581120 8713728 7800832 7736832 7985152 8246784 7910912 6983680 7984128 7552000 6365184
3194 6365184 5830144 6119424 6722048 6121472 5896192 7493120 5339136 4648448 4979200
3185 4979200 5913088 5398016 5469696 5234176 4990976 5595136 5594112 5357568 4610560 4860416
3175 4860416 5645312 5137408 6362624 6094336 5309952 6018048 6370304 5523456 6208000
$$ packed form
3240A2857344K78016j322496M77184o27712j98144K06848j246720L64544o28224
3231A0160640k80576M50048K05824n29920J197056m18816l36896O78400Q45824
3222A1971584r83552J47968l18976j129984O68672j046016k2016J028608r46176
3213I370112L46624K73920Q22272j311744j46432l42528L88096k060288J241088
3204H581120J32608r12896o4000K48320K61632l35872r27232J000448m32128j186816
3194F365184n35040K89280O02624o00576k25280J596928k153984o90688L30752
3185D979200R33888n15072P1680k35520k43200O04160j024k36544p47008K49856
3175D860416P84896n07904J225216k68288p84384P08096L52256q46848O84544
$$ plain form
3166 6208000 5064704 4653056 5646336 5020160 5090816 5711360 5353984 4317696 5192704
3157 5192704 5164032 4581888 5200896 4983296 5312512 4860416 5250048 4665856 5055488 4019712
3147 4019712 3600896 5038080 5636096 5217792 5352448 6567424 5096960 5012480 5345280
3138 5345280 4537344 5249536 4123648 4471808 3367936 3116544 4090368 5203968 5396992
3129 5396992 5020160 4914688 5913600 4959744 4507648 5840896 5117952 4637696 4702208 5547008
3119 5547008 5920256 6209024 5698048 5626880 6723584 7358464 8193536 8221696 10479104 11544576
3109 11544576 10532864 11706880 10251264 11503104 10534400 9940480 9421312 9741312 9636352
3100 9636352 9440768 9589248 9666048 10072576 10283008 9975808 10054656 9729024 11172864 10750976
$$ packed form
3166F208000j143296m11648R93280o26176P0656O20544l57376j036288Q75008
3157E192704k8672n82144O19008k17600L29216m52096L89632n84192L89632j035776
3147D019712m18816J437184N98016m18304J34656J214976j470464q4480L32800
3138E345280q07936P12192j125888L48160j103872k51392R73824J113600J93024
3129E396992l76832j05472R98912r53856m52096J333248p22944m80256O4512Q44800
3119E547008L73248K88768n10976p1168J096704O34880Q35072K8160K257408J065472
3109A1544576j011712J174016j455616J251840r68704n93920n19168L20000j04960
3100I636352j95584J48480P6800M06528K10432l07200P8848l25632J443840m21888
$$ plain form
3090 10750976 10037248 10787840 10356224 10117632 11127808 11803648 12566016 11264000 11423232
3081 11423232 13108736 12083200 13071360 12750848 12101632 12273664 13197312 13315072 13253120
3072 13253120 14049792 14132736 14235136 15986176 14915072 15047680 15679488 16723456 16545280
3063 16545280 17556480 17326592 17984512 19231232 19654656 20372480 22046208 22350848 22542848
3054 22542848 23139840 24048128 24037376 25977344 27137024 26151936 27168768 27553792 28165632
3045 28165632 29532160 29614080 30578688 31443968 31560192 31880192 34057216 36018688 36788224
3036 36788224 36891648 35657728 31372288 29078016 24686080 22672384 19760640 18012672
3028 18012672 15201792 14462976 13359104 12087296 12769280 11267072 11299840 10711040 10145280
$$ packed form
3090A0750976p13728P50592m31616k38592J010176O75840P62368j302016J59232
3081A1423232J685504j025536R88160l20512o49216J72032R23648J17760o1952
3072A3253120P96672Q2944J02400J751040j071104J32608O31808J043968j78176
3063A6545280J011200k29888O57920J246720M23424P17824J673728L04640J92000
3054B2542848N96992R08288j0752J939968J159680r85088J016832L85024O11840
3045B8165632J366528Q1920R64608Q65280J16224L20000K177024J961472P69536
3036C6788224J03424j233920m285440k294272m391936k013696k911744j747968
3028A8012672k810880p38816j103872j271808O81984j502208L2768n88800n65760
$$ plain form
3019 10145280 10396160 9908224 9743872 8785408 9545216 8822784 8306176 7259648 8391168
3010 8391168 6770176 7212544 5967872 6649856 4919296 4761088 6224896 6231040 5471232
3001 5471232 5894144 4768768 5298176 5299200 5099008 5390848 5733888 4782592 5043200 4727296
2991 4727296 4892160 4526592 4627456 4388864 4581888 5182976 5752320 4092928 5376512
2982 5376512 4935168 4724736 4317696 4160000 4962816 3997696 4327936 4647424 4496384 5339648
2972 5339648 4179456 4738560 4130816 5254656 4550656 4957184 4668928 4805120 5073408
2963 5073408 4491264 5451264 4729344 4948480 5047296 5138432 5123584 4980224 5866496 4755456
2953 4755456 4705792 4518912 5023232 4979712 5020160 5044224 4936192 5517824 5775872 5784064 5420032
$$ packed form
3019A0145280K50880m87936j64352r58464P59808p22432n16608j046528J131520
3010H391168j620992M42368j244672O81984j730560j58208J463808O144p59808
3001E471232M22912j125376N29408J024k00192K91840L43040r51296K60608l15904
2991D727296J64864l65568J00864k38592J93024O01088N69344j659392J283584
2982E376512m41344k10432m07040j57696Q02816r65120L30240L19488j51040Q43264
2972E339648j160192N59104o07744J123840p04000M06528k88256J36192K68288
2963E073408n82144R60000p21920K19136R8816R1136j4848j43360Q86272j111040
2953D755456m9664j86880N04320m3520M0448K4064j08032N81632K58048Q192l64032
$$ plain form
2942 5420032 6069760 5703168 6203392 5256192 5545984 6403072 6021632 5059072 5157888 4916224
2932 4916224 5122048 5545984 4234240 4305920 5301760 3479040 4466176 3662336 4326912
2923 4326912 3727360 3660800 5088768 3913728 4666368 4423680 3754496 4418048 4381696 4608512
2913 4608512 3928064 4646912 4783104 4491776 4326400 4359168 4525568 3895296 4718592 4464128
2903 4464128 4217856 4307968 5131264 4716032 4228096 5453312 6348800 5770240 6310400 6215168
2893 6215168 6194688 6002176 6894592 7834112 7609856 8677376 8622080 10716672 12024320
2884 12024320 16041472 21036032 23521280 22067200 21429760 22072832 19110400 12048896
2876 12048896 8949760 5672960 5513728 5507072 4829696 4497920 3389440 4131328 4974592
$$ packed form
2942E420032O49728l66592N00224r47200K89792Q57088l81440r62560R8816k41664
2932D916224K05824M23936j311744P1680R95840j822720R87136q03840O64576
2923D326912n99552o6560J427968j175040P52640k42688o69184O63552l6352K26816
2913D608512o80448P18848J36192k91328j65376L2768J66400o30272Q23296k54464
2903D464128k46272R0112Q23296m15232m87936J225216Q95488n78560N40160r5232
2893F215168k0480j92512Q92416R39520k24256J067520n5296K094592J307648
2884A2024320M017152M994560K485248j454080o37440O43072k962432p061504
2876A2048896l099136l276800j59232o656o77376l31776j108480P41888Q43264
$$ plain form
2867 4974592 3834880 3622400 3830272 4032000 4420608 3892224 3303424 5362176 4034048
2858 4034048 4675072 5822976 4930048 3089408 3210240 3506688 4029440 4029952 5343232 5031424
2848 5031424 4895744 4768256 4801024 4440064 5963776 5934592 6010880 4854272 5272064 3815424
2838 3815424 5180928 5245952 4553728 5170688 5253120 5238272 5264896 5471232 4756480 5158912
2828 5158912 5107712 5161984 5488128 4304896 5380608 5532672 5687296 3920896 5330944
2819 5330944 5358080 4568576 4630528 5693952 3588608 5455872 5765120 5560832 5453312
2810 5453312 5899264 4082176 4707840 5498880 5098496 5165568 3992576 4406784 4323328 5097472
2800 5097472 4559360 5070848 5509632 5024256 4068864 4827648 3767808 5739008 5291520
$$ packed form
2867D974592j139712k12480K07872K01728L88608n28384n88800K058752j328128
2858D034048O41024J147904q92928j840640J20832K96448N22752N12J313280l11808
2848E031424j35680j27488L2768l60960J523712k9184P6288j156608M17792j456640
2838C815424J365504O5024o92224O16960Q2432j4848K6624K06336p14752M02432
2828E158912n1200N4272L26144j183232J075712J52064J54624j766400J410048
2819E330944K7136p89504O1952J063424k105344J867264L09248k04288j07520
2810E453312M45952j817088O25664P91040m00384O7072j172992M14208q3456P74144
2800E097472n38112N11488M38784m85376r55392P58784j059840J971200m47488
$$ plain form
2791 5291520 5806592 5495296 5442048 5603328 6500352 6863872 6343168 5527040 7348736 6426112
2781 6426112 6319104 6912512 6593536 6866432 6661632 6587392 6964224 7187968 7612416 8213504
2771 8213504 8595456 10202624 10118144 10809344 11133440 11208704 10624512 9880576 8896000 7215616
2761 7215616 7790592 7561216 6474240 6562816 6012416 5684224 5896192 5794816 5467136 5479936
2751 5479936 5475328 5130752 5481472 4926464 4107264 4868608 5564928 5310464 6004736 5494784
2741 5494784 4562944 5158400 4411392 4380672 3881984 4994560 5494784 5728256 4301312
2732 4301312 4953600 5089280 4449792 4885504 4959744 4955648 4947968 5620224 5332992 4561408
2722 4561408 5910528 4786688 4511232 6932480 5371904 5477376 4304384 4253696 5328896
$$ packed form
2791E291520N15072l11296n3248J61280Q97024L63520n20704q16128J821696r22624
2781F426112j07008N93408l18976K72896k04800p4240L76832K23744M24448O01088
2771H213504L81952J607168q4480O91200L24096P5264n84192p43936r84576j680384
2761G215616N74976k29376j086976Q8576n50400l28192K11968j01376l27680J2800
2751E479936m608l44576L50720n55008q19200P61344O96320k54464O94272n09952
2741E494784r31840N95456p47008l0720m98688J112576N00224K33472j426944
2732D301312O52288J35680o39488M35712P4240m096p680O72256k87232p71584
2722D561408J349120j123840k75456K421248j560576J05472j172992n0688J075200
$$ plain form
2713 5328896 5412864 5276672 5274112 4533248 5510144 5279744 4640768 5167616 4324352 4827648
2703 4827648 4029952 5033472 4345856 5436928 4420608 4596736 5012992 5252608 5100032
2694 5100032 5275136 4739072 4816384 4899840 3407872 4237824 3940352 4188672 5349376 5419008
2684 5419008 6161920 4942336 5517312 4006400 5474816 4707840 4992000 4655616 4529152
2675 4529152 4332032 5840896 5646336 6867968 5601280 7857152 8580096 8498176 9817088
2666 9817088 13755904 19065856 25388032 34475520 31069184 19028992 12167680 8304640
2658 8304640 6696960 6537728 5488640 4823552 4516864 4417024 4572160 4867584 5252608
2649 5252608 4951552 3565568 5309952 4903936 3957760 3652096 4116480 3873792 5039104
$$ packed form
2713E328896Q3968j36192k560p40864R76896k30400o38976N26848q43264N03296
2703D827648p97696J003520o87616J091072j016320J76128M16256K39616j52576
2694E100032J75104n36064P7312Q3456j491968Q29952k97472K48320J160704O9632
2684E419008P42912j219584N74976j510912J468416p66976K84160l36384j26464
2675D529152j97120J508864j94560J221632j266688K255872P22944q1920J318912
2666I817088L938816N309952O322176R087488l406336j2040192o861312l863040
2658H304640j607680j59232j049088o65088l06688r9840J55136K95424L85024
2649E252608l01056j385984J744384m06016r46176l05664M64384k42688J165312
$$ plain form
2640 5039104 3792384 3361792 4452864 4032512 4157952 3465728 3428352 3204096 2303488
2631 2303488 3109888 2777600 4036608 4824064 4080128 4166144 3606016 4789760 4702720 4446720
2621 4446720 3857920 4119040 4159488 3208192 3789824 3809280 4129792 3340288 3917312 4091904
2611 4091904 3342848 3339264 4172800 4118016 3332096 3819520 3204096 4226560 3282944 3115008
2601 3115008 3919872 4603904 3418112 3869184 5681664 4265472 5767680 5482496 4045824
2592 4045824 4893184 4746752 6017536 5645824 5784064 6258688 5983232 7089664 6480384
2583 6480384 7194112 8506880 9263616 9613312 9748992 10836480 13848576 19855872 27131392
2574 27131392 37985280 48154112 43378688 29654016 20214272 16117760 15148544 16264704
$$ packed form
2640E039104j246720m30592J091072m20352J25440o92224l7376k24256r00608
2631B303488Q06400l32288J259008P87456p43936Q6016n60128J183744q7040k56000
2621D446720n88800K61120M0448r51296N81632J9456L20512p89504N77024J74592
2611D091904p49056l584Q33536n4784p85920M87424o15424J022464r43616j67936
2601C115008Q04864O84032j185792M51072J812480j416192J502208k85184j436672
2592D045824Q47360j46432J270784l71712J38240M74624k75456J106432o09280
2583F480384P13728J312768P56736L49696J35680J087488L012096O007296P275520
2574B7131392J0853888J0168832m775424j3724672r439744m096512r69216J116160
$$ plain form
2566 16264704 17789952 22503424 29273600 35359232 28964864 20221440 16270848 16814592
2558 16814592 17258496 21776384 28091904 36832256 47888384 37703680 24673792 17284096
2550 17284096 15973376 15106048 16602624 20418048 26423296 31911424 26625024 17259520
2542 17259520 12962816 9674752 9755648 9777664 12558336 15209984 18204672 14223360 10566656
2533 10566656 7344640 6658560 5544448 5502976 4806656 4982784 4788224 4715520 4886016
2524 4886016 4337152 5207552 4402176 4166144 5125632 4915200 4702208 4834816 5810688 5061632
2514 5061632 5642240 6668800 6233600 5771264 6487552 6298624 5287424 5315072 5424640
2505 5424640 5898752 6277120 5024256 6635008 5637120 4951040 4870656 3597312 4331008
$$ packed form
2566A6264704J525248M713472O770176O085632o394368q743424l950592N43744
2558A6814592M43904M517888O315520Q740352J1056128j0184704j3029888p389696
2550A7284096j310720q67328J496576L815424O005248N488128n286400r365504
2542A7259520m296704l288064Q0896K2016K780672K651648K994688l981312l656704
2533A0566656l222016o86080j114112m1472o96320J76128j94560p2704J70496
2524D886016n48864Q70400q05376k36032R59488k10432k12992J32608R75872p49056
2514E061632N80608J026560m35200m62336P16288j88928j011200K7648J09568
2505E424640M74112L78368j252864J610752r97888o86080q0384j273344P33696
$$ plain form
2496 4331008 4361216 3894272 2648064 3493888 3130368 2894336 2627584 2381824 2308096 2337792
2486 2337792 3094016 2008576 3015680 1902592 3052032 3277824 2674176 2813952 1992704
2477 1992704 1694208 2212864 2956800 2516992 2026496 3222528 2280448 2390016 2025984
2468 2025984 1960960 3116032 2381312 2582528 2269696 3120128 2629120 2251264 2438656 1946112
2458 1946112 3222016 1665536 1665536 2538496 2900480 1961472 2840576 1837056 2644480 2002944
2448 2002944 2088960 3440128 2589696 2288128 1951232 1944576 1186816 2847232 1868800 3155456
2438 3155456 1215488 2589696 1627648 1405440 2261504 2823680 2086400 3010560 937984
2428 2221568 1849344 3106816 2076672 2726912 2354688 2582528 2039296 1563648 3613184
$$ packed form
2496D331008L0208m66944j246208Q45824l63520k36032k66752k45760p3728K9696
2486B337792P56224j085440J007104j113088J149440K25792o03648J39776q21248
2477A992704k98496N18656P43936m39808m90496J196032r42080J09568l64032
2468B025984o5024J155072p34720K01216l12832Q50432m91008l77856J87392m92544
2458A946112J275904j556480%Q72960L61984r39008Q79104j003520Q07424o41536
2448B002944Q6016J351168q50432l01568l36896o656p57760J660416r78432J286656
2438C155456A215488J374208r62048k22208Q56064N62176p37280R24160I37984
2428B221568l72224J257472j030144O50240l72224K27840n43232m75648K049536
$$ plain form
2419 3613184 3000320 2655232 3100672 2189824 2484224 2452992 2917888 2760192 2911232 3255808
2409 3255808 1836544 2334208 2966528 2104320 2928128 2235904 2267136 1585664 2648576
2400 2648576 2880000 2716160 2177024 3288064 2139136 4341248 3022336 2199040 2884608
2391 2884608 2866176 1693696 2330624 1632256 2569216 2004992 1380864 2486784 2254336
2382 2254336 2537984 2543616 2689024 1641472 2011136 2811392 2621952 2440192 1981952 2309632
2372 2309632 2046464 1990144 3839488 2199552 2302464 2246656 2589696 1874432 2991104
2363 2991104 3347456 3230208 3038208 2812928 2268160 1661952 3045376 1965056 1814528
2354 1814528 2965504 3217920 3002880 2519552 1435136 2157056 3191296 2814976 2731008
$$ packed form
2419C613184o12864l45088M45440r10848K94400l1232M64896j57696J51040L44576
2409C255808j419264M97664O32320q62208Q23808o92224L1232o81472J062912
2400B648576K31424j63840n39136J111040j148928K202112j318912q23296O85568
2391B884608j8432j172480O36928o98368R36960n64224o24128J105920k32448
2382B254336K83648N632J45408j047552L69664Q00256j89440j81760m58240L27680
2372B309632k63168n6320J849344j639936J02912n5808L43040p15264J116672
2363B991104L56352j17248j92000k25280n44768o06208J383424j080320j50528
2354A814528J150976K52416k15040m83328j084416P21920J034240l76320q3968
$$ plain form
2345 2731008 3267072 2760704 3646464 3445248 3203072 2826752 3005952 2585600 2688000 3575808
2335 3575808 3510272 4118528 3338240 3214336 3524608 4260864 3479040 3997696 4061184 3997696
2325 3997696 3639808 4027392 4325888 4342784 4097024 4801024 3913728 4840960 4639232 4106752
2315 4106752 4060672 4146688 3925504 4111360 4635136 3512832 4775936 4948992 4030464 3886080
2305 3886080 6861824 6063616 5399040 4521984 4902400 5326336 5060608 5763584 5302272
2296 5302272 5349376 4718592 6049280 4824576 4454400 6204928 4759552 6090240 5630464
2287 5630464 6213632 5895168 5678592 4633088 4887552 5300224 3347968 4024832 4444160
2278 4444160 3921920 5078016 4911104 4109312 3326464 4575744 3649536 3755008 3834368
$$ packed form
2345B731008N36064n06368Q85760k01216k42176l76320J79200m20352J02400Q87808
2335C575808o5536O08256p80288j23904L10272P36256p81824N18656O3488o3488
2325C997696l57888L87584K98496J6896k45760P04000q87296R27232k01728n32480
2315D106752m6080Q6016k21184J85856N23776j122304J263104J73056r18528j44384
2305C886080K975744p98208o64576q77056L80416M23936k65728P02976m61312
2296E302272M7104o30784J330688j224704l70176J750528j445376J330688m59776
2287E630464N83168l18464k16576j045504K54464M12672j952256O76864M19328
2278D444160n22240J156096j66912q01792p82848J249280r26208J05472P9360
$$ plain form
2269 3834368 4398080 4269056 4102656 3286016 3441152 3978240 4773376 4531200 4506624 3775488
2259 3775488 4154880 3320320 4024832 4055040 3552768 3259392 4442112 3168768 2978304
2250 2978304 4933120 2898432 3388416 3440128 3207168 3497472 3866624 3179008 3956224
2241 3956224 3665920 2361856 3133440 3662848 3316224 2803712 3649024 3766784 4359168
2232 4359168 3840000 3559936 2973696 3229696 3242496 3567616 4613120 2311680 4068352
2223 4068352 3257344 3884032 4525568 3621888 4880896 3144704 2599936 3831808 3225088
2214 3225088 3159552 3987968 3368448 3440128 3035648 3701760 3471872 3085824 3127808 2819072
2204 2819072 3473920 3496960 3058688 2987008 3570688 4935680 3918336 2555904 3298304
$$ packed form
2269C834368N63712j29024j66400q16640J55136N37088P95136k42176k4576p31136
2259C775488L79392q34560P04512L0208n02272k93376J182720j273344j90464
2250B978304J954816k034688M89984N1712k32960K90304L69152o87616P77216
2241C956224k90304j304064P71584N29408l46624n12512Q45312J17760N92384
2232D359168n19168k80064n86240K56000J2800L25120J045504k301440J756672
2223D068352q11008O26688O41536r03680J259008j736192n44768J231872o06720
2214C225088o5536Q28416o19520P1680m04480O66112k29888l86048M1984l08736
2204B819072O54848K3040m38272p1680N83680J364992j017344j362432P42400
$$ plain form
2195 3298304 3542528 3971072 4499456 3399680 4008960 3555328 4979712 3097600 2535424
2186 2535424 3707904 4270080 3753472 4405760 3774464 5079040 4638720 4130816 4822016
2177 4822016 3653632 3416064 3859968 3644928 2940416 4702720 4573696 4664320 3739648
2168 3739648 3954176 4287488 3573248 3889152 4641280 4986368 3797504 3877376 4751360 2838528
2158 2838528 4872192 4604416 3127808 3116544 4410368 3272192 4471808 4182528 4344320
2149 4344320 3686400 2962944 4011520 3420160 3646976 4955648 4360192 3703296 4014592
2140 4014592 3401216 4063232 4830208 5048832 4883968 4785152 4046848 4857856 4612608 5167104
2130 5167104 4116992 4594688 5602816 6299136 5551616 5566464 5420032 4638720 5719552
$$ packed form
2195C298304K44224M28544N28384j099776O09280m53632J424384j882112n62176
2186B535424J172480N62176n16608O52288o31296J304576m40320n07904O91200
2177D822016j168384k37568M43904k15040p04512J762304j29024R0624r24672
2168C739648K14528L33312p14240L15904P52128L45088j188864P9872Q73984j912832
2158B838528K033664k67776j476608j1264J293824j138176J199616k89280J61792
2149D344320o57920p23456J048576n91360K26816J308672n95456o56896L11296
2140D014592o13376O62016P66976K18624j64864r8816p38304Q11008k45248N54496
2130E167104j050112M77696J008128O96320p47520J4848j46432p81312J080832
$$ plain form
2121 5719552 5107200 5067264 6811648 4767744 4807168 5222400 5395968 6643712 6277120
2112 6277120 6109184 6423040 6737408 6663168 6379008 6352896 7809536 7194112 7263744 7106560
2102 7106560 7605248 8660992 7465472 7787008 7205888 8772608 7206400 9146880 9183744
2093 9183744 8385536 9128448 9319424 8816640 8080384 8376320 7134208 7432704 8437760
2084 8437760 9000960 7917568 7508480 7852032 8670208 7542272 7496704 8091648 7943168
2075 7943168 6900224 7363584 7677952 7994368 6474752 8173568 7237120 6874112 6939648
2066 6939648 7412224 7383040 7367680 7294976 6188544 7930880 7078912 7238656 7715840 7203840
2056 7203840 6650368 6446592 6664192 6264832 5646336 6873600 7246848 6632448 6476800
$$ packed form
2121E719552o12352l9936J744384k043904L9424M15232J73568J247744l66592
2112F277120j67936L13856L14368p4240k84160k6112J456640o15424O9632j57184
2102G106560M98688J055744j195520L21536n81120J566720j566208J940480L6864
2093I183744p98208P42912J90976n02784p36256K95936j242112K98496J005056
2084H437760N63200j083392m09088L43552Q18176j127936m5568N94944j48480
2075G943168j042944M63360L14368L16416j519616J698816r36448l63008O5536
2066F939648M72576k9184j5360p2704j106432J742336q51968J59744M77184n12000
2056G203840n53472k03776K17600l99360o18496J227264L73248o14400j55648
$$ plain form
2047 6476800 7568384 7529472 7894528 7670784 8382976 7721984 7746560 6870016 7884288 8175616
2037 8175616 7529984 7142400 6601728 7250944 7607808 6352384 7158272 6226944 5573632
2028 5573632 6599168 6530048 6172160 4726784 5159424 5542912 6244352 6118400 5532160
2019 5532160 5863936 6087680 5676544 6127616 6591488 5976576 5266944 6405632 5601280
2010 5601280 5523456 6270976 5926400 7422976 6855680 6485504 7761408 6210560 6887936
2001 6887936 6842368 6333952 6764544 7058944 6078976 6080000 5947904 5859840 6734336 6608896
1991 6608896 6992896 7176704 7407616 6932480 7814144 7092736 8467968 7760384 6744064
1982 6744064 7575040 7288832 7238144 7657472 7984128 8411648 8170496 7891968 8447488 7832064
$$ packed form
2047F476800J091584l8912L65056k23744P12192o60992K4576q76544J014272K91328
2037H175616o45632l87584n40672O49216L56864j255424Q05888r31328o53312
2028E573632J025536o9120l57888j445376M32640L83488P01440j25952n86240
2019E532160L31776K23744m11136M51072M63872o14912p09632J138688q04352
2010E601280p7824P47520l44576J496576n67296l70176J275904j550848O77376
2001F887936m5568n08416M30592K94400r79968J024j32096q8064Q74496j25440
1991F608896L84000J83808K30912m75136Q81664p21408J375232p07584j016320
1982F744064Q30976k86208n0688M19328L26656M27520k41152k78528N55520o15424
$$ plain form
1972 7832064 8933888 8486400 8953856 8720384 9245696 8964096 8570880 9290752 10106368
1963 10106368 10631168 9223680 10096640 10210816 10507776 10391552 10085888 9913856 11840512
1954 11840512 10715136 10729984 10569728 9573888 10523136 9995264 9602560 9876480 11014656
1945 11014656 10083840 10156544 11245568 10130432 10010112 10455040 11119104 10109440 10561536
1936 10561536 10011648 10744320 9340928 10370048 10668032 9970176 10585088 10001920 10477056
1927 10477056 10798592 10351616 11217408 11645440 10906624 10332672 10936320 10738688 11144192
1918 11144192 12115456 12016128 12008448 10719744 10877952 10652160 11049472 9106944 10358272
1909 10358272 10367488 10451968 10661888 10132992 9719808 10887680 11924992 13780992 17641472
$$ packed form
1972G832064J101824m47488M67456k33472N25312k81600l93216P19872Q15616
1963A0106368N24800j407488Q72960J14176K96960j16224l05664j72032J926656
1954A1840512j125376J4848j60256r95840R49248n27872l92704K73920J138176
1945A1014656r30816P2704J089024j115136j20320M44928O64064j009664M52096
1936A0561536n49888P32672j403392J029120K97984o97856O14912n83168M75136
1927A0477056L21536m46976Q65792M28032p38816n73952O03648j97632M05504
1918A1144192R71264r9328p680j288704J58208k25792L97312j942528J251328
1909A0358272R216Q4480K09920n28896m13184J167872J037312J856000L860480
$$ plain form
1900 17641472 21752832 28212224 25399808 16729088 12280320 11175936 9826304 9281536
1892 9281536 8343552 9437184 8819712 9193472 8614400 7836160 8431104 8647680 8036864
1883 8036864 8565248 7468544 7998464 8464896 7866368 8377856 8085504 6785536 7720960
1874 7720960 7408640 6455296 7224832 8131584 6657536 7032320 7553536 7330816 7282688 7338496
1864 7338496 7870464 6846976 7024128 7959040 8079360 7243264 6962688 8287744 7020544
1855 7020544 7041536 7369216 8104448 7368704 8104448 7235584 8081920 7183360 7170560 8695296
1845 8695296 7848448 7854592 7495680 8209408 7701504 8191488 8475648 8335872 8405504 8070144
1835 8070144 8331776 7830016 8837632 8625664 8290304 8709632 9139200 8305664 9612800
$$ packed form
1900A7641472M111360O459392k812416q670720m448768j104384j349632n44768
1892I281536r37984J093632o17472L73760n79072p78240N94944K16576o10816
1883H036864N28384j096704N29920M66432n98528N11488k92352j299968R35424
1874G720960l12320r53344P69536R06752j474048L74784N21216k22720m8128N5808
1864G338496N31968j023488J77152R34912J20320q36096k80576J325056j267200
1855G020544K0992L27680P35232p35744P35744q68864Q46336q98560j2800J524736
1845H695296q46848O144l58912P13728n07904M89984K84160j39776O9632l35360
1835H070144K61632n01760J007616k11968l35360M19328M29568q33536J307136
$$ plain form
1826 9612800 8560128 9612800 8466432 8888832 8365568 7896576 9822208 8014336 8071168
1817 8071168 7817216 7832064 7370752 7833088 6991360 7179776 7515648 6715904 7266304 6484480
1807 6484480 6958080 7326208 6203392 6032384 7071232 6534656 6569984 6877184 6076928
1798 6076928 7919616 7748608 7627264 7677952 7691776 7716352 7547392 8172544 7924224 7098368
1788 7098368 8124928 6287872 7700992 8674816 9453056 9258496 8704512 10056704 8829952
1779 8829952 8860672 9191424 9062912 9875968 9223168 9486336 8889856 9592832 9037824 8957952
1769 8957952 9413632 8863744 10028544 8829952 10198528 9618944 10562048 10317312 11179520
1760 11179520 11469312 11245056 11939840 11296768 10807296 10809856 10614272 12388864 10542080
$$ packed form
1826I612800j052672J052672j146368M22400n23264m68992J925632j807872N6832
1817H071168k53952J4848m61312M62336q41728J88416L35872p99744N50400p81824
1807F484480M73600L68128j122816j71008J038848n36576L5328L07200q00256
1798F076928J842688j71008j21344N0688J3824K4576j68960O25152k48320q25856
1788G098368J026560j837056J413120R73824P78240j94560n53984J352192j226752
1779H829952L0720L30752j28512Q13056o52800K63168n96480P02976n55008p9872
1769H957952M55680n49888J164800j198592J368576n79584R43104k44736Q62208
1760A1179520K89792k24256O94784o43072m89472K560j95584J774592j846784
$$ plain form
1751 10542080 12285440 11589632 13067264 12643328 13087744 12891136 13460992 13031936 14161408
1742 14161408 14056448 14262272 14501376 14850048 14587904 14472704 13837824 13150720 13108736 14172672
1732 14172672 13146624 13234176 13191168 13302784 13402624 12462592 13730816 13369856 14004736 12930048
1722 12930048 12762624 13490176 13371392 12662272 12005888 14147072 13496320 12856832 13385216
1713 13385216 13077504 12476416 13047296 12785152 13189632 13491712 14124544 12538368 12440576
1704 12440576 13086720 13039104 12673024 12967424 12537344 11702784 11148288 12223488 13018112
1695 13018112 11850240 10898432 11504128 11732992 10990592 10331648 10851328 10103296 10097664 10352128
1685 10352128 10705408 9962496 9861632 10480128 9864192 10044416 9122816 9739776 9419264
$$ packed form
1751A0542080J743360o95808J477632m23936M44416j96608N69856m29056J129472
1742A4161408j04960K05824K39104L48672k62144j15200o34880o87104m1984J063936
1732A4172672j026048Q7552m3008J11616R9840r40032J268224l60960O34880j074688
1722A2930048j67424P27552j18784p09120o56384K141184o50752o39488N28384
1713A3385216l07712o01088N70880k62144M04480L02080O32832j586176r7792
1704A2440576O46144m7616l66080K94400m30080q34560n54496J075200P94624
1695A3018112j167872r51808O05696K28864p42400o58944N19680p48032n632K54464
1685A0352128L53280p42912j00864O18496o15936J80224r21600O16960l20512
$$ plain form
1676 9419264 7933952 9420800 10029568 10008576 9830912 9268736 9736704 8431616 8148992
1667 8148992 8906752 8271872 8656384 8751104 8292352 8778752 7879168 9235968 8385024 9021440
1657 9021440 7760896 8455680 7559168 8462848 8195072 8994304 6524928 8374784 9161728
1648 9161728 7678464 8806912 8899072 8484352 8786944 8049664 8409088 9607680 9967104
1639 9967104 9140736 9465856 10045952 10168320 9944064 9820160 9039872 10179584 11553792
1630 11553792 11059200 10890752 11158528 11173888 11670016 10679808 12526080 11636224 12567040
1621 12567040 12245504 12284416 11676160 12160512 13659648 13984768 12862464 14828032 14140928
1612 14140928 15983616 14473728 16114176 15347200 14510592 14947840 16721408 16049152 16563200
$$ packed form
1676I419264j485312J486848O08768k0992j77664n62176M67968j305088k82624
1667H148992P57760o34880L84512R4720m58752M86400q99584J356800q50944O36416
1657I021440j260544O94784q96512R03680k67776P99232k469376J849856P86944
1648I161728j483264J128448R2160m14720L02592p37280L59424J198592L59424
1639I967104q26368L25120N80096J22368k24256j23904p80288J139712J374208
1630A1553792m94592j68448K67776J5360M96128r90208J846272q89856R30816
1621A2567040l21536L8912o08256M84352J499136L25120j122304J965568o87104
1612A4140928J842688j509888J640448p66976q36608M37248J773568o72256N14048
$$ plain form
1603 16563200 17520128 18457088 18562560 20420608 20376576 20040192 22653952 21922304 24116736
1594 24116736 25008640 26147328 26455552 28019712 28208128 30461440 32050176 33849856 35300352
1585 35300352 36733952 38747648 39584768 40657408 42231296 44852224 44179456 45392896
1577 45392896 46071296 47725056 48725504 49627136 50947072 53443072 54097920 56058880 59810816
1568 59810816 61599744 64348160 66285568 70234112 75124224 79806464 85628928 92689920
1560 92689920 101922304 111658496 121820160 130899968 138577408 139992576 135131136 125676032
1552 125676032 112020992 97257472 82988032 70650368 58452480 49187840 41270784
1545 41270784 36231168 33146368 28490752 26129408 24360960 22048768 21171200 20073984
$$ packed form
1603A6563200R56928R36960J05472J858048m4032l36384K613760p31648K194432
1594B4116736Q91904J138688L08224J564160J88416K253312J588736J799680J450496
1585C5300352J433600K013696Q37120J072640J573888K620928o72768J213440
1577D5392896O78400J653760J000448R01632J319936K496000O54848J960960L751936
1568E9810816J788928K748416J937408L948544M890112M682240N822464P060992
1560I2689920R232384R736192J0161664R079808P677440J415168m861440r455104
1552A25676032j3655040j4763520j4269440j2337664j2197888r264640p917056
1545D1270784n039616l084800m655616k361344j768448k312192q77568j097216
$$ plain form
1537 20073984 18471936 18457088 17388032 17357824 16374272 16258048 14940160 13695488 14281728
1528 14281728 14081536 14015488 13145600 14066688 12800000 13229056 12923904 11847168 12253184
1519 12253184 11343872 10635776 10960896 10767872 10024448 10265088 10361856 9312768 9054720
1510 9054720 9175040 8739840 9092096 8671232 8689152 9570816 7625216 7620608 8466944 7465984
1500 7465984 8061952 8254464 7720448 7636480 7661568 8002560 7384576 7242752 5904384 7317504
1490 7317504 6398976 7807488 6644224 6573568 6623232 5923328 6436864 6297600 5696512 5028352
1480 5028352 5367808 5649920 5543936 6146560 5676544 5730816 5943808 5696000 5392384 5133824
1470 5133824 6934528 5041152 6436352 5026304 5435904 5174784 5437440 5660160 5743104
$$ packed form
1537B0073984j602048j4848j069056l0208r83552j16224j317888j244672N86240
1528A4281728k00192o6048q69888R21088j266688M29056l05152j076736M06016
1519A2253184r09312p08096L25120j93024p43424K40640R6768j049088k58048
1510I054720J20320m35200L52256m20864J7920Q81664j945600m608Q46336j000960
1500G465984N95968J92512n34016q3968K5088L40992o17984j41824j338368J413120
1490G317504r18528J408512j163264p0656M9664o99904N13536j39264o01088o68160
1480E028352L39456K82112j05984O02624m70016N4272K12992k47808l03616k58560
1470E133824J800704j893376J395200j410048M09600k61120K62656K22720Q2944
$$ plain form
1461 5743104 5620736 5469184 5629440 6422016 5088768 5974528 6631936 5266944 5554688
1452 5554688 5244416 5521408 4526080 4582912 4711424 5268480 4841984 4892160 4843520 4244992
1442 4244992 5072896 5431808 4288512 4411904 4239872 4680704 5679104 5708800 5141504 4742144
1432 4742144 4323840 5947392 4842496 5357056 5767680 5879296 6796288 7248896 6976000
1423 6976000 7630848 5530624 7040000 7681536 7376384 7447040 7208448 7741440 6896128
1414 6896128 8555520 7585280 7820288 8700416 9617920 8687104 9433600 10256384 11332096
1405 11332096 11816448 11843072 12367872 12511232 11543040 11422208 11151360 11404800 10257408
1396 10257408 10532864 9745408 10045952 10875904 10231808 10507776 11400192 11091968 10224640
$$ packed form
1461E743104j22368j51552J60256P92576j333248Q85760O57408j364992K87744
1452E554688l10272K76992r95328N6832J28512N57056m26496N0176m8640n98528
1442D244992Q27904L58912j143296J23392j72032M40832R98400K9696n67296l99360
1432D742144m18304J623552j104896N14560M10624J11616R16992M52608k72896
1423F976000O54848k100224J509376O41536l05152P0656k38592N32992q45312
1414F896128J659392r70240K35008Q80128R17504r30816P46496Q22784J075712
1405A1332096M84352K6624N24800J43360r68192j20832k70848K53440j147392
1396A0257408K75456p87456L00544Q29952o44096K75968Q92416l08224q67328
$$ plain form
1387 10224640 10681344 10225664 10712064 10161152 10226688 10907136 9433088 10410496 10122752
1378 10122752 11079680 10097664 9771008 10809856 10876928 10291712 11330560 11340800 12770304
1369 12770304 13601280 14715904 15646720 15820800 16286720 16623616 17467392 16563712 15581184
1360 15581184 14578688 14002176 12468224 12285440 9950208 9882112 8697344 9461760 9231360
1351 9231360 10356736 9557504 8832512 8553984 7896064 8654848 8583168 8978944 10012672
1342 10012672 9293312 10682368 10589696 10359808 11103232 11517440 12151296 11980288 11236864
1333 11236864 11242496 10412544 10065408 9989120 10973184 9488384 10058752 9409024 9816064 7996416
1323 7996416 8528896 8920576 8258560 7995904 6686720 7540736 7351296 7279616 7222272 7061504
$$ packed form
1387A0224640M56704m55680M86400n50912O5536O80448j474048R77408k87744
1378A0122752R56928r82016l26656J038848O7072n85216J038848J0240J429504
1369A2770304Q30976J114624R30816J74080M65920L36896Q43776r03680r82528
1360A5581184j002496n76512j533952j82784k335232o8096j184768P64416k30400
1351I231360J125376p99232p24992k78528o57920P58784p1680L95776J033728
1342A0012672p19360J389056r2672k29888P43424M14208O33856j71008p43424
1333A1236864N632q29952l47136p6288R84064j484800N70368o49728M07040j819648
1323G996416N32480L91680o62016k62656j309184Q54016j89440p1680n7344j60768
$$ plain form
1313 7061504 6110720 6434816 6551552 6615040 6533120 6685184 6597632 5761536 6560256 7726592
1303 7726592 6713856 5863424 6657024 6715392 6648320 6144000 5789696 6415360 6222336 5716992
1293 5716992 6267392 5077504 6031872 6129664 4845568 5168640 5792256 6415360 4775424
1284 4775424 5317632 5995008 5095936 4686336 3415040 3482112 3567616 4085248 2871808 3057664
1274 3057664 3555328 2278912 3272704 2712576 2986496 2418688 1620480 2350592 2070016
1265 2070016 1592320 2743808 2057216 2268160 1926144 2469888 1410560 1823232 2274816
1256 2274816 2143232 2200576 2236928 2144256 1477632 1943552 1909248 1432576 1912320 2113024
1246 2113024 2177024 1238528 1817600 1613824 2488320 3166720 1434112 2551808 1931776
$$ packed form
1313G061504r50784L24096J16736O3488q1920J52064q7552q36096P98720J166336
1303G726592j012736q50432P93600N8368o7072n04320l54304O25664j93024n05344
1293E716992N50400j189888R54368R7792j284096L23072O23616O23104j639936
1284D775424N42208O77376q99072m09600j271296O7072Q5504N17632j213440J85856
1274C057664M97664j276416R93792n60128K73920n67808p98208P30112k80576
1265B070016m77696J151488o86592K10944l42016N43744j059328M12672M51584
1256B274816j31584N7344L6352r2672o66624M65920l4304m76672M79744K00704
1246B113024O4000r38496N79072k03776Q74496O78400A434112J117696o20032
$$ plain form
1237 1931776 1081344 1422336 2450432 2628096 336384 1854976 2625024 1998848 3103744
1228 3103744 1187328 1586176 1450496 2406912 1827328 2127872 608768 1790976 993280
1219 993280 2032640 1921024 2262016 2005504 1707520 1886208 1357824 2301440 1906176 2086912
1209 2086912 1529344 2323968 1645568 2055680 2298368 2328576 1863168 2750464 2610688 3081216
1199 3081216 2558464 1738240 2196992 2511872 2550272 2689536 2314240 3791360 3941888 3018240
1189 3018240 2919936 2297856 3552768 2908672 3750912 943616 2198528 904192 2137600
1180 2137600 1298944 1966592 1656832 2942976 1350144 1672192 914432 961536 1601024
1171 1601024 819712 2071040 1131008 1755136 2595328 1552896 1420800 799744 1803776
$$ packed form
1237A931776q50432L40992J028096J77664C36384J518592P70048o26176J104896
1228C103744A187328L98848j35680R56416n79584L00544F08768J182208p97696
1219I93280J039360j11616L40992k56512k97984J78688n28384R43616l95264J80736
1209B086912n57568P94624o78400M10112K42688L0208m65408Q87296j39776M70528
1199C081216n22752q20224M58752L14880L8400J39264l75296J477120J50528r23648
1189C018240r8304o22080J254912o44096Q42240I43616J254912I04192J233408
1180B137600q38656O67648l09760J286144A350144L22048p57760M7104O39488
1171A601024p81312J251328r40032O24128Q40192j042432j32096o21056J004032
$$ plain form
1162 1803776 1230848 1137152 969216 2014720 2298880 993280 1517056 1963008 1168896 1645568
1152 1645568 1390592 862720 1567744 572928 1246720 2339328 604672 1427968 707072
1142 953344 1660928 1075200 1330688 1627648 684032 2181632 1348608 527872 2084352
1133 2084352 1457152 746496 1523712 407552 1410048 2352128 1703424 1566208 1218048
1124 1218048 827392 2042368 1388032 1086464 1589760 1330176 1431552 2166784 1229312
1115 1229312 1790976 1249280 1435648 1398784 790016 1835008 752640 1872384 2185216
1106 2185216 1296896 1369600 1011712 793088 1822208 2062336 990720 879104 1388544 1997824
1096 1997824 1460736 1645568 1610240 780288 1699840 825856 848384 876544 830976 1783808
$$ packed form
1162A803776n72928r3696j67936J045504K84160I93280N23776M45952p94112M76672
1152A645568k54976n27872P05024E72928O73792J092608F04672Q23296G07072
1142I53344P07584n85728K55488K96960F84032J497600q33024E27872J556480
1133B084352o27200p10656P77216D07552J002496R42080o48704j37216l48160
1124A218048l90656J214976o54336l01568N03296k59584J01376P35232r37472
1115A229312N61664n41696J86368l6864o08768J044992G52640J119744L12832
1106B185216q88320P2704l57888k18624J029120K40128I90720j11616N09440O09280
1096A997824n37088J84832l5328G80288R19552H25856K2528K8160m5568R52832
$$ plain form
1086 1783808 1473536 1556992 1588736 1097728 2024960 1904640 1464320 660480 1654272 1389056
1076 1389056 1189888 664576 539648 1374208 522752 1598464 1166336 982016 1400832
1067 1400832 1995776 1282560 532992 620544 2222592 170496 1581568 1447936 1471488 1067008
1057 1067008 380928 1618944 75264 1713664 1099776 1367040 1376768 547840 1555456 882688
1047 882688 1395712 1289728 1014272 1355776 1328640 1084416 2043904 2161152 505344 135168
1036 538112 1434112 1741312 1357312 1331712 815616 1052160 1789440 1973760 452608 1138688
1026 1138688 2308608 530944 1703936 1648640 1702400 2039296 959488 1772032 1680384 1312256
1016 1312256 1246208 1395712 1570304 1054208 1240576 1212416 1400320 1122816 937984 1766400
$$ packed form
1086A783808l10272Q3456L1744m91008R27232j20320m40320F60480R93792k65216
1076A389056j99168n25312j24928Q34560E22752J075712m32128j84320M18816
1067A400832N94944p13216E32992Q7552J602048A70496J411072j33632K3552m04480
1057A067008C80928J238016G5264J638400o13888K67264R728E47840J007616o72768
1047H82688N13024j05984k75456L41504k7136k44224R59488J17248E05344A35168
1036E38112Q96000L07200l84000k5600n16096K36544P37280J84320D52608O86080
1026A138688J169920E30944J172992n5296N3760L36896I59488Q12544r1648l68128
1016A312256o6048J49504J74592n16096J86368k8160J87904k77504j84832Q28416
$$ plain form
1006 1766400 281600 1649152 1083392 824832 123904 383488 376832 959488 936448 573440
996 573440 1199616 2009088 1134080 945664 910848 993792 876032 1310720 1199616 1667072
986 1667072 1105408 1445888 1156096 1289728 800256 356352 1958912 1700352 993280 1548800
976 1548800 748032 483840 290304 624128 1721344 1893376 1404928 1077248 -67584 1435136
965 2708480 863232 1870848 1350144 1036288 1665536 1865216 1122816 1377792 2161152 1310720
955 1310720 1225216 2298880 2127360 1221632 905728 1623040 3555328 1177088 3383808
946 3383808 2381824 1319424 2720256 5008384 4035584 4879872 6951424 8560128 10255360
937 10255360 8806400 7463424 8047104 9463296 8781824 9384960 10709504 10203136 12537344
$$ packed form
1006A766400B81600J367552n65760k58560A23904K59584o656N82656k3040l63008
996E73440O26176Q09472q75008j88416l4816Q2944j17760M34688j11104M67456
986A667072n61664L40480k89792J33632m89472C56352J602560k58560p07072N55520
976A548800G48032k64192j93536L33824J097216J72032m88448l27680f7584A435136
965B708480H63232J007616n20704l13856O29248J99680p42400K54976P83360q50432
955A310720q5504J073664j71520r05728l15904P17312J932288A177088K206720
946C383808j001984j062400J400832K288128r72800Q44288K071552J608704J695232
937A0255360j448960j342976N83680J416192o81472O03136J324544n06368K334208
$$ plain form
928 12537344 14462976 14372352 17608192 21163520 26170368 44137984 72226304 106639872
920 106639872 155597312 121697792 61450240 33869312 22317056 16048640 12974592
913 12974592 9180672 6770688 5266944 5247488 5212672 4190720 4126208 3907584 4752384
904 4752384 4271104 5597184 5635584 6427648 5466624 4162048 3322368 3499520 3876864 3202048
894 3202048 2123776 2743808 3420672 1975296 3309056 2087936 2285568 1958400 1805312
885 1805312 2062336 833536 2163712 1115648 2016256 1462784 1793024 1118720 1717248
876 1717248 1894912 1924096 1213440 1831936 1208832 835584 1757696 1790464 981504 1019904
866 1019904 51712 23040 521216 468992 1173504 997888 1272320 584192 488448 973312
$$ packed form
928A2537344J925632r0624L235840L555328N006848J7967616K8088320L4413568
920A06639872M8957440l3899520o0247552k7580928j1552256o268416l074048
913A2974592l793920k409984j503744j9456l4816j021952o4512k18624Q44800
904D752384m81280J326080L8400P92064r61024j304576q39680J77152L77344o74816
894C202048j078272O20032O76864j445376J333760j221120J97632l27168j53088
885A805312K57024H33536J330176j048064R00608n53472L30240o74304N98528
876A717248J77664K9184p10656O18496o23104l73248R22112L2768q08960L8400
866A019904E1712B3040M98176n2224P04512j75616K74432E84192r5744M84864
$$ plain form
856 973312 1310208 1548800 1673728 801280 1780736 950784 1260032 1650176 865280 1075712
846 1075712 1410560 835072 971776 444928 1247744 761344 -41984 735744 1427968 1665024
836 1665024 291328 1115136 643584 487936 738304 805888 -87552 1396224 626176 398336
826 398336 1346560 1594880 589824 1100288 1448448 1024000 995328 1072640 2174976 312832
815 1309696 -432128 52224 1007104 645120 624128 333824 629760 412160 -12288 1401856
804 1425408 1520640 19456 703488 672256 165888 358912 14336 377856 666112 816128
794 816128 619520 432128 -58368 1094656 1239552 202240 843264 163840 224256 755200
784 755200 113152 1725952 278016 130048 261632 1049600 1234432 65024 1093632 1414656
$$ packed form
856I73312L36896K38592J24928H01280R79456q29952L09248L90144p84896K10432
846A075712L34848n75488J36704D44928Q02816m86400d1984G35744O92224K37056
836A665024B91328Q23808m71552j55648K50368O7584h7552A396224F26176k27840
826C98336R48224K48320E89824N10464L48160m24448k8672P7312J102336C12832
815A309696d32128E2224R54880l61984k0992k90304K95936k17600a2288A401856
804A425408R5232A9456O84032l1232A65888J93024A4336L63520K88256J50016
794H16128j96608j87392e8368A094656J44896B02240O41024A63840O0416N30944
784G55200A13152J612800B78016A30048J31584P87968J84832F5024J028608L21024
$$ plain form
774 1414656 992768 225280 287232 523776 622080 256512 245248 424960 -109568 1326080
763 1210368 -824320 1103872 1505280 -68096 740864 418816 346624 494592 1215488 19968
752 1330176 1103872 979456 823296 36864 961536 112128 1266688 -706560 650752 553472
742 553472 762880 -117760 -41472 436736 279552 379392 381952 1010176 206848 1218048
732 1218048 20480 1097728 992256 197632 -96768 -166400 23040 442368 465920 296960
722 296960 1272320 1473024 889344 536064 -348672 747008 -50688 717824 1184768 1490432
712 1490432 737792 444416 335872 161792 1352704 1326592 185344 707584 364544 720896
702 720896 397312 387072 1345024 660992 891904 631296 451072 1806336 609280 449536
$$ packed form
774A414656m21888B25280O1952K36544R8304B56512j1264J79712a09568A326080
763A210368h24320A103872M01408f8096G40864l22048p2192J47968P20896A9968
752A330176k26304j24416j56160C6864R24672A12128J154560g06560F50752r7280
742E53472K09408a17760d1472D36736j57184R9840K560O28224B06848J011200
732A218048B0480J077248j05472A97632i6768o9632B3040M19328K3552j68960
722B96960R75360K00704n83680l53280c48672G47008e0688G17824M66944L05664
712A490432G37792k93376j08544A61792J190912k6112A85344N22240l43040L56352
702G20896l23584j0240R57952F60992K30912k60608j80224J355264F09280j59744
$$ plain form
692 449536 452608 1089536 328192 952832 698368 -328704 1057792 793088 351744 988160
682 988160 575488 634880 1278464 14848 719360 271360 975360 1254400 1174016 129024
671 779776 1223680 177664 1679360 1528320 1215488 2001408 1853952 1773568 1684480 945152
661 945152 1937920 1812480 1937920 1824768 1394176 1473536 2671104 2809344 2236928 2763264
651 2763264 1965568 1988096 1819136 422912 33280 1298944 573952 1409536 295424 338944
641 338944 1225216 714752 175104 679936 1293312 -224256 1192448 1172992 637440 1663488
631 1663488 1262080 322560 623616 214528 402944 -130560 813568 -448000 300544 -90624
620 1385472 1075712 -4608 117760 547328 658944 -206336 316416 268288 -123392 -108544
$$ packed form
692D49536L072O36928C28192O24640k54464c28704A057792k64704C51744O36416
682I88160m12672N9392O43584A4848P04512B71360P04000K79040q0384A29024
671G79776M43904A77664J501696j51040l12832P85920j47456q0384q9088p39328
661I45152R92768j25440J25440j13152m30592P9360J197568J38240n72416N26336
651B763264p97696K2528j68960D22912C3280J265664E73952Q35584B95424M3520
641C38944Q86272n10464A75104N04832O13376b24256A192448j9456n35552J026048
631A663488m01408C22560L01056B14528J88416a30560H13568d48000C00544i0624
620A385472l09760d608A17760M29568J11616b06336C16416m8128a23392J4848
$$ plain form
610 -108544 157696 94720 -279040 488448 357888 -406528 276992 514560 868864 574976
600 574976 292352 611328 848896 -98816 -216576 850944 -666624 471040 307200 -113152
589 -312832 428544 -580608 551424 193024 271360 675328 363008 -52736 633856 -167936
578 391168 -197120 -225792 -102912 1147904 1282560 676352 -243712 -485888 453120 -755200
567 320000 -267776 230912 625664 459264 -409088 -37376 978944 697856 -133632 935424
556 1048576 1333248 1354752 892928 509952 739328 45568 -37888 -122880 279552 1266176
546 1266176 680448 1289216 634368 386560 1138688 494080 -983040 264192 698368 544768
536 544768 124928 1170944 -1008640 655360 368128 -75776 -499200 409600 693248 1019904
$$ packed form
610a08544A57696o2976b79040D88448j30560d06528B76992K37568L54304k93888
600E74976k82624L18976K37568i8816j17760H50944f66624D71040j63840a13152
589c12832D28544e80608E51424A93024P8336M03968l12320e2736F33856a67936
578C91168a97120k8672a02912A147904J34656o06208b43712k42176D53120g55200
567C20000b67776B30912L94752j66400d09088c7376I78944k81088a33632I35424
556A048576K84672K1504m61824l82976K29376D5568c7888q4992B79552R86624
546A266176n85728O08768F34368k47808P52128D94080i83040B64192M34176j53600
536E44768A24928J046016a008640F55360k87232g5776m23424D09600K83648L26656
$$ plain form
526 1019904 314880 -335872 1304064 624128 197632 6656 82944 68608 382464 502272
516 502272 3584 872448 411136 -375296 -530432 483328 1383424 -279552 60928 -83456 -377856
505 -377856 635904 621568 539136 449024 749056 -156672 56832 610816 -144384 -188928 351744
493 135168 1009664 459776 -379392 83968 295936 -167936 141824 952832 990720 372224
482 178176 32256 -581632 810496 -68608 134656 -671744 653312 68096 629760 509952
472 509952 -164864 -75264 217600 977408 -562176 313856 543744 344064 1087488 -301568
461 512512 361472 186368 390656 -744448 -303616 1283584 266240 -256000 -466432 1288192
450 979968 -33792 885760 11264 259072 217088 -905216 253440 -125440 -512 -637952 1077248
$$ packed form
526A019904C14880c35872A304064F24128A97632F656P6288j4336L13856J19808
516E02272C584Q68864D11136c75296j55136D83328R00096b79552F0928h3456k94400
505c77856F35904j4336q2432r0112L00032a56672E6832N53984a44384m4544C51744
493A35168Q74496D59776c79392H3968K11968a67936A41824Q11008L7888C72224
482A78176C2256e81632H10496f8608A34656f71744F53312F8096N61664j19808
472E09952a64864g5264B17600P59808e62176C13856K29888j99680P43424c01568
461E12512j51040j75104K04288g44448c03616A283584B66240b56000k10432A288192
450I79968c3792H85760A1264K47808m1984i05216B53440a25440e12o37440A077248
$$ plain form
438 559616 36352 -286208 -44032 293888 716800 387072 388096 1222656 -179712 -326144 1582592
426 -997888 1074688 -590336 1128960 999424 856064 1606656 -761856 309760 279040 621056
416 621056 150528 520192 466944 552960 -556544 179200 743424 -715264 97280 367104
406 367104 304640 295936 904192 192000 -726016 943616 27648 1347584 -97280 594432 304128
395 304128 -233472 566272 16384 -225792 -1075712 1469440 508416 481280 21504 878080
385 878080 -138240 2062336 398336 812032 1121280 1359872 462336 893440 394240 708096
375 708096 440832 556032 699904 -412672 -431104 1442816 123392 417792 434176 2300416
365 2300416 -395264 377856 -5632 -325632 667648 538624 267776 -380928 -567808 729600
$$ packed form
438E59616C6352b86208d4032B93888M22912l29728J024Q34560a79712j46432A582592
426i97888A074688e90336A128960j29536j43360P50592g61856C09760l0720L42016
416F21056A50528L69664n3248Q6016e56544A79200N64224g15264I7280K69824
406C67104o2464q704O08256A92000g26016I43616B7648J319936i7280E94432k90304
395C04128b33472E66272A6384b25792q49920A469440E08416k7136B1504Q56576
385H78080a38240B062336C98336M13696L09248K38592D62336M31104C94240L13856
375G08096k67264J15200J43872d12672j8432A442816A23392K94400J6384J866240
365B300416c95264C77856e632l20000F67648j29024B67776c80928j86880G29600
$$ plain form
354 1055744 411648 -213504 288768 436736 -466944 -687104 337408 499200 250880 -82944
343 -218112 -425472 501248 142336 -496640 478208 713216 -427008 393216 472576 -437248
332 19968 677888 -742912 -498176 -44544 137728 876032 -128000 403456 65024 -844288
321 -371200 962048 340992 252928 -497664 -544256 223232 571392 354816 676352 6144 -342016
309 375808 -1032192 -144384 -208896 -82432 740864 47104 -811008 99328 63488 245760 59904
297 278528 -331264 41984 506368 676352 -1008128 -1094144 -452608 736768 538112 640000
287 640000 414720 -102400 -293888 -333824 -402944 -264192 772096 -12288 174592 195584 82944
275 1097728 488448 933376 -413184 -460288 3584 98304 -6144 147968 -492544 117248 -193024
$$ packed form
354A055744D11648b13504B88768J47968d66944k20160C37408J61792k48320h2944
343b18112k07360E01248A42336d96640D78208K35008d27008C93216P9360d37248
332A9968O57920g42912K44736d4544A37728P38304a28000D03456F5024h44288
321c71200I62048C40992q8064d97664m6592B23232L48160k16576L21536F144c42016
309C75808a032192a44384o4512h2432G40864D7104h11008I9328l5840J82272E9904
297B78528c31264D1984M64384J69984a008128q6016d52608G36768j98656J01888
287F40000k25280a02400j91488l9936o9120J38752G72096a2288A74592K0992H2944
275A097728D88448M44928d13184m7104C584R4720f144A47968d92544A17248a93024
$$ plain form
263 851968 -68608 -291840 63488 -357376 449024 -242176 385024 301568 93184 -335872 262656
251 504832 141824 288256 -309760 406016 -387584 268288 1199104 585728 -120320 10752
240 444416 23040 679936 356352 -87552 373760 -274432 1369600 134656 -1536 17408 -1051136
228 -836608 696320 -403456 -321536 296960 1984000 -96768 -121856 205312 323072 74752
217 -294912 -271360 457728 -759808 -147968 480256 -571392 0 466944 -707584 1505792 458752
205 46080 -628224 54272 899584 551936 466944 -698368 583680 75264 -72704 -374784 -819200
194 -819200 -175616 684032 65536 -770560 -66048 193536 228352 -660992 -294400 -451072
184 -451072 -326144 -363520 524800 -217088 -845824 -39424 352256 -130560 -9728 -476160 198144
$$ packed form
263H51968f8608k23232F3488c57376D49024b42176C85024q3456I3184c35872B62656
251E04832A41824J46432c09760D06016c87584B68288R30816E85728a20320A0752
240D44416B3040O56896l23584h7552C73760b74432A369600A34656a536A7408a051136
228h36608F96320d03456Q1920B96960J687040i6768k5088B05312J17760G4752
217b94912K3552D57728g59808a47968D80256e71392@D66944g07584A505792D58752
205D6080f28224E4272Q45312l47648q4992f98368E83680G5264g2704l02080m44416
194h19200a75616F84032F5536g70560f6048A93536L4816f60992b94400j56672
184d51072J24928l7376E24800b17088o28736c9424C52256a30560i728m66432A98144
$$ plain form
172 571392 552448 -430080 -410624 -486400 -294400 -1317376 -10752 312832 189952 -179200
161 -507392 -472064 77824 722944 -165376 -594944 -907776 -946688 -210432 -417280 167936
150 617984 -289792 851456 12800 90112 267776 -201216 -741376 776192 449024 -313344
139 396288 143360 -431616 395776 0 332288 -29184 438272 -114688 -463872 -17408 89600
127 -36864 577536 -93184 35840 -303104 -11264 -782848 164864 1845760 713216 389632
117 389632 -197120 273920 608768 57344 358912 204800 397824 -190976 -219136 -685568
107 -685568 112640 723968 244736 -213504 -595456 228352 -1356800 -410624 898560 466432
97 466432 235008 -494592 750080 -441344 621056 233984 539648 374272 133120 -576512
$$ packed form
172E71392j8944d30080J9456p5776J92000j022976a0752C12832j22880a79200
161e07392L5328G7824O45120a65376m29568l12832l8912b10432k06848A67936
150F17984b89792H51456A2800P7312J77664b01216n40160G76192l27168c13344
139C96288A43360d31616C95776@C32288b9184D38272a14688l49184a7408H9600
127c6864E77536i3184C5840c03104a1264p71584A64864J680896G13216l23584
117C89632a97120B73920L34848E7344L01568j54112J93024a90976k8160m66432
107f85568A12640O11328B44736b13504l81952B28352a356800d10624H98560m32128
97D66432k31424d94592G50080d41344F21056B33984L05664j65376A33120e76512
$$ plain form
86 781824 -20992 347136 86528 -354816 650752 201216 -279552 171008 370688 652288
76 652288 -341504 -673792 -92672 591360 -792576 267776 -26624 125952 163328 -53248 1125888
64 577024 449024 114176 -236032 -178176 -212480 -343552 935424 -29184 -735232 -256000 -59392
52 176128 343040 -723456 -154112 -487424 -1053184 464896 -168960 248832 178176 1069056
42 1069056 -36352 338432 931840 161280 -160768 1615360 -327680 212480 260608 -317952
31 -337408 -165376 -1027072 -278016 209408 236544 229376 168960 329216 848896 940032 103424
19 982016 -738304 -37376 -1192448 -330240 -104960 364544 -108544 435200 -155648 -508416
9 -508416 331776 603648 -117248 -359424 955904 -941568 469504 -81408 -468480
$$ packed form
86G81824b0992C47136H6528c54816F50752B01216b79552A71008J99680K81600
76F52288c41504l32288i2672E91360g92576B67776b6624A25952L7376e3248A125888
64E77024j28000A14176b36032N7856l4304j31072I35424b9184p06048b56000e9392
52A76128J66912g23456a54112l33312n65760D64896a68960B48832p0656Q90880
42A069056c6352C38432N93408A61280a60768A615360c27680B12480M8128c17952
31c37408a65376q61696b78016B09408K7136p168o0416J60256N19680R1136A03424
19I82016g38304c7376j155072c30240a04960C64544a08544D35200a55648l52768
9e08416C31776K71872a17248k42176I55904i41568D69504h1408l87072
$$ plain form
0 -468480
$$ packed form
0d68480
##END=
