##TITLE=1383
##JCAMPDX= 6.0         $$ Bruker NMR JCAMP-DX V2.0
##DATA TYPE= NMR SPECTRUM
##DATA CLASS= XYDATA
##ORIGIN= NUTS EXPORT
##OWNER= Administrator
$$ 1.72 TOPSPIN		Version 2.1
$$ 2016-02-23 12:22:03.152 -0800  Administrator@X
$$ Compression mode = diff/dup
##.OBSERVE FREQUENCY= 90.275459
##.ACQUISITION MODE= SIMULTANEOUS (DQD)
##.ACQUISITION SCHEME= undefined
##.AVERAGES= 16
##.DIGITISER RES= 22
##SPECTROMETER/DATA SYSTEM= 
##.PULSE SEQUENCE= zg30
##.SOLVENT NAME= None
##.SHIFT REFERENCE= INTERNAL, None, 1, 14.36465
##AUDIT TRAIL= $$ (NUMBER, WHEN, WHO, WHERE, PROCESS, VERSION, WHAT)
$$ ##TITLE= Audit trail, TOPSPIN		Version 2.1
$$ ##JCAMPDX= 5.01
$$ ##ORIGIN= Bruker BioSpin GmbH
$$ ##OWNER= Administrator
$$ $$ E:/data/jwist/nmr/1383/1/pdata/1/auditp.txt
$$ ##AUDIT TRAIL=  $$ (NUMBER, WHEN, WHO, WHERE, PROCESS, VERSION, WHAT)
(   1,<2016-02-23 09:17:56.011 -0800>,<Administrator>,<X>,<jcamp>,<TOPSPIN 2.1>,
      <fromjdx created from
       E:\data\jwist\nmr\uniandes\1383
       data hash MD5: 8K
       AB 64 6F 67 FE DD 7D 8D 89 91 9B 55 69 75 00 7E>)
$$ ##END=
$$ 
$$ $$ hash MD5
$$ $$ 15 B3 57 66 3B 81 62 E0 5D C6 49 2A C2 3E 31 E3
##$RELAX= 
$$ Bruker specific parameters
$$ --------------------------
##$DU= <E:>
##$EXPNO= 1
##$NAME= <1383>
##$PROCNO= 1
##$TYPE= <nmr>
##$USER= <jwist>
##$ACQT0= 0
##$AMP= (0..31)
100 100 100 100 100 100 100 100 100 100 100 100 100 100 100 100 100 100
100 100 100 100 100 100 100 100 100 100 100 100 100 100
##$ANAVPT= 1
##$AQSEQ= 0
##$AQ_mod= 3
##$AUNM= <au_zg>
##$AUTOPOS= <>
##$BF1= 90.275459
##$BF2= 400.02
##$BF3= 400.02
##$BF4= 400.02
##$BF5= 400.02
##$BF6= 400.02
##$BF7= 400.02
##$BF8= 400.02
##$BYTORDA= 0
##$CFDGTYP= 0
##$CFRGTYP= 0
##$CHEMSTR= <none>
##$CNST= (0..63)
1 1 145 1 1 1 1 1 1 1 1 1 1 1 1 1 1 1 1 1 1 1 1 1 1 1 1 1 1 1 1 1 1 1 1
1 1 1 1 1 1 1 1 1 1 1 1 1 1 1 1 1 1 1 1 1 1 1 1 1 1 1 1 1
##$CPDPRG= <>
##$CPDPRG1= <>
##$CPDPRG2= <>
##$CPDPRG3= <>
##$CPDPRG4= <mlev>
##$CPDPRG5= <mlev>
##$CPDPRG6= <mlev>
##$CPDPRG7= <mlev>
##$CPDPRG8= <mlev>
##$CPDPRGB= <>
##$CPDPRGT= <>
##$D= (0..63)
0 1 0 0 0 0 0 0 0 0 0 0 0 0 0 0 0 0 0 0 0 0 0 0 0 0 0 0 0 0 0 0 0 0 0 0
0 0 0 0 0 0 0 0 0 0 0 0 0 0 0 0 0 0 0 0 0 0 0 0 0 0 0 0
##$DATE= 0
##$DBL= (0..7)
120 120 120 120 120 120 120 120
##$DBP= (0..7)
150 150 150 150 150 150 150 150
##$DBP07= 0
##$DBPNAM0= <>
##$DBPNAM1= <>
##$DBPNAM2= <>
##$DBPNAM3= <>
##$DBPNAM4= <>
##$DBPNAM5= <>
##$DBPNAM6= <>
##$DBPNAM7= <>
##$DBPOAL= (0..7)
0.5 0.5 0.5 0.5 0.5 0.5 0.5 0.5
##$DBPOFFS= (0..7)
0 0 0 0 0 0 0 0
##$DE= 6.5
##$DECBNUC= <off>
##$DECIM= 2432
##$DECNUC= <off>
##$DECSTAT= 4
##$DIGMOD= 1
##$DIGTYP= 12
##$DL= (0..7)
0 120 120 120 120 120 120 120
##$DP= (0..7)
150 150 150 150 150 150 150 150
##$DP07= 0
##$DPNAME0= <>
##$DPNAME1= <>
##$DPNAME2= <>
##$DPNAME3= <>
##$DPNAME4= <>
##$DPNAME5= <>
##$DPNAME6= <>
##$DPNAME7= <>
##$DPOAL= (0..7)
0.5 0.5 0.5 0.5 0.5 0.5 0.5 0.5
##$DPOFFS= (0..7)
0 0 0 0 0 0 0 0
##$DQDMODE= 0
##$DR= 22
##$DS= 2
##$DSLIST= <SSSSSSSSSSSSSSS>
$$ [...]
##$SPOFFS= (0..31)
0 0 0 0 0 0 0 0 0 0 0 0 0 0 0 0 0 0 0 0 0 0 0 0 0 0 0 0 0 0 0 0
##$SUBNAM0= <"">
##$SUBNAM1= <"">
##$SUBNAM2= <"">
##$SUBNAM3= <"">
##$SUBNAM4= <"">
##$SUBNAM5= <"">
##$SUBNAM6= <"">
##$SUBNAM7= <"">
##$SUBNAM8= <"">
##$SUBNAM9= <"">
##$SW= 20.5580556627758
##$SWIBOX= (0..15)
0 0 3 4 0 0 0 0 0 0 0 0 0 0 0 0
##$SW_h= 8223.68421052631
##$SWfinal= 0
##$TD= 65536
##$TD0= 1
##$TE= 300
##$TE2= 300
##$TE3= 300
##$TEG= 300
##$TL= (0..7)
0 120 120 120 120 120 120 120
##$TP= (0..7)
150 150 150 150 150 150 150 150
##$TP07= 0
##$TPNAME0= <>
##$TPNAME1= <>
##$TPNAME2= <>
##$TPNAME3= <>
##$TPNAME4= <>
##$TPNAME5= <>
##$TPNAME6= <>
##$TPNAME7= <>
##$TPOAL= (0..7)
0.5 0.5 0.5 0.5 0.5 0.5 0.5 0.5
##$TPOFFS= (0..7)
0 0 0 0 0 0 0 0
##$TUNHIN= 0
##$TUNHOUT= 0
##$TUNXOUT= 0
##$USERA1= <user>
##$USERA2= <user>
##$USERA3= <user>
##$USERA4= <user>
##$USERA5= <user>
##$V9= 5
##$VALIST= <valist>
##$VCLIST= <CCCCCCCCCCCCCCC>
##$VD= 0
##$VDLIST= <DDDDDDDDDDDDDDD>
##$VPLIST= <PPPPPPPPPPPPPPP>
##$VTLIST= <TTTTTTTTTTTTTTT>
##$WBST= 1024
##$WBSW= 4
##$XGAIN= (0..3)
0 0 0 0
##$XL= 0
##$YL= 0
##$YMAX_a= 1326993024
##$YMIN_a= -5161582.592
##$ZGOPTNS= <>
##$ZL1= 120
##$ZL2= 120
##$ZL3= 120
##$ZL4= 120
##$ABSF1= 10
##$ABSF2= 0
##$ABSG= 5
##$ABSL= 3
##$ALPHA= 0
##$AQORDER= 0
##$ASSFAC= 0
##$ASSFACI= 0
##$ASSFACX= 0
##$ASSWID= 0
##$AUNMP= <proc_1d>
##$AXLEFT= 0
##$AXNAME= <>
##$AXNUC= <off>
##$AXRIGHT= 0
##$AXTYPE= 0
##$AXUNIT= <>
##$AZFE= 0.1
##$AZFW= 0.1
##$BCFW= 1
##$BC_mod= 2
##$BYTORDP= 0
##$COROFFS= 0
##$CY= 15
##$DATMOD= 1
##$DC= 2
##$DFILT= <>
##$DTYPP= 0
##$F1P= 0
##$F2P= 0
##$FCOR= 0.5
##$FTSIZE= 0
##$FT_mod= 4
##$GAMMA= 1
##$GB= 0
##$INTBC= 1
##$INTSCL= 1
##$ISEN= 128
##$LB= 0.3
##$LEV0= 0
##$LPBIN= 0
##$MAXI= 10000
##$MC2= 0
##$MEAN= 0
##$ME_mod= 0
##$MI= 0
##$NCOEF= 0
##$NC_proc= -9
##$NLEV= 6
##$NOISF1= 0
##$NOISF2= 0
##$NSP= 1
##$NTH_PI= 0
##$NZP= 0
##$OFFSET= 14.36465
##$PC= 1
##$PHC0= 0
##$PHC1= 0
##$PH_mod= 0
##$PKNL= yes
##$PPARMOD= 0
##$PPDIAG= 0
##$PPIPTYP= 0
##$PPMPNUM= 2147483647
##$PPRESOL= 1
##$PSCAL= 4
##$PSIGN= 0
##$PYNMP= <proc.py>
##$REVERSE= no
##$SF= 90.2741622435341
##$SI= 8192
##$SIGF1= 0
##$SIGF2= 0
##$SINO= 400
##$SIOLD= 32768
##$SPECTYP= <>
##$SREGLST= <1H.CDCl3>
##$SSB= 0
##$STSI= 0
##$STSR= 0
##$SW_p= 1497.18866228788
##$SYMM= 0
##$S_DEV= 0
##$TDeff= 0
##$TDoff= 0
##$TI= <>
##$TILT= no
##$TM1= 0
##$TM2= 0
##$TOPLEV= 0
##$USERP1= <user>
##$USERP2= <user>
##$USERP3= <user>
##$USERP4= <user>
##$USERP5= <user>
##$WDW= 1
##$XDIM= 8192
##$YMAX_p= 1326992896
##$YMIN_p= -5161472
##$CURPLOT= <PDFCreator>
##$CURPRIN= <$PDFCreator>
##$DFORMAT= <normdp>
##$LAYOUT= <+/1D_H.xwp>
##$LFORMAT= <normlp>
##$PFORMAT= <normpl>
##$SURQMSG= 1
$$ End of Bruker specific parameters
$$ ---------------------------------
##XUNITS= HZ
##YUNITS= ARBITRARY UNITS
##XFACTOR= 0.182762287876938
##YFACTOR= 1
##DELTAX= -0.182762287876938
##NPOINTS= 8192
##FIRSTX= 1497.0059
##FIRSTY= -462848
##LASTX= 0
##MAXY= 1326992896
##MINY= -5161472
##XYDATA= (X++(Y..Y))
8191 -462848 350208 -486912 282624 -521728 -207360 -603648 411136 172032 -680960 -392192
8181 -392192 720384 591872 29184 297984 494080 159744 6656 1134592 -886784 1711616
8170 332288 413184 -479744 -116224 623104 -180736 141312 -312832 -623104 1109504 -4608
8159 -91136 185856 -677888 61952 -281600 635904 -61952 497664 -171520 -131584 -397824
8149 -397824 669184 -9728 614912 -39936 819200 -152064 -285696 325120 408576 2048 -278528
8137 -1434112 -320000 416256 -172544 -511488 -339968 -258048 -589312 1024 -990208 596992
8126 592384 431616 -124416 -624128 -1099264 11776 845312 864768 329728 148480 -326144
8115 -196608 1099264 704512 706048 834560 -210944 532480 1118720 -190464 39424 -420352
8104 286208 499712 -30208 265728 -376320 256512 -107008 -477696 513024 1072128 316928
8093 8704 -520192 82944 293376 224256 95232 576512 -89088 -105984 687104 151040 898560
8082 898560 -715776 741376 248832 73728 -1129984 519168 1010176 424448 222720 163328
8072 163328 416256 146432 735232 -631808 -20480 -411648 414208 -273408 1033216 516096
8061 -171520 1776128 985600 -304640 760320 1334272 -415744 59904 402432 230912 1136128
8051 1136128 -1197568 -403456 -178176 700928 -121344 -144384 113664 -170496 581632 96256
8040 -550400 223232 110080 1319936 307200 -181248 -589824 1462272 143360 484864
8031 484864 137216 -209408 823296 -328704 -118272 930304 -43008 269824 22016 46080
8021 46080 315392 7168 -398848 -48128 -148992 347648 253952 -107008 -119296 -634368 -803328
8010 -803328 -510464 -670720 506880 321024 483328 171008 418816 1198592 -5120 576000
7999 -79360 674816 -657920 -807424 802304 -44032 -842752 -1123840 383488 447488 223232
7988 675840 -404480 -404480 262656 -493568 31744 900096 -662016 -28160 -33280 222208 -521728
7976 -665088 1018368 -238080 460800 216064 480768 740352 347648 876544 993280 285696
7965 648192 -87552 196608 -1300480 -649216 1281536 207872 199680 -381952 608256 -445952
7954 -1326592 72192 198144 891392 522752 -505344 373760 105984 148480 -606720 247296
7943 709632 476672 336896 -460800 -1104384 326656 -189952 582144 -776704 1364480 -20992
7932 233472 1257984 -764416 326144 918016 392704 301568 490496 1166336 782848 -276480
7921 -200192 521728 -647680 329216 560640 417280 323072 136192 181760 -505344 894464
7910 546304 -739840 406016 1190912 -639488 -419328 918528 171008 147456 -89088 -131072
7900 -131072 388608 -225280 594944 140800 102912 926720 -1184768 1197056 -74240 -147456
7890 -147456 -161280 -248832 -818688 -266240 -318464 1013760 517632 1037824 912384 -586752
7879 194560 614400 -165888 -241664 890880 248832 -443392 322048 238592 411648 930816
7869 930816 385536 956416 -291328 942080 642560 -311296 -475648 -593408 -562176 298496
7858 -862720 -827904 191488 551424 -242688 475648 778752 189440 334336 355840 928768
7848 928768 -187392 525824 472064 -787968 -528384 -727040 4096 361472 -777216 165888
7837 1022976 221696 209920 -118784 598016 857600 -339456 701440 -117760 791552 1725440
7827 1725440 -433152 -447488 -523776 208384 246272 394240 82944 383488 270848 432640
7817 432640 837632 848384 -454144 -539136 180736 -31744 553984 77312 -225792 -163840 323072
7805 208384 22016 428032 446976 -1160192 403968 40448 606720 93696 471040 -91648
7794 240128 110592 734208 547328 240128 638464 210944 -654848 853504 581120 -445952
7783 640000 -489984 -67584 1202176 -104448 -844800 -783872 216576 -157696 -181760 -648704
7773 -648704 91648 -68608 182272 579072 869888 373248 -290304 283648 -29696 58368
7762 -235520 -691712 -305664 772096 198656 -179200 -476160 -644608 480768 -103936 488960
7751 -308224 -720896 -180736 678912 123904 394752 -721408 -182784 26624 152064 1038336
7741 1038336 -862720 -94208 -46080 90112 -744960 -274432 -607232 522752 573440 130560
7730 330240 287232 -197120 655872 -125440 -889856 1018880 711168 711168 1008128 714752 165888
7718 -246784 476672 -350720 243712 736768 390656 -328192 281600 -133120 -138752 186368
7707 -250368 64000 -440832 -673792 -352256 1766400 -333312 70144 359936 -145408 -26112
7696 -252416 59392 -217600 448000 -84992 -317952 -73216 -521728 652800 1416704 -441344
7685 -733696 887296 545792 832000 92160 827904 244224 634368 280064 796672 378880
7674 113664 -342528 60928 129024 249344 1474560 368640 -247296 -228864 -546304 577024
7663 4608 -790016 325632 185344 -503808 -266752 -1001984 43008 -3072 -290304 311808 682496
7652 682496 613888 374784 -400896 379392 -1150976 280064 172032 847872 -807424 709632
7641 1011200 -76800 -108544 -369664 345600 -381952 117760 -1259008 -394752 595456 836608
7631 836608 432128 613888 -443904 -547840 -211456 233984 217088 640000 277504 -53760
7620 -83456 -588288 979456 287232 -618496 -4096 1126400 -391680 359424 -456192 -727552
7610 -727552 -332800 -488448 -469504 167424 416768 225280 -469504 434176 1387520 678400
7599 422912 -101888 48640 -329216 1113600 400896 136704 1035776 302592 78848 543744
7589 543744 -540160 -166912 37376 339968 -609280 580608 -98304 64512 909824 41984
7578 694272 178176 547328 -39936 -534016 1244672 74752 -664576 1036800 534528 -101376
7567 -32768 757248 761344 -235520 720384 306176 -180736 -257024 -551936 10240 397312 -403456
7555 -53760 1106944 -446464 308224 -418816 374272 -65536 866304 -629248 -787968 911360
7544 31744 1204224 424448 -446976 -652800 138752 621568 -215040 -731136 -1452032 861696
7533 275456 298496 335872 913920 156160 169984 -1248768 -996864 249344 97792 253952
7523 253952 -545792 107008 610816 -251904 -330752 1380864 711168 -242176 -376832 569856
7512 -564224 -586752 137728 406016 362496 -117760 -805376 171520 83456 440320 -714752
7501 -1209344 -472576 185344 1537024 601600 -411136 -210944 39936 -65536 294400 50688
7490 256000 279552 263680 923648 708096 -396288 257536 563200 -438784 -684032 477184
7479 478720 236544 164864 -691200 900096 -3584 -462848 -1174016 315904 240640 333824 -363008
7467 -1041920 29696 -201216 -189440 -396288 -430592 762880 -1337344 670720 -503808 -47616
7456 407552 424448 -677376 658944 1403904 -414208 -1199104 -66048 0 686592 -168448 601600
7444 753152 -1117184 417280 813568 -215552 -692224 -59904 66048 297984 -409088 -363520
7434 -363520 -326656 230400 143872 1000448 783872 -771584 1029120 180224 -124928 33280
7423 146944 604672 -250368 443904 672768 194560 -105472 562688 334336 -313344 -508416
7413 -508416 707072 -897536 1110528 -241152 236032 -730624 180224 659968 -410624 583168
7402 464384 -269824 136192 263680 230400 1091072 -93696 26624 742400 629248 -446464
7391 190976 321024 -278016 1067520 -55808 -745984 -407040 -626688 60416 487424 -813056
7380 53248 393216 -281600 516608 -208896 79360 241152 193024 345088 81920 612864
7370 612864 479744 -648192 51200 862208 822784 459776 410624 -156672 -80384 702976
7359 547840 -1395712 334336 140288 534016 -185856 7168 251904 -347648 -646144 625152
7348 1049088 459776 697344 415232 132608 267264 -610304 -127488 213504 674304 -962048
7337 403456 258048 -443392 461824 130560 170496 -278016 32768 -314368 -603648 766464
7326 635392 411136 589312 6656 -87040 1022464 141312 177152 414208 431616 -178688
7315 518656 991744 481280 385024 718848 497664 730112 296960 340992 -62976 262144
7304 -184320 -1163776 13824 -486400 -353792 128000 1107456 -689152 -153600 -427520 668160
7293 -26112 98816 -22528 567296 -22016 557056 -212992 -109568 157184 -40960 39424 311296
7282 311296 -182784 -48640 712704 -192000 -1119744 288768 69120 385536 442880 531968
7272 531968 718848 -669184 1089536 -291328 229888 482304 -140800 -561664 -111104 -232960
7262 -232960 -141312 41984 71168 -153088 -519168 -490496 43008 -630272 744448 657408 172544
7250 -85504 437248 -49152 -533504 616448 186880 293888 333824 -123904 713728 640000
7240 640000 -19968 69632 628736 -27648 -485376 -192512 113152 -54272 103424 -160768
7229 646656 -372736 -1076224 -734208 513536 1408512 13312 432640 157184 317952 391680
7219 391680 373760 14336 530432 611328 -6656 708096 63488 416256 1104384 886784 -437760
7207 -353280 1066496 368128 304640 -265216 -353792 650240 -423424 -554496 -576000 628224
7196 61440 -175616 -50688 -239616 358912 59904 -609792 364032 -482816 -621056 135168
7185 653824 -464384 -124416 -601600 120832 -223232 -978944 603648 236544 36864 -36864
7174 -451072 552448 -100352 -249856 297984 -628736 -474624 -260096 -216064 -422400 574464
7163 -18944 672768 -65024 64512 -181760 -128512 -314368 -155648 -755200 -139264 40960 302592
7152 302592 402432 765952 -84992 -568832 572416 -566272 285184 199680 324096 -43008
7141 -451584 -532480 884736 43520 17920 150528 148992 340480 -663552 482304 284160 175104
7130 175104 -455680 -237568 394240 192512 322048 -72192 830976 352768 -94720 577024
7119 270848 -377856 91136 -473088 344576 -520192 -535040 -986112 1128448 1003520 -865792
7108 -833536 -842752 -688128 -100352 898560 -282112 390144 545280 -154112 -120320 369664
7097 493568 235520 462848 287744 -54784 -608256 665600 180736 874496 175616 -314368
7086 -671232 -367616 1141760 -104960 629760 223744 236032 -730112 710656 -854016 339456
7075 320512 -697344 199680 -210944 1100800 284672 754688 121344 78336 1436672 -354304
7064 -101376 -584192 -421888 599552 -1016320 -468480 -864768 823296 230912 738816 -563200
7053 771072 -251904 -523776 -155648 720896 -334336 -898048 611328 -656896 -320000 -351744
7043 -351744 -146944 373760 -1347584 -1128448 -304640 799232 -272384 614912 -750592 502272
7032 -472576 380928 -142336 838144 -820224 1143296 198656 113664 859648 457216 614912
7022 614912 -31744 2560 435200 -279040 60416 -863232 527872 -194048 1091584 510976
7011 -1464320 -802304 -880128 878592 -54784 867840 -590848 -508416 24064 -403456 -77824
7000 -375808 -750080 -120320 437760 -184832 551424 259072 643584 31232 291840 -861696
6989 -371200 -618496 -376320 1057280 189440 60416 227840 -273920 115200 502272 827392
6979 827392 973824 1089024 531456 332800 -424448 1022976 -577024 1227776 480768
6969 114176 158720 -190464 -538624 -92672 503808 440320 185856 -6144 -569344 -19968 67072
6957 -109568 -444416 495104 514560 -848384 -499200 318976 795648 449024 -350208 -180224
6947 -180224 -152576 234496 -68096 -681984 701952 245248 390656 71168 -2048 -179712 -35840
6935 -347648 0 212992 91136 -326144 556032 69632 -64000 -15360 9216 -527360 -361472 -210432
6923 -210432 208896 160768 95744 -448512 -649216 165376 137216 43520 586240 -1515008
6912 206336 638464 616448 -532992 -129024 -182784 -594432 -479744 -175616 57856 836608
6902 836608 -605696 289280 -234496 -580096 -906240 -1017344 792576 -412160 -1130496 -232960
6891 699392 331264 42496 308736 -181248 393728 -361472 -460800 420352 -442368 51712
6880 900608 -333824 -190464 745472 -420352 -1020928 -713216 778240 -282624 -179712 56320
6869 -70656 645632 -10240 413696 407040 486400 627712 360960 -619008 -218112 420864 196096
6857 -61440 -713216 634368 278016 260096 -710144 134656 1286144 65024 -964608 526848
6846 -857088 -283136 401408 162304 16384 -491008 -517632 -530432 -325120 -46080 -419840
6836 -419840 -541184 -562176 -72192 113152 566272 -968704 351232 641536 -547328 90112
6825 718336 134656 -34304 -786432 -262656 -131072 44032 239616 141824 -296448 356352
6814 -259584 493056 -343040 951808 -213504 675840 50176 410624 513536 -34816 450048
6803 342016 289280 -801792 395776 -684032 -1062400 -544768 602624 349184 -805376 172032
6792 496128 -1108992 -565760 -98304 -534528 174592 246272 -1119744 125952 -361984 422912
6781 557056 -741888 727040 -387584 -138240 -429568 -672256 -514560 -910336 842240 416768
6770 -231936 -652800 814080 -309248 -733696 1641472 -624128 252928 -332800 547328 -13312
6759 768512 906240 634880 189440 -871424 -1144320 -184832 -485376 -375296 -191488 -443904
6749 -443904 -603648 670208 -142336 -340992 -58880 159232 92672 -21504 628736 -379392
6738 -402432 -421376 435712 174080 455168 4096 568832 249856 40960 83968 -486400 -165888
6726 288256 99328 663040 -799744 -68608 989696 233984 -519168 -35840 148992 31232
6715 -160256 -144384 -428544 19968 15360 1048576 -189952 -1329664 -1480704 345600 -988672
6704 415232 -440832 -14336 -412160 -755200 -51712 -1660928 195584 539136 -19968 931840
6693 437248 -422400 -268800 79360 55296 958464 -652800 -334336 486400 142336 -195584
6682 -104960 628224 -78848 501248 160768 -163840 -72704 905728 68608 -581632 -438272
6672 -438272 -610304 610816 -541696 132608 23040 85504 801792 -37376 -170496 1180160
6661 -389120 -125440 -366592 -552960 -368640 832000 -1048064 230912 -675328 -461824 -129536
6650 438272 -394752 87040 -16896 16896 -911360 -851968 -183808 -166400 157696 -502272 818688
6638 -332288 676864 375808 279040 -439296 237056 -694784 90624 219648 399360 85504
6627 162304 153088 -434688 747008 73728 -822784 -809984 -123904 -510976 -339456 491008
6616 -673280 -421888 332288 -1069568 -882688 -502272 -698880 -307200 628736 -314880 15872
6605 -184832 -201216 -162304 -860672 -158208 63488 -684544 207872 -441856 -1145856 465408
6594 378880 459776 494080 -433664 -937472 41472 330240 37376 -95744 -309760 208384 49152
6582 1515008 -401408 -1141248 -477184 -463872 480256 -325632 36864 83456 -450048 365056
6571 -102912 -620032 -1212928 -1720832 623104 810496 195072 -128512 536064 159744 -440320
6560 1033216 -741888 -178176 -326656 -285696 704000 564736 -743424 224256 -1011200 153600
6549 -1187328 271360 61952 -115712 354816 -203264 -410624 -353280 -755200 11264 -276992
6538 -557056 -446976 -654848 686080 97280 689152 -357376 -209408 736256 -170496 -19968
6527 -437760 -187392 -773632 87552 -1040384 -535040 188416 231936 845312 -20992 816128
6516 609792 177664 -200704 -391680 507904 -471552 573440 -118272 -639488 -855040 36864
6505 96256 1028608 -509440 -155648 128512 373248 161792 -481792 -655872 -126976 -96768
6495 -96768 13312 96768 -92160 -598016 -529920 -121856 10240 519680 -178688 771584 -145408
6483 -107008 -169984 -786432 180736 -781824 710144 703488 145920 -541696 -326144 152064
6472 43520 -216576 -513024 -457728 -1851392 17408 221184 -47616 493568 -261632 -46592
6461 555008 -648192 -803840 -79872 175104 92672 -823808 -8704 -317440 -115200 550400
6450 -287232 275456 570368 -302080 238080 -663040 375808 -807936 494080 11776 -1366528
6439 125952 440832 850432 118784 7168 -670208 852992 -259072 266752 131072 -1091584
6428 838144 -583680 637440 -152064 -373248 -755200 -71680 660480 -37888 455680 630784
6418 630784 -201728 -737792 -141824 -267264 -313856 433664 -632320 -593408 -456192 -471040
6408 -471040 321536 211968 503808 339456 -174080 27648 585216 177664 394240 -698368
6397 -554496 -459264 459264 -219648 25600 -27136 -135168 -791552 308736 63488 -17408 209920
6385 -576000 -841216 186368 -896000 790016 606720 -1133568 623104 -117760 -527360 -119296
6374 -71680 -392192 334848 -725504 -222208 -283136 638464 -988160 57344 184320 -33280
6363 8192 175616 -133632 -947712 -613376 -434688 122368 -1294848 534016 -240128 -69120
6352 -392192 1140736 -327168 -1548288 -1718784 -596992 -633856 412160 -415744 -261120 -311296
6342 -311296 -223744 56320 -747008 908800 -253440 -334848 -986112 343552 -706048 567808
6331 -1302528 -1291264 -1313280 -161280 -954368 -485888 -925184 297472 -124928 860160 -589312
6320 -423936 -26624 -410624 435200 -249344 389632 298496 -379392 -89088 -767488 -208896
6309 520704 -150016 264704 879104 -367616 305152 -121856 -1091584 33280 404992 154112
6298 379904 -17920 -316928 138240 -246272 -406528 -570880 -375808 239616 1334784 -919040
6287 -16384 793088 696832 242688 -268288 142848 253952 10240 -293376 -288256 -1131520 -410112
6275 465408 -366592 -229376 -435712 153600 -120832 -180224 -363520 798720 -460800 830976
6264 -355840 -937472 7168 146432 -565248 -228864 -1055232 763392 507904 564224 -593920
6253 -720896 -611840 51200 220672 -653312 534016 -253440 -1013760 -309760 -905728 335360
6242 -555008 555520 -620032 -939520 -235008 -424448 -142336 -510464 -1159168 83456 -556032
6231 228352 579072 117248 82432 -1311232 -122368 -183808 -531968 -733696 406528 192512
6220 -584192 116224 397312 -514048 -733184 245760 -740352 508928 515584 -696832 187392
6209 -45568 -372224 603136 1120256 -965632 315392 347648 151552 -131072 -749056 92672
6198 104960 -515584 10752 -186368 -529408 -193024 -268288 218624 378368 711680 -33792
6187 319488 -1017856 418304 -322048 -476160 326656 642560 66048 123392 -956928 -544768
6177 -544768 -60416 -11264 -145920 -360448 443392 177664 -738816 303104 3072 -581120
6166 -500736 -679424 43520 342528 -370688 265216 -171008 -296960 -209408 -474112 -329728
6156 -329728 -155648 -251392 -118272 -238592 578560 -54784 -600576 -427520 -464896 260096
6145 -207872 -266240 -352768 504832 -652800 -321024 -315904 -605696 -527872 -1398784 200704 -491008
6133 -236544 -19456 195584 -794624 488960 405504 -413184 80896 547840 -487936 60928
6122 -871424 -308736 467968 479232 323584 -476672 427520 763904 855040 25600 229888
6112 229888 62976 -108032 401920 -127488 -1337344 1139712 352768 404992 885248 -164864
6101 -36352 -935424 172544 691200 -368128 -597504 -1644544 -194048 98304 588288 -871424
6090 -966144 -16384 -1048064 975872 405504 -473600 -816640 91136 -1420288 -716800 -145920
6079 -479744 -126976 -366080 -691200 -932352 602624 -270336 -25600 -381440 -921088 -920576
6069 -920576 878592 -692736 855040 -37888 21504 754176 -1042944 535040 52736 -284160
6058 -12288 772608 -100352 326144 -55808 134144 63488 -1207808 -390656 182784 -385536
6047 -577024 -605184 666112 -239104 -476160 42496 -1155072 100864 -141312 -135168 263168
6036 -87040 -1130496 -507392 550400 -977408 544256 -19456 -281088 -175104 -596992 -435712
6026 -435712 -401920 -33280 -604672 450560 -346624 -491008 -1185280 374784 -1058816 -189440
6015 167424 579584 -419840 390656 -791552 -672256 -35328 48640 224256 -11776 553472
6004 -486912 -358912 73216 -953344 -216064 147456 276992 -199680 573440 -425472 -423936
5994 -423936 -249344 -3584 313856 7680 483840 820224 29184 645120 471552 -79872 14336
5982 -781824 221184 567808 367104 -363520 879616 1270784 -358912 570368 -590336 -23552
5971 -1065472 -145408 -258560 62976 932864 -844800 117248 255488 -467456 453632 -721920
5960 -204288 -788480 1622016 163840 403968 -322048 -175616 808448 -305664 828416 -416256
5949 -455168 516608 -548352 -712704 -535040 -1215488 281088 -911872 -431616 -599040 -574464
5939 -574464 -940544 -360448 305152 427008 268800 -75776 -896000 561152 -525824 129536
5928 -817152 622080 -337920 -158720 -378880 -414208 -692736 -556544 -928768 -33280 -286720
5918 -286720 653824 326656 196608 -764416 521216 322560 607744 -372224 -405504 -17408
5907 -762368 -611328 172032 -288768 -168448 -1131520 681984 272896 26112 -680448 -308224
5896 -376320 266240 -561152 -274432 -13312 -159232 -207360 253440 1303040 -205312 -1184768
5886 -1184768 239104 170496 -369152 -484352 300544 41984 -283648 -7680 -206336 41984
5875 431616 -530944 -1945600 -90624 -142848 98304 589824 -1072640 1109504 -1156608 -967680
5865 -967680 14848 -980480 115712 352768 -1334272 -863744 -953344 -1035264 289280 467456
5855 467456 -801792 -720896 -14336 -779776 579584 205824 -620032 -153088 -359936 393216
5844 -124928 360960 91136 -773632 797184 -55808 304128 101376 212480 135680 -377856
5833 -259584 -104448 -96768 -309760 -367616 -273920 -598016 355840 321536 -235520 484352 26112
5821 -363008 -290816 -401920 414720 -60928 -49152 -288256 344064 -881664 228864 1024 -417792
5809 393216 -324096 40960 126976 -387584 406528 -145920 557056 354816 -765440 570880
5798 -573440 -310272 -68096 -133120 -295424 -759808 -839680 -2560 -119296 -598016 -449536 -341504
5787 -341504 842240 -972288 462848 -779776 313344 -669696 467968 -494080 -140800 951808
5776 -524288 -205824 -151040 -267264 153600 -232960 587776 -344064 -728064 -507392 630272
5765 -1206784 333824 230912 -611840 37376 -979968 919040 102912 234496 -60416 -627712
5755 -627712 -736768 -213504 -721408 141824 964096 -61952 19968 -331264 -975360 337408
5744 -286720 -650752 -628736 -114176 838144 608256 -457728 -602624 -816640 -221696 -774144
5734 -774144 -612352 -238592 164864 221184 -577024 -448512 615424 -776192 107008 502784
5724 502784 -381952 -984064 564736 -446464 333824 286208 -470528 207360 257024 -1351680
5713 578560 221184 -589312 200704 633856 -32256 160256 -728064 -100352 -367104 -498688
5703 -498688 -257536 -1290752 -866304 -665088 299520 -563200 359424 221184 -262144 498176
5692 -517120 -346624 1318400 -148480 152576 -750592 -770048 105984 -61440 -487424 -384512
5682 -384512 141312 23552 -279552 780288 -224256 172032 -475136 -364032 -1050624 -8704
5671 -169472 663040 429056 232448 91648 133120 79872 1136640 301056 327680 -201216
5660 -1135104 288256 -429056 1327616 72704 -297984 350720 513024 1687040 1381376
5651 1381376 208896 173568 6144 627200 521216 6144 -79872 1464832 958464 1129984
5641 1129984 854528 868352 309760 1290240 133120 344064 -410112 19456 -129536 -387584
5631 -387584 -524288 353280 349184 336896 1074688 -100352 499712 -377344 -491520 -4096 334848
5619 550912 84992 -283136 785920 553984 -247296 -470016 754176 -524288 -312320 -69120
5608 -776192 405504 -198144 83456 801792 -676352 57856 -295424 -39424 776704 -791552
5597 623104 392192 108032 -605696 -333824 -1340416 32256 8192 -435712 -179200 698880
5586 -70144 670208 -545792 -175104 -153600 -467968 -93184 -801280 463360 -645120 -144896
5575 -103424 -396800 401408 208384 121856 -288768 828416 1226752 -405504 -650240 160768
5564 -800768 -1111040 -1329664 469504 -823808 29184 -175616 -5632 -218112 -737280 -425472
5554 -425472 -347648 365056 360448 288256 -370176 743936 -281600 -584704 1014272 1044480
5544 1044480 -26624 -93184 -759296 -644096 -141312 -1136128 336384 -308224 -726016 518656
5533 -261120 -361472 239104 -232448 -87552 -610816 194048 -200192 374784 251392 -129024
5522 445440 -1024512 1406976 879104 63488 195584 197632 216064 1177088 -348160 657408
5511 -20480 366080 -71168 516096 -414720 -12800 -844800 -228352 -232448 -33280 -292352 -728064
5500 -728064 1151488 597504 453120 -330240 453632 660992 1383936 -758272 682496 834560
5490 834560 385536 -48128 368128 34304 351744 910336 839168 906240 1249792 520192
5479 1268224 1061888 285184 159744 367616 443392 2176512 548864 401920 233472 315904
5469 315904 317440 519680 642560 420864 331264 -460800 -166912 216576 371200 279040
5459 279040 611328 337408 -108544 371200 41472 -618496 -94208 323584 -204288 910848
5448 101888 175616 13824 313344 582144 101888 -83456 285184 -179712 -276992 727040
5437 -82944 188928 1121280 160768 -142336 200192 1070592 524800 812032 -165888 134656
5426 -637952 -13824 -1047040 -652288 -455168 438784 218624 -828416 -205312 -602624 289280
5415 -231424 -881664 240128 -228864 -533504 -104960 375808 -1502720 -523264 -762880 -919552
5405 -919552 1217536 -53248 105472 263168 166912 -84992 -201216 -311808 397312 816128
5395 816128 -330752 354304 -279040 28672 -615424 -246784 576512 82432 -196608 -704000
5385 -704000 225280 -99840 -405504 -157696 -493568 -311296 336896 -101376 188416 117760
5375 117760 -271872 -156672 -653312 -992768 -523776 -614912 -291328 17408 -1167360 418304
5364 47104 436224 -707072 100352 195072 -345088 -193536 -333824 -644608 -520704 124416
5353 55808 363520 561664 -823296 -13312 -73216 -11264 245760 -34816 -331776 1184256
5342 -568320 -1451520 603648 437248 -9216 -220672 -310784 501248 -700928 -546304 805888
5331 338432 -82944 -947200 73216 -1338880 39936 -662016 104448 682496 -701440 -77824
5320 -131584 744960 -437248 -93184 -569856 -258048 -343552 -181760 60416 -252416 1504768
5309 812544 369664 562688 -399872 -300544 -441344 -297984 -657920 -299520 -72192 -648192
5299 -648192 -166400 996864 223744 -1467904 -205824 498688 -16384 -768000 -305664 -549376
5289 -549376 -670208 523264 -389632 -66048 336384 -143360 610304 -23552 -488960 -261120
5279 -261120 597504 -455680 56320 -380928 -520192 -1099264 415744 462336 604160 -324096
5268 -927744 74752 -154624 -169984 -531456 31232 465408 -109056 -362496 542208 296448
5258 296448 1204736 -333824 421888 -468992 472064 243200 1038336 -450048 772608 54784
5247 991744 182784 210944 -195072 511488 1820160 349696 2210304 1098752 1830912
5238 1830912 1477120 1586176 1155584 1347584 -308736 912896 -685568 -264192 -419328 -250880
5228 -250880 774656 546816 -290816 171520 1357312 -112640 -115200 736256 -756224 -322048
5217 -206336 -100864 527872 -545280 1672192 66560 -220672 -203264 -224768 181248 -456704
5206 340480 -802816 -1230336 -488960 -499200 -37376 -42496 -863232 -983040 -106496 -353280
5196 -353280 -624640 -652288 -758784 -807424 600576 505344 237056 -421888 -456704 185856
5185 458752 -1134080 -507392 227328 -309248 -773632 114688 -632832 838656 -642048 1536
5174 -429056 -727552 269824 -567296 125440 -582656 74240 -171520 -478720 -911872 -297984
5163 174080 69120 -235520 297472 -392192 -140288 117248 647680 -374784 161280 551936
5153 551936 -236032 35840 687104 -1401856 -376832 -111616 292864 513536 177664 232960
5143 232960 -498176 -836608 -79360 467968 224768 292864 630784 369664 581120 -118784
5132 202752 131072 440832 219136 606208 227840 -458752 -150528 -978944 957952 -663040
5121 47104 286720 -685056 -70656 488960 -187904 525824 114688 800256 -224768 -179200
5111 -179200 -446464 308224 748032 -370688 478720 -274432 831488 407552 -126464 138752
5100 260608 201728 1472000 -72192 35328 419840 958976 306688 -191488 -116736 1093632
5089 1139712 -94720 1339904 65536 175104 148992 -168960 789504 828416 153088 817152
5079 817152 1867264 -805888 251904 337408 684032 -1203200 716288 -262656 120320 785408
5069 785408 679424 623616 146944 -546304 252416 -242176 262656 1464320 187904 491008
5059 491008 138240 991744 -197120 912384 354816 699904 249344 727040 -1488384 -324096
5048 121856 495104 1737216 -184832 270848 415232 -123904 -275968 288768 190976 198144
5038 198144 -339968 747008 41984 -116736 146432 10240 800256 -260096 763392 -203264
5027 -32256 -828416 -442880 -133120 371712 1075712 896000 81920 479744 62976 -2070528
5016 81920 949248 -122368 -10752 289280 -492544 862208 -84480 485888 125440 434688
5006 434688 77312 989184 -324608 780800 143360 -194048 10240 874496 578560 10752
4995 1310208 475648 724992 184832 -54784 692224 622080 833536 1298944 417792 546816
4985 546816 1149952 1461760 573440 1765376 1802752 2942464 2275840 3073536 3903488 3888640
4975 3888640 4591104 3312128 3767808 3385344 3926016 2405888 1098240 321536 1455104
4966 1455104 822784 837120 709632 1174016 4608 313856 502784 833536 543744 -22528
4955 670208 1385984 490496 -640512 -282112 2560 359936 191488 114688 864768 296448
4944 -198144 -1051136 -498176 -167936 -524800 777216 -311296 -223232 -883712 1056256 790016
4934 790016 385536 12288 158208 323072 497152 -430080 369152 -445952 -123904 -504832
4924 -504832 667648 -126976 493568 163328 -1333760 -344064 871936 -251904 247296 269824
4914 269824 390656 494592 -768000 28672 93696 642048 257024 1083392 1143808 563712
4903 887296 -566784 -345088 -111616 587776 -255488 793600 222720 -264704 1060352 -9216
4892 131584 -619520 1317888 1214464 -217088 -109056 -219136 -294912 1169920 -287744 324096
4881 -214016 466944 989696 830976 949760 944640 623616 160768 185856 452608 862208
4871 862208 111104 -420352 256512 2159104 34304 17408 -238592 637952 423936 108032
4860 735232 -370176 -402432 -32768 -757248 -217600 709632 138752 524800 -408576 596480
4849 -286720 582144 -207360 1693696 735744 -97792 184832 -504832 -476672 686592 270848
4838 -985088 16384 -109568 870912 646656 -68608 775168 209408 722944 -522240 466432
4827 -349184 643584 -442880 445440 158208 867328 778240 577024 1583616 330240 1294848
4817 1294848 822784 963584 1042432 1726976 653824 558592 1387520 1389568 478208 437248
4807 437248 983552 1419776 832512 -820736 441344 1717248 1164288 889344 1701888 917504
4797 917504 674304 645632 691200 1461760 1148928 1124864 1615872 666112 464896 1743872
4787 1743872 1154560 854528 746496 171520 853504 1175552 634368 711680 1383424 544256
4776 875520 760320 333824 1044992 261120 1234944 1137152 947200 438272 845824 797184
4766 797184 187904 1034240 1141248 728064 1047040 1059328 219648 -116736 408576 372736
4756 372736 244224 -90624 638976 595968 -92672 572928 1905664 1076736 445952 66560
4745 972800 421888 71680 1024512 860672 622080 545280 445952 68096 337920 -637440
4734 436736 465408 87040 29696 558592 355328 628224 392704 514048 -1413632 1386496
4723 1424896 764928 1044480 1148928 1396224 1034240 1366016 1739264 1494016 2222080 1639936
4713 1639936 2040832 927232 1150464 773632 1847808 819200 1626112 1909760 1689600
4704 1689600 219136 322560 1296384 701440 382976 158208 -355840 87552 969728 241664
4693 589824 1451008 478720 840704 -99328 407040 1169408 454144 985600 861696 740352
4683 740352 1340416 1068544 1351168 1660928 3136512 1030144 2266112 2073088 1688576
4674 1688576 2159616 1458176 1531904 1196032 1637888 1328128 1317376 1017856 1626112 1451520
4664 1451520 1119232 1355264 685568 110080 1583104 1518080 688640 627200 198656 1067520
4654 1067520 1068032 1116160 321536 1093120 678912 71680 855040 -572928 738816 367616
4643 1490432 124928 1005056 -147968 -137216 866816 -291840 589824 -314880 386048 -351232
4632 435712 -158720 226304 -38400 255488 671232 477696 465408 -336384 1267200 871936
4622 871936 219136 691712 707584 -670208 710656 300544 -424960 -226304 -633856 241664
4611 413184 781312 -470016 345088 1030144 365056 1068032 575488 546816 1078272 333312
4600 -317440 1147904 1192448 2251776 237056 593920 778240 -175616 364544 295424 1175552
4590 1175552 606208 818176 464896 611840 803840 1608704 470016 1075712 1175552 830464
4580 830464 1349632 1591296 280064 885248 869376 977920 1974272 1588736 2295808 22528
4569 1234432 806912 361472 419840 990208 107008 140288 1379328 723968 1242112 1643008
4559 1643008 1547776 422400 245760 649728 571904 584192 291328 1304064 1210880 755712
4549 755712 1223168 65536 245248 551936 712704 947712 16896 179712 606720 1017856
4539 1017856 1208320 374784 170496 -197120 -90624 466944 249344 -319488 -377344 1490432
4528 1105408 152064 434176 393216 -23552 615424 795648 -409600 1567744 674816 250880
4517 436224 1177088 916480 524288 1482240 265216 963584 823296 -73216 1025536 1724928
4507 1724928 750080 1039360 841216 1465856 506880 1070592 351232 812032 1068544 434688
4496 1184256 1122304 701952 554496 241152 1352704 1213440 1463296 -230912 -220672 1067520
4485 1523200 974336 1614848 -64000 1376768 1817600 1351168 1406976 1690112 888832 1689088
4475 1689088 1103872 1840128 1683968 1856512 1849856 2147840 1503232 2702848 1799168 1847808
4465 1847808 2362368 2477056 1294848 2158592 2814464 3723264 4068352 3454464 3694080
4456 3694080 2333184 2475008 1778176 3187200 2506240 2049024 1294336 1741312 2511872
4447 2511872 2900480 2224128 1296896 1712128 2268672 1904128 2459648 2543104 1461248 1767424
4437 1767424 2660352 3232768 1476608 1872896 2217472 2005504 2421760 1272832 979456
4428 979456 2062848 83968 1534976 1430528 272896 479232 1875456 688640 1812480
4419 1812480 1228288 2459648 757760 1300992 962048 2491904 2085888 1302528 932352
4410 932352 1140224 738304 1046016 1582080 1717248 147456 509952 397312 766464 1543168
4400 1543168 847872 2401280 2504704 794624 1331200 1905664 603136 1237504 1134080
4391 1134080 875520 1272832 976896 1545728 1033728 323072 488448 -388608 1056256
4381 259584 553472 -10240 1574912 1368576 414208 728064 683520 177152 1163264 1069568
4371 1069568 501760 862208 1167872 -4608 1148928 247296 368128 830464 -75264 982016
4360 1024000 1051136 264704 278016 868352 913920 1688576 524800 -216576 749568 1071104
4350 1071104 332288 986112 99328 -1005056 269312 -304128 373760 521728 1172480 598016
4340 598016 -826368 508416 332800 642048 459264 470528 1054208 46592 72192 26112
4329 314368 362496 1517568 322560 416256 1160704 887296 -232448 -442368 150528 211456
4319 211456 198144 685568 894464 21504 733696 -256512 -1192448 73216 423936 1674752
4309 1674752 -158720 1072128 474112 -178176 -29696 -94208 1005056 -507392 338432 1389568
4299 1389568 -280064 -278528 -708096 731648 439808 24064 739328 506880 695808 245760
4288 1249792 -263680 -389632 880128 -145920 -47616 302592 126464 577024 698368 821760
4278 821760 330752 913920 205824 165376 -468480 632320 15360 -8192 -71680 527360 -188416
4266 -362496 -512512 -117760 880640 -59392 93696 62464 250880 1173504 288256 143360
4255 -777216 740352 1339904 1211904 410624 -221184 1028096 1970176 2526208 430080 510464
4245 510464 505344 682496 408576 1081344 1958400 1637376 651264 396800 1708544 2474496
4235 2474496 1056256 747520 1404928 1546752 1878016 1327616 1277952 1621504 1442816 1731072
4225 1731072 2464768 1019904 1929216 2295296 1045504 240640 589312 1620992 363008
4215 -469504 13824 689152 1120256 795136 149504 333824 -467968 1161728 249856 836096
4205 836096 1214976 1410048 1112576 1035264 1672192 1357312 1952768 937472 283136 2111488
4195 2111488 -316928 -1079808 545792 816640 692224 761344 1359872 168960 1403904 -3072
4184 670208 1078784 1273856 1309696 1416704 620544 1571840 1300992 2077696 2521600 1800704
4174 1800704 510976 2326016 2688000 2695680 3660288 3073024 2617856 3367936 3341312 4338176
4164 4338176 4493312 3537920 5516800 5061632 4866048 4860928 4806144 4539904 4925952 5024768
4154 5024768 4977664 5259264 5393920 4789760 5072384 5219328 5788160 5723136 5860352 6033408
4144 6033408 6193664 6894080 7484928 6718976 7327232 7774208 7099392 8118784 8737280
4135 8737280 8257536 9133056 7953920 8552448 8976896 9936896 9618944 9710080 10231296 10362368
4125 10362368 11039744 10561024 12475904 12424192 11915264 12827136 14005248 15693824 16366080
4116 16366080 18144768 18074112 18192384 17813504 15705600 13752832 12038656 9688064 8437760
4107 8437760 7041024 6587904 5929472 5774848 3579904 4371456 3620352 3360768 4346368
4098 4346368 3217408 3435520 8909312 1791488 2624512 2341888 3326464 2824192 1733632
4089 1733632 1964032 1305088 3360768 2412544 1022976 1089024 1551872 1832448 2579456
4080 2579456 1923584 1817600 1328128 2214400 1317376 3142656 1438720 1622528 1584128
4071 1584128 1614848 2367488 1712640 1187840 1932288 1555456 1058816 1113600 1550336 1773056
4061 1773056 977408 1242112 3033600 2354688 2621440 2848256 3115008 2968064 2939392 2137600
4051 2137600 2741248 2369024 1084928 1492480 2796032 974336 1601536 2073088 694272
4041 1451008 1633280 809984 623104 1755648 1794560 241664 1394688 107520 -122368
4031 -91136 2188800 1625088 711168 743424 2019328 -65536 1868800 1535488 1337344 857600
4021 857600 1541120 835584 254976 1226752 792576 262144 1273856 816128 888832 210432
4010 722432 912896 1028096 632320 1010176 315392 1327616 245760 2111488 1631744
4001 1631744 2490880 834560 876544 1433088 1472512 417792 112640 701440 68096 388096
3991 388096 1284096 72704 209408 -154112 805376 1186304 -98816 1048064 349184 692224
3981 692224 744960 741888 1130496 -709120 -142336 1652224 365056 702976 -228864 -729600
3971 -729600 253952 320000 807424 714240 -599552 461312 -50688 -567808 -1408000 409088
3960 -614400 375296 1309696 531456 898048 155136 1102336 -243200 -1334272 -645120 -249344
3949 428544 742400 687616 610304 748032 767488 307200 197632 273408 402944 -401920
3938 -2048 2034176 168448 -333824 955392 956928 -538112 -410112 -269312 -220160 21504 601088
3927 601088 1115136 706560 1093632 -193024 371712 243200 216576 178176 580096 -258048
3916 -344576 -669696 -83968 302592 227840 580096 154112 -292864 -440320 -612864 -904192
3906 -904192 226816 -992256 -181248 191488 1249280 -1406976 -151552 264192 1082368
3897 1082368 -284672 -888832 -150016 378368 -667648 118272 496640 220672 188928 -940032
3886 242176 -395776 -370176 104448 486400 -18944 -346112 -91648 -475648 -1189376 232960
3875 -809984 186368 807424 324608 447488 -271360 1008128 21504 498688 -172032 -835584
3865 -835584 583168 222720 1466880 -856576 651264 1298432 628736 1093632 1160192 638464
3855 638464 612864 836608 1351680 871936 -280576 1498624 781312 1873408 866304 532992
3845 532992 1926656 1422336 1971712 1700864 1497088 1730560 1856000 2808320 1978880 2564096
3835 2564096 3007488 2634240 3799040 3367424 2907648 3073536 4056064 3991040 4336640 5165056
3825 5165056 6394880 6864384 7083520 7034368 7456768 8160768 9520640 10970112 11086848
3816 11086848 11162112 11929600 13251072 11698176 13134848 14242816 13912576 14671872 14764032
3807 14764032 15302656 16076800 17190912 18107392 18745856 18611200 20589568 21743104 22930944
3798 22930944 24840192 25270784 26135040 25953280 23624704 20708864 16886272 14083584 12285440
3789 12285440 9755136 8081408 6917120 5256192 6004736 5469696 6620160 4928000
3781 4928000 5242880 3747328 4409344 3913216 3895296 3890688 3922432 4672512 3456000 4214272
3771 4214272 3486208 4670464 4830720 4605952 5220352 3493888 4122624 4797440 4176896
3762 4176896 3960320 3501056 3950080 2983424 4154880 3585024 3925504 5171712 4183552
3753 4183552 4846080 3462656 4083712 2967040 3242496 4355072 3244544 3581440 3476992
3744 3476992 4244480 4381696 3641344 4544000 5818880 6204928 7003136 9022976 8547840
3735 8547840 8352768 8713216 6813184 6316032 5125632 3408384 3440640 4160000 3923968
3726 3923968 3193344 3517440 4139008 3862528 3270144 2919424 2957824 3910144 3651584 3663872
3716 3663872 3164160 3518464 3193856 3122176 3063296 3357696 2887680 3047936 2912256 3530240
3706 3530240 4311040 2588160 4642304 5220352 3642368 2527744 1761792 3077120 2778624
3697 2778624 1375744 1880064 1877504 1137664 2070016 1682432 1357312 716800 1581056 1964032
3687 1964032 -337920 939520 893952 1654272 1187840 544256 1474048 860672 598016 1079808
3677 1079808 384512 1143296 422400 650240 48128 -475136 -702976 152064 736256 939520
3667 939520 56320 862208 163328 813568 1157120 753152 558080 -57856 247296 696832
3657 696832 742400 1399296 831488 559104 -499712 852992 175104 335872 683008 33280
3646 -483840 359424 873472 -62464 328192 540160 202240 792576 38912 -884224 216576
3635 233472 184832 -557056 1150976 -384512 -143360 -514048 -624128 -640000 -367104 -356864
3625 -356864 -142336 -167424 -1482240 -69632 -850944 -710656 340992 -325120 -796672 -758784
3615 -758784 -656896 -807424 -720896 -562176 -397824 -1094656 665088 -1216000 -596992 -467456
3605 -467456 -697344 -280576 -304640 195072 -1084928 963072 -56320 -671232 -261632 -1352192
3595 -1352192 -636416 44544 -950784 -808448 -263680 -816128 -452608 -226816 -1597440 -1085952
3585 -1085952 -1101312 -2198016 -1161216 -1490432 -1174528 -770048 -531968 -1473024 -1408512 -126464
3574 -852480 -1684480 -1391616 -779264 -1351168 -1126400 -2046976 -2109440 -2204160 -1446400 -970240
3564 -970240 -1351680 320512 -877056 -1278464 -2455040 -3059712 -5161472 -4597760 -3287040
3555 -3287040 -2771456 -2499072 -2046976 -2529280 -1211392 -1334784 -1196032 -2722816 -3097088
3546 -3097088 -4616704 -3499520 -3540992 -2077184 -1531392 -1482240 -773632 -1300992 -1167360
3537 -1167360 -253440 51712 17920 -235520 -40448 692224 747520 1370112 2658304 2212864
3527 2212864 2522624 4267008 3027968 4777472 4702720 3979264 5399040 6980096 6988800
3518 6988800 7151616 8414208 8923136 9271296 10800128 11203584 11923456 13967360 15968768
3509 15968768 16743424 20325888 21975552 26186240 31056896 35766272 40450560 45983744
3501 45983744 50521088 55943680 62043648 67781120 73542144 79286784 87584256 95768064
3493 95768064 103016960 113063424 124336128 136535552 151234048 169336320 189153280
3486 189153280 213988352 246074880 284019200 336438784 406479360 507239936 649170944
3479 649170944 841710592 1068161536 1258210304 1326992896 1254960128 1091830784 888782848
3472 888782848 697075200 543131648 426951680 342609408 281676800 237684224 205602816
3465 205602816 181075968 162387456 145717760 133607424 121870848 113603584 105879040
3458 105879040 99350016 92331008 88325120 83718144 78819328 75527168 71954944 68798976
3450 68798976 65090560 63819264 60963840 58652160 56056832 54512640 52361728 51133952
3442 51133952 49398784 47697920 46783488 45165056 42770944 43008512 42031616 40579584 38771200
3433 38771200 37667328 37599744 36955136 35853312 33902080 34853888 34355712 32409600 32283136
3424 32283136 31767040 30821376 30956032 30637568 30290432 29416448 29450240 28819968 28560384 28705792
3414 28705792 27098624 26003968 26202624 25894400 27846144 26789376 26006016 28004352 27186176
3405 27186176 25268736 24633856 22446080 21230080 21439488 22109184 21034496 21276672 22663168
3396 22663168 22784000 21453312 21379072 21060608 20656640 18642944 19694592 18028544 18953216
3387 18953216 18608640 18077184 18513408 17971200 17697280 17072128 16765952 18164224 17727488
3378 17727488 17019392 16942592 14740992 15469568 15446528 15650304 16651264 15110144 15354880
3369 15354880 14340608 14528512 14323712 14610432 13174272 13620224 13406208 13730816 13228032
3360 13228032 13111296 12709376 11826688 11550720 11273216 12528640 11938816 11498496 11656704
3351 11656704 11300864 12025856 12212224 11890688 12195328 11130368 11028992 10950144 11192320
3342 11192320 11146240 10207744 10811904 10356736 10611712 10461696 10328576 10924032 10896896 9581568
3332 9581568 10779648 10959872 9742848 9377280 10879488 10148864 10948096 9405440 8907776
3323 8907776 9806336 10502144 9835520 10401792 10652160 10961408 10357248 8993792 9288192
3314 9288192 9075712 9212416 9003008 8587776 7907840 8894976 9034240 8007168 8803328
3305 8803328 8408064 8745472 8184832 8525824 8197632 8755200 8145920 8578048 7768576 8777216
3295 8777216 7747072 8648192 8794112 8741888 9577472 9282560 9082880 11944448 10711552
3286 10711552 10786816 12146688 11276288 10908672 9049088 10137600 9327104 11015168 8917504
3277 8917504 8670720 8398336 7322112 7822848 6944256 7761920 7891968 7097856 6799360
3268 6799360 8622592 6709248 6934528 6064128 6634496 7115776 6880768 5356032 7120384
3259 7120384 6767104 6323712 6112256 6387712 5991936 6055936 6543360 6779392 6047744 6573056
3249 6573056 5712384 6268928 6529536 5903872 5899264 7022592 5450752 5705216 6020096 6044160
3239 6044160 6369792 6642688 6009856 6568960 5707776 5897728 6206464 6834688 7053824 6306816
3229 6306816 7225344 7455232 7711744 7702016 7455744 7681536 8803840 8648704 9058304 9056768
3219 9056768 10141696 11561472 10805760 11501568 11504640 12284416 12875264 14395904 13237248
3210 13237248 15149568 15386624 15389184 17592832 16814080 16957440 16619008 17843200 16929792
3201 16929792 17842176 17127936 17871360 17215488 17489408 16743424 16687104 17762816 17762816 17301504
3191 17301504 16805376 16269312 15598080 17410560 17438720 16998912 18122752 17887744 18893824
3182 18893824 17223168 19475968 19372032 19586560 19567616 22110208 20872704 22067712 21899776
3173 21899776 22359040 22274560 23771136 23537152 24420352 25113600 25244160 25854976 26651136
3164 26651136 26966528 27746304 27936768 30688256 30868992 34089472 34162688 33824256 33117696
3155 33117696 31992320 27972608 24958976 22333440 20514816 18953216 17675264 16468992
3147 16468992 16604160 15450112 14269440 12936192 13411328 14021120 11709440 11511808 10953728
3138 10953728 11747840 11565568 12594688 12117504 11227136 11444224 11444736 10978304 11384320 11193856
3128 11193856 10213376 10391552 9892352 10227200 9302016 8946688 9407488 9588736 10019840
3119 10019840 9722368 10636800 10090496 10558464 8264704 9660416 9044992 8411648 9616896
3110 9616896 8343040 9191936 8947200 9109504 8730624 9022464 8460800 7306752 9488384
3101 9488384 8152064 8401408 8644608 8302080 8025088 7669760 8076800 7791104 8443392
3092 8443392 7273472 8180736 7390720 8372736 8014848 7939584 7708672 7986688 7567360 7852544
3082 7852544 8558080 7659520 7728640 9651200 9453056 8380928 8794624 8251392 9315840
3073 9315840 8526336 8914432 8896512 9206784 9046016 9954304 9537536 10312704 10650112 10515968
3063 10515968 11714048 13623808 16954368 23969792 24393728 24517632 27439104 27103744 23205376
3054 23205376 19974144 16199680 13515776 11308032 10350592 9544704 7903232 9360384
3046 9360384 8646656 7929856 7669248 9036800 8379392 8025600 8205824 7527424 7800832
3037 7800832 7392768 7099904 7580672 8473088 7271936 6982656 7478272 6323200 6114816
3028 6114816 7376896 6081536 6304768 7074304 7027712 7332864 6499840 6394880 7141376
3019 7141376 6227968 6526976 6337536 6019072 7367680 6993920 5387264 5720576 7352320
3010 7352320 7587840 6306304 6362624 6751744 6355456 6138880 5848576 6422528 6428672 6934528
3000 6934528 5156864 6677504 6280192 5087232 6308864 5429760 5710848 5733376 5865984
2991 5865984 6078464 6455296 5297152 5825024 6098432 5524480 5714432 5686784 5640192 5337088
2981 5337088 6407168 6048768 4640256 6102016 6141440 5847040 5991424 5805568 5346304
2972 5346304 5424640 5659136 4400128 4720640 4732416 5501440 5754880 6006784 5152256 6340096
2962 6340096 5333504 4920832 5581312 6793216 4726272 5306368 6337536 5453312 6148096
2953 6148096 5673984 5378560 6114304 5621760 5722624 5661184 5988864 5980160 6240768 5781504
2943 5781504 5038080 5421056 4137984 6325248 4605440 6206464 5713920 6070784 5966336
2934 5966336 5573632 5382144 4420096 5414400 4914688 6601216 5312512 4611584 5377536
2925 5377536 4968960 5279744 4252160 4761600 5647872 4936192 5301248 6146048 5143040
2916 5143040 4184576 5186560 5173760 6157312 5735424 4424192 4664832 5178368 4427776
2907 4427776 4978176 4580352 4703232 6449664 4708352 5752832 4453376 5821952 5558784
2898 5558784 5860352 6396416 4782080 5197312 4992000 4993024 5380096 5969920 5644800 6041088
2888 6041088 5379072 5901312 6090240 5593600 6712320 5747200 4798464 5182976 5397504
2879 5397504 5408768 4862976 5625344 5185024 6195712 5939200 6093312 6436352 6436864 6679040
2869 6679040 8082944 8012800 8317440 8185856 10328064 10208256 10591744 10718720 12234240
2860 12234240 12790272 12144640 12355584 12846592 13639680 13661696 14726656 14346752 14872576
2851 14872576 15083520 15282176 16692736 16353792 17801216 18303488 19292672 19972096 24332288
2842 24332288 29916672 41152512 50348032 46504960 42664960 36676608 31094272 27807232
2834 27807232 24200192 19961344 18213888 15253504 13411328 12110336 11212288 9547776
2826 9547776 9205760 9670144 8964096 8527360 8444416 7737856 8606720 8435200 8209920 8538624
2816 8538624 8005120 7024640 6839296 6780928 6473216 6612480 7381504 6437376 5629952 6609920
2806 6609920 5926912 6109184 6831104 5410816 6089216 6255616 6723584 6917632 5881856
2797 5881856 5921280 5766144 5780480 4978688 6771712 4977664 5023232 4729856 6136320 5424640
2787 5424640 5309952 4784640 5584384 4482560 5606400 5296640 5015040 5404160 5898752
2778 5898752 5222912 6077440 4920832 5941248 4781568 4723200 6281728 6267392 5449728
2769 5449728 5600256 6151168 5562368 6725632 5664768 6973440 6013440 6858752 6621184
2760 6621184 7600640 7532032 7947776 9299456 9567744 9294336 11644416 16382464 25047040
2751 25047040 38450688 43581440 38365696 32768512 24686080 17808384 16583680 15526400
2743 15526400 15731712 22716416 32329728 29814784 27889664 23065600 18469888 15838720
2735 15838720 17811456 20458496 28542464 41943552 38871040 35392000 29670912 20694016
2727 20694016 17321984 16682496 17624064 22044160 30625280 29043712 25002496 20993536
2719 20993536 16106496 12646400 12323328 12722176 14774272 18783232 17605120 15552000
2711 15552000 14104064 10959360 9958912 8578560 7117312 8100864 7615488 6056960
2703 6056960 6824448 7040512 6874112 7940608 6833152 6540800 8147968 6904832 7633408
2694 7633408 7725568 8064512 9891840 9008640 9877504 9573376 9424384 8239104 8336384 7329280
2684 7329280 7314432 6535680 8758272 6807040 7027200 7105536 7433216 6978560 6026240 5401600
2674 5401600 5214720 4262912 4984320 4752384 5118464 4872192 4085248 4307456 4110848 4638720
2664 4638720 4088832 3760640 4208640 4376576 4816896 4774912 4728832 3717120 4343808 4720640
2654 4720640 3984384 5017088 4936704 4221952 3892224 4173824 3747328 3726336 4387840 4232192
2644 4232192 3955712 2976256 4539392 2586624 3793408 3143680 3358208 3102720 4037632
2635 4037632 3068928 3826176 4324352 2954752 3686912 4045312 3472896 3683328 3183104
2626 3183104 3573248 4294144 3553792 4364288 3563008 3500032 3500032 4008960 3279872 3457024 3374080
2615 3374080 3433472 3295232 3546624 3300352 2882048 2683904 4321792 2978304 2557952
2606 2557952 3932672 3147776 3296256 3463168 3371520 3700736 3692032 4261376 3096576 4311552
2596 4311552 3428864 2931200 3339776 3023872 3417088 3416576 1753600 2724864 3503104 3110912
2586 3110912 3346944 4097536 3216384 4347904 3697664 3191296 4068352 3244032 2314240
2577 2314240 3463680 3750400 4143616 2719232 3515392 3088384 3788288 3608064 3968512
2568 3968512 4294144 3970048 2991104 3715072 3711488 4297728 2936320 3951616 3719168 3261952
2558 3261952 3858944 3061760 3581440 3152384 3493376 4225536 3850240 3354624 3993600 4659712
2548 4659712 3942400 4164096 2888192 3466752 4111360 3172864 4021248 3932672 3655680 3654656
2538 3654656 3886080 4965888 3272704 4999168 3863040 4403712 4518400 4409856 5459456
2529 5459456 4065792 3350528 5732352 4089344 4248064 3473408 4120064 4926976 4506624
2520 4506624 4602368 3146752 4774400 4355584 4811776 4495872 5269504 3575296 3197952
2511 3197952 4087296 4244480 4611584 4281344 3522048 4010496 4665856 3212800 3616256
2502 3616256 3398144 4306432 3277824 3696640 4284416 4325376 4834816 4254208 4191744 3753472
2492 3753472 4142592 3684352 4015616 3939840 4944896 4068352 2961920 4032512 4048384
2483 4048384 4336640 4047872 4254208 3918336 4002304 4477952 4986880 4359680 4394496 5353984
2473 5353984 4307456 5715968 4325376 4667904 5140992 5517312 5857280 5661696 4889088
2464 4889088 5626880 6428160 5392896 4715520 4716032 4771840 5153280 4558336 4139520 4304384
2454 4304384 4458496 4851712 5129216 5180416 5095936 4896768 3965440 4550656 5006336 4284928
2444 4284928 4856320 4093952 5685760 5030400 5224448 5234176 4676096 5286400 6084096 5571584
2434 5571584 5907456 5100544 5257728 5064192 5038592 5638656 5522944 6074368 4994560 4722688
2424 4722688 4767744 5569536 5580288 6321664 5015040 5407744 5358080 4814848 5873152 5463552
2414 5463552 5347840 5339648 5509632 5705728 6684672 5112320 5363200 4655104 5848064 5617664
2404 5617664 6393856 5433856 6127616 5753344 5860352 5466624 5845504 6316544 6445568 6743040
2394 6743040 6992384 6422016 4814336 6553600 6760960 4738560 5745152 5286400 5634560
2385 5634560 5298688 6175744 5611520 4798976 6295040 6540800 5581824 5182976 5330944
2376 5330944 5643264 5511680 4930560 5801984 5914112 5748736 5096448 6480384 6030848
2367 6030848 4700672 5934592 5436928 5082624 5279744 4664320 4874752 5639680 5205504
2358 5205504 5114368 5740032 6161408 5467136 6188544 4958720 4355584 4500480 5003776 4659712
2348 4659712 4982784 4453376 4452352 4708864 4575232 5352960 3887104 4844032 4915712 4457472
2338 4457472 4540416 5827584 4659200 4250112 4606464 3824640 3403776 4041728 4129280 3596288
2328 3596288 4542976 4063232 4503552 4122624 4582912 3101696 4144640 4065792 4626432
2319 4626432 3712000 5022208 4166144 3081216 3186176 4783616 4808192 4979200 4826112
2310 4826112 4063232 4032512 4870656 5170176 3973120 4859904 4639744 4250624 4798464 4239360
2300 4239360 3845632 3816448 5362688 4771840 4053504 4459520 5801984 5138944 5584896
2291 5584896 4846592 5052928 5797376 5951488 5309952 5773312 5691904 5287936 6438400 5896192
2281 5896192 5058560 7001600 5848064 5788672 7085568 7402496 7554560 7307776 8250368
2272 8250368 7759872 7758336 7325696 8570368 7266304 7025664 6969856 7034880 6498304 6893568
2262 6893568 6313984 6491648 7347200 5471232 6644224 6966784 6921216 7068672 8498688
2253 8498688 7088128 7123968 6987264 7416832 7321600 7715328 7422976 7554560 6596608 6949376
2243 6949376 6982144 6320640 7140352 7121920 6114304 6984704 7465984 7980032 6525440 7102464
2233 7102464 7744512 7482368 6980608 6608384 6986752 6453760 6213632 6950912 6217728 6046208
2223 6046208 6715904 6107136 7260160 6950912 7384064 7608832 6763520 7094272 6905344
2214 6905344 7826944 7203328 6727168 5690368 6348800 6495232 7144448 6857728 6729728
2205 6729728 6070784 6527488 5204480 6467584 5794304 5829632 6272512 6408192 5585920
2196 5585920 5021184 6007296 5440512 5716992 5639680 5419520 4833792 5000192 5564416 5130240
2186 5130240 4489216 6312960 4621824 6033920 5513728 5690880 5331968 5819904 5625344
2177 5625344 6871040 5903872 4758016 5734400 6045696 6141440 5717504 6386688 6569984
2168 6569984 6684160 5159424 6261760 6535680 7104000 6599680 5352960 6027264 5871104
2159 5871104 6441472 5716992 6916096 6358016 6969344 7769088 6995456 6694400 7033856
2150 7033856 8322560 7677440 8325120 7612928 7324672 9236480 7579136 8678400 7589376
2141 7589376 8939008 8939520 8531968 9065984 9730560 8047104 9582592 9488384 10543616 9783296
2131 9783296 9626112 9378304 8687616 8570880 8754688 9511936 9224704 9453568 10186752 11037184
2121 11037184 10261504 9718784 9590784 9268224 10225664 10200064 10853376 9380864 9801728
2112 9801728 8844800 10146816 10242048 9333760 9576960 10734080 9603072 10116096 9991680
2103 9991680 10563584 10741760 11418112 11308544 10669568 10897920 10168832 10480640 12085248
2094 12085248 11597824 11614208 11461632 11567104 10971136 11722240 11034624 11038720 10697216 11146240
2084 11146240 10358784 11712512 11054592 11301376 12186112 12921344 14428160 19708416 30203392
2075 30203392 27755008 24660480 21338624 16047104 14087680 12780032 12177408 11624960
2067 11624960 10563584 12549632 10842112 11367936 10515456 10811392 9867264 9253376 9099264
2058 9099264 9896448 9528832 10226176 10070528 10138112 10994688 10037760 8556032 9503232 8841216
2048 8841216 7902208 7901696 7033344 8122368 7646208 6545408 7332352 6595072 7039488 6673920
2038 6673920 6422528 7611392 6951936 6495744 6200320 7260672 5006848 6934016 6307840
2029 6307840 5953024 5343232 7256576 4922880 5081600 6103040 6940672 4935168 6043648
2020 6043648 5271040 5500928 5208576 5658624 5451264 5321216 5839360 5564928 5861888 5617664
2010 5617664 5665280 5504000 5016064 5478400 5194240 5273088 5168640 5333504 6585856 4975616
2000 4975616 5374464 6131712 6142464 7152128 5888512 5600768 6438912 5091840 6040064
1991 6040064 5746176 6050816 5636608 5606912 5439488 6283264 5586944 5288960 4911104 5509120
1981 5509120 5319168 5559808 7154688 5420032 4712448 5163008 4217344 5047808 5943808
1972 5943808 6086144 5477376 6872576 7100416 7099904 6845952 6838272 6236160 7963648 7212544
1962 7212544 7432704 7028736 7443968 7933952 7721984 8865792 8204800 8794624 8391680
1953 8391680 8173056 8168960 8761856 8550400 8795648 8685056 8229376 9175552 9268224 8586240
1943 8586240 8381440 8199680 9524224 10062848 10233856 10662912 9839616 9485824 10477056
1934 10477056 10240000 10203648 10646016 10489344 10530304 10212864 10457088 12112384 12218368 10848768
1924 10848768 12190720 12959744 12264448 12366848 14211072 13213184 13840384 13939200 14141440
1915 14141440 12962304 14151168 13426688 12431872 12250112 13192192 11833344 12525056 11182080
1906 11182080 12453888 12022784 12577792 11383296 10367488 10596352 12344320 11591680 12071936
1897 12071936 11675136 11020800 11324416 11429888 11335168 11341824 11449344 10956800 11736576 11730944
1887 11730944 11240448 11790336 11034112 10813440 11446272 12166656 12435968 11294720 11051008
1878 11051008 10621952 11322880 11002880 10386432 9510912 10372096 10921472 10155520 10671104
1869 10671104 9493504 9054208 9049088 9146880 8319488 10089472 8099328 9202176 7067648
1860 7067648 8883200 7735296 8050176 8807936 6804480 7125504 8251904 8037376 6384128
1851 6384128 7387136 6561280 7582208 6718976 7250432 6607872 5490688 7089664 6240256
1842 6240256 6401536 6424064 6526976 6619136 6597120 7228928 5365760 6402560 5879296 5911040
1832 5911040 5761024 6490112 7173120 6428160 5131264 4959744 6836736 5745664 6500352
1823 6500352 6387200 5963264 5815296 6091264 5867008 5636096 5437440 6845952 6526976
1814 6526976 5704704 6140416 6444032 6950912 6792192 7173120 7296512 6795776 8123904
1805 8123904 8060928 7756288 6091264 7848960 7367168 8397312 7951360 8433664 8900608
1796 8900608 8666624 9018880 9413632 9712640 8422912 9302016 9947136 10287616 10514944
1787 10514944 11556352 11304960 10962944 11621376 12083200 11811840 11592704 11752960 12571648
1778 12571648 13905920 14148096 13722112 15465984 15289344 16671744 16939008 17359872 18831872
1769 18831872 19324416 22248960 21925376 22929408 25314304 26023424 28813824 29753856 30786048
1760 30786048 33183232 32807424 34364928 35486208 36303360 37084160 37794304 38523392 40103424
1751 40103424 39617024 42091008 42319360 44244992 45957120 48307712 49665024 52663808
1743 52663808 55609856 58266624 61850624 65070080 71025152 77682176 84629504 93734400
1735 93734400 103119360 110947328 121470976 125554176 125819392 122320896 114972160 107227648
1727 107227648 97931264 84670976 73321984 63505408 54320128 46166016 41484288 36135424
1719 36135424 31988224 31269888 29399552 26498048 26460672 25199616 22960128 22636544 21576192
1710 21576192 20245504 19531776 18746368 19413504 19230720 18715648 16820736 17140224 16670208
1701 16670208 16027136 15805952 15322624 15132672 14958592 14517248 15033856 14850048 13929984
1692 13929984 13851648 14230528 12713984 12499456 11617792 12798464 12556288 12451328 10545664
1683 10545664 12036608 11489792 11671040 10852864 11998720 11059712 10407936 10674688 9887744
1674 9887744 9883648 10216448 8837120 9085440 8468480 8530432 9054720 9219072 9695232 7982592
1664 7982592 9732608 9721856 8770560 8533504 8190464 7523840 7871488 9514496 7519744
1655 7519744 8455168 7224832 7356928 7182848 7299072 6633472 6795776 7275008 6990336
1646 6990336 8289792 7344640 6935552 6751232 6804992 6179840 6790656 7500800 6925824 5344256
1636 5344256 6773248 6398464 6762496 6569472 6321152 6697472 6901248 6950400 6773760 6476288
1626 6476288 5825024 6558720 6564864 5344768 6940672 6363648 5752832 6668800 6610944 6298112
1616 6298112 5570048 5360640 5732864 7367680 5705728 5731328 6124544 6732800 5664768
1607 5664768 6501888 5944320 7536640 8116224 6440448 7251968 6590464 8031232 8048128
1598 8048128 8224256 7927808 7953408 7124480 7341056 7828480 8053760 9057280 9033728 9041408
1588 9041408 9326080 9605120 10027520 9943040 10705920 13210112 14002688 14548992 15559168
1579 15559168 14985728 13974528 13072384 13194752 11870208 11319808 11537408 11763712 10788864
1570 10788864 11600384 10405888 10893824 10530304 10474496 10779136 10779136 10790912 10508288 9232896
1560 9232896 11245568 10506240 10352640 10359808 10053120 10415104 11174400 10838016 10496000 11160064
1550 11160064 10574848 11633152 10913792 12081664 13070336 14133248 14159872 14870016 15290368
1541 15290368 16558080 15830528 16273920 16608768 15752192 14495744 13116928 12914688 12098560
1532 12098560 12642304 9406464 10578944 10546688 10077696 10681344 9230848 9695232 10149888
1523 10149888 9393664 9152000 9284096 9452032 9374208 9883136 11237376 11665408 12274176
1514 12274176 13109760 12275200 13337088 14332928 15069184 13027328 11988992 12325376 10855936
1505 10855936 10007040 10060288 9397248 9252352 7993344 9427968 8380928 7436288 7685120
1496 7685120 8068096 5772288 6343168 6614528 6968320 6984704 6626816 5532672 5471744 6319104
1486 6319104 5395456 5981184 5395968 5292032 5857792 5765120 6205440 5747200 6154752 5353472
1476 5353472 5361152 5267968 4812288 4930560 4829696 5100544 5950464 5983232 5285376 5640192
1466 5640192 5403648 5147136 5822464 5869056 5652992 5555712 5234176 5671424 5672960 5696512
1456 5696512 5559808 5584384 5750272 6313984 5444096 5291520 5688832 5944832 6824448 6144512
1446 6144512 5478912 5159424 5981696 6307840 5675008 5216768 5641728 6254080 6296576 6459392
1436 6459392 5635072 6763008 6615552 6612480 6464000 6177792 6635520 6751744 5755904 6828032
1426 6828032 7042048 7578624 7240192 6551552 6389760 7832576 7599616 6324224 7300608
1417 7300608 8299520 8082944 8070144 7650816 6624256 7347200 6454272 6733824 5158400
1408 5158400 6274048 5411840 5376000 5237760 3877888 4614656 4679168 3831296 3619840 5589504
1398 5589504 4148224 4530688 3133952 3185664 3692032 4344320 4715008 3637248 3642880 3889152
1388 3889152 3616768 4574208 2735616 2867200 4720640 3931136 2991104 2874368 3723264
1379 3723264 3363840 2812416 3587072 2827264 2807296 3300864 2772480 2271744 3490304 3225088
1369 3225088 2806784 2828288 3384320 3278848 2890752 2464256 3352064 3095040 3346432 3223552
1359 3223552 3096064 3617792 2563072 3437056 2510848 3147264 3119616 2859008 2498560 3045376
1349 3045376 2697728 2415616 2447360 3156992 2556928 3330560 2439168 2301440 2735104 2063360
1339 2063360 2227200 3154944 2045952 2795008 2476032 2469888 1158656 2435584 2332160
1330 2332160 2807296 2757120 2408960 3093504 2857472 2355712 2083328 3469312 1951744
1321 1951744 2293248 2594304 3552256 2980352 3259904 2843648 3150336 2397184 1520128 2179072
1311 2179072 1811456 1862144 3475456 2609152 2053632 2527232 2232832 2299904 2957312 2416128
1301 2416128 3701760 2877952 1498624 2123264 2446336 1557504 2542080 1169408 2532352
1292 2532352 2169856 2547200 1957376 2207744 2217984 2435072 1812480 1701376 1223680 2509824
1282 2509824 1529856 2220032 1845248 1940480 2855936 2467328 2251776 2516992 2966016 2616832
1272 2616832 2252288 2683392 2901504 2679808 3116544 1686528 2457600 3294720 2362368
1263 2362368 2409984 2524160 2468864 3337216 1472000 1225728 1970176 1456640 1337856 2635264
1253 2635264 3712512 2252800 1464320 2109440 2343936 2245120 2377216 2465280 2650624 1948160
1243 1948160 2771456 3101184 1752064 2301952 3190272 1452544 1269248 2867200 1942016
1234 1942016 2168832 662528 1955328 2757632 1926656 3319296 1999360 2760704 1688064
1225 1688064 1836544 2209792 1973248 1357824 959488 1761792 1101824 2354176 2164224
1216 2164224 1892352 1830400 2486272 2206208 1849344 1798656 1460224 1133568 2625024 2349568
1206 2349568 1955840 1795072 1728512 1740800 1507328 1401344 927744 2073600 2337792 1670656
1196 1670656 1321472 2865664 1324544 1389056 1523712 1773056 917504 1597952 2210816
1187 2210816 1127936 1090560 1122816 1720320 1225216 1403392 1864704 473600 1074176 544256
1177 544256 1550848 2357248 1312256 1483264 857600 1404416 1859584 418816 1082880
1168 1082880 1167360 538112 359936 934912 2256384 777728 1390592 1673216 1436672 1157120
1158 1157120 1153024 1462784 938496 1615360 1325056 789504 2270208 1062912 376320 2246144
1148 2246144 1322496 -79872 919040 1557504 1868288 1664512 2121728 1389568 1834496 1491456
1138 1491456 2167296 1609728 2610688 1849856 1014784 1556480 1286656 1741824 1519104
1129 1519104 1403904 2588672 1967104 2426880 1542656 3424768 2793984 3711488 4334080
1120 4334080 4638720 3191296 4542464 5785600 7310848 8070144 5787136 6877184 6401536
1111 6401536 6752768 7212544 6948864 7727616 7685632 9075200 10047488 10806272 11945984
1102 11945984 15437824 18975232 24344064 54901760 114726400 121915392 98998272 83949568
1094 83949568 48789504 33104896 23287296 18651648 15382016 11819520 10855936 9895424
1086 9895424 8913920 9084416 8982528 7273984 8015360 8027136 8561664 8475648 9095168 7579136
1076 7579136 6881280 5324800 5648384 4193280 4399104 4849664 5240832 5052416 3950592
1067 3950592 4193280 4625408 4445696 3436032 4229632 4030976 4932608 3654144 3766272
1058 3766272 3159040 3073024 3010048 4572672 3204096 3057152 4090880 3153408 3488768
1049 3488768 2966016 2838016 3181568 2803712 3964416 3969536 3715072 2860544 2637312 2901504
1039 2901504 2234368 3052032 2686976 2789376 3449344 3127808 2498048 1304576 3472896
1030 3472896 1967104 1871360 3274752 2998272 3571712 2432512 2418176 2591232 2080256
1021 2080256 1663488 2404352 2038784 2184192 2311168 3033088 2163712 2288128 2097664 1939456
1011 1939456 2974208 2112512 2003968 2470912 2310656 1733120 2120192 1703424 3047424
1002 3047424 2606080 1810432 1946112 2630144 2354688 2674688 2369536 2423296 2508288 2392576
992 2392576 2478080 1724416 2304512 1715712 2474496 2161152 1411072 1237504 2580992 3104256
982 3104256 971264 1650176 1955328 1983488 2248704 2078720 1980928 1772032 2030080 1321472
972 1321472 1401344 2395136 1932800 2831872 2067968 1477120 2712576 2663936 3278848 2341376
962 2341376 1131008 1098240 2742272 2699264 885760 1199104 1738240 1555968 1538048 2250752
952 2250752 2095616 2120704 2105856 2799616 1905664 1731072 1347072 1135616 1637888 2041856
942 2041856 2165760 1090560 2212864 1157120 1838080 795648 1303552 822784 1811968
933 1811968 1704960 1335296 2209280 2427392 860160 2109440 2304000 1688064 2834432
924 2834432 1638400 1315328 2022912 1264640 1394688 1110016 1349120 1384960 1846272 1850880
914 1850880 1983488 1901568 1094144 1733632 2707968 1948160 1794560 1925120 935936 1243648
904 1243648 561664 2212864 1102336 1168384 1429504 1531904 2151424 912896 1603584 1741824
894 1741824 1151488 160768 1292288 1940480 1132544 1466880 1252864 1439232 1699840 2516480
884 2516480 1556992 1742336 1986560 1653760 715776 1682432 1369600 1428992 2097664 1631744
874 1631744 1895424 1299456 872448 952832 1140736 1041408 1354240 1047552 1394688 1201152
864 1201152 1674240 587264 1057280 1505280 -453120 1958912 1222656 655872 896000 993280
854 993280 1662976 1223680 1556480 1975808 1270784 741376 2002432 612864 2055168 1199616
844 1199616 1572864 1140736 2264576 857088 2088960 1234432 2275840 1431552 1500672
835 1500672 828928 -318976 1296384 2319872 2136576 610304 2155520 863744 1954304
826 1954304 1453568 1036800 2049024 1158144 1180160 1455616 1577472 1365504 1317376 1417728
816 1417728 990720 1591296 1766912 1585152 2612224 654848 1166848 1502720 1040896 1450496
806 1450496 2132480 2503680 1642496 1018880 1732096 2056192 1379840 2106368 2060288 2166272
796 2166272 2196992 1998848 1598464 1698304 1455616 2735104 1693696 866816 2458624 1707008
786 1707008 1742336 2263040 2029568 2631168 3503616 2621952 2885120 2867200 2738688 2953216
776 2953216 3146240 2421760 2494464 1943552 2534400 2677760 1307648 2300928 1482240 1434112
766 1434112 884224 1154560 1240064 2044416 1502720 1144320 1984000 1138176 1897472 -44544
755 674816 1286656 1402368 1546752 962048 1303552 1372160 2096640 1503232 1520128 2229248
745 2229248 1161728 428544 108032 385536 1554432 1083392 844288 455168 1869312
736 1869312 1212416 991232 1174016 1334784 318464 1005568 539136 646656 331776 1533440
726 1533440 1512960 1192960 694784 1468416 1035264 -310272 310272 183296 1486848 753664
716 753664 1441280 1001472 1003008 1315840 1169408 176128 1118720 1338368 1072128 1377280
706 1377280 587776 72192 398336 1436672 861696 1142272 -42496 982016 820736 590848
696 590848 1574400 493568 345600 1333248 643584 900608 1940480 418304 687616 987136
686 987136 482816 869888 1028608 2066944 1688576 938496 348160 1455616 777216 589312
676 589312 304128 1466368 431616 962048 1119232 706048 1340928 781312 1404928 636928
665 481280 1624576 982528 2147328 1538560 1386496 1491968 771584 1445888 157696 208896
655 208896 1030656 905728 825856 853504 1789952 1144320 1302528 731136 731648 1482240 2051584
644 2051584 542208 606208 537600 552960 856576 804352 1292800 840704 885248 491520 715264
633 715264 442368 1311744 1496064 -17920 340992 1438720 87552 -34816 1527808 457216
622 1944064 1669120 1203712 1171968 978432 439296 759808 1177600 1075712 364544 1349632
612 1349632 794112 781312 783360 1306112 817664 1218048 1012736 -288768 815104 1670656
602 1670656 378368 73728 1711104 1222656 990720 23552 766464 1977856 960000 355840
591 695296 890880 913408 1098752 1528320 790016 -303616 690176 1286144 994304 949760
581 949760 727552 1278464 1049600 1129472 826880 468480 55808 586752 529408 531456 997376
570 997376 -226816 1744384 21504 282624 443392 1744384 632832 -150528 159744 -78848
559 -472576 780800 781824 1249280 654848 1038848 789504 822272 1107456 831488 284160
548 796160 50688 -162816 239616 978944 857600 8192 964608 -537088 451584 24576 309248
537 309248 112640 827392 1168384 603648 866304 837632 286208 593920 109568 1094144
527 1094144 274944 -226304 622592 866304 801792 2569216 1258496 914432 -436736 747520
516 433152 265216 1116672 79360 221696 439296 -436224 871424 206336 168960 1368576
506 1368576 1059328 996352 1488896 79872 1438720 880640 890880 540672 824320 239104
495 6656 549888 1160704 832512 516096 -178688 1431552 -387584 194048 1161728 1125376
485 1125376 493568 791040 881664 658944 1070080 693760 1159680 252416 943616 1369088
475 1369088 1417216 1080320 822784 1315840 987648 630272 938496 1779712 757248 952832
465 952832 1698816 1116160 714752 388608 1739264 1066496 1402880 2037760 2304512 779264
454 1562112 1317376 1344000 1371648 1014272 1073152 1486336 886272 994816 1249280 -133120
443 730624 1453568 401408 509952 317952 151040 -418816 138752 290816 554496 134656
432 56832 772096 814080 804864 -27648 529408 950272 1153024 1061376 670720 -175104 1658880
420 -359936 -647680 349696 230912 377856 -106496 850432 1021952 1202688 786432 565760
410 565760 682496 1153536 -21504 723456 -205824 -33280 416256 883200 660992 255488
399 1228288 426496 582656 497152 264704 -224256 -411136 824832 241664 -121344 835584
388 -71168 348160 760320 -403968 300544 -270848 532480 1113600 626176 222720 858112
378 858112 818176 376320 -414208 -141312 404992 261632 1026048 269824 1052672 -111616
367 402944 148480 1261056 413184 451584 204800 -325120 -43520 120832 551936 -212992
356 209920 1300992 -880640 -198656 -314368 684032 324096 305152 184832 1049600 -59904
345 705536 1114112 903168 201728 329216 851968 -50688 448000 958464 124928 1036288
335 1036288 799744 827392 175616 -350720 -176640 975872 1437184 221696 292864 -956928
324 192512 -587264 -289792 390144 455680 304128 992768 -284160 506368 -247296 27648
313 764928 -109056 721408 566784 183808 386560 266752 -219136 838656 -512512 -31744
302 91648 104960 -115200 583680 758272 37376 -367104 958976 981504 59392 -186368 -917504
291 -917504 672256 1051648 180736 558592 342016 -1133568 -128000 864256 443904 3072
280 -612352 756224 1146880 401920 1556992 164864 -34816 600064 -315904 1439744 485888
269 970752 -311296 666624 1140736 278016 875008 -104960 307200 382464 459264 671744
259 671744 890368 -570368 717824 667648 1083904 -427520 190464 -270336 778240 362496
248 532992 586240 29184 860672 195584 480256 188928 552960 -121856 601600 1039872
238 1039872 151040 1038848 903168 -875008 980480 235008 765952 64512 -307200 750080
227 279552 -1047040 786432 388608 936960 447488 -100864 317952 157696 430080 1459712
217 1459712 491008 195072 161792 205312 -74752 586752 -14336 183808 855040 -127488
206 -50688 -219136 -312320 -786944 -276992 261120 -324608 288768 57344 896000 -59904 -461824
195 -461824 296448 -461312 -481280 207360 111616 -195072 -31232 343552 102912 -105472
184 166400 349696 442368 72192 -3072 -1057280 -809472 82432 501760 20480 281088 63488
172 288256 652800 328192 1460224 -383488 -927744 475136 19968 -312832 130048 138240
162 138240 -602112 1025536 1590272 465408 328704 -131072 -183808 132096 -159232 333824
151 365568 -112640 1128448 224768 415232 -83456 1082368 -243712 -421888 1341952 -134656
140 972288 1321984 -58368 513024 1412608 -16384 -830976 669696 795136 -233472 743424
129 322048 1338368 474624 309760 -88064 -294912 -417792 379392 296960 -79360 -24576
118 18944 651776 798720 198144 965632 -477696 280064 -348160 330752 361472 -412160
107 910848 669184 -448512 -137728 710144 525824 -218112 -168960 -95232 355840 1244160
97 1244160 -135168 695808 421888 -834560 401920 374784 230912 483328 -386048 -51200
86 119808 -769536 -604160 60416 143872 408576 -133632 -26624 -136192 -144896 364032 527872
75 527872 -62464 -31232 564224 1005568 78336 1216000 -349184 676864 595456 -15872 -28160
64 -28160 -636928 1344000 322560 656384 -82432 968704 1133056 1363456 603136 -157184
53 512 662528 280576 11776 340480 714752 -278016 -965632 450560 0 407040 -128000 -170496
41 -170496 5632 -372736 -247808 -324096 476672 -560128 197632 1366528 197120 128512 -88576
29 -181248 -68096 1553408 654848 -663552 -620544 -211968 109056 261120 257536 434176 -667136
17 -29184 95232 485376 -988160 -458752 -363520 -248832 -669696 347648 292864 18944 538624
6 538624 248832 173056 871424 -25600 89600 -306176
##END=
