##TITLE=1390
##JCAMPDX= 6.0         $$ Bruker NMR JCAMP-DX V2.0
##DATA TYPE= NMR SPECTRUM
##DATA CLASS= XYDATA
##ORIGIN= NUTS EXPORT
##OWNER= Administrator
$$ 1.72 TOPSPIN		Version 2.1
$$ 2016-02-23 12:22:12.886 -0800  Administrator@X
$$ Compression mode = diff/dup
##.OBSERVE FREQUENCY= 90.275459
##.ACQUISITION MODE= SIMULTANEOUS (DQD)
##.ACQUISITION SCHEME= undefined
##.AVERAGES= 16
##.DIGITISER RES= 22
##SPECTROMETER/DATA SYSTEM= 
##.PULSE SEQUENCE= zg30
##.SOLVENT NAME= None
##.SHIFT REFERENCE= INTERNAL, None, 1, 14.2675
##AUDIT TRAIL= $$ (NUMBER, WHEN, WHO, WHERE, PROCESS, VERSION, WHAT)
$$ ##TITLE= Audit trail, TOPSPIN		Version 2.1
$$ ##JCAMPDX= 5.01
$$ ##ORIGIN= Bruker BioSpin GmbH
$$ ##OWNER= Administrator
$$ $$ E:/data/jwist/nmr/1390/1/pdata/1/auditp.txt
$$ ##AUDIT TRAIL=  $$ (NUMBER, WHEN, WHO, WHERE, PROCESS, VERSION, WHAT)
(   1,<2016-02-23 09:21:14.480 -0800>,<Administrator>,<X>,<jcamp>,<TOPSPIN 2.1>,
      <fromjdx created from
       E:\data\jwist\nmr\uniandes\1390
       data hash MD5: 8K
       4F 0F 54 75 8C CA D8 95 94 81 F1 B9 AC 55 A7 19>)
$$ ##END=
$$ 
$$ $$ hash MD5
$$ $$ 55 A3 7E 8A F9 30 9A F5 1A 8F 25 5A 9F 1C 19 CD
##$RELAX= 
$$ Bruker specific parameters
$$ --------------------------
##$DU= <E:>
##$EXPNO= 1
##$NAME= <1390>
##$PROCNO= 1
##$TYPE= <nmr>
##$USER= <jwist>
##$ACQT0= 0
##$AMP= (0..31)
100 100 100 100 100 100 100 100 100 100 100 100 100 100 100 100 100 100
100 100 100 100 100 100 100 100 100 100 100 100 100 100
##$ANAVPT= 1
##$AQSEQ= 0
##$AQ_mod= 3
##$AUNM= <au_zg>
##$AUTOPOS= <>
##$BF1= 90.275459
##$BF2= 400.02
##$BF3= 400.02
##$BF4= 400.02
##$BF5= 400.02
##$BF6= 400.02
##$BF7= 400.02
##$BF8= 400.02
##$BYTORDA= 0
##$CFDGTYP= 0
##$CFRGTYP= 0
##$CHEMSTR= <none>
##$CNST= (0..63)
1 1 145 1 1 1 1 1 1 1 1 1 1 1 1 1 1 1 1 1 1 1 1 1 1 1 1 1 1 1 1 1 1 1 1
1 1 1 1 1 1 1 1 1 1 1 1 1 1 1 1 1 1 1 1 1 1 1 1 1 1 1 1 1
##$CPDPRG= <>
##$CPDPRG1= <>
##$CPDPRG2= <>
##$CPDPRG3= <>
##$CPDPRG4= <mlev>
##$CPDPRG5= <mlev>
##$CPDPRG6= <mlev>
##$CPDPRG7= <mlev>
##$CPDPRG8= <mlev>
##$CPDPRGB= <>
##$CPDPRGT= <>
##$D= (0..63)
0 1 0 0 0 0 0 0 0 0 0 0 0 0 0 0 0 0 0 0 0 0 0 0 0 0 0 0 0 0 0 0 0 0 0 0
0 0 0 0 0 0 0 0 0 0 0 0 0 0 0 0 0 0 0 0 0 0 0 0 0 0 0 0
##$DATE= 0
##$DBL= (0..7)
120 120 120 120 120 120 120 120
##$DBP= (0..7)
150 150 150 150 150 150 150 150
##$DBP07= 0
##$DBPNAM0= <>
##$DBPNAM1= <>
##$DBPNAM2= <>
##$DBPNAM3= <>
##$DBPNAM4= <>
##$DBPNAM5= <>
##$DBPNAM6= <>
##$DBPNAM7= <>
##$DBPOAL= (0..7)
0.5 0.5 0.5 0.5 0.5 0.5 0.5 0.5
##$DBPOFFS= (0..7)
0 0 0 0 0 0 0 0
##$DE= 6.5
##$DECBNUC= <off>
##$DECIM= 2432
##$DECNUC= <off>
##$DECSTAT= 4
##$DIGMOD= 1
##$DIGTYP= 12
##$DL= (0..7)
0 120 120 120 120 120 120 120
##$DP= (0..7)
150 150 150 150 150 150 150 150
##$DP07= 0
##$DPNAME0= <>
##$DPNAME1= <>
##$DPNAME2= <>
##$DPNAME3= <>
##$DPNAME4= <>
##$DPNAME5= <>
##$DPNAME6= <>
##$DPNAME7= <>
##$DPOAL= (0..7)
0.5 0.5 0.5 0.5 0.5 0.5 0.5 0.5
##$DPOFFS= (0..7)
0 0 0 0 0 0 0 0
##$DQDMODE= 0
##$DR= 22
##$DS= 2
##$DSLIST= <SSSSSSSSSSSSSSS>
$$ [...]
##$SPOFFS= (0..31)
0 0 0 0 0 0 0 0 0 0 0 0 0 0 0 0 0 0 0 0 0 0 0 0 0 0 0 0 0 0 0 0
##$SUBNAM0= <"">
##$SUBNAM1= <"">
##$SUBNAM2= <"">
##$SUBNAM3= <"">
##$SUBNAM4= <"">
##$SUBNAM5= <"">
##$SUBNAM6= <"">
##$SUBNAM7= <"">
##$SUBNAM8= <"">
##$SUBNAM9= <"">
##$SW= 20.5580556627758
##$SWIBOX= (0..15)
0 0 3 4 0 0 0 0 0 0 0 0 0 0 0 0
##$SW_h= 8223.68421052631
##$SWfinal= 0
##$TD= 65536
##$TD0= 1
##$TE= 300
##$TE2= 300
##$TE3= 300
##$TEG= 300
##$TL= (0..7)
0 120 120 120 120 120 120 120
##$TP= (0..7)
150 150 150 150 150 150 150 150
##$TP07= 0
##$TPNAME0= <>
##$TPNAME1= <>
##$TPNAME2= <>
##$TPNAME3= <>
##$TPNAME4= <>
##$TPNAME5= <>
##$TPNAME6= <>
##$TPNAME7= <>
##$TPOAL= (0..7)
0.5 0.5 0.5 0.5 0.5 0.5 0.5 0.5
##$TPOFFS= (0..7)
0 0 0 0 0 0 0 0
##$TUNHIN= 0
##$TUNHOUT= 0
##$TUNXOUT= 0
##$USERA1= <user>
##$USERA2= <user>
##$USERA3= <user>
##$USERA4= <user>
##$USERA5= <user>
##$V9= 5
##$VALIST= <valist>
##$VCLIST= <CCCCCCCCCCCCCCC>
##$VD= 0
##$VDLIST= <DDDDDDDDDDDDDDD>
##$VPLIST= <PPPPPPPPPPPPPPP>
##$VTLIST= <TTTTTTTTTTTTTTT>
##$WBST= 1024
##$WBSW= 4
##$XGAIN= (0..3)
0 0 0 0
##$XL= 0
##$YL= 0
##$YMAX_a= 1144969728
##$YMIN_a= -1516853.248
##$ZGOPTNS= <>
##$ZL1= 120
##$ZL2= 120
##$ZL3= 120
##$ZL4= 120
##$ABSF1= 10
##$ABSF2= 0
##$ABSG= 5
##$ABSL= 3
##$ALPHA= 0
##$AQORDER= 0
##$ASSFAC= 0
##$ASSFACI= 0
##$ASSFACX= 0
##$ASSWID= 0
##$AUNMP= <proc_1d>
##$AXLEFT= 0
##$AXNAME= <>
##$AXNUC= <off>
##$AXRIGHT= 0
##$AXTYPE= 0
##$AXUNIT= <>
##$AZFE= 0.1
##$AZFW= 0.1
##$BCFW= 1
##$BC_mod= 2
##$BYTORDP= 0
##$COROFFS= 0
##$CY= 15
##$DATMOD= 1
##$DC= 2
##$DFILT= <>
##$DTYPP= 0
##$F1P= 0
##$F2P= 0
##$FCOR= 0.5
##$FTSIZE= 0
##$FT_mod= 4
##$GAMMA= 1
##$GB= 0
##$INTBC= 1
##$INTSCL= 1
##$ISEN= 128
##$LB= 0.3
##$LEV0= 0
##$LPBIN= 0
##$MAXI= 10000
##$MC2= 0
##$MEAN= 0
##$ME_mod= 0
##$MI= 0
##$NCOEF= 0
##$NC_proc= -9
##$NLEV= 6
##$NOISF1= 0
##$NOISF2= 0
##$NSP= 1
##$NTH_PI= 0
##$NZP= 0
##$OFFSET= 14.2675
##$PC= 1
##$PHC0= 0
##$PHC1= 0
##$PH_mod= 0
##$PKNL= yes
##$PPARMOD= 0
##$PPDIAG= 0
##$PPIPTYP= 0
##$PPMPNUM= 2147483647
##$PPRESOL= 1
##$PSCAL= 4
##$PSIGN= 0
##$PYNMP= <proc.py>
##$REVERSE= no
##$SF= 90.2741710130998
##$SI= 8192
##$SIGF1= 0
##$SIGF2= 0
##$SINO= 400
##$SIOLD= 32768
##$SPECTYP= <>
##$SREGLST= <1H.CDCl3>
##$SSB= 0
##$STSI= 0
##$STSR= 0
##$SW_p= 1497.18866228788
##$SYMM= 0
##$S_DEV= 0
##$TDeff= 0
##$TDoff= 0
##$TI= <>
##$TILT= no
##$TM1= 0
##$TM2= 0
##$TOPLEV= 0
##$USERP1= <user>
##$USERP2= <user>
##$USERP3= <user>
##$USERP4= <user>
##$USERP5= <user>
##$WDW= 1
##$XDIM= 8192
##$YMAX_p= 1144969728
##$YMIN_p= -1516544
##$CURPLOT= <PDFCreator>
##$CURPRIN= <$PDFCreator>
##$DFORMAT= <normdp>
##$LAYOUT= <+/1D_H.xwp>
##$LFORMAT= <normlp>
##$PFORMAT= <normpl>
##$SURQMSG= 1
$$ End of Bruker specific parameters
$$ ---------------------------------
##XUNITS= HZ
##YUNITS= ARBITRARY UNITS
##XFACTOR= 0.182762287876938
##YFACTOR= 1
##DELTAX= -0.182762287876938
##NPOINTS= 8192
##FIRSTX= 1497.0059
##FIRSTY= -467968
##LASTX= 0
##MAXY= 1144969728
##MINY= -1516544
##XYDATA= (X++(Y..Y))
8191 -467968 -140800 562688 -338432 -57856 116224 1562624 394752 278528 9728 930304
8181 930304 -1071616 -611328 -705024 -275456 -179200 396800 446464 -713728 155136 243200
8171 243200 -133632 -26624 148480 593408 -444928 -404992 -495104 -295424 248320 292352
8161 292352 745984 -1046528 -110592 154624 72704 -241152 -1080320 1029632 -27136 -176640
8151 -176640 144384 887808 -833024 -330240 -338944 143872 -119808 470016 422912 434688
8141 434688 329728 267264 -369152 30720 -432128 459776 318976 921600 584192 659456
8131 659456 -68096 -43008 -17408 -370688 7680 860160 -310784 44032 -247296 -621056 716800
8119 -863744 -429056 83968 -1516544 63488 250880 1903104 610816 179712 -157184 -239616
8109 -239616 150528 903168 366592 29696 243200 151552 846336 268288 110592 1019392
8099 1019392 729088 805376 588800 259072 555520 321536 -770048 258048 578560 -200192
8088 367104 246784 80896 279040 1107968 -2048 -1143296 830976 381952 -112128 808960
8077 1033216 -123904 304640 -380416 535552 308736 649728 -229888 361984 116224 -312832
8066 1207296 114688 -323584 97792 915456 280576 109568 -482304 93696 -574976 425984
8055 26624 387584 434176 75264 155136 190976 713728 541696 250368 673280 658944 -189952
8043 580096 455168 147968 -557568 -307712 571392 125952 196096 548352 -170496 1310208
8032 -376832 -142848 242688 -34304 174080 578048 237056 -211968 10752 347648 -72704
8021 500736 974336 22016 274432 364032 697344 -257536 814592 160256 509952 -95232
8010 -177152 -152576 549888 -584192 23040 604672 486400 66560 75264 537600 -285696 768000
7998 476672 -398336 -283136 -69632 1320960 46080 549376 448000 738304 -691712 -6656
7987 463360 -410112 523264 -132608 478208 -98816 -102912 -413696 205312 349184 893440
7977 893440 -353280 -575488 550400 424448 923648 489984 588288 90112 578048 95744
7966 -557568 -128000 400384 812544 -692224 -121856 -617984 95744 271360 147456 638464
7956 638464 351232 -327168 412160 258560 128512 312320 519168 -521728 1053696 419840
7945 -716288 951808 -287744 646144 247808 65536 89600 93696 1268736 -553472 520704
7934 389632 -51712 903680 -100352 302592 -525824 -377344 -61952 -261120 789504 -42496
7923 -211456 527360 -520704 599040 1025536 -970752 27136 -728576 -217600 -371712 -288768
7913 -288768 -246272 -407552 -664576 19456 -667648 716800 903168 -981504 353280 611328
7903 611328 85504 477184 -321024 25088 -262144 348672 1736704 434176 564736 181248
7892 133120 1186816 848384 190976 251904 305664 -724480 403456 -32768 -516608 -163328
7881 -11264 941056 66048 320512 1054208 297984 127488 223232 -27648 242688 267776 751104
7870 751104 -770560 825856 517120 273408 614400 -315904 -72192 1224704 1250816 330752
7859 971776 428032 -600576 453120 -610816 350720 -605696 352256 140800 342016 886272
7849 886272 -107008 635904 -895488 -3072 -326656 163328 193024 303616 381440 1140736
7839 1140736 1337856 628736 -344576 226304 -4608 713216 1107968 -332800 -517120 -263168
7829 -263168 688128 515072 348160 -189952 -106496 -272896 535040 698368 -367104 235520
7818 168960 1009664 -26624 1214464 -171520 247808 -345600 110080 221696 -76800 -692736
7808 -692736 -36352 851456 512512 380928 53248 344064 722432 953856 784384 497664
7798 497664 164352 884224 1324544 1385472 440832 753664 470528 -255488 -57344 -7680
7787 476672 232448 -150528 603648 390144 165376 142336 -72704 -322560 -492544 -132608
7776 -351232 -474624 846848 888832 217600 -582656 -226304 -336384 458752 -90112 39936
7765 736256 548352 -209920 680960 539136 534528 734720 453120 223744 -444416 -411136
7755 -411136 385536 45056 376832 610304 896000 259072 -300544 -373248 -356864 619520
7744 -872448 184832 -1220096 -372224 1036800 550912 -204800 -214016 6144 -36352 619008
7733 1090048 883200 593408 92672 -461312 347648 214528 693760 354816 -181760 524288
7722 230400 -356352 943616 1039872 -282624 82432 -31744 468480 -223232 -340480 225280
7711 -231936 -1067008 -321024 377344 585216 592384 3072 -448000 503296 1006592 73728 282624
7700 282624 -338432 811008 -107520 66560 556032 332288 -39936 761344 -92672 12288
7689 885248 333312 516608 -532480 6144 -118784 -231424 977920 512 472064 79360 736256
7678 736256 194560 906240 1111552 739840 472064 -687104 635904 365056 77824 727552
7668 727552 -753152 862208 18944 989184 -351744 261120 -143872 -465408 1074688 -420352
7657 920576 -553472 324608 -632320 847872 -360960 -753152 291328 277504 -60416 -737280
7647 -737280 -378368 497152 1230336 739840 33792 -686080 593408 844800 -718848 220160
7636 -217088 595968 -200192 323584 596992 -187392 -692224 56832 519168 -117248 -117760
7626 -117760 -745472 -58880 748032 771584 727040 631808 186880 56320 1004032 699392 1668096
7615 1668096 322048 301056 402944 361472 881152 -546304 92160 577024 492032 886784
7605 886784 -44032 52224 -492032 376320 72704 323072 204288 307712 238592 174080 151040
7594 151040 163328 -177664 1125888 -768512 647680 199680 444416 -289280 204800 262656
7584 262656 801280 -250368 473088 -56320 -370688 399360 -293376 211968 827392 125440
7573 566784 -117248 142848 212480 962048 -534528 -222208 407552 -614400 -200704 214016
7562 -83456 934400 257536 -371712 -127488 287232 -352256 692224 291840 -56320 -72704
7552 -72704 522240 -2048 1448960 550400 -29184 724992 36352 380416 -86528 606720 640000
7541 640000 -624640 -564224 -56320 427008 564736 -294912 592384 -135168 -194048 19456
7530 142336 261120 500736 738304 -433664 -12800 818176 -464384 247296 -1088000 644608
7519 934400 -567808 1220608 492032 -214528 -744960 589312 244736 -136704 1009152
7509 1151488 -1091584 -427008 301568 -822784 696320 1475584 319488 1012224 232448
7499 -286720 -492032 318976 587776 29696 -117248 616448 501760 770048 446976 564736
7489 564736 430592 -592384 1041920 -943616 783360 750592 717312 -174592 -20992 1217536
7478 1173504 -210944 224256 970240 382464 224768 530944 -173056 -497664 123904 -472576
7467 -51200 393728 -1208832 865280 897024 -387072 631808 -47104 -759296 281088 1042432
7457 1042432 721408 -364032 393216 388096 931840 1323008 499200 289280 -8192 1024 373248
7446 373248 -97280 -166400 67072 658432 1032704 25600 -462848 158720 576512 -215040
7435 1105408 -493568 264192 145408 0 325632 851968 131584 440832 271872 705536
7425 705536 -205312 238080 -288256 594944 642560 374784 612352 9728 373248 108032
7414 27648 1324032 -226816 183296 183296 558592 508416 -93184 -54272 -66560 366080 -650752
7402 564736 228864 -402944 1018368 354816 -62976 539136 536576 218624 368640 500736
7392 500736 690688 686080 457728 -642560 222208 -1006080 603648 337920 444928 -147968
7381 -514048 47616 992768 479232 -226816 -41472 -485888 925696 -75264 -704512 901632
7370 1040384 -852480 -76800 136704 -117760 192512 633344 47104 -353280 -228352 98304
7359 254976 272384 -109056 508928 1061376 186368 1488384 -213504 -323584 1124864 220160
7348 171520 841216 -659968 -168448 -365056 323072 -496128 1458176 915968 -215552 80896
7337 676352 -18432 663552 231424 1185792 625664 333312 617472 121344 536576 242688
7326 406016 -454144 1159680 -195072 201216 1559040 1080832 915968 -1114112 75776
7316 304640 337408 -138240 -133632 232448 -440320 755712 1263616 -741888 200192 -597504
7305 400896 229888 250880 540672 762880 828416 97280 -388096 -265216 -841728 794624
7294 482304 -152576 -589824 435712 1519616 -237056 634368 112640 -7680 587776 141312
7283 745984 -884224 474112 221696 76288 444928 584704 -115200 202240 144384 967168
7273 967168 559104 -157696 -1004544 769536 381952 548352 441856 -547840 241664 124416
7263 124416 477184 212480 1013760 404992 -553984 731648 -61952 261120 350208 512 -56320
7251 438272 302592 702464 590848 -196608 -167936 45568 1336320 934912 -4096 -257024
7241 -257024 92672 503296 575488 7680 825344 33280 481792 -371712 -95232 -125440 529408
7229 226816 588288 -273408 -67584 -95232 702976 163840 175616 -170496 -325120 892928
7218 424960 -305152 137728 260608 -239616 729088 572928 788480 1143296 -686080 -321536
7207 493568 484352 1066496 -31232 -9216 119808 1684480 871424 -232448 873472 523264
7197 523264 -468480 -452096 641024 343552 838656 144384 613888 -43520 347648 377856
7187 377856 510976 -703488 1100800 -450048 -360960 -323584 590336 270848 974848 -616448
7176 529408 516096 791552 -457216 655872 535040 68608 345088 403968 -249344 455680
7165 1080320 637440 847872 675840 334336 580096 962560 1218048 -440320 188928 385024
7155 385024 287744 -537600 179200 -427008 240128 726016 326144 -224768 1447424 -347136
7144 -129536 1115648 1161216 324608 642048 561664 -457728 406528 -57344 145408 1060352
7134 1060352 788480 524288 291328 473600 936960 797184 498176 835072 227840 -502784
7123 1254400 1298432 -182784 732672 -328704 299008 1005568 777216 858112 572416 822272
7113 822272 226816 -136704 -119296 156160 379392 474112 -8704 -474624 -499712 -596480 -686080
7102 -686080 -171520 706048 584192 -263680 -468992 -95744 -28160 388608 779776 656896
7092 656896 1282560 125952 62464 879616 1104384 239616 364032 -212480 91136 1327616
7082 1327616 -1024000 -431104 788480 157184 761856 1018368 195072 -340992 892928
7072 790016 662528 523776 894976 -450048 1328128 633856 719360 -340992 -8192 116736
7061 484864 493056 759808 566784 4096 -209920 64512 198144 -421888 -288256 37888 735232
7050 735232 -196608 -531456 248832 1636864 -27136 61440 1439744 804352 -692736 947712
7039 551936 823808 439808 1051136 123392 943104 663040 -335872 419840 1369088 764416
7029 764416 129536 407040 -38912 942080 219648 1305600 843776 895488 432128 -749568
7018 -70144 712704 -371200 194048 -668160 318464 6656 -711168 1127424 54272 724480
7008 724480 -921600 1030656 364032 -28160 -392192 646144 1064448 905216 -140800 -124928
6998 -124928 535040 470528 402432 850432 151552 417792 318464 -55808 728064 -471552
6987 710656 740352 14336 529920 229376 324096 278528 43008 534528 9216 1047040 346112
6975 266240 604672 -226816 1033216 488960 -388096 -632832 429568 548864 -348160 625152
6964 -290816 488448 -67072 -557568 369152 -463872 284160 -123904 -608768 88576 -321536
6953 58880 -613376 -451584 446464 936960 -65536 928768 -396288 1080832 425984 -518144
6942 546304 -966656 -54272 400896 -841728 1051648 -1134080 429568 255488 194560 495616
6932 495616 960000 655360 289280 -278016 625152 333824 455680 -37888 835584 712192
6922 712192 549376 -251392 -36352 746496 1383424 736256 660992 217600 610304 110080
6911 -156160 399360 -657920 -426496 930816 360448 -113152 862208 290816 1393152 -768000
6900 -303104 596480 657920 194560 545792 -124928 183296 -689664 824320 1236480 1652736
6890 1652736 183296 -154624 670720 502784 -149504 -7168 -316928 232448 122880 -134144
6879 -116224 1844224 881152 -310784 857088 -146944 384512 41984 969728 320000 136704
6868 791040 264704 710656 -173568 -534016 992256 977920 1107968 32768 1009664 453120
6857 1065472 -373248 572416 -508416 1207296 -539136 -61952 648192 350720 470016 86016
6846 125440 80384 -152576 760832 180736 -492544 -541184 -491520 727552 -32768 930816
6835 987648 -133120 872960 24064 424960 585728 879104 1154048 -125952 932864 -45056
6824 514560 -161280 314368 437760 -86016 589312 856576 206336 774656 602624 216576
6813 588800 -279040 -295424 111616 -619008 34816 286208 1020416 135680 216064 162304
6803 162304 666624 1043456 646656 720384 72192 265216 -322560 -381440 -69120 -267264
6793 -267264 587264 -161792 700416 -128512 658944 777728 442880 707072 325632 -122880
6782 363520 -73216 347648 -499712 933888 -167424 182784 947712 -245248 -462336 -560128
6772 -560128 -6144 126976 109056 584704 -564224 -297472 -579072 -642560 201728 -793600
6761 293376 84480 -36864 453632 1067008 -203264 -292352 -49664 -688128 431104 -238592
6750 -221184 9216 320000 -184832 -35840 139776 695808 -4608 494592 295424 508928 422400
6739 422400 566784 -642560 -8192 819712 -59392 685056 -202240 -176640 -169984 173568 820736
6728 820736 -371712 734720 704512 30720 1119232 841728 1907712 -161792 778752 427008
6718 427008 -569856 1117696 168448 394752 271360 782848 206336 898048 232960 579072
6708 579072 548352 574976 664064 378880 187904 868352 -291328 -782336 1366016 414720
6697 412160 498176 62464 272896 -776192 559104 -435712 227840 293376 638464 165376
6686 236544 864256 -112128 679424 523264 1133056 52736 620032 6656 669184 453632
6676 453632 90112 72704 -253952 -154112 1195008 372736 182784 -72704 -1160704 406528
6665 223232 32768 565248 672256 -633344 1043456 -425472 237568 462848 198656 265728
6655 265728 -79872 1506304 -232448 504832 -150528 443904 -380928 855040 -249344 513024
6644 19456 310784 561664 101888 320512 419328 -271872 572928 224256 246272 37888
6633 1538048 115200 -569856 715776 14336 512000 414208 848896 104448 820736 790016
6623 790016 346624 1188352 -84480 -586752 655360 765952 570880 214016 428032 -25600
6612 244224 -466944 -119808 721920 545280 192512 -94208 1368576 1483264 530944 1561088
6602 1561088 -149504 -105984 -149504 650240 -122368 -113152 -187904 1680384 217600 1999872
6592 1999872 1009152 1135616 -23552 190464 525824 708096 -27648 657408 406016 -224768
6581 -61952 1182720 1020416 239616 321024 1414656 611840 763392 145920 -158720 172032
6570 605696 645632 412160 434688 567808 -270336 -503808 468480 474624 50688 -576512 701440
6558 396288 612352 443392 681472 68608 396288 844800 -712704 622592 -857088 -51712
6547 324608 504832 181760 61440 262656 833536 197632 -473088 1024 839168 740352
6537 740352 33792 -322560 -126464 829952 -57344 439296 528896 -506880 697856 -39936
6526 801280 1344000 -203264 -321536 -60928 97280 -557056 328192 1044480 1211392 212480
6515 212992 -59392 -314368 287232 1282560 715776 -95232 886272 422912 464384 -292352
6504 934912 174080 -229888 36352 895488 61952 377344 -136704 -498176 456192 -375808
6493 913920 519680 949760 775680 104960 251392 -91136 285184 466944 927232 636416
6483 636416 95232 -78848 -237568 -148480 866304 85504 205312 119296 837632 624128 79360
6471 469504 128000 98304 -413696 1341952 571904 472576 914432 897536 846336 700416
6461 700416 903168 463872 799232 423424 865280 -80896 312832 739840 -330752 329728
6450 26112 904704 -128000 56320 233472 1028096 773120 563200 528384 421376 -229888
6439 862720 492544 -145920 1246720 764416 723456 803840 643584 20992 224256 128512
6429 128512 234496 -49664 317440 692224 1141248 1129472 1014272 146432 210432 -153088
6418 318976 1646080 -101376 1223680 348160 -168960 802304 516608 1046528 150528
6408 456192 208896 792064 183808 645120 1146880 1190912 905728 119808 531456 358912
6398 358912 113664 411136 542208 616960 -159744 167424 695296 403968 -77312 507904
6387 -241152 -713216 -130560 1219584 -239104 1864704 623616 1051648 -342016 1283072
6377 613888 722944 955904 -68096 1027072 -171008 -451072 461824 900608 875008 356352
6366 202752 324096 -240640 521728 470528 -454656 1156096 -552960 -602112 947712 813056
6356 813056 -32768 365056 488960 523776 472064 718848 -467456 -17408 1361920 397312
6345 78848 957440 772096 1031680 311296 509952 -657408 -86016 -156672 1033728 -150016
6334 766464 -375808 -567296 -19968 1355776 116224 335360 230912 587264 839680 -32768
6323 680448 595968 925184 1352192 -55808 748032 155136 779264 275456 312832 -607744
6312 670208 137728 -83456 498688 -32768 83968 1123840 -54784 132608 -527872 879616
6301 462336 218624 418816 958976 -177152 43008 -462848 -778240 -650752 142336 508928
6291 508928 112640 738816 344576 602112 514560 306688 676864 1000960 88576 528896
6281 528896 899072 -731648 570368 813056 560640 130560 1325568 1009152 138240 21504
6270 -60928 708096 1047040 795136 426496 834048 -32768 505856 560128 409600 651264
6260 651264 488960 491008 653824 349696 857600 1285120 -297984 -371712 240128 -757760
6249 1405440 601600 -64000 -416768 -99840 590848 1593344 -156160 1398784 -77824 506880
6238 1302528 136192 1248768 446976 824320 1267200 968704 -184320 892416 335872
6228 58368 653824 978944 66560 166912 1383936 1020928 280576 -112128 876544 764928
6218 764928 1967104 313856 -246272 1412608 298496 293888 812544 118272 -104448 -97280
6208 -97280 -145920 764928 176640 1222144 89600 520704 529920 -164352 251392 737792
6198 737792 894976 -232448 1200128 29696 43008 54272 -214016 445440 911872 1222144
6188 1222144 1328128 640000 784896 70144 -164864 56320 1314304 -243200 266752 -159232
6177 290816 1008640 -265216 702976 1173504 461312 -91136 62464 1037312 163840 185856
6167 185856 542720 -260096 384000 735744 311296 -275968 546304 552960 -400384 292352
6156 520192 834560 230400 -39936 259072 -424448 -323072 264192 327168 1120256 483840
6145 656384 622080 104448 624128 -257536 -50688 555008 1235968 482304 749056 1364992
6135 1364992 571904 1333760 384512 322560 212992 554496 -548864 984064 283648 -158720
6124 -59392 -38400 957440 443904 208896 16896 543744 735744 289280 -239104 277504
6113 559616 612352 -246272 1133568 1583104 1082368 1252864 773120 312832 701952 804352
6103 804352 -330240 677888 1020928 -525312 117248 192000 684032 -52224 480256 889344
6093 889344 567296 633344 328704 1189376 1197056 289792 -542720 599552 551936 1097216
6083 1097216 70144 510976 627200 694272 363520 1716736 136192 705024 752128 401920
6073 401920 584704 481792 134144 759296 208384 -806912 530432 982528 815104 327680
6062 -107520 -166400 564224 366080 267264 -42496 262144 821760 105984 482304 1340416
6052 1340416 635392 1768448 -99840 235008 17408 579072 208896 488448 14336 1077760
6042 1077760 104960 435712 -73216 -54272 870912 422912 -408064 1135104 504832 260096
6032 260096 170496 610304 280064 -138752 -336384 616960 -204288 1097216 284160 499200
6022 499200 849920 344064 269312 740864 439296 -233472 1072640 960512 407040 -490496
6011 581120 1934848 161280 966656 -307712 738816 -346624 841216 -536576 1035264
6001 -417792 452608 1506304 -7680 386048 1496064 784384 1371136 -152064 323072 918016
5991 918016 145920 399360 836608 1119744 758272 439808 557568 764416 806912 50688
5980 537600 1206784 -119808 395776 598528 -52224 194560 1117696 380928 202752 347136
5970 347136 482304 564224 0 1081344 195584 -384512 1454592 986112 1168896 366592
5959 381952 1367040 1420288 364032 -416256 266240 -75264 1131008 318464 355840 1964032
5949 1964032 716288 1048064 905216 1153536 449024 223744 854528 -131072 673792 477696
5939 477696 286208 469504 1185792 1117696 29696 286720 169472 1243136 1028608 179200
5928 449536 804352 513536 790016 -41472 887296 884736 -273920 1098240 -10752 1882624
5917 299520 694784 416256 752640 810496 1664512 942592 503808 735232 455680 1318912
5907 1318912 -343040 358912 363008 1473536 650240 -107008 -198656 947200 633344 803840
5897 803840 690688 645632 685568 431104 481280 922112 1402368 1330688 2091520 1228800
5887 1228800 -204288 429056 261632 1043456 687104 960512 1062912 634880 -313344 752128
5876 1550336 1270784 512512 351232 546304 1088000 1294336 252416 847872 372224 -822272
5865 1720320 1621504 1708544 820736 446976 548352 733696 657920 -236032 1434624 689664
5854 355840 -124416 1597952 372736 945664 22528 -583680 -128000 335360 477184 367616
5844 367616 844800 1413632 1486336 -41472 898560 502784 442880 797696 361472 1238528
5834 1238528 878592 465408 -430080 416256 992256 473088 -133632 1236480 531456
5824 1814528 971776 57344 -430080 -51712 -16896 1367040 820224 602112 249856 440832
5814 440832 835072 303616 -352768 1603584 1054720 1442816 421888 1803264 951808
5805 951808 756736 -38912 738304 1208832 347648 -361984 407040 684544 -483328 1042432
5794 98816 710144 673280 1076224 12800 653312 -187392 508416 1358336 795648 719872
5784 719872 1123840 88576 -51200 390656 544768 593920 -274432 1442304 752640 948736
5774 948736 1636352 1055232 885760 994816 798208 1159168 402432 164864 827904 -410624
5763 993792 1278464 570880 -82944 120320 220672 1275904 1145344 872448 871936 1429504
5753 1429504 327168 1378304 655872 228864 485888 768000 265216 1622016 -520704
5743 573440 601088 501760 599040 50176 1650176 696832 582656 605184 457728 850432
5733 850432 97792 498176 1507840 954368 144384 720384 -520192 847872 708608 822272
5723 822272 1215488 1028096 253440 579072 2007040 -312832 403968 875520 1665536 970240
5713 970240 408576 1693696 1113600 292864 377344 864768 195584 975360 1380352 710144
5703 710144 747520 1134592 835584 2079744 1627648 1965568 1371136 -317952 1696768 2265600
5693 2265600 1184256 974848 1550336 733184 1574400 1715712 1814016 937472 770048 1419264
5683 1419264 2074112 335360 1569280 1102336 858112 1515520 1387008 639488 1485312
5674 1485312 979456 34816 183296 960512 65024 994304 708608 1360384 1634816 547328
5663 735744 1063424 1664512 -271872 570368 302592 8704 940544 908288 1414656 676352
5652 389632 20480 95232 562688 83456 461312 902144 128512 1204224 -13824 1658368
5641 287744 677376 472064 1409024 1467392 1097728 300032 -169472 1576448 629248 29696
5630 70144 1390592 -67584 147968 597504 714240 392704 789504 483328 578560 774656
5620 774656 1245184 49152 1303552 1900032 807424 1282560 -52224 849408 805376 334336
5609 1134080 1165312 346624 719872 937472 1182720 67072 1841152 804864 1619968 465920
5598 1041408 -189440 184832 1443328 665088 952832 425984 492032 1177600 1411072 1521152
5588 1521152 1620992 458752 1777152 624640 927232 971776 -50176 -309760 915456 1062912
5578 1062912 1492992 670208 1883136 318976 1515008 1111552 923136 1217024 1120256
5569 1120256 1147904 1523712 1559552 337920 1484288 1886208 1104896 1652736 814592 1004544
5559 1004544 1350144 1114112 2176512 1210368 288256 598528 -76288 1162752 1011200
5550 1011200 882176 167936 1795072 1058304 1388544 1288704 1590784 1699328 1549312 2009600
5540 2009600 1764352 1175040 2571264 1959936 1621504 1390592 623616 1577984 2311168
5531 2311168 1591296 1357824 1844736 1516032 688128 1152000 1008640 868352 1427456 1315840
5521 1315840 663040 1556992 1870336 1594880 731136 339968 1981440 338944 522240
5512 522240 1612288 541184 1469952 197120 2148352 304128 1131520 1049600 1984512 446976
5501 325632 1082368 2408960 1189888 655360 1984512 1129984 1390080 621056 1071616
5492 1071616 944640 1037824 919552 495104 713216 788992 924672 515584 64512 596480
5482 596480 1392640 1161216 570368 910336 1201664 1231360 1201152 521216 517632 529408 144896
5470 851456 593920 1551872 1324032 721920 337408 743936 535040 758272 573952 766976
5460 766976 1047552 984576 648704 723968 1118720 -181248 1127936 258048 143872 192512
5450 192512 1176576 960512 659456 1833472 971264 978432 -484864 476672 855552 1181696
5440 1181696 890368 1102336 1274880 968704 1871872 1144832 755712 1890304 1102848
5431 1102848 153088 1013248 -120832 538112 1170944 457728 1762816 374784 1352704
5422 1352704 888832 1100800 862720 903680 297984 411648 1664000 1494528 484352 695808
5412 695808 -263168 1114624 1210880 670720 1081856 545792 1330176 2001920 1099776 487424
5401 1138688 514048 904704 2487808 601088 1371136 307712 999424 1061888 1250816 1659904
5391 1659904 800768 1263104 934912 1345536 135168 685568 521216 645632 -74752 1423360
5380 1271808 1305600 359424 1196544 1060352 0 1519104 893440 138240 898560 136704
5369 1134080 20992 1113600 1505792 1428992 112128 190464 832512 559616 1207808 903680
5359 903680 142336 465920 834048 1656832 869376 816128 869376 2070528 1518592 945152
5349 945152 1170432 1235968 1702912 1575936 844288 2371584 1056768 852480 566784 42496
5338 1673216 93696 690688 685568 1337856 763904 1141248 1252864 975360 556032 960000
5328 960000 1561088 1215488 367616 752128 734208 503808 1314304 270336 1216512 418816
5317 1120768 75776 304640 1029632 529408 902656 2279936 522240 440832 336384 407040
5307 407040 -272896 760320 -126464 970240 541696 360448 1567232 811520 486912 657920
5297 657920 631296 900608 230400 602624 1526272 627712 1082368 -552448 447488 920064
5287 920064 553984 1314304 694784 1404928 1751552 1322496 1318912 1888768 1470464 1468928
5277 1468928 1170432 1576960 1818624 3145216 2839040 1946112 1213440 1694720 2344960
5268 2344960 1730048 224768 960512 1902592 837632 403456 1694720 820736 945152
5259 945152 888832 709632 738816 550400 1889280 754688 1031168 503296 1380352 1135104
5249 1135104 924672 619520 -371200 769024 873984 564736 1305600 1438720 729600 925184
5239 925184 1106944 1346560 576000 1534464 768000 1681408 160768 1265152 972288 860160
5229 860160 1207296 720384 1314816 825856 738816 1011712 694784 1661952 905728 1618432
5219 1618432 840192 1177088 1415168 250368 1723392 603136 1173504 1358848 1065472
5210 1065472 835072 1121280 229376 -367616 1486336 858624 1819136 791552 596992
5201 596992 843264 779264 1277440 2010112 656384 1328128 1002496 1019392 1142272 870400
5191 870400 1494016 1510912 -396800 311808 749056 654336 748544 359424 431104 1421312
5181 1421312 759296 292864 1141248 1553920 847360 152576 292864 1995264 623616
5171 1694720 1288704 656384 1536512 1231360 850944 739328 716800 1105408 1429504 1497088
5161 1497088 709632 1672704 1424384 -73216 1050624 1382400 1238016 814080 1457152 698368
5150 1612288 1509888 1160192 1499136 1381888 1243136 1302528 1304576 2013184 687616 2035200
5140 2035200 798720 2255872 798720 1937920 1244160 1734144 963072 1458176 1166848
5131 1166848 2032640 173568 271360 1961984 1693696 1947648 1522688 2004992 2296320 1682432
5121 1682432 1346048 788992 1366528 2575872 1432576 1377280 940544 889856 2533888
5112 2533888 364032 1142272 286720 1816576 82432 1807872 1575424 1625600 722944 688128
5102 688128 2544640 1188352 653824 2162688 1382400 1137152 1733120 1914880 898560
5092 2073600 2218496 769536 1248768 1166848 489984 2583040 980992 1878016 1466368 1584640
5082 1584640 1211904 2577408 478720 1233408 -261632 1897472 697344 1351680 1238016
5073 1238016 765952 188416 2421248 831488 742912 603136 1149440 1958912 948224 2101760
5063 2101760 670720 1864192 2139136 1137152 1448960 1410048 841216 685568 604672 576512
5053 576512 1803776 2351104 252928 1662464 1018368 2215936 1776640 617472 1102848
5044 1102848 1833984 1160192 1707520 1600512 2219520 1866752 2380288 2225152 1342976 2068992
5034 2068992 2480128 2958848 2371584 2225152 2795008 3074048 3965952 3619840 4423680 4499968
5024 4499968 5395968 3944960 4992000 4690944 4468224 3183104 3129344 2413056 1200128
5014 1811968 1479168 1454592 1191424 1462272 600064 2166272 1581568 1670144 628224 122368
5003 1655808 793600 1773056 1980928 1458688 1583616 1287168 1390080 1010688 1479680 1411072
4993 1411072 1438208 1528320 809472 997376 970240 1230848 1629184 1009664 1204224 672768
4983 672768 738304 1966592 1604608 820736 857600 988672 293888 1457152 823808 2050048
4973 2050048 1386496 1133056 2158080 485888 2041856 2162688 1497600 1479680 881664
4964 881664 1543680 1392640 1316352 969216 1065472 788992 2585600 1260544 900096 -223744
4953 1537024 1216512 893440 1778176 712192 1055744 1399808 903680 194560 1330688
4944 1330688 1568768 1358336 1001472 1298944 1171456 489984 1954816 1299968 1326592 817664
4934 817664 1614336 1477632 2117120 1595392 1737216 1193472 876544 1486848 1855488 1678848
4924 1678848 998912 1440768 1426432 1134080 2099712 2026496 1467904 1150464 285184 1475072
4914 1475072 1245696 1769472 1368064 1251840 1607168 2132480 1459200 426496 1609728
4905 1609728 761344 711168 939008 1773056 1693184 1028608 1208832 426496 2073600 1481216
4895 1481216 1819648 1447424 1313280 1426944 2291200 1422848 1792000 1131008 955904 1027072
4885 1027072 1184256 1873920 1597952 1594880 612352 1471488 2376704 1256960 1669120 1802240
4875 1802240 1698816 1520128 1395712 942080 1344000 1417216 1557504 2640384 1917440 1384960
4865 1384960 1877504 760320 618496 1422848 1121280 1768960 1200640 1049088 2086400
4856 2086400 1550848 1482240 941056 2106880 1739264 1566720 1224704 2076672 1642496 1697792
4846 1697792 1895424 1842176 1338880 1698304 2330624 1970688 1676288 2699264 1034752
4836 1457664 2217472 2177024 1833472 1441792 1473024 1347584 1815040 1827328 1466368 882176
4826 882176 1440256 702464 1674240 2087424 2366464 1893888 1467392 1697792 1737216 1333248
4816 1333248 1318400 1441792 2003456 2614272 1055232 1446912 2130944 1266176 1416704 2160640
4806 2160640 1738752 1940480 863232 2029568 2105856 1333760 1280512 1584640 1773056 1486848
4796 1486848 1520640 1238016 1625088 1444864 2305024 919552 2157568 1985536 1912320 1280000
4786 1280000 1530880 2516992 2619392 2791936 2936320 2009600 1505792 2009088 2140160 2501632
4776 2501632 2139648 1882112 2872320 2519552 2110976 1052160 2665472 3254272 2345472
4767 2345472 2891264 2519552 3718656 3356672 1723904 2521600 1730048 2571264 2819584
4758 2819584 3164160 2450432 3769856 3003392 2781696 3051008 2549248 1774592 1512448
4749 1512448 1722368 1380864 2049024 1441280 1890816 1242624 1832960 1253888 2077184 2011648
4739 2011648 1889280 1860608 2762240 2804736 3141120 2565632 2170880 2332160 2321408 3058688
4729 3058688 2361856 3623424 3011072 3459072 1760256 3388928 2128384 2530816 2525696
4720 2525696 2615808 2572288 1925120 1472512 1690624 2797568 3139072 1957888 1195520 3111424
4710 3111424 2279424 2070528 1180672 1745408 1624064 2039296 1589248 2130944 2491392 1978880
4700 1978880 1022464 1900544 2003456 1399808 1445888 1918464 2217984 1621504 1538048 2417152
4690 2417152 1432064 1332224 795136 2182656 1137664 1765376 1699328 1472512 1151488 2224640
4680 2224640 1049600 1786880 1276416 1902592 1256448 2354176 1930752 1852416 1891328 2080768
4670 2080768 2514432 2402816 2087936 2283520 2365952 1975296 2353664 1684480 1536000 1675264
4660 1675264 1449984 1525760 1684480 2677760 2259968 1837568 2201088 2741760 1458688 1866752
4650 1866752 2278912 2685952 1867776 2267136 1814528 2229760 558080 2227200 1922048
4641 1922048 1438720 2774016 2267136 1238528 1806336 2138112 2142720 2108928 2521600 3049984
4631 3049984 3534336 3952640 3620352 1097728 2905600 2976256 2067456 3417088 2454528
4622 2454528 3159040 2649600 2543104 3238400 2254848 2433536 1905664 2132480 2685952 2558976
4612 2558976 2167296 2075136 2272256 1664512 2415104 1500160 1976320 1726976 2473984 2872320
4602 2872320 2643456 2921984 1771008 2284544 1679360 2235904 2217984 2286080 2195456 1061376
4591 1030656 1677824 1995776 2099200 2121216 2234368 1963520 2256896 1773056 1647104 2338816
4581 2338816 1499648 2392576 2438144 2958848 2607104 3207680 1515520 2417152 2188288 2140160
4571 2140160 2877440 2962432 1894400 2208256 1967616 2856960 2344448 2274816 1804800 2948096
4561 2948096 2785792 2750976 3026944 2295296 147968 2302976 788480 2518528 1731584
4552 1731584 2054656 3984896 2441728 2085376 1244672 1480192 1603584 2110464 2843648
4543 2843648 1107968 1155072 1213440 1895936 2523648 2087936 2244608 1886720 1966080 1466368
4533 1466368 2299904 890880 2424320 1936384 1443328 1316864 2229760 2460672 1646080
4524 1646080 2411520 1688576 1354752 2028544 1912832 2938880 3015168 2231808 2680832 2347008
4514 2347008 3826176 2877952 1985024 2910720 3261952 3347456 3323392 3437568 2999296 2575360
4504 2575360 2418176 2881536 3062784 2816512 1970688 2831872 2163200 1714688 3305984
4495 3305984 2078720 1803264 2452992 2775040 2967040 1969152 3150336 1647104 2737152
4486 2737152 2063872 2795008 2715648 3180032 2503680 3341824 2449920 3102208 2059264 2522624
4476 2522624 2935296 1768960 2892800 2334720 2505216 3491328 3352576 2421248 3399168
4467 3399168 2580992 2440192 3329536 3521024 4277248 4308480 3575296 2774016 3771904 3055616
4457 3055616 3321344 3472896 2895872 3253760 2304512 3569664 3526656 3524096 2654720 2626560
4447 2626560 3855872 3317248 3695616 3337216 3811328 3728384 4005376 3970048 3423744 3470848
4437 3470848 3662336 3573760 3684864 3858944 3119104 3833856 3712000 3561984 3020800 3660288
4427 3660288 2963968 4613632 3535360 3644416 3574784 3171840 4429824 4054016 1641472
4417 2675712 3331584 2433024 2239488 2954752 2121728 2350080 3654656 3119616 2899456
4408 2899456 2311680 3464704 2908160 2758656 1712128 2646528 1205248 2080768 1943552
4399 1943552 2770432 3135488 2264064 2758656 2313728 2480128 2471936 2087936 751104 2525696
4389 2525696 2344960 1890816 1742336 1831936 2747904 1716224 2837504 2378240 2287616 2941440
4379 2941440 2315264 2505216 1516544 1914880 2130432 2555904 1977344 1806336 2020352 1829376
4369 1829376 2598400 2060800 1805824 1330176 2036736 2138112 2122240 1030144 1681920 1754624
4359 1754624 2894848 2544640 3065856 2155008 2177536 2676736 1944064 2543616 1728000 3047936
4349 3047936 1722368 2065920 2246144 1775616 2128384 2168320 2050048 2427392 1612288 2663936
4339 2663936 1895936 2054656 2158592 2414080 2014208 3278848 2295808 2335744 2722816 2280448
4329 2280448 1497600 2934784 2408960 3252736 2403840 2821632 2638336 3049984 2328576
4320 2328576 2494464 2700288 3694592 2399232 3418624 2890240 2199552 2739200 2505216
4311 2505216 2064896 2139648 1907200 1911808 2723840 2482176 2125312 1923584 2843136 2738688
4301 2738688 3446272 3734016 2981376 2801664 2380288 3143680 2574336 3101696 1943552
4292 1943552 2916352 2667008 3175936 2191872 3640832 4154368 4142080 3420160 2789376 4552704
4282 4552704 3932160 4117504 2937344 4221440 3579392 3118592 3526144 3433472 2204672
4273 2204672 2822656 3829760 2734592 3506176 3103232 4071936 3510784 2761728 2521088
4264 2521088 1700352 2823168 2841600 1366528 2945536 2786304 2782720 2403840 3067904 2737664
4254 2737664 2972672 2710528 2964992 2289664 3486720 2326528 3589120 3479552 2811392
4245 2811392 1952768 2083840 1752576 2330624 3453952 2057216 3108352 2462208 2639360
4236 2639360 2180608 2132992 3308544 2960384 2926080 3051520 2081792 2443776 3118080 2088960
4226 2088960 1763328 2802176 2987008 3283456 3284992 3908608 3385344 3314688 3525120 3971072
4216 3971072 3595264 3233280 3774464 2642944 3259904 3531264 3060224 2999296 4272128
4207 4272128 3871744 4504576 3545600 2833920 3597312 3988480 3728896 4123648 4268032 4896256
4197 4896256 3982848 3848192 4420608 4720640 4158464 4302336 4895744 4654592 3518976
4188 3518976 4492288 3865088 4716032 3119104 4092928 5054464 4782592 3058176 5008896
4179 5008896 4675072 4358656 4422656 5063680 5263360 5583872 4485632 5117440 4436992 5917184
4169 5917184 5237248 5800448 5329408 6009344 5416960 5371392 7434240 5035520 5882368
4160 5882368 7027200 6557184 6703104 7215616 6736384 6673408 6215168 6394880 6625792 6996480
4150 6996480 7245824 8582656 8300032 8281600 9115648 9509888 8945664 10378240 11210752
4141 11210752 9928704 9598976 9778176 10890752 11666432 10895872 11513856 11403776 11049472
4132 11049472 13134336 13367808 12982272 13220864 13880832 14345728 15984128 16745984 16714752
4123 16714752 16481792 15271424 12165632 11365888 9416704 9448448 8060928 7189504 5321216
4114 5321216 4983808 4722688 3962880 4538880 3684864 4750336 4337152 4961280 4760064
4105 4760064 4861952 4597248 5792256 4433408 3936768 5452800 4547072 4816896 4516864
4096 4516864 8037376 3672576 3585024 3882496 4379136 4622336 4160512 2980352 3344384
4087 3344384 3768320 3230208 3014656 3945984 4508672 3148288 3470848 4184576 2695680
4078 2695680 4171776 3721728 2944000 3147776 3067904 3116544 2388992 3824640 2635264
4069 2635264 3149824 3670016 2867712 3280896 3073536 4342784 3948032 4021248 3042816 2866176
4059 2866176 2741248 4519936 3135488 3020288 3576832 4211712 3042816 3554816 3272192
4050 3272192 4227584 3980288 3328000 4233728 3769856 3278336 2560512 3226624 3765760 3928576
4040 3928576 3610112 3325440 3509760 3091456 3226624 3100160 2244608 2486272 2925056 3887616
4030 3887616 3573248 3443200 2805248 3396608 3445248 2834944 3557888 3062272 3035136 3209728
4020 3209728 2731008 2746368 2605056 1484288 3294720 3339776 3137536 1693184 2916864
4011 2916864 3363840 4189696 3248640 3305472 3699712 3371520 3243008 2824704 3636224 2310144
4001 2310144 2492928 3193856 3114496 2289664 2860032 2319360 3308032 3014144 3264512 2168320
3991 2168320 3043328 2905088 3172864 3801600 2872320 3714560 3388416 3085824 3045376 3405824
3981 3405824 2622976 3422720 3361792 3589120 3003392 2599936 3369472 2776576 3231232 3057152
3971 3057152 3620864 2283008 2649088 3115008 2571264 3025920 2732544 3309056 4170752
3962 4170752 2439680 3213824 2607616 2322944 4184576 3335680 3675648 2609152 2116096
3953 2116096 3244544 2150400 2800128 3554304 3238400 1967616 3624960 3364864 4111872
3944 4111872 3381248 3119104 3225600 2788864 3350016 3251200 2545664 2970624 3122688 2696704
3934 2696704 3106304 2764288 2933248 3205632 2995712 3330048 3830272 2635264 2895360
3925 2895360 2502144 3180544 3728896 2697728 3209216 3140608 3166208 3527680 3028480 4136960
3915 4136960 3623936 3634688 3640320 3945984 3575808 3806208 4112896 3480064 4165120 3493376
3905 3493376 2625536 2960384 3375616 3255808 3376128 3182080 3623936 3894784 3041280 3833344
3895 3833344 2953728 3644928 3208192 3977216 4341760 4391936 4361728 4147712 4211712 3944960
3885 3944960 4137472 4185088 3494912 5792256 4038144 5799936 4796416 5323264 5557248
3876 5557248 6412800 5948416 6231552 6131200 4878336 5800448 6099456 6129664 6269952 5994496
3866 5994496 6363136 7046144 6784512 6726656 7120384 7157248 7264256 7839232 7274496 7471616
3856 7471616 6703104 8705024 7967744 7982592 7828480 7723008 9231360 9815552 9210368
3847 9210368 10447872 12083712 13048832 13737472 14383616 15207424 15204352 17189888 17491968
3838 17491968 17783808 18688000 20352512 19461632 20016128 22000640 21822976 22158336 23865344
3829 23865344 24795136 25079296 26379264 27767296 28522496 27493376 25156608 21657088 20333568
3820 20333568 14888448 14151680 14325248 12815872 11644928 11627520 11195904 10582016 9329664
3811 9329664 8493568 8163840 9317888 8202240 9093632 8175104 8270848 8891392 9099264
3802 9099264 7912448 8157184 7836672 8186368 7269888 7064576 7673344 7511552 7401984
3793 7401984 7562240 7575552 6787072 7000576 8551424 8356352 10318336 11560960 12882432
3784 12882432 12417536 12338176 9876992 8985088 8570368 8080896 6725120 7213056 7018496
3775 7018496 6790144 6443520 7169024 6576640 7773696 7574528 6130688 6532608 7052800
3766 7052800 7415296 8187904 7607808 7568384 7158784 5855744 6667264 6771712 6957568 6549504
3756 6549504 6710272 7282176 8161280 6855168 7754752 7036928 5879296 6754304 6307840
3747 6307840 6525952 5227520 5672960 5006336 5135360 4675072 5426688 5713408 6261248
3738 6261248 4873216 5080576 4807680 5587456 4342784 5279744 5119488 5693440 5861376
3729 5861376 4594688 4534784 4965376 4999168 4730368 6148608 6052864 4276736 4993536 6454784
3719 6454784 6043648 5239296 4147712 5051392 4678656 5678592 6059008 5765120 5354496
3710 5354496 5877760 5634560 5844480 6419456 5553152 6674944 5750272 6643712 6437376
3701 6437376 6038528 5455360 5877248 4459520 5741568 5268992 6001152 6419456 6055424
3692 6055424 6483456 5154816 6218752 6759424 5085184 5971968 6597120 6328832 6094848
3683 6094848 6608384 5508096 6219264 5947392 6714880 5622784 6100992 5500416 5741056
3674 5741056 6359040 6159872 6676992 7101952 5611008 5630464 7022592 6035456 6462464
3665 6462464 7286784 6304256 6790656 5637632 6512640 6508032 6600192 5668864 6148608 6446592
3655 6446592 6812672 6615040 6779904 6248960 6663168 6471168 6648320 7029760 6615552 6883840
3645 6883840 6957568 6596608 6445568 7205376 7216640 7819776 6818304 6809600 8321536 7407616
3635 7407616 7750656 7975424 8498176 7696896 7610368 7690752 8506880 9080832 7971328 7635968
3625 7635968 7968256 7905280 8596992 8264704 8012800 7446528 8374784 8777728 7475200 7546880
3615 7546880 7989248 7392768 8237056 8321024 8103424 7877632 8958976 8979968 7622656 9159168
3605 9159168 9035776 8860672 10363392 11044864 10799104 11911168 11822592 13291520 13393408
3596 13393408 13232640 13474816 14176768 12952576 13397504 13688832 13501952 13478912 14491648
3587 14491648 14870528 14051328 15582720 13953024 15655936 15142400 15912448 16218112 17049600
3578 17049600 18319872 17852416 18868736 18935808 20896768 21519872 21572096 22693888 22935552
3569 22935552 23156224 25004032 25955328 25894400 27070464 28385280 29481472 30877696 32807936
3560 32807936 33251328 35205632 37881856 39290368 42099200 44343296 46313472 49095168
3552 49095168 52480000 55141376 59507712 64298496 68794880 73912832 81333760 89584128
3544 89584128 97305088 106498560 116200960 125704192 136421376 148570624 162377216 177599488
3536 177599488 195296768 215116800 240860160 270533120 308685312 356143616 418096128
3529 418096128 503883264 623472640 784048128 974513152 1130417664 1144969728 991389184
3522 991389184 773099008 583368192 441806848 337346048 260570112 205094400 165526016
3515 165526016 137849856 117991936 102580224 90435072 79785984 71639040 64522752
3508 64522752 59909120 55997952 50888192 47528960 46255616 43121664 41038848 38356992
3500 38356992 36534272 35730432 32951296 32507904 30528000 28869632 29010944 27621376 26910720
3491 26910720 26179072 24860160 25662976 23533056 23067136 22117376 21701120 20473856 20064768
3482 20064768 19832320 19077632 18710528 18799616 17338368 17824256 17458688 16278528 15682048
3473 15682048 15795200 14208000 15000576 14386176 14287872 13948928 12867072 13786624 13643776
3464 13643776 13099008 11704832 12800000 12978176 11864576 11288576 11004928 11047936 10769408
3455 10769408 10301440 8841216 9339392 9058304 8434176 8634368 9274368 8752640 9986560
3446 9986560 9734656 10945536 10570240 9583104 9951744 9560064 9858048 8995328 9375232
3437 9375232 9202688 8919552 9059328 9461760 8324096 8972288 8781312 8841728 8309248 8362496
3427 8362496 7912448 7731200 8204288 7507968 7845888 6445056 6168576 6564352 7267328
3418 7267328 6414336 6951936 5902848 6513664 7548416 6987264 7224832 5635072 6927360
3409 6927360 6627840 5825024 6276096 5843456 5064192 5769728 6600192 6005248 5918720 7121920
3399 7121920 6330880 6330880 5368832 5926400 5517312 6160896 6446592 5393408 5747712 5146112
3389 5146112 5599744 5616640 6711808 5039616 5630976 5596160 4534784 4411904 4953088
3380 4953088 5067264 4136448 4419072 4787200 4545024 4900352 4653568 4643328 5184000 4755456
3370 4755456 5084672 4710400 5656576 5721088 3976192 4942336 4694528 3960832 5564416
3361 5564416 4613120 4620288 4570624 4105728 4300800 5019136 4620800 4787712 4091392 4216320
3351 4216320 4022784 3407360 4124160 4556800 3037184 4735488 4091904 3948032 5847040
3342 5847040 5329920 5760512 6147584 6780416 6571520 9113600 9150976 8996864 8651776 9297408
3332 9297408 8799744 8136192 7284736 6035456 4810752 5011456 5535744 4191232 4401152
3323 4401152 4649472 4772864 4617216 4078592 4656128 4114944 3324928 4537344 4282368
3314 4282368 4254720 3867136 3769856 4277248 3935232 3799552 3836928 3832320 4021760 4049408 4012032
3303 4012032 4051456 4672000 3631104 4354048 3866112 4261376 5375488 5478912 5453312 7224320
3293 7224320 6761472 6037504 7593984 7392768 7548928 6959104 9028096 8948224 8785920
3284 8785920 9704448 9179648 8619520 8792064 8792064 10065920 10516992 10758144 10608128 10368512
3274 10368512 11069440 11680256 11204096 11779072 12713984 11548672 13178368 12639232 12999168
3265 12999168 13965312 14733824 13979648 15331840 15001600 14585856 15977472 17003008 16747520
3256 16747520 17103872 17059840 18019328 18373120 18296320 18942464 18913792 18643456 18573824 18241024
3246 18241024 19749888 19674112 20032000 20478464 20055040 19706368 20378624 20801024 21650944
3237 21650944 20501504 20718080 21313536 21392384 21807616 20761600 21867008 23083520 22918144
3228 22918144 23480832 23612416 24554496 25511424 25087488 23047168 19769344 18038272 15552000
3219 15552000 13264896 11969536 10501120 9632256 9723904 9329664 8411648 7302144 8275968
3210 8275968 7395840 8536064 7568384 8331264 7358464 7280640 6499840 7296512 7173632 6217216
3200 6217216 6333952 6737920 6351360 6739456 6393344 6876160 6680576 6362112 5591040 6224384
3190 6224384 6665728 6513664 5979136 6214144 6407168 5990912 6136320 7236608 6566912
3181 6566912 5952512 5924864 6585344 5813760 5615616 5368832 6223872 6001664 5653504 5791232
3171 5791232 6396416 6270976 6378496 5998592 6092800 6219264 5226496 6531072 6907392 7120896
3161 7120896 6242816 5263360 5381120 5478400 6233600 4570624 6141440 4808704 4968448
3152 4968448 5065728 5157376 4240896 4797952 4907520 4614656 5596672 4802048 5049344 4802048
3142 4802048 5230592 4594176 4642304 3953152 4763136 4349440 5792256 4805120 4919808 5052928
3132 5052928 4774912 5720576 5451264 5899264 4939776 4899328 4925952 5614592 4820480 6220288
3122 6220288 6120960 6114304 6703104 6167040 6970368 6419456 7168000 7389184 7542784 8447488
3112 8447488 9945088 9423872 11446272 15713792 22827520 24655360 19911680 19995648 24688640
3103 24688640 18100224 11657216 8661504 7721984 7428608 6150144 5999104 4319232 5436416
3094 5436416 4984832 5756416 4184576 5700096 4467200 5822976 5113344 5228544 3668992
3085 3668992 5056000 5691904 5257216 3909120 5180416 4235776 4485120 5332480 4075008
3076 4075008 4725248 3796992 4579328 4838400 4947456 5276672 5350912 5171712 5221888 5612544
3066 5612544 4719616 5035008 4751872 3443200 4500992 3419648 4317696 4508672 4385792
3057 4385792 3942400 4084224 4298752 5120000 4124672 4447744 4434944 4800512 4133376 4141568
3047 4141568 4377088 4812288 5300224 3124736 5283840 3542016 3147264 3346944 3190272
3038 3190272 3834880 4683264 4380160 3971072 4973056 4317184 3900416 4704256 3970560
3029 3970560 4867072 3800576 3846144 3944448 4221440 4290560 3963392 3729920 4323328 4277248
3019 4277248 3710976 3234304 3821056 4668928 5020672 4153856 5002752 4815872 5519360 5539840
3009 5539840 4471296 4570624 4398080 4060160 5227520 4087296 5511680 5164544 4614144
3000 4614144 3988992 4803584 3692032 4640256 4227072 3874304 4730880 5205504 4601344
2991 4601344 4598784 4139008 4877824 4857856 3772416 4855808 4976128 5086720 3860992 4718592
2981 4718592 4851200 4840960 5362176 5070336 4953088 5194240 5021696 4049408 4459520 4731904
2971 4731904 4926976 5303296 5124608 4585984 5171200 5333504 5124096 4999168 5805568 4625408
2961 4625408 5776896 6129664 5499904 5253632 5532672 6515200 6605824 6364160 5871104 5648896
2951 5648896 6199296 8524288 7375360 8666112 8586240 10736128 9503744 11112448 10531328
2942 10531328 11490816 11921920 12274688 13806592 14538752 13452288 14665216 14380544 14817280
2933 14817280 14375936 15467520 16399360 15929856 18555904 17842176 19897856 22046208 21353984
2924 21353984 19947520 20171264 17898496 15104000 14045184 12057600 10998784 10130944
2916 10130944 8627200 8989696 7735296 7964672 7849472 7930368 7796736 7358464 7148032
2907 7148032 7402496 7072768 6374912 6539264 5863424 7534080 6270976 6340608 6523392
2898 6523392 6962176 7692800 7598080 8284672 6464000 9752576 10258944 12434944 17231872
2889 17231872 27319296 41246208 29157888 15217664 10287616 9772544 7344128 7137792
2881 7137792 6086144 5907968 5898240 5883392 5827072 3908096 5810176 4832256 5149184 5380608
2871 5380608 4749312 5794816 5635584 4875776 5656064 5053952 5188096 4540416 3906048
2862 3906048 5242368 5025792 3700224 4352512 4264960 4405760 4096000 4518400 4670976
2853 4670976 4714496 4497920 4361728 4506112 4742656 5252608 3885568 5258240 4933632
2844 4933632 3448832 4407296 4480000 4626432 3921408 4569088 4237824 3599360 3756032 4548608
2834 4548608 5939200 4218368 4604416 4102656 4606464 3530240 3979264 4615680 4294144
2825 4294144 5021696 5051904 4514816 4292096 4201984 3724288 5067776 4757504 5022720 5130752
2815 5130752 5003264 5726208 5926400 6251008 6203904 6264320 6290944 7035904 7561728 8014848
2805 8014848 8944128 9623040 10686464 12316672 15605248 23583232 37912576 51034624
2797 51034624 34396672 20420096 15383040 13658624 11137024 12567552 14245888 19597824
2789 19597824 27195904 30179840 18284544 13876224 13107712 11735040 13963264 15078400
2781 15078400 22533120 36491264 40187392 22964736 15426048 12619264 11709952 11274240
2773 11274240 11074048 17071616 26050560 28095488 15590400 9719808 8951808 7198208
2765 7198208 7824384 8544256 10865664 13989376 16317952 9558016 7477248 6131712 5113856
2756 5113856 4748288 4766720 4111872 5244928 3771392 4756480 5195776 4726784 3770880
2747 3770880 4126720 3651072 5162496 5554688 3770880 4681728 5048320 4871680 5046272
2738 5046272 5005312 5520384 5665280 6525952 6147584 5445120 4799488 5759488 4612096 4206592
2728 4206592 4941824 4725248 5221888 4476416 3383808 3488256 1956864 2085376 3396096
2719 3396096 3106816 2423808 3259904 3892224 3045376 2596352 2453504 3223552 2433024 3360768
2709 3360768 3098624 3380224 3044864 3085824 1590784 3951616 3578880 3202048 2328064
2700 2328064 2554368 2304512 2990080 3287040 2983936 2858496 3517952 2301952 2370560 2329600
2690 2329600 2566656 1670144 3206144 2667520 1922048 2092544 3343872 2946560 3042816
2681 3042816 2865152 3320832 2135552 2255872 3182592 2650624 1615360 2209792 3433472
2672 3433472 3429376 2469376 2581504 3245568 3244032 2508288 2821632 3521024 2166272 2094592
2662 2094592 2294272 2542080 2456064 2820096 2079232 3268096 2426880 3484160 1611264
2652 2936320 2696704 3254272 2826752 3772928 3125248 4105216 1693696 3426304 3419136 2841600
2642 2841600 2838528 2884608 2430464 2714624 3098624 3687936 1505792 2336768 2593280 3140096
2632 3140096 2649600 2803200 3734016 2929664 2994688 4398080 3389952 2529792 3056640
2623 3056640 2610176 2791424 3165696 2606592 3363840 2802176 2404864 2199552 2897408 1939456
2613 1939456 2729472 2377728 2191872 2140160 2286592 1932288 2861056 2136576 2505216 2315264
2603 2315264 2812928 3086848 2814976 1862656 2296320 2458112 2926592 3333120 2507776 3251200
2593 3251200 3822592 3715072 2550784 3284480 2876416 2535424 2237440 3032576 2814976
2584 2814976 2960384 2308096 2788352 2926080 3018752 2465280 2610688 2822656 2447360 3207680
2574 3207680 2725888 3126784 2841600 2736128 2570240 2932736 2157568 2855424 4106240
2565 4106240 3424256 3661312 2969088 3831296 1984512 3505152 2657280 2764800 3251200
2556 3251200 1955328 3272192 3591680 4248576 2883584 3758592 3672064 4179968 3944448
2547 3944448 3801600 3945984 4968448 3398144 4392448 2986496 2893312 2816000 3496960
2538 3496960 3508736 3565568 3824640 3953664 4166656 3545088 4383232 2598912 4071936 4641792
2528 4641792 3813376 4867072 3078144 4077056 4393472 5835776 3963904 5744640 4866560
2519 4866560 4577792 5202432 4744192 5348352 5409280 5479424 5299712 5873664 4917248 5176320
2509 5176320 4958720 4726272 4838912 3992576 4174848 3937280 3328512 4586496 4073472
2500 4073472 4170752 5194752 4820480 5178880 3723264 4111872 5255680 4523520 3909120
2491 3909120 4072448 3820544 5315584 4973056 3986944 4260352 4584960 4139008 4293632
2482 4293632 4731904 3271168 4359680 4060672 4440064 3907072 4812800 3609600 4347904
2473 4347904 4162048 2854912 3512832 2941440 3657216 3020288 3666944 3148288 4302848
2464 4302848 3749376 3580416 4110848 4247040 3359744 3408896 2951168 3768320 3466752 3759616
2454 3759616 3993088 3758592 4153856 3236352 3616256 4277760 4381184 5340672 4006912
2445 4006912 3298816 3613696 4268032 4253184 4480000 4033536 4048384 4146176 4762112 4914688
2435 4914688 4589056 4570624 4279296 3868160 4404736 4099072 4498944 3844096 4482048 3508224
2425 3508224 4274176 3831296 4120576 4571136 3528704 3986432 4347392 3532800 5049856
2416 5049856 3411456 3559424 5840384 3249152 4445184 4674560 4734464 3850752 4913664
2407 4913664 5131776 5516800 5286912 4822528 5430784 4542464 5585920 5059584 4803584
2398 4803584 4913664 5047808 5822976 4859392 4805120 4844544 5871616 4554752 5342208 5230592
2388 5230592 5517312 5214208 5773824 5771264 5139456 4492800 6439936 5003776 5172224 5441536
2378 5441536 4987392 4501504 4485632 5379584 4675584 4237312 4229120 4954112 5292032 3848704
2368 3848704 4456448 4329984 3095040 4208128 3908096 4831744 4363776 4470784 2965504
2359 2965504 3433472 3686912 4466176 4114944 4139520 3807232 4129280 4555264 4742656 4759040
2349 4759040 4562944 3662336 4407296 4742656 4281344 4174336 5037056 4578304 4520960 4670976
2339 4670976 5254144 5182464 4758016 4555264 4330496 5278720 5303808 5053440 4976128 5870080
2329 5870080 6027776 6540288 6704640 7292928 6392320 7032832 7785984 6917120 7154688 7196672
2319 7196672 8782336 7211520 5906944 6626816 6966784 6263296 6274048 5787648 6396928
2310 6396928 6880256 6290944 5037568 5835776 6255616 7436800 6879232 6474240 6919680
2301 6919680 5620736 6219264 6080000 6978560 6923264 6928384 7894528 7152640 7327744 6296576
2291 6296576 7070720 7627776 6021120 6260224 6950912 7127040 6751744 7276544 6425088
2282 6425088 6064640 6802432 5809152 5440512 5708800 5614592 5330432 5662720 6518272 5391360
2272 5391360 6523904 6321664 7194624 6516224 7550464 6830080 6414848 6623744 5611008
2263 5611008 7718912 6281216 5493760 6414848 4970496 6409216 5639168 5630464 5321728
2254 5321728 5523456 5957632 5301248 5374976 4781056 5074944 5451776 4164096 4908544 4827648
2244 4827648 4570112 4250112 5522944 4440064 4553216 4449280 5343232 5336576 4470784 4621824
2234 4621824 5388800 5846016 5322240 5057024 6440448 5793280 6249472 6513152 5795328
2225 5795328 5486080 6424576 5459456 5867008 6137856 5985792 6000640 6605824 5726720 6857728
2215 6857728 6908416 6432768 7435264 7747584 6265856 5826048 7408640 6007808 7291904
2206 7291904 6038528 5839872 6342144 7233024 7769088 6683136 8222720 7163392 8488960
2197 8488960 8091648 8749568 9024000 8065024 8465408 8518656 8118272 7304192 10661888 8106496
2187 8106496 9347072 9219584 10186240 9924608 10018304 9103872 10449408 9705472 8784384
2178 8784384 9673216 8382976 9458176 9426944 8915968 9764352 9372672 8786944 9250816
2169 9250816 9602048 8806400 9419776 8505856 7959040 9658368 9186816 9862656 8992256
2160 8992256 9857536 9882624 9886720 8501760 10363392 9384448 10627072 9882112 10483712 9988096
2150 9988096 10796032 10084864 10762752 9681408 9027584 9367552 10312704 9049600 10296832
2141 10296832 10210304 10361344 9282560 8980480 8694784 9402368 10118144 10201088 9946624 8398848
2131 8398848 10260992 10984960 10080768 10319872 11869696 17724416 24493056 30444544 18904576
2122 18904576 11509760 10562048 9895936 8924672 8224256 8586240 7494656 7647232 7620096
2113 7620096 7677440 7259136 8100864 7558656 8011264 6198272 7574016 7552512 7488512 7426560
2103 7426560 7717888 7737856 7374336 7326720 7549952 7443456 8613376 7240704 8033280 8643072
2093 8643072 8093696 7580160 8215552 8079872 7272448 8443904 8106496 7875584 8558592
2084 8558592 7642624 8594944 7921152 7990784 7792128 8217600 6942720 6462464 7165952 6521856
2074 6521856 5724160 5270016 6508544 5772800 6753280 5798912 4157440 5510656 5718016
2065 5718016 5203968 4512256 5572096 5948416 5951488 5803520 5103104 5326848 5174272 5904896
2055 5904896 5692928 5557248 4804608 5241856 5104128 4665344 4392960 4296704 5675520 4676096
2045 4676096 5352960 6078976 6149632 5445120 5792256 5596672 6391808 6145024 5210624 5506048
2035 5506048 6974976 6130688 5744128 5671936 5463040 4595712 5528064 5157376 5128704 5897216
2025 5897216 4695552 5954560 5916160 5449728 5544960 5375488 5221888 5778944 7190016
2016 7190016 6750208 6438912 6717952 7657984 7051776 6330880 7742976 7027712 6749184
2007 6749184 7634432 7078400 7554048 7873536 7292416 7883264 8231936 8093184 7559168 7750144
1997 7750144 8033792 8761856 8790528 9016832 8551936 9349120 8518656 8250880 9376768 9896448
1987 9896448 8552448 8637952 8768512 9829888 10339328 9777664 9271296 9434112 9763840
1978 9763840 10684928 10176000 11060736 10308096 10560512 11454464 11132928 11800064 11701248 12094976
1968 12094976 12795904 12590592 12628992 12349440 11924480 12419072 11007488 12518400 11190272
1959 11190272 11084288 11087360 11589120 10884096 10747904 11506688 11169280 10415104 10793984 10783744
1949 10783744 9889280 9949696 9772032 10754048 10427392 10990592 9890304 11107328 9991168
1940 9991168 11638784 9606144 11786752 10789376 9822720 10466816 10446336 11549696 10860544
1931 10860544 10686464 10696192 11146240 11170304 9681920 9782784 11194368 10414080 9077760
1922 9077760 8970240 9618432 9782272 8677376 9415680 8595968 8188416 8410112 8128000
1913 8128000 8617472 8083456 8322560 7110144 6646784 6892544 7387136 7883264 8035840
1904 8035840 8082944 6472192 7498240 6315008 7369216 6185984 7475712 7761408 7087616
1895 7087616 6932992 6269440 7414784 6935040 6569984 6173184 5850624 5979136 5870080
1886 5870080 6827008 5933056 7131136 6848512 7147008 6180864 6849024 5663744 6057472
1877 6057472 6663168 7410688 6669312 6972416 7652864 6269440 6762496 6556160 7097344
1868 7097344 6471680 6683648 6461952 8098304 7752704 7210496 8231424 7348224 8431616
1859 8431616 7676416 7349248 9112576 7537152 7927296 9137152 9195520 8702464 9057280
1850 9057280 9146880 9946112 9705472 9665536 9930752 9812992 10576384 10427904 10520576 10862592
1840 10862592 10481664 12452864 11700224 12923392 11754496 12442112 11544576 12599296 13178880
1831 13178880 12790272 13966848 13987328 13449728 14592000 15319552 16051712 16275456 18051584
1822 18051584 17548800 17932800 19271168 20198400 20896768 22064640 23104000 23753216 25596928
1813 25596928 25689600 27640320 30022656 29843968 32192512 32531968 33956864 34541568 36098560
1804 36098560 36165632 35906560 37747712 37999616 39409152 40502272 40876544 42982400 43424256
1795 43424256 46533120 47561216 49656320 52739072 54839808 58237952 62259200 66095616
1787 66095616 70676992 76764672 83075584 90728448 99444224 105986560 111586304 112191488
1779 112191488 108825600 101298688 93570560 84203520 73404928 61498368 51484160 43278336
1771 43278336 36563456 31780352 27271680 24677376 22204416 20465152 19507712 17395200
1763 17395200 18098176 15345152 14989824 13894656 13795840 13762560 14185984 13236736 12854784
1754 12854784 11982336 11885056 12041216 12430848 11688448 11142656 9886208 11464704 10708992
1745 10708992 10720256 10704384 10346496 8734720 8943104 8599040 8050176 9391616 6935552
1736 6935552 8556544 7885824 7914496 8055296 7537152 7095808 6667264 6775808 6451200 7208960
1726 7208960 6958592 6799360 6537728 5877248 6047232 7366656 6260224 5347328 6681600
1717 6681600 5300224 5398016 4752896 4502016 4740608 5658624 5141504 4592128 5456384 5341696
1707 5341696 4099072 3822080 5770752 4170240 4182016 4448768 4752384 3983872 4676608
1698 4676608 4312064 4819456 3857920 3831296 4160512 5213696 4292096 4569088 4253696 4700672
1688 4700672 4713472 4557312 4039168 4377088 3835904 4220928 2553344 4144640 4360192
1679 4360192 3663872 4913152 5061120 4764672 4315136 3953664 4444672 4733440 3100160
1670 3100160 4355072 4589568 3933696 4729856 4050944 4403200 4755968 4552704 4738560
1661 4738560 5051392 5171200 3797504 4218368 6033920 5370368 5915136 4910080 5358592
1652 5358592 5245952 6139904 6170624 5804032 5171200 6617088 5408768 4781056 5312512
1643 5312512 5906944 6259712 6850560 6084096 7316480 6987264 8091136 7583744 8325632
1634 8325632 8118272 8568320 9552384 11148288 12111360 13501952 13675008 11972096 10848256
1625 10848256 10822144 9793536 9203712 8637440 8634880 9197568 9712128 8622080 9831424
1616 9831424 8693760 8438272 8182784 8891904 9767936 8339456 9018368 8877056 8671232
1607 8671232 7350272 8772096 8108032 7235072 9203712 8305152 8612352 7165440 7892992
1598 7892992 8099328 8397824 8475136 9859584 10921472 12260352 12698112 12874752 12794880
1589 12794880 13646848 13786112 13696512 14260736 11020288 10649600 10500608 9043456 7535616
1580 7535616 7390720 7845376 7341568 7229440 7576064 6701056 7168512 7538176 6309376
1571 6309376 7121920 6388224 6775296 6699008 7510016 8086016 7911424 8756224 9395712 9301504
1561 9301504 9468928 10358272 10685440 8276992 9304576 8591872 8451584 8406016 7298560
1552 7298560 7720448 6496768 6724096 7266304 6614016 4478976 4977664 5936128 5557760
1543 5557760 5260800 5644800 5436928 4447744 5646336 4657152 5796352 4720640 4348928
1534 4348928 4681216 4890112 4435456 4293632 4124160 4300800 4437504 4643328 4628480 4490240
1524 4490240 4703232 4064768 3414016 4519936 4381696 2697216 4265472 3548160 3112960
1515 3112960 4819968 3847680 4400128 4441600 4517376 3846144 4754432 3787264 4774912 3305472
1505 3305472 3005952 4209664 3366912 3959808 4638208 3933696 4902912 4427264 4459008 4222976
1495 4222976 4046848 4930560 4056576 4440576 4336640 4021248 4794880 4350464 5107200 3102720
1485 3102720 3857408 3695616 4803072 3526656 4393472 3523072 4202496 3357184 3864064
1476 3864064 3564544 2103808 3491328 2864640 1788416 3601920 3996160 2276352 2551296
1467 2551296 2797568 2803712 3022848 2381824 3160064 3067904 3101184 2744320 1678848 2255872
1457 2255872 2669568 2153472 1401856 3279872 2998272 2587136 2804736 1982464 3330560
1448 3330560 3505152 2786816 2607616 3600384 2042368 2697728 2775040 1901056 1793024 1501184
1438 1501184 2575872 1419776 2074624 2136064 2979840 2499584 1634304 1926656 1623552
1429 1623552 1659904 1895936 1305600 851456 1579520 2658304 1362944 1897472 1449472
1420 1449472 2287616 1680896 800768 2024960 2042368 1851392 1902080 2106880 1833984 984576
1410 984576 1567744 1255424 1381888 450048 1701376 1178112 1470976 1846272 1323520 1449984
1400 1449984 1657856 28672 948224 1462784 1418752 790016 1558528 1826304 1515520 1733120
1390 1733120 541696 1674240 1073152 2057728 1030144 737792 1512960 859136 2396672
1381 2396672 841216 2256384 976896 677888 750080 1377792 942080 1234944 2246144
1372 2246144 1738752 731648 1615360 871936 2139648 1876992 2713600 823296 1881088
1363 1881088 1220096 1389568 757760 2399744 1354240 2039296 1650176 1594368 1313280
1354 1313280 594432 1375232 398336 1272320 1878528 1354752 279040 1057792 1269248 1302528
1344 1302528 984576 1037312 1903104 1098240 1629184 1197056 646656 1975808 1475584 1159680
1334 1159680 1769472 996352 1509888 607232 1359360 1039360 1635840 1610240 1873408 1056256
1324 1056256 1312256 776192 1765376 384000 1758208 1503744 768512 1196544 1042432
1315 1042432 1928704 1113088 1226240 1059840 1326592 1318400 904704 2019840 1377792 1504256
1305 1504256 1188864 1164288 877568 787968 1134592 1276416 998400 1601024 1252864 41984
1294 957440 1643008 1699840 1500672 1593856 524800 1043968 1384960 2021376 1298944 1486336
1284 1486336 1372160 1458176 925184 1393152 399360 1244160 692224 1517568 1635328 607744
1273 -35840 1747968 993792 1450496 2084864 870400 1411584 381952 369664 1474048 546304
1262 1897472 699904 1276416 1902592 1898496 2386944 712192 1298432 774656 996864 1106944
1252 1106944 1269760 436224 909312 1079808 1291264 1415168 1587200 1019392 1296896 471040
1241 1765376 994816 919552 364032 1337344 660480 1556480 805376 1677312 1648640 1597952
1231 1597952 1074176 789504 749568 1048576 1344000 430592 1189376 5120 742912 1526272
1221 1526272 1815040 956928 1648128 871936 1562112 1472512 1800192 881152 2322944 1583616
1211 1583616 1337344 2227200 422912 1098752 1333248 2073088 1409536 1758720 2145792 1435648
1201 1435648 2509312 1583104 2021888 1951232 2021888 2464768 2306048 3452416 2625024 2427392
1191 2427392 3085824 2527232 2721280 2625024 2835968 2716160 3033088 3726848 3318272 2814464
1181 2814464 3057664 3357184 3546112 3387392 3292672 2629120 3378688 2500096 2375168 2947584
1171 2947584 3323904 2688512 2631680 3011072 3981312 2915840 4941312 6209536 7078912
1162 7078912 5241344 4460032 5978112 5317120 6391808 5784576 6266368 6920704 8557056
1153 8557056 10165760 11328512 13863424 15235584 17242624 23296512 49522176 88662528
1145 88662528 150491648 64253440 30066176 19979264 15220224 11613184 8470016 6347264
1137 6347264 4800512 3440640 3476480 3791360 3590144 3003904 3345920 4005376 3393536
1128 3393536 3983360 6723584 5004800 3847680 3061248 2597376 3529728 2631680 1999872
1119 1999872 2070016 2262528 1879040 1667072 1892352 2355712 1876480 1790464 1675264 2263040
1109 2263040 924160 2009088 187392 2003456 1565696 2025472 2466816 1545728 1654272
1100 1654272 1821696 974336 68608 1287168 971776 76800 1925120 182272 1179648 339456
1089 1105408 648704 747520 1747968 849408 784384 1076736 2560000 238592 144896 1486848
1079 1486848 1260544 351232 932864 1093632 1189888 2086912 619520 1255936 771584 316928
1068 1928192 884736 320000 1521152 718336 941568 1489408 724992 246272 192512 1078784
1058 1078784 869376 -202240 808960 656896 1599488 2421760 1065472 1560064 866304
1049 866304 36864 1637888 762368 471040 -324096 867840 1239552 1184256 731648 870400
1039 870400 435200 1047552 656896 1283072 760832 750592 641024 952320 744960 924672
1029 924672 95744 -141312 842240 1574400 1227264 806912 1552896 698880 906240 728064
1019 728064 942080 275456 519680 788992 1637888 666112 90112 1168384 2048 -562176
1008 251904 339968 632320 1809408 430080 499712 1194496 897024 399360 521728 1516544
998 1516544 1075200 1894912 1008128 2058240 282112 297472 575488 1306112 202752 -89600
987 641024 1158144 829952 655872 1318400 720384 223744 1379328 -288768 400896 1495552
977 1495552 109568 922112 992768 1686528 921600 1238016 222720 144384 348672 1621504
967 1621504 -110592 600064 475136 1187840 1284096 10240 1238016 -162816 281600 1366528
957 1366528 114688 9728 1375232 829440 131072 854528 559616 358400 1455616 460800
946 1592320 1106944 410624 462848 364544 336384 345600 665600 586752 888832 -256512 859136
934 903680 235520 286208 -136704 1442816 -333824 482304 1145344 273920 650240 185856
923 583168 135168 1240576 1106432 25088 892928 643072 754176 984576 -571392 610304
912 -243200 1155584 616960 1098752 115200 609280 714240 188928 160768 657408 -40960
901 511488 497152 1154048 299008 711168 166912 772608 23552 237568 748032 769536
891 769536 1917440 904704 -156672 1103872 251904 411648 1977344 956416 1217024
882 1217024 189440 507392 944640 546304 980480 1028608 473088 55808 1010176 703488
872 703488 994304 1049088 723456 689152 776704 1297408 1076224 1349120 1043968 1451520
862 1451520 1317888 846848 1148416 24576 563712 1574400 2000384 1153024 1031680 475648
851 675840 770560 1073152 877568 1082880 1131008 2500096 1503744 1516032 1729536 774144
840 1417728 1135616 1442304 215552 824832 -134656 -313856 676864 548864 946688 1122304
830 1122304 373760 311808 -237568 296448 -267776 885248 885248 727552 1634816 607232 197120
818 912384 720896 402944 1273856 -782848 407552 -1055232 806912 -191488 260096 418304
808 418304 76800 390144 143360 446464 -358400 1179648 199168 -422400 1907200 439296
797 671232 314368 1414144 399360 8704 1127424 883200 -99840 796672 -267264 207360
786 1190912 732160 738304 786944 1024 955392 -355840 196096 -16384 111616 561664 -139264
774 323072 167936 29184 871424 79872 375808 334336 -444928 532480 588288 239616 358400
763 358400 622592 644608 -181248 -536064 -11264 706048 312320 -42496 -336384 -227328
753 -227328 -756736 -512 9216 991744 -519680 -124928 -202752 1106944 1015808 -269312 837632
741 -666624 55808 -59904 -142848 -308736 -138752 -870400 -487936 -477696 537600 924160 275456
729 -251904 -156672 285696 265216 -104448 702464 -61440 747008 273920 491520 1064960
719 1064960 580608 781312 568320 1329664 502272 -58368 -619008 237056 13312 31232
709 31232 451584 286720 540672 -38912 341504 108544 510464 109568 248832 473088
699 473088 443904 154624 23040 1019904 152576 -378880 230912 -187392 504832 1071104
689 1071104 943616 139776 -828416 259072 -533504 161792 442880 876544 734208 300544
678 973312 699392 867328 294912 -564224 -404992 -11776 289280 124416 26112 224768
668 224768 -783872 -899072 61952 576000 -33280 330752 232960 -780800 386560 218624
658 218624 158720 -264704 563200 595968 564224 -199168 558592 37376 -330752 -793088 -107008
646 262144 651776 426496 1121792 518144 240128 -376832 276480 271360 1096192 294400
635 -97280 309760 -366592 862720 1038848 358400 249344 1102336 -27136 974336 607232
625 607232 112128 219648 747008 333312 420352 -990208 485888 267776 -251392 319488
614 -340992 -167424 147456 1516032 -876544 926208 109568 -347648 709120 377344 633344
604 633344 233472 1003520 -66560 -94720 -311296 45056 -709632 925184 -69120 -242688 690176
592 229376 -351744 537600 -593920 1059328 837120 1072128 639488 480256 5120 212992
582 212992 675840 837120 380416 255488 507392 1362432 144896 867328 211456 374272
572 374272 -377344 661504 75264 551424 908288 787968 673280 663040 524288 148480
561 702976 -10752 105472 1297920 278016 187904 1398272 690176 1408000 766464 1184256
551 1184256 1049600 1064960 818176 357888 1349120 2175488 1763840 1419264 799744 708608
541 708608 1049088 -632832 13312 978944 611840 1196544 82944 13312 1506816 -7168 -468992
530 -468992 1024 -578048 1030656 -900608 1204224 203264 -503296 -638464 -384512 -392704
520 -392704 -268288 179712 215552 557568 288768 -290816 -27648 698880 -328192 853504
509 -388096 436224 77824 289792 -622080 -74752 13824 586240 -712704 363520 -128512
498 252928 -211968 -347136 1240576 -806912 -3072 512000 -184832 295424 171520 487936
488 487936 92160 440320 -255488 725504 -458752 173568 169984 421376 297984 1204736
478 1204736 -186880 1018368 753152 600576 -318976 -684032 913408 -76288 -790528 853504
467 680448 -23552 52736 534528 -39936 496128 31744 188928 182784 471040 536576 -1312256
455 534528 -2560 -256512 -446976 -119296 505856 387072 129024 38400 350720 363008 760832
444 760832 208896 -1111552 540160 -636928 -686592 265216 -477696 252416 370176 914944
434 914944 -466432 768512 505344 -186368 -211456 -125440 -431104 -291840 -577536 -392704
424 -392704 224768 692736 -239104 351232 179712 415232 -613888 -213504 884736 1494528
414 1494528 794624 595456 -220672 -156672 485376 401408 -141824 1027072 587776 -423424
403 57856 -577536 -237056 776192 -425984 -247808 462336 38400 4096 -530944 523776 -212480
391 -94208 -107520 1253888 851968 -404480 -526848 -287232 475648 -638464 187392 260096
381 260096 449536 282112 470016 579072 -136192 237568 50176 390144 -147968 -251904
371 -251904 -690176 -331776 -347136 418304 14336 -1024 1054208 179712 534528 871936
361 871936 -254976 341504 291840 987648 617984 -60416 -282624 22016 -247808 -556032
351 -556032 907776 20992 129536 220672 593920 316928 -523264 517632 -176640 183808
340 -122368 -527872 368128 -53248 53248 -403456 309760 245760 379904 -352768 390656
329 870912 -1336320 -185344 992768 -311808 -295936 73728 -859136 32768 958976 124928
318 -706048 425984 219136 194048 465920 -291840 60416 -50688 516608 -300544 244736
307 867328 -241152 499712 -126464 -951808 -205312 255488 494080 356864 368640 -189440
296 -20480 313344 -120320 713216 -1051136 -407040 -760320 -428544 -29696 -290304 -573952
286 -573952 504832 71168 623616 405504 657408 -1370624 306176 215552 -675840 425984
275 652800 51712 322560 14848 -79360 363520 312832 591360 125440 182272 638464 591872
264 591872 -344576 240128 340480 333824 -352768 366080 -244736 813568 -35328 38400 -90112
252 110080 165888 -816640 338432 -365056 -795136 460288 233472 349184 -230400 168448
241 -10240 24576 -49152 -1033216 283136 66560 -203776 481792 151040 -984576 506368 709120
230 709120 -1034752 -921088 -57856 1127424 -68608 -817152 697344 94720 38400 220160
220 220160 910848 392704 621568 -39936 630272 39936 536576 -370688 -1256448 -625152
209 -200704 626688 -78848 -276480 94208 282112 -293888 -113152 -234496 260608 -65536
198 1018880 -169984 507392 636416 -37376 -288256 412672 -785408 1245184 356352 872960
188 872960 583680 -899072 492544 -652288 -635904 120832 -619008 657408 929280 -754688
177 -289280 -734208 -181760 369664 -52224 494592 -435712 632320 1219584 472576 557568
167 557568 -760320 -162816 -140288 314880 -747008 -450560 644608 -66048 -879104 -338432
156 -751616 157184 384512 -3584 -288256 -776192 -672256 -453632 157184 -766976 -345088
145 916480 585728 -1072128 -16384 -13312 -730112 86016 68096 961536 -1030144 123904
134 -52736 -635904 14848 549888 188928 -206848 -347136 -885248 241152 615936 -388096
123 72704 75776 -47104 -1317888 492544 -509440 614912 422912 565248 -1368576 -461312
112 61440 235520 -418304 519168 13824 -511488 139264 578560 295424 147968 951296
102 951296 566784 -794624 -211968 -961536 -86016 117760 760320 140288 -613888 400896
91 -1090560 -229888 145408 409088 -410624 -74752 188928 461824 -195584 364032 808960
81 808960 146432 -360448 -262656 795648 -865280 227328 -862720 -342528 -223232 270848
70 214016 721408 187392 -22528 88064 591360 -476160 643584 130560 662016 -498688
59 -26112 -1114112 748544 529920 473088 -407552 -110592 -595968 -138240 -227328 -952320
49 -952320 -837632 491008 -892416 -399360 303104 327680 -158208 1468928 1817088 -1079296
38 -374272 -96768 35328 -915456 -478208 -184320 -364032 581632 -209408 -1039872 -419328
27 566272 -365056 155648 -397312 -244224 156160 143360 402432 -577536 515072 -752128
16 752128 -708096 180224 515072 -536064 583168 329216 -243712 1079296 -378368 557568
5 -12800 -164864 -598016 -571392 13824 -50688
##END=
