##TITLE=1392
##JCAMPDX= 6.0         $$ Bruker NMR JCAMP-DX V2.0
##DATA TYPE= NMR SPECTRUM
##DATA CLASS= XYDATA
##ORIGIN= NUTS EXPORT
##OWNER= Administrator
$$ 1.72 TOPSPIN		Version 2.1
$$ 2016-02-23 12:22:22.511 -0800  Administrator@X
$$ Compression mode = diff/dup
##.OBSERVE FREQUENCY= 90.275459
##.ACQUISITION MODE= SIMULTANEOUS (DQD)
##.ACQUISITION SCHEME= undefined
##.AVERAGES= 16
##.DIGITISER RES= 22
##SPECTROMETER/DATA SYSTEM= 
##.PULSE SEQUENCE= zg30
##.SOLVENT NAME= None
##.SHIFT REFERENCE= INTERNAL, None, 1, 14.56039
##AUDIT TRAIL= $$ (NUMBER, WHEN, WHO, WHERE, PROCESS, VERSION, WHAT)
$$ ##TITLE= Audit trail, TOPSPIN		Version 2.1
$$ ##JCAMPDX= 5.01
$$ ##ORIGIN= Bruker BioSpin GmbH
$$ ##OWNER= Administrator
$$ $$ E:/data/jwist/nmr/1392/1/pdata/1/auditp.txt
$$ ##AUDIT TRAIL=  $$ (NUMBER, WHEN, WHO, WHERE, PROCESS, VERSION, WHAT)
(   1,<2016-02-23 09:22:04.277 -0800>,<Administrator>,<X>,<jcamp>,<TOPSPIN 2.1>,
      <fromjdx created from
       E:\data\jwist\nmr\uniandes\1392
       data hash MD5: 8K
       D3 A4 C7 C5 4C B4 8E 52 8A E2 01 AC B5 DA B4 68>)
$$ ##END=
$$ 
$$ $$ hash MD5
$$ $$ A2 87 93 74 14 88 23 12 25 F1 46 17 10 C6 C4 BF
##$RELAX= 
$$ Bruker specific parameters
$$ --------------------------
##$DU= <E:>
##$EXPNO= 1
##$NAME= <1392>
##$PROCNO= 1
##$TYPE= <nmr>
##$USER= <jwist>
##$ACQT0= 0
##$AMP= (0..31)
100 100 100 100 100 100 100 100 100 100 100 100 100 100 100 100 100 100
100 100 100 100 100 100 100 100 100 100 100 100 100 100
##$ANAVPT= 1
##$AQSEQ= 0
##$AQ_mod= 3
##$AUNM= <au_zg>
##$AUTOPOS= <>
##$BF1= 90.275459
##$BF2= 400.02
##$BF3= 400.02
##$BF4= 400.02
##$BF5= 400.02
##$BF6= 400.02
##$BF7= 400.02
##$BF8= 400.02
##$BYTORDA= 0
##$CFDGTYP= 0
##$CFRGTYP= 0
##$CHEMSTR= <none>
##$CNST= (0..63)
1 1 145 1 1 1 1 1 1 1 1 1 1 1 1 1 1 1 1 1 1 1 1 1 1 1 1 1 1 1 1 1 1 1 1
1 1 1 1 1 1 1 1 1 1 1 1 1 1 1 1 1 1 1 1 1 1 1 1 1 1 1 1 1
##$CPDPRG= <>
##$CPDPRG1= <>
##$CPDPRG2= <>
##$CPDPRG3= <>
##$CPDPRG4= <mlev>
##$CPDPRG5= <mlev>
##$CPDPRG6= <mlev>
##$CPDPRG7= <mlev>
##$CPDPRG8= <mlev>
##$CPDPRGB= <>
##$CPDPRGT= <>
##$D= (0..63)
0 1 0 0 0 0 0 0 0 0 0 0 0 0 0 0 0 0 0 0 0 0 0 0 0 0 0 0 0 0 0 0 0 0 0 0
0 0 0 0 0 0 0 0 0 0 0 0 0 0 0 0 0 0 0 0 0 0 0 0 0 0 0 0
##$DATE= 0
##$DBL= (0..7)
120 120 120 120 120 120 120 120
##$DBP= (0..7)
150 150 150 150 150 150 150 150
##$DBP07= 0
##$DBPNAM0= <>
##$DBPNAM1= <>
##$DBPNAM2= <>
##$DBPNAM3= <>
##$DBPNAM4= <>
##$DBPNAM5= <>
##$DBPNAM6= <>
##$DBPNAM7= <>
##$DBPOAL= (0..7)
0.5 0.5 0.5 0.5 0.5 0.5 0.5 0.5
##$DBPOFFS= (0..7)
0 0 0 0 0 0 0 0
##$DE= 6.5
##$DECBNUC= <off>
##$DECIM= 2432
##$DECNUC= <off>
##$DECSTAT= 4
##$DIGMOD= 1
##$DIGTYP= 12
##$DL= (0..7)
0 120 120 120 120 120 120 120
##$DP= (0..7)
150 150 150 150 150 150 150 150
##$DP07= 0
##$DPNAME0= <>
##$DPNAME1= <>
##$DPNAME2= <>
##$DPNAME3= <>
##$DPNAME4= <>
##$DPNAME5= <>
##$DPNAME6= <>
##$DPNAME7= <>
##$DPOAL= (0..7)
0.5 0.5 0.5 0.5 0.5 0.5 0.5 0.5
##$DPOFFS= (0..7)
0 0 0 0 0 0 0 0
##$DQDMODE= 0
##$DR= 22
##$DS= 2
##$DSLIST= <SSSSSSSSSSSSSSS>
$$ [...]
##$SPOFFS= (0..31)
0 0 0 0 0 0 0 0 0 0 0 0 0 0 0 0 0 0 0 0 0 0 0 0 0 0 0 0 0 0 0 0
##$SUBNAM0= <"">
##$SUBNAM1= <"">
##$SUBNAM2= <"">
##$SUBNAM3= <"">
##$SUBNAM4= <"">
##$SUBNAM5= <"">
##$SUBNAM6= <"">
##$SUBNAM7= <"">
##$SUBNAM8= <"">
##$SUBNAM9= <"">
##$SW= 20.5580556627758
##$SWIBOX= (0..15)
0 0 3 4 0 0 0 0 0 0 0 0 0 0 0 0
##$SW_h= 8223.68421052631
##$SWfinal= 0
##$TD= 65536
##$TD0= 1
##$TE= 300
##$TE2= 300
##$TE3= 300
##$TEG= 300
##$TL= (0..7)
0 120 120 120 120 120 120 120
##$TP= (0..7)
150 150 150 150 150 150 150 150
##$TP07= 0
##$TPNAME0= <>
##$TPNAME1= <>
##$TPNAME2= <>
##$TPNAME3= <>
##$TPNAME4= <>
##$TPNAME5= <>
##$TPNAME6= <>
##$TPNAME7= <>
##$TPOAL= (0..7)
0.5 0.5 0.5 0.5 0.5 0.5 0.5 0.5
##$TPOFFS= (0..7)
0 0 0 0 0 0 0 0
##$TUNHIN= 0
##$TUNHOUT= 0
##$TUNXOUT= 0
##$USERA1= <user>
##$USERA2= <user>
##$USERA3= <user>
##$USERA4= <user>
##$USERA5= <user>
##$V9= 5
##$VALIST= <valist>
##$VCLIST= <CCCCCCCCCCCCCCC>
##$VD= 0
##$VDLIST= <DDDDDDDDDDDDDDD>
##$VPLIST= <PPPPPPPPPPPPPPP>
##$VTLIST= <TTTTTTTTTTTTTTT>
##$WBST= 1024
##$WBSW= 4
##$XGAIN= (0..3)
0 0 0 0
##$XL= 0
##$YL= 0
##$YMAX_a= 1206546176
##$YMIN_a= -1627445.76
##$ZGOPTNS= <>
##$ZL1= 120
##$ZL2= 120
##$ZL3= 120
##$ZL4= 120
##$ABSF1= 10
##$ABSF2= 0
##$ABSG= 5
##$ABSL= 3
##$ALPHA= 0
##$AQORDER= 0
##$ASSFAC= 0
##$ASSFACI= 0
##$ASSFACX= 0
##$ASSWID= 0
##$AUNMP= <proc_1d>
##$AXLEFT= 0
##$AXNAME= <>
##$AXNUC= <off>
##$AXRIGHT= 0
##$AXTYPE= 0
##$AXUNIT= <>
##$AZFE= 0.1
##$AZFW= 0.1
##$BCFW= 1
##$BC_mod= 2
##$BYTORDP= 0
##$COROFFS= 0
##$CY= 15
##$DATMOD= 1
##$DC= 2
##$DFILT= <>
##$DTYPP= 0
##$F1P= 0
##$F2P= 0
##$FCOR= 0.5
##$FTSIZE= 0
##$FT_mod= 4
##$GAMMA= 1
##$GB= 0
##$INTBC= 1
##$INTSCL= 1
##$ISEN= 128
##$LB= 0.3
##$LEV0= 0
##$LPBIN= 0
##$MAXI= 10000
##$MC2= 0
##$MEAN= 0
##$ME_mod= 0
##$MI= 0
##$NCOEF= 0
##$NC_proc= -9
##$NLEV= 6
##$NOISF1= 0
##$NOISF2= 0
##$NSP= 1
##$NTH_PI= 0
##$NZP= 0
##$OFFSET= 14.56039
##$PC= 1
##$PHC0= 0
##$PHC1= 0
##$PH_mod= 0
##$PKNL= yes
##$PPARMOD= 0
##$PPDIAG= 0
##$PPIPTYP= 0
##$PPMPNUM= 2147483647
##$PPRESOL= 1
##$PSCAL= 4
##$PSIGN= 0
##$PYNMP= <proc.py>
##$REVERSE= no
##$SF= 90.2741445730333
##$SI= 8192
##$SIGF1= 0
##$SIGF2= 0
##$SINO= 400
##$SIOLD= 32768
##$SPECTYP= <>
##$SREGLST= <1H.CDCl3>
##$SSB= 0
##$STSI= 0
##$STSR= 0
##$SW_p= 1497.18866228788
##$SYMM= 0
##$S_DEV= 0
##$TDeff= 0
##$TDoff= 0
##$TI= <>
##$TILT= no
##$TM1= 0
##$TM2= 0
##$TOPLEV= 0
##$USERP1= <user>
##$USERP2= <user>
##$USERP3= <user>
##$USERP4= <user>
##$USERP5= <user>
##$WDW= 1
##$XDIM= 8192
##$YMAX_p= 1206545920
##$YMIN_p= -1627136
##$CURPLOT= <PDFCreator>
##$CURPRIN= <$PDFCreator>
##$DFORMAT= <normdp>
##$LAYOUT= <+/1D_H.xwp>
##$LFORMAT= <normlp>
##$PFORMAT= <normpl>
##$SURQMSG= 1
$$ End of Bruker specific parameters
$$ ---------------------------------
##XUNITS= HZ
##YUNITS= ARBITRARY UNITS
##XFACTOR= 0.182762287876938
##YFACTOR= 1
##DELTAX= -0.182762287876938
##NPOINTS= 8192
##FIRSTX= 1497.0059
##FIRSTY= -551424
##LASTX= 0
##MAXY= 1206545920
##MINY= -1627136
##XYDATA= (X++(Y..Y))
$$ plain form
8191 -551424 384512 626688 1187328 -342528 -820736 302592 -302080 403968 287744 430080
8181 430080 -243200 400896 -130560 -925184 -696832 631808 647168 -132096 -310272 -280576
8171 -280576 -219136 824320 -158720 -342016 -236544 382976 692224 1323520 -798720 -46592
8160 -405504 -889856 1213952 889856 486400 631296 845824 305664 1202176 30208 -750080
8149 1072128 310272 757248 -122368 458240 1119744 241152 -366592 296960 307712 220160
8139 220160 131072 -517120 554496 -47104 -696832 -371200 397824 -262144 -1068544 -344064
8128 270336 -38400 570368 1241088 -241152 565248 1016320 221696 -520704 -175104 260096
8117 55296 835072 258560 508928 301056 -194048 601600 -82944 289280 118784 50176
$$ packed form
8191e51424C84512K42176N60640c42528m78208C02592c02080D03968j16224J42336
8181D30080b43200D00896a30560p94624K28352F31808J5360a32096j78176K9696
8171b80576O1440H24320a58720j83296J05472C82976L09248O31296g98720d6592
8160d05504m84352A213952l24096m03456J44896K14528C05664Q96512C0208g50080
8149A072128C10272M46976a22368D58240O61504B41152c66592B96960J0752q7552
8139B20160q9088e17120E54496d7104o49728L25632C97824b62144q06400c44064
8128B70336c8400E70368O70720b41152E65248M51072B21696e20704a75104B60096
8117E5296P79776B58560K50368k07872a94048F01600h2944B89280A18784E0176
$$ plain form
8106 -70656 771072 196608 367616 104448 539648 -405504 -185856 65024 412672 -48640
8095 -504320 176128 34304 -256000 335872 -518144 -846336 22528 388608 186368 90624
8084 510976 1079808 335872 -278528 -658944 177152 -778240 -258560 1394176 266752 337920
8074 337920 535040 -252416 839168 -126464 -240640 497664 244736 -44032 -31744 108544
8063 921088 -949248 -498688 74240 259072 -71680 893952 -286720 408064 206336 580096
8053 580096 139776 -303616 -31232 -264192 209408 464384 -87552 75776 55296 -65536 552448
8041 786944 534528 -202752 125440 -163840 420864 492544 -324608 337920 48128 455168
8031 455168 -586240 408064 -792064 219648 -861696 -900608 -53760 -137728 579072 143360
$$ packed form
8106g0656G71072A96608J71008A04448M35200d05504a85856F5024L47648d8640
8095e04320A76128C4304b56000C35872e18144l28192B2528L66080A86368I0624
8084E10976N68832C35872b78528l80416A77152g78240b58560A394176B66752P1168
8074C37920J97120b52416H39168a26464j14176D97664B44736d4032J2288A08544
8063I21088i49248M50560G4240J84832g1680H93952b86720D08064k01728L73760
8053E80096A39776c03616c1232k32960B09408K54976h7552G5776k0480f5536E52448
8041G86944k52416b02752A25440a63840D20864P1680c24608C37920D8128M07040
8031D55168e86240D08064g92064B19648h61696l8912e3760q3968E79072A43360
$$ plain form
8020 752128 455168 -209920 502272 126464 1507328 349184 -132608 385536 471552 -780800
8009 265216 -227328 1096704 187392 -510976 381440 -954880 460288 1299968 -365056 286208
7998 907264 97792 163840 270336 -880128 -1182208 192512 -524800 -538112 45056 485376
7988 485376 77312 1028096 -412672 1231872 77312 1203200 -483840 -148992 -183808 256000
7977 -90624 142336 646656 -70656 -1080832 646144 519680 1530880 52224 423936 -389120
7966 -791040 691200 819712 108544 -807936 107008 -765952 1328128 -244224 319488 222720
7956 222720 693248 -114688 -203264 15872 -23040 406528 480768 174592 -418304 415744
7945 196608 264192 -322560 931328 -485888 140288 536064 352768 -77824 -126976 176128
$$ packed form
8020G52128k96960b09920E02272A26464J380864C49184a32608C85536Q6016g80800
8009B65216b27328A096704A87392e10976C81440i54880D60288Q39680c65056B86208
7998I07264I7792O6048J06496h80128l02080A92512e24800j3312D5056M40320
7988D85376G7312R50784d12672A231872G7312J125888d83840a48992l4816B56000
7977i0624A42336N04320g0656j010176F46144j26464J011200E2224L71712c89120
7966g91040F91200J28512A08544h07936A07008g65952A328128b44224C19488r6768
7956B22720M70528a14688q8576A5872b3040D06528P4240A74592d18304D15744
7945A96608O7584c22560I31328d85888A40288L95776j83296g7824m9152A76128
$$ plain form
7934 73728 263168 -202752 -607744 313344 -184320 1652736 594432 -282624 308224 1582592
7924 1582592 512 115712 -631296 150016 -41984 -936448 -205824 -38400 -829440 921600
7913 -920576 854528 -293376 350720 441856 -364032 821760 -956928 392704 306688 -321536
7902 -538624 238592 937984 -333312 246784 -312832 772096 166400 -3584 -596992 1026048
7891 230400 -185856 530944 423424 -790528 266240 -643072 -737280 130560 -314368 170496
7880 -260096 565760 -419840 394752 964608 352256 361472 -525312 343552 525312 692736
7870 692736 -46592 451072 535552 -1067520 685056 818176 -702464 69632 76800 348160
7860 348160 850944 -635904 -228352 501248 973312 -42496 727040 -90624 311808 159232
$$ packed form
7934G3728J89440b02752m04992C13344a84320A652736E94432b82624C08224J274368
7924A582592E12J15200f31296A50016d1984q94464b05824c8400p91040I21600
7913i20576H54528b93376C50720R1136c64032H21760i56928C92704q6016c21536
7902e38624B38592O99392c33312B46784c12832G72096A66400c584n93408A026048
7891B30400a85856E30944j07520g90528B66240f43072r4208A30560c14368A70496
7880b60096E65760d19840C94752N69856C52256R216e25312C43552J81760J67424
7870F92736d6592D51072Q4480a067520F85056J33120g02464F9632P168K71360
7860C48160N02784f35904b28352E01248M72064d2496G27040i0624C11808j52576
$$ plain form
7850 159232 396288 664064 783872 5120 -67584 -300544 -431616 665088 714752 -260608
7839 -292864 776704 -235520 920576 599552 145920 714752 70656 -320512 571392 593920
7829 593920 -169472 -104960 859648 1241088 603136 -834048 1229312 201216 244224 -464384
7818 -676864 1097728 360448 -207360 -495616 433152 798208 376320 -116224 586752 825344
7808 825344 -308736 -353280 -19968 58368 -328192 443904 -590336 -67584 252928 500224
7798 500224 -856576 1073152 -1183232 -159232 -14336 958976 -538624 892416 809472 338944
7787 -54272 557056 1345024 168448 195072 -1011200 -202240 -625152 50688 800768 800768 420864
7776 420864 129024 499200 -526848 286720 215040 -126976 -48128 -188928 145408 333312
$$ packed form
7850A59232K37056K67776J19808E120f7584k32960j31072F65088M9664b60608
7839b92864G76704b35520I20576l21024A45920N68832G0656c20512E71392K2528
7829E93920a69472O4512H59648L81440F03136h34048A229312B01216M3008d64384
7818f76864A097728C60448b07360k88256D33152L65056C76320a16224E86752K38592
7808H25344c08736m4544a9968E8368c28192D43904e90336f7584B52928K47296
7798E00224h56576A073152a183232a59232a4336I58976e38624H92416q2944C38944
7787e4272E57056P87968A68448K6624a011200b02240m22912E0688P50080%l79904
7776D20864A29024L70176e26848B86720p1680a26976d8128j40800A45408J87904
$$ plain form
7766 333312 -36864 -223744 -514048 206848 551424 124416 107520 388608 373760 1077760
7756 1077760 431616 -38400 275968 -554496 1747456 -439808 -225280 -483328 -448512 257536
7745 1189888 -244736 786944 256512 -1022464 -319488 -497664 -134144 187904 632320
7736 632320 212992 -347648 -475648 -966144 906752 547328 435200 -780288 15872 716800
7726 716800 -231424 621056 -583168 667136 631808 795136 594432 315904 230400 1179648
7716 1179648 176128 34816 440832 -110080 -598016 52224 -933888 -92672 -266752 262144
7705 1240576 -75264 736768 -293376 466432 -125440 851968 -108032 830464 863232 -286208
7694 296960 509440 294912 290816 15872 52224 -19456 687616 646144 -103936 504320 1209344
$$ packed form
7766C33312c6864j86880k90304B06848L44576A24416j6896K81088j4848P04000
7756A077760D31616c8400B75968e54496A747456d39808K14528k58048L4816B57536
7745A189888b44736G86944B56512a022464c19488j78176a34144A87904M44416
7736F32320B12992c47648j28000m90496I06752l59424j12128g80288A5872P00928
7726G16800b31424F21056e83168F67136l5328J63328k00704k78528q5504R49248
7716A179648A76128C4816M06016a10080m87936E2224i33888i2672j74080B62144
7705A240576g5264G36768b93376D66432a25440H51968a08032H30464L2768b86208
7694B96960K12480k14528m096A5872L6352a9456F87616m1472a03936E04320P05024
$$ plain form
7683 1209344 -241152 -9216 -389120 -29696 -1028608 -4608 10240 -706048 7680 642048 -345600
7671 1226752 117248 1561088 22528 -586240 198144 402944 593408 -91136 1057280 -690688
7660 409600 173056 -219648 -962048 -230912 -723456 -387584 209408 1175040 544256 162304
7649 -328192 161280 -88064 1050112 432640 -1046016 -186368 200704 -491008 494592 244224
7638 757760 -77312 -59392 385536 399360 709120 903680 1003008 106496 9216 772608 133632
7626 -175616 88576 444416 594432 897024 603648 244736 470016 -618496 -860160 482816
7615 -186880 -522240 272896 895488 437760 -799232 109056 -151552 -209408 477184 171008
7604 1453568 -274944 217600 280576 -249856 -659968 185344 251392 1268736 -140288 1297408
$$ packed form
7683A209344b41152i216l79904b9696r98912d608A0240g06048G680O34368c45600
7671A226752A17248J443840B2528e86240A98144K04800J90464i1136A057280f90688
7660D09600A73056b19648p42400b30912m92544L35872B09408R65632E44256A62304
7649c28192A61280h8064A050112D32640a046016a86368B00704d91008D94592B44224
7638G57760g7312J7920C85536J3824L09760J94560R9328A06496I216P63392A33632
7626a75616H8576L55840J50016L02592k93376B44736K25280f18496k41664D82816
7615a86880l35360B72896O22592D37760g99232A09056a51552n7856D77184A71008
7604A453568b74944B17600O2976b49856m10112A85344O6048J017344a40288A297408
$$ plain form
7593 54272 844288 290304 1139712 1194496 240128 1164800 570880 -99328 -372224 -412672
7583 -412672 1247232 317440 -432640 747008 169984 696832 12288 -462848 148992 390144
7573 390144 -345600 518144 565760 532480 555520 -103424 -40960 -539136 -212480 -20992 518144
7561 766976 666624 693760 -109568 566272 595456 648192 992768 638464 308224 164864
7551 164864 411136 -393728 603648 -451584 -268800 -737792 553984 1209344 -587776 -72192
7540 73728 815616 844288 81920 1944064 -104448 -188416 823296 -901120 -651776 794112
7529 569344 132608 1119744 -95744 95744 -299008 -380416 -320000 -438272 -652288 485376
7518 -37376 1146880 405504 982016 200704 87040 -447488 839680 694272 500736 183296
$$ packed form
7593E4272P90016B90304Q49408N4784B40128R24672E70880i9328k72896m0448
7583d12672A247232C17440d32640G47008A69984N26848A2288d62848A48992K41152
7573C90144c45600E18144M7616l3280K3040a03424d0960m98176b12480b0992E18144
7561G66976j00352K7136a09568E66272K9184N2736L44576l54304C08224j43360
7551A64864K46272c93728F03648d51584J82784m68992E53984O55360e87776g2192
7540G3728P41888K8672H1920J862144a04448q3968H23296i01120K49344G94112
7529E69344A32608R87136i5744I5744b99008q1408O0416j18272k14016D85376
7518c7376A146880D05504N76512B00704H7040d47488H39680j45408j93536A83296
$$ plain form
7507 364544 449024 -576000 -854528 635392 673280 805888 126464 630272 -299520 222720
7496 -34304 1249792 -76800 -985600 753664 132608 634368 106496 -289280 338944 -353792
7485 704000 -78848 194560 957952 -413696 -71168 -247808 115712 773632 -459264 480768
7474 344064 10240 847360 409600 567808 923648 -341504 -90112 -437248 -77312 -112640
7464 -112640 150016 -46080 13824 117248 -752640 -176640 696320 -700416 556544 901632
7454 901632 28160 -259584 432640 2048 -482304 390144 -259072 -789504 -628224 436736
7443 -801280 266752 46592 -402432 -1013248 416768 624640 126464 504320 1767936 -266752
7432 -275456 639488 453120 24064 260608 -1278464 -243200 962048 436736 189440 1958912
$$ packed form
7507C64544Q4480e76000k78528F35392L7888J32608A26464N03808b99520B22720
7496c4304A249792g6800r08800G53664A32608N01760A06496b89280C38944c53792
7485G04000g8848A94560P63392d13696g1168j76640A15712O57920d59264D80768
7474C44064A0240Q37120D09600J58208L55840c41504i0112l47136g7312l5328
7464a12640A50016d6080A3824J03424g52640a76640F96320g00416E56544L45088
7454I01632B8160b59584D32640B048d82304C90144b59072n30432J61280D36736
7443h01280B66752D6592d02432o10816D16768K07872A26464L77856J263616b66752
7432b75456F39488j86368B4064K36544a278464b43200I62048D36736A89440J769472
$$ plain form
7422 1958912 -893952 -43008 -854016 628736 893952 918528 113152 781824 704000 -351232
7411 -8192 964608 -160768 163328 436224 618496 420864 -323072 -660480 153088 -1060352
7400 -26112 269312 606720 1240576 181248 -152064 800768 857088 352256 363520 -72704
7389 631296 -808448 228352 428032 200704 1273856 792064 -122368 121344 285184 -585216
7378 357376 656896 528384 -740864 599552 151040 148480 279552 1035264 -220160 -543232
7368 -543232 279040 -252416 99328 591360 729088 48640 -833024 -360448 1147392 28160
7357 521216 641024 596992 -11776 937472 101888 -237568 126976 -19456 -764416 1034240
7346 335360 1024 -934912 125952 -227328 -67584 -87040 228352 -134656 -82944 502784 -258560
$$ packed form
7422A958912h93952d3008q11008F28736K65216K4576A13152O68672p7824c51232
7411h192I64608a60768A63328K72896J82272j97632c23072l37408A53088a060352
7400b6112B69312L37408O33856A81248a52064H00768N6320C52256J1264g2704
7389F31296h08448B28352J99680B00704J073152m81792a22368A21344J63840e85216
7378C57376K99520j28512g40864E99552A51040k560J31072P55712b20160l23072
7368e43232B79040b52416I9328M92032J37728D8640h33024c60448A147392B8160
7357E21216J19808m4032a1776I37472A01888b37568A26976a9456p44960A034240
7346C35360A024i34912A25952b27328f7584j9456B28352a34656N1712E02784b58560
$$ plain form
7334 313856 -9216 1140224 22528 58368 75264 180224 570368 921600 41472 158720 -330240
7322 133632 969728 535552 660480 -760320 -14848 -535552 330752 -318464 924160 409600
7311 1122304 -66048 -76288 368640 -595456 1361920 1587712 500736 5120 467456 1047552
7301 1047552 1140736 780800 212992 197632 593920 563712 -1182720 574464 -496128 386560
7290 -33280 -348672 1040384 260096 821248 895488 968192 103936 420864 626176 294400
7279 1279488 -1328640 -262144 -87040 665088 1047552 190976 842752 -37888 229888 -148992
7268 50176 495104 -877056 727552 250880 707072 -847872 538112 470016 961536 323584
7257 581632 118784 221696 664576 442368 424448 351744 -428544 222720 -45568 -225280
$$ packed form
7334C13856i216A140224B2528L5840J6896J04960L90144L51232D1472J17248c30240
7322A33632Q36096m34176J24928g60320a4848n20704C30752c18464I24160D09600
7311A122304f6048j0240C68640e95456A361920K25792E00736E120M62336N80096
7301A047552R3184l59936B12992j5360L96288l0208a182720E74464d96128C86560
7290c3280l15392A040384B60096N61152P4240P2704A03936L16928K05312B94400
7279A279488a328640b62144h7040F65088L82464A90976O51776c7888B29888a48992
7268E0176M44928h77056G27552B50880M56192h47872E38112o8096M91520C23584
7257E81632A18784J02912M42880k22208j7920p2704d28544B22720d5568j79712
$$ plain form
7247 -225280 1169920 1316864 1203200 206336 -403968 -406016 -326144 731136 302592 1002496
7237 1002496 1069568 590848 -347136 91648 161280 -235520 -1094144 1454080 -87040 692224
7226 -156672 -279040 -395776 360960 849920 610816 865792 -362496 1414656 -600576 443904
7215 469504 -237056 567296 1244672 -806400 -168960 748032 766464 1491456 566784 555520
7205 555520 -503808 557568 -196608 864768 -214016 494592 478208 -35328 58368 -107008
7194 693248 100352 -307712 311808 1220608 49152 310784 267264 194560 973824 636928
7184 636928 314880 575488 -464896 834560 -118784 -747520 -294400 -197632 1060352 114688
7173 412160 276480 761856 492032 1016320 -958976 207872 350208 523264 13824 133120
$$ packed form
7247b25280A169920J46944j13664B06336d03968k048P9872G31136C02592O99904
7237A002496O7072m78720c47136I1648O9632b35520q58624A454080h7040F92224
7226a56672j22368j16736C60960M88960k39104K54976c62496A414656f00576D43904
7215D69504b37056E67296O77376h06400a68960G48032J8432P24992E66784j1264
7205E55520e03808E57568a96608H64768b14016D94592j6384c5328E8368a07008
7194F93248A00352c07712C11808R08800D9152K61632m3520p2704P79264l36896
7184F36928C14880K60608d64896H34560a18784o28736b94400R6768A060352A14688
7173D12160j35680M85376k69824N24288i58976B07872J42336J73056A3824J19296
$$ plain form
7163 133120 852992 512 411136 453632 547328 -222208 -700416 -716800 965632 333312 845312
7152 845312 150016 156672 199680 440320 754688 -517632 -411136 424448 461312 806912
7142 806912 1478144 1165824 798720 756736 439296 -612864 402944 758784 172032 283136
7132 283136 1031168 -1000960 279552 336384 352768 531456 307200 -716288 269824 23552
7121 847360 -81920 -195584 -615424 745984 761856 128512 199680 1128960 1456128 456704
7110 -371200 129024 258048 342528 282112 202752 412160 915456 446464 -1051136 -169472
7099 -1242624 558592 202752 129536 450048 392192 -489984 531456 633856 426496 -36864
7088 -13312 551424 -204288 -158720 974848 -45056 325632 -1026048 588288 -40448 624640
$$ packed form
7163A33120P19872E12M10624M2496R3696b22208m78208j6384I65632C33312N12000
7152H45312A50016O656M3008K40640L14368e17632J06496D24448L6864L45600
7142H06912O71232l12320l67104m1984l17440f12864D02944L55840A72032J11104
7132B83136P48032a000960B79552N6832J6384J78688k24256g16288B69824B3552
7121H47360h1920j13664m19840G45984J5872A28512P1168R29280L27168D56704
7110c71200A29024J29024Q4480o0416p9360K09408N03296D46464a051136a69472
7099a242624E58592B02752p3216L20512n7856d89984E31456J02400k07360c6864
7088a3312E51424b04288M5568I74848d5056C25632a026048E88288d0448F24640
$$ plain form
7077 9216 -104960 184320 -64000 423936 196608 1420800 448000 -84480 1085440 61952
7066 184320 1258496 683008 5120 681984 -165888 92672 -129024 42496 1705472 -163840
7055 -157184 532480 -502784 -146944 1080832 729600 572416 614400 443392 1191936 -395264
7044 444416 -797184 451584 475136 417280 1167872 267264 15360 -161280 812544 1268224
7034 1268224 683520 505344 551936 401920 448512 811008 252416 437760 -101888 -66048
7024 -66048 -41984 -605696 164864 -198656 295424 705024 1266688 271360 869888 1383424
7014 1383424 110592 763904 -272384 378368 1052160 -473088 662528 742912 -372736 900096
7003 536064 944640 523264 399360 770560 419328 138752 609280 757248 -279552 -89088
$$ packed form
7077I216a04960A84320f4000D23936A96608J224192D48000h4480A085440F1952
7066A84320J074176n75488E120O76864a65888I2672a29024D2496J662976a63840
7055a57184E32480e02784a46944A080832l51232j57184M1984j71008P48544c95264
7044D44416g97184D51584K3552n7856P50592B67264A5360a61280H12544M55680
7034A268224n84704j78176M6592j50016M6592L62496B52416J85344a01888L5840
7024f6048K4064n63712A64864a98656B95424M09600N61664B71360N98528N13536
7014A383424A10592O53312b72384C78368O73792d73088F62528Q0384c72736I00096
7003E36064M08576m21376j23904L71200l51232A38752M70528J47968b79552h9088
$$ plain form
6992 335360 546304 -924160 80896 1126912 -927744 1129984 266240 1074176 412160 859136
6982 859136 88064 1450496 541696 154624 472576 -176128 288256 -369664 320000 564224
6972 564224 525824 514560 -71168 664576 -493056 1501184 -381440 1089536 193024 908800
6962 908800 995328 -394752 -120832 53248 1305600 -28160 648192 1364480 275456 561152
6952 561152 57856 662528 1700352 1258496 175104 418304 232960 -1107456 735744 456192
6942 456192 637952 1347584 374784 54784 -531456 172032 222208 -516608 -216576 -293888
6932 -293888 82432 314368 986112 35328 413184 -233984 120832 -879104 1253376 455680
6921 1355264 -34816 428544 516608 406528 -254976 985088 -279552 1139200 331264 1610752
$$ packed form
6992C35360K10944i24160H0896J046016i27744A129984B66240Q07936D12160M46976
6982H59136H8064J362432E41696A54624L17952a76128B88256c69664C20000K44224
6972E64224l8400j1264g1168F64576d93056A501184c81440A089536A93024P15776
6962I08800Q6528c94752a20832E3248J252352b8160F48192P16288B75456K85696
6952E61152E7856O04672J037824m41856A75104K43200j85344a107456G35744k79552
6942D56192J81760P09632C74784E4784e31456A72032N0176e16608b16576p7312
6932b93888H2432K31936O71744C5328L77856b33984A20832h79104A253376D55680
6921A355264c4816D28544Q8064j10080b54976I85088b79552A139200C31264J279488
$$ plain form
6911 1610752 186368 339968 219136 505344 420864 573952 814592 217088 1082368 -140288
6900 -555008 259072 227328 395776 985088 94208 86016 566272 -417792 984576 541696
6890 541696 324096 916480 366080 489472 387072 514560 713216 202752 195072 361984
6880 361984 646144 658432 -305664 139264 -561664 731648 418304 -222720 -314880 1024000
6869 558080 346112 355840 -89600 247808 90112 1232384 530432 217088 -237056 945664
6858 262656 215552 878080 41472 471552 -77312 407040 631808 1196032 -671744 770560
6847 -157184 143360 455680 569344 -62464 258048 -38912 -380416 135680 -561152 585728
6836 59904 214528 1042944 280576 -769536 42496 1117184 177664 216576 -505344 50176
$$ packed form
6911A610752A86368J53600j20832K86208q4480J53088K40640B17088Q65280a40288
6900e55008B59072l1744J68448N89312I4208q192M80256d17792I84576m42880
6890E41696k17600N92384C66080J23392j02400J27488J98656B02752p680J66912
6880C61984K84160J2288c05664A39264e61664G31648l13344b22720r2160A024000
6869E58080k11968R728h9600B47808I0112J142272E30432B17088b37056I45664
6858B62656m7104O62528D1472M30080g7312D07040K24768N64224f71744G70560
6847a57184A43360L12320J13664f2464B58048c8912l41504A35680e61152E85728
6836E9904J54624Q28416B80576g69536D2496J074688A77664L8912e05344E0176
$$ plain form
6825 58368 -166400 1588736 -147968 982016 326656 130560 1599488 293888 485376 806912
6815 806912 757248 -513536 -809984 293376 764416 470016 438272 -392704 -157696 638464
6804 680448 -16384 211968 51712 -420864 -6656 -409600 665088 -253952 385024 306176 889344
6793 889344 -456704 -519680 -39424 391168 1455104 1260032 966144 207360 706048 1051136
6783 1051136 183808 -118784 -295424 374272 -62464 481280 820736 298496 1045504 122368
6772 627200 371712 270336 -489472 -124416 232448 384000 1530880 126976 435200 202240
6761 -13312 265216 1437184 958976 1027584 -471040 223232 1177600 145408 719872 29184
6750 -698368 237056 217088 -809472 -133120 -747008 -449024 1627136 -161280 -694784 667136
$$ packed form
6825E8368a66400A588736a47968I82016C26656A30560J468928B93888J91488L21536
6815H06912m9664e13536k96448B93376M71040k94400l1744c92704a57696F38464
6804F80448a6384B11968E1712d20864f656m02944F65088b53952C85024p8848N83168
6793H89344d56704o2976c9424C91168J063936j95072k93888B07360M98688L45088
6783A051136A83808a18784j76640C74272f2464D81280L39456B98496P47008A22368
6772F27200k55488j01376d89472a24416B32448J51552J146880A26976L08224B02240
6761a3312B65216J171968m78208O8608d71040B23232R54368A45408N74464B9184
6750f98368B37056j9968h09472a33120o13888K97984A627136a61280n33504F67136
$$ plain form
6739 411136 252416 814080 10752 -709120 -1627136 634880 1154560 99328 666112 431104
6729 431104 844288 522752 -192000 -4608 457216 -615424 318464 143872 319488 458752
6719 458752 -76800 387584 434176 1156096 593920 95232 361984 618496 -124416 1558528
6708 -1118208 469504 143872 -712704 178176 1767936 375808 761856 -260608 158720
6698 56320 468480 130560 120320 294400 858112 171520 1299968 -496640 -88064 469504
6687 1863168 -405504 775680 -742912 1480192 261632 317440 551424 -165888 739840 996352
6677 996352 2342400 -82432 442368 157184 -510464 651264 705536 72704 -5120 820224
6666 -142848 -319488 210944 103936 -398848 743936 303616 -223744 -436736 1564160 -1050624
$$ packed form
6739D11136j58720N61664A0752g09120r18016F34880N19680I9328N66784k35008
6729D31104M13184l21536a92000d608D57216f15424C18464A43872J75616J39264
6719D58752g6800C87584M6592P21920n62176I5232K66752K56512a24416A558528
6708a118208D69504A43872g12704A78176J589760C75808L86048b60608A58720
6698E6320M12160A30560j0240J74080N63712A71520J128448d96640h8064D69504
6687A863168d05504G75680g42912A480192B61632N5808K33984a65888G39840K56512
6677I96352J346048h2432D42368A57184e10464F51264N4272G2704e120H20224
6666a42848j76640B10944A03936c98848G43936C03616b23744k12992A564160a050624
$$ plain form
6655 1276928 38912 49152 179712 1366528 -285184 1026048 47104 -659456 1170944 300032
6644 468992 354304 203776 662016 -501248 447488 1078272 1006592 -213504 -124416 -576512
6634 -576512 273408 1098240 1084416 17920 157184 901632 962048 342528 1369600 78336
6623 -478208 471552 -563200 -551424 -80384 -386560 346624 269312 -51200 -318464 655872
6612 1195520 408576 1050112 396288 401920 394752 610304 -401920 255488 708608 729600
6602 729600 629248 1167360 -29184 -316928 -95744 -214016 -248320 1523200 204800 500224
6592 500224 697344 1289216 120320 528896 -491008 870400 395264 -193536 1319936 1038848
6582 1038848 -9728 -120320 -599040 -501760 -816640 -78848 456704 -840704 -488960 -221184
$$ packed form
6655A276928C8912J0240J30560J186816b85184A026048D7104f59456A170944C00032
6644D68992j14688j50528M58240e01248D47488O30784p1680b13504Q9088m52096
6634e76512B73408Q24832j3824A7920J39264P44448O0416C42528J027072G8336
6623d78208D71552e63200J1776h0384l06176C46624p7312e1200k67264F55872
6612A195520D08576O41536C96288N632p168K15552d01920B55488M53120K0992
6602G29600j00352N38112b9184k87744i5744j18272l4304A523200B04800K95424
6592E00224J97120N91872A20320M08576d91008H70400C95264a93536A319936k81088
6582A038848i728j10592m78720R7280l14880g8848D56704h40704L51744b21184
$$ plain form
6571 794624 1161216 371712 734720 757248 1024000 -307200 246784 -58368 520192 48640
6560 128000 630784 218112 359936 573952 77824 1305088 815104 1186304 90112 430592
6550 430592 707072 724480 974336 494080 100864 431104 292352 489984 720896 -69120
6539 -299520 -171008 -442880 255488 587776 1058816 1325568 1214976 841216 504832 1341440
6529 1341440 604672 1619968 356352 169984 213504 427008 720896 884736 27648 792064
6519 792064 954368 34304 -25600 769536 -39936 399872 -20992 503808 719872 1130496
6509 1130496 489984 91136 1635840 476672 565760 -206848 424960 -301056 843776 -91648
6498 902656 1049600 366080 -92672 515072 228864 701952 683520 206336 -14336 507392
$$ packed form
6571G94624L66592C71712L63008K2528K66752c07200B46784e8368E20192D8640
6560A28000N02784B18112J41824K14016G7824J227264m89984L71200I0112L40480
6550D30592K76480J7408K49856m80256A00864L30240j38752J97632K30912f9120
6539b99520J28512k71872B55488L32288M71040K66752j10592l73760l36384Q36608
6529A341440F04672J015296C56352A69984M3520K13504K93888J63840B7648P64416
6519G92064J62304C4304b5600G69536c9936C99872b0992E03808K16064M10624
6509A130496D89984I1136J544704D76672Q9088b06848D24960c01056H43776i1648
6498I02656J46944C66080i2672E15072B28864M73088j8432B06336a4336E07392
$$ plain form
6487 386048 198144 918528 299520 97280 514048 685568 568320 439808 563200 529920
6477 529920 -330240 -637952 552448 521728 1112064 1100800 -94208 390144 -68096 1717248
6466 -434688 309248 510464 888832 901120 359936 1012224 521728 650752 952320 858624
6456 858624 -369152 568320 603648 -60928 379392 1262080 518144 -647680 -491008 192512
6445 1717248 1571328 -271360 504320 -770560 592896 1073152 -850432 1227776 460800
6435 -253440 922624 1358336 -459264 1151488 1318912 32768 663040 529408 379392 128512
6424 -87040 1167360 1272832 1400832 986624 76800 -609280 -499200 1273344 161280 132608
6414 132608 858112 1067520 315904 924672 1027072 -477184 1216512 32256 624128 1055232
$$ packed form
6487C86048j87904P20384B99520I7280M16768J71520j17248j28512J23392l3280
6477E29920c30240l07712E52448l0720N90336j1264i4208C90144f8096A717248
6466d34688C09248K01216L78368J2288C59936O52288m90496J29024L01568r3696
6456H58624c69152E68320L5328f0928C79392Q82688E18144f47680J56672A92512
6445A717248j45920b71360E04320g70560E92896M80256h50432A227776D60800
6435b53440I22624M35712d59264A151488J67424C2768O30272j33632j50016A28512
6424h7040A167360J05472J28000m14208G6800f09280J10080A273344A61280k8672
6414A32608P25504K09408C15904O08768J02400d77184A216512C2256N91872M31104
$$ plain form
6404 1055232 -580608 520704 659456 565248 845824 837632 772608 -947200 887296 -189952
6393 791040 72192 323072 639488 -396800 337920 1012736 -4608 309248 240128 257024 149504
6382 149504 -520704 846848 740352 313856 714752 1128960 250368 -71168 1142272 942080
6372 942080 1017856 511488 822272 20480 369152 1042944 370688 366592 471040 -1295360
6361 368640 29184 -194560 -658944 1018368 590336 -848384 184320 -498176 1559552 -381440
6350 -34816 555008 73216 -37888 927744 -258560 623616 987648 -180736 1089024 585728
6340 585728 -404480 184832 1019904 735232 317952 1040384 1064960 164864 1178112 11264
6329 -297984 -4096 135168 -179200 953344 1156608 336384 347648 438784 700928 54784 347648
$$ packed form
6404A055232e80608E20704J38752r4208K80576q192o5024i47200H87296a89952
6393G91040G2192K50880L16416c96800C37920O74816d608C09248o9120J6896j07520
6382A49504e20704H46848j06496C13856M00896M14208B50368g1168A142272k00192
6372I42080P5776n06368L10784B0480L48672O73792C70688m096J04448a295360
6361C68640B9184a94560m64384A018368m28032h48384A84320d98176A559552c81440
6350c4816E55008G3216c7888I27744b58560F23616L64032a80736A089024n03296
6340E85728d04480A84832Q35072k84672C17952P22432K4576A64864J013248A1264
6329b97984d096A35168a79200I53344K03264C36384J1264R1136K62144E4784K92864
$$ plain form
6318 347648 634880 1172480 317440 389632 1919488 548864 350208 612864 1215488 228352
6307 86528 1394688 -114176 -271872 615424 267776 271872 1093120 96768 477696 1131520
6297 1131520 7168 827904 878080 926208 1127424 -65024 -441344 1150976 317952 462848
6287 462848 7168 220160 -22528 516608 1107968 882688 292352 470016 28160 287232
6277 287232 -70656 91136 22016 -1031680 786432 368640 -293376 2229760 1113088 712192
6267 712192 508416 570880 271360 887808 878080 34816 635904 598528 205312 1253376
6257 1253376 973312 897536 439296 1016320 1260032 611840 784896 197632 993792 119296
6246 240128 497664 198656 -311808 361472 757248 -179200 457728 892928 302592 -144896
$$ packed form
6318C47648K87232N37600C17440P2192J529856E48864j98656K62656O02624B28352
6307H6528J308160a14176j57696F15424B67776M096Q21248I6768L80928O53824
6297A131520G168Q20736N0176M8128K01216f5024l76320A150976C17952J44896
6287D62848G168K12992b2528E16608N91360k25280B92352J77664B8160K59072
6277B87232g0656I1136B2016a031680G86432C68640b93376B229760A113088m00896
6267G12192k03776O2464B71360O16448r728C4816O01088l7376B05312J048064
6257A253376k80064p5776D39296N77024K43712F11840J73056A97632P96160A19296
6246B40128K57536A98656c11808C61472L95776a79200D57728M35200C02592a44896
$$ plain form
6235 182272 297472 191488 662528 -359936 411136 -226304 1728512 544256 261120 451072
6225 451072 1291264 412672 1202688 -643584 274944 -126976 636928 163328 824320 1051648
6215 1051648 1104896 378368 -719872 240640 359424 611840 1051648 901632 1459712 1056256
6205 1056256 -559104 156672 735744 200704 223744 827904 891904 778752 1138688 1334784
6195 1334784 522752 1467904 1365504 1104384 1165312 1187840 610304 875520 354304 456704
6185 456704 674304 342528 229376 -7168 1200128 434688 62976 244224 27648 181760
6175 181760 1969152 848896 373248 893440 658432 577536 71168 360448 1157120 1321472
6165 1321472 -771072 1280512 559616 -150528 1467392 551936 332288 -637440 1036800
$$ packed form
6235A82272J15200j05984M71040c59936D11136b26304A728512E44256B61120J89952
6225D51072Q40192D12672P90016f43584B74944a26976F36928A63328O60992K27328
6215A051648N3248C78368g19872B40640J18784K52416M39808j50016N58080m03456
6205A056256e59104A56672N79072B00704K3040O04160O4000j13152L59936J96096
6195A334784E22752R45152j02400k61120O0928K2528n77536K65216C54304J02400
6185D56704K17600l31776j13152g168A200128D34688F2976J81248B7648J54112
6175A81760J787392H48896C73248N20192k35008q0896G1168K89280P96672J64352
6165A321472g71072A280512E59616a50528A467392E51936k19648f37440A036800
$$ plain form
6155 928256 516608 831488 148992 668160 1140736 243200 1559552 612352 541696 815616
6145 815616 582656 83456 794112 187392 175104 36864 608768 238080 916480 -228864
6134 769024 946688 430592 1958912 1540608 1029632 1831424 706560 933888 1796608 1433600
6124 1433600 960512 583168 314880 84992 -111616 266240 153088 988672 1024 1344000
6114 1344000 969216 1228288 367616 573952 961536 943616 1051648 2150400 -595968 -587264
6104 -587264 201728 1305600 168960 1061376 1402880 918016 753664 -187904 1416192
6094 776192 204288 117248 353792 701952 445440 1281024 1329664 250368 908800 -166912
6083 1049088 705024 120320 313344 -417792 827392 1264640 1183744 174080 359424 431616
$$ packed form
6155I28256m11648L14880A48992N19168M72576B43200J316352F12352p0656K73920
6145H15616k32960H3456P10656A87392j2288C6864N71904B38080O78400b28864
6134G69024J77664D30592J528320m18304n10976Q01792G06560K27328Q62720l63008
6124A433600m73088l77344k68288H4992a11616B66240j13152Q35584A024J342976
6114A344000l74784K59072C67616K06336L87584j7920J08032J098752e95968Q704
6104e87264B01728J103872A68960Q92416L41504m84864j64352a87904A416192
6094G76192B04288q7040K36544L48160k56512Q35584M8640B50368O58432a66912
6083A049088l44064A20320J93024d17792H27392M37248q0896A74080J85344P2192
$$ plain form
6073 431616 47104 -479232 1291776 1548800 35840 -56320 641536 706560 477696 868864
6063 868864 -570880 1671680 74240 735232 450048 702464 -210944 376320 -238080 711680
6052 542208 -146432 -110080 767488 -75776 1596928 -150528 514560 117760 13824 519680
6042 519680 697344 920064 415744 325120 -124928 1017856 933376 1081344 -77824 38912
6031 1338880 405504 198656 646656 1329152 775680 751616 1263616 1291776 1394688 -120832
6020 1406976 -631808 1259008 1150976 888320 1185792 716800 322560 530944 574464 972800
6010 972800 44544 817152 629248 372736 403968 915968 -136704 1088512 -164352 1346560
5999 -98816 1141248 1010176 1418240 1058304 -421888 -591872 415232 1282560 722944 583680
$$ packed form
6073D31616D7104d79232A291776K57024C5840e6320F41536O5024k28864L91168
6063H68864e70880A671680G4240O60992k85184K52416b10944C76320b38080G11680
6052E42208a46432L6352G67488g5776A596928a50528E14560A17760A3824N05856
6042E19680J77664K22720D15744r0624a24928A017856q4480J47968g7824C8912
6031A338880D05504A98656M48000O82496n53472k4064N12000K8160J02912a20832
6020A406976f31808A259008j08032k62656K97472m68992C22560K08384M3520L98336
6010I72800D4544P72608j87904k56512L1232N12000a36704A088512a64352A346560
5999i8816A141248j31072M08064l59936d21888j69984D15232Q67328n59616j39264
$$ plain form
5989 583680 738304 365568 567296 168448 532480 -37376 101376 1015808 1159168 249856
5978 830464 827904 431104 602112 397312 519680 467968 1290752 325120 739328 760832
5968 760832 585728 635904 607744 1049600 1122304 1247744 647680 -111104 302592 1417216
5958 1417216 82432 1190912 429568 399360 -970240 540160 -120320 281600 282112 91136
5947 141824 1412096 657408 1368576 408064 695808 1243136 202240 -578048 619008 498688
5937 498688 -61952 -916480 160256 1060352 777728 1201152 487424 336384 1064448 609792
5927 609792 915968 -691200 350720 482304 1084416 578560 1467904 553984 -236544 1418752
5916 924160 1758208 1556992 677376 317440 884736 99840 837632 1201664 1080832 722432
$$ packed form
5989E83680J54624C65568K01728A68448L64032c7376A01376R14432J43360B49856
5978H30464k560l96800J71008k04800J22368n1712Q22784C25120M14208K1504
5968G60832j75104N0176k8160M41856P2704J25440o00064a11104C02592J114624
5958A417216H2432J108480D29568l0208i70240E40160a20320B81600N12I1136
5947A41824J270272F57408P11168D08064K87744N47328B02240e78048F19008j20320
5937D98688f1952q54528A60256R00096k82624M23424D87424j51040P28064m54656
5927F09792L06176f91200C50720J31584O02112n05856Q89344E53984b36544A418752
5916I24160Q34048k01216F77376C17440N67296I9840P37792L64032j20832l58400
$$ plain form
5906 722432 1059840 373760 -292352 583168 1361408 433664 646656 1912320 520192 904704
5896 904704 94720 1129984 975872 815616 1020416 431616 1185280 -158208 344064 -142848
5885 941056 -311808 721408 292352 1127424 -208896 977920 426496 206848 609280 1125888
5875 1125888 352768 438784 1298432 395776 1021952 763904 271360 -19456 -11776 1470976
5864 1286656 -81920 748032 652288 736256 628736 729600 184832 231424 1157120 958464
5854 958464 -57856 304640 -69632 743424 1749504 548352 239104 551424 -30208 1146880
5843 1474048 323072 328704 2446336 424960 1257472 603136 -233472 1094656 724992 804864
5833 804864 670208 113664 458752 484864 730624 1590784 567296 -409088 710656 847872
$$ packed form
5906G22432L37408C73760b92352E83168P78240D33664K12992J265664E20192L84512
5896I04704I4720J035264j54112j60256K04800D31616P53664a58208C44064a42848
5885I41056c11808G21408B92352Q35072b08896I77920D26496B06848M02432N16608
5875A125888C52768Q6016Q59648C95776O26176k58048B71360a9456P680A470976
5864A286656h1920G48032r5744Q3968j07520J00864A84832M6592R25696j98656
5854I58464e7856C04640f9632G43424J006080E48352B39104L12320c0208A146880
5843A474048C23072N632K117632D24960Q32512F03136b33472A094656l69664P9872
5833H04864j34656A13664L45088K6112K45760Q60160E67296d09088G10656J37216
$$ plain form
5823 847872 1642496 1157632 156160 1355776 704000 1910784 256512 -258560 640000
5813 1058304 830976 -207872 71168 1006080 623616 624640 964608 1282048 945664 1934336
5803 1934336 1601536 1442304 1569792 388608 -138752 785408 -60416 558592 889856 476160
5793 476160 284672 -5632 551936 84992 536064 371712 962048 977920 1069056 689152 415744
5782 415744 1297408 -166912 16384 158208 1032704 1053696 1833472 618496 946688 38912
5771 800256 212480 184320 1333248 -217088 1046528 708608 378880 1381888 754176
5762 754176 1042944 400384 1394176 1296896 2538496 1141760 -86528 1816064 -300544 252928
5751 -214016 328704 227328 595968 1708544 1214464 538624 710656 994304 1357312 -726016
$$ packed form
5823H47872P94624m84864A56160J199616o51776J206784B56512b58560F40000
5813A058304k27328b07872G1168R34912l82464J024L39968L17440l36384R88672
5803A934336l32800j59232J27488C88608a38752G85408f0416E58592L31264m13696
5793D76160j91488e632E51936H4992M51072j64352N90336J5872R1136l79904k73408
5782D15744Q81664a66912A6384J41824Q74496K0992P79776F18496L28192C8912
5771H00256B12480k8160J148928b17088A046528l37920l29728J003008o27712
5762G54176K88768D00384R93792r7280J241600A141760h6528A816064c00544B52928
5751b14016C28704j01376L68640J112576m94080E38624J72032K83648L63008g26016
$$ plain form
5740 1811968 228864 977920 2023424 693760 552960 -305664 315904 659456 400896
5731 400896 1126400 435200 1137152 658944 -46592 970240 1801216 1269760 875008 -67584
5720 88576 658944 929280 941056 -13312 95744 591360 845312 921088 1310720 684544 1379840
5709 1379840 1418752 -175616 1170944 1001984 1835008 1257984 1392640 1198080 696832 -296960
5698 1206784 -371712 944640 647680 833024 1155584 105984 767488 159232 419328 629760
5688 629760 1625088 390656 887808 977920 1525248 335360 1239552 200704 1110016 806912
5678 806912 1439744 665600 865792 1426944 196608 572416 818688 1206784 724992 620032
5668 620032 893440 366592 1055744 -208384 194560 478208 645632 721408 2066944 556032
$$ packed form
5740A811968B28864P49056J045504F93760j40800c05664C15904L43552k58560
5731D00896P25504D35200P01952m78208d6592I70240Q30976n31456l94752f7584
5720H8576N70368K70336J1776a3312I5744M95616K53952P5776L89632o26176O95296
5709A379840L8912a75616A170944j68960Q33024n77024J34656j94560n01248b96960
5698A206784c71712I44640k96960J85344L22560A05984O61504A59232K60096K10432
5688F29760R95328C90656M97152R0112N47328C35360R04192B00704R09312l03104
5678H06912O32832F65600K00192N61152A96608L75808K46272L88096m81792j04960
5668F20032K73408C66592O89152b08384A94560K83648J67424P5776J345536E56032
$$ plain form
5657 1877504 1259520 968192 865280 -684544 192000 168960 1174016 1018368 604672 660992
5647 660992 704000 887808 382976 270848 706048 1061376 505856 744960 1356288 429056
5636 579584 -128000 945152 489984 27136 987648 1092096 1104896 3072 513536 1090048
5626 1090048 910336 642560 1272832 980480 1314304 1880576 728064 1594368 -301056 1140736
5615 1462784 1253376 433664 495104 877568 1538560 1512960 698368 577024 -196608 446464
5604 1083904 1280512 986112 1043456 499200 1152512 1098752 1030144 710656 1796096 676864
5593 1781760 223744 444928 550912 945664 809472 1167872 754176 567808 1497600 707584
5582 1557504 1369088 1227264 1039360 922624 -463872 1251328 385536 1340416 1057280
$$ packed form
5657A877504o17984k91328j02912f84544A92000k3040J005056j55648m13696N6320
5647F60992M3008J83808C82976j12128M35200L55328E05856K39104O11328D29056
5636E79584a28000I45152m55168B7136R60512J04448J2800C072N10464N76512
5626A090048j79712k67776O30272k92352L33824N66272G28064Q66304c01056A140736
5615A462784k09408D33664O1440L82464O60992k5600F98368j21344a96608D46464
5604A083904J96608k94400N7344D99200O53312n3760o8608l19488J085440F76864
5593A781760B23744K21184J05984L94752j36192L58400m13696j86368R29792G07584
5582A557504j88416j41824j87904j16736d63872A251328C85536R54880k83136
$$ plain form
5573 1057280 944128 1513984 203264 1159680 337408 910336 1171968 659968 -19968 1777152
5562 1417728 1059840 -367616 1293312 2105856 1158144 947712 314368 402432 1076224 1458688
5552 1458688 2065920 1592832 1687040 1467392 1334272 1306624 1841152 793600 964096 2007552
5542 2007552 1401344 969728 1399296 1449472 1025536 1418240 1226240 1825280 384000 944640
5532 944640 1239040 832000 1114112 249344 1075200 970752 679424 917504 491008 886784
5522 886784 78336 53248 399360 1015296 -11264 772096 263680 1236480 735232 -199680
5511 1141248 1917440 736256 904704 303104 1357312 1039872 877056 121856 1670656
5502 1670656 529408 1068544 1124864 668672 1542656 556032 787456 955904 927232 702464
$$ packed form
5573A057280j13152N69856B03264R56416C37408N72928K61632n12000a9968A777152
5562A417728l57888c67616A293312Q12544r47712k10432C14368Q8064O73792L82464
5552A458688O07232m73088R4208k19648j33120k7648N34528G93600J70496J043456
5542B007552o06208m31616M29568N0176m23936L92704j92000N99040C84000N60640
5532I44640K94400m07040K82112B49344Q25856j04448k91328K38080m26496L95776
5522H86784G8336k5088L46112O15936a1264G72096B63680R72800n01248a99680
5511A141248P76192G36256J68448C03104J054208l17440j62816A21856J548800
5502A670656E29408N39136N6320m56192Q73984E56032K31424J68448k8672k24768
$$ plain form
5492 702464 1656320 528896 93696 1078784 1007104 2160640 954880 1327104 77824 1081344
5482 1081344 894464 1477632 1145856 1260544 -735232 969728 1276928 1153024 1306112 717312
5472 717312 1792512 263168 758784 777216 730112 629248 916992 875008 691712 797696
5462 797696 759808 1508864 538112 850944 1207296 1588736 250368 734720 958976 1564160
5452 1564160 954880 1658368 1051648 897536 2023936 552448 486912 555008 612352 907264
5442 907264 873472 1057280 416768 372736 691200 1079296 1293312 369152 1350656 768000
5432 768000 1111040 1457152 746496 1828864 1213952 1094656 1895936 1637376 1434112 1268224
5422 1268224 1139712 1829888 1994240 744448 556032 1754624 1487360 1457152 1421312 2285568
$$ packed form
5492G02464R53856E28896I3696R85088p1680J153536I54880L72224G7824J003520
5482A081344j86880N83168l31776J14688g35232I69728L07200j23904J53088n88800
5472G17312J075200B63168M95616J8432m7104j00864K87744m1984j83296J05984
5462G97696l7888P49056E38112L12832L56352L81440B50368M84352K24256O05184
5452A564160o09280P03488o06720j54112J126400E52448o5536O8096N7344K94912
5442I07264l3792J83808D16768m4032L18464L88096K14016C69152R81504n82656
5432G68000L43040L46112p10656J082368o14912j19296Q01280k58560k03264j65888
5422A268224j28512O90176J64352G44448j88416J198592k67264l0208l5840Q64256
$$ plain form
5412 2285568 814080 499712 667136 567808 296448 1795584 1213952 791552 769024 1602048
5402 1602048 2550784 625664 1222656 2153984 1336832 1296896 982016 1031168 2237952 742912
5391 1356288 2556416 1592320 1158656 982016 1815040 1946112 1080832 1647104 970240
5382 970240 1024000 1696768 1055232 2336768 1356800 1845248 528384 1041920 1630208 1658880
5372 1658880 1624064 1316352 2302464 828416 585728 2228736 1986048 1392128 1650176 1480704
5362 1480704 1065984 1709568 1447424 1563136 930304 2182656 1804800 1512960 1584640 1107456
5352 1107456 1808896 815104 1122816 1099264 -140800 461824 946176 1836032 1840640 207872
5341 1015296 1338880 922624 107520 1227264 1058304 2413056 351744 817664 381440
$$ packed form
5412B285568H14080l14368J67424r9328k71360J499136n81632m22400k2528Q33024
5402A602048R48736F25664N96992R31328q17152l9936l14880M9152J206784G42912
5391A356288J200128r64096m33664j76640Q33024J31072q65280N66272o76864
5382I70240N3760O72768o41536J281536r79968M88448E28384N13536N88288K8672
5372A658880l4816l07712R86112H28416k42688J643008k42688n93920K58048j69472
5362A480704m14720O43584k62144J15712o32832J252352l77856k91840P1680m77184
5352A107456P01440H15104L07712k3552a40800D61824M84352Q89856M608B07872
5341A015296L23584m16256A07520J119744j68960J354752C51744M65920C81440
$$ plain form
5331 778752 1615360 966144 782336 147456 656384 569344 1395712 1008640 1041920 1108480
5321 1108480 579584 1021440 1133568 -96768 947712 562688 382464 1765888 979968 1785856
5311 1785856 1106944 1262080 1216000 670720 1353728 1121280 800256 613376 569344 879104
5301 879104 1530880 1912320 1541120 1347072 1302016 529920 806400 1182720 271872 817152
5291 817152 1190400 1120256 714240 1455104 1165824 1223168 922112 816128 1169408 296448
5280 1486336 1571840 1044992 1103360 1870336 487936 1680384 304640 857600 1453568 909312
5270 909312 1895936 745472 551424 1928192 942592 353280 911360 327680 651264 1393664
5260 1393664 297984 972288 1129472 1861120 1478144 1017856 827392 1173504 1474048 1502208
$$ packed form
5331G78752Q36608o49216j83808A47456N08928q7040Q26368l87072L3280O6560
5321A108480n28896M41856J12128i6768I47712l85024j80224J383424p85920Q05888
5311A785856o78912J55136m6080n45280O83008k32448l21024j86880m4032L09760
5301H79104O51776L81440l71200j94048m5056E29920K76480L76320B71872N45280
5291H17152L73248p0144m06016P40864k89280N7344l01056j05984L53280B96448
5280A486336Q5504n26848N8368P66976D87936J192448C04640N52960N95968n44256
5270I09312R86624G45472j94048J376768I42592C53280N58080C27680L23584P42400
5260A393664B97984O74304J57184P31648l82976m60288j90464L46112L00544K8160
$$ plain form
5250 1502208 1509376 769024 1427968 1612288 1106432 1071616 1726464 1325568 1195520 440832
5239 677888 1178112 1499136 2122752 756736 1223168 717824 567296 1431040 203776 665088
5229 665088 1196544 1307648 1643008 825856 1275904 1586176 -90112 1367552 1077248 1016832
5219 1016832 687616 1343488 1345024 264192 1017344 709120 902656 523264 1399808 1164288
5209 1164288 1694208 1188864 2169856 1995264 1774592 1794560 1358848 825344 1808896 922624
5199 922624 1747968 1358336 1080832 1068544 474624 1307648 657408 1167872 1621504 327680
5188 1078272 264704 1943040 1129984 1654272 852480 1300992 1650688 1086976 1028096 697856
5178 697856 1666048 -13824 1127936 1991168 1742848 337920 -156160 1504768 880640 1030144
$$ packed form
5250A502208P168p40352O58944J84320n05856l4816O54848m00896j30048D40832
5239F77888N00224L21024O23616G56736M66432n05344j50528Q63744B03776M61312
5229F65088N31456J11104L35360q17152M50048L10272i0112A367552k90304o0416
5219A016832l29216O55872J536B64192P53152l08224J93536l79392Q76544k35520
5209A164288N29920n05344R80992j74592k20672J9968m35712n33504R83552q86272
5199I22624Q25344l89632k77504j2288D74624Q33024o50240N10464M53632C27680
5188A078272B64704J678336q13056N24288q01792M48512L49696n63712n8880l30240
5178F97856R68192a3824A127936Q63232k48320C37920a56160A504768o24128J49504
$$ plain form
5168 1030144 2079744 1406976 350720 1651200 221696 1794048 2202624 1520128 912896
5159 912896 541696 53248 1776128 850944 1935872 1477632 1916928 2082816 1355264 1864704
5149 1864704 1317376 2103296 1854976 1726464 656896 363008 1875968 2129920 2284544
5140 2284544 803328 2425856 2501120 1951232 2745344 2753536 2888192 3415040 3461632 2613760
5130 2613760 2077696 2505216 1372160 1139712 2274816 1966592 1356288 1027584 736768
5121 736768 672768 954368 1231872 685056 400384 1625600 391680 2263552 1867264 634368
5110 997888 1032704 1809920 2108416 904192 1873408 815616 1463808 2461184 1083904 1209856
5100 1209856 1442816 2044928 2177024 1151488 1039872 1834496 582656 208896 1341440
$$ packed form
5168A030144J049600o72768C50720J300480B21696J572352M08576o82496o07232
5159I12896l71200E3248J722880H50944J084928m58240M39296J65888p27552N09440
5149A864704n47328P85920k48320j28512F56896k93888J512960K53952J54624
5140B284544H03328J622528P5264n49888P94112Q192J34656N26848M6592q47872
5130B613760n36064M27520j133056k32448J135104l08224o10304l28704k90816
5121G36768o4000K81600K77504n46816k84672J225216C91680J871872l96288F34368
5110I97888L4816P77216K98496I04192R69216H15616O48192R97376A083904J25952
5100A209856K32960O02112J32096j025536j11616P94624E82656B08896J132544
$$ plain form
5091 1341440 1933312 156672 -427008 796160 1153536 2232320 1529856 690688 1451008
5082 1451008 731648 1911296 760320 1108992 632832 890368 681984 2099712 1280512
5073 1280512 1355264 2563072 673792 1262080 2662400 205824 1070592 2084352 869888
5063 448000 2083328 404480 1422336 1984000 776192 1073664 1218560 1116672 1218560
5054 1218560 1202688 762880 991232 1269760 1746432 1105408 1616896 1573376 1110528 1842176
5044 1842176 1772032 980992 1601536 2123264 846848 1520640 1535488 1822208 974336 1622528
5034 1622528 1465344 1522176 1620992 1472512 2074112 354304 1665536 1803776 2421760 821248
5023 2270208 1718784 1608704 1798144 2721280 2389504 1494528 1413120 1398784 882688 1658880
$$ packed form
5091A341440N91872A56672d27008G96160L57376J078784p02464F90688P60320
5082A451008p19360J179648G60320L48672m76160K57536k08384J417728q19200
5073A280512P4752J207808F73792N88288J400320B05824Q64768J013760H69888
5063D48000J635328D04480J017856N61664G76192K97472J44896j01888J01888
5054A218560j5872m39808K28352K78528M76672o41024N11488m3520m62848P31648
5044A842176p0144p91040O20544N21728H46848O73792J4848K86720q47872O48192
5034A622528j57184N6832R8816j48480O01600C54304J311232J38240O17984H21248
5023B270208n51424j10080J89440R23136l31776q94976q1408j4336n16096P76192
$$ plain form
5013 1658880 2732544 2001920 1612800 611328 2196992 1687040 1743360 994816 1567232
5004 1567232 1824768 2017280 937984 2029056 1625088 1788928 1601024 518656 928768
4995 928768 1860608 932352 1229312 656896 1855488 1285120 2020864 1507328 2500096 2737664
4985 2737664 1835520 1916928 1417728 1928192 1844736 300032 1566208 1579008 2053120 2449920
4975 2449920 1679872 1783296 1262080 2078720 1370624 2181632 630784 1472512 1413120 1636352
4965 1636352 1422848 1625600 1292288 1989632 1186304 1648640 1762816 1676288 2078720 2154496
4955 2154496 1647616 974848 1594880 906752 1480192 1252864 2392064 1873408 1531904
4946 1531904 1900544 1637888 1742848 2148864 1644544 1568256 2196480 2593280 1930240 1989632
$$ packed form
5013A658880J073664p30624l89120F11328J585664n09952N6320p48544N72416
5004A567232K57536J92512I37984J091072m03968J63840j87904E18656M10112
4995I28768R31840r28256K96960n72416J198592n70368P35744n13536R92768K37568
4985B737664r02144Q1408m99200N10464q3456C00032J266176J2800M74112L96800
4975B449920p70048J03424n21216Q16640p08096Q11008F30784Q41728n9392K23232
4965A636352k13504K02752l33312O97344q03328M62336J14176q6528M02432P5776
4955B154496n06880o72768O20032o88128N73440k27328J139200n18656l41504
4946A531904L68640k62656J04960M06016n04320p6288O28224L96800o63040N9392
$$ plain form
4936 1989632 1830912 1757184 1916416 401920 1988608 1146368 2084864 1807872 2478080 500736
4925 1033216 893440 740864 1493504 1370112 1700864 1559552 1602048 1770496 1922560 1628160
4915 1628160 1367552 1174016 900608 1275904 1252352 1084928 2573824 1223168 2202112
4906 2202112 59904 1928192 1205760 2282496 2361856 1575424 1222144 1773568 1778176 2766336
4896 2766336 824320 2348544 2360320 1851392 1378304 1610752 2972160 2510336 1909760
4887 1909760 2636800 3539968 4325376 3836928 4256256 4846592 5396992 4731904 5216256 6149632
4877 6149632 4912640 4470272 3670016 3130880 2726400 2351616 1683968 207872 1096192
4868 1096192 1719296 1702400 1304576 2365440 1270272 1745920 1631744 2313728 2441216
$$ packed form
4936A989632j58720p3728J59232D01920J586688q42240R38496k76992O70208E00736
4925A033216j39776j52576P52640j23392L30752j41312M2496J68448J52064k94400
4915A628160k60608j93536k73408L75296k3552j67424J488896A223168R78944
4906B202112E9904J868288p22432J076736P9360p86432l53280N51424M608R88160
4896B766336H24320J524224J1776n08928m73088K32448J361408m61824o00576
4887A909760P27040R03168P85408m88448M19328N90336N50400o65088M84352R33376
4877F149632j236992m42368q00256n39136m04480l74784o67648B07872Q88320
4868A096192O23104j6896l97824J060864j095168M75648j14176O81984J27488
$$ plain form
4859 2441216 1769984 2462720 873472 1876480 1304576 1048064 1030656 1394688 1528832 2649600
4849 2649600 1459200 1906176 1843712 1652224 1896960 521216 1231872 1719808 2262528 1588224
4839 1588224 1947648 1358848 928768 1344512 1378304 2256384 1292800 1451520 1479680 1232896
4829 1232896 2094080 867840 2250240 1614848 1168384 1590784 2455040 2350080 1948160
4820 1948160 1217024 776704 2359296 1431552 2449408 2033152 2684928 1942016 2570240
4811 2570240 2176000 2145280 1623552 1769472 1364480 1067520 1414656 1708032 1650688 2099200
4801 2099200 1708032 1360384 886272 787456 1989120 648192 2041344 1768960 2343424
4792 2343424 1786368 2098176 1573888 1791488 1337856 1806848 2240000 1133056 2029568
$$ packed form
4859B441216o71232O92736H73472J003008n71904k56512j7408L64032J34144J120768
4849B649600j190400M46976o2464j91488K44736E21216P10656M87936N42720o74304
4839A588224L59424n88800m30080M15744L3792Q78080r63584J58720K8160k46784
4829A232896Q61184H67840J382400o35392m46464M22400Q64256j04960m01920
4820A948160p31136m40320J582592r27744J017856m16256O51776p42912O28224
4811B570240l94240l0720n21728J45920m04992k96960L47136K93376n7344M48512
4801B099200l91168l47648m74112r8816J201664F48192J393152k72384N74464
4792B343424n57056L11808n24288K17600m53632M68992M33152j106944Q96512
$$ plain form
4783 2029568 1593344 2220544 1357824 1463296 2197504 2093568 2465792 1685504 885760 1489920
4773 1489920 1376256 1424384 1768448 1702912 1714176 761856 1801216 1801728 1856000 1329664 2041344
4762 2041344 1483776 880128 3060736 1665024 1801728 1780736 3116032 2400256 1842176
4753 1842176 1960448 2004992 1849856 1598464 1981440 1740800 1584640 1662464 1525760 2298880
4743 2298880 2452480 2277888 891904 865792 2663936 1336320 1251328 2903040 2778112
4734 2778112 1124864 2247168 1737216 1870848 2152448 944640 1900032 2717184 1870336
4725 1870336 2058240 2137088 1719808 2800640 2593792 2309120 2803712 1823744 1828864 2106368
4715 2106368 2321408 2557952 1841152 2512896 3034624 1801216 1824256 3118080 2487296
$$ packed form
4783B029568m36224O27200q62720J05472P34208j03936L72224p80288p99744O04160
4773A489920j13664M8128L44064o5536J1264G61856J039360N12N4272n26336P11680
4762B041344n57568o03648K180608j395712J36704k0992J335296p15776n58080
4753A842176J18272M4544j55136k51392L82976k40640j56160P7824j36704P73120
4743B298880J53600j74592H91904k6112J798144j327616q4992J651712j24928
4734B778112A124864J122304n09952J33632K81600I44640R55392Q17152q46848
4725A870336J87904P8848m17280J080832k06848k84672M94592r79968N120K77504
4715B106368K15040K36544p16800O71744N21728j233408K3040J293824o30784
$$ plain form
4706 2487296 2391552 2121216 2813440 1145856 1840640 2388992 1756160 3680256 1683968
4696 2388992 3087872 2387456 3328512 2021376 2659840 2007040 2138624 2288640 2216960 2123264
4686 2123264 1162752 2036224 2394624 2690048 1097216 1723392 1261568 1867264 2718208
4677 2718208 1553408 1867264 1765376 2322432 2667008 2498048 2713600 2212864 2441728
4668 2441728 2160128 1678848 2427904 2307584 1497088 2498048 1893376 2625536 1953792
4659 1953792 1760768 1661440 1811456 2056704 1355776 1807360 1241088 2384896 1548800 2351616
4649 2351616 1445888 1737216 1635840 1502208 1909248 2275840 2876416 2377728 2401280 4653568
4639 4653568 1373184 1686016 1947648 1210880 2580480 2354688 1845760 2289664 1889280
$$ packed form
4706B487296r5744k70336O92224A145856O94784N48352o32832J924096A683968
4696B388992O98880p00416R41056j307136O38464o52800J31584J50016p1680r3696
4686B123264r60512Q73472L58400K95424A097216O26176m61824O05696Q50944
4677B718208j164800L13856j01888N57056L44576j68960K15552n00736K28864
4668B441728k81600m81280P49056j20320q10496J000960o04672P32160o71744
4659A953792j93024r9328J50016K45248p00928M51584n66272J143808q36096Q02816
4649B351616r05728K91328j01376j33632M07040L66592O00576m98688K3552K252288
4639D653568A373184L12832K61632p36768J369600k25792n08928M43904m00384
$$ plain form
4630 1889280 1770496 1711616 1996800 2605568 2783744 3248128 2084352 2904064 2584576 4209664
4620 4209664 3680768 2541056 2217984 2832896 2332160 3832832 2076160 2634752 2844672
4611 2844672 3173888 2285056 2999808 1940992 1542144 2323456 2409984 2188800 2971136 1859584
4601 1859584 2907648 2274304 2091520 2865664 2559488 2972160 2465792 2726912 2964992
4592 2964992 2288640 2405376 2503680 1799168 2629120 3288064 2551296 3189248 2820096 3499520
4582 3499520 2970624 3019264 3095552 3140608 3013120 2255360 2099200 2218496 1729024 3068416
4572 3068416 2021888 2577920 3104256 3265024 3564032 2990592 2488320 2397184 2388480 3387392
4562 3387392 1895936 1967104 1831936 1281536 3328000 1879040 1574912 2040320 2554368
$$ packed form
4630A889280j18784n8880K85184O08768J78176M64384j163776Q19712l19488J625088
4620D209664n28896j139712l23072O14912n00736J500672j756672N58592K09920
4611B844672L29216q88832P14752j058816l98848P81312Q6528k21184P82336j111552
4601A859584J048064o33344j82784P74144l06176M12672n06368K61120K38080
4592B964992o76352J16736R8304p04512Q29952O58944p36768O37952l69152O79424
4582C499520n28896M8640P6288M5056j27488p57760j56160J19296m89472J339392
4572C068416j046528N56032N26336J60768K99008n73440n02272r1136q704R98912
4562C387392j491456P1168j35168n50400K046464j448960l04128M65408N14048
$$ plain form
4553 2554368 2635776 2723328 1913856 2455552 1793024 2514944 2504704 2276352 1255424 2524672
4543 2524672 2435072 1731584 1911296 1147904 1623552 2508800 2577408 2789888 2305024 1921024
4533 1921024 2608640 2289152 1908736 1516032 2234880 1856000 2568192 2420224 2557952 1985536
4523 1985536 1816064 1329152 1703424 1634304 1709568 2694144 2470912 2342912 2878464 2582016
4513 2582016 2409472 2711552 2094080 2440192 3037184 3059712 2035712 2440192 2649600 3440640
4503 3440640 2711040 2680320 2401280 3479040 3062272 2760704 2134016 2212864 2618368 2366464
4493 2366464 2491392 2821120 3171840 2288128 2763264 3400704 2155008 4233728 4164096
4484 4164096 3681792 2681344 4405248 3397632 3522048 2643968 3396096 3936768 3659264
$$ packed form
4553B554368Q1408Q7552q09472N41696o62528P21920j0240k28352j020928J269248
4543B524672q9600p03488J79712p63392M75648Q85248O8608K12480m84864l84000
4533A921024O87616l19488l80416l92704P18848l78880P12192j47968J37728n72416
4523A985536j69472m86912L74272o9120P5264R84576k23232j28000N35552k96448
4513B582016j72544L02080o17472L46112N96992K2528j024000M04480K09408P91040
4503C440640p29600l0720k79040J077760m16768l01568o26688P8848M05504k51904
4493B366464J24928L29728L50720q83712M75136O37440j245696K078720o9632
4484D164096m82304j000448J723904j007616J24416q78080P52128N40672k77504
$$ plain form
4475 3659264 3903488 3544064 4384256 3271168 3088896 2716160 3194368 2357760 2903040
4466 2903040 2259968 3519488 3009536 3440128 3195392 2900992 3699712 2030080 1938944
4457 1938944 2661888 3130368 3402240 1910272 2029056 3194368 2735616 3171328 3655680
4448 3655680 3453952 2656256 2369024 3030528 2763264 2890240 2854912 2333184 3457536 2693632
4438 2693632 1792000 2685952 3508736 2791424 3435008 3317248 3144704 2870272 2384896 2669568
4428 2669568 4271104 4254720 3229696 3805184 3532288 3204608 3792896 2876416 2792960 2687488
4418 2687488 3530752 4774400 5122560 3303936 3683328 3847168 3626496 3660800 3488768
4409 3488768 3823616 3746816 2944512 2925568 2811904 3646976 3124224 2745856 3098624 2396672
$$ packed form
4475C659264K44224l59424Q40192j113088j82272l72736M78208q36608N45280
4466B903040o43072J259520n09952M30592k44736k94400P98720j669632r1136
4457A938944P22944M68480K71872j491968J18784J165312m58752M35712M84352
4448C655680k01728p97696k87232O61504k67264J26976l5328n21728J124352p63904
4438B693632r01632Q93952Q22784p17312O43584j17760j72544k74432m85376K84672
4428B669568J601536j6384j025024N75488k72896l27680N88288r16480q3456j05472
4418B687488Q43264J243648L48160j818624L79392J63840k20672L4304j72032
4409C488768L34848p6800q02304j8944j13664Q35072n22752l78368L52768p01952
$$ plain form
4399 2396672 2791936 3356672 2177536 3177472 2164736 2496512 2874368 2275840 2148864
4390 2148864 2679808 3230720 2997760 2908160 3352064 2052096 2472448 2363392 2562560 2737152
4380 2737152 4285440 1588224 2957824 2373120 2838528 2914816 3898368 3136000 3768832
4371 3768832 3476480 2841600 4090880 4295680 3053568 3119616 4042240 4403200 4781056
4362 4781056 3656192 3287040 2688512 2863616 2588672 2579456 2646016 2536960 2711552 2622976
4352 2622976 3415552 2544128 1934336 2946560 2433536 2388480 2612736 2769408 3686400 3630592
4342 3630592 3289600 2465792 2561536 2078720 1603584 1879552 2251264 3238912 2496000 2227712
4332 2227712 3578880 2695680 2891776 2406912 3627008 2535936 1506816 3165184 3013120
$$ packed form
4399B396672L95264N64736j179136R99936j012736L31776L77856n98528j26976
4390B148864N30944N50912k32960q9600M43904j299968M20352j09056J99168J74592
4380B737152J548288A588224J369600n84704M65408P6288R83552p62368O32832
4371C768832k92352o34880J249280K04800j242112O6048R22624L60960L77856
4362D781056j124864l69152n98528J75104k74944r216O6560j09056J74592q8576
4352B622976P92576q71424o09792J012224n13024m5056K24256J56672R16992n5808
4342C630592l40992q23808R5744m82816m75136K75968L71712R87648p42912k68288
4332B227712J351168q83200J96096m84864J220096j091072j029120J658368j52064
$$ plain form
4323 3013120 2788352 3958272 3044864 4198400 4301824 2624512 3416576 3723264 3473920
4314 3473920 3086336 4231168 3021824 2963968 2423296 1974784 3357184 3245056 1611776
4304 2198016 2348544 2377216 3459072 3588608 3556352 1931776 2768896 2923008 2192384 4200448
4294 4200448 2269184 1939456 1581568 2746368 2000896 2845184 3430400 3285504 2112000
4285 2112000 3672576 2655744 2534912 3459072 2135040 1650688 2307584 3361280 2706432
4276 2706432 2874368 2486784 3175936 3275264 2977280 2417152 3436544 3082240 2178048 2897920
4266 2897920 3058688 2087424 2842112 2176000 2993664 2675712 2412032 2540544 2770944 2543616
4256 2543616 2215424 3165184 3784192 3268096 1851904 3056640 2144256 1636352 1692672
$$ packed form
4323C013120k24768J169920r13408J153536J03424j677312P92064L06688k49344
4314C473920l87584J144832j209344n7856n40672m48512J382400j12128A611776
4304B198016J50528K8672J081856J29536l2256j624576Q37120J54112p30624K008064
4294D200448j931264l29728l57888J164800p45472Q44288N85216j44896j173504
4285B112000J560576j016832j20832R24160j324032m84352O56896J053696o54848
4276B706432J67936l87584O89152R9328k97984n60128J019392l54304r04192P19872
4266B897920J60768r71264P54688o66112Q17664l17952k63680J28512K30400k27328
4256B543616l28192R49760O19008n16096j416192J204736r12384n07904N6320
$$ plain form
4247 1692672 1974784 2964480 3245568 2280448 3265024 2691584 3269632 2785280 2785792 3041792
4237 3041792 2323968 2631680 1257472 4432384 3006976 2705408 3484160 3987456 2462208
4228 2462208 3407360 3505664 4022272 2844672 3939328 2693632 3664384 2852352 3365376
4219 3365376 2467840 3553280 2390528 3543552 4338688 3198464 3121152 3406336 3339776
4210 3339776 3337216 3359232 2915840 3603968 3920896 4454912 4892160 4222464 2990080 3622400
4200 3622400 3340800 4050432 3235840 4614144 3987968 4101632 4008448 5301760 3559424
4191 3559424 3918848 4345344 4777472 5129728 4222464 4062720 4523520 3656192 4935680
4182 4935680 4828160 4642816 4608000 4773888 5832192 5158400 6005248 5312000 5586432 6131712
$$ packed form
4247A692672K82112R89696K81088r65120R84576n73440N78048m84352N12K56000
4237C041792p17824L07712A257472L174912j425408l01568P78752N03296j525248
4228B462208R45152R8304N16608j177600J094656j245696R70752q12032N13024
4219C365376q97536J085440j162752J153024P95136j140224p7312K85184o6560
4210C339776k560K2016m43392O88128L16928N34016M37248o69696j232384O32320
4200C622400k81600P09632q14592J378304o26176J13664r3184J293312j742336
4191C559424L59424M26496M32128L52256r07264j59744M60800q67328J279488
4182D935680j07520j85344l4816J65888J058304o73792Q46848o93248K74432N45280
$$ plain form
4172 6131712 5019136 6431744 6272000 5840896 5219328 5948416 6171648 5647872 5760512
4163 5760512 6252544 5965824 6270464 6052352 5509120 4929536 5869568 6355968 6566400 5281792
4153 5281792 5009920 5629952 5172736 4899328 4130816 3693056 4271616 4635136 4390400 4102144
4143 4102144 5097984 5523456 4829184 5514240 4428288 4390400 4029440 3868672 5414400
4134 5414400 3888640 5032448 4618752 4119552 4013568 4058624 4449792 4577280 4333056
4125 4333056 4493312 3931136 5611008 3835392 4314624 3824128 3407872 3826176 4335616
4116 4335616 3286528 4408832 4033536 2933760 3538432 4024320 3297792 3568128 2907648
4107 2907648 4334080 4060672 4936192 4262400 3950592 4418048 2953216 3261440 4144128
$$ packed form
4172F131712j112576J412608j59744m31104o21568P29088K23232n23776J12640
4163E760512M92032k86720L04640k18112n43232n79584R40032M86400K10432j284608
4153E281792k71872O20032m57216k73408p68512m37760N78560L63520k44736k88256
4143D102144R95840M25472o94272O85056j085952l7888l60960j60768J545728
4134E414400j525760J143808m13696m99200j05984M5056L91168J27488k44224
4125D333056J60256n62176J679872j775616M79232m90496m16256M18304N09440
4116D335616j049088J122304l75296j099776O04672M85888p26528K70336o60480
4107B907648J426432k73408Q75520o73792l11808M67456j464832L08224Q82688
$$ plain form
4098 4144128 4459008 3862016 8753152 4157952 3062784 3547136 4250624 3689984 3025408
4089 3025408 3636736 4094976 3248640 4056576 4005888 4084224 3398656 3356672 3053056 3547136
4079 3547136 3990016 3685888 3340288 4412928 4039680 3830272 4175872 4476416 4692480
4070 4692480 4462080 4803072 4726784 4303872 4409344 5605376 4465152 5080576 4339712
4061 4339712 4633600 4391936 4000256 5191168 4085760 3728384 4160512 4349440 3544576
4052 3544576 5332480 4918272 4315136 5036032 5364736 3970048 3930112 4440576 4137984
4043 4137984 4095488 3634688 3524608 3461120 3974656 3244032 3042816 3727360 2887680 3356672
4033 3356672 3170816 3048448 4286976 3478528 2512384 1999360 3046912 4043776 3389440
$$ packed form
4098D144128L14880n96992M891136D157952j095168M84352P03488n60640o64576
4089C025408O11328M58240q46336Q07936n0688P8336o85568m1984l03616M94080
4079C547136M42880l04128l45600J072640l73248k09408L45600L00544K16064
4070D692480k30400L40992p6288m22912J05472J196032j140224O15424p40864
4061D339712K93888k41664l91680J190912j105408l57376M32128J88928q04864
4052C544576J787904m14208o03136P20896L28704j394688l9936N10464l02592
4043D137984m2496m60800j10080o3488N13536p30624k01216O84544q39680M68992
4033C356672j85856j22368J238528q08448r66144n13024J047552R96864o54336
$$ plain form
4024 3389440 2991104 3207168 2622464 2957824 3699200 3476480 4149760 2671616 3472896
4015 3472896 3827712 3895808 3789824 3025408 3085312 3879936 2564608 4087296 3108864 3210240
4005 3210240 4521472 2222080 4424192 4142080 4174336 4403200 3186176 4138496 3401216
3996 3401216 4193280 3635712 3813376 3870720 4622848 3571200 3972096 4466176 3662336 3245056
3986 3245056 4307456 3696640 4029440 4102656 3860480 4142080 4507136 4681728 3258368
3977 3258368 4089344 3830784 3982848 4332032 4201472 3963392 4078592 4427264 5492736
3968 5492736 4241408 4292608 4882432 4423680 5745664 5997056 5500928 5338112 6374912
3959 6374912 6274048 6500352 6228480 5862400 7503872 7225856 6610944 6780928 6929408
$$ packed form
4024C389440l98336K16064n84704L35360P41376k22720O73280j478144Q01280
4015C472896L54816O8096j05984p64416N9904P94624j315328J522688r78432J01376
4005C210240J311232B222080K202112k82112L2256K28864j217024R52320p37280
3996C401216P92064n57568J77664N7344P52128j051648M00896M94080q03840m17280
3986C245056J062400o10816L32800P3216k42176K81600L65056J74592j423360
3977C258368Q30976k58560J52064L49184j30560k38080J15200L48672J065472
3968E492736j251328N1200N89824m58752J321984K51392m96128j62816J036800
3959F374912j00864K26304k71872l66080J641472k78016o14912J69984J48480
$$ plain form
3950 6929408 6713856 7027712 6792192 6600704 7478784 7220224 6956544 7767552 8546304 7054848
3940 7054848 7901696 7790592 8327168 8688128 9272832 8935936 8394752 8763904 9405440 9624576
3930 9624576 9211392 9961472 10601984 10716672 10611712 11392512 11865088 11232768 13149696
3921 13149696 13777408 14124544 13777920 13871616 14985216 15326720 16033792 15992832 16194048 16798720
3911 16798720 17098240 17334784 18546688 17910784 18056704 18620416 21242368 21353472 22073856
3902 22073856 22581248 25988608 25353216 27246080 26057216 24134144 20093440 18887168
3894 18887168 14214656 13184000 10711552 8849920 8420352 7185920 7058944 6248960 7491072
3885 7491072 5599232 6915072 5613056 5363712 5593088 5107200 5185536 5826560 4869632
$$ packed form
3950F929408k15552L13856k35520j91488Q78080k58560k63680Q11008P78752j491456
3940G054848Q46848j11104N36576L60960N84704l36896n41184L69152O41536K19136
3930I624576m13184P50080O40512J14688j04960P80800M72576o32320J916928
3921A3149696O27712L47136l46624R3696J113600L41504P07072m0960K01216O04672
3911A6798720K99520K36544J211904o35904J45920N63712K621952J11104P20384
3902B2073856N07392L407360o35392J892864j188864j923072m040704j206272
3894A8887168m672512j030656k472448j861632m29568j234432j26976q09984J242112
3885G491072j891840J315840j302016k49344K29376m85888P8336O41024r56928
$$ plain form
3876 4869632 4157952 5204480 5012992 4489216 6122496 5504512 4742656 5161472 5049856
3867 5049856 4400640 5010432 4626944 4655616 6337536 4984832 4306432 5803520 5072896
3858 5072896 5404672 4982784 5642752 5192704 4791808 5316096 5028864 5143552 5424128 5047808
3848 5047808 4326400 5399552 4974080 5402624 4497920 4372480 4658688 4983808 5273600
3839 5273600 5604864 4647936 3988992 4481024 4217856 4063744 4729344 4744704 4486656 4447232
3829 4447232 4556800 4551168 4944384 4361216 5117440 4189696 3806720 5221376 5449216 3443712
3819 3443712 3913216 4491776 3959296 4913152 4479488 5339648 5524992 5198336 4895744 4917248
3809 4917248 4657664 4052992 4637696 5019648 4418560 5197312 4403712 4932608 5774336 5448192
$$ packed form
3876D869632p11680J046528j91488n23776J633280o17984p61856M18816j11616
3867E049856o49216O09792l83488K8672J681920j352704o78400J497088p30624
3858E072896L31776m21888O59968m50048m00896N24288k87232J14688K80576l76320
3848E047808p21408J073152m25472M28544r04704j25440K86208L25120K89792
3839E273600L31264r56928o58944M92032k63168j54112O65600J5360k58048l9424
3829D447232J09568n632L93216n83168P56224r27744l82976J414656K27840k005504
3819C443712M69504N78560n32480R53856m33664Q60160J85344l26656l02592K1504
3809D917248k59584o04672N84704L81952o01088P78752p93600N28896Q41728l26144
$$ plain form
3799 5448192 4870656 4701184 5794304 4919296 4826112 5036544 4499968 3380224 5244928
3790 5244928 4220928 4525056 4705792 6046208 5172224 5228544 4940288 5229568 5774848
3781 5774848 3905536 5316608 5002752 5174272 4290560 4622848 5161984 4859392 4971008
3772 4971008 5328896 5197312 4609024 4451840 4817920 5246976 4702208 5485056 4523520 4359168
3762 4359168 4552704 5322752 4988416 4668928 5157376 4975104 5556736 4140032 4989440
3753 4989440 5259776 4721664 5925376 5832192 5966848 5450240 4573696 4871168 5104640 5767680
3743 5767680 5656064 4899840 6157312 5584896 5899776 4948480 4756480 6327808 4627968
3734 4627968 5773312 5057024 4646400 5688320 5926912 5788160 5971968 5179392 5956096
$$ packed form
3799E448192n77536j69472J093120q75008r3184K10432n36576j119744J864704
3790E244928j024000L04128J80736J340416q73984N6320k88256K89280N45280
3781E774848j869312J411072l13856J71520q83712L32288N39136l02592J11616
3772D971008L57888j31584n88288j57184L66080M29056n44768P82848r61536j64352
3762D359168J93536P70048l34336l19488M88448j82272N81632j416704Q49408
3753D989440K70336n38112J203712r3184J34656n16608q76544K97472K33472O63040
3743E767680j11616p56224J257472n72416L14880r51296j92000J571328j699840
3734D627968J145344p16288m10624J041920K38592j38752J83808p92576P76704
$$ plain form
3725 5956096 5015040 5406208 5612544 6052864 5413888 6795776 5788160 5480448 6207488
3716 6207488 6224384 5774336 5993472 6525440 5457920 6808064 7026688 5790208 7455232
3707 7455232 7564800 6801920 6066176 6365696 6265344 7207936 6539264 7118848 6126592 7306752
3697 7306752 7168000 7024640 7838720 7622144 7719424 6696960 7572992 6515712 7869440
3688 7869440 7676416 8531968 7980544 7790080 9267712 8909312 8492032 8242176 10103808
3679 10103808 10098688 9283072 10739200 10238464 12388864 10978816 13140992 13463040 12681216
3670 12681216 14508544 14658560 13737984 15678976 15575552 17462784 18641920 19532288 21251072
3661 21251072 21635584 24189952 24066048 25610240 26424832 27148288 26544128 28086784 30333440
$$ packed form
3725E956096r41056L91168K06336M40320o38976J381888j007616l07712P27040
3716F207488J6896m50048K19136N31968j067520J350144K18624j236480J665024
3707G455232J09568p62880p35744K99520j00352R42592o68672N79584r92256J180160
3697G306752j38752j43360Q14080k16576R7280j022464Q76032j057280J353728
3688G869440j93024Q55552n51424j90464J477632l58400m17280k49856J861632
3679A0103808n120q15616J456128n00736K150400j410048K162176L22048p81824
3670A2681216J827328J50016r20576J940992j03424J887232J179136Q90368J718784
3661B1251072L84512K554368j23904J544192Q14592P23456o04160J542656K246656
$$ plain form
3652 30333440 30746112 32479232 32862208 33615360 34791936 35573760 38290944 40531968 43100672
3643 43100672 43907584 44074496 43976192 41607168 38180864 32415232 27633152 22232064 19758080
3634 19758080 16965632 14632960 14454272 12776960 12810752 12698624 12833280 12080640 11373568
3625 11373568 11554304 11498496 11248640 10723840 10953728 11349504 11279872 9537536 9684992 9782272
3615 9782272 9145344 9291776 9222656 9802240 9195520 9755648 9526784 9773568 9452544 10152448
3605 10152448 8624640 8849920 9271296 8738816 7464448 6906368 7685632 7874048 7043584
3596 7043584 8549376 6987264 7856640 8141824 7471104 7252480 7472640 6813184 7944192
3587 7944192 7827456 7874560 7967232 6847488 7335936 7917056 8878080 8014336 8414208 7971840
$$ packed form
3652C0333440M12672J733120L82976P53152J176576P81824K717184K241024K568704
3643D3100672Q06912J66912r8304k369024l426304n765632m782080n401088k473984
3634A9758080k792448k332672j78688j677312L3792j12128J34656p52640p07072
3625A1373568J80736n5808k49856n24800K29888L95776o9632j742336J47456R7280
3615I782272o36928J46432o9120N79584o06720N60128k28864K46784l21024O99904
3605A0152448j527808K25280M21376n32480j274368n58080P79264J88416q30464
3596G043584J505792j562112Q69376K85184o70720k18624K20160o59456J131008
3587G944192j16736M7104R2672j119744M88448N81120R61024q63744L99872m42368
$$ plain form
3577 7971840 8014336 7476736 7321088 6783488 6487552 7660544 7591936 7825408 7775744 8412160
3567 8412160 7313408 8889856 7053824 7677952 8120832 8159744 7649280 8397824 7464960
3558 7464960 8474624 8404480 8352256 7698432 8210432 8856064 7843840 9285120 8403456
3549 8403456 9182720 7841280 9395200 8875520 8221696 9118720 8869376 8595968 8098816
3540 8098816 7988736 7947776 7383552 8921600 9248256 10311168 8329728 8434688 8856064
3531 8856064 9207296 8876032 8871936 8057856 8282112 8470016 9033728 8506880 8744448 9142272
3521 9142272 9821184 8373760 8910336 9613312 8943104 9846272 10426368 10181632 9543680
3512 9543680 10671104 9303552 9960960 11357184 9722368 10190336 10010112 10492928 9696768
$$ packed form
3577G971840M2496n37600j55648n37600k95936J172992o8608K33472m9664O36416
3567H412160j098752J576448j836032O24128M42880L8912n10464P48544r32864
3558G464960J009664p0144n2224o53824N12000O45632j012224J441280q81664
3549H403456P79264j341440J553920n19680o53824Q97024k49344k73408m97152
3540H098816j10080m0960n64224J538048L26656J062912j981440J04960M21376
3531H856064L51232l31264m096q14080K24256J87904N63712n26848K37568L97824
3521I142272O78912j447424N36576P02976o70208R03168N80096k44736o37952
3512I543680J127424j367552O57408J396224j634816M67968j80224M82816p96160
$$ plain form
3503 9696768 9588224 10436608 10840064 11767808 9758720 11665408 11729408 11445248 11832832
3494 11832832 11560960 12068352 11653632 11891200 12404224 12669952 13315072 12534272 12847616
3485 12847616 13088256 12883456 13002752 11696128 13825024 12489216 13931008 13038080 12865536
3476 12865536 14291968 13634560 13222912 13750784 12634624 15283200 13714432 14542336 13695488
3467 13695488 14494208 14791680 13530112 14488064 14749696 15575552 16212480 17650688 17550848
3458 17550848 17151488 17584128 16842752 17404928 16917504 18114048 17929216 18359808 19334656
3449 19334656 19077632 20024832 20966912 21558272 21634048 21149696 21401600 22689280 23609856
3440 23609856 23261184 24199168 25361920 25670656 26222080 26126336 27251200 27341824 27879936
$$ packed form
3503I696768j08544Q48384M03456R27744k009088J906688O4000k84160L87584
3494A1832832k71872N07392m14720K37568N13024K65728O45120p80800L13344
3485A2847616K40640k04800J19296j306624K128896j335808J441792q92928j72544
3476A2865536J426432o57408m11648N27872j116160K648576j568768Q27904q46848
3467A3695488P98720K97472j261568R57952K61632Q25856O36928J438208r9840
3458A7550848l99360M32640p41376N62176m87424J196544j84832M30592R74848
3449A9334656k57024R47200R42080N91360P5776m84352K51904J287680R20576
3440B3609856l48672R37984J162752L08736N51424r5744J124864R0624N38112
$$ plain form
3431 27879936 29353984 31435776 32489472 34328576 34787328 34812928 38076416 38356992 41278464
3422 41278464 41992704 42705920 45416448 47987200 49776128 52638720 55409664 57966592
3414 57966592 62433280 65148416 69499392 74296320 80265728 86192640 93023232 99220992
3406 99220992 108547584 117470208 126753280 137574912 148128256 161010176 174815232 191909376
3398 191909376 210460160 231824384 258873344 290253824 329133568 378529280 442215424
3391 442215424 526557696 640148480 786423808 954929152 1109200896 1203702272 1206545920
3384 1206545920 1108384256 933425152 730117632 547134976 402926080 300637184
3378 300637184 228918272 179494912 145186816 119122432 101389312 87843328 75962880
$$ packed form
3431B7879936J474048K081792J053696J839104M58752K5600L263488K80576K921472
3422D1278464P14240P13216K710528K570752J788928K862592K770944K556928
3414E7966592M466688K715136M350976M796928N969408N926912O830592O197760
3406I9220992R326592Q922624R283072J0821632J0553344J2881920J3805056J7094144
3398A91909376J8550784K1364224K7048960L1380480L8879744M9395712O3686144
3391D42215424Q4342272J13590784J46275328J68505344J54271744R4501376K843648
3384A206545920r8161664j74959104k03307520j82982656j44208896j02288896
3378C00637184p1718912m9423360l4308096k6064384j7733120j3545984j1880448
$$ plain form
3371 75962880 68911104 60864000 54840320 50136576 44355072 41149952 36457472 33560064
3363 33560064 30239232 28982784 27610624 26719744 25974272 24203264 23535104 23563264 20604416
3354 20604416 20174336 19592704 19111936 18672128 17351168 17077248 16431616 15533056 14482944
3345 14482944 15382016 13603328 13259264 13564416 12010496 12928000 10081792 10746880 11535872
3336 11535872 10668544 10214400 10041856 9281024 9282048 9809408 9541632 7285760 9083904
3327 9083904 8304128 8057856 7553024 7091200 8473600 7072768 7662592 6642688 7736320
3318 7736320 7627776 6764032 7739904 6539776 7774208 6649856 6340096 5607936 5353472
3309 5353472 5297152 5040640 5607936 4388352 4938752 5909504 5631488 6323200 5076992
$$ packed form
3371G5962880p051776q047104o023680m703744n781504l205120m692480k897408
3363C3560064l320832j256448j372160q90880p45472j771008o68160K8160k958848
3354B0604416m30080n81632m80768m39808j320960k73920o45632q98560j050112
3345A4482944Q99072j778688l44064L05152j553920R17504k846208O65088P88992
3336A1535872q67328m54144j72544p60832J024N27360k67776k255872J798144
3327I083904p79776k46272n04832m61824J382400j400832N89824j019904J093632
3318G736320j08544q63744R75872j200128J234432j124352l09760p32160k54464
3309E353472n6320k56512N67296j219584N50400R70752k78016O91712j246208
$$ plain form
3300 5076992 4510208 4940288 4342272 4905472 5155328 4194304 3624448 3411456 3667456 4483072
3290 4483072 3883008 3968000 4288512 3732992 3935232 3371008 3025920 3056640 3245568 2682368
3280 2682368 4304384 3925504 4237312 3896320 3425792 2428416 3220480 3402240 2780160
3271 2780160 4368384 3436032 3558912 3119104 3924480 3744768 2694656 2793472 2621952
3262 2621952 3704832 3880448 2471936 2246656 3186688 4299264 3059200 3377664 3099648
3253 3099648 2900992 3652096 3171840 2490368 4299264 3085312 3079168 2896896 3099136 3463680
3243 3463680 2540544 2786816 3061760 3024896 2060288 2519552 3389440 3791872 4134912 3713536
3233 3713536 4561920 4273664 3790848 3200000 2031616 2513920 3370496 2640896 2154496
$$ packed form
3300E076992n66784M30080n98016N63200K49856r61024n69856k12992K56000Q15616
3290D483072o00064Q4992L20512n55520K02240n64224l45088L0720J88928n63200
3280B682368J622016l78880L11808l40992m70528r97376P92064J81760o22080
3271B780160J588224r32352J22880m39808Q05376j79712j050112R8816j71520
3262B621952J082880J75616j408512k25280R40032J112576j240064L18464k78016
3253C099648j98656P51104m80256o81472J808896j213952o144j82272K02240L64544
3243C463680r23136K46272K74944l6864r64608M59264Q69888M02432L43040m21376
3233C713536Q48384k88256m82816n90848j168384M82304Q56576p29600m86400
$$ plain form
3224 2154496 3648512 3536384 3208704 4145152 3247104 3054080 3518464 3287040 1966080
3215 1966080 3844096 3881984 2995200 3085312 3827200 2422272 3231232 3747328 3334144 3032064
3205 3032064 4211200 3310080 3326464 3768832 4639232 5527040 5381632 6199808 6206464 5322240
3195 5322240 6659072 6956032 9132032 9194496 10724352 12241920 11163648 11207680 12271104
3186 12271104 11164160 10653184 10770944 10647552 9819648 10510336 10080256 9313280 9393152
3177 9393152 10234368 11863040 12000768 12394496 11779584 11919872 11830784 12219392 12484608 13731840
3167 13731840 14070272 13748736 14089728 13897728 13819904 15042560 14615040 15517696 16468480
3158 16468480 15142912 17229824 16381952 17246208 17635840 17779200 18731008 19604992 19043328
$$ packed form
3224B154496J494016j12128l27680R36448q98048j93024M64384k31424j320960
3215A966080J878016L7888q86784R0112P41888j404928Q08960N16096m13184l02080
3205C032064J179136r01120J6384M42368Q70400Q87808j45408Q18176O656q84224
3195E322240J336832K96960K176000O2464J529856J517568j078272M4032J063424
3186A2271104j106944n10976J17760j23392q27904O90688m30080p66976P9872
3177I393152Q41216J628672J37728L93728o14912J40288q9088L88608K65216J247232
3167A3731840L38432l21536L40992j92000p7824J222656m27520R02656R50784
3158A6468480j325568K086912q47872Q64256L89632J43360R51808Q73984n61664
$$ plain form
3149 19043328 21177344 21629440 22846464 22021632 23248896 23932928 24411648 24654848 25246720
3140 25246720 26083328 27193856 27206656 28176384 30462976 30459392 29723648 30675968 32874496
3131 32874496 32263680 32177664 32712704 31535104 29237248 25873408 22784512 20357632 16969728
3122 16969728 14399488 13729792 11090432 11927552 11144704 9952256 9634304 10709504 10459648
3113 10459648 9542656 10261504 9566208 10186752 9839616 9954304 10539520 9437696 9140224
3104 9140224 8860672 9294848 8105472 9012224 8430080 8315904 7956992 7164928 7593984
3095 7593984 7320064 7266304 6637056 5984256 5696512 6249984 5979648 6329344 5745664 6022144
3085 6022144 6168064 4959744 4395008 4249600 5764096 5679616 4527616 5691392 4992512
$$ packed form
3149A9043328K134016M52096J217024q24832J227264O84032M78720K43200N91872
3140B5246720Q36608J110528J2800R69728K286592l584p35744R52320K198528
3131C2874496o10816q6016N35040j177600k297856l363840l088896k426880l387904
3122A6969728k570240o69696k639360Q37120p82848j192448l17952J075200k49856
3113A0459648r16992P18848o95296O20544l47136J14688N85216j101824k97472
3104I140224k79552M34176j189376R06752n82144j14176l58912p92064M29056
3095G593984k73920n3760o29248o52800k87744N53472k70336L49696n83680K76480
3085F022144J45920j208320n64736j45408J514496q4480j152000J163776o98880
$$ plain form
3076 4992512 5916672 5029376 5074944 4886016 5098496 4861440 4513280 5067776 4932608 5106176
3066 5106176 4877312 4623360 5125120 4555264 5014016 4680704 3998720 4217856 4255232 4095488
3056 4095488 4816384 5925888 4510208 4980224 5180416 5542400 5388288 3967488 5988864
3047 5988864 5028352 4393472 5366784 4915712 4999680 4319744 4879360 4708864 6000128 5492736
3037 5492736 5256704 4889600 5701120 5498880 4254208 4805120 3824128 4987392 5019648
3028 5019648 4918272 5538304 6161408 4568064 5273600 5332992 5190656 5213184 6957056 5340672
3018 5340672 5570560 4774400 4881920 5348864 4997120 4579328 4947456 4941312 4900864 5319680
3008 5319680 4438528 4592640 5379072 5583360 4888576 4100096 4899840 5369856 5000192 4524544
$$ packed form
3076D992512R24160q87296M5568j88928K12480k37056l48160N54496j35168J73568
3066E106176k28864k53952N01760n69856M58752l33312o81984K19136L7376j59744
3056D095488P20896J109504j415680M70016K00192L61984j54112j420800K021376
3047E988864r60512o34880R73312m51072Q3968o79936N59616j70496J291264n07392
3037E492736k36032l67104Q11520k02240j244672N50912r80992J163264L2256
3028E019648j01376O20032O23104j593344P05536N9392j42336K2528J743872j616384
3018E340672K29888p96160J07520M66944l51744m17792L68128o144m0448M18816
3008E319680q81152J54112P86432K04288o94784p88480P99744M70016l69664m75648
$$ plain form
2998 4524544 5032960 5409792 4142080 4746752 4090368 3789312 4747264 4155904 4877824
2989 4877824 5268992 3438592 4241408 4059648 5199360 4439552 5048832 5014016 4472320
2980 4472320 5952000 6688256 5501440 5418496 5743104 5935104 6085632 6831616 6606848
2971 6606848 7456768 6561280 7724032 8754688 9713664 9836032 11853824 15944704 19422208
2962 19422208 20168704 18398720 18593280 20110336 13160448 9358848 6955520 5876224
2954 5876224 4289024 4967936 3981824 4291072 3425792 3670528 4718080 3951104 4988928
2945 4988928 4415488 4463616 3476480 4910080 4908544 3880448 4758528 3821568 3998208 4713984
2935 4713984 5178880 5152768 4597760 3848704 3866624 4652032 4876288 4226048 5507072 4495360
$$ packed form
2998D524544N08416L76832j267712O04672o56384l01056R57952n91360P21920
2989D877824L91168j830400Q02816j81760J139712p59808O09280l4816n41696
2980D472320J479680P36256j186816q2944L24608J92000J50528P45984k24768
2971F606848Q49920q95488J162752J030656R58976J22368K017792M090880L477504
2962A9422208P46496j769984J94560J517056o949888l801600k403328j079296
2954E876224j587200O78912r86112L09248q65280K44736J047552p66976J037824
2945D988928n73440M8128r87136J433600j536j028096Q78080r36960J76640P15776
2935D713984M64896k6112n55008p49056J7920P85408K24256o50240J281024j011712
$$ plain form
2925 4495360 4887040 5761024 5876224 6588928 4889600 5472256 6084608 5857792 5121024
2916 5121024 6147584 5455872 7564800 5760512 5462528 6295552 6824960 6020096 6680576
2907 6680576 6616064 6500864 7096320 6075392 6932480 7760384 7937024 7991296 8435200 8041984
2897 8041984 8180736 9594368 11315200 12284928 13367808 14559232 16053248 16799744 16506880
2888 16506880 17009152 17083392 18400768 19204096 18428416 18937344 20531200 20015616 20910592
2879 20910592 20637184 23031296 22729216 24636416 25908224 27187200 29352960 29768704 29240320
2870 29240320 27511296 23759872 21855744 18271744 16589312 14200832 12573184 10281984
2862 10281984 10770944 9052160 8146432 6908928 7985664 7686656 5602304 6750208 7337984
$$ packed form
2925D495360L91680Q73984J15200P12704j699328N82656O12352k26816p36768
2916E121024J026560o91712K108928j804288k97984Q33024N29408q04864O60480
2907F680576o4512j15200N95456j020928Q57088Q27904J76640N4272M43904l93216
2897H041984J38752J413632J720832R69728J082880J191424J494016P46496k92864
2888A6506880N02272P4240J317376Q03328p75680N08928J593856n15584Q94976
2879B0910592k73408K394112l02080J907200J271808J278976K165760M15744n28384
2870B9240320j729024l751424j904128l584000j682432k388480j627648k291200
2862A0281984M88960j718784r05728j237504J076736k99008k084352J147904N87776
$$ plain form
2853 7337984 7405568 6522880 6661120 6800384 6912000 7157760 6809088 6146048 5942272 6999552
2843 6999552 5682176 5913088 5803520 5622784 5662720 5170688 5365248 5739520 5308416 6138368
2833 6138368 4581888 5363712 4555264 5066240 4541952 3922944 5418496 4790784 4947968
2824 4947968 5074432 4018176 4285440 4618752 4626944 4311552 5167616 4381184 4468224 3750912
2814 3750912 4579328 3337728 4203520 4915200 4701184 4064256 3111936 3841536 4104704
2805 4104704 4366848 3462656 3419136 3758080 3774976 3775488 3684352 4530176 5024768 3411456
2795 3411456 5314048 4899840 3893248 3398656 4154368 5319168 3857920 3322880 3512832
2786 3512832 3936768 3327488 3497472 4465664 3784704 3667968 4349440 3433472 4271616 3736576
$$ packed form
2853G337984O7584q82688J38240J39264J11616K45760l48672o63040k03776J057280
2843F999552j317376K30912j09568j80736L9936m92032J94560L74272m31104Q29952
2833F138368j556480P81824q08448N10976n24288o19008J495552o27712J57184
2824D947968J26464j056256K67264L33312Q192l15392Q56064p86432Q7040p17312
2814C750912Q28416j241600Q65792P11680k14016o36928r52320P29600K63168
2805D104704K62144r04192m3520L38944J6896N12r1136Q45824M94592j613312
2795C411456J902592m14208j006592m94592P55712J164800j461248n35040J89952
2786C512832M23936o09280J69984R68192o80960j16736O81472r15968Q38144n35040
$$ plain form
2776 3736576 4225536 4038656 3456512 2578432 4066816 3558400 3752448 3347456 4797952
2767 4797952 4090880 3796480 3581952 4393984 4466688 3956224 4645888 3645440 4060672 3659264
2757 3659264 4220928 4462592 4372992 5586432 4242432 5566464 6396416 6863872 6030336
2748 6030336 8781824 8500736 11375616 16537600 26703872 30951936 21757440 13663232
2740 13663232 7810560 5388800 5206528 4916736 3416064 4179456 4691456 3838976 3768320
2731 3768320 2341376 2723328 1616896 2913792 3334144 2742784 2186240 3515392 3930624
2722 3930624 2698752 3694592 3253248 4158464 2436096 4652032 3971584 3051520 3732480
2713 3732480 3059712 3990016 2628608 3659264 2525696 2846208 3512320 3864064 3907072
$$ packed form
2776C736576M88960j86880n82144q78080J488384n08416J94048m04992J450496
2767D797952p07072k94400k14528Q12032P2704n10464O89664j000448M15232m01408
2757C659264N61664K41664q9600J213440j344000J324032Q29952M67456q33536
2748F030336K751488k81088K874880N161984J0166272M248064r194496q094208
2740A3663232n852672k421760j82272k89792j500672P63392N12000q52480p0656
2731C768320j426944L81952j106432J296896M20352n91360n56544J329152M15232
2722C930624j231872R95840m41344R05216j722368K215936o80448r20064O80960
2713C732480o72768R30304j361408J030656j133568L20512O66112L51744M3008
$$ plain form
2704 3907072 4719616 4591616 4289536 4219392 3469824 2770432 4007936 2350080 3120128
2695 3120128 2956800 3239936 3367936 2948096 3607040 2618880 3115008 3239424 3639808 3040256
2685 3040256 4001792 3847168 2616832 3835392 3902464 3464192 5039616 3834368 4272128
2676 4272128 4012032 5017600 4903424 4581888 4054528 5332480 5761024 5326336 5385216
2667 5385216 6014464 5892608 7049728 6552576 7379968 8040448 9049600 9207808 10080768
2658 10080768 11900928 13167104 17858560 26595840 40647680 43244544 34706432 22663168
2650 22663168 15101952 13312512 13142528 14960128 16739840 22323712 34013184 32696832
2642 32696832 22441472 17119744 13619712 14730240 14666752 19486720 30651392 45657088
$$ packed form
2704C907072Q12544j28000l02080p0144p49568o99392J237504j657856P70048
2695C120128j63328K83136J28000m19840O58944r88160M96128J24416M00384n99552
2685C040256R61536j54624j230336J218560O7072m38272J575424j205248M37760
2676D272128k60096J005568j14176l21536n27360J277952M28544m34688N8880
2667E385216O29248j21856J157120m97152Q27392O60480J009152J58208Q72960
2658A0080768J820160J266176M691456Q737280J4051840K596864q538112j2043264
2650B2663168p561216j789440j69984J817600J779712N583872J1689472j316352
2642C2696832j0255360n321728l500032J110528o3488M819968J1164672J5005696
$$ plain form
2634 45657088 42351104 29966848 19599360 14620160 12411904 12292608 15726080 22141440
2626 22141440 31682560 30087168 20415488 14388224 10034176 8671232 9051136 9207296
2618 9207296 12532736 17648640 17172992 11189760 8533504 6749696 4849664 4589568 4181504
2609 4181504 3786752 3745792 4220928 3196928 3495424 2827776 2535936 3450880 3082752 3704832
2599 3704832 3483136 3567104 4427264 4843008 4958720 4963840 4917248 5538304 4369920 4574720
2589 4574720 5403648 5345792 4183552 5706240 5756416 4155392 5212672 4106240 4651520
2580 4651520 3769344 3653120 2714112 2833920 3316224 1595904 2549248 2621952 2041344 2770432
2570 2770432 3011072 2266112 2754048 2619392 3176448 3058176 2481664 1875968 2210816 1884672
$$ packed form
2634D5657088l305984j2384256j0367488m979200k208256j19296L433472O415360
2626B2141440R541120j595392r671680o027264m354048j362944L79904J56160
2618I207296L325440N115904m75648n983232k656256j783808j900032k60096m08064
2609D181504l94752m0960M75136j024000K98496o67648k91840R14944l68128O22080
2599C704832k21696Q3968Q60160M15744J15712N120m6592O21056j168384K04800
2589D574720Q28928n7856j162240J522688N0176j601024J057280j106432N45280
2580D651520q82176j16224r39008J19808M82304A595904R53344P2704n80608P29088
2570B770432K40640p44960M87936j34656N57056j18272n76512o05696L34848l26144
$$ plain form
2560 1884672 2670592 3481088 1199616 1939968 2917888 2692608 3076608 1937920 2016768
2551 2016768 2028032 1271296 1927680 1605120 2147328 2334208 2067456 2379776 1250816 2135040
2541 2135040 2759680 1811968 1358848 2644992 1821696 1575936 2070528 591360 1867264
2532 1867264 1709568 2638848 2336768 1577472 2400256 1504256 1732608 2045440 2025984 2144768
2522 2144768 2036224 1767424 2404864 2987520 1860096 1195520 2878976 2694656 2424832
2513 2424832 2682880 1721856 2002944 2183168 3102720 2198528 2323968 2084352 2349056 1284608
2503 1284608 2288640 1870848 2213888 1594880 2616832 1988096 3092480 2054144 1733120
2494 1733120 2347008 1938944 2086912 2951680 2165248 2642944 2440192 1446912 2051072 1876480
$$ packed form
2560A884672P85920Q10496A199616P40352R77920k25280L84000j138688P8848
2551B016768J1264p56736O56384l22560N42208J86880k66752L12320j128960Q84224
2541B135040O24640r47712m53120J286144q23296k45760M94592E91360J275904
2532A867264j57696R29280l02080p59296Q22784q96000K28352L12832j9456J18784
2522B144768j08544k68800O37440N82656j127424o64576J683456j84320k69824
2513B424832K58048r61024K81088J80224R19552r04192J25440k39616K64704j064448
2503A284608J004032m17792L43040o19008J021952o28736J104384j038336l21024
2494A733120O13888m08064J47968Q64768p86432M77696k02752r93280O04160j74592
$$ plain form
2484 1876480 1993216 2175488 2024448 2891264 1536000 1083904 2582528 2277376 568320
2474 2367488 1148416 1720832 2698240 2733056 2788352 2215424 2401792 2483200 1793024 2313728
2464 2313728 2629120 2747904 2735104 2561024 2752512 2175488 2046976 2085376 3410432 3015680
2454 3015680 3105280 2570752 2540544 2549760 2060800 3131904 3788288 2415104 1927680 3722752
2444 3722752 3001856 2630656 3094528 2245120 3452416 2029568 3605504 2034688 2969088
2435 2969088 3318784 3003392 2995712 3458048 2544640 2694656 2203648 2651136 3065856 3521024
2425 3521024 4062208 2850816 2896896 3663872 3111424 3467264 3367936 4106752 2451456 5066240
2415 5066240 3566080 3484672 4744704 4106752 3080704 3743232 4274688 3070976 4904448
$$ packed form
2484A876480J16736J82272j51040Q66816j355264m52096J498624l05152E68320
2474B367488A148416N72416R77408L4816N5296n72928J86368Q1408o90176N20704
2464B313728L15392J18784j2800j74080J91488n77024j28512L8400J325056l94752
2454C015680Q9600n34528l0208R216m88960J071104O56384j373184m87424J795072
2444C722752p20896l71200M63872q49408J207296j422848J575936j570816R34400
2435B969088L49696l15392p680M62336r13408J50016m91008M47488M14720M55168
2425C521024N41184j211392M6080P66976n52448L55840r9328P38816j655296K614784
2415E066240j500160q1408J260032o37952j026048O62528N31456j203712J833472
$$ plain form
2406 4904448 5009408 3706368 3769344 4116480 4462592 4692992 4868096 4172288 4871168 5044736
2396 5044736 3955200 4349440 3421696 4661248 4173312 4207104 4266496 4956672 4899328 4648960
2386 4648960 4582400 4521984 4163072 4700672 5328384 4614656 4579840 6460928 5046784 4244992
2376 4244992 5759488 4341760 4925952 5807104 4804608 5328896 5130240 5698048 5169152
2367 5169152 5502464 5310976 4659712 3995648 4156928 3774976 3470336 4485120 3611648
2358 3611648 4095488 4057600 4246528 3804160 4316160 3444736 2976256 3890688 3850752 3841024
2348 3841024 4012544 3299840 3768320 3114496 3896832 3359232 3546112 4028928 3787264 4402688
2338 4402688 3689472 5668352 4229120 3087360 2784768 2782720 2767872 4070400 3288064
$$ packed form
2406D904448J04960j303040O2976L47136L46112K30400J75104o95808O98880J73568
2396E044736j089536L94240r27744J239552m87936L3792N9392O90176n7344k50368
2386D648960o6560o0416l58912N37600O27712p13728l4816J881088j414144q01792
2376D244992J514496j417728N84192Q81152j002496N24288j98656N67808n28896
2367E169152L33312j91488o51264o64064J61280l81952l04640J014784q73472
2358C611648M83840l7888J88928m42368N12000q71424m68480R14432l9936r728
2348C841024J71520p12704M68480o53824P82336n37600J86880M82816k41664O15424
2338D402688p13216J978880j439232j141760l02592k048j4848J302528p82336
$$ plain form
2329 3288064 3342848 3633152 3464704 2464256 2568192 2724864 3201024 2683904 2590720 3276288
2319 3276288 3232768 2616320 3127808 2384896 2571776 2894336 2374144 2394112 3439104 3822080
2309 3822080 3934720 4377088 3817472 1784832 3542016 3054080 3761152 3588096 3408384
2300 3408384 3952640 2229248 3275776 3333632 2960896 2963456 4044800 3873280 2650112
2291 2650112 3868160 2513920 3803648 3837440 2345472 2390528 3409408 3096576 2917376
2282 2917376 2318336 3299840 3524096 2411520 2951680 2153472 3697152 3222528 2635776
2273 2635776 3660288 4178944 2981888 2867200 3448832 3687936 3639296 3947520 2821120
2264 2821120 3096064 4555776 3860480 4217344 3650560 4300800 4036096 2787328 2785280 3363328
$$ packed form
2329C288064N4784K90304j68448j000448J03936J56672M76160n17120r3184O85568
2319C276288m3520o16448N11488p42912J86880L22560n20192J9968J044992L82976
2309C822080J12640M42368n59616A784832J757184m87936P07072j73056j79712
2300C408384N44256j723392J046528N7856l72736K560J081344j71520j223168
2291B650112J218048j354240J289728L3792j491968M5056J018880l12832j79200
2282B917376n99040R81504K24256j112576N40160p98208J543680m74624n86752
2273B635776J024512N18656j197056j14688N81632K39104m8640L08224j126400
2264B821120K74944J459712o95296L56864n66784O50240k64704j248768k048N78048
$$ plain form
2254 3363328 4014592 2625536 3113984 4521472 3934720 3744768 3050496 4222976 3473920
2245 3473920 3084800 3793408 3938304 3655168 3859968 4160000 4035072 4068864 4567552 3462656
2235 3462656 4593152 4316160 3866624 4872704 2368512 4422656 3681792 4604928 3348480
2226 3348480 4058112 3128320 4088832 3416576 3543040 2802176 3943424 4170752 3860992
2217 3860992 4128768 4620800 3869184 4042752 2627584 4484608 5267968 5537280 3909120
2208 3909120 4720640 5159936 5131264 4534272 4057600 5239296 5364736 5156352 5423104 4866560
2198 4866560 5624320 4593664 5006848 6315008 5945856 6595072 5771264 6662656 4925952
2189 4925952 6053888 6704128 6019072 5993984 6341120 6212096 6678528 6646784 7159808 7284224
$$ packed form
2254C363328O51264j389056M88448J407488n86752j89952o94272J172480p49056
2245C473920l89120P08608J44896k83136K04800L00032j24928L3792M98688j104896
2235C462656J130496k76992m49536J006080B368512K054144p40864R23136j256448
2226C348480P09632r29792R60512o72256J26464p40864J141248K27328l09760
2217C860992K67776M92032p51616J73568j415168J857024P83360K69312j628160
2208C909120Q11520M39296k8672n96992m76672J181696J25440k08384K66752n56544
2198D866560P57760j030656M13184J308160l69152O49216q23808Q91392j736704
2189D925952J127936O50240o85056k5088L47136j29024M66432l1744N13024J24416
$$ plain form
2179 7284224 6796288 7249408 8121856 7133184 7913472 7192064 7540736 7520768 7772672 7566336
2169 7566336 7793664 8136192 7209984 7545856 7050240 7430144 8100864 8974336 7757824
2160 7757824 7314432 7617024 7520256 8440320 8258048 7822336 7878144 8099840 9659392 8526336
2150 8526336 8731648 9384448 9217536 7668736 8856576 7152640 6859264 7267840 6957056
2141 6957056 7117824 6935040 7712768 6691840 6657024 6323712 7901696 5727232 6743040
2132 6743040 5094400 6531072 6710272 5904384 5742592 7293952 6565376 6432256 6859776
2123 6859776 7270912 7540736 7394304 7118848 7557632 6914048 6804992 5558784 6548480
2114 6548480 7255552 6309888 5814272 6827520 6436864 6534144 5568000 5757440 5126656 5514240
$$ packed form
2179G284224m87936M53120Q72448r88672P80288p21408L48672j9968K51904k06336
2169G566336K27328L42528r26208L35872m95616L79904O70720Q73472j216512
2160G757824m43392L02592r6768R20064j82272m35712N5808K21696J559552j133056
2150H526336K05312O52800j66912j548800J187840j703936k93376M08576l10784
2141F957056J60768j82784P77728j020928l4816l33312J577984k174464J015808
2132F743040j648640J436672J79200q05888j61792J551360p28576j33120M27520
2123F859776M11136K69824j46432k75456M38784o43584j09056j246208R89696
2114F548480P07072r45664m95616J013248l90656R7280r66144J89440o30784L87584
$$ plain form
2104 5514240 4929536 5464576 4561408 5828608 5825536 4302336 4852224 4625920 4518400 4216320
2094 4216320 5195264 4208640 4962304 5132288 5002240 6506496 4806144 5061120 5078528
2085 5078528 4642816 5702144 5335552 6827008 6177792 6127616 5799936 5295104 5977600
2076 5977600 6051328 6010880 6603264 5997568 5553152 5900800 6108160 6303744 6173696 5420032
2066 5420032 5888512 6174720 6169088 6532608 5890560 6357504 5883392 6166016 6031872 6990336
2056 6990336 6369792 5999104 5819904 8016896 6980608 8020480 7063040 7705088 7901184
2047 7901184 7860736 8156672 8850944 8015872 8403456 8675840 9451520 9137664 9290752 9639424
2037 9639424 9135104 9261056 8191488 9553920 10211840 7355904 8998400 8987136 8426496
$$ packed form
2104E514240n84704N35040r03168J267200l072j523200N49888k26304j07520l02080
2094D216320R78944r86624P53664J69984j30048J504256j700352K54976J7408
2085E078528m35712J059328l66592J491456o49216n0176l27680n04832O82496
2076E977600P3728m0448N92384o05696m44416L47648K07360J95584j30048p53664
2066E420032M68480K86208n632L63520o42048M66944m74112K82624j34144R58464
2056F990336o20544l70688j79200K196992j036288J039872r57440O42048J96096
2047G901184m0448K95936O94272q35072L87584K72384P75680l13856J53088L48672
2037I639424n04320J25952j069568J362432O57920k855936J642496j1264n60640
$$ plain form
2028 8426496 8068608 9124352 8087040 8629248 8223232 9009664 9323008 8729600 9839104
2019 9839104 9325568 7882752 8937984 9431040 8139264 8972288 9499136 9022464 8440320
2010 8440320 8937472 9921024 8816128 7980544 9072128 9706496 9822720 9445376 9519104
2001 9519104 8122880 9426432 10141184 9404416 9385984 9590784 9139712 9102336 8665600 9279488
1991 9279488 10099712 7794688 8622592 9211392 8720896 9663488 8671744 10083840 10525184
1982 10525184 12847104 17516544 25971712 28769280 21498880 13496320 10609664 8570368
1974 8570368 7900672 7791104 7647232 7256576 7605248 7296512 6949376 6115840 7172608
1965 7172608 7085568 5386752 5752832 6329856 6912512 6027264 5749760 5875200 6184960 6438912
$$ packed form
2028H426496l57888J055744j037312N42208m06016P86432L13344n93408J109504
2019I839104n13536j442816J055232M93056j291776Q33024N26848m76672n82144
2010H440320M97152R83552j104896q35584J091584O34368J16224l77344P3728
2001I519104j396224J303552P14752p36768j8432K04800m51072l7376m36736O13888
1991I279488Q20224k305024Q27904N88800m90496R42592r91744J412096M41344
1982A0525184K321920M669440Q455168K797568p270400q002560k886656k039296
1974H570368o69696j09568j43872l90656L48672l08736l47136q33536J056768
1965G172608q7040j698816L66080N77024N82656q85248k77504J25440L09760K53952
$$ plain form
1955 6438912 6327296 5323264 6246912 6250496 6035968 5277184 5570048 5237760 5511680 5650944
1945 5650944 4830208 4770304 5203456 5684736 5737472 6064128 5024768 6189568 5262336 5458944
1935 5458944 6502912 6252032 6214144 4994048 5488128 4969472 5416960 4784128 6012928
1926 6012928 4893184 5606912 5354496 5804544 6203392 6254080 5949440 5073920 6660096
1917 6660096 6548992 6177280 6081536 6592512 7097856 6769664 6397440 6270976 6641152 7242752
1907 7242752 7090688 7574528 7171072 7339008 7415808 7729152 7945216 7672832 7355392 7900672
1897 7900672 7270912 8773120 9004544 8508416 8080896 8028160 8391680 7689216 7260672 7794176
1887 7794176 7713792 7303680 6305792 6190592 6880768 5108736 5283328 6137856 6295040 6016000
$$ packed form
1955F438912j11616j004032R23648L584k14528p58784K92864l32288K73920J39264
1945E650944q20736n9904M33152M81280N2736L26656j039360J164800r27232J96608
1935E458944J043968k50880l7888j220096M94080n18656M47488o32832J228800
1926F012928j119744P13728k52416M50048L98848N0688l04640q75520J586176
1917F660096j11104l71712r5744N10976N05344l28192l72224j26464L70176O01600
1907G242752j52064M83840m03456J67936P6800L13344K16064k72384l17440N45280
1897G900672o29760J502208K31424m96128m27520n2736L63520p02464m28544N33504
1887G794176q0384m10112r97888j15200O90176j772032J74592Q54528J57184k79040
$$ plain form
1877 6016000 5861376 5326336 4956160 5429248 6740992 5955584 5583360 6105600 6973440
1868 6973440 5964800 7702528 6796288 5953024 7243776 6326784 6134784 6552064 7349760
1859 7349760 7919104 6708224 7576576 6639616 7424512 7360000 6696960 7693312 9005568
1850 9005568 7395328 7277056 8111104 7461888 7767040 8226816 7672832 8535040 7405568
1841 7405568 7696896 9277952 9281536 8827392 8372224 9059840 9172480 9679872 9175040 10089984
1831 10089984 9838592 10172928 9940992 9686528 10600448 10241024 11239424 10985984 11158528
1822 11158528 11321856 10467840 10093056 10606592 10674176 12113408 10720768 9187328 10235392
1813 10235392 9684480 10681344 9800192 9357824 8930816 9929216 9929728 10601984 9837056 9563648
$$ packed form
1877F016000j54624n35040l70176M73088J311744p85408l72224N22240Q67840
1868F973440j008640J737728r06240q43264J290752r16992j92000M17280P97696
1859G349760N69344j210880Q68352r36960P84896o4512o63040R96352J312256
1850I005568j610240j18272Q34048o49216L05152M59776n53984Q62208j129472
1841G405568K91328J581056L584m54144m55168O87616J12640N07392n04832R14944
1831A0089984k51392L34336k31936k54464R13920l59424R98400k53440J72544
1822A1158528J63328q54016l74784N13536O7584J439232j392640j533440J048064
1813A0235392n50912R96864q81152m42368m27008R98400N12O72256p64928k73408
$$ plain form
1803 9563648 8158720 9736704 10095104 9396224 10097664 9667072 9467392 8422400 9882112
1794 9882112 8292864 9059840 9674240 8964608 10237440 9482240 9199616 9679872 9271296
1785 9271296 9205248 9823232 9627136 8377344 9920512 8760832 8954880 7869440 8282112
1776 8282112 8631296 8924672 8280064 7194624 8450560 8636928 8140800 7895552 7338496
1767 7338496 6792704 7111168 7718912 7599616 6906368 7800320 6732288 7502336 6993408
1758 6993408 6287872 6150656 7465984 6311936 7299072 6646272 7230464 6031360 6366720
1749 6366720 6414336 6598656 6497792 5678592 6936064 6922752 7215104 6680576 6740992 6414336
1739 6414336 6513152 6479360 8231936 6329344 7181824 5844480 7310848 7002624 6298624
$$ packed form
1803I563648j404928J577984L58400o98880P01440m30592j99680j044992J459712
1794I882112j589248P66976O14400p09632J272832p55200k82624M80256m08576
1785I271296o6048O17984j96096j249792J543168j159680J94048j085440M12672
1776H282112L49184K93376o44608j085440J255936J86368m96128k45248n57056
1767G338496n45792L18464O07744j19296o93248Q93952j068032P70048n08928
1758F993408p05536j37216J315328j154048R87136o52800N84192j199104L35360
1749F366720M7616J84320j00864q19200J257472j3312K92352n34528O0416l26656
1739F414336R8816l3792J752576j902592Q52480j337344J466368l08224p04000
$$ plain form
1730 6298624 6629888 6392832 6548992 7513600 7940096 7389184 6831616 8256000 7751168
1721 7751168 7467008 7811584 7874560 8825344 6654976 7475712 8292864 8650240 7564288
1712 7564288 8505344 9024000 8842240 8351744 8281600 8771584 9789440 7869440 9484288
1703 9484288 8819200 10686976 10478592 10275328 10207232 10441216 10771968 11527680 11432960 11017216
1693 11017216 11260928 12078592 12344320 12319744 11947008 12353024 13376512 13058560 14036992
1684 14036992 14535680 13809664 14392832 15579136 15584256 16634880 16439808 17673728 19144704
1675 19144704 19177472 19493888 21337600 21828608 22417408 23456768 24762368 26474496 27186176
1666 27186176 28487680 30324736 30746112 32312832 32783360 33309696 34856960 35061760 35269632
$$ packed form
1730F298624L31264k37056J56160R64608M26496n50912n57568J424384n04832
1721G751168k84160L44576O2976R50784k170368Q20736Q17152L57376j085952
1712G564288R41056N18656j81760m90496p0144M89984J017856j920000J614848
1703I484288o65088J867776k08384k03264o8096K33984L30752P55712r4720m15744
1693A1017216K43712Q17664K65728k4576l72736M06016J023488l17952R78432
1684A4036992M98688p26016N83168J186304N120J050624j95072J233920J470976
1675A9144704L2768L16416J843712M91008N88800J039360J305600J712128P11680
1666B7186176J301504J837056M21376J566720M70528N26336J547264K04800K07872
$$ plain form
1657 35269632 36877824 36428288 36374528 37233664 38887424 41058304 41162240 43622912 45216256
1648 45216256 46089216 49798656 52276224 54950400 57589760 61567488 66172416 70839296
1640 70839296 77442048 84896768 92462592 98864640 102402048 101168128 96649216 88012800
1632 88012800 79808512 70042112 59325952 50750976 43073024 33264128 29365760 25115648
1624 25115648 20969984 19521024 17164288 16206848 14016000 13654528 12512256 12433408 10700800
1615 10700800 10914816 10836992 11056640 9600000 10587648 9669120 9588736 9205248 8603136 8478208
1605 8478208 7639552 8054272 7320576 6842880 8417792 6653952 7452672 7821312 7080960
1596 7080960 6855168 4951552 6180352 5179392 5718016 5431808 5899776 5306880 5364224
$$ packed form
1657C5269632J608192m49536n3760Q59136J653760K170880J03936K460672J593344
1648D5216256Q72960L709440K477568K674176K639360L977728M604928M666880
1640G0839296O602752P454720P565824O402048L537408j233920m518912q636416
1632H8012800q204288r766400j0716160q574976p677952r808896l898368m250112
1624B5115648m145664j448960k356736r57440k190848l61472j142272p8848j732608
1615A0700800K14016p7824K19648j456640R87648r18528q0384l83488o02112j24928
1605H478208q38656M14720p33696m77696J574912j763840P98720L68640p40352
1596G080960k25792j903616J228800j000960N38624k86208M67968n92896N7344
$$ plain form
1587 5364224 6045696 5996032 6175744 5842432 5683200 6110720 5980672 5441536 5346304 4238336
1577 4238336 4103680 4110848 4312576 5483008 3804160 5521408 3740160 4915712 4569088
1568 4569088 4239360 3891200 4508672 3631104 3858432 3667968 4771328 3193856 3789312
1559 3789312 4134400 4018176 4080128 3282432 3353088 2758144 3340800 2721792 3786752 4717568
1549 4717568 3894272 2886656 4377600 2974208 4357632 4447232 3931648 3350016 3692544
1540 3692544 3555840 3276800 2792960 3821056 2949632 3720192 4451840 4142080 4427264
1531 4427264 3762688 3746304 4911104 3763712 3898368 4389888 3525120 4549120 4233728
1522 4233728 4679680 3996160 4399616 3456512 4650496 4496384 4715520 3975680 5660672
$$ packed form
1587E364224O81472m9664J79712l33312j59232M27520j30048n39136r5232j107968
1577D238336j34656P168K01728J170432j678848J717248j781248J175552l46624
1568D569088l29728l48160O17472q77568K27328j90464J103360j577472N95456
1559C789312L45088j16224O1952p97696P0656n94944N82656o19008J064960R30816
1549D717568q23296j007616J490944j403392J383424Q9600n15584n81632L42528
1540C692544j36704k79040m83840J028096q71424P70560P31648l09760K85184
1531D427264o64576j6384J164800j147392J34656M91520q64768J024000l15392
1522D233728M45952o83520M03456r43104J193984j54112K19136p39840J684992
$$ plain form
1513 5660672 4842496 4997120 4790784 3802112 5360128 3747328 5821952 5353984 5607424
1504 5607424 5105152 5079552 5417984 5400064 5590528 5846528 5443072 6314496 6012928 6689280
1494 6689280 6666752 5629952 7692288 7128064 7379968 8382464 8556032 9698304 9434624
1485 9434624 11222016 11874816 11470848 10786304 11152384 9029120 9289728 9211904 8837120
1476 8837120 8550400 8464896 8707072 9192960 8635904 8755712 7611904 8060416 8732160 8962048
1466 8962048 7471616 8087040 7859712 8184320 6662144 7495680 7617536 8449536 7456768
1457 7456768 8219648 9530368 7521280 8357376 9308672 8736256 9280512 9290752 11724800
1448 11724800 12172800 12912640 12417536 12113408 11552256 13737984 13138432 11967488 11661312
$$ packed form
1513E660672q18176J54624k06336r88672J558016j612800K074624m67968K53440
1504E607424n02272k5600L38432j7920J90464K56000m03456Q71424l01568O76352
1494F689280k2528j036800K062336n64224K51904J002496J73568J142272k63680
1485I434624J787392O52800m03968o84544L66080k123264K60608p7824l74784
1476H837120k86720q5504K42176M85888n57056J19808j143808M48512O71744K29888
1466H962048j490432O15424k27328L24608j522176Q33536J21856Q32000r92768
1457G456768P62880J310720k009088Q36096R51296n72416N44256J0240K434048
1448A1724800M48000P39840m95104l04128n61152K185728n99552j170944l06176
$$ plain form
1439 11661312 10915328 10060288 8842752 8367104 7281152 8477696 6756864 6738944 7262208
1430 7262208 7598080 7852032 7096320 5975040 6360064 6779392 7041536 6749184 6799872 7886848
1420 7886848 7918592 8427008 9103872 9506816 9358848 8475648 10150912 9754112 9144320 9145856
1410 9145856 8766464 6734336 8629248 7427584 7585280 6921728 6338560 7733248 6183424
1401 6183424 6178816 6405632 5902848 5944832 5110784 4966912 6473728 4972032 5321216 5507072
1391 5507072 6112256 5253632 5876224 5460480 5726208 5505536 4333056 3749376 5077504
1382 5077504 4115456 4571136 4610560 4340224 4387840 4070912 3408384 3091456 3867648 3840512
1372 3840512 3455488 3348480 2933760 2687488 1990144 1429504 1804800 2209280 1907200 2113024
$$ packed form
1439A1661312p45984q55040j217536m75648j085952J196544j720832j7920N23264
1430G262208L35872K53952p55712j121280L85024M19328K62144k92352N0688J086976
1420G886848L1744N08416O76864M02944j47968q83200J675264l96800o09792J536
1410I145856l79392k032128J894912j201664J57696o63552n83168J394688j549824
1401F183424m608K26816n02784M1984q34048j43872J506816j501696L49184J85856
1391E507072O05184q58624O22592m15744K65728k20672j172480n83680J328128
1382E077504r62048M55680L9424k70336M7616l16928o62528l16928P76192k7136
1372C840512l85024j07008m14720k46272o97344n60640L75296M04480l02080K05824
$$ plain form
1362 2113024 2660352 2561024 2024960 2037760 2207744 2537984 2624000 3118592 1229312 3211264
1352 3211264 2108416 1821184 1512960 1948672 1345024 1621504 2437120 1347072 1539584
1343 1539584 1021440 1262592 1368064 2489856 1617408 1302528 1958400 1150464 807936
1334 807936 2055680 1617408 898560 1789440 2131456 1549824 1045504 1353216 1008128 1790464
1324 1790464 1208832 2158080 769536 2203136 1772032 2044416 1467392 1425408 1295872 473088
1313 1801728 874496 718848 1613824 1571840 1451008 774144 1330176 1159168 1037312 2225664
1303 2225664 1355264 1345024 1584128 1916928 1107968 1093632 1297408 1401856 1118208 1202688
1293 1202688 1224704 1734144 1595904 1190400 684544 1679872 1108480 1449984 1819136 1522688
$$ packed form
1362B113024N47328r9328n36064J2800J69984L30240Q6016M94592A229312J981952
1352C211264j102848k87232l08224M35712o03648K76480Q15616j090048J92512
1343A539584n18144K41152J05472J121792q72448l14880O55872q07936l42528
1334H07936J247744m38272p18848Q90880L42016n81632n04320L07712l45088P82336
1324A790464n81632R49248G69536J433600m31104K72384n77024m1984j29536D73088
1313A801728H74496j55648Q94976m1984j20832o76864N56032j71008j21856J188352
1303B225664q70400j0240K39104L32800q08960j4336K03776J04448k83648Q4480
1293A202688K2016N09440j38240m05504n05856R95328n71392L41504L69152k96448
$$ plain form
1283 1522688 1697280 1626624 2070528 1518592 1894912 1882624 1446400 1090048 1072640 898560
1273 898560 2562048 1402880 2267648 1196544 676352 2411008 2248704 3098112 2622976
1264 2622976 2162176 2157568 1592832 2307584 3445760 3053056 3334144 3507200 2949120 2667008
1254 2667008 2205184 572416 1647616 1863680 1706496 1287168 991232 1323008 -124416
1244 -515584 1164288 762880 1428992 1560064 1482752 1465344 1318912 1460736 725504 1202688
1234 1202688 1168384 1735680 117760 1612800 -97792 110592 1796608 2516480 1739264 1582080
1224 1582080 1615360 1417216 1161728 670208 738816 115200 1149440 1224704 696832 715264
1214 715264 1052672 1384960 1604096 1266688 1225728 2182144 888320 1121792 1095680 1087488
$$ packed form
1283A522688J74592p0656M43904n51936L76320j2288m36224l56352j7408j74080
1273H98560J663488j159168Q64768j071104n20192J734656j62304Q49408m75136
1264B622976m60800m608n64736P14752J138176l92704K81088J73056n58080k82112
1254B667008m61824E72416J075200K16064j57184m19328k95936L31776a24416
1244e15584A164288m01408O66112J31072p7312j7408j46432J41824G25504M77184
1234A202688l4304N67296A17760J495040i7792A10592J686016P19872p77216j57184
1224A582080L3280j98144k55488m91520O8608A15200J034240P5264n27872J8432
1214G15264L37408L32288K19136l37408m0960R56416H88320K33472k6112q192
$$ plain form
1204 1087488 581120 1235968 947200 830976 1263104 1486848 -52736 1033728 1968128 1888256
1194 1888256 1809920 2040320 1851392 453120 1726976 238080 61952 1108480 311296 864256
1184 864256 858112 857088 2363904 1613824 684032 1513984 1557504 1230336 812544 1353728
1174 1353728 1141760 1351168 1441280 1237504 2070016 1120256 1619456 1249280 1781760 842752
1163 1553408 2093056 1303552 1561600 1319424 1628160 1756672 2113536 2628096 1583616
1154 1583616 1205248 476672 1335808 2380288 1141760 2436608 2014208 2019840 1984512 1383424
1144 1383424 2072064 2769920 2050560 1850880 2112000 1812992 2911232 1747456 3072512
1135 3072512 2204672 3469312 3158016 2394624 2899968 1560064 3395072 3085312 2478080
$$ packed form
1204A087488n06368O54848k88768j16224M32128K23744e2736A033728R34400p9872
1194A888256p8336K30400j88928D53120J273856B38080F1952J046528C11296N52960
1184H64256o144j024J506816p50080F84032Q29952M3520l27168m17792N41184
1174A353728k11968K09408R0112k03776Q32512r49760M99200l70176N32480H42752
1163A553408N39648p89504K58048k42176L08736J28512L56864N14560j044480
1154A583616l78368D76672Q59136J044480A141760J294848m22400N632l5328o01088
1144A383424O88640O97856p19360j99680K61120k99008J098240j163776J325056
1135C072512q67840J264640l11296p63392N05344j339904J835008l09760o07232
$$ plain form
1126 2478080 3090944 1321984 3184640 2185216 3538944 3095552 2392576 3047424 2565632
1117 2565632 2751488 1107456 2115072 2624000 1779712 976896 680448 1485312 1313280
1108 1313280 1100800 222208 1769984 1565696 796160 954368 1382912 1559040 440320
1098 1892864 1081344 241664 1024512 -286208 1555456 1290752 462336 943616 967680 379392
1087 978944 -2560 482816 238080 980480 428544 1439232 952832 1060864 35840 64512
1077 64512 749056 751616 841216 1099776 1558016 400896 -81920 887296 1168384 455680 368128
1066 368128 526848 1400320 370688 -290304 1594880 1017344 956928 518656 -66048 1202688
1055 561664 150528 592384 1251328 581120 1053184 -343040 -96768 1053184 995328 1321472
$$ packed form
1126B478080O12864A321984J862656r99424J353728m43392p02976O54848m81792
1117B565632J85856A107456J007616N08928q44288q02816k96448Q04864j72032
1108A313280k12480B22208J547776k04288p69536J58208M28544J76128D40320
1098A892864q11520B41664P82848b86208A555456k64704D62336M81280K4064C79392
1087I78944b560D82816B38080P42400D28544J010688m86400J08032C5840K8672
1077F4512O84544K560Q9600K58560M58240D00896h1920H87296K81088D55680q7552
1066C68128J58720Q73472C70688b90304A594880n77536o0416m38272f6048A202688
1055E61664A50528M41856O58944E81120M72064c43040i6768A053184n7856L26144
$$ plain form
1045 1321472 225792 794624 907264 1062400 1550336 1048576 611840 130048 1796608
1036 1796608 384512 267264 1797120 1738752 1815552 1548288 2416128 2301440 2345472 2084864
1026 2084864 2202624 1700864 2570240 2908672 3265024 3798528 5650432 7337472 6558720
1017 6558720 5291008 5736960 5719552 6336000 6816256 6371328 7351296 8272384 10014208
1008 10014208 11239936 13134336 15804416 18598912 23045120 34444800 64999936 125637632
1000 125637632 137268736 84839424 37948928 21219840 12415488 9833472 6387712
993 6387712 5356032 4679680 2906112 3214336 3082752 1400832 2620416 2091520 2131968
984 2131968 3229184 3951104 5171200 3940864 2667008 2070016 1485824 1603072 595968
$$ packed form
1045A321472B25792N68832J12640J55136M87936n01760m36736A30048J666560
1036A796608C84512j17248J529856n8368P6800k67264Q67840j14688M4032k60608
1026B084864J17760n01760Q69376L38432L56352N33504J851904J687040p78752
1017F558720j267712M45952j7408O16448M80256m44928R79968R21088J741824
1008A0014208J225728J894400K670080K794496M446208J1399680L0555136O0637696
1000A25637632J1631104n2429312C7948928j6729088q804352k582016l445760
993F387712j031680o76352j773568L08224j31584A400832J219584n28896M0448
984B131968J097216P21920J220096j230336j273856n96992n84192J17248E95968
$$ plain form
974 1019392 1902080 1313792 1958912 1462272 1746944 2091520 909824 1087488 761344 394752
964 394752 2463744 656896 1016320 684544 1669632 79360 872960 1159168 942080 2260480
954 2260480 1369088 105984 622592 148992 1445376 796672 392192 146944 417280 697344
944 697344 826368 765440 587776 1356288 1336832 687104 647168 1189376 1238528 276480 1606144
933 1606144 1073152 200704 1630720 1193984 1292288 1008640 1261056 455168 711680 -175616
922 1032192 354304 1020928 989696 898048 1249280 531968 125440 318976 316928 824320
912 824320 1021952 1275392 1348096 1025024 1239552 498176 248832 477184 1651712 -643072
901 -342528 240640 1092608 169472 -591872 419328 802816 456192 133120 -46080 46080
$$ packed form
974A019392Q82688n88288O45120m96640K84672L44576I09824J77664l26144l66592
964C94752K068992F56896L59424l31776R85088G9360P93600K86208k17088J318400
954B260480q91392A05984N16608A48992J296384o48704C92192A46944K70336K80064
944F97344J29024o0928j77664P68512j9456o49728l9936N42208M9152B76480J329664
933A606144n32992B00704J430016m36736R8304k83648K52416D55168K56512a75616
922A032192C54304O66624l1232r1648L51232E31968A25440J93536k048N07392
912H24320J97632K53440P2704l23072K14528D98176B48832K28352J174528f43072
901c42528B40640Q51968A69472e91872D19328L83488l46624A33120d6080D6080
$$ plain form
890 -79360 383488 701440 806912 564736 620544 1330176 1295360 -66048 772096 1310720 419328
878 443904 771584 873984 931328 -129536 606720 1360384 -1308160 241152 875520 1165312
868 1165312 -29184 555008 -518144 87552 299008 266752 -76288 12288 733696 -498176 -217088
856 471040 348160 49152 744448 955904 198656 388608 -525824 441856 276992 532480
846 532480 375808 171520 -401408 -1024000 131584 -264704 963072 796672 87552 745472
836 745472 -701952 846848 47616 325120 -284672 -375808 604160 -133120 219136 296960
826 296960 29184 -268800 476160 -934400 -119296 -98816 134144 866816 93696 -566784
815 196096 -401920 -192000 -338944 82432 535040 1008640 277504 -164352 7680 119296
$$ packed form
890g9360C83488L17952J05472k42176N5808P09632l4816f6048G72096N38624D19328
878D43904L27680J02400N7344a29536F06720P53664a308160B41152O34368K89792
868A165312b9184E55008e18144H7552K11456l2256g6288A2288P21408d98176b17088
856D71040j22880D9152O95296K11456A98656J89952e25824D41856j64864K55488
846E32480j56672A71520d01408o22592A31584b64704I63072j66400H7552O57920
836G45472g01952H46848D7616K77504b84672r1136F04160a33120B19136P7824
826B96960B9184b68800D76160i34400a19296K0480A34144P32672I3696e66784
815A96096d01920a92000j46944H2432M52608M73600B77504a64352G680J11616
$$ plain form
805 119296 -233472 1758208 -170496 -897024 -480768 1145856 -334848 -160768 378368 846848
795 846848 1025024 606720 -340480 1004032 906752 556032 -94720 923136 46592 174592
785 174592 1118208 775680 25088 692224 1277952 230400 680448 791040 1428480 521728
774 13824 1314816 403456 1424384 296448 -193536 1157632 601600 1163776 1476608 1800704
764 1800704 1875968 1949184 473088 954368 136192 1366016 2113024 1046016 1099264 1716736
754 1716736 834560 921088 832512 76288 816128 2485248 1596416 1695744 1486336 1348608
744 1348608 2451968 2247168 1934848 1698816 -252416 105984 216064 1731072 2048 -331264
733 882688 -41472 -532480 303104 -101376 647680 311808 358912 505344 102912 681984
$$ packed form
805A19296b33472A758208a70496p26528M16256A145856c34848a60768C78368M68480
795H46848J78176m18304c40480A004032r7280l50720i4720I23136D6592J28000
785A74592R43616l42528B5088O67136N85728B30400M50048J10592O37440E21728
774A3824J300992D03456J020928B96448a93536A157632n56032N62176L12832L24096
764A800704P5264P3216D73088M81280A36192J229824P47008A046016N3248O17472
754A716736H34560Q6528q8576G6288P39840J669120q88832R9328k09408j37728
744A348608J103360k04800l12320k36032b52416A05984J10080J515008B048c31264
733H82688d1472m91008C03104a01376F47680C11808M7104J46432A02912N79072
$$ plain form
723 681984 -227328 557056 537600 307200 249856 -139264 1208832 836608 -250368 685568
712 -171520 -305152 417792 566272 78336 385536 352768 -455680 141312 230400 -80896 -282624
701 -282624 1771520 234496 -108544 210432 -413696 309760 1408000 727552 80896 301568
691 301568 -315392 -76800 376832 -493568 729600 167936 393216 130560 556544 242176
680 861184 945152 83968 108544 182784 1150464 881664 1020416 -66048 902144 695296 1088000
669 1088000 663040 668672 46592 665088 -249856 769024 554496 69632 45056 -654336 -312832
657 471040 413184 -557056 -364544 -109568 -808960 348160 -218624 805376 304128 -400384
646 -330752 1119232 76800 1176064 -270848 648192 334848 437760 79872 -897024 -832000
$$ packed form
723F81984b27328E57056j9456k30400n7344a39264A208832l72224b50368F85568
712a71520j33632D17792J48480G8336L07200l2768d55680A41312Q9088h0896k01728
701b82624A771520B34496a08544B10432d13696C09760J098240o80448H0896K20672
691C01568c15392g6800C76832d93568G29600A67936K25280A30560M25984B42176
680H61184Q3968H3968K4576P4240R67680k68800J38752f6048I02144k06848L92704
669A088000m24960N632D6592O18496b49856G69024k14528F9632k4576f54336c12832
657D71040n7856e57056J92512a09568o99392C48160b18624H05376C04128d00384
646c30752A119232G6800J099264b70848F48192l13344J02912G9872h97024O5024
$$ plain form
636 -832000 -488448 -976384 -351744 228864 -162304 -866304 528384 -706560 1146880 211456
625 -486400 1233920 76800 58368 -1029632 300032 880128 -443392 231424 -427520 -154112
614 339456 364544 701952 -459776 -887296 32768 -1442816 505856 -500736 -1205248 548864
603 94720 97280 -50688 -722944 185344 397824 316928 -861696 -120832 -410624 -14848 340480
591 52736 19968 138752 -32768 182784 172032 717312 -227840 35328 41472 909312 -211456
579 -463360 287232 728576 -544768 -1051136 440320 65024 946176 -778752 -1094656 -27648
568 -531968 293888 -1063936 291328 -516608 -942592 -670720 -871424 207360 -268288 131072
557 -687104 748544 -1270272 -548352 285184 -64512 -418816 -302080 -820224 -144384 179712
$$ packed form
636h32000L43552m87936c51744B28864a62304p04000E28384g06560A146880B11456
625d86400A233920G6800j8432a029632C00032N80096d43392B31424d27520a54112
614C39456K5088L37408d59776m27520C2768a442816E05856e00736p04512E48864
603I4720K560e0688o72256A85344K12480q0896h61696a20832k89792a4848C40480
591E2736A9968J18784c2768A82784j0752N45280b27840C5328O144Q67840b11456
579d63360B87232M41344e44768n06368D40320F5024Q81152g78752l15904b7648
568e31968B93888a063936B91328e16608m25984K71872k00704B07360b68288A31072
557f87104G48544a270272e48352B85184f4512l54304J16736n18144a44384A79712
$$ plain form
546 1751040 -713216 -482304 -84480 -415744 123392 330752 -33792 541184 -121856 -775168
536 -775168 501760 -153088 68096 -606720 -346112 -353792 367616 -278016 -663040 -442880
526 -442880 -1110016 -61440 196608 -663552 546816 -678400 -443904 455168 51200 56832 -677376
514 -80896 -227328 -372736 804352 481280 -223744 620544 374272 2198016 660992 1315328
504 1315328 402432 551936 272384 -183808 110080 1303040 872448 -1536 627712 519168
494 519168 202752 68096 1283072 353792 526848 1092608 1787392 2298880 2061312 1968640
484 1968640 1101824 1063936 920064 1239552 345600 160768 -948736 490496 497664 34304
473 -143360 -448512 -244736 535040 632832 159232 -1144832 -74240 -201216 -388608 509440
$$ packed form
546A751040g13216K30912h4480l31264A23392K07360c3792E41184a21856o53312
536g75168E01760a53088F8096f06720K60608p680C67616b78016l85024K20160
526d42880o67136f1440A96608f63552E46816f78400K34496D55168E1200N632f77376
514h0896j46432j45408H04352l23072b23744F20544k46272J823744F60992O54336
504A315328D02432J49504B72384a83808A10080J192960m30592a536F27712j08544
494E19168B02752F8096J214976C53792J73056N65760O94784N11488k37568r2672
484A968640q66816l7888j43872L19488C45600A60768i48736D90496P168C4304
473a43360l05152K03776E35040R7792A59232a144832g4240j26976j87392E09440
$$ plain form
462 -56320 -844288 914432 -71168 252928 830976 296960 546304 -1287680 -186368 48128
451 338432 -282112 -236032 482816 247808 -571904 -172032 36864 -58880 906240 -178688
440 493568 346112 1269248 -886272 474112 -881664 -413696 -288256 -547840 -886272 -557056
430 -557056 -180736 -923648 145920 991232 350720 -278016 1024 528896 -842752 -177664
419 -232448 47104 428544 28160 -496640 -360448 -555520 -209920 -392704 -193024 -536064
409 -536064 679936 515584 158720 137216 54272 254464 -686592 -209920 -82944 -436736
399 -436736 -1189888 -201216 -503296 -515584 -1131008 576000 -631296 199680 -186880 -327168
389 -327168 440320 -108544 123904 569856 477696 389120 -123904 -108544 -222720 -1212928
$$ packed form
462e6320p87968I14432g1168B52928N78048B96960K49344a287680a86368D8128
451C38432b82112M6080D82816k35008e71904a72032C6864e8880I06240a78688
440D93568j47456R23136h86272D74112h81664d13696J25440k59584l38432L29216
430e57056a80736p42912A45920Q45312C50720b78016A024N27872h42752a77664
419b32448D7104L81440B8160d96640J36192j95072b09920j82784a93024l43040
409e36064F79936j64352A58720k1504E4272K00192f86592b09920h2944l53792
399d36736p53152b01216l02080j2288o15424E76000f31296A99680a86880j40288
389c27168D40320a08544A23904M45952r2160q8576a23904J5360j14176r90208
$$ plain form
379 -1212928 -722944 143360 630272 -476160 -1018880 -467968 -361984 130048 403456 10752
368 138240 3584 1171456 -194048 704000 569344 -357888 -29184 -7680 -140800 -931328 -599552
357 -599552 -382464 708608 -1049600 -680448 -142848 550912 -321536 -599552 1053184 -1053696
346 -631808 -903168 -881664 -799232 847872 -1277952 -257024 394752 -537600 -451072 48128
335 394752 -515584 -200192 -1127936 -276480 -1380864 300544 -134656 857600 -187392 879616
324 -19456 -542208 935936 -205824 -259072 -42496 -340480 594432 297984 -559616 -35840 221696
312 -276992 -62976 201728 -1059328 492032 -946688 -375808 -525312 64512 -965120 -165376
301 -739328 -536064 518656 178176 76288 -1602048 53760 28672 975360 -157696 -392192
$$ packed form
379a212928M89984A43360M86912d76160n42720d67968J05984A30048K73408A0752
368A38240C584J167872a94048G04000j34656c57888b9184g680j33120p90528L31776
357e99552K17088G08608a049600L69152a42848E50912c21536k78016A053184a053696
346f31808k71360K1504Q2432H47872a277952b57024C94752e37600Q6528D8128
335C94752e15584b00192r27744b76480j104384C00544a34656H57600a87392H79616
324a9456n22752I35936b05824n3248d2496k97984E94432k96448e59616c5840B21696
312b76992f2976B01728a059328D92032i46688c75808j49504F4512i65120a65376
301g39328K03264E18656A78176G6288a602048E3760k5088R46688a57696k34496
$$ plain form
291 -392192 473600 -805376 284160 -20992 157696 -1012224 478208 472576 175616 -1262080
280 -352768 266752 606720 -232448 71168 435200 404992 -707072 168448 11264 -273408
269 -67072 -550912 -1255936 768512 -107520 -759296 160256 681984 -485888 -167936 -627200
259 -627200 -1021440 -631296 -231424 505344 55296 84992 487936 237568 298496 -577024
248 -689664 196096 -697344 -467456 17408 1360384 852480 78336 262656 803328 -305152
237 -978944 198656 531968 -336896 249856 31232 -164864 82944 -1136640 -114688 112128
226 529408 129024 662016 42496 -592384 23552 735744 286720 398848 -155648 -568832
216 -568832 495616 -286208 -565248 553472 258048 -226816 -488448 780800 -384000 -367616
$$ packed form
291c92192D73600h05376B84160b0992A57696a012224D78208n632A75616a262080
280c52768B66752L39968b32448G1168L64032l0208g07072A68448A1264b73408
269f7072m83840p05024G68512a07520o51776A60256N21728d85888a67936m59264
259f27200l94240L90144b31424E05344E5296K9696M02944B37568O0928e77024
248f89664A96096f97344K29888A7408J342976n07904G8336J84320N40672c05152
237i78944A98656L33312c36896B49856C1232a64864H2944a136640a14688A12128
226E29408A29024N32992D2496e92384B3552P12192B86720J12128a55648m13184
216e68832D95616b86208k79040E53472B58048b26816k61632G80800c84000J6384
$$ plain form
206 -367616 -1342464 765440 181248 15872 556032 -517632 -515584 -387584 281600 -444416
195 -1101824 190976 707584 -72704 99840 -327168 1057280 111616 -890368 -550400 48640
184 781824 441856 0 -95232 -289792 268800 -346112 305664 766464 133632 300544 -105472
172 -626688 -51200 -576000 -675840 225280 83968 -73728 -99328 -148992 258560 -684032 242688
160 -373248 878080 -691200 -541184 592384 994304 43008 -1032704 -306176 -365056 75776
149 -98816 -552448 967168 69120 -168960 783360 -824832 -583168 -814592 -331264 -495104
139 -495104 -811520 380416 -335872 315904 -848384 736768 -376832 166400 253952 -45568
128 425984 222208 345088 -424960 1102848 529408 695296 38400 -563712 54784 8192
$$ packed form
206c67616r74848G65440A81248A5872N40160e17632K048J28000B81600d44416
195a101824A90976N16608g2704I9840c27168A057280A11616h90368L39968D8640
184G81824l39968@i5232j94560B68800c46112C05664M60800A33632J66912a05472
172f26688e1200n24800r9840B25280H3968g3728k5600m9664B58560f84032B42688
160c73248H78080f91200J50016E92384M01920D3008a032704c06176n8880G5776
149i8816m53632I67168F9120a68960G83360h24832K41664k31424c31264j63840
139d95104l16416C80416c35872C15904h48384G36768c76832A66400Q7552d5568
128D25984k03776J22880d24960A102848E29408J65888C8400e63712E4784H192
$$ plain form
117 253440 89600 -415744 -989184 150528 -160768 -432128 1078784 -157696 -671744 -822784
107 -822784 237056 -342528 -791552 -1414656 -244224 -1022976 -1536 149504 -660480 -785920
97 -785920 -310272 -902656 367616 -662016 -93696 330240 540160 -568320 -528384 -1063424
87 -1063424 527360 -580096 -588800 -700928 4096 -211456 -803328 307200 -40448 -551424 73216
75 -239104 -570368 329728 -389632 -227328 -438272 -165888 15360 -398848 -1177600 334336
64 -292352 -785408 -190976 -536064 744960 -39936 -646144 520192 1106432 -468480 -76288
53 -19456 -200704 -70656 -560128 -989696 41472 -104448 627712 -1063424 -560640 123392
42 1456640 99328 327168 379392 -228864 -723968 -447488 1157632 -109056 1326080 -112640
$$ packed form
117B53440H9600d15744n73440A50528a60768k71360A078784a57696n14048j51040
107h22784B37056c42528m49024o23104b44224p78752a536A49504f60480j25440
97g85920c10272n92384C67616f62016i3696C30240K09920e68320L9936n35040
87a063424E27360e80096q704j12128D096b11456n91872C07200d0448n10976G3216
75b39104l31264C29728c89632J62304k10944a65888A5360c98848p78752C34336
64b92352m93056a90976l45088G44960c9936o06208E20192N86240d68480g6288
53a9456j81248g0656m89472m29568D1472a04448F27712a063424N02784A23392
42A456640I9328K27840N2224b28864m95104K76480A157632a09056A326080a12640
$$ plain form
31 -1341952 372224 -94208 -334848 -485376 -339456 951296 -377856 -93184 -205312 -482816
21 -482816 4608 -399360 -222208 -145920 192512 797184 507392 -536064 -228352 -376832 86016
9 921600 -1623040 -611328 748032 323584 0 -88576 365056 -42496 -253440
0 -253440
$$ packed form
31a341952C72224i4208k40640j50528J45920I51296c77856i3184j12128k77504
21d82816D608c99360J77152P6288A92512O04672k89792e36064b28352j48480H6016
9I21600a623040f11328G48032C23584@h8576C65056d2496k10944
0b53440
##END=
