##TITLE=1394
##JCAMPDX= 6.0         $$ Bruker NMR JCAMP-DX V2.0
##DATA TYPE= NMR SPECTRUM
##DATA CLASS= XYDATA
##ORIGIN= NUTS EXPORT
##OWNER= Administrator
$$ 1.72 TOPSPIN		Version 2.1
$$ 2016-02-23 12:22:33.308 -0800  Administrator@X
$$ Compression mode = diff/dup
##.OBSERVE FREQUENCY= 90.275459
##.ACQUISITION MODE= SIMULTANEOUS (DQD)
##.ACQUISITION SCHEME= undefined
##.AVERAGES= 16
##.DIGITISER RES= 22
##SPECTROMETER/DATA SYSTEM= 
##.PULSE SEQUENCE= zg30
##.SOLVENT NAME= None
##.SHIFT REFERENCE= INTERNAL, None, 1, 14.3706
##AUDIT TRAIL= $$ (NUMBER, WHEN, WHO, WHERE, PROCESS, VERSION, WHAT)
$$ ##TITLE= Audit trail, TOPSPIN		Version 2.1
$$ ##JCAMPDX= 5.01
$$ ##ORIGIN= Bruker BioSpin GmbH
$$ ##OWNER= Administrator
$$ $$ E:/data/jwist/nmr/1394/1/pdata/1/auditp.txt
$$ ##AUDIT TRAIL=  $$ (NUMBER, WHEN, WHO, WHERE, PROCESS, VERSION, WHAT)
(   1,<2016-02-23 09:22:42.965 -0800>,<Administrator>,<X>,<jcamp>,<TOPSPIN 2.1>,
      <fromjdx created from
       E:\data\jwist\nmr\uniandes\1394
       data hash MD5: 8K
       97 A3 BC FE E9 56 1E AA D0 D3 9C 53 74 1C F6 56>)
$$ ##END=
$$ 
$$ $$ hash MD5
$$ $$ 27 18 F1 E2 77 43 CA 4E E0 BE F7 CC A0 18 10 97
##$RELAX= 
$$ Bruker specific parameters
$$ --------------------------
##$DU= <E:>
##$EXPNO= 1
##$NAME= <1394>
##$PROCNO= 1
##$TYPE= <nmr>
##$USER= <jwist>
##$ACQT0= 0
##$AMP= (0..31)
100 100 100 100 100 100 100 100 100 100 100 100 100 100 100 100 100 100
100 100 100 100 100 100 100 100 100 100 100 100 100 100
##$ANAVPT= 1
##$AQSEQ= 0
##$AQ_mod= 3
##$AUNM= <au_zg>
##$AUTOPOS= <>
##$BF1= 90.275459
##$BF2= 400.02
##$BF3= 400.02
##$BF4= 400.02
##$BF5= 400.02
##$BF6= 400.02
##$BF7= 400.02
##$BF8= 400.02
##$BYTORDA= 0
##$CFDGTYP= 0
##$CFRGTYP= 0
##$CHEMSTR= <none>
##$CNST= (0..63)
1 1 145 1 1 1 1 1 1 1 1 1 1 1 1 1 1 1 1 1 1 1 1 1 1 1 1 1 1 1 1 1 1 1 1
1 1 1 1 1 1 1 1 1 1 1 1 1 1 1 1 1 1 1 1 1 1 1 1 1 1 1 1 1
##$CPDPRG= <>
##$CPDPRG1= <>
##$CPDPRG2= <>
##$CPDPRG3= <>
##$CPDPRG4= <mlev>
##$CPDPRG5= <mlev>
##$CPDPRG6= <mlev>
##$CPDPRG7= <mlev>
##$CPDPRG8= <mlev>
##$CPDPRGB= <>
##$CPDPRGT= <>
##$D= (0..63)
0 1 0 0 0 0 0 0 0 0 0 0 0 0 0 0 0 0 0 0 0 0 0 0 0 0 0 0 0 0 0 0 0 0 0 0
0 0 0 0 0 0 0 0 0 0 0 0 0 0 0 0 0 0 0 0 0 0 0 0 0 0 0 0
##$DATE= 0
##$DBL= (0..7)
120 120 120 120 120 120 120 120
##$DBP= (0..7)
150 150 150 150 150 150 150 150
##$DBP07= 0
##$DBPNAM0= <>
##$DBPNAM1= <>
##$DBPNAM2= <>
##$DBPNAM3= <>
##$DBPNAM4= <>
##$DBPNAM5= <>
##$DBPNAM6= <>
##$DBPNAM7= <>
##$DBPOAL= (0..7)
0.5 0.5 0.5 0.5 0.5 0.5 0.5 0.5
##$DBPOFFS= (0..7)
0 0 0 0 0 0 0 0
##$DE= 6.5
##$DECBNUC= <off>
##$DECIM= 2432
##$DECNUC= <off>
##$DECSTAT= 4
##$DIGMOD= 1
##$DIGTYP= 12
##$DL= (0..7)
0 120 120 120 120 120 120 120
##$DP= (0..7)
150 150 150 150 150 150 150 150
##$DP07= 0
##$DPNAME0= <>
##$DPNAME1= <>
##$DPNAME2= <>
##$DPNAME3= <>
##$DPNAME4= <>
##$DPNAME5= <>
##$DPNAME6= <>
##$DPNAME7= <>
##$DPOAL= (0..7)
0.5 0.5 0.5 0.5 0.5 0.5 0.5 0.5
##$DPOFFS= (0..7)
0 0 0 0 0 0 0 0
##$DQDMODE= 0
##$DR= 22
##$DS= 2
##$DSLIST= <SSSSSSSSSSSSSSS>
$$ [...]
##$SPOFFS= (0..31)
0 0 0 0 0 0 0 0 0 0 0 0 0 0 0 0 0 0 0 0 0 0 0 0 0 0 0 0 0 0 0 0
##$SUBNAM0= <"">
##$SUBNAM1= <"">
##$SUBNAM2= <"">
##$SUBNAM3= <"">
##$SUBNAM4= <"">
##$SUBNAM5= <"">
##$SUBNAM6= <"">
##$SUBNAM7= <"">
##$SUBNAM8= <"">
##$SUBNAM9= <"">
##$SW= 20.5580556627758
##$SWIBOX= (0..15)
0 0 3 4 0 0 0 0 0 0 0 0 0 0 0 0
##$SW_h= 8223.68421052631
##$SWfinal= 0
##$TD= 65536
##$TD0= 1
##$TE= 300
##$TE2= 300
##$TE3= 300
##$TEG= 300
##$TL= (0..7)
0 120 120 120 120 120 120 120
##$TP= (0..7)
150 150 150 150 150 150 150 150
##$TP07= 0
##$TPNAME0= <>
##$TPNAME1= <>
##$TPNAME2= <>
##$TPNAME3= <>
##$TPNAME4= <>
##$TPNAME5= <>
##$TPNAME6= <>
##$TPNAME7= <>
##$TPOAL= (0..7)
0.5 0.5 0.5 0.5 0.5 0.5 0.5 0.5
##$TPOFFS= (0..7)
0 0 0 0 0 0 0 0
##$TUNHIN= 0
##$TUNHOUT= 0
##$TUNXOUT= 0
##$USERA1= <user>
##$USERA2= <user>
##$USERA3= <user>
##$USERA4= <user>
##$USERA5= <user>
##$V9= 5
##$VALIST= <valist>
##$VCLIST= <CCCCCCCCCCCCCCC>
##$VD= 0
##$VDLIST= <DDDDDDDDDDDDDDD>
##$VPLIST= <PPPPPPPPPPPPPPP>
##$VTLIST= <TTTTTTTTTTTTTTT>
##$WBST= 1024
##$WBSW= 4
##$XGAIN= (0..3)
0 0 0 0
##$XL= 0
##$YL= 0
##$YMAX_a= 2077446656
##$YMIN_a= -4049970.176
##$ZGOPTNS= <>
##$ZL1= 120
##$ZL2= 120
##$ZL3= 120
##$ZL4= 120
##$ABSF1= 10
##$ABSF2= 0
##$ABSG= 5
##$ABSL= 3
##$ALPHA= 0
##$AQORDER= 0
##$ASSFAC= 0
##$ASSFACI= 0
##$ASSFACX= 0
##$ASSWID= 0
##$AUNMP= <proc_1d>
##$AXLEFT= 0
##$AXNAME= <>
##$AXNUC= <off>
##$AXRIGHT= 0
##$AXTYPE= 0
##$AXUNIT= <>
##$AZFE= 0.1
##$AZFW= 0.1
##$BCFW= 1
##$BC_mod= 2
##$BYTORDP= 0
##$COROFFS= 0
##$CY= 15
##$DATMOD= 1
##$DC= 2
##$DFILT= <>
##$DTYPP= 0
##$F1P= 0
##$F2P= 0
##$FCOR= 0.5
##$FTSIZE= 0
##$FT_mod= 4
##$GAMMA= 1
##$GB= 0
##$INTBC= 1
##$INTSCL= 1
##$ISEN= 128
##$LB= 0.3
##$LEV0= 0
##$LPBIN= 0
##$MAXI= 10000
##$MC2= 0
##$MEAN= 0
##$ME_mod= 0
##$MI= 0
##$NCOEF= 0
##$NC_proc= -10
##$NLEV= 6
##$NOISF1= 0
##$NOISF2= 0
##$NSP= 1
##$NTH_PI= 0
##$NZP= 0
##$OFFSET= 14.3706
##$PC= 1
##$PHC0= 0
##$PHC1= 0
##$PH_mod= 0
##$PKNL= yes
##$PPARMOD= 0
##$PPDIAG= 0
##$PPIPTYP= 0
##$PPMPNUM= 2147483647
##$PPRESOL= 1
##$PSCAL= 4
##$PSIGN= 0
##$PYNMP= <proc.py>
##$REVERSE= no
##$SF= 90.2741617060686
##$SI= 8192
##$SIGF1= 0
##$SIGF2= 0
##$SINO= 400
##$SIOLD= 32768
##$SPECTYP= <>
##$SREGLST= <1H.CDCl3>
##$SSB= 0
##$STSI= 0
##$STSR= 0
##$SW_p= 1497.18866228788
##$SYMM= 0
##$S_DEV= 0
##$TDeff= 0
##$TDoff= 0
##$TI= <>
##$TILT= no
##$TM1= 0
##$TM2= 0
##$TOPLEV= 0
##$USERP1= <user>
##$USERP2= <user>
##$USERP3= <user>
##$USERP4= <user>
##$USERP5= <user>
##$WDW= 1
##$XDIM= 8192
##$YMAX_p= 2077446556
##$YMIN_p= -4049969
##$CURPLOT= <PDFCreator>
##$CURPRIN= <$PDFCreator>
##$DFORMAT= <normdp>
##$LAYOUT= <+/1D_H.xwp>
##$LFORMAT= <normlp>
##$PFORMAT= <normpl>
##$SURQMSG= 1
$$ End of Bruker specific parameters
$$ ---------------------------------
##XUNITS= HZ
##YUNITS= ARBITRARY UNITS
##XFACTOR= 0.182762287876938
##YFACTOR= 1
##DELTAX= -0.182762287876938
##NPOINTS= 8192
##FIRSTX= 1497.0059
##FIRSTY= -744556
##LASTX= 0
##MAXY= 2077446556
##MINY= -4049969
##XYDATA= (X++(Y..Y))
8191g44556J93450F13614J132212f54237B20869P65783f87263a63083j246012
$$ -744556 -551106 613614 1745826 -654237 220869 986652 -687263 -163083 -1409095
8182a409095C36485a874461A623975C36643a64390D14403f94408I59294E1799
$$ -1409095 336485 -1874461 1623975 336643 -164390 414403 -694408 959294 51799
8172C44666M04085d8653A037679K80621Q525a01396j3352A140916D6443d65679
$$ 344666 748751 -48653 1037679 1318300 1326825 -101396 -114748 1140916 46443 -465679
8161g1256C664J432785e81504A052940C82478a640891E00741a176994I30319B5329
$$ -71256 3664 1436449 -581504 1052940 382478 -1640891 500741 -1176994 930319 25329
8150g38755A041168a454099a19042A810635a171646C75514e29704r57584A057108
$$ -738755 1041168 -1454099 -119042 1810635 -1171646 375514 -529704 -1487288 1057108
8140A244632n7715E17376i14781E38145e00499G00205M90875n28153j9952d55526
$$ 1244632 1186917 517376 -914781 538145 -500499 700205 1191080 662927 642975 -455526
8129H90017a502502C59128b54867j289733f83756B87217J396544p77787m15506
$$ 890017 -1502502 359128 -254867 -1544600 -683756 287217 1683761 905974 490468
8120D90468r4685D4866J262163E89498j77603Q27337d65999B20513a72531j138944
$$ 490468 395783 44866 1307029 589498 411895 1239232 -465999 220513 -172531 -1311475
8110a311475A678544J65605a68734o7736l13783H37044L18426r1273L8295m45834
$$ -1311475 1678544 1844149 -168734 -236470 -550253 837044 1155470 1064197 1102492 656658
8100F56658Q7664a262053I73616a384496H14878g53259A899312g974A266194l572
$$ 656658 744322 -1262053 973616 -1384496 814878 -753259 1899312 -7974 1266194 1262622
8090A262622a594200b22305a0874o93377I12187l31819i37912d52293B202268
$$ 1262622 -1594200 -222305 -10874 -704251 912187 580368 -937912 -452293 2202268
8080H37555C58770h35098D157672b142598d97782A259283N09020j42072H09701
$$ 837555 358770 -835098 4157672 -2142598 -497782 1259283 1768303 1626231 809701
8070a476768A123874a73954I50427i52244A247611f44534D50055d59146B154970
$$ -1476768 1123874 -173954 950427 -952244 1247611 -644534 450055 -459146 2154970
8060h58508B196579f07967F16250q4520a292574D73763a266945D41820a349045
$$ -858508 2196579 -607967 616250 531730 -1292574 473763 -1266945 441820 -1349045
8050c82894o21762K16641j842629G53383a746899E96369J265256r01633k02842
$$ -382894 -1004656 -788015 -2630644 753383 -1746899 596369 1861625 959992 757150
8041G57150a936882B685377r69510c58127A305150E28361O11343A61428a318897
$$ 757150 -1936882 2685377 1715867 -358127 1305150 528361 1139704 161428 -1318897
8031a91304A1448Q57793i54440A300134d71139J01785A618197i16113B43453P59572
$$ -191304 11448 869241 -954440 1300134 -471139 -369354 1618197 -916113 243453 1003025
8021A003025a752718A882943h25406j197185B47557g23277B994888j258672E31020
$$ 1003025 -1752718 1882943 -825406 -2022591 247557 -723277 2994888 1736216 531020
8011h74363A011038b32019A114007g33824E45987J710156e35183B077016R23868
$$ -874363 1011038 -232019 1114007 -733824 545987 2256143 -535183 2077016 3000884
8002C000884j484594c24344A299718h04088j80412H75575a801614A173853k75358
$$ 3000884 1516290 -324344 1299718 -804088 -984500 875575 -1801614 1173853 898495
7993H98495e66804j235942b86564A59972J211932h73228B71990c62612j210887
$$ 898495 -566804 -1802746 -286564 159972 1371904 -873228 271990 -362612 -1573499
7984a573499E68832d30311F60059f45044k36080j85805H819f23752j00068F39248
$$ -1573499 568832 -430311 660059 -645044 -881124 -1066929 8819 -623752 -723820 639248
7973f37090I44775p4982b63568j492280q78489f09215o10746B0704K390458I49919
$$ -637090 944775 869793 -263568 -1755848 -2634337 -609215 -1219961 20704 2411162 949919
7962A345817F69263A15928L330196A483931a079624B186468D58213g28928k08899
$$ 1345817 669263 115928 3446124 1483931 -1079624 2186468 458213 -728928 -937827
7953i37827A157654L75002m47090N71908g7058r73662b21749A5572a33852A031243
$$ -937827 1157654 1532656 1085566 1657474 -77058 -1050720 -221749 15572 -133852 1031243
7942a941354i18666A222780J497823a77239B92362J308054n23249a100144b5142
$$ -1941354 -918666 1222780 2720603 -177239 292362 1600416 1077167 -1100144 -25142
7932D59411c17908l60400o0650A99344i42074A149662J660839C52899L55934h90948
$$ 459411 -317908 -678308 -738958 199344 -942074 1149662 2810501 352899 708833 -890948
7921a540736b90542B556626j035975j15580a836101M47729b79480B24820c66232
$$ -1540736 -290542 2556626 1520651 1405071 -1836101 -1388372 -279480 224820 -366232
7911A176003i35227H82066K46282J137467A028057R31004a052048A48262K917843
$$ 1176003 -935227 882066 1128348 2265815 1028057 1959061 -1052048 148262 3066105
7902C066105d07868l97393L65415J6168m64315M5563b49946A60420g03642r89688
$$ 3066105 -407868 -805261 -439846 -423678 -887993 -842430 -249946 160420 -703642 -1693330
7892a693330a83630H25136B98940P92607B42281O07436N47350g8874A674692c30466
$$ -1693330 -183630 825136 298940 1091547 242281 849717 1397067 -78874 1674692 -330466
7881A966383g76164A071184K62705f2871G87399l48459j2077L96263B93410j31421
$$ 1966383 -776164 1071184 1333889 -62871 787399 438940 426863 823126 293410 161989
7871A61989C4366c39485B733772h95637G2834M80589Q23133J74357L65764h7353
$$ 161989 34366 -339485 2733772 -895637 72834 553423 1376556 1550913 1916677 -87353
7860F46369f0677o78478A683692o31904a177291A317177i90807M88379D63209
$$ 646369 -60677 -739155 1683692 1051788 -1177291 1317177 -990807 -502428 463209
7850G15024a168968j559090E45820c15088j005145G2379R84295m87687j06345
$$ 715024 -1168968 -2728058 545820 -315088 -1320233 72379 1056674 568987 462642
7841D62642a555806F65448L69361c93784A046832a923877B77789N7431J527152
$$ 462642 -1555806 665448 1034809 -393784 1046832 -1923877 277789 335220 1862372
7832A862372e12389k8192b5161j27957A48911L16622b606685D00582L223399B84615
$$ 1862372 -512389 -540581 -25161 -153118 148911 465533 -2606685 400582 3623981 284615
7821b271905f24652A769J93790a020603A311378c46655B054300G9447K98214K65442
$$ -2271905 -624652 1769 195559 -1020603 1311378 -346655 2054300 79447 377661 643103
7811F43103m0792h07304A213353Q1779m93456B6049f60227B52510p6492d3660
$$ 643103 602311 -807304 1213353 1295132 801676 26049 -660227 252510 176018 -43660
7800H59641a49167A645512H3881Q53033A14086h10702A301720i22770A758292
$$ 859641 -149167 1645512 83881 936914 114086 -810702 1301720 -922770 1758292
7790A284003L30737L06099E45948g18920K38441A211781j4140D28488R3064O27963
$$ 1284003 1614740 1920839 545948 -718920 -480479 1211781 1197641 428488 521552 1149515
7780A149515a869659C8731a878647G75229b62439b6277B589923m00474D35338
$$ 1149515 -1869659 38731 -1878647 775229 -262439 -26277 2589923 2189449 435338
7770d43631M0113A79755J496134C45884K218648A130053K0270D2232a195847b19517
$$ -443631 -403518 179755 1675889 345884 2564532 1130053 1150323 42232 -1195847 -219517
7759I64262m61606A02150J587900a21017p64662A150765l56542J124030b65036
$$ 964262 502656 102150 1690050 -121017 -885679 1150765 794223 1918253 -265036
7749h21699B3093e9998I3321c06069l57556A568453b550520A032023b60620B056542
$$ -821699 23093 -59998 93321 -306069 -663625 1568453 -2550520 1032023 -260620 2056542
7738B51100g71865a16287M309C2358f09233D30317a043837B48468L06249a6451
$$ 251100 -771865 -116287 -111978 32358 -609233 430317 -1043837 248468 554717 -16451
7727I26219N0176N5259j07504D19303j28759R07986Q19697q94180i04751K88493
$$ 926219 976395 1031654 924150 419303 290544 1198530 2018227 1124047 -904751 -616258
7717f16258p04593B069301j024018J430280H07135d27747k80762I05787g62935
$$ -616258 -1320851 2069301 1045283 2475563 807135 -427747 -708509 905787 -762935
7707f90853K94534k50698B683247A026192m82437N41880J493885B56155K438495
$$ -690853 -396319 -647017 2683247 1026192 543755 1085635 2579520 256155 2694650
7698B694650A213548L40703A66882K682114A277711N59321F75131A95861b75787
$$ 2694650 1213548 1554251 166882 2848996 1277711 1837032 675131 195861 -275787
7688A83362L29007J289581m30570c74727k11424n77732E88433a784701G70106
$$ 183362 512369 1801950 1371380 -374727 -586151 -1163883 588433 -1784701 770106
7678A138235a773386A215842c0797j003421a07879A712104G57111O75723C37744
$$ 1138235 -1773386 1215842 -30797 -1034218 -107879 1712104 757111 1432834 337744
7668A317796b23685b6690q36746I62422f33925C53708c67890A3244a69728m89379
$$ 1317796 -223685 -26690 -863436 962422 -633925 353708 -367890 13244 -169728 -659107
7658f59107A970384e94246A334216a714419F06785Q44133o60309a253697B428404
$$ -659107 1970384 -594246 1334216 -1714419 606785 1450918 790609 -1253697 2428404
7648A513631A93899a663826D01342K542279H10127J223251c93194A354706F16782
$$ 1513631 193899 -1663826 401342 2943621 810127 2033378 -393194 1354706 616782
7638a029570l34871E75335c53863E451M95038j94492M91934j0380P75818p14534
$$ -1029570 -1364441 575335 -353863 5451 500489 305997 797931 787551 1563369 848835
7628H48835P21550a32644A8961Q36554Q62449f47470B76860m5160K44416K82365
$$ 848835 1570385 -132644 18961 855515 1717964 -647470 276860 231700 476116 758481
7618G58481a720323A989368m95296j35584C46269J82272b91678I51149J730925
$$ 758481 -1720323 1989368 1494072 1358488 346269 528541 -291678 951149 2682074
7609B682074o11188F1346R81763c90825l101819B178382m78560B98960O86418
$$ 2682074 2070886 61346 1043109 -390825 -3492644 2178382 1699822 298960 985378
7600I85378P06037g1444E26064p3927K55244a555584B82664J341401g7109D74232
$$ 985378 1691415 -71444 526064 452137 707381 -1555584 282664 1624065 -77109 474232
7589A866662n31267C08911J332639k045E33245M51041I6466a424450d0992k085873
$$ 1866662 1335395 308911 1641550 1639505 533245 984286 96466 -1424450 -40992 -2126865
7579b126865A309241a665247C009105E47118Q2653A8364J500331a203476B374187
$$ -2126865 1309241 -1665247 3009105 547118 629771 18364 1518695 -1203476 2374187
7569A233312d73445B251530A18063L43155R77541f58008A471425i1364A105183
$$ 1233312 -473445 2251530 118063 461218 1438759 -658008 1471425 -91364 1105183
7559A217691J206823A79334M16818P69202f69752j95645b4287n07299a84380d6363
$$ 1217691 2424514 179334 596152 1365354 -669752 -865397 -24287 -531586 -184380 -46363
7548c2744A104991c24847A331014a247393A158112m38646g40448G03517J182483
$$ -32744 1104991 -324847 1331014 -1247393 1158112 719466 -740448 703517 1886000
7539A886000F16030M59839b43863I45526Q24530D87351J53656c69125C15218O21700
$$ 1886000 616030 1075869 -243863 945526 1770056 487351 641007 -369125 315218 936918
7529I36918l21347B00298J074111E01003N87599a079390B051368a445286A868775
$$ 936918 615571 200298 1274409 501003 1088602 -1079390 2051368 -1445286 1868775
7519D06319d9114D54551i21366A127619a160684k8872n18768A807889G15546L57246
$$ 406319 -49114 454551 -921366 1127619 -1160684 -1189556 -1708324 1807889 715546 1072792
7509A072792b16562G11164J299721P79645h360D17529J856115E76940I2440O89651
$$ 1072792 -216562 711164 2010885 2790530 -8360 417529 2273644 576940 92440 782091
7499G82091J870773c58709A610660E15863Q86596A99017n21K510402A84807L459772
$$ 782091 2652864 -358709 1610660 515863 1402459 199017 198496 2708898 184807 3644579
7489C644579F32232J198697c88977A131072k01320L33928A52084L23874J049898
$$ 3644579 632232 1830929 -388977 1131072 929752 1263680 152084 475958 1525856
7480A525856m15098l32859K69750F8107J003763h24955G21755B38998J118001
$$ 1525856 1110758 777899 1047649 68107 1071870 -824955 721755 238998 1356999
7471A356999Q85396e06997A946366H21429M11192a61982H55345F1807a714639
$$ 1356999 2242395 -506997 1946366 821429 1232621 -161982 855345 61807 -1714639
7461D14373J066509J099082D56930J254958j96229F9844e71180A48018N93655
$$ 414373 1480882 2579964 456930 1711888 1515659 69844 -571180 148018 741673
7452G41673j16503b42705E83975L70454a90842L0009E31038J885300g39367K38067
$$ 741673 625170 -242705 583975 954429 -190842 -160833 531038 2416338 -739367 -501300
7442e01300A272564m73369f00791B47012M85132d41943B650229E51443a75662
$$ -501300 1272564 799195 -600791 247012 732144 -441943 2650229 551443 -175662
7432C8115c6423j901674E58941J56117P66678P0646l66577J803565d70362I29895
$$ 38115 -36423 -1938097 558941 715058 1481736 1552382 1185805 2989370 -470362 929895
7421A792570J23722e05296A774176G63044J96491Q46652a177763F67707O13443
$$ 1792570 1916292 -505296 1774176 763044 959535 1806187 -1177763 667707 1281150
7412A281150A34282R44089C70440i9343A491731a28865C13723O5266e07740o96332
$$ 1281150 134282 1078371 370440 -99343 1491731 -128865 313723 378989 -507740 -1204072
7402a204072l47499B43599g82315A464528J5818p20498l73378g96818B358646
$$ -1204072 -1551571 243599 -782315 1464528 1480346 759848 386470 -796818 2358646
7392H84397L33947B42953J027418o5476M95265L51791I55513C56677N20173L98012
$$ 884397 1218344 242953 1270371 1204895 1700160 2051951 955513 356677 876850 1274862
7382A274862a104091j49027B90363d92698A995387L77707H64196Q36315F3030
$$ 1274862 -1104091 -1253118 290363 -492698 1995387 2373094 864196 1700511 63030
7372b097378D0073J329063a413763a32895A919989m51334g19358H54522L46001
$$ -2097378 40073 1369136 -1413763 -132895 1919989 1468655 -719358 854522 1200523
7363A200523a551253G57772c50510j156614C64583a219302A173335n46072A36254
$$ 1200523 -1551253 757772 -350510 -1507124 364583 -1219302 1173335 627263 136254
7353c17784B38783J205112D47270a303929f03033b6040m01760o30587I70746K32477
$$ -317784 238783 1443895 447270 -1303929 -603033 -26040 -427800 -1058387 970746 1203223
7343A203223N68357q39919a00339A051389C33256J01951j0607a427081f22938
$$ 1203223 1771580 931661 -100339 1051389 333256 435207 424600 -1427081 -622938
7333G44860J438398c57302l67417G18781d74096A378089d52938Q2683F7137O75358
$$ 744860 2183258 -357302 -724719 718781 -474096 1378089 -452938 -370255 67137 742495
7323G42495J114776p0594Q16346B35249K72725O97083a256282A716791C67751
$$ 742495 1857271 1786677 2603023 235249 507974 1205057 -1256282 1716791 367751
7313G62949b081794E12480J066957c77385O8509A602585h57371D044738j950239
$$ 762949 -2081794 512480 1579437 -377385 -308876 1602585 -857371 4044738 2094499
7304B094499I31487b268018A722308E40730K477540E38560e60909G82130J433982
$$ 2094499 931487 -2268018 1722308 540730 3018270 538560 -560909 782130 2216112
7295B216112d24773j371741F82938j33731K08269J140870i77531A069706K138555
$$ 2216112 -424773 -1796514 682938 549207 757476 1898346 -977531 1069706 3208261
7286C208261a398291A219789n77464L33824P26679G92394K150328C28059g77723
$$ 3208261 -1398291 1219789 642325 976149 1702828 792394 2942722 328059 -777723
7276B963019j100923k80649M44085H74950C31758M01143J37310e601H52324O87912
$$ 2963019 1862096 1581447 2025532 874950 331758 732901 870211 -5601 852324 1540236
7266A540236l38969b50814A97412A6229N09597c7165B462779r50918E40095K65998
$$ 1540236 1201267 -250814 197412 16229 525826 -37165 2462779 1511861 540095 806093
7256H06093J514685I02926b46511b1178G6034R90880D10696M97192m35066A5332
$$ 806093 2320778 902926 -246511 -21178 76034 1066914 410696 907888 472822 15332
7245B716661g64208A314025E19758a22730G03654j74361M86357A2758L42521J012356
$$ 2716661 -764208 1314025 519758 -122730 703654 529293 1015650 12758 355279 1367635
7235A367635a115909A291125R17548E32268h86193A867681i48415I27153J378482
$$ 1367635 -1115909 1291125 2208673 532268 -886193 1867681 -948415 927153 2305635
7226B305635I94728J238961d06813D58601d78135F71939L56594a821511d78118
$$ 2305635 994728 2233689 -406813 458601 -478135 671939 1028533 -1821511 -478118
7216g1049j487348E71549N07577C44350Q79883k73360f28952A265541b06747M2285
$$ -71049 -1558397 571549 1079126 344350 1224233 950873 -628952 1265541 -206747 -164462
7206a64462n57883C170439E45697N64200D84284J358600n55262m09865J846934
$$ -164462 -722345 3170439 545697 1109897 484284 1842884 1287622 877757 2724691
7197B724691a173678A169613a54945A200020p2364B00657e40496A788515p77371
$$ 2724691 -1173678 1169613 -154945 1200020 1127656 200657 -540496 1788515 1011144
7188A011144C54506R05794n73362j80070K35673K02899Q60314G99680J140978
$$ 1011144 354506 1260300 686938 506868 742541 945440 1805754 799680 1940658
7179A940658D00748R82267b07130A956960o78480C89032M44372c1409j00044j02084
$$ 1940658 400748 1383015 -207130 1956960 1278480 389032 833404 -31409 -131453 -233537
7169b33537A509994h48100B46462a119196B419113I4971c69369j27206a32688
$$ -233537 1509994 -848100 246462 -1119196 2419113 94971 -369369 -496575 -132688
7159F10236J08292i01939A97357J348318q3184o28909g20167A450992B41345P60718
$$ 610236 718528 -901939 197357 1545675 1462491 833582 -720167 1450992 241345 1002063
7149A002063J110073f40696m81675H99606b64797A421082A1996K060580A87419
$$ 1002063 2112136 -640696 -1122371 899606 -264797 1421082 11996 2072576 187419
7139H2674a223123A741896p25020J70706n58959O345O30529j94213C2343J369150
$$ 82674 -1223123 1741896 1016876 1187582 628623 634968 1265497 1071284 32343 1401493
7129A401493b010970A94819O63797k67665J085927C73287J362041j38495l75956
$$ 1401493 -2010970 194819 858616 590951 1676878 373287 1735328 1596833 1220877
7120A220877J398869F58029A81088o1263R24041D97418K765274i23973A745810
$$ 1220877 2619746 658029 181088 119825 1043866 497418 3262692 -923973 1745810
7110B001482C90267n0819J322022f32961F13894g90008E10813e58899C260316
$$ 2001482 390267 339448 1661470 -632961 613894 -790008 510813 -558899 3260316
7100A576065m53586j54433b390653G57523J775960A245690J046717o21620a035393
$$ 1576065 1122479 968046 -2390653 757523 2533483 1245690 2292407 1670787 -1035393
7090A558063A88992J425491A92903L115318j579286e22336B459232j038814e90093
$$ 1558063 188992 1614483 192903 3308221 1728935 -522336 2459232 1420418 -590093
7080b39471B850062i5378A87517a314700A577761p56721N25817P85850p08854
$$ -239471 2850062 -95378 187517 -1314700 1577761 821040 1346857 2132707 1423853
7071A423853i58429J9011B665181a263390d53142I58638J789894F40300O4227
$$ 1423853 -958429 -939418 2665181 -1263390 -453142 958638 2748532 640300 704527
7062G04527Q44512M02069r505e73309A544609D08603b039582c86327n19260B451822
$$ 704527 1549039 1951108 1941603 -573309 1544609 408603 -2039582 -386327 -905587 2451822
7051D86596a784100q19783e62255B351614F88779c69456F25670J94623L09923
$$ 486596 -1784100 -2603883 -562255 2351614 688779 -369456 625670 820293 1130216
7042A130216J074818A84568K330306R06410o15675A361345k43744O5495h79837
$$ 1130216 2205034 184568 2514874 3421284 2805609 1361345 1117601 1183096 -879837
7032A976930D54766N79626D35063c55407B012200J13465o19172M03644f4700A358925
$$ 1976930 454766 1034392 435063 -355407 2012200 2125665 1506493 1910137 -64700 1358925
7021a38053m49735A495482M41686O96284j221377C44904A16027c74690a80196
$$ -138053 -587788 1495482 1937168 2633452 1412075 344904 116027 -374690 -180196
7011H33619J38823f17658B771243b06749I42867a154883b24862l19094B024933
$$ 833619 972442 -617658 2771243 -206749 942867 -1154883 -224862 -543956 2024933
7001A801699L78565A003752a20B410548q65430E98201j92809J217608p79408N75874
$$ 1801699 2180264 1003752 -120 2410548 1545118 598201 405392 1623000 843592 1419466
6991A419466l36211R13927g09516b93397H64198E5062h04288A391365C74720Q56153
$$ 1419466 1083255 1997182 -709516 -293397 864198 55062 -804288 1391365 374720 1230873
6981A230873a114194F77673O60447c993027G40371k44470j56629k5207a224993
$$ 1230873 -1114194 677673 1338120 -3993027 740371 495901 339272 314065 -1224993
6971C22438J819322H4455a469655B388496F76549R21000b52389F07380g29755
$$ 322438 2141760 84455 -1469655 2388496 676549 1597549 -252389 607380 -729755
6961b512290A1039d91504A192250A24736J20011J434514c404B116347j044824
$$ -2512290 11039 -491504 1192250 124736 244747 1679261 -3404 2116347 1071523
6952A071523o4696O2014P20779C23014J427350k83148K371122c8316A148412m50048
$$ 1071523 1006827 1068841 1789620 323014 1750364 1467216 3838338 -38316 1148412 698364
6942F98364a501104A075752E909K535757q38855k71380n5398d83842A402460Q25873
$$ 698364 -1501104 1075752 5909 2541666 1702811 1431431 1376033 -483842 1402460 2228333
6932B228333D01189h62957A564602f7469r73083A110273J468136n71720c48884
$$ 2228333 401189 -862957 1564602 -67469 -1040552 1110273 2578409 2006689 -348884
6922B340935c32435I16357Q14795o27400J498458F04541J97943k53224Q15036
$$ 2340935 -332435 916357 1731152 1103752 2602210 604541 802484 549260 1364296
6913A364296N10325F0103L19869J05371K44688L12091D78863J015577n23204K68229
$$ 1364296 1874621 60103 379972 485343 730031 1042122 478863 1494440 971236 1239465
6903A239465a922282B114545c61569A697230L279283H68413a494025E20352j29625
$$ 1239465 -1922282 2114545 -361569 1697230 4976513 868413 -1494025 520352 390727
6894C90727N9714d16619a31357A983777B60164b355909C63942J75739M10482J355364
$$ 390727 450441 -416619 -131357 1983777 260164 -2355909 363942 539681 950163 2305527
6884B305527r28348F85754M73237J084921A014061e66606A191097P71490l90280
$$ 2305527 1377179 685754 1158991 2243912 1014061 -566606 1191097 1962587 1572307
6875A572307e53808A098822P12133k65839l74392K52556O332F93110j60511A56729
$$ 1572307 -553808 1098822 1810955 1545116 1170724 1423280 1429612 693110 532599 156729
6864e8267F99082J228903q17341H7484J859973o25552m58297h9353B945059p51971
$$ -58267 699082 1927985 1110644 87484 1947457 1321905 863608 -89353 2945059 2193088
6854B193088E36498c97356F81774a47452A093610k33781b79022n58689F12076
$$ 2193088 536498 -397356 681774 -147452 1093610 859829 -279022 -837711 612076
6844A671919Q71607A237695E92686j66976d14729B083336p06146J071035D93479
$$ 1671919 2543526 1237695 592686 425710 -414729 2083336 1377190 2448225 493479
6834A524414a238666I51772k96702a161928I70347l72736I4981J459439F77215
$$ 1524414 -1238666 951772 655070 -1161928 970347 597611 94981 1554420 677215
6824A366037n17326B63101J284877K72801B27589L80444J148979a107092A178945
$$ 1366037 848711 263101 1547978 1820779 227589 608033 1757012 -1107092 1178945
6814e34668A525013F29155P27631J689934A267425g08768A343757J409058E82823
$$ -534668 1525013 629155 1356786 3046720 1267425 -708768 1343757 2752815 582823
6804B697525F68999J110868B16103a72019I03272P79784n04917P92047c4835B300763
$$ 2697525 668999 1779867 216103 -172019 903272 1683056 1178139 1970186 -34835 2300763
6793h3504C298473C24193J903545B64884K742916j005143f27942o52317R0152
$$ -83504 3298473 324193 2227738 264884 3007800 2002657 -627942 -1280259 -1190107
6784a190107A09343J804023E18340A95676J500693N89466F28720L10297c89412
$$ -1190107 109343 1913366 518340 195676 1696369 2285835 628720 939017 -389412
6774B494059A023808Q38660M20082J21215m62186C99500K916627I34937J587906
$$ 2494059 1023808 1862468 2282550 2403765 1941579 399500 3316127 934937 2522843
6765B522843I18459a69842B072943a39387A967355g35614r6870A733441F18417
$$ 2522843 918459 -169842 2072943 -139387 1967355 -735614 -832484 1733441 618417
6755i37610I81523B03062b16990L7216B617801F09397a49730A390193P72284e7108
$$ -937610 981523 203062 -216990 -179774 2617801 609397 -149730 1390193 2162477 -57108
6744D20257A42044P22798J6705K769609A158724n60481J322417i22782B98299
$$ 420257 142044 864842 881547 3651156 1158724 598243 1920660 -922782 298299
6734H51138a019601b85211A289768l3786R95661E11770a031217n83954I43986
$$ 851138 -1019601 -285211 1289768 1255982 2251643 511770 -1031217 -1615171 943986
6724c7598A174631a353703A738883q69366l10486R03899I7935J093523n94705
$$ -37598 1174631 -1353703 1738883 869517 559031 1462930 97935 1191458 596753
6715E96753Q58684F71994c43161A44348R58308L67555F86568J37232b55980A867338
$$ 596753 1455437 671994 -343161 144348 1102656 1470211 686568 823800 -255980 1867338
6704A434608a133083a40959C43956J824187F62633J295146f163A589361B76733
$$ 1434608 -1133083 -140959 343956 2168143 662633 1957779 -6163 1589361 276733
6694A759577k0648A00640J163997h47988A56663f05768I79690J882615G53794
$$ 1759577 1738929 100640 1264637 -847988 156663 -605768 979690 2862305 753794
6684G35514J038555N23661O43360a15263B212306q21916O39227D1630R78397L84080
$$ 735514 1774069 2297730 2941090 -115263 2212306 1390390 2029617 41630 1020027 1404107
6674A404107A06742f9277A424456J104241o79894F70009M24130L02469h29434
$$ 1404107 106742 -69277 1424456 2528697 1848803 670009 1094139 1396608 -829434
6664A348446R99826A111988J775844G89210R10929q34243L2592K0720k0105c09429
$$ 1348446 2348272 1111988 2887832 789210 1700139 865896 898488 919208 899103 -309429
6653A157849P40653b44133B199196m12263A33441J993177A020920c29733A077716
$$ 1157849 1898502 -244133 2199196 1786933 133441 2126618 1020920 -329733 1077716
6643A207676l13292q0659L88831B98947a6541F96297a382567B483023f12364B086328
$$ 1207676 894384 813725 1202556 298947 -16541 696297 -1382567 2483023 -612364 2086328
6632a07214B010644l48430o6634R30187A38294F0860c39020B447217J88192I97838
$$ -107214 2010644 1662214 1595580 2525767 138294 60860 -339020 2447217 2635409 997838
6621B316647p34258n39900J596883N08170C04446L29474a129208A924245G20357
$$ 2316647 1582389 1042489 2639372 3147542 304446 633920 -1129208 1924245 720357
6611A595563a581130C026052A3577J947837I34367j60250K15380B98333J205199
$$ 1595563 -1581130 3026052 13577 1961414 934367 774117 989497 298333 1503532
6602A503532J896011H44118J258323g64081A292657N23832n96561J309136B85030
$$ 1503532 3399543 844118 2102441 -764081 1292657 1816489 1219928 2529064 285030
6592A448283P18934J921j9382K16257A097537K94335N7795K23370E36991L3059
$$ 1448283 2167217 2169138 2149756 2366013 1097537 1391872 1449667 1673037 536991 570050
6582E70050P65735J49246h6501C147454F50610P09121J331868A096076M49469
$$ 570050 1335785 1485031 -86501 3147454 650610 1359731 2691599 1096076 1545545
6573A545545a15636D35270R2988J363467C8585O66336R82509O34277a33195o30689
$$ 1545545 -115636 435270 528258 1891725 38585 704921 1687430 2321707 -133195 -763884
6563g63884J02329B894310C00686R55665d74467Q5076j5196B459747c87818B598859
$$ -763884 -661555 2894310 300686 1256351 -474467 -389391 -404587 2459747 -387818 2598859
6552E77102J450325I70874J174254I01607J320182F87788M79388f5516B642167
$$ 577102 2027427 970874 2145128 901607 2221789 687788 1167176 -65516 2642167
6542d33714k094626A645327L41228E93999O840M47791K417822A319602J34676
$$ -433714 -2528340 1645327 1986555 593999 600839 1048630 3466452 1319602 1454278
6533A454278J490715p8699B32934L34520O92893J04636J531991j406248n9279
$$ 1454278 2944993 2866294 232934 567454 1260347 1364983 2896974 1490726 1431447
6524A431447P03822a555204c78669A961888F23762j58497J286695k50948b61368
$$ 1431447 2135269 -1555204 -378669 1961888 623762 465265 1751960 1501012 -261368
6514I71253a70165A175796M19020E82764J433463K20836G08896J211414a30932
$$ 971253 -170165 1175796 1594816 582764 2016227 2237063 708896 1920310 -130932
6504B238179I04896C05703K16329K090942A166880L77403K98858b97409F85860
$$ 2238179 904896 305703 522032 2612974 1166880 1544283 1843141 -297409 685860
6494F14188J458484k42051E53981m3284K28012P16034j22899K52120k39626i29478
$$ 614188 2072672 1830621 553981 510697 738709 1454743 1331844 1583964 1344338 -929478
6483F83723b50682A397764C59572Q54706j32930L63039K76360b04984B524530
$$ 683723 -250682 1397764 359572 1214278 1081348 1444387 1720747 -204984 2524530
6473h03854A367522o50589K105848B93518K59091J657219F49949K700921C49349
$$ -803854 1367522 716933 2822781 293518 552609 2209828 649949 3350870 349349
6463H78641k52002G9156K66988e68233a06023A015145m69041O28831E67664K6684
$$ 878641 626639 79156 346144 -568233 -106023 1015145 546104 1174935 567664 594348
6453E94348P44054J368153n88321Q4690N61056A360873Q35318j070467C82991
$$ 594348 1338402 2706555 2118234 2202924 2763980 1360873 2196191 1125724 382991
6443c55134H20357P09994K721J225031f54182B552798A192927O58780H13601h10076
$$ -355134 820357 1530351 1533072 2758103 -654182 2552798 1192927 1851707 813601 -810076
6432A265430n18270J77334K31756J431067F98305J198689J22071H08464r5332
$$ 1265430 747160 924494 1156250 2587317 698305 1896994 2019065 808464 713132
6423G13132a85664A227163D45293J798560D36236L80896J78367K02531C00634
$$ 713132 -185664 1227163 445293 2243853 436236 817132 995499 1198030 300634
6413H54752B31617K297655A255296b37993A112471L76016k83264J096648k54652
$$ 854752 231617 2529272 1255296 -237993 1112471 1488487 1205223 2301871 2047219
6404B047219R62373C38961M06125f3310A201504L59571O44898M3966H08143b8825
$$ 2047219 3009592 338961 745086 -63310 1201504 1561075 2205973 2249939 808143 -28825
6393A485020Q077E61117K703050C95356J155690A66715L365924A36278J385904
$$ 1485020 1493097 561117 3264167 395356 1551046 166715 3532639 136278 1522182
6384A522182J566233G51092C13869J314563I8950f92454B008368g34259B393702
$$ 1522182 3088415 751092 313869 1628432 98950 -692454 2008368 -734259 2393702
6374B430383J56814A192879J958713j348087n90042J57520Q03230F95340J77178
$$ 2430383 2587197 1192879 3151592 1803505 1213463 1370983 2174213 695340 872518
6365H72518j7819b81700A57488d67101E90743Q95431F60579e80717B99742i92702
$$ 872518 854699 -281700 157488 -467101 590743 1486174 660579 -580717 299742 -992702
6354a80642F5035J089910K549537D31676O46302k54577O56288K486715a31126
$$ -180642 65035 1154945 3704482 431676 1077978 823401 1479689 3966404 -131126
6344b31036B755007N2932I32573J677172p34338F33112N55469B01948c53827A200868
$$ -231036 2755007 2807939 932573 2609745 1875407 633112 1188581 201948 -353827 1200868
6333h73756A767768A56156R18569D61238R04332J087281B76809J359844J421780
$$ -873756 1767768 156156 1074725 461238 1365570 2452851 276809 1636653 3058433
6324C058433H38953j6162M80006L0076J208930I27778k21354J680635e88877A49893
$$ 3058433 838953 822791 1302797 1332873 2541803 927778 706424 2387059 -588877 149893
6313A139147P74022I01537J132042K2334C38916K15425J544907r10971j37102
$$ 1139147 1913169 901537 2033579 2055913 338916 554341 2099248 1188277 1051175
6304A051175O75602p15216l5881d3205A027180K15819K269206A664568l88491
$$ 1051175 1726777 1011561 975680 -43205 1027180 1242999 3512205 1664568 1276077
6295A276077m8073K419740c2156r33312B859309j144798l33387Q19416i68954
$$ 1276077 1228004 3647744 -32156 -965468 2859309 1714511 1381124 2200540 -968954
6285a641098C049399E81939J274832j75410M3183a00668B001396g36262F19372
$$ -1641098 3049399 581939 1856771 1681361 1724544 -100668 2001396 -736262 619372
6275D39239e38565B429483j073506Q06421k76962j74260G25599J20912O45085
$$ 439239 -538565 2429483 1355977 2162398 1885436 1711176 725599 846511 1491596
6266A491596E90667A07881O92281B26318b23774k6871A070613K007987A166990
$$ 1491596 590667 107881 800162 226318 -223774 -250645 1070613 3078600 1166990
6256A179777J466223k26206H64203R44835g45088C158904A303053A22550d76658
$$ 1179777 2646000 2419794 864203 1809038 -745088 3158904 1303053 122550 -476658
6246A702216K068734a096645C75468K65087C0109K280126I51695L523875j704385
$$ 1702216 3770950 -1096645 375468 640555 30109 2310235 951695 4475570 2771185
6237B771185h39946C70352J681198a397050A284131l0103J591084A379905n39237
$$ 2771185 -839946 370352 2051550 -1397050 1284131 1254028 2845112 1379905 840668
6228H40668M92924e38061A022375R50584L84539e54750B955899A168577J169637
$$ 840668 1333592 -538061 1022375 1972959 2357498 -554750 2955899 1168577 2338214
6219B338214j111739M18296B7909L841306j679697q17213J31165j74441L14154
$$ 2338214 1226475 1644771 27909 3869215 2189518 1372305 1503470 1329029 1643183
6210A643183J078851G65195J977475I10146P54101J74356G00514l04135N39070
$$ 1643183 2722034 765195 2742670 910146 1664247 1838603 700514 396379 935449
6201I35449m47713J271687k25920M28004o51348K35443M57418K02998N28433K22686
$$ 935449 487736 1759423 1533503 1961507 1310159 1545602 2003020 2206018 2734451 2957137
6191B957137j402726g09144m26038B563743A237660J010014E52210J052513J064583
$$ 2957137 1554411 -709144 -1135182 2563743 1237660 2247674 552210 1604723 2669306
6182B669306l49385j047567m69832J897158H2739K94804K966903A669330K130766
$$ 2669306 2319921 1272354 802522 2699680 82739 377543 3344446 1669330 3800096
6173C800096j334923A156241J227394m34984m99766m95425M88904f19119B68020
$$ 3800096 2465173 1156241 2383635 1948651 1448885 953460 1442364 -619119 268020
6163c034956A543918I371J518063d38032B398481K49275j007999l95764j50471
$$ -3034956 1543918 9371 1527434 -438032 2398481 2647756 1639757 1243993 1093522
6154A093522K52900k767d287A026553L039571j993156p64647b70372E0863J62845
$$ 1093522 1346422 1343655 -4287 1026553 4066124 2072968 1308321 -270372 50863 213708
6144B13708L99262R94297L4223o02964Q80295k84667H05854L148694b99666A300457
$$ 213708 612970 1607267 1641490 1038526 1918821 1634154 805854 3954548 -299666 1300457
6133A840504J400386H8553J760836b494A029558R71256A42110J113146J749962
$$ 1840504 3240890 88553 1849389 -2494 1029558 2000814 142110 1255256 3005218
6124C005218j071840p97715m61607O9757M52549m33257b26875G73350M91455c0617
$$ 3005218 1933378 1135663 674056 743813 1196362 763105 -226875 773350 1264805 -30617
6113B62044J767244n68177m47178b19105B065215n72747D72049J813583q19801
$$ 262044 2029288 1461111 1013933 -219105 2065215 1492468 472049 2285632 1465831
6104A465831h01820A36927J96076K095563r85477J460373a572225B592628q79763
$$ 1465831 -801820 136927 333003 2428566 1443089 2903462 -1572225 2592628 1712865
6095A712865M01533A51335d8210C41264J8270L06561P97837J65137l48103J841277
$$ 1712865 2114398 151335 -48210 341264 359534 666095 1463932 1629069 1280966 3122243
6085C122243I94519J997234c94458A718250d0271A143310M94158J701L83258o13949
$$ 3122243 994519 2991753 -394458 1718250 -40271 1143310 1637468 1639169 2022427 1408478
6075A408478R79265A163559D89764J348099j86210O01742A009035P65285R9606
$$ 1408478 2387743 1163559 489764 1837863 1651653 2253395 1009035 1774320 1873926
6066A873926l35700m02621a5995B71866J554472q07204L11945f02414A044624
$$ 1873926 1538226 1135605 -15995 271866 1826338 1019134 1331079 -602414 1044624
6056B33552O84584f63682B71641Q85663g73179a75889B115689q32186J515164
$$ 233552 918136 -663682 271641 1157304 -773179 -175889 2115689 1283503 2798667
6047B798667I66551J724786I95191O71482g26841G16503L89414J26537O44710
$$ 2798667 966551 2691337 995191 1666673 -726841 716503 1105917 1232454 1877164
6038A877164J516821m46187j391098P5737K36329q38381l41869K14015m33184
$$ 1877164 3393985 2947798 1556700 1632437 1868766 1030385 688516 902531 469347
6029D69347M15510J115694M3764J171848j402783J029838k20706A214908J609827
$$ 469347 884857 2000551 2044315 3216163 1813380 2843218 2622512 1214908 2824735
6020B824735k21405E96794Q73033e24470A190950K63776K03378p48794n3587J458966
$$ 2824735 2603330 596794 1469827 -524470 1190950 1454726 1658104 909310 855723 2314689
6010B314689H00530a459385A177581O09961K48894o10221k63166O62893L00468
$$ 2314689 800530 -1459385 1177581 1787542 2036436 1426215 1163049 1825942 2126410
6001B126410H35917L50853J05540J180268H66550O90971O5503P38794A108353
$$ 2126410 835917 1186770 1292310 2472578 866550 1557521 1623024 2361818 1108353
5991A621217K635270q89657C15641J994112p29461Q19008c37337A67353e46669
$$ 1621217 4256487 3366830 315641 2309753 1580292 2399300 -337337 167353 -546669
5981A182047j74317J181281D85944O40889Q12733K96750k33337a4185B671548
$$ 1182047 1007730 2189011 485944 1126833 1939566 2236316 2002979 -14185 2671548
5971A65919N61434J168931J163646J007676B027194I47070b69126E7798J614958
$$ 165919 727353 1896284 3059930 4067606 2027194 947070 -269126 57798 1672756
5962A672756f14014B087327k26834J172587A133122N03314j95050C15038J160703
$$ 1672756 -614014 2087327 1860493 3033080 1133122 1636436 1441386 315038 1475741
5953A475741J35378b64700B795155A253179R05640a916967f4877p31655A406223
$$ 1475741 1611119 -264700 2795155 1253179 2158819 -1916967 -64877 -796532 1406223
5943C00831P35664J35168M30954o83699Q9246K38297P91411N62496o36369q52564
$$ 300831 1036495 1171663 1602617 918918 1008164 1246461 2037872 2600368 1963999 1111435
5933A111435K251769A011966J237795M51356N6004h20870B346392o69369L02643
$$ 1111435 3363204 1011966 2249761 2701117 2757121 -820870 2346392 1677023 1979666
5924A979666J169226A292784N47326F6039K742387r0270j018142J079565q08112
$$ 1979666 3148892 1292784 1840110 66039 2808426 2718156 1700014 2779579 1971467
5915A971467j92525E76817e4933G43759O08142J095478P54664j232273o32095
$$ 1971467 1778942 576817 -54933 743759 1351901 2447379 3202043 1969770 1337675
5906A337675A46356K885469A395073J2838L646217a187897B959442A051881J454801
$$ 1337675 146356 3031825 1395073 1407911 5054128 -1187897 2959442 1051881 2506682
5897B506682M43855m01350G41043M42854J025515m91716b54157A453355o2756
$$ 2506682 2950537 2549187 741043 1183897 2209412 1717696 -254157 1453355 1390599
5888A390599J978663A644699c11790C431440b8448C126606m93018B77910K834051
$$ 1390599 3369262 1644699 -311790 3431440 -28448 3126606 2633588 277910 3111961
5879C111961j29436F19740J698582N03089o58965O98579F97104a341527G26018
$$ 3111961 2982525 619740 2318322 2821411 2162446 2861025 697104 -1341527 726018
5869B823868r40230A60166P59949A77570e9574A115270J000067A010689D65253
$$ 2823868 1883638 160166 920115 177570 -59574 1115270 2115337 1010689 465253
5859D142716j855616o0581j104093R75638R4678K32918N04546r20214D16609g34394
$$ 4142716 2287100 2226519 1122426 2098064 2192742 2425660 2930206 2009992 416609 -734394
5848E36112O92921G9080J106018J606094D58468J087747G10447J605134e1001
$$ 536112 1229033 79080 1185098 2791192 458468 1546215 710447 2315581 -51001
5838H49069M35130m01302B56759J149708K77823i3878B403675j001087R31543
$$ 849069 1284199 882897 256759 1406467 1684290 -93878 2403675 1402588 2334131
5829B334131k65534K289436I8449J626590J279604r24471F27634O85983k03418
$$ 2334131 2068597 4358033 98449 1725039 3004643 2080172 627634 1313617 1110199
5820A110199c56775E1231Q49009K335872n7573e50953A700570J254262j412955
$$ 1110199 -356775 51231 900240 3236112 3178539 -550953 1700570 2954832 1541877
5811A541877M38734J93006C98064J538814P60905j177867J669491A543442J206257
$$ 1541877 1980611 2173617 398064 1936878 2697783 1519916 3189407 1543442 2749699
5802B749699J539418j060579H85332g33959A132872b19265B641074G01448J454940
$$ 2749699 4289117 3228538 885332 -733959 1132872 -219265 2641074 701448 2156388
5793B156388j032302j08708m40564d95491B269847o91656J176341l81371q83920
$$ 2156388 1124086 1015378 574814 -495491 2269847 1578191 2754532 2373161 1489241
5784A489241F25031J140749K29521p84984m8680O77128K17387M12279r75495K45154
$$ 1489241 625031 1765780 1995301 1210317 1161637 1838765 2056152 2468431 1492936 1738090
5774A738090F74189J548784H90609r9830e830B75217R2379K433338G51252O84954
$$ 1738090 674189 2222973 890609 790779 -5830 275217 367596 2800934 751252 1436206
5764A436206J96828L91725D54281p0616J424578J824659A572518O41027O72051
$$ 1436206 1633034 2024759 454281 383665 1808243 3632902 1572518 2213545 2885596
5755B885596N19663A186836l83536J783209J152593j064721J21955O0434H00843
$$ 2885596 3405259 1186836 803300 2586509 3739102 2674381 2796336 2856770 800843
5745B196130q04471O38309n49490M6751K59998B24834R4369K569218M46371r97420
$$ 2196130 1391659 2029968 1480478 1527229 1787227 224834 319203 2888421 3334792 2337372
5735B337372F04258E1615R18870J134839q9478q65420j88876J539373m72540l37469
$$ 2337372 604258 51615 970485 2105324 2015846 1150426 961550 2500923 2028383 1690914
5725A690914O81020n99948R43127j26624q64217G3442K936185o75318H76177J163327
$$ 1690914 2371934 1771986 2715113 2588489 1724272 73442 3009627 2334309 876177 2039504
5715B039504J366656A610917K79389q90760j25518J871722H33160O48966K659624
$$ 2039504 3406160 1610917 1890306 999546 874028 2745750 833160 1482126 4141750
5706D141750F85472K371995m04265l14477A161321J949134A75823Q72275K060793
$$ 4141750 685472 3057467 2653202 2338725 1161321 3110455 175823 1048098 3108891
5697C108891j287386M78021n96898N86808L66428m45244e06853A918526E22344
$$ 3108891 1821505 2299526 1702628 2289436 2655864 2210620 -506853 1918526 522344
5687B734852j89644M15743J07193L23540j375528f90231A871512q93629k71946
$$ 2734852 2545208 2960951 3068144 3391684 2016156 -690231 1871512 977883 705937
5678G05937J428156A99561R02983J723976m56561j137366J266687H02433K105203
$$ 705937 2134093 199561 1102544 2826520 2369959 1232593 2499280 802433 2907636
5669B907636a86714B343813M62870O40845j154248j94192K98975n30512J470535
$$ 2907636 -186714 2343813 2806683 3447528 2293280 2099088 2398063 1867551 3338086
5660C338086Q90608A912002p96579K365721j429505E84596J887075n3897K30233
$$ 3338086 4228694 1912002 1115423 3481144 2051639 584596 2471671 2417774 2648007
5651B648007J822215j588811J215212A896756K031064o69032Q32252j345060P13346
$$ 2648007 4470222 2881411 4096623 1896756 3927820 3258788 4091040 2745980 3459326
5642C459326j579412J862419l40177P84555j742930K020484k204008L18495j285890
$$ 3459326 1879914 3742333 3402156 4186711 2443781 4464265 2260257 2578752 1292862
5633A292862D35264L223346j387833R24991j558952J516382r94829j39805p82280
$$ 1292862 435264 3658610 2270777 3195768 1636816 3153198 2158369 2018564 1236284
5624A236284Q43635J187368q90139l21251q23982R12443I15366J681162b02158
$$ 1236284 2079919 3267287 2377148 2055897 1231915 2144358 915366 2596528 -202158
5614A366828B81779K757429l18150F19866L129536A558773J322245A54477R15027
$$ 1366828 281779 3039208 2721058 619866 3749402 1558773 2881018 154477 1069504
5605A069504J118850g6790B541640J633355j54888j077431l75212J094732A810144
$$ 1069504 2188354 -76790 2541640 4174995 4020107 2942676 2567464 3662196 1810144
5595D633712I54734J845230A160377j24321Q25947j25987J581912A165928M45623
$$ 4633712 954734 2799964 1160377 1036056 1862003 1736016 3317928 1165928 1611551
5586A611551M35933p15724c24511D026257A357531P18670M57126A227010D16172
$$ 1611551 2047484 1331760 -324511 4026257 1357531 2076201 2533327 1227010 416172
5576C229046j006964j099793K688763A725409J630045J74448r00537N25000j295129
$$ 3229046 2222082 1122289 3811052 1725409 3355454 3529902 2629365 3154365 1859236
5567A859236L62352A106852K814738r37811n26936J90209J74574j387078k02807
$$ 1859236 2221588 1106852 3921590 2983779 2456843 2647052 2821626 1434548 1231741
5558A231741j29429J290687q58838J549854r84008J642056A835165J290580j188658
$$ 1231741 1102312 2392999 1534161 3084015 2100007 3742063 1835165 3125745 1937087
5549A937087J551397j424992p32340L077513a97180B900945O6292A026228J140665
$$ 1937087 3488484 2063492 1331152 4408665 -197180 2900945 2967237 1026228 2166893
5540B166893J247992C69878J600689K903874j034979d34551B085938J310845A676318
$$ 2166893 3414885 369878 1970567 4874441 3839462 -434551 2085938 3396783 1676318
5530B552188j242122K077851N86557p88044L07470r00539P98240k23135j26245
$$ 2552188 1310066 3387917 3974474 3186430 3493900 2593361 3391601 3168466 3042221
5521C042221J9450A471946J603285P42682R44176k137337l4982P9747Q57860k53702
$$ 3042221 3061671 1471946 3075231 3817913 4762089 2624752 2589770 2669517 3527377 3273675
5511C273675j27644o85612Q88968J628283L74103A615243k0110E69992L199044
$$ 3273675 3146031 2460419 3349387 4977670 5351773 1615243 1595133 569992 3769036
5502C769036j568577o58321L304932j470656j426468K105811F34663L393599q68853
$$ 3769036 2200459 1542138 4847070 3376414 1949946 4055757 634663 4028262 3159409
5493C159409J089174K291639I51730K402778J253536r86146p98291J5827C82065
$$ 3159409 4248583 6540222 951730 3354508 4608044 3621898 2823607 2839434 382065
5483C880549o54829n54l35873M091345C335126R57849K4081A726849l08121K430027
$$ 3880549 3225720 3225166 2889293 6980638 3335126 4292975 4317056 1726849 1418728 3848755
5473C848755k78380r94650J659508l2803k7726k71220j033454R97987A479311
$$ 3848755 3570375 2575725 4235233 4202430 4174704 3903484 2870030 3868017 1479311
5463A482145J390534n51243E60051J076045r5627J630898l50781q07161P93845
$$ 1482145 2872679 2321436 560051 1636096 1540469 3171367 2820586 2013425 2807270
5454B807270H34611L252101o71730j327826J762914j755028J494000k82964o72605
$$ 2807270 834611 4086712 3414982 2087156 3850070 2095042 3589042 3306078 2633473
5445B633473P34450A219265n00349M17777K318854A631037K192307r53065j335745
$$ 2633473 3367923 1219265 718916 1136693 3455547 1631037 3823344 2870279 1534534
5436A534534G09490O99054J588138m23334n14033J93280L68046l97947j060707
$$ 1534534 709490 1408544 2996682 2573348 2059315 2252595 2620641 2222694 1161987
5427A161987j84444J574627m3821J509319r93939j438744G67059O54719Q37930
$$ 1161987 977543 2552170 2508349 4017668 3023729 1584985 767059 1421778 2259708
5418B259708J169949A153244J641414K7471J262154j650240J047243j33568r05857
$$ 2259708 3429657 1153244 2794658 2822129 4084283 2434043 3481286 3347718 2441861
5409B441861J556808A548670K118737A472415J39175J265385A181663j94082J237785
$$ 2441861 3998669 1548670 3667407 1472415 1611590 2876975 1181663 987581 2225366
5400B225366A047057K60549N05531K148210A547360l42022J199190H04631O37065
$$ 2225366 1047057 1307606 1813137 3961347 1547360 1205338 2404528 804631 1441696
5391A441696Q4406J259239N16135K214630A751703o37581J428967j225225L09977
$$ 1441696 1526102 2785341 3301476 5516106 1751703 1114122 2543089 1317864 1627841
5382A627841J49733R47012k53091K578084B013376K103052k035856L25802n9648
$$ 1627841 1777574 2724586 2471495 5049579 2013376 4116428 2080572 2406374 2346726
5373B346726K78922l95645J335519J28601j666706C47964L273548p64069R46378
$$ 2346726 2625648 2230003 3565522 3694123 2027417 347964 3621512 2857443 3803821
5364C803821j446724M75562A144919J338388k62574O74738A258178A02131K593928
$$ 3803821 2357097 2832659 1144919 2483307 2220733 2895471 1258178 102131 2696059
5355B696059G32815J07742J777560J705711J333757A840869K160119k46231j354022
$$ 2696059 732815 840557 2618117 4323828 5657585 1840869 4000988 3754757 2400735
5346B400735l9397l16151k17157L06518J969663j004511j38492j85671J971619
$$ 2400735 2361338 2045187 1828030 2134548 4104211 3099700 2961208 2775537 4747156
5337D747156L76548p68355j260058j67905O55202O07494F36322K129276l68428
$$ 4747156 5123704 4355349 3095291 2927386 3582588 4190082 636322 2765598 2397170
5328B397170M56199M76248L64460j356742M54636Q01836R45094k242179q72524
$$ 2397170 2853369 3329617 3694077 2337335 2791971 3593807 4538901 2296722 1424198
5319A424198L769893k419200D11642L150202C84456J829015N02903J331025j364933
$$ 1424198 5194091 2774891 411642 3561844 384456 2213471 2716374 4047399 2682466
5310B682466j230697J500618M72065A020875J851504k27470B19152J212403J176129
$$ 2682466 1451769 2952387 3424452 1020875 2872379 2644909 219152 1431555 2607684
5301B607684r84319J080392L0071O78835n89223J601895o47590A658850J885131
$$ 2607684 1623365 2703757 2733828 3412663 2823440 4425335 3777745 1658850 3543981
5292C543981K47599N46596k077035J503742n44994H33994J594630A119404K260237
$$ 3543981 3791580 4338176 2261141 3764883 3219889 833994 2428624 1119404 3379641
5283C379641A033873Q05535o67068J206017R37416l2469m08449P03751r22102
$$ 3379641 1033873 1839408 1172340 2378357 3315773 3283304 2874855 3578606 2656504
5274B656504J379410j925274l64861J382800r42896K037262j336351j191717N09561
$$ 2656504 4035914 2110640 1745779 3128579 2185683 4222945 2886594 1694877 2204438
5265B204438n530K595080j545711j595665C65551J453699J372851J40687n41483
$$ 2204438 2198908 4793988 3248277 1652612 365551 1819250 3192101 3332788 2791305
5256B791305p67833r65269L327344j175525J662385j47851J966845q70647J043497
$$ 2791305 2023472 1058203 4385547 3210022 4872407 4724556 6691401 5820754 6864251
5247F864251q96776r17031J580241j578943O12225r45488n51712j391787J293925
$$ 6864251 5967475 5050444 6630685 5051742 5663967 4718479 4166767 2774980 4068905
5238D068905A578566J750771L17753q51750J896745o4766A535129K555444J13530
$$ 4068905 1578566 3329337 3647090 2795340 4692085 4627319 1535129 4090573 4204103
5229D204103j131638n86436K341793j012098p22376J927314G80537K290055j131779
$$ 4204103 3072465 2486029 4827822 3815724 3093348 5020662 780537 3070592 1938813
5220A938813R86631A13330K293758L61843P26731N19374A504971M63712J040047
$$ 1938813 2925444 113330 2407088 2768931 3495662 4015036 1504971 1968683 3008730
5211C008730k58796P690J307549j075057R09365A740327J398822J836088A124305
$$ 3008730 2749934 2757624 4065173 2990116 3899481 1740327 3139149 4975237 1124305
5201E414665j465838j770583J677858M08220j192254J349860j594599J268258
$$ 5414665 3948827 2178244 3856102 4264322 3072068 4421928 2827329 4095587
5193D095587A133805K362004j152349N1325M40388A353233J365490J038944j617133
$$ 4095587 1133805 3495809 2343460 2394785 2835173 1353233 2718723 3757667 2140534
5184B140534K35061J215408m52885j506967K18428D61786K407917j146360J536484
$$ 2140534 2375595 3591003 3138118 1631151 1849579 461786 2869703 1723343 3259827
5175C259827r55897j28628L384539k357849n77707J050919k74779M10956A476961
$$ 3259827 2303930 2175302 5559841 3201992 2624285 3675204 3400425 3811381 1476961
5165C057734J840227j844946Q94808j623021r3398K892142j416222q55102j246856
$$ 3057734 4897961 3053015 3947823 2324802 2231404 5123546 3707324 2852222 1605366
5156A605366J707208m34357J432216j033814p16019J772154A943095J27426J938356
$$ 1605366 3312574 2878217 4310433 3276619 2560600 4332754 1943095 2070521 4008877
5147D008877r22482j206179J363338r78910J990008L2365B073281F60270J191074
$$ 4008877 3086395 1880216 3243554 2264644 4254652 4287017 2073281 660270 1851344
5138A851344J969208J076106j142405F88718L222194j155802J129964M47499q65298
$$ 1851344 3820552 4896658 3754253 688718 3910912 2755110 3885074 4332573 3467275
5129C467275j386738K694937j992911O92171K63299P90132p70433K39172l2307
$$ 3467275 2080537 4775474 2782563 3474734 3738033 4528165 3757732 3996904 3964597
5120C964597r56597K444332m00977B408718J859089n06876l29423R95856j421900
$$ 3964597 3008000 5452332 5051355 2408718 4267807 3760931 3431508 4427364 3005464
5111C005464J487927Q77928k574047K110947O81074P772j464595o1229j830070
$$ 3005464 4493391 5371319 2797272 4908219 5589293 5597065 4132470 4071241 2241171
5102B241171J356078j490922P84992J401469K92314o28137J935711j595351o73282
$$ 2241171 3597249 2106327 2891319 4292788 4585102 3956965 5892676 4297325 3624043
5093C624043J479068L87255j80184B448328K612757k180700J638112k18819m76357
$$ 3624043 5103111 5490366 5310182 2448328 5061085 2880385 4518497 4299678 3823321
5084C823321j087549O79516q66465J244916O12474K4235B169536J982551q66489
$$ 3823321 2735772 3415288 2548823 3793739 4406213 4430448 2169536 4152087 3285598
5075C285598J026395J198078p854B699748J831421j100030J793698B440229E30462
$$ 3285598 4311993 5510071 5502217 2699748 4531169 3431139 5224837 2440229 530462
5065C619359J698669j112868n03356j149567Q99587J07193P17583j059043J249828
$$ 3619359 5318028 4205160 3701804 2552237 3451824 3559017 4276600 3217557 4467385
5056D467385k220135K3206J198997J108767J78449j907765o1761J203744k79706
$$ 4467385 2247250 2270456 3469453 4578220 4756669 2848904 2787143 3990887 3711181
5047C711181n66254O4947j78295K485943k298327Q14439J672678k718189J596219
$$ 3711181 3144927 3209874 3031579 5517522 3219195 4033634 5706312 2988123 4584342
5038D584342j648210A248758K431848Q783J042102j308547J093126A290011M013766
$$ 4584342 2936132 1248758 3680606 3689389 4731491 3422944 4516070 1290011 5303777
5029E303777A051801K854880j387188J281599k54635M97011o1509k85948J264694
$$ 5303777 1051801 3906681 2519493 3801092 3546457 4043468 3981959 3696011 4960705
5020D960705r86802j431979K675164k392458p33756J270523M79334j906587O02060
$$ 4960705 3973903 2541924 5217088 2824630 2090874 3361397 3840731 1934144 2536204
5011B536204J004907j102435J600318A757680K833909A783152M99622O75016J05954
$$ 2536204 3541111 2438676 4038994 1757680 4591589 1783152 2282774 2957790 3063744
5002C063744J603250r51242m59176n28474J561048A930749M481872j848879R95126
$$ 3063744 4666994 3715752 3256576 2728102 4289150 1930749 6412621 4563742 5558868
4993E558868M3129k147929q96701J298472m13954N29120O43833J33769Q71671
$$ 5558868 5601997 3454068 2557367 3855839 3441885 3971005 4614838 4748607 5620278
4984E620278L2120m36003P41954l21090n2079j486870J846116J167171J67783
$$ 5620278 5652398 5216395 5958349 5637259 5585180 4098310 5944426 7111597 7279380
4975G279380r42220J549150L784271n183415R49467j357178K11839r41787O63406
$$ 7279380 6337160 7886310 11670581 6487166 7436633 6079455 6291294 5349507 6012913
4966F012913B370849J762651L91438o07394j72013o38936K6928P65933P31950
$$ 6012913 2370849 4133500 4524938 3917544 3745531 3106595 3133523 3899456 4631406
4957D631406p88405j464678K699320j671745m81126J236116j207267J884533A029301
$$ 4631406 3843001 2378323 5077643 3405898 2924772 4160888 2953621 4838154 1029301
4947C710542l40327p02128k99500P21414l93571P70275O83204O94039k201280
$$ 3710542 3370215 2668087 2368587 3090001 2696430 3466705 4149909 4843948 2642668
4938B642668J210556M43409J882415B894852l59858N34641o15252o00917K714730
$$ 2642668 3853224 4296633 6179048 2894852 2534994 3069635 2454383 1853466 4568196
4929D568196J7805A508837R27778M96941N32451l64965M86017J62537j338623
$$ 4568196 4586001 1508837 2436615 2933556 3466007 3101042 3587059 3749596 2410973
4920B410973N09871J629139j555811K780135E74373K255037K329771j334296o78042
$$ 2410973 2920844 4549983 2994172 5774307 574373 2829410 5159181 3824885 3146843
4911C146843p63748O06859J685610L69945j125560J527243j878719j132453K704892
$$ 3146843 2383095 2989954 4675564 5045509 3919949 5447192 3568473 2436020 5140912
4902E140912j245181J324143B246375J144418N47409A425148K393624J376134
$$ 5140912 3895731 5219874 2246375 3390793 3938202 1425148 3818772 5194906
4894E194906m81471A345738L173573p18077L63375C94175J776749J436719k02240
$$ 5194906 4713435 1345738 4519311 3801234 4164609 394175 2170924 3607643 3405403
4885C405403J508306J121343k059766l34399L37331J093253j734547j180479P11319
$$ 3405403 4913709 6035052 3975286 3640887 3978218 5071471 3336924 2156445 2867764
4876B867764J460707M82213l1161p7046j298890J744131k373562J521429P14280
$$ 2867764 4328471 4810684 4779523 4702477 3403587 5147718 2774156 4295585 5009865
4867E009865k152270K174021k32482J263829B783436K523420k91916Q879k122077
$$ 5009865 2857595 5031616 4799134 6062963 2783436 5306856 5014940 5023819 2901742
4858B901742L2234M945336C310649j584900L028171A697871K094223J451756j405619
$$ 2901742 2933976 7879312 3310649 1725749 4753920 1697871 3792094 5243850 3838231
4849C838231O76668j821541J417836q82325J216011n77250J812147B591382K144546
$$ 3838231 4514899 2693358 4111194 3228869 4444880 3867630 5679777 2591382 4735928
4840D735928R612k45855Q0156N60001N90756j448631R94642O28892j549606k95022
$$ 4735928 4745540 4499685 4579841 5139842 5730598 4281967 5276609 5905501 4355895 4060873
4830D060873N07659k145800K152390N49496p7496M92859B740485K993169j444576
$$ 4060873 4568532 2422732 4575122 5124618 5047122 5539981 2740485 5733654 4289078
4821D289078m28085J885029j695700M96752J58408R35243j841941P20319j498103
$$ 4289078 3860993 5746022 4050322 4547074 4705482 5640725 3798784 4519103 3021000
4812C021000K323414m19653M75443j675580l21634N37326p02305J084547o03840
$$ 3021000 5344414 4924761 5400204 3724624 3402990 3940316 3238011 4322558 3718718
4803C718718M38737p56936K032650m01200n81148q32546L84258m97069K35381
$$ 3718718 4157455 3400519 5433169 5031969 4450821 3618275 4002533 3505464 3740845
4794C740845M99655o23008J213315m51303K068970j939146n63031j065222n17315
$$ 3740845 4240500 3617492 4830807 4379504 6448474 4509328 3946297 2881075 2363760
4785B363760K898523P86180j012791m31973m1698Q34832p17541J480561B882783
$$ 2363760 5262283 6048463 5035672 4603699 4562001 5396833 4679292 6159853 2882783
4775E240180M21017q28031j999582J720076N55819j551371K760983j357974n62341
$$ 5240180 5661197 4833166 2833584 4553660 5109479 3558108 6319091 4961117 4398776
4766D398776p79249J217540K10891k89072n35187K616301Q73815j542085j085880
$$ 4398776 3619527 4837067 5047958 4758886 4223699 6840000 7713815 6171730 5085850
4757E085850J23454R24745j960369N95142J64543J130534j469807r23974m65292
$$ 5085850 5209304 6134049 4173680 4768822 4933365 6063899 4594092 3670118 3204826
4748C204826J435865M58215j004319J011008p45877j153872J643883O00541K97545
$$ 3204826 4640691 5098906 4094587 5105595 4359718 3205846 4849729 5450270 5747815
4739E747815k368471J831729k228668K610270k683346J846194n16968J487613
$$ 5747815 3379344 5211073 2982405 5592675 2909329 4755523 4238555 5726168
4731E726168o19026J65105N44135j762929R06969J73704J093148j957595R56089
$$ 5726168 5107142 5272247 5816382 4053453 4960422 5134126 6227274 4269679 5225768
4722E225768k098708J972009K49234j481312Q28715J404295j773351J340153o20493
$$ 5225768 3127060 5099069 5348303 3866991 4695706 6100001 4326650 5666803 5046310
4713E046310n40671q8368K181445K9217j681152j152420N61022r87025R99458
$$ 5046310 4505639 4417271 6598716 6627933 4946781 3794361 4355383 3368358 4367816
4704D367816q01350K125755n21593q69314Q83566j400550q6704J943170R53458
$$ 4367816 3566466 5692221 5170628 4301314 5184880 3784330 3697626 5640796 6594254
4695F594254l4249k231796P53991j1496j235696J655286k086005J331532L188409
$$ 6594254 6560005 4328209 5082200 5070704 3835008 5490294 3404289 4735821 7924230
4686G924230k497695L78835n53884L00700L93824q03428P25896K599735Q5931
$$ 7924230 5426535 5805370 5251486 5552186 5946010 5142582 5868478 8468213 8554144
4677H554144k811722J893663O96531k611718K016367j691447k456665K161680
$$ 8554144 5742422 7636085 8332616 5720898 7737265 6045818 3589153 5750833
4669E750833L07039J79005P39603J045740j919916m53218k411j970728K478751
$$ 5750833 6057872 6236877 6976480 8022220 6102304 5649086 5646675 3675947 6154698
4660F154698p22518n23525P06087k115391K153681n92863j00150n09132J109706
$$ 6154698 5432180 4908655 5614742 3499351 5653032 5060169 4960019 4450887 5560593
4651E560593k097034M86105J534857j274573L13500k94449Q03080r09085k10872
$$ 5560593 3463559 3949664 5484521 4209948 4523448 4228999 5032079 4122994 3912122
4642C912122K206958j543711q00063L654994C439362J310055Q80814n13076L68830
$$ 3912122 6119080 4575369 3775306 7430300 3439362 4749417 5630231 5117155 5485985
4633E485985j230450J915933k425468P4050K630428k93458k082489J396085P0473
$$ 5485985 4255535 6171468 3746000 3820050 6450478 6157020 4074531 5470616 5541089
4624E541089N27894J70377k552904K966616r81973q13815J15924J09054p1095
$$ 5541089 6068983 6239360 3686456 6653072 5671099 4857284 4973208 5082262 5011167
4615E011167j229609J169030J348367k732519J338002j724583K182952J179392
$$ 5011167 3781558 4950588 6298955 3566436 4904438 3179855 5362807 6542199
4607F542199L206529l656673Q73558k305179K26654J777080M80677M25546J576817
$$ 6542199 9748728 6092055 6965613 4660434 4887088 6664168 7144845 7570391 9147208
4598I147208k329579j861556K408507J356730o32108j305084P37368J18811r75928
$$ 9147208 6817629 4956073 7364580 8721310 8089202 6784118 7521486 7640297 6664369
4589F664369J85819J063378j686941J47405J220463j590442K13008r42809K325787
$$ 6664369 6850188 7913566 6226625 6374030 7594493 6004051 6217059 5274250 7600037
4580G600037p55085r76360q62147K809581o12790j44181j076992J89927J749947
$$ 7600037 6844952 5868592 5006445 7816026 7203236 7059055 5982063 6171990 7921937
4571G921937j239949n04874K563489j086368o04392j054266M386k15991J666188
$$ 7921937 6681988 6177114 8740603 7654235 7049843 5995577 5999963 5783972 7450160
4562G450160k267548l99519J290313N78286J048854j790782K326550l676019J894084
$$ 7450160 5182612 4783093 6073406 6651692 7700546 5909764 8236314 4560295 6454379
4553F454379J108802k837786Q32398K501694j690176K00443K23362j115948K276413
$$ 6454379 7563181 4725395 5557793 8059487 6369311 6569754 6793116 5677168 7953581
4544G953581k707238J8989J526734J76561j019118N28028j216991J466731j949373
$$ 7953581 5246343 5265332 6792066 6968627 5949509 6477537 5260546 6727277 4777904
4535D777904k27656K522318n36890r79990k160052J775571k502858J850771K001766
$$ 4777904 4550248 7072566 6535676 5555686 3395634 5171205 2668347 4519118 6520884
4526F520884j575405K209946l113099K235257Q81887p87348p78149J729013j997095
$$ 6520884 4945479 7155425 4042326 6277583 7159470 6372122 5593973 7322986 5325891
4517E325891n03369k06186J369426Q68895k477109K013554J756818l143427o34379
$$ 5325891 4822522 4616336 5985762 6854657 4377548 6391102 8147920 5004493 4370114
4508D370114J380207K599495k524544l1155j410230L80719K578150o79152k513735
$$ 4370114 5750321 8349816 5825272 5794117 4383887 4764606 7342756 6663604 4149869
4499D149869J296997J927659j045097p78490k220233K246911J318453j613196
$$ 4149869 5446866 7374525 6329428 5550938 3330705 5577616 6896069 5282873
4491E282873r07754K114007n93357k13843B520157L945875j792237o6576r9252
$$ 5282873 4375119 6489126 5895769 5681926 2520157 6466032 4673795 4607219 4507967
4482D507967J488029p04406K199264j625419o41462Q86037j475579N94606j047861
$$ 4507967 5995996 5291590 7490854 5865435 5223973 6110010 4634431 5229037 4181176
4473D181176K801201j612503j019362K724842j267351K34532J10769J036959Q12646
$$ 4181176 6982377 5369874 4350512 7075354 5808003 6042535 6153304 7190263 8002909
4464H002909p00478j844446K340973m27195r26045J010800r67237O99203k654140
$$ 8002909 7302431 5457985 7798958 7371763 6445718 7456518 6489281 7188484 4534344
4455D534344L81584K797989l560997Q52951J379292J74611j372176J52961K20377
$$ 4534344 4915928 7713917 4152920 5005871 6385163 6559774 5187598 5340559 5560936
4446E560936J425420j92337o67394n9555K67606k862388K698709j92562k006132
$$ 5560936 6986356 6794019 6126625 6067070 6334676 3472288 6170997 5978435 3972303
4437C972303J928703L15349O04625J837706m210977J923216j815327R88994J802978
$$ 3972303 5901006 6216355 6820980 8658686 4447709 6370925 4555598 5544592 7347570
4428G347570k953162N36610J500584q07386O81247j09665O53133J28449K01495
$$ 7347570 4394408 4931018 6431602 5624216 6305463 6195798 6848931 6977380 7178875
4419G178875n08911r09183J120088j604663o6644J221406p98495Q91884Q68516
$$ 7178875 6669964 5760781 6880869 5276206 5209562 6430968 5632473 6524357 7392873
4410G392873k1630j888439P58425q2741J210495q24416j19350r53001J042122
$$ 7392873 7371243 5482804 6241229 6158488 7368983 6544567 6425217 5472216 6514338
4401F514338n05115l31884j5099K245415j707415J932267j674788K42074p92600
$$ 6514338 6009223 5677339 5662240 7907655 6200240 8132507 6457719 6699793 5907193
4392E907193J381999k39262j580731J117977o00538Q29041K40393r45697k97695
$$ 5907193 7289192 7049930 5469199 6587176 5986638 6815679 7056072 6110375 5812680
4383E812680J507661k902198J525804N42609O15472j810442o96225K142682L62645
$$ 5812680 7320341 4418143 5943947 6486556 7102028 5291586 4595361 6738043 7100688
4374G100688J92631j751488J86698o34814K319440l434499L739228l259000R94962
$$ 7100688 7293319 5541831 5728529 5093715 7413155 3978656 7717884 4458884 5453846
4365E453846K096448p64120j313739l11538J841029O97407j840463n82J82298
$$ 5453846 7550294 6786174 5472435 5160897 7001926 7699333 5858870 5858288 6040586
4356F040586l15777j042297Q73956K282707k203857j13418L40816p78988J835312
$$ 6040586 5724809 4682512 5556468 7839175 5635318 5521900 5862716 5083728 6919040
4347F919040m29648P36732K66017j63965l78180l41134N14270j276983R14408
$$ 6919040 6489392 7226124 7492141 7328176 6949996 6608862 7123132 5846149 6760557
4338F760557J250103j096626Q46964j038198R5196R75636J83767j715054K860666
$$ 6760557 8010660 6914034 7760998 6722800 6817996 7793632 7977399 6262345 9123011
4329I123011k117193Q76488L80155j93288J245826k802045P6803J756322j551740
$$ 9123011 7005818 7882306 8262461 8069173 9314999 6512954 6589757 8346079 6794339
4320F794339J292300J090784k573076K386325l266477M828292M58903k040966
$$ 6794339 8086639 9177423 6604347 8990672 5724195 10552487 11011390 8970424
4312H970424J27566J364298j897165J933252L74556o38830o48284n88252J857913
$$ 8970424 9097990 10462288 8565123 10498375 10872931 10234101 9585817 8997565 10855478
4303A0855478m851087L152455P77420k714418J430240N29206n49727n6541r20040
$$ 10855478 6004391 9156846 9934266 7219848 8650088 9179294 8629567 8573026 7652986
4294G652986L488891j445274n56620J696010P5993k017209l187206K484455J862713
$$ 7652986 11141877 9696603 9139983 10835993 10911986 8894777 5707571 8192026 10054739
4285A0054739J004569l335733L127490n23667k00709N25106p24605l78436O83587
$$ 10054739 11059308 7723575 10851065 10327398 10126689 10651795 9927190 9548754 10232341
4276A0232341j722526J188979l005449J756401J348286j933971k398481K692005
$$ 10232341 8509815 9698794 6693345 8449746 9798032 7864061 5465580 8157585
4268H157585l857548K810437Q39230m03504O59923j686717J276564K726196l287868
$$ 8157585 4300037 7110474 7949704 7546200 8206123 6519406 7795970 10522166 7234298
4259G234298o88479J240655J76127r00751J03047j731987N00862K482955r83074
$$ 7234298 6545819 7786474 7962601 7061850 7164897 5432910 5933772 8416727 7433653
4250G433653r19511K852698k963457J039181J273642k69550r11527J615558o19465
$$ 7433653 6514142 9366840 6403383 7442564 8716206 8446656 7535129 9150687 8531222
4241H531222n90688K73689J124068k374141O18947J095172j279287k160966K862913
$$ 8531222 7940534 8214223 9338291 6964150 7583097 8678269 7398982 5238016 8100929
4232H100929j26383N84874R33026q03651J365591j135031j753331k669032K436723
$$ 8100929 7974546 8559420 9492446 8688795 10054386 8919355 7166024 4496992 6933715
4223F933715Q60385k358440K046892p64173K304338k405628p30266J513137p74064
$$ 6933715 7794100 5435660 7482552 6718379 9022717 6617089 5886823 7399960 6625896
4214F625896J65852O16765j69028L40417J96491j254865J496319n70643o57002
$$ 6625896 6791748 7408513 7239485 7579902 7776393 6521528 8017847 7447204 6790202
4205F790202J994524k111488O53508O30366k298347O02929o27836K980267p23863
$$ 6790202 8784726 6673238 7326746 7957112 5658765 6261694 5633858 8614125 7890262
4196G890262j846597K175538r51377q5158m49652j709192N27090J499076P43736
$$ 7890262 6043665 8219203 7267826 7182668 6733016 5023824 5550914 7049990 7793726
4187G793726N88438p826j825550J565586j323771N16595M45148J19239k667749
$$ 7793726 8382164 8374338 6548788 8114374 6790603 7307198 7752346 7871585 5203836
4178E203836J01615K364392j933148K949724L23230k812391K32435M614399l705257
$$ 5203836 5305451 7669843 5736695 8686419 9009649 6197258 6429693 11044092 7338835
4169G338835n17551K539886k236627L131061j027510L66595j521281K39615k656611
$$ 7338835 6821284 9361170 7124543 10255604 9228094 9594689 8073408 8313023 5656412
4160E656412L454555k124961J437124m50051n89014j040522R17046n53196k45011
$$ 5656412 9110967 6986006 8423130 7973079 7384065 6343543 7260589 6707393 6462382
4151F462382J447876n35149m44013R52065l878191M396957Q36750l097199K803973
$$ 6462382 7910258 7375109 6931096 7883161 4004970 8401927 9238677 6141478 8945451
4142H945451k118186R83316j139797J183821l54005J128809k397212J565291N86058
$$ 8945451 6827265 7810581 6670784 7854605 7500600 8629409 6232197 7797488 8383546
4133H383546j016077j202987J107033l25921J185713j691802K721362r54606m53620
$$ 8383546 7367469 6164482 7271515 6945594 8131307 6439505 9160867 8206261 7752641
4124G752641P8689j478976K388141k388789J791202k131154L299074n68809j644285
$$ 7752641 7831330 6352354 8740495 6351706 8142908 6011754 9310828 8742019 7097734
4115G097734R23496J252886k917580L29777J497156j923525J088009J292741k338512
$$ 7097734 8021230 9274116 6356536 6686313 8183469 6259944 7347953 8640694 6302182
4106F302182K378317J408012k694078J262777j805483K719637m370675K352233
$$ 6302182 8680499 10088511 7394433 8657210 6851727 9571364 5200689 7552922
4098G552922J791977j514641J1135498G115874L167j407209K137816K73000j027366
$$ 7552922 9344899 7830258 18965756 7115874 7119041 5711832 7849648 8122648 7095282
4089G095282o1247K616451r33852J907849k810647q15608J576192m64833k00560
$$ 7095282 7034035 9650486 8716634 10624483 7813836 6998228 8574420 8109587 7909027
4080G909027J015310n21345J028048R86860P33537J627130K06717r07411M672
$$ 7909027 8924337 8402992 9431040 10417900 11151437 12778567 12985284 12077873 12082545
4071A2082545k211889K654627j848496K557121m09208J23175k0223m11798L80674
$$ 12082545 9870656 12525283 10676787 13233908 12824700 12947875 12927652 12515854 12896528
4062A2896528o11611Q95701Q92208m19198J875092j740630L155460r92295N78541
$$ 12896528 12284917 13180618 14072826 13653628 15528720 13788090 16943550 15951255 16529796
4053A6529796o2177j343350K248561p81231J940796j245564J906153K80206J78714
$$ 16529796 16467619 15124269 17372830 16591599 18532395 17286831 19192984 19473190 19651904
4044A9651904N93938n08252J567642L98476K597278j931502L57572J784142O48920
$$ 19651904 20245842 19737590 21305232 21703708 24300986 22369484 22727056 24511198 25160118
4035B5160118J75188L02340J06580K003496m90584O22453L4275K43746K566370
$$ 25160118 25335306 25637646 25744226 27747722 27257138 27879591 27913866 28157612 30723982
4026C0723982o46358P90243L37911Q89380J61752J451955K097517J850815n78067
$$ 30723982 30077624 30867867 31205778 32095158 32256910 33708865 35806382 37657197 37079130
4017C7079130K070563J697648K205816L555492K266099P89777l55429j310879
$$ 37079130 39149693 40847341 43053157 46608649 48874748 49664525 49309096 47998217
4009D7998217k181049l853415o165036l101957l061260o733657l183570j047107
$$ 47998217 45817168 41963753 35798717 32696760 29635500 22901843 19718273 18671166
4001A8671166k041412k033050k339593N91811N56970L66210j147754j106668k437680
$$ 18671166 16629754 14596704 12257111 12848922 13405892 13772102 12624348 11517680 9080000
3992I080000L641033k615564L031570m355308K162871k736555M85485J69819L30991
$$ 9080000 12721033 10105469 13137039 8781731 10944602 8208047 8693532 8863351 9194342
3983I194342J630765j695060l99133J141219L34561l53445q69865o95343J853579
$$ 9194342 10825107 9130047 8730914 9872133 10206694 9853249 8983384 8288041 10141620
3974A0141620j401138P14018J86097M24579k058813J091711k38531O75046r49234
$$ 10141620 8740482 9454500 9640597 10065176 8006363 9098074 8859543 9534589 8585355
3965H585355R10918P28991k464732J150852M42290J5939m6535K74205J89500J17664
$$ 8585355 9496273 10225264 7760532 8911384 9353674 9369613 9323078 9597283 9786783 9904447
3955I904447l794950K956864L43336k032531L749084k728943J654547j813462
$$ 9904447 6109497 9066361 9409697 7377166 11126250 8397307 10051854 8238392
3947H238392q7379L56120N89026J475372k221799M39000M30223J71743o15023
$$ 8238392 8151013 8507133 9096159 10571531 8349732 8788732 9218955 9390698 8775675
3938H775675k466185O190734m101800J325847k073398J592675q24552R86656k99373
$$ 8775675 6309490 12500224 8398424 9724271 7650873 9243548 8418996 9405652 9106279
3929I106279k29464n30924J026878k003336J604629n93211P30088O39976k224002
$$ 9106279 8876815 8345891 9372769 7369433 8974062 8380851 9110939 9750915 7526913
3920G526913K466711j974330J909248j312546J250223J058074k497822O45983
$$ 7526913 9993624 8019294 9928542 8615996 9866219 10924293 8426471 9072454
3912I072454k26201M63283j135412J534879k21801m69600R98973j031710j684319
$$ 9072454 8846253 9309536 8174124 9709003 9487202 9017602 10016575 8984865 7300546
3903G300546J770729q85860Q52966J654357p33451k27267J34997m80712l88423
$$ 7300546 9071275 8185415 9038381 10692738 9959287 9732020 9867017 9386305 8997882
3894H997882j301775K718804r79831P67378j103421J250017o75123L11720l110236
$$ 8997882 7696107 10414911 9435080 10202458 9099037 10349054 9673931 9985651 6875415
3885F875415L864897k178443P61829J11929j50494K126693j788322j38950L99752
$$ 6875415 10740312 8561869 9323698 9435627 9285133 11411826 9623504 9484554 9884306
3876I884306j343197k70582K221767j790698J216042O0407J192479K87972j900810
$$ 9884306 8541109 8270527 10492294 8701596 9917638 9978045 11170524 11458496 9557686
3867I557686O29324R9321l48504J483085j364006J509096k394823L42103o67411
$$ 9557686 10187010 10286331 9937827 11420912 10056906 11566002 9171179 9513282 8845871
3858H845871L179933k026234K48771K99396Q83591j541207l24393j294016L370525
$$ 8845871 12025804 9999570 10248341 10547737 11431328 9890121 9565728 8271712 11642237
3849A1642237k697724L15010K259179m308362K916929j065195P20864L149127
$$ 11642237 8944513 9259523 11518702 7210340 10127269 9062074 9782938 12932065
3841A2932065j010597j501698J671497r65342k319558K388623p48457P86479k455209
$$ 12932065 11921468 10419770 12091267 11125925 8806367 11194990 10446533 11233012 8777803
3832H777803K282085Q66244q78780M40794J702482j559805K67041l27333L51360
$$ 8777803 11059888 11926132 11047352 11488146 13190628 11630823 11897864 11570531 11921891
3823A1921891L21985j826890R62422J002554L44574j137924J033q5721N69797
$$ 11921891 12243876 10416986 11379408 12381962 12726536 11588612 11589645 11503924 12073721
3814A2073721N63165J92221K138393j188184n73814o48857J647923j570483R14498
$$ 12073721 12636886 12829107 14967500 13779316 13205502 12556645 14204568 12634085 13548583
3805A3548583k312279l73560J742390N01311n29483k861846K255763Q32626N02102
$$ 13548583 11236304 10862744 12605134 13106445 12576962 9715116 11970879 12803505 13305607
3796A3305607P2800M023538j780561P66132J803518k465308J646802o20544M38929
$$ 13305607 13378407 17401945 15621384 16387516 18191034 15725726 17372528 16751984 17190913
3787A7190913j0677N0000p52088J863082J147754j064096K419506k546054K513474
$$ 17190913 17180236 17230236 16478148 18341230 19488984 18424888 20844394 18298340 20811814
3778B0811814Q89834J149454N37034l84959L421803K881622K1834K156922L116195
$$ 20811814 21701648 22851102 23388136 23003177 26424980 29306602 29328436 31485358 34601553
3769C4601553k84816L433036K528201J904159L03960J043247P29629N788264m721300
$$ 34601553 34316737 37749773 40277974 42182133 42486093 43529340 44258969 50047233 45325933
3760D5325933N145947Q11100J787680o69092N899716q94091M580951N7100J986160
$$ 45325933 50471880 51282980 53070660 52401568 58301284 57407193 61988144 62045244 64031404
3751F4031404K433116L172203J946809L260848J849407O976888N54944J872784
$$ 64031404 66464520 69636723 71583532 74844380 76693787 83670675 84225619 86098403
3743H6098403Q39616k082496k908456o938895p856656n844220n806852n742139
$$ 86098403 86938019 84855523 81947067 75008172 67151516 61307296 55500444 49758305
3735D9758305l211665n692527j444844k540120k324335m156521m325913l156646
$$ 49758305 46546640 40854113 39409269 36869149 34544814 30388293 26062380 22905734
3727B2905734K54920j339334K16414j149022r93602Q62444J937916m725190J699442
$$ 22905734 23160654 21821320 22037734 20888712 19895110 20757554 22695470 17970280 19669722
3718A9669722K616264l900012J639834J94976K24108l09424p41190k114202J893534
$$ 19669722 22285986 18385974 20025808 20220784 20444892 20135468 19394278 17280076 19173610
3709A9173610j310558j606270J238238Q84606J055641L12449J389540p12468q98994
$$ 19173610 17863052 16256782 17495020 18379626 19435267 19747716 21137256 20424788 19525794
3700A9525794J69230l164612K509850l227982K263797p12399p08729n54448P03510
$$ 19525794 19695024 16530412 19040262 15812280 18076077 17363678 16654949 16100501 16804011
3691A6804011j867976J406121l088535K508195p6240j30060p10050Q51475R47590
$$ 16804011 14936035 16342156 13253621 15761816 15685576 15555516 14845466 15696941 16644531
3682A6644531J23443m16327j509040R23228P05413j103667R80494m39415l77053
$$ 16644531 16767974 16351647 14842607 15765835 16471248 15367581 16348075 15908660 15531607
3673A5531607o06341K53890P79743j076657Q3800K88413k082383K694483k023540
$$ 15531607 14925266 15179156 15958899 14882242 14966042 15254455 13172072 15866555 13843015
3664A3843015L34111M053856k696126j166253J88271K138455P3277J411409j252045
$$ 13843015 14177126 18230982 15534856 14368603 14556874 16695329 16768606 18180015 16927970
3655A6927970j236894O73500M61778j19604o13171Q2211m70149R31326J457605
$$ 16927970 15691076 16364576 16826354 16706750 16093579 16175790 15705641 16636967 18094572
3646A8094572q49352K51831m24779l888963L962512N9793o82781j68514J749863
$$ 18094572 17245220 17497051 17072272 13183309 17145821 17205614 16522833 16354319 18104182
3637A8104182o69318q01664J619903j072126j127294K833417j307770j855902
$$ 18104182 17434864 16633200 18253103 17180977 16053683 18887100 17579330 15723428
3629A5723428N71254J666321J12239J370622l097013K252555j817021J767297
$$ 15723428 16294682 17961003 18073242 19443864 16346851 18599406 16782385 18549682
3621A8549682J07606j89610j196419K86023N69242K200184J071778o02452j132416
$$ 18549682 18657288 18467678 17271259 17557282 18126524 20326708 21398486 20796034 19663618
3612A9663618L0536P61015J29489n81054l99024k33012J97994K07364k43J073619
$$ 19663618 19694154 20455169 20584658 20003604 19604580 19371568 19569562 19776926 19776683 20850302
3602B0850302m30652O18650k055680L347594n23716j502600Q72794P61356j46708
$$ 20850302 20419650 21038300 18982620 22330214 21806498 20303898 21176692 21938048 21791340
3593B1791340N29200n07626k362534L719400N75362p3398J419354J125864j336762
$$ 21791340 22320540 21812914 19450380 23169780 23745142 23671744 25091098 26216962 24880200
3584B4880200J11751l47867O24288j089284j230706J629626Q29000k290341J822972
$$ 24880200 24991951 24644084 25268372 24179088 22948382 24578008 25407008 23116667 24939639
3575B4939639p00011O58694j56865o05767J262812j986266K455902k012290O34202
$$ 24939639 24239628 24898322 24741457 24135690 25398502 23412236 25868138 23855848 24490050
3566B4490050J122470k072180K974060K10262j992610J943988K42913L51115J398194
$$ 24490050 25612520 23540340 26514400 26724662 24732052 26676040 26918953 27270068 28668262
3557B8668262j573426K228538J130413o52242n65080K115955J388729L5804r18635
$$ 28668262 27094836 29323374 30453787 29801545 29236465 31352420 32741149 32776953 31858318
3548C1858318K650731J339105K16979M66932k717552K859180j810627q91260J095231
$$ 31858318 34509049 35848154 36065133 36532065 33814513 36673693 34863066 33971806 35067037
3539C5067037l627925L713870K864567K022089J966343j305920J243488j220908
$$ 35067037 31439112 35152982 38017549 40039638 42005981 40700061 41943549 40722641
3531D0722641K951464q848P86608K839844O20735J791633J100743K19929K342508
$$ 40722641 43674105 43665257 44451865 47291709 47912444 49704077 50804820 51024749 53367257
3522E3367257R15607J113405J512715J732696M54284J939948K681192J350268
$$ 53367257 54282864 55396269 56908984 58641680 59095964 61035912 63717104 65067372
3514F5067372L126864L728663J60040L403976O913608K158744O853960L709327
$$ 65067372 68194236 71922899 72082939 75486915 82400523 84559267 91413227 95122554
3506I5122554J0066456P258431R103136O735960J4141935Q115280J2310703J0838112
$$ 95122554 105189010 112447441 121550577 128286537 142428472 150543752 162854455 173692567
3498A73692567J1907087J0069568J3218831J2134256J0777903J5463727J7137216
$$ 173692567 185599654 195669222 208888053 221022309 231800212 247263939 264401155
3491B64401155J8549007J9023198K0563744K8307871K6353118L4483711M1505150
$$ 264401155 282950162 301973360 322537104 350844975 377198093 411681804 453186954
3484D53186954M7788158O2822492P5488828R3852988J14011963J53727737J92889782
$$ 453186954 500975112 563797604 639286432 733139420 847151383 1000879120 1193768902
3477A193768902K39452533K60795636K25208052J38399226J9822207j07501691
$$ 1193768902 1433221435 1694017071 1919225123 2057624349 2077446556 1969944865
3471A969944865k13657461k65330420k87063154k62419316k20394293j68231033
$$ 1969944865 1756287404 1490956984 1203893830 941474514 721080221 552849188
3465E52849188j22884857r0000956o0101949m5962686l8238878k6335791j8721679
$$ 552849188 429964331 339963375 279861426 233898740 195659862 169324071 150602392
3458A50602392j8714447j2054456r578447r368824l484735n920392o320049n414455
$$ 150602392 131887945 119833489 110255042 100886218 97401483 91481091 85161042 79746587
3450G9746587o597231m017593l318611m780336k039208m656908q16383j328680
$$ 79746587 73149356 69131763 65813152 61032816 58993608 54336700 53520317 52191637
3442E2191637l580284k251784m484132n58356j595360l490092O27484k163343
$$ 52191637 48611353 46359569 41875437 41317081 39721721 36231629 36859113 34695770
3434C4695770P56167k270082J734770j31112o14172Q2548l446180n78224L76015
$$ 34695770 35451937 33181855 34916625 34785513 34171341 34253889 30807709 30229485 30605500
3425C0605500m284892N8775M67023k244478R81748J298898m592187R74733m11705
$$ 30605500 26320608 26379383 26846406 24601928 25583676 26882574 22290387 23265120 22853415
3416B2853415J992221l812978k78695n68311K60636J781494j994430q61829J351929
$$ 22853415 24845636 21032658 20753963 20185652 20446288 22227782 20233352 19371523 20723452
3407B0723452j990691K088679k195194q33114J585616j961562L649924j604484
$$ 20723452 18732761 20821440 18626246 17793132 19378748 17417186 21067110 19462626
3399A9462626j253622J994566j415198j08698k97904r48774j557144p97553k802346
$$ 19462626 18209004 20203570 18788372 18679674 18381770 17432996 15875852 15078299 12275953
3390A2275953K510792Q74122Q92287q09856l77502o42058k562947J145070j161953
$$ 12275953 14786745 15660867 16553154 15743298 15365796 14723738 12160791 13305861 12143908
3381A2143908K091567O05805k266691K145751k251017L2104p13747k386499l6132
$$ 12143908 14235475 14841280 12574589 14720340 12469323 12501427 11787680 9401181 9365049
3372I365049J372180L57437q54462n79084O45290j321561j087837m02682K588299
$$ 9365049 10737229 11094666 10240204 9661120 10306410 8984849 7897012 7494330 10082629
3363A0082629k632290Q99141K81850J383784j145876k92494J789721l549078J472084
$$ 10082629 7450339 8349480 8631330 10015114 8869238 8576744 10366465 6817387 8289471
3354H289471O62484K304018k110905j330438L26018j541010L80016J328835R38248
$$ 8289471 8951955 11255973 9145068 7814630 8140648 6599638 6979654 8308489 9246737
3345I246737m04857r73788l51491r61493J755314J190452l653229L922055l031636
$$ 9246737 8841880 7868092 7516601 6555108 8310422 9500874 5847645 9769700 6738064
3336F738064J843720P15332J549857o24958j369599R03538k529575J646266j299509
$$ 6738064 8581784 9297116 10846973 10222015 8852416 9755954 7226379 8872645 7573136
3327G573136N20083L495725n061406J994941R88939j108269N94815L21338J497767
$$ 7573136 8093219 11588944 6527538 8522479 9511418 8403149 8997964 9319302 10817069
3318A0817069j623688J089087J25316p60445q6374o7959m47991l8542p90981L24128
$$ 10817069 9193381 10282468 10407784 9647339 9560965 9493006 9045015 9006473 8215492 8539620
3308H539620M14192n43904l31674j800264M167490k339052Q04541Q32432J191632
$$ 8539620 8953812 8409908 8078234 6277970 10445460 8106408 8910949 9743381 10935013
3299A0935013k306966J443994j707295K875652q51558k56459J6117L7294Q10831
$$ 10935013 8628047 10072041 8364746 11240398 10388840 10132381 10148498 10185792 10996623
3290A0996623J341931j102968K392606K318514k582350L144351J80451L30670
$$ 10996623 12338554 11235586 13628192 15946706 13364356 16508707 16689158 17019828
3282A7019828j048087K942613l336681J540794q39230j036929j665548K201867
$$ 17019828 15971741 18914354 15577673 17118467 16279237 15242308 13576760 15778627
3274A5778627l44216R92325k544178L727874r32841O03734O9729R70096j151834
$$ 15778627 15434411 16426736 13882558 17610432 16677591 17281325 17351054 18321150 17169316
3265A7169316L598146k524976K295558L18822Q3750k48584K794062k24500l24668
$$ 17169316 20767462 18242486 20538044 20856866 20940616 20692032 23486094 23261594 22936926
3256B2936926Q56284M00478j241501N58804L939609j383204P36731l27771L446566
$$ 22936926 23793210 24193688 22952187 23510991 27450600 26067396 26804127 26476356 29922922
3247B9922922l64273J528104J235995J445106j046566p77743L393456K112160
$$ 29922922 29558649 31086753 32322748 33767854 32721288 31943545 35337001 37449161
3239C7449161K405668k33780J172648K117316J758176L527835Q03500P21057J578335
$$ 37449161 39854829 39621049 40793697 42911013 44669189 48197024 49000524 49721581 51299916
3230E1299916J911720L063141L88656L732139J887232J288672K406200j033276
$$ 51299916 53211636 56274777 56663433 60395572 62282804 63571476 65977676 64944400
3222F4944400L152804L120720L108815K138136K599776L526032R05224K235200
$$ 64944400 68097204 71217924 74326739 76464875 79064651 82590683 83495907 85731107
3214H5731107M457328L092407L948601K372599M909920N727567K691697L603727
$$ 85731107 90188435 93280842 97229443 99602042 104511962 110239529 112931226 116534953
3206A16534953L225536M474328l803248j0445503j0121304j5524287q188615j5957920
$$ 116534953 119760489 124234817 120431569 109986066 99864762 84340475 76151860 60193940
3198F0193940q285564q809279n869768k992292m811835j505759j914463j54189
$$ 60193940 51908376 43099097 37229329 34237037 29425202 27919443 26004980 25850791
3190B5850791j064881m413338o80034O00714q59590j844210m86343k645712L84887
$$ 25850791 24785910 20372572 19692538 20293252 19433662 17589452 17103109 14457397 14842284
3181A4842284j548048J962047k603078p48973Q9862j798622l5525J604798j077572
$$ 14842284 13294236 15256283 12653205 11904232 11994094 10195472 10159947 11764745 10687173
3172A0687173J782147r69405M74644j830651j101183J913191k521827L359561
$$ 10687173 12469320 11499915 11974559 10143908 9042725 10955916 8434089 11793650
3164A1793650j936066m34455P41694j331092P08817K262023n67670M43349k668385
$$ 11793650 9857584 9423129 10164823 8833731 9542548 11804571 11236901 11680250 9011865
3155I011865K109819j386151j92284N91729o12209J168746N85307j150965Q87667
$$ 9011865 11121684 9735533 9543249 10134978 9522769 10691515 11276822 10125857 11013524
3146A1013524l60928K07953j138862J955023j98522j207344K909005j654788j172672
$$ 11013524 10652596 10860549 9721687 11676710 11478188 10270844 13179849 11525061 10352389
3137A0352389R9705M97439j070086J561728j185925J635770k866457K376518r91953
$$ 10352389 10452094 10949533 9879447 11441175 10255250 11891020 9024563 11401081 10409128
3128A0409128J64424k005060K056384j881378l49838K816302O87267j576624N04002
$$ 10409128 10573552 8568492 10624876 8743498 8393660 11209962 11897229 10320605 10824607
3119A0824607J017700j462184J911970k33897K594019k516959j530036J871502
$$ 10824607 11842307 10380123 12292093 12058196 14652215 12135256 10605220 12476722
3111A2476722m061273J963834j094890J296209j724886K718656n34634j096330
$$ 12476722 8415449 10379283 9284393 10580602 8855716 11574372 11039738 9943408
3103I943408J184211l545569J730370j174463j133036l47189J509548J201791
$$ 9943408 11127619 7582050 9312420 8137957 7004921 6657732 8167280 9369071
3095I369071k370437K718217m206279K740090l86365j876749K856273l44062J002280
$$ 9369071 6998634 9716851 5510572 8250662 7864297 5987548 8843821 8499759 9502039
3086I502039j985138J236973K32588k120412o44313N87634K182501l94685j108484
$$ 9502039 7516901 8753874 8986462 6866050 6221737 6809371 8991872 8597187 7488703
3077G488703j102437L51250K959658P89612m34969j847248K108887M1622k67159
$$ 7488703 6386266 6737516 9697174 10486786 10051817 8204569 10313456 10355078 10087919
3068A0087919q05419K52880J263010R41610L32636J189000J184494K101167L530021
$$ 10087919 9282500 9535380 10798390 11740000 12072636 13261636 14446130 16547297 20077318
3059B0077318j206078N592816L124482J36576j690150O03831k949119m187924
$$ 20077318 18871240 24464056 27588538 27725114 26034964 26638795 23689676 19501752
3051A9501752j992912k118786m182459m3029J125477j745129L78497m41930j110835
$$ 19501752 17508840 15390054 11207595 11164566 12290043 10544914 10923411 10481481 9370646
3042I370646j449993N13015K073247m770080K875853M3735J665869r73235k9301
$$ 9370646 7920653 8433668 10506915 5736835 8612688 8656423 10322292 9349057 9319756
3033I319756k001734Q39077j675029J805507O44562j8563P58661r36250J33002
$$ 9319756 7318022 8157099 6482070 8287577 8932139 8913576 9672237 8735987 8868989
3024H868989k096535J478088q75479M27933K572969p06635p42515K169017j397808
$$ 8868989 6772454 8250542 7375063 7802996 10375965 9669330 8926815 11095832 9698024
3015I698024L94078Q47964j327647p16620J155659J644742k307295J379643l06874
$$ 9698024 10092102 10940066 9612419 8895799 10051458 11696200 9388905 10768548 10461674
3006A0461674K080613l766941J921906j209048p84644J453785J474768j110095
$$ 10461674 12542287 8775346 10697252 9488204 8703560 10157345 11632113 10522018
2998A0522018K430767M18607m80954k139369o09666K450080k905736p10020K551212
$$ 10522018 12952785 13371392 12890438 10751069 10141403 12591483 9685747 8975727 11526939
2989A1526939n93726l04759K173472k935799J325198J63596j472275K326078Q05788
$$ 11526939 10933213 10628454 12801926 9866127 11191325 11354921 9882646 12208724 13014512
2980A3014512l48119k377609J980251k761503K433395j382007J435513j791219
$$ 13014512 12666393 10288784 12269035 9507532 11940927 10558920 11994433 10203214
2972A0203214K19749J89323O39430j722106R87095J493552L86644P96259Q09283
$$ 10203214 10422963 10612286 11251716 9529610 10516705 12010257 12396901 13193160 14002443
2963A4002443j701365M158437k160529J700210q91320k573980M332816m99095
$$ 14002443 12301078 16459515 14298986 15999196 15107876 12533896 16866712 16367617
2955A6367617j617472J042377N42289j075546M76851R34084K75039J052157j051089
$$ 16367617 14750145 15792522 16334811 15259265 15736116 16670200 16945239 17997396 16946307
2946A6946307O26644q30231j4916M198818j844110K797562K851712j26236N21566
$$ 16946307 17572951 16742720 16727804 20926622 19082512 21880074 24731786 24605550 25127116
2937B5127116K104460J198206j527011J652135k390022m921579j297659l036140
$$ 25127116 27231576 28429782 26902771 28554906 26164884 21243305 19945646 16909506
2929A6909506k761067J130139k356896l93511J30785O39749n80565j329338J419681
$$ 16909506 14148439 15278578 12921682 12528171 12658956 13298705 12718140 11388802 12808483
2920A2808483j455959j196958P96693m34437j304247K791831k828878K55637J626270
$$ 12808483 11352524 10155566 10952259 10517822 9213575 12005406 9176528 9432165 11058435
2911A1058435k457922k26818K825394J555082o032477K021498K77277J08118M87819
$$ 11058435 8600513 8373695 11199089 12754171 6721694 8743192 9020469 9128587 9616406
2902I616406l658474L004747p85897n91589J258626J409025R67538j567106M88098
$$ 9616406 5957932 8962679 8176782 7585193 8843819 10252844 11220382 9653276 10141374
2893A0141374j749862L334422l298618L595188k124404J380978l08610j412589
$$ 10141374 8391512 11725934 8427316 12022504 9898100 11279078 10970468 9557879
2885I557879M54765K1363J96214n17462l381850J010032J105701O25677j27006
$$ 9557879 10012644 10034007 10230221 9712759 6330909 7340941 8446642 9072319 8945313
2876H945313J865299j678451N43849Q30267M38322r77926m71873J175861l058142
$$ 8945313 10810612 9132161 9676010 10506277 10944599 9966673 9494800 10670661 7612519
2867G612519J346098J665668K393027k976883O88436P88502m472266K183993J873645
$$ 7612519 8958617 10624285 13017312 10040429 10728865 11517367 7045101 9229094 11102739
2858A1102739r89602j897359K159600Q45544j825819K37747J441947j760539j640172
$$ 11102739 10113137 8215778 10375378 11220922 9395103 9632850 11074797 9314258 7674086
2849G674086K129486L24432J144092j70379r300L106205K83587K917425P004866
$$ 7674086 9803572 10128004 11272096 11101717 11092417 14198622 14482209 17399634 24404500
2840B4404500K131550K209062J552525j351109k682646k551534o213994m360404
$$ 24404500 26536050 28745112 30297637 28946528 26263882 23712348 17498354 13137950
2832A3137950j095626k921202m3065q77545J158742k867250J27694Q76875P16892
$$ 13137950 12042324 9121122 9078057 8200512 9359254 6492004 6619698 7496573 8213465
2823H213465K779605l677872o56111j934441Q77080M41130R86473k22585j61173
$$ 8213465 10993070 7315198 6659087 4724646 5601726 6042856 7029329 6806744 6645571
2814F645571K486329j480290j285203J755627J550984k416186j178037N88667
$$ 6645571 9131900 7651610 6366407 8122034 9673018 7256832 6078795 6667462
2806F667462k404342J940413J283496N36916j020163O7827K481481j61345J928722
$$ 6667462 4263120 6203533 7487029 8023945 7003782 7071609 9553090 9391745 11320467
2797A1320467m144571K91067r41531K437084j607924J669534p27981j479170M4269
$$ 11320467 7175896 7466963 6525432 8962516 7354592 9024126 8296145 6816975 6861244
2788F861244M17505J005637j204521p72122J973965k073218J656224R09150j061711
$$ 6861244 7278749 8284386 7079865 6307743 8281708 6208490 7864714 8773864 7712153
2779G712153q81463j218890J882060P42399j348496L573287j567199J513922j494025
$$ 7712153 6830690 5611800 7493860 8236259 6887763 10461050 8893851 10407773 8913748
2770H913748p49315J632110j246373J842547k982969L753681j822349R60185m17301
$$ 8913748 8164433 9796543 8550170 10392717 7409748 11163429 9341080 10301265 9883964
2761I883964K640643j907633k66105J657332N68816K059295K812248j168357K958043
$$ 9883964 12524607 10616974 10350869 12008201 12577017 14636312 17448560 16280203 19238246
2752A9238246N444106O880784Q206217L821880N812940L88839l728339m120916
$$ 19238246 24682352 31563136 39769353 43591233 49404173 49793012 46064673 41943757
2744D1943757p747896k828767k751526j041506J0814187L968896K989960R98796
$$ 41943757 34195861 31367094 28615568 27574062 38388249 42357145 45347105 46345901
2736D6345901j389716o670688K04680m105659L822892R921843O562951K149540
$$ 46345901 44956185 38285497 38490177 34384518 38207410 48129253 54692204 56841744
2728E6841744M055060o539039p877908p213079m726060k822778O304913L08324
$$ 56841744 60896804 54357765 46479857 39266778 34540718 31717940 38022853 38331177
2720C8331177L193832K306316o219364n734936m055510m483141j129768R66288
$$ 38331177 41525009 43831325 37611961 31877025 27821515 23338374 22208606 23174894
2712B3174894r38856Q64010R19260l330278l96350k153243m634950k463005K0639
$$ 23174894 22236038 23100048 24019308 20689030 20292680 18139437 13504487 11041482 11062121
2703A1062121j052477l73089k318577K332517r6077n47405j074671J817559K140010
$$ 11062121 10009644 9636555 7317978 9650495 9554418 9007013 7932342 9749901 11889911
2694A1889911j629526N92693q60501K49121J377070K635132o36157j19212p83234
$$ 11889911 10260385 10853078 9992577 10241698 11618768 14253900 13617743 13498531 12715297
2685A2715297j636902J813043M55963K07017r61631j475110J984215o3768j024882
$$ 12715297 11078395 12891438 13347401 13554418 12592787 11117677 13101892 13038124 12013242
2676A2013242J837836m472201K110128p90566J012384k261218M10307J752127
$$ 12013242 13851078 9378877 11489005 10698439 11710823 9449605 9859912 11612039
2668A1612039K052142j456772k989562K311959O16300j028317q05925k952269
$$ 11612039 13664181 12207409 9217847 11529806 12146106 11117789 10311864 7359595
2660G359595j669622O70414j420844R05412k36308j136849K194660m98159k009497
$$ 7359595 5689973 6360387 4939543 5844955 5608647 4471798 6666458 6168299 4158802
2651D158802K796656j269758k89190j98295J572375k402557J382771k360324P36127
$$ 4158802 6955458 5685700 5396510 5198215 6770590 4368033 5750804 3390480 4126607
2642D126607K258083j486484O4068K97894J22173j041511J8157K36335J824954
$$ 4126607 6384690 4898206 4962274 5260168 5382341 4340830 4358987 4595322 6420276
2633F420276j702005L72523k17928k69292J98060l21049J59136k00507L66606
$$ 6420276 4718271 5090794 4872866 4603574 4801634 4480585 4639721 4439214 4805820
2624D805820P87119Q5820k1527J475613n56845k694051N7030J969461n1591j475585
$$ 4805820 5592939 5678759 5657232 7132845 6576000 3881949 3938979 5908440 5856849 4381264
2614D381264k37912L98549J893056K63734k098701J397207j622435K446278k632056
$$ 4381264 4143352 4541901 6434957 6698691 4599990 5997197 4374762 6821040 4188984
2605D188984K688929p62421k930113J594743J896500k228906J09964M98665j376237
$$ 4188984 6877913 6115492 3185379 4780122 6676622 4447716 4557680 5056345 3680108
2596C680108R84040q03808J384165J732697k136136K217651B535152K261715j058282
$$ 3680108 4664148 3860340 5244505 6977202 4841066 7058717 2535152 4796867 3738585
2587C738585K144565L8830q30074K760163l023631J542089j770773R26266r5713
$$ 3738585 5883150 5921980 5091906 7852069 4828438 6370527 4599754 5526020 5430307
2578E430307J288983k396541J548871J158463j12697j830226K637233j107711
$$ 5430307 6719290 4322749 5871620 7030083 6917386 5087160 7724393 6616682
2570F616682J80840K228805l342354N72191j71179o48363K74037K984330D021026
$$ 6616682 6797522 9026327 5683973 6256164 6084985 5436622 5710659 8694989 4021026
2560E486859Q18925p26105J416272k241130K76611J981672l273659L211605k885345
$$ 5486859 6305784 5579679 6995951 4754821 5031432 7013104 3739445 6951050 4065705
2551D065705L059159l57065r10808N23710p29524K43185J448197J61278k393754
$$ 4065705 7124864 6767799 5856991 6380701 5651177 5894362 7342559 7503837 5110083
2542E110083J233338J042157o69634K52268R276p0260j294120J007607j910923
$$ 5110083 6343421 7385578 6715944 6968212 6977488 6907228 5613108 6620715 4709792
2533D709792P67256O56039K86339L75494p38522o34641K200915j675348K043562
$$ 4709792 5477048 6133087 6419426 6794920 6056398 5421757 7622672 5947324 7990886
2524G990886k910414K187635o36901m31090J644931j343465K68675r7719J204660
$$ 7990886 5080472 7268107 6631206 6200116 7845047 6501582 6770257 6672538 7877198
2515G877198k68224j662072J147710j018025P37940J709386j535508K531416l556206
$$ 7877198 7608974 5946902 7094612 6076587 6814527 8523913 6988405 9519821 5963615
2506E963615M60368J240595K13009m96888J320457J241418m27505k62998m41425
$$ 5963615 6423983 7664578 7877587 7380699 8701156 9942574 9515069 9252071 8810646
2497H810646J937476k482973J392021M47962j86091o09918R43467j431800K11064
$$ 8810646 10748122 8265149 9657170 10105132 9919041 9309123 10252590 8820790 9031854
2488I031854O95739o14671j587816K053259J802756k064834R95662j033559J504788
$$ 9031854 9727593 9112922 7525106 9578365 11381121 9316287 10311949 9278390 10783178
2479A0783178K359885J061899j903755r85187J123840K29013Q70542M46134j068647
$$ 10783178 13143063 14204962 12301207 11316020 12439860 12668873 13539415 13985549 12916902
2470A2916902j621696J156318P08379L10635q95079M42740q20445K207251l21069
$$ 12916902 11295206 12451524 13159903 13470538 12575459 13018199 12197754 14405005 14083936
2461A4083936k415427Q37744j362113K595856j809547j89786l305815Q38008N02486
$$ 14083936 11668509 12506253 11144140 13739996 11930449 11740663 8434848 9272856 9775342
2452I775342K57486O49056o71197p12330O71347J34278n29597J013193j336681
$$ 9775342 10032828 10681884 10010687 9298357 9969704 10103982 9574385 10587578 9250897
2443I250897n40564l80854J252692Q14364j621053Q65269J14765Q8381m98918
$$ 9250897 8710333 8329479 9582171 10396535 8775482 9640751 9755516 9843897 9344979
2434I344979r75800M13817j031292k91699R15895j96677j301089r9565K50968
$$ 9344979 8369179 8782996 7751704 7460005 8375900 8179223 6878134 6778569 7029537
2425G029537L543J236901K92140k233595M39822J538099J151289o39361o23658
$$ 7029537 7033080 8269981 8562121 6328526 6768348 8306447 9457736 8818375 8194717
2416H194717J225210k061754J82898K29158j98095J514047J38726k311077M22636
$$ 8194717 9419927 7358173 7541071 7770229 7572134 9086181 9224907 6913830 7336466
2407G336466k77324J837713j178365p41605Q68777k67403l22736K44731M73354
$$ 7336466 7059142 8896855 7718490 6976885 7845662 7578259 7255523 7500254 7973608
2398G973608j396929r31920J643271k797742J990042O35516Q12905j542906L124244
$$ 7973608 6576679 5644759 7288030 4490288 6480330 7115846 7928751 6385845 9510089
2389I510089j813147J47472J221005j829816N02667n64007j194249J011229N23601
$$ 9510089 7696942 7844414 9065419 7235603 7738270 7174263 5980014 6991243 7514844
2380G514844j104136K877220l397050R52151n44829J601013o97191P78376j063079
$$ 7514844 6410708 9287928 5890878 6843029 6298200 7899213 7202022 7980398 6917319
2371F917319r07267K234338J229536j812333Q5225J714334r32076j829976N39550
$$ 6917319 6010052 8244390 9473926 7661593 7746818 9461152 8529076 6699100 7238650
2362G238650L16102N99033o04329n14447J948353R6324j137187M9451L866250
$$ 7238650 7554752 8153785 7549456 7035009 8983362 9079686 7942499 7991950 11858200
2353A1858200l247887J162319l8307l96410L39803N66033j280320k442683K500230
$$ 11858200 8610313 9772632 9734325 9337915 9677718 10243751 8963431 6520748 9020978
2344I020978k95574Q06298J20877J164967k727308J652242j25456j535192p46928
$$ 9020978 8725404 9531702 9652579 10817546 8090238 9742480 9617024 8081832 7334904
2335G334904K125968K9627k260788m29581L21038J496256j84446O26971r63997
$$ 7334904 9460872 9490499 7229711 6800130 7121168 8617424 8432978 9059949 8095952
2326H095952K785713k972569J143806j25689N59418l53122L49140r64383K314811
$$ 8095952 10881665 7909096 9052902 8927213 9486631 9133509 9482649 8518266 10833077
2317A0833077r77069j844376J879975k77353j32549J410124J829462k556662J776535
$$ 10833077 9856008 8011632 9891607 9614254 9481705 10891829 12721291 10164629 11941164
2308A1941164r23417M073643m131288J434012j996222O22505l17645R1023J916300
$$ 11941164 11017747 15091390 10960102 12394114 10397892 11020397 10702752 10793775 12710075
2299A2710075j69524j9091L71662L2682n14092J795533J183204j018770K27984
$$ 12710075 12540551 12521460 12893122 12925804 12411712 14207245 15390449 14371679 14599663
2290A4599663P38018j998207P07210J91266k5926J400977P32630q23857O64321
$$ 14599663 15337681 13339474 14046684 14237950 14212024 15613001 16345631 15521774 16186095
2281A6186095k54113j56847j09914K314169j338616j759796Q54971K231299L84669
$$ 16186095 15931982 15775135 15665221 17979390 16640774 14880978 15735949 17967248 18351917
2272A8351917j122984J442773j095020N94925L67971j01556k614421L447539j916820
$$ 18351917 17228933 18671706 17576686 18171611 18539582 18438026 15823605 19271144 17354324
2263A7354324J879520k108633k70903k891425K385893J117104j561428N45299
$$ 17354324 19233844 17125211 16854308 13962883 16348776 17465880 15904452 16449751
2255A6449751o15756J626045j759416N17863N81157k584614J064975k78001J069826
$$ 16449751 15833995 17460040 15700624 16218487 16799644 14215030 15280005 15002004 16071830
2246A6071830n87581l63789J215442j582769j292815J556445r96118L05735o30678
$$ 16071830 15484249 15120460 16335902 14753133 13460318 15016763 14020645 14326380 13695702
2237A3695702k306233K471306j628052J789645j057111M68204J611776R70687
$$ 13695702 11389469 13860775 12232723 14022368 12965257 13433461 15045237 16015924
2229A6015924r06720j322790k82119l71881M97212r17622J113004k2803P60069
$$ 16015924 15109204 13786414 13504295 13132414 13629626 12712004 13825008 13802205 14562274
2220A4562274M35717m98473M20174K42022M48q09813J057815j34825l19728l1677
$$ 14562274 14997991 14499518 14919692 15161714 15162162 14352349 15410164 15275339 14955611 14923934
2210A4923934m13730j123172p98844L489107j892252Q23339j707660k288368J121923
$$ 14923934 14510204 13387032 12588188 16077295 14185043 15008382 13300722 11012354 12134277
2201A2134277J797161j956195M11560J333719j292637k30730j121436K904901
$$ 12134277 13931438 11975243 12386803 13720522 12427885 12197155 11075719 13980620
2193A3980620J159k977642R05891J00398M84865k897280K341496K58549R93115
$$ 13980620 13981779 11004137 11910028 12010426 12495291 9598011 11939507 12198056 13191171
2184A3191171n5037j089111j027030K941415m5875j405455o5534J500641m18463
$$ 13191171 13136134 12047023 11019993 13961408 13915533 12510078 12444544 13945185 13526722
2175A3526722P5716j40504M98918j202770M20742J376400k252226J392477l72130
$$ 13526722 13602438 13461934 13960852 12758082 13178824 14555224 12302998 13695475 13323345
2166A3323345O85921J65213q19272J354240j487882J575381k57910j27025o75028
$$ 13323345 14009266 14174479 13355207 14709447 13221565 14796946 14539036 14412011 13736983
2157A3736983j134344J227463p28629J340589p8129m70898Q38018O66164q64225
$$ 13736983 12602639 13830102 13101473 14442062 14363933 13893035 14731053 15397217 14532992
2148A4532992J429197O96953n86483m08991J00804M42559O02108Q98761o10758
$$ 14532992 15962189 16659142 16072659 15663668 15764472 16207031 16809139 17707900 17097142
2139A7097142k033229K701317r39402j652935M472733l582233J913845j912152
$$ 17097142 15063913 17765230 16825828 15172893 19645626 16063393 17977238 16065086
2131A6065086L690760j588810L039364l121896L25374k74034J114638m127646
$$ 16065086 19755846 18167036 21206400 18084504 18409878 18135844 19250482 15122836
2123A5122836N119784k038296J74034k33822J190291K62917k98799K02543n14024
$$ 15122836 20242620 18204324 18378358 18144536 19334827 19597744 19298945 19501488 18987464
2114A8987464J965060l376894j070647K061723N40334q10075p17895J338108m29367
$$ 18987464 20952524 17575630 16504983 18566706 19107040 18296965 17579070 18917178 18487811
2105A8487811O10021m89533J02721m61218Q58598J258494j228858J091892j212404
$$ 18487811 19097832 18608299 18711020 18249802 19108400 20366894 19138036 20229928 19017524
2096A9017524K15754k043158K677348p07275o45875J25508K359618k667218R07876
$$ 19017524 19233278 17190120 19867468 19160193 18514318 18639826 20999444 18332226 19240102
2087A9240102J836856k835503J444562l6051K042698j493132m27040p15910K447980
$$ 19240102 21076958 18241455 19686017 19649966 21692664 20199532 19772492 19056582 21504562
2078B1504562m46772K494505k74651N411241R438624K260764J938492J776708
$$ 21504562 21057790 23552295 23277644 28688885 38127509 40388273 42326765 44103473
2070D4103473m499832m059235m621277q927125r69714p29258m632742M50682J223324
$$ 44103473 39603641 35544406 30923129 21996004 21026290 20297032 15664290 16114972 17338296
2061A7338296n07741j088193R86225o4409n98236J219018k4570l207378Q5218
$$ 17338296 16830555 15742362 16728587 16664178 16065942 17284960 17260390 14053012 14138230
2052A4138230J516570k259330J447503R08283N84230j53979j049535k4056J4909
$$ 14138230 15654800 13395470 14842973 15751256 16335486 16181507 15131972 15107916 15122825
2043A5122825J154691l657609K880370k720795J810813Q64546o61090q53405J008793
$$ 15122825 16277516 12619907 15500277 12779482 14590295 15454841 14793751 13940346 14949139
2034A4949139K698m06623K70905P45758k401743L666579p38512m19998k356506
$$ 14949139 14951837 14545214 14816119 15561877 13160134 16826713 16088201 15668203 13311697
2025A3311697K857760j52842K52290m8025k24034J058226q95356J342438j915878
$$ 13311697 16169457 16016615 16268905 16220880 15996846 17055072 16159716 17502154 15586276
2016A5586276J318948j80261l56087R11054J88410o20352P10159j479259L556298
$$ 15586276 16905224 16724963 16368876 17279930 17468340 16847988 17558147 16078888 19635186
2007A9635186j945828P19102J628206k939434L472474l056754O86716J668020
$$ 19635186 17689358 18408460 20036666 17097232 20569706 17512952 18199668 19867688
1999A9867688j263922P51962J94748N05368m012375K398059j860301k272909J37302
$$ 19867688 18603766 19355728 19550476 20055844 16043469 18441528 16581227 14308318 14445620
1990A4445620J157415m486900N512211j969116o80326j042920j78924J217157
$$ 14445620 15603035 11116135 16628346 14659230 13978904 12935984 12757060 13974217
1982A3974217k202761M87158p9333Q66858J18593l32833p46509J737143k257959
$$ 13974217 11771456 12258614 12179281 13046139 13164732 12831899 12085390 13822533 11564574
1973A1564574J123338k693387K845262J895585l585956J992053K633373j560542
$$ 11564574 12687912 9994525 12839787 14735372 11149416 13141469 15774842 14214300
1965A4214300j13539k52040J087442K3998k136744n3970r97917L265547j661851
$$ 14214300 14100761 13848721 14936163 14960161 12823417 12769447 11771530 15037077 13375226
1956A3375226L030974L01167j377780R5859j057558M13860O58759J196372j040503
$$ 13375226 16406200 16707367 15329587 15425446 14367888 14781748 15440507 16636879 15596376
1947A5596376O50556Q90674j188654k31542J152802q57147J308412K36161M38624
$$ 15596376 16246932 17137606 15948952 15717410 16870212 16013065 17321477 17557638 17996262
1938A7996262J610246J687634k640346j41942J494648p29684J587028l141433
$$ 17996262 19606508 21294142 18653796 18511854 20006502 19276818 20863846 17722413
1930A7722413J469919P44760q0338L55172P48470Q72362p96074J51538J341584
$$ 17722413 19192332 19937092 19856754 20211926 20960396 21832758 21036684 21188222 22529806
1921B2529806r9400K10338J49926J942158P96332l09749m5619p66624k883446
$$ 22529806 22430406 22640744 22790670 24732828 25529160 25219411 25173792 24407168 21523722
1912B1523722K458998J936446j459362M95722j926270J52768l83300P76267M28709
$$ 21523722 23982720 25919166 24459804 24955526 23029256 23182024 22798724 23574991 24003700
1903B4003700K83562q24284M18296j914280Q35816J424939j393025j21332J40332
$$ 24003700 24287262 23462978 23881274 21966994 22802810 24227749 22834724 22713392 22853724
1894B2853724J925948k065960J640060p80829J452884l225091J263266J361460
$$ 22853724 24779672 22713712 24353772 23572943 25025827 21800736 23064002 24425462
1886B4425462j071408K016536j464274j24060j071114L71320j288734J591510
$$ 24425462 23354054 25370590 23906316 23782256 22711142 23082462 21793728 23385238
1878B3385238K16644j117794Q94792j343546L91248O65484o77668k040192J482222
$$ 23385238 23601882 22484088 23378880 22035334 22426582 23092066 22414398 20374206 21856428
1869B1856428k457958K222024o53502R52654o94347J194609j337108q26501j426365
$$ 21856428 19398470 21620494 20966992 21919646 21225299 22419908 21082800 20256299 18829934
1860A8829934J123338K16806k54634j47866j516974o61514L23917K011057k465778
$$ 18829934 19953272 20170078 19915444 19767578 18250604 17589090 17913007 19924064 17458286
1851A7458286k84498K78058J470868j826878L22378J270112k559220J351808j27220
$$ 17458286 17173788 17451846 18922714 17095836 17418214 18688326 16129106 17480914 17353694
1842A7353694j404326R77156j377691J539365P08568j676362p14202M51382J708390
$$ 17353694 15949368 16926524 15548833 17088198 17796766 16120404 15406202 15857584 17565974
1833A7565974j898261J323169o09072J112024j009186J673078j510307q78067
$$ 17565974 15667713 16990882 16381810 17493834 16484648 18157726 16647419 15769352
1825A5769352N96825j82568M84064r449J796479l146993J838056P40084j79221
$$ 15769352 16366177 16183609 16667673 16658224 18454703 15307710 17145766 17885850 17706629
1816A7706629L38371J072911r30371O74990j190878J592012J15082J224804k426106
$$ 17706629 18045000 19117911 18187540 18862530 17671652 19263664 19378746 20603550 18177444
1807A8177444L176818j596284K035262q34522q84812J156040J071710j261458
$$ 18177444 21354262 19757978 21793240 20958718 20073906 21229946 22301656 21040198
1799B1040198j244896J860374m51838j147475K035393J687676j190635K349184
$$ 21040198 19795302 21655676 21203838 20056363 22091756 23779432 22588797 24937981
1791B4937981j001174J077429J942299q70098J056678K87282M92672p4343l28830
$$ 24937981 23936807 25014236 26956535 26086437 27143115 27430397 27923069 27848726 27519896
1782B7519896J556004N80394M43069j041794K702773P43747R96184o09576J935316
$$ 27519896 29075900 29656294 30099363 29057569 31760342 32504089 33500273 32890697 34826013
1773C4826013K32152N79072J473876L776492J098696O09239L173389J294703K619940
$$ 34826013 35058165 35637237 37111113 40887605 41986301 42595540 45768929 47063632 49683572
1764D9683572O43109M904375n47615O148335O11072M925315l12767M046032J522776
$$ 49683572 50326681 55231056 54683441 60831776 61442848 66368163 66055396 70101428 71624204
1755G1624204L138783l55135K994167J754304J531648o544K912296K97920M304768
$$ 71624204 74762987 74407852 77402019 79156323 80687971 80681427 83593723 83891643 88196411
1746H8196411K310608K120847M001664M152480K304160N415927N616913N928016
$$ 88196411 90507019 92627866 96629530 100782010 103086170 108502097 114119010 120047026
1738A20047026R930799Q269176R967503J3474095J3319376J4989183J4056159
$$ 120047026 129977825 138247001 148214504 161688599 175007975 189997158 204053317
1731B04053317J1852383N429872n005216p853535j6056304k1812446k2132847
$$ 204053317 215905700 221335572 216330356 208476821 192420517 170608071 148475224
1724A48475224k2327263j9708207j5345616j5214439j2293731p749816p192280
$$ 148475224 126147961 106439754 91094138 75879699 63585968 55836152 48643872
1717D8643872o474347l777159k037756m086194J286158n518567Q73433j652659
$$ 48643872 42169525 38392366 36354610 32268416 33554574 28036007 28909440 27256781
1709B7256781l347303R25868o04702j5920j264136N45670r21174k86432j380486
$$ 27256781 23909478 24835346 24230644 24214724 22950588 23496258 22575084 22288652 20908166
1700B0908166j62074j552500p20927J465067L4400j502940m15286j724388M32137
$$ 20908166 20746092 19193592 18472665 19937732 19972132 18469192 18053906 16329518 16761655
1691A6761655J010517k085257K507577k056526j318298Q33786k15906O7755j434122
$$ 16761655 17772172 15686915 18194492 16137966 14819668 15653454 15437548 15505303 14071181
1682A4071181J29056R32079k022781O92289O4668K57003j063584q03107l6568
$$ 14071181 14200237 15132316 13109535 13801824 13866492 14123495 13059911 12256804 12220236
1673A2220236L75524J905458j558534J277513M46828k248718J593J173577r77140
$$ 12220236 12595760 14501218 12942684 14220197 14667025 12418307 12419900 13593477 12616337
1664A2616337J67547J220201r16625J083319k810343J561515k352546O57879Q29073
$$ 12616337 12783884 14004085 13087460 14170779 11360436 12921951 10569405 11227284 12056357
1655A2056357n41103L56200J77703L17527K80966j235463j302751M12071n91598
$$ 12056357 11515254 11871454 12049157 12366684 12647650 11412187 10109436 10521507 9929909
1646I929909R05375l78959k255342P69377L092574J89566j20484n85428L443226
$$ 9929909 10835284 10456325 8200983 8970360 12062934 12252500 12132016 11546588 14989814
1637A4989814n691806J661956j718029K776629k914911Q07661J213228m07599
$$ 14989814 9298008 10959964 9241935 12018564 9103653 9911314 11124542 10716943
1629A0716943J761725j694245k239809M193874l093460j235761J892668j708257
$$ 10716943 12478668 10784423 8544614 12738488 9645028 8409267 10301935 8593678
1621H593678L02493r44401R54285p26252K052824J24138r43537j447928L004424
$$ 8593678 8896171 7951770 8906055 8179803 10232627 10356765 9413228 7965300 10969724
1612A0969724j228697J30241m8654n17347j531586J705532K407528k201068n92515
$$ 10969724 9741027 9871268 9822614 9305267 7773681 9479213 11886741 9685673 9093158
1603I093158P69636P7647J528332j001214J854391n46660p88600j409587M666254
$$ 9093158 9862794 9940441 11468773 10467559 12321950 11775290 10986690 9577103 14243357
1594A4243357j602201Q17662l48459Q72374K35312K36688N64545n40314k13664
$$ 14243357 12641156 13458818 13110359 13982733 14218045 14454733 15019278 14478964 14265300
1585A4265300r69112K846537m93519P48113L05264M78986q72369J509632q87092
$$ 14265300 13296188 16142725 15649206 16397319 16702583 17181569 16309200 17818832 16931740
1576A6931740O77416P62901r2590Q56653K82672k547308M2872J506874p13296
$$ 16931740 17609156 18372057 18279467 19136120 19418792 16871484 16914356 18421230 17707934
1567A7707934K211962n1528k518654M80628K23924J66466k633283J438461N21966
$$ 17707934 19919896 19868368 17349714 17830342 18054266 18220732 15587449 17025910 17547876
1558A7547876K620058k112008j41694J322650J81324K68944J27694J06620m7760
$$ 17547876 20167934 18055926 17914232 19236882 19418206 19687150 19814844 19921464 19873704
1549A9873704r92448o60604K351624J458456J461650L88382K066230J87110r93
$$ 19873704 18881256 18220652 20572276 22030732 23492382 23880764 25946994 26134104 26133111
1540B6133111K282977Q87631J979657k716280p7188l207630J0832j565336j148828
$$ 26133111 28416088 29303719 31283376 28567096 28489908 25282278 25293110 23727774 22578946
1531B2578946j192810k500671j458065j69936K782118n055848L284498J611118
$$ 22578946 21386136 18885465 17427400 17257464 20039582 14983734 18268232 19879350
1523A9879350j846491m07363m21576J572750k395116J937826j099490K213550
$$ 19879350 18032859 17625496 17203920 18776670 16381554 18319380 17219890 19433440
1515A9433440o35590O82131N2241q96122M84016K106719p12249J6008N64126m952255
$$ 19433440 18797850 19479981 19532222 18636100 19120116 21226835 20514586 20530594 21094720 16142465
1505A6142465M711049k689694M40948j914803J350104j527614q90547K8790K364266
$$ 16142465 20853514 18163820 18604768 16689965 18040069 16512455 15621908 15650698 18014964
1496A8014964m82450j134054j405317K698789m455736L032186k691744M33745
$$ 18014964 17532514 16398460 14993143 17691932 13236196 16268382 13576638 14010383
1488A4010383J321505l18948k389253K784708j060265J668598m71581N25841q36048
$$ 14010383 15331888 15012940 12623687 15408395 14348130 16016728 15545147 16070988 15234940
1479A5234940q64083k91386J27981J437312j509450J634297j424758p6587l73022
$$ 15234940 14370857 14079471 14207452 15644764 14135314 15769611 14344853 14268266 13895244
1470A3895244J327849Q11560j679364O4563K15098K626644O27360k034694J400730
$$ 13895244 15223093 16034653 14355289 14419852 14634950 17261594 17888954 15854260 17254990
1461A7254990j741934l57635q25539j009830k070528j251095o160j115473o04355
$$ 17254990 15513056 15155421 14329882 13320052 11249524 9998429 9992269 8876796 8272441
1452H272441N39244n34628j193114q10036Q81859N89094k044242J251452k846260
$$ 8272441 8811685 8277057 7083943 6273907 7155766 7744860 5700618 6952070 4105810
1443D105810K65251K469894B243234K278267p62002j26033J044395J349819k750242
$$ 4105810 4371061 6840955 2243234 4521501 3759499 3633466 4677861 6027680 3277438
1434C277438J490071B261751J517696K156545m5560r07087B244018m05011K883508
$$ 3277438 4767509 2261751 3779447 5935992 5890432 4983345 2244018 1839007 4722515
1425D722515R0440j843873k40665L154635o59633q20513l90154j188958K516611
$$ 4722515 4812955 2969082 2728417 5883052 5223419 4402906 4012752 2823794 5340405
1416E340405m22595j266216n4753K217381A975136M07997K900753j837694p35647
$$ 5340405 4917810 3651594 3596841 5814222 1975136 2383133 5283886 3446192 2710545
1407B710545K57364G16835L573224j206823e6764C756715J060668M43845n11912
$$ 2710545 2967909 716835 4290059 3083236 -56764 3756715 4817383 5261228 4749316
1398D749316o66130L98260j834595K184855l50841q69540j429733N89820K469924
$$ 4749316 4083186 4481446 2646851 4831706 4480865 3611325 2181592 2771412 5241336
1389E241336p63635M8488k50240j719922J304757N22886J367105j033559k857
$$ 5241336 4477701 4526189 4275949 2556027 3860784 4383670 5750775 4717216 4714359
1380D714359q72991J260097k49225j65875O69762j027251N85441l62855K827051
$$ 4714359 3841368 5101465 4852240 4686365 5356127 4328876 4914317 4551462 7378513
1371G378513J634428l087389M86054J88603P72511j002659K811402j474194q35210
$$ 7378513 9012941 5925552 6411606 6600209 7372720 6370061 9181463 7707269 6872059
1362F872059p62999K358785k183015B563255L07228K740428k728026N03673p2507
$$ 6872059 6109060 8467845 6284830 2563255 2870483 5610911 2882885 3386558 3314051
1353C314051A434357J848897J019991j130888j024068J981072j341636E42157
$$ 3314051 1434357 3283254 4303245 3172357 2148289 4129361 2787725 542157
1344A968205J594407p74104r72690R46709L080710k063894j310780N76589A088635
$$ 1968205 3562612 2788508 1815818 2762527 5843237 3779343 2468563 3045152 1088635
1334B278563p64354P09871K046280n54302q65414O81790A173872N04074J455924
$$ 2278563 1514209 2224080 4270360 3716058 2850644 3532434 1173872 1677946 3133870
1325C133870r26556P38805q41404F57008K005147K056446B141600K321932j781071
$$ 3133870 2207314 2946119 2104715 657008 2662155 4718601 2141600 4463532 2682461
1316B682461J025681I64770J257798L363883j866853j211707N64408J515611B248561
$$ 2682461 3708142 964770 2222568 5586451 3719598 2507891 3072299 4587910 2248561
1306B967960q74359L227120k250369J574711B149419l83121K605326A816742K159350
$$ 2967960 2093601 5320721 3070352 4645063 2149419 1766298 4371624 1816742 3976092
1297C976092j473363P80574R17124r93755K73667k30600J025221P7632j07645
$$ 3976092 2502729 3283303 4200427 3206672 3480339 3249739 4274960 4352592 4244947
1288D244947q20617A684172L637528n04619A744444N80480J407996k90048O07204
$$ 4244947 3424330 1684172 5321700 4817081 1744444 2324924 3732920 3442872 4050076
1279D050076j470979K05908J259767j558857J825409Q8255j000590O91638J003555
$$ 4050076 2579097 2785005 4044772 2485915 4311324 4399579 3398989 4090627 5094182
1270E094182A753479L557113p69667Q90459k342426n82674Q93191Q18090q02230
$$ 5094182 1753479 5310592 4540925 5431384 3088958 2506284 3399475 4217565 3415335
1261C415335J843546j111164m0851j229801m53851J743955r3988j708779j113862
$$ 3415335 5258881 4147717 4106866 2877065 2423214 4167169 4073181 2364402 1250540
1252A250540K525912J263560B092437L229440A844243E76375J530345J51747l72564
$$ 1250540 3776452 5040012 2092437 5321877 1844243 576375 2106720 2258467 1885903
1243A885903K588041A235575J363895O41011N10355O4148J33178l04939k54887
$$ 1885903 4473944 1235575 2599470 3240481 3750836 3814984 3948162 3643223 3388336
1234C388336j498479K135171j624608J404958K08799F07476L333053j22110l84185
$$ 3388336 1889857 4025028 2400420 3805378 4014177 607476 3940529 3818419 3434234
1225C434234p31990H30390J194565o82367L632390j573292O19896I09458J930296
$$ 3434234 2702244 830390 2024955 1342588 4974978 3401686 4021582 909458 2839754
1216B839754O74770N67120j908602K641516j928526j440865L104360q0111A493737
$$ 2839754 3514524 4081644 2173042 4814558 2886032 1445167 4549527 4469416 1493737
1206C443727O50654M04827j495905L046802q68405p55772B029536L390317B458195
$$ 3443727 4094381 4499208 3003303 6050105 5181700 4425928 2029536 5419853 2458195
1196B762108R75730P85736B184221O72531K10445J261748O53057j885323L05441
$$ 2762108 3737838 4523574 2184221 2856752 3067197 4328945 4982002 3096679 3402120
1187C402120p6352A307203O21829M332116A771107h37512B137992o14324J834706
$$ 3402120 3325768 1307203 1929032 6261148 1771107 -837512 2137992 1523668 3358374
1178C358374A067679n19783K169445m5616l9197j237504K291319a66587A255504
$$ 3358374 1067679 547896 2717341 2671725 2632528 1395024 3686343 -166587 1255504
1168B649188k3453j074722j56361J722559A230328Q93806A57619K129464A51917
$$ 2649188 2625735 1551013 1394652 3117211 1230328 2124134 157619 2287083 151917
1158B810602p27860J052312j293209k13166N76084K263482j978144P41d30527
$$ 2810602 2082742 3135054 1841845 1628679 2204763 4468245 2490101 2490842 -430527
1148A866712k99984K390133I76634J390289D80287L136857B13893J297064J821003
$$ 1866712 1566728 3956861 976634 2366923 480287 3617144 213893 1510957 3331960
1139C331960r59415j010879K604452A809429J007182m95889L55970N79404j136543
$$ 3331960 2372545 1361666 3966118 1809429 2816611 2320722 2676692 3256096 2119553
1130B119553J038776q76243K171293j241661p33672J154346Q36616K089699o05783
$$ 2119553 3158329 2282086 4453379 3211718 2478046 3632392 4469008 6558707 5952924
1121E952924J959208k62937J46144J996810J296846m01828J869252J919251p82599
$$ 5952924 7912132 7649195 7795339 9792149 11088995 10687167 12556419 14475670 13693071
1112A3693071N181401k817724k137001k68815J80460L873361k697468M078605
$$ 13693071 18874472 16056748 13919747 13650932 13831392 17704753 15007285 19085890
1104A9085890P69666P537056P54537L988713Q144651O040572K0868303N3984246
$$ 19085890 19855556 27392612 28147149 32135862 40280513 46321085 67189388 121173634
1096A21173634L0845861K1779184J2891407j5464287m6529766k1187143k2703959
$$ 121173634 152019495 173798679 186690086 171225799 124696033 103508890 80804931
1089H0804931l8406838j1311875j4409837k887169l559496j829801j047982k311046
$$ 80804931 42398093 31086218 16676381 13789212 10229716 8399915 7351933 5040887
1081E040887J647489K31584R36708j97213j2013J69349O61816j332728k047988
$$ 5040887 6688376 6919960 7856668 7659455 7647442 7816791 8478607 7145879 5097891
1072E097891J062814J35303j592208j544028j466136J858784r48422J165502j691538
$$ 5097891 6160705 6296008 4703800 3159772 1693636 3552420 2603998 3769500 2077962
1063B077962Q53862J329195A088283J682923j264968J238009M91470k57665m38501
$$ 2077962 2931824 4261019 1088283 2771206 1506238 2744247 3235717 2978052 2539551
1054B539551Q89020P36862j846670r40117J250515o20348P55910a31204C119423
$$ 2539551 3428571 4165433 2318763 1378646 2629161 2008813 2764723 -131204 3119423
1044B507227J422441q53875n18412j54145I29261M754278c4368B59978K714040
$$ 2507227 3929668 3075793 2557381 2403236 929261 5683539 -34368 259978 2974018
1035B974018j118651J187081j133948r53451K710147c37215A890634p3804m37934
$$ 2974018 1855367 3042448 1908500 955049 3665196 -337215 1890634 1816830 1378896
1026A378896N19965n48145O65134K518529B245291L43331q21402Q62631j263430
$$ 1378896 1898861 1350716 2015850 4534379 2245291 2588622 1767220 2629851 1366421
1017A366421Q10033R33748e9513k27241B008268N00850b039638B713519l22918
$$ 1366421 2176454 3110202 -59513 -286754 2008268 2509118 -2039638 2713519 2390601
1008B390601K024734B018403n80160L67461M44157P36876c0138B097902k4122
$$ 2390601 4415335 2018403 1438243 1805704 2249861 2986737 -30138 2097902 2073780
999B073780r85747Q04215G10693J85170d10220A308209K67262P288o79620J840497
$$ 2073780 1088033 1892248 710693 895863 -410220 1308209 1575471 1582759 903139 2743636
989B743636j041030K24919N78323A75684Q62396K038217G54144j09575J999262
$$ 2743636 1702606 1927525 2505848 175684 1038080 3076297 754144 644569 2643831
980B643831A272169a432991A752456C73486L451288A753117A93022K022431b37040
$$ 2643831 1272169 -1432991 1752456 373486 3824774 1753117 193022 2215453 -237040
970A368947a735229A748881b93847C040375B37336L584241A395988P47047K01807
$$ 1368947 -1735229 1748881 -293847 3040375 237336 3821577 1395988 2143035 2344842
961B344842A147791m04335a155844A645161m32516L02364J87385b303273I3757
$$ 2344842 1147791 743456 -1155844 1645161 1212645 1515009 1702394 -2303273 93757
951A066164e69377j48628A12953N39379K53068l70696A5897Q14030J45093n0767
$$ 1066164 -569377 -718005 112953 652332 905400 534704 15897 829927 975020 924253
941I24253J97870C63728g90744B700024k02386F33847d20776C167738D84463M0753
$$ 924253 1122123 363728 -790744 2700024 2497638 633847 -420776 3167738 484463 525216
931E25216J291372l9594F98456J68003J428194r71483J320185j068282P58322
$$ 525216 1816588 1776994 698456 866459 2294653 1323170 2643355 1575073 2333395
922B333395o90851M69825E38819j15590Q09681O99023n2820n88435b90399l88341
$$ 2333395 1642544 2112369 538819 423229 1232910 1931933 1879113 1290678 -290399 -678740
912f78740a98803B96559O66809p6087J914193F05318J868303N82822L01801A650295
$$ -678740 -198803 296559 963368 887281 2801474 605318 2473621 3056443 3358244 1650295
901a68432D45553J051552A33940K337282A65350a72111A173706R89180p46679
$$ -168432 445553 1497105 133940 2471222 165350 -172111 1173706 2162886 1416207
892A416207O68775l98995l90989L50477m37605C46833M43024O18319h96223D419428
$$ 1416207 2084982 1685987 1294998 1645475 1207870 346833 789857 1408176 -896223 4419428
881A784658m6770e7620A224926K316693j430048I33797l67233J619671K67761
$$ 1784658 1737888 -57620 1224926 3541619 2111571 933797 566564 2186235 2453996
872B453996N29298I33211J184928j37528P16128E77640J001934D04247J674019
$$ 2453996 2983294 933211 2118139 1980611 2696739 577640 1579574 404247 2078266
863B078266J100846k4908Q51413a45098A420150J043261B76935K20014J873928
$$ 2078266 3179112 3154204 4005617 -145098 1420150 2463411 276935 496949 2370877
854B370877J217291j714068k25355K992777j042179J318433k08649k314198Q86422
$$ 2370877 3588168 1874100 1648745 4641522 3599343 4917776 4709127 2394929 3281351
845C281351L600634k364000P30541o04666O56904j964203J954609j148695J915068
$$ 3281351 6881985 4517985 5248526 4643860 5300764 3336561 5291170 4142475 6057543
836F057543k493287K113811o5624J157058j047342L461804k032598K97277n62850
$$ 6057543 3564256 5678067 5612443 6769501 5722159 9183963 7151365 7448642 6885792
827F885792J691906J51011J590076l761457o81508J5138a1659A217427J536558
$$ 6885792 8577698 8728709 10318785 6557328 5875820 5890958 -11659 1217427 2753985
818B753985D60252b26396B183859F07728B2564R44136a345691A14413O88320a99176
$$ 2753985 460252 -226396 2183859 607728 22564 966700 -1345691 114413 802733 -199176
807C459291r54044n27540c31702j833073d04538B547598r95461m62289J393751
$$ 3459291 2505247 1977707 -331702 -2164775 -404538 2547598 1552137 1089848 2483599
798B483599r83574k94664h5170A586092a258637B24423L620428H50093K4583P60998
$$ 2483599 1500025 1205361 -85170 1586092 -1258637 224423 3844851 850093 874676 1635674
788A635674n81085g0773B378220q48313J10070a87037G2192J93375n1401J16296
$$ 1635674 1054589 -70773 2378220 1529907 1639977 -187037 72192 265567 214166 330462
778C30462R59044J169944G92751k72826J487147p08771m19007J950139j62866
$$ 330462 1289506 2459450 792751 519925 2007072 1298301 879294 2829433 2666567
769B666567B28749j13570Q38620K19985f65594C243146a05157A491465c07917
$$ 2666567 228749 115179 953799 1173784 -665594 3243146 -105157 1491465 -307917
759A680693P05351n83937L46554a279535H87744K057702H98173B60167A26458
$$ 1680693 2386044 1802107 2148661 -1279535 887744 2945446 898173 260167 126458
749C8793J106805C75380O59633K44348a96589n31693B266120n62209E98784j60566
$$ 38793 1145598 375380 1035013 1279361 -196589 -728282 2266120 1703911 598784 438218
739D38218K41383L02918g30860A800705F68890Q75507c5379n68947B87723g71232
$$ 438218 679601 982519 -730860 1800705 668890 1544397 -35379 -604326 287723 -771232
728A171740E31224R41540c93147c8197j728573g00575A208132l06821c50076p27099
$$ 1171740 531224 1472764 -393147 -38197 -1766770 -700575 1208132 901311 -350076 -1077175
718a077175j92A623511i7651A647482F60013J083465a55432G54852L096516j313393
$$ -1077175 -1077367 1623511 -97651 1647482 660013 1743478 -155432 754852 3851368 2537975
708B537975I71053K815K01462a648077D32552r3658J87448M08436B98619J1340
$$ 2537975 971053 973868 1175330 -1648077 432552 338894 526342 934778 298619 309959
698C09959b74269j02121k52084I57615a095320H69261j6143c17893o271A938609
$$ 309959 -274269 -376390 -628474 957615 -1095320 869261 853118 -317893 -324164 1938609
687E25571j97807J214436L39266q80803O75729A24073e30761B35546J145836g79889
$$ 525571 327764 1542200 1881466 1000663 1676392 124073 -530761 235546 1381382 -779889
676A548471b32861B138910h593j369151l30273a84817E68563M08913j4003J88235
$$ 1548471 -232861 2138910 -8593 -1377744 -1708017 -184817 568563 977476 963473 1151708
666A151708a44054j586865F32770Q12740f46877m16681a07223B252712g21820
$$ 1151708 -144054 -1730919 632770 1445510 -646877 -1063558 -107223 2252712 -721820
656d2375C15006d19960j418735A132552C34364g418j551134E90389b23825H41743
$$ -42375 315006 -419960 -1838695 1132552 334364 -7418 -1558552 590389 -223825 841743
645a05751J9044E45458J76794k46653J297534H05173J231715k38042f29856A56321
$$ -105751 -86707 545458 722252 475599 1773133 805173 2036888 1798846 -629856 156321
634G0662J159921B37768i57041b86248k26959A010754J63574h81664D86817h33782
$$ 70662 1230583 237768 -957041 -286248 -513207 1010754 1174328 -881664 486817 -833782
623H31029a240602A031786L1065a96226A213518J214741C67082A1019J782668
$$ 831029 -1240602 1031786 1062851 -196226 1213518 2428259 367082 11019 1793687
614A793687l11291M36159h93554j364776A817057c02610o12383b2161B497912
$$ 1793687 1482396 1918555 -893554 -2258330 1817057 -302610 -914993 -22161 2497912
604I2608R76199k488E05193K16251a574703P63588G00127N81060o2743a857708
$$ 92608 1068807 1066319 505193 721444 -1574703 -811115 700127 1281187 1218444 -1857708
593B872943A182439j66879D98178P13161a34453D46935K709227H17903n9291C57223
$$ 2872943 1182439 1015560 498178 1211339 -134453 446935 3156162 817903 758612 357223
582D64344d87010B36971K53677h7367B225499r18392l80700C47891M70495e56676
$$ 464344 -487010 236971 490648 -87367 2225499 1307107 926407 347891 818386 -556676
571B992875j30574j228971l22554G212J869929A3469h95481A764852k55130J170626
$$ 2992875 2862301 1633330 1310776 7212 1877141 13469 -895481 1764852 1509722 2680348
561B680348A096707H7814J690512P06742H60681I8700K102654D32484J180935
$$ 2680348 1096707 87814 1778326 2485068 860681 98700 2201354 432484 1613419
552A613419j05163F85795j74373P53042K694107j713312a178711E41335G6672
$$ 1613419 1508256 685795 511422 1264464 3958571 2245259 -1178711 541335 76672
542A657894D41349k01633b61644A14596a56052F01667Q23338C15694o0323A03717
$$ 1657894 441349 239716 -261644 114596 -156052 601667 1425005 315694 255371 103717
531a417029A419620o11162A51202G2326b11730A108915g55987A073340i41685
$$ -1417029 1419620 808458 151202 72326 -211730 1108915 -755987 1073340 -941685
521A6561h89481c06855B313186A17968Q40648L41697K012K45642a98291j0583
$$ 16561 -889481 -306855 2313186 117968 958616 1300313 1302325 1547967 -198291 -208874
511b08874n58692c58999A39442K60674J04270e96550A72249a15237A377508a32341
$$ -208874 -767566 -358999 139442 400116 504386 -596550 172249 -115237 1377508 -132341
500C77114a452323N47360J14867G18826A57222J697937A10451a614784a74999
$$ 377114 -1452323 -904963 -790096 718826 157222 1855159 110451 -1614784 -174999
490A586639a54574l24887H44672h14247A141386b63231A023716m07303K003120
$$ 1586639 -154574 -479461 844672 -814247 1141386 -263231 1023716 616413 2619533
481B619533A58537c31885A757343M48654c2015o89199A027259a135687A874662
$$ 2619533 158537 -331885 1757343 2205997 -32015 -721214 1027259 -1135687 1874662
471a507736j074856d84313H90778f37322I90844a537481a02827B64317Q18320
$$ -1507736 -2582592 -484313 890778 -637322 990844 -1537481 -102827 264317 1082637
462A082637k83500I0196b72073G12543O1202e29016G62762a454354D64295K58890
$$ 1082637 799137 90196 -272073 712543 773745 -529016 762762 -1454354 464295 723185
452G23185J231061E79896a773606N32693A729249a918848d76645G33711C11484
$$ 723185 1954246 579896 -1773606 -1240913 1729249 -1918848 -476645 733711 311484
442g12289j04754D32315j10375l5080d93958B172873b7827k18913l76407D29505
$$ -712289 -817043 432315 321940 286860 -493958 2172873 -27827 -246740 -623147 429505
431F95700Q98357G53147h35396A966003D46672j56200b5207A825759B90360e2833
$$ 695700 1594057 753147 -835396 1966003 446672 290472 -25207 1825759 290360 -52833
420B853670H34026j78429a768639M53798C46978h97566a79056E47358J97967K89738
$$ 2853670 834026 655597 -1768639 -1314841 346978 -897566 -179056 547358 745325 1035063
410A035063b709020E39480b37991A751550G59651j84653b542010d23739k32571
$$ 1035063 -2709020 539480 -237991 1751550 759651 574998 -2542010 -423739 -656310
401f56310F7313h05270F56461N50606a383370c37785G09491f33127H47799d59684
$$ -656310 67313 -805270 656461 1207067 -1383370 -337785 709491 -633127 847799 -459684
390B487108I56658M9550B83460a350309A362148E16362J048068a103042a33078
$$ 2487108 956658 1006208 283460 -1350309 1362148 516362 1564430 -1103042 -133078
380C06650O39766d41023A398975E81615j46051d76789H74329A97706g24998G4596
$$ 306650 946416 -441023 1398975 581615 435564 -476789 874329 197706 -724998 74596
369e14400H6441L72808e81268m4787A792897a555856B48097Q21548c30742B04135
$$ -514400 86441 459249 -581268 -626055 1792897 -1555856 248097 1069645 -330742 204135
358a931062E15970i09020c06002A185186m77713J012443j43425c76370l87503
$$ -1931062 515970 -909020 -306002 1185186 707473 1719916 1576491 -376370 -763873
349g63873E82492h16352G33963J599240a033159C743210i15291C13955J97556
$$ -763873 582492 -816352 733963 2333203 -1033159 3743210 -915291 313955 511511
340E11511j04224h44165B48168N86065A14748Q69586i97388H91842a02391n30323
$$ 511511 407287 -844165 248168 834233 114748 984334 -997388 891842 -102391 -632714
330f32714r041D59244a159823G15247k88761a02518G79759a199407A112148a107993
$$ -632714 -641755 459244 -1159823 715247 426486 -102518 779759 -1199407 1112148 -1107993
319H05029R72859p84077K82734A02367c06950A595399C73669a137329a57484l3030
$$ 805029 1777888 993811 1276545 102367 -306950 1595399 373669 -1137329 -157484 -190514
309a90514F41409J645313d049969A97526J669442r2185n88054O1452p6225g65426
$$ -190514 641409 2286722 -4049969 197526 1866968 1774783 1186729 1248181 1171956 -765426
298f02450A148866a66309A771245H3852b96887C0821J503481d5411I97014l96184
$$ -602450 1148866 -166309 1771245 83852 -296887 30821 1534302 -45411 997014 600830
288F00830J087475m59387p1978B00489J986966d0467I41771a420370K30049H30653
$$ 600830 1688305 1228918 1156940 200489 2187455 -40467 941771 -1420370 -1190321 830653
277C73835e70984j130564F3452K000247e67188C59818g23954C39564J996913A23579
$$ 373835 -570984 -1701548 63452 2063699 -567188 359818 -723954 339564 2336477 123579
266D08295O46274J84821a566698D11847K16190b35649r04169A431486c57302L7928
$$ 408295 1054569 1239390 -1566698 411847 628037 -235649 -1139818 1431486 -357302 -319374
256c19374a21997j698798p61326A344246a11115A171677g94932A246865K22126
$$ -319374 -121997 -1820795 -2582121 1344246 -111115 1171677 -794932 1246865 1468991
247A468991A56695R36273f043k47356G68004K807702a859371P75077A25606J034353
$$ 1468991 156695 1092968 -6043 -253399 768004 3575706 -1859371 -1084294 125606 1159959
237A159959C68164Q34058c00372l70675B37218J186822A15084i26197A98339J853630
$$ 1159959 368164 1202222 -300372 -671047 237218 1424040 115084 -926197 198339 2051969
227B051969b414510B081733D92795J145530D95343a316651G81899C90434M99002
$$ 2051969 -2414510 2081733 492795 1638325 495343 -1316651 781899 390434 889436
218H89436a342316d99153j704791d27747j103707A94037P49721J224715g11219
$$ 889436 -1342316 -499153 -2203944 -427747 -1531454 194037 943758 2168473 -711219
208H64436g72705J02045A386970l37890Q73371p87150d5248C11724c96104H9376
$$ 864436 -772705 -670660 1386970 1049080 1922451 1135301 -45248 311724 -396104 89376
197a4451k38560A509979o73901a505765D15475J353431f28105b48985A811842
$$ -14451 -253011 1509979 836078 -1505765 415475 1768906 -628105 -248985 1811842
187A695859G50644K588190G73878R08157C46699a771572G1375l624e6687k34007
$$ 1695859 750644 3338834 773878 1682035 346699 -1771572 71375 67751 -56687 -290694
177b90694J6684B82164L01876e64615j23785A229961N2151a383137d81841B524247
$$ -290694 -274010 282164 584040 -564615 -688400 1229961 1282112 -1383137 -481841 2524247
166E6812J433083g63555B21321a016142M93183A911407a01243A234498C51912
$$ 56812 1489895 -763555 221321 -1016142 -522959 1911407 -101243 1234498 351912
156A653558G90970R89160j78913f76566A686280a39863C122937A90611P34333
$$ 1653558 790970 1780130 1601217 -676566 1686280 -139863 3122937 190611 924944
147I24944J413002E35968a186675B28526N60986k39014M8421c281357B74269J62606
$$ 924944 2337946 535968 -1186675 228526 789512 550498 598919 -3281357 274269 436875
137D36875O10277f66375a72444A546025D4472h80103A031270f5759L2808n57738
$$ 436875 1047152 -666375 -172444 1546025 44472 -880103 1031270 -65759 -32951 -590689
127e90689E59936j57736J557457e64848n80242B312497a889375G08868a253927
$$ -590689 559936 402200 1959657 -564848 -1145090 2312497 -1889375 708868 -1253927
117a285363G43799Q40466g1653j179052e74485j35339A565427D54412a280008
$$ -1285363 743799 1584265 -71653 -1250705 -574485 -709824 1565427 454412 -1280008
107g13797G4557k4865a067738M82107E5822M44204d34008j185975J68690A181218
$$ -713797 74557 49692 -1067738 -585631 55822 500026 -434008 -1619983 -1451293 1181218
96C13473c84550J72766o7551p25812I83288M23801D51041k0148N82736a782806
$$ 313473 -384550 -211784 -279335 -1005147 983288 1407089 451041 430893 1013629 -1782806
85i91687D062998A89515d08555J93651B75086Q36433j85968h14746H03230l5044
$$ -991687 4062998 189515 -408555 -214904 275086 1111519 925551 -814746 803230 768186
75G68186p7338a035909A283671a142503E45898N96694i96992A039822a320175
$$ 768186 690848 -1035909 1283671 -1142503 545898 1142592 -996992 1039822 -1320175
65I04847j1667g19941n14770Q1981A136299g37114c43702D36217a38970A292352
$$ 904847 893180 -719941 -1234711 -1152730 1136299 -737114 -343702 436217 -138970 1292352
54b165808c73692Q6944B24601b89893m27429o0108D16087a784522A219389J332988
$$ -2165808 -373692 -286748 224601 -289893 -717322 -777430 416087 -1784522 1219389 2552377
44B552377a84839G94053a276595A892013o79687n44086M88150J006302d03137
$$ 2552377 -184839 794053 -1276595 1892013 1212326 668240 1156390 2162692 -403137
34b84319O1589A705378a177207A354106l77003n0360a81126D67782J110974G25181
$$ -284319 -222730 1705378 -1177207 1354106 977103 926743 -181126 467782 1578756 725181
23a832340B66757L90940a636648b48163B0425g1750o09735G24553e18625B92372
$$ -1832340 266757 657697 -1636648 -248163 20425 -71750 -681485 724553 -518625 292372
12F04634f77512A63436i05138A130082N78739E29367g94262b26379h9614B62664
$$ 604634 -677512 163436 -905138 1130082 1708821 529367 -794262 -226379 -89614 262664
1A88113b426842
$$ 188113 -2426842
##END=
