##TITLE=1425
##JCAMPDX= 6.0         $$ Bruker NMR JCAMP-DX V2.0
##DATA TYPE= NMR SPECTRUM
##DATA CLASS= XYDATA
##ORIGIN= NUTS EXPORT
##OWNER= Administrator
$$ 1.72 TOPSPIN		Version 2.1
$$ 2016-02-23 12:24:14.605 -0800  Administrator@X
$$ Compression mode = diff/dup
##.OBSERVE FREQUENCY= 90.275459
##.ACQUISITION MODE= SIMULTANEOUS (DQD)
##.ACQUISITION SCHEME= undefined
##.AVERAGES= 16
##.DIGITISER RES= 22
##SPECTROMETER/DATA SYSTEM= 
##.PULSE SEQUENCE= zg30
##.SOLVENT NAME= None
##.SHIFT REFERENCE= INTERNAL, None, 1, 14.39826
##AUDIT TRAIL= $$ (NUMBER, WHEN, WHO, WHERE, PROCESS, VERSION, WHAT)
$$ ##TITLE= Audit trail, TOPSPIN		Version 2.1
$$ ##JCAMPDX= 5.01
$$ ##ORIGIN= Bruker BioSpin GmbH
$$ ##OWNER= Administrator
$$ $$ E:/data/jwist/nmr/1425/1/pdata/1/auditp.txt
$$ ##AUDIT TRAIL=  $$ (NUMBER, WHEN, WHO, WHERE, PROCESS, VERSION, WHAT)
(   1,<2016-02-23 09:26:39.465 -0800>,<Administrator>,<X>,<jcamp>,<TOPSPIN 2.1>,
      <fromjdx created from
       E:\data\jwist\nmr\uniandes\1425
       data hash MD5: 8K
       A8 B1 79 0A C1 BC AA F9 14 34 AB B7 45 1A F5 27>)
$$ ##END=
$$ 
$$ $$ hash MD5
$$ $$ 7A 43 83 81 39 42 35 75 DF 5F 33 12 43 E8 FB 83
##$RELAX= 
$$ Bruker specific parameters
$$ --------------------------
##$DU= <E:>
##$EXPNO= 1
##$NAME= <1425>
##$PROCNO= 1
##$TYPE= <nmr>
##$USER= <jwist>
##$ACQT0= 0
##$AMP= (0..31)
100 100 100 100 100 100 100 100 100 100 100 100 100 100 100 100 100 100
100 100 100 100 100 100 100 100 100 100 100 100 100 100
##$ANAVPT= 1
##$AQSEQ= 0
##$AQ_mod= 3
##$AUNM= <au_zg>
##$AUTOPOS= <>
##$BF1= 90.275459
##$BF2= 400.02
##$BF3= 400.02
##$BF4= 400.02
##$BF5= 400.02
##$BF6= 400.02
##$BF7= 400.02
##$BF8= 400.02
##$BYTORDA= 0
##$CFDGTYP= 0
##$CFRGTYP= 0
##$CHEMSTR= <none>
##$CNST= (0..63)
1 1 145 1 1 1 1 1 1 1 1 1 1 1 1 1 1 1 1 1 1 1 1 1 1 1 1 1 1 1 1 1 1 1 1
1 1 1 1 1 1 1 1 1 1 1 1 1 1 1 1 1 1 1 1 1 1 1 1 1 1 1 1 1
##$CPDPRG= <>
##$CPDPRG1= <>
##$CPDPRG2= <>
##$CPDPRG3= <>
##$CPDPRG4= <mlev>
##$CPDPRG5= <mlev>
##$CPDPRG6= <mlev>
##$CPDPRG7= <mlev>
##$CPDPRG8= <mlev>
##$CPDPRGB= <>
##$CPDPRGT= <>
##$D= (0..63)
0 1 0 0 0 0 0 0 0 0 0 0 0 0 0 0 0 0 0 0 0 0 0 0 0 0 0 0 0 0 0 0 0 0 0 0
0 0 0 0 0 0 0 0 0 0 0 0 0 0 0 0 0 0 0 0 0 0 0 0 0 0 0 0
##$DATE= 0
##$DBL= (0..7)
120 120 120 120 120 120 120 120
##$DBP= (0..7)
150 150 150 150 150 150 150 150
##$DBP07= 0
##$DBPNAM0= <>
##$DBPNAM1= <>
##$DBPNAM2= <>
##$DBPNAM3= <>
##$DBPNAM4= <>
##$DBPNAM5= <>
##$DBPNAM6= <>
##$DBPNAM7= <>
##$DBPOAL= (0..7)
0.5 0.5 0.5 0.5 0.5 0.5 0.5 0.5
##$DBPOFFS= (0..7)
0 0 0 0 0 0 0 0
##$DE= 6.5
##$DECBNUC= <off>
##$DECIM= 2432
##$DECNUC= <off>
##$DECSTAT= 4
##$DIGMOD= 1
##$DIGTYP= 12
##$DL= (0..7)
0 120 120 120 120 120 120 120
##$DP= (0..7)
150 150 150 150 150 150 150 150
##$DP07= 0
##$DPNAME0= <>
##$DPNAME1= <>
##$DPNAME2= <>
##$DPNAME3= <>
##$DPNAME4= <>
##$DPNAME5= <>
##$DPNAME6= <>
##$DPNAME7= <>
##$DPOAL= (0..7)
0.5 0.5 0.5 0.5 0.5 0.5 0.5 0.5
##$DPOFFS= (0..7)
0 0 0 0 0 0 0 0
##$DQDMODE= 0
##$DR= 22
##$DS= 2
##$DSLIST= <SSSSSSSSSSSSSSS>
$$ [...]
##$SPOFFS= (0..31)
0 0 0 0 0 0 0 0 0 0 0 0 0 0 0 0 0 0 0 0 0 0 0 0 0 0 0 0 0 0 0 0
##$SUBNAM0= <"">
##$SUBNAM1= <"">
##$SUBNAM2= <"">
##$SUBNAM3= <"">
##$SUBNAM4= <"">
##$SUBNAM5= <"">
##$SUBNAM6= <"">
##$SUBNAM7= <"">
##$SUBNAM8= <"">
##$SUBNAM9= <"">
##$SW= 20.5580556627758
##$SWIBOX= (0..15)
0 0 3 4 0 0 0 0 0 0 0 0 0 0 0 0
##$SW_h= 8223.68421052631
##$SWfinal= 0
##$TD= 65536
##$TD0= 1
##$TE= 300
##$TE2= 300
##$TE3= 300
##$TEG= 300
##$TL= (0..7)
0 120 120 120 120 120 120 120
##$TP= (0..7)
150 150 150 150 150 150 150 150
##$TP07= 0
##$TPNAME0= <>
##$TPNAME1= <>
##$TPNAME2= <>
##$TPNAME3= <>
##$TPNAME4= <>
##$TPNAME5= <>
##$TPNAME6= <>
##$TPNAME7= <>
##$TPOAL= (0..7)
0.5 0.5 0.5 0.5 0.5 0.5 0.5 0.5
##$TPOFFS= (0..7)
0 0 0 0 0 0 0 0
##$TUNHIN= 0
##$TUNHOUT= 0
##$TUNXOUT= 0
##$USERA1= <user>
##$USERA2= <user>
##$USERA3= <user>
##$USERA4= <user>
##$USERA5= <user>
##$V9= 5
##$VALIST= <valist>
##$VCLIST= <CCCCCCCCCCCCCCC>
##$VD= 0
##$VDLIST= <DDDDDDDDDDDDDDD>
##$VPLIST= <PPPPPPPPPPPPPPP>
##$VTLIST= <TTTTTTTTTTTTTTT>
##$WBST= 1024
##$WBSW= 4
##$XGAIN= (0..3)
0 0 0 0
##$XL= 0
##$YL= 0
##$YMAX_a= 1559781632
##$YMIN_a= -1910142.464
##$ZGOPTNS= <>
##$ZL1= 120
##$ZL2= 120
##$ZL3= 120
##$ZL4= 120
##$ABSF1= 10
##$ABSF2= 0
##$ABSG= 5
##$ABSL= 3
##$ALPHA= 0
##$AQORDER= 0
##$ASSFAC= 0
##$ASSFACI= 0
##$ASSFACX= 0
##$ASSWID= 0
##$AUNMP= <proc_1d>
##$AXLEFT= 0
##$AXNAME= <>
##$AXNUC= <off>
##$AXRIGHT= 0
##$AXTYPE= 0
##$AXUNIT= <>
##$AZFE= 0.1
##$AZFW= 0.1
##$BCFW= 1
##$BC_mod= 2
##$BYTORDP= 0
##$COROFFS= 0
##$CY= 15
##$DATMOD= 1
##$DC= 2
##$DFILT= <>
##$DTYPP= 0
##$F1P= 0
##$F2P= 0
##$FCOR= 0.5
##$FTSIZE= 0
##$FT_mod= 4
##$GAMMA= 1
##$GB= 0
##$INTBC= 1
##$INTSCL= 1
##$ISEN= 128
##$LB= 0.3
##$LEV0= 0
##$LPBIN= 0
##$MAXI= 10000
##$MC2= 0
##$MEAN= 0
##$ME_mod= 0
##$MI= 0
##$NCOEF= 0
##$NC_proc= -9
##$NLEV= 6
##$NOISF1= 0
##$NOISF2= 0
##$NSP= 1
##$NTH_PI= 0
##$NZP= 0
##$OFFSET= 14.39826
##$PC= 1
##$PHC0= 0
##$PHC1= 0
##$PH_mod= 0
##$PKNL= yes
##$PPARMOD= 0
##$PPDIAG= 0
##$PPIPTYP= 0
##$PPMPNUM= 2147483647
##$PPRESOL= 1
##$PSCAL= 4
##$PSIGN= 0
##$PYNMP= <proc.py>
##$REVERSE= no
##$SF= 90.2741592096043
##$SI= 8192
##$SIGF1= 0
##$SIGF2= 0
##$SINO= 400
##$SIOLD= 32768
##$SPECTYP= <>
##$SREGLST= <1H.CDCl3>
##$SSB= 0
##$STSI= 0
##$STSR= 0
##$SW_p= 1497.18866228788
##$SYMM= 0
##$S_DEV= 0
##$TDeff= 0
##$TDoff= 0
##$TI= <>
##$TILT= no
##$TM1= 0
##$TM2= 0
##$TOPLEV= 0
##$USERP1= <user>
##$USERP2= <user>
##$USERP3= <user>
##$USERP4= <user>
##$USERP5= <user>
##$WDW= 1
##$XDIM= 8192
##$YMAX_p= 1559781376
##$YMIN_p= -1909760
##$CURPLOT= <PDFCreator>
##$CURPRIN= <$PDFCreator>
##$DFORMAT= <normdp>
##$LAYOUT= <+/1D_H.xwp>
##$LFORMAT= <normlp>
##$PFORMAT= <normpl>
##$SURQMSG= 1
$$ End of Bruker specific parameters
$$ ---------------------------------
##XUNITS= HZ
##YUNITS= ARBITRARY UNITS
##XFACTOR= 0.182762287876938
##YFACTOR= 1
##DELTAX= -0.182762287876938
##NPOINTS= 8192
##FIRSTX= 1497.0059
##FIRSTY= -1909760
##LASTX= 0
##MAXY= 1559781376
##MINY= -1909760
##XYDATA= (X++(Y..Y))
8191a909760A35168F5024a13152k19136n8880H99072r2672c5328m83840j1264
8181e30432c5840A082880D48000A83296P7312d16256g9360B7136f19520e3760
8170a207296d01920J60768H24832g78752L76320l73248F60992a212928F9632R9328
8160A68960d83328E88800g0656c3792B25280b58560J14176A77152E5808g81824
8149D26496N36576f32320a10592D34176d1984n87264b56000B2528L30240c71712
8138D30592K98496k20160a055744K11968c85024a74592m71040B99008i75360K0992
8128i54368B6112g11680l2256a86368b4576o48192K67776k29376E71904c072A55136
8116b08896P6288q5504l8400I0112b20672j16736k31936D38784c8912n67808I40544
$$ y = [-1909760, 135168, 65024, -113152, -332288, -391168, 899072, 806400, -35328, -519168, -530432, -35840, 1082880, 448000, 183296, 260608, -416256, -79360, 27136, -619520, -53760, -1207296, -401920, -241152, 824832, -778752, -402432, -775680, 660992, -1212928, 69632, 168960, -483328, 588800, -70656, -33792, 225280, -258560, -144384, 177152, 55808, -781824, 426496, 963072, -632320, -110592, 434176, -41984, -629248, -256000, 22528, 352768, -371712, 430592, 729088, 508928, -1055744, -843776, -385024, -174592, -645632, 299008, -975360, -954368, 26112, -711680, -743936, -186368, -24576, -672768, -404992, -634368, 571904, -3072, 155136, -208896, -132608, -218112, -256512, 90112, -220672, -337408, -569344, 438784, -38912, -606720, 940544]
8104I8304e60128a81760m55680B75968d55168A17248b19648r68704N81632K76480
8094c30240l9936a72032C22048b87744k9696p4752r7792I80992f13376K65728
8084c47648m6080M9152q23808N24288K22720j195520g86944K60096k88256F656
8073a018880a13664j72032C03616f54848i0112B85184g14752b09920E68320L4304
8063F02624k62656g42400k60608o81984c50720B57024f96832J7920b17600A73056
8052e43744k02752I5744h2432F79936B6112R32352d8640C42016F0928c69152m71552
8041h40704F7072c46624o5536A35680a034752N14560I4720a288704K60608c25120
8030E14560A64352b41152o30272j23392A94560a30560m21376m99712f8096k16064
$$ y = [98304, -560128, -181760, -637440, 275968, -455168, 117248, -219648, -1188352, -606720, -330240, -370176, -172032, 322048, -287744, -317440, -392192, -489984, 980992, -613376, -347648, -393728, -344576, -1168384, -644096, -421376, -1616896, -786944, -526848, -815104, 6656, -1018880, -113664, -285696, 303616, -654848, -90112, 285184, -714752, -209920, 568320, 602624, 339968, -742400, -1003008, -1684992, -350720, 257024, -696832, -678912, -217600, 173056, -543744, -746496, 95744, -82432, 679936, 26112, 958464, -48640, 342016, 60928, -369152, -840704, 67072, -346624, -412160, 135680, -1034752, -520192, 94720, -1288704, -1028096, -325120, 514560, 164352, -241152, -871424, -994816, 194560, -130560, -551936, -1051648, -68096, -284160]
8020b84160C23584d72064F00064c47648j96608K44224o6560j66912k0992a33120
8009C22560d03968J01888j038848c42016q9600J93024G54688h33536j96096L73760
7999f55872m26496E44768J20320a19296l4304l40480B88256a08032B58048a66912
7988d98688N5808d4544m72064L5840R2672C60448C9936b2016m79232p64928c47136
7976a246720C5328P35744E2224K49856e41184J28512B2016i41568c45600C64032
7965C584L65568f01088a2800l65056F144a0240C09760j6896f58944g5776m59776
7954e35552n20704D77696k29888D096J82272d47488G94112f29248Q1408q99584
7944a447424B85696L30240h77056J05472d3008o4512k53952c2768k30400D16768
$$ y = [-284160, 323584, -472064, 600064, -347648, -544256, -300032, -366592, -533504, -554496, -133120, 322560, -403968, -302080, -1340928, -342016, -431616, -238592, 754688, -833536, -1029632, -655872, -1082368, 544768, 665088, -119296, -153600, -494080, 288256, -108032, 258048, -166912, -498688, -442880, -44544, -516608, -480768, -388096, 360448, 39936, -22016, -501248, -1266176, -347136, -1246720, 35328, 771072, 52224, 302080, -541184, -412672, 22016, -941568, -345600, 364032, 3584, 369152, -601088, -12800, -377856, 6144, -10240, 309760, 292864, -658944, -75776, -535552, -1056256, 477696, 247808, 4096, 186368, -447488, 794112, -629248, -547840, -1447424, 285696, 615936, -877056, -771584, -43008, -107520, -361472, -32768, -263168, 416768]
7933e7344j84832m25472K39616a02912m29568J09568E95968c03616i3184m57216
7923e50400B5088d80256n25312c22048m1472r77920i8304j32096n90848b83136
7912e8368A92000K27328e86752K02240j95072B63680c8912m07552j27488a36192
7901c57888k79040k92352a14176j82784A04960h6528j25440B89792J75616e14048
7890D11648a14688L3792k29888D54144a34656n73952F08768j42848d62848q82688
7880a345536f44096A02400e32480A8432L49696a14688B18112J37216j3824F4512
7869C4816h68864L2768A00864d52096J31072j09568F6560a014272D59776J96096
7859F55872a264640G680K59584m608e25312J71520m17280B81088b3552n06368
$$ y = [-57344, -242176, -667648, -428032, -102912, -532480, -422912, 595968, -303616, -93184, -550400, 25088, -480256, -1005568, -322048, -363520, -1341440, -98304, -230400, -821248, -283136, -58368, 192000, 419328, -586752, -384512, -579584, 263680, -38912, -446464, -573952, -136192, -357888, -636928, -929280, -114176, -296960, 104960, -86528, -211968, 289792, 465408, -514048, 411648, -114688, -80896, -310784, 454144, -134656, -708608, 608768, 465920, -462848, -1345536, -644096, 102400, -532480, 18432, 368128, -114688, 218112, 355328, 341504, 64512, 34816, -868864, -836096, 100864, -452096, -321024, -430592, 66560, -1014272, 459776, 655872, -1264640, 7680, 267264, 262656, -525312, -353792, -771072, 281088, -23552, -529920]
7849e29920F0928g6288A1264a036800G92064l50720c1744k70848E31968A92512
7838a474048d14720m87936A334784b51392k81088J89952r23136c79392A17760
7828A82784g34720j76640I84064a23392j409536C15392P8336h46336J31072b89792
7817a109504b32448o78400J38240D59776P168d82816l13856h1920r52320G40864
7806d68992a73568B48832e79584q51456E47840c24096n94432k58048C97312K10432
7796F07744h59136L87072A59232b59072m7104C38944n6320b06848a1264B53952
7785a22880n2224F46656f38976J94048D44928j77152a131520c75296J8944j20832
7775d77184J82784r39520I35424i82528A21344c1232p55712E1200N66784k41152
$$ y = [-529920, 60928, -76288, 11264, -1036800, 792064, 441344, -31744, -302592, 531968, 192512, -1474048, -414720, -902656, 1334784, -251392, -532480, -342528, -1265664, -379392, 117760, 182784, -734720, -911360, 984064, -123392, -1532928, 315392, 393728, -846336, -715264, -289792, -1109504, -232448, -910848, -772608, 459776, 466944, -482816, -796672, -81920, -1034240, 740864, -468992, -173568, 248832, -579584, -1431040, 547840, -324096, -918528, -1176576, 397312, 607744, -859136, -472064, 159232, -259072, -306176, 338944, 282624, -206848, -11264, 253952, -122880, -175104, 646656, -638976, -444928, 444928, 267776, -1131520, -375296, -356352, -477184, -294400, -1233920, 935424, -982528, 121344, -31232, -786944, 51200, 617984, 376832]
7765C76832K20672J90976R2672c26656C1744L50208a03424k99008f8096G17824
7754h32000a01376A198080b74432j39776n12i7792m61312j57696C5840b19136
7743H70400i83552D3520K15552a132544L66080B64192b54464L3280k26816A449472
7732a95584n42208A238016k02240d5568j21856q25856N4784b74944B14016a04448
7721d25984j45408J47456q1920b08384H7552D608g1168o30784a47456q4480l0720
7710b62656A24928a054720C02080I8304J096704d87424J48480l8400r5232D19328
7699D26496j19296a551360b54464k20160A61280J87392c77856I8816N0688O20032
7689G69536a25440C24096b94400j29536k82112I8816f15424d4544j224192N19680
$$ y = [376832, 597504, 788480, 881152, -326656, 31744, 381952, -103424, -402432, -68096, 717824, -832000, -101376, 1198080, -274432, -414208, -414720, -97792, -559104, -716800, 35840, -219136, 870400, -983552, 43520, 259072, -1132544, -766464, 264192, -254464, -221184, -448000, 1449472, -195584, -737792, 1238016, 1035776, -45568, -167424, -993280, -938496, -274944, 214016, -104448, -425984, -571392, -423936, -505856, -208384, 87552, 4608, -71168, -701952, -147456, -231936, -262656, 124928, -1054720, 302080, 98304, 1195008, -487424, -338944, -377344, -472576, 419328, 426496, 307200, -1551360, -254464, -474624, 161280, 348672, -377856, 98816, 149504, 769536, -125440, 324096, -294400, -423936, -706048, 98816, -615424, -44544, -1268736, -749056]
7679g49056C34336f06720j92000O7072f6560r86624A057280A54112d87424N8368
7669d29056I59488C10784i3696l68128A7920O30272a30560B70848i16480F78912
7658H55552f1952C88096e83680a35680n97504a99680D66944A47968a30560k12992
7648c43552l18976k0480C90144A16736K93888b43200D19328a51040E44768i80992
7637E83680b26816n08928B83136B048e69856C14880i8816H5504a39776n21216
7627f60992b84160D53632O99904d98688l21024d04992I26720A69472K048K25792
7617C97312g39328d3008C98848A20320N5808f23104c06176C09760K76480c79904
7606G87456c9936p39840c10272k59584K51904I9840g5776m03968B43200e96480
$$ y = [-749056, 334336, -606720, -798720, -731648, -66560, -1053184, 1057280, 154112, -487424, -429056, 959488, 310784, -93696, -461824, 17920, 648192, -130560, 270848, -916480, 678912, 855552, -61952, 388096, -583680, -135680, -733184, -199680, 466944, 147968, -130560, -343552, -662528, -683008, 390144, 116736, 410624, -243200, 419328, -151040, 544768, -980992, 583680, -226816, -735744, 283136, 2048, -569856, 314880, -98816, 85504, -139776, -660992, -284160, 453632, 1153536, -498688, -819712, -404992, 926720, 169472, 171520, 397312, -739328, -43008, 398848, 120320, 176128, -623104, -306176, 309760, 586240, -379904, 787456, -39936, -779776, -310272, -569856, -317952, 99840, -75776, -479744, 243200, -596480]
7595g63904L40480B20672O87104l20512a076224e05856J45920L584F83008a365504
7584a57696p77728b560A79200a277952C93728c54816m01920q2944l17952a03936
7573E67296a94560o71744G1168f79424b50368D34176c23584k60608B78528a14688
7562D1984J203200a101824F8096g31648b06336j96608b560D61824k18112D096
7551h92928c7888n632l44576o55360e15072l88608a44384p17824E5296K7136K92352
7540C74784f44096b8160G60320f8096k20160j03936M7104p8848P1168a00352D37248
7528G5776e46304H05888b56000D49024J30560d28544l19488L47136r6768H2432
7517c76832D76160K36032e7856n04320q76032b00704c7376m9664n63712b35520
$$ y = [-763904, -423424, 220672, 907776, 587264, -1076224, -505856, -359936, -356352, 683008, -1365504, -157696, -935424, -2560, 179200, -1277952, 393728, -354816, -756736, -839680, -1157632, -103936, 567296, -194560, -866304, 71168, -679424, -250368, 434176, -323584, -584192, 278528, -114688, 41984, 1245184, -1101824, 68096, -731648, -206336, -402944, -2560, 461824, 243712, 4096, -892928, -37888, -43520, -388096, -1043456, -515072, -903680, -144384, -862208, 55296, 82432, 374784, -644096, -28160, 760320, -68096, -288256, -392192, -345088, -423936, -352768, -100352, 437248, 75776, -546304, 805888, -256000, 449024, 579584, -428544, -748032, -400896, -497664, 82432, -376832, 476160, 712192, -57856, -562176, -1438208, -200704, -37376, -87040, -650752, -235520]
7506E25824i29280L1744B00704n2224b83136A64352G7824j4336K65216a94560
7495d93568C3280O9120e10464k29888j75104c06688a08544D08064d20352A28000
7484h80128k82112b2528A59232e12000M5056C0208P8336c89120D52608A17248
7473I00096N8880l59936j54624c24096m6080k21184F08768A69984f36416A05984
7462a488896K88256D31104e89824l1232j65376b38592k4064m45440c11296D65920
7451a52576B27840A13152Q82688j78688f84032A325568B80064f76864j14688B33984
7440B44224b92352l6352j38240J57696j26976o9632A48480c97824d5568o83008
7430g28576A02400B7136e04832C65056A71520e88800j61792C97824f28224D30080
$$ y = [525824, -929280, -897536, 200704, 148480, -283136, 164352, 77824, 63488, 328704, -194560, -493568, 33280, 102400, -510464, -740352, -915456, -306688, -108544, 408064, -420352, 128000, -880128, -1162240, -22528, 159232, -512000, -466944, 30208, 108544, -389120, 452608, 117248, 900096, 958976, 599040, 444416, -324096, -370176, -591360, 608768, 169984, -636416, 105984, -1488896, -1200640, 431104, -589824, -621056, -786432, -238592, -262656, -708096, -311296, 465920, -152576, 227840, 113152, 995840, 817152, -684032, 1325568, 280064, -676864, -791552, 233984, 244224, -292352, -328704, -466944, -309248, -436224, -505856, 148480, -397824, -45568, -728576, 102400, 27136, -504832, 365056, 171520, -588800, -750592, 397824, -628224, 430080]
7419d25984J94560F14912f2464A94048m0448a2800j024j54624B09920J81760I4208
7407a15712I90208i36448a02912H96512g60320a29024n41184A80736d27008g2192
7396A1776i15456b5600B57024R97888b96448N120A008128B61632E4272e62688
7385c67104i5232G36768e81120b11456B8160b8160l67616D38272M20864d32128
7374g62368A92000i13408G91552h50432A9968a82272j379328L52768b55488g8848
7363B67264e61664C37920c61984H02304l83488j57184f57408A050112B64704J42336
7353D07040J83808k80576d07552J93536E54496d54144B63168J55136g80800b8672
7342A06496J39776c12320A071104b42688m27520m08064c39456g4752m91008A17760
$$ y = [-425984, -231424, 614912, -62464, 194048, 153600, -12800, -13824, -168448, 209920, 391680, 94208, -115712, 990208, -936448, -102912, 896512, -760320, -129024, -670208, 180736, -427008, -72192, 11776, -915456, -25600, 257024, 1254912, -296448, -291328, 1008128, 261632, 54272, -562688, -367104, -95232, 736768, -581120, -211456, 28160, -28160, -395776, 438272, 859136, -432128, -762368, 192000, -913408, 791552, -850432, 19968, -182272, -1561600, -1208832, -255488, -78848, 267264, -561664, 337920, -361984, 802304, 418816, 261632, -657408, 1050112, 264704, 407040, 590848, 310272, -407552, -214016, 554496, -454144, 263168, 418304, -780800, -28672, 106496, 246272, -312320, 1071104, -242688, -670208, -1078272, -339456, -74752, -565760, 117760]
7331b20672k56000i6256E55520A63840J39776d77184j4848a23392m67968K90304
7321c01056E60640a106944A36192a294336K62656e8880A317376e42208l7376j10080
7311f89664n84192C85024b57536j72032i9328A40288J260544o97856f04160J12128
7301d92032j89952D31616c46112a54112e2736A67424m0448d30592D37248b67264
7290d88960j68960j59744E10976B40128a80736f0928j14688F40000g32160a54624
7279b38080O656C01056h4992G56224j5872B6112J68960a66400I73312m80768J19296
7268F11840k89280b39616A241600C39456c79392E67808d37760P680k52416r1136
7258g73632A172480F6048a80736G6800A2800J50528g69536K05312E22752c26656
$$ y = [-220672, -476672, -96256, 555520, 163840, 303616, -477184, -492032, -123392, -591360, -301056, 560640, -1106944, 136192, -1294336, -1031680, -58880, 1317376, -542208, -579584, -689664, -1273856, 385024, -257536, -429568, -99328, 140288, 1400832, 702976, -604160, -492032, -681984, 431616, -346112, -154112, -52736, 167424, 126976, -430592, 437248, -267264, -488960, -657920, -817664, 510976, 240128, -180736, -60928, -175616, 640000, -732160, -154624, -238080, -231424, 301056, -84992, 756224, 740352, 26112, 195072, -166400, 973312, 492544, 611840, 322560, -239616, 1241600, 339456, -379392, 567808, -437760, -430080, -682496, -773632, 1172480, 66048, -180736, 76800, 12800, 163328, -769536, -564224, 522752, -326656]
7247H18688C78880b59072C96288a389568c92704j88928B51904A1776N93408c28704
7236A263616B97472M21888b00704h7040F67648b2528j15200C14368f01088A406976
7225B18624L72224J63328a079296A5872K25280a100800N44768l34848l32800k74432
7215a498112d36736J48992H07936b25280A369600F08256a125888F63552I3184
7205B52416C7376L14368j17248c1744F68672i68704h2432r5232q84736c7888j10080
7194a47968A43872h05888E26848j37216a11104F06720d33152b0480m09088C47136
7183D85376n0176i6768J1776D62848c3792H9088N80608c14368M3008r216A02912
7171B52928M6592a45408E32480B9184M81792g23456B32448a83808I88160c10784
$$ y = [818688, 378880, -259072, 396288, -1389568, -392704, -581632, 251904, 11776, 605184, -328704, 1263616, 297472, 719360, -200704, -87040, 667648, -22528, -137728, 314368, -601088, 1406976, 218624, 590848, 754176, -1079296, 15872, 241152, -1100800, -556032, -890880, -1223680, -1498112, -436736, -287744, 807936, -225280, 1369600, 608256, -1125888, 663552, 93184, 252416, 37376, 351744, 234496, -31744, 668672, -968704, -82432, -177664, -1062400, -37888, -147968, 143872, -805888, 526848, 389632, -111104, 606720, -433152, -20480, -429568, 347136, 485376, 435200, -96768, -84992, 462848, -33792, 89088, 669696, -314368, -271360, -280576, 102912, 252928, 299520, -145408, 532480, 29184, 510976, -723456, 232448, -183808, 988160, -310784]
7160e23776K05824C78368e58080G35744a148928a75104j2288l42528D23936a07520
7149B38592f30784c0208D27520c17440C05664N90848C9936h192D34176b8672H6016
7137a09568A270784h23808D66944b60608A03424h05888L97312B15040a26976D4032
7126A43360L40992j32096f7584C19488i1136j45408j90464F24128h2432o25152
7116g07584c42016j4848o10304J32096B11968J57696j6896k048Q96512c80928
7105h85760a82784A35168B8672c15904C12832J152512D29056d52096G35232e18144
7094c04640B05312e52448l30752D94592g88992M9664k80064B1504R63584e28896
7083a175040B67776a003520F83008b49344k26816a87904C13344c66080D6080N81120
$$ y = [-523776, -317952, 378368, -558080, 735744, -1148928, -175104, -187392, -529920, 423936, -107520, 238592, -630784, -30208, 427520, -317440, 305664, 896512, 39936, -8192, 434176, -28672, 86016, -109568, 1270784, -823808, 466944, -260608, 103424, -805888, -408576, 215040, -126976, 44032, 143360, 484352, 352256, -67584, 319488, -91136, -236544, -427008, 624128, -82432, -707584, -342016, -356864, -967168, -835072, 211968, 369664, 352768, 350720, 1247232, -380928, -885760, -182784, 135168, 28672, -315904, 312832, 1465344, 429056, -452096, 735232, -518144, -304640, 205312, -552448, -883200, 494592, -788992, -739328, -1019392, 21504, 985088, -528896, -1175040, 267776, -1003520, 683008, -249344, -476160, -187904, 313344, -366080, 46080, 627200]
7073F27200c65056A74592K11456e21216K46272D14720h40704c36896A357312e82144
7062A8432i16480A038848C73760g43936A82272g88480E9904K95424K42688B79552
7051F57408a036288d72576A10080l1232B2528N1200L8912J03424o1440M6080K78016
7040D78720d63872F89664H192N06880e04832K08384D94080p0144P680G168c67104
7028A14176c39968l17440K91840k99520n25312C3280j3312e05344p28064L69664
7018h63744J38240J17248K54464E3248J171456l08224B33984G7824J08544K63680
7008D50048j30048b90816j55136F4000M3008C3792b82624h7040j65376k11968
6998d64384A90976h58624B25280J11104g43424K73920C5328Q1920N84192a3824
$$ y = [627200, -365056, 174592, 386048, -521216, -274944, 414720, -840704, -336896, 1357312, -582144, 18432, -916480, 1038848, 373760, -743936, 182272, -788480, 59904, 355328, 598016, 279552, 657408, -1036288, -472576, 110080, 78848, 22528, 73728, 112640, 216064, 154624, 200704, 478720, -463872, 689664, 8192, 515072, -504832, -296448, 494080, 423936, 431616, 7168, -367104, 114176, -339968, -657408, -365568, -665088, -1190400, 33280, 19968, -505344, -1233408, -863744, -725504, -608256, -353792, 53248, 1224704, 916480, 233984, 77824, 186368, 450048, 320000, -290816, -445952, 64000, 107008, 33792, -282624, -87040, -252416, -464384, 190976, -858624, 225280, 336384, -743424, -469504, 35328, 117248, 701440, -13824]
6987E23264O05184h05376A86368H704M24448b79040l38944I6768a54112k87232
6977d41344E22752C5840f64576B27328c91168q64256D42880d3520l24608f8608
6966a28512E86752h42240K25792h2432l71712n7344D67456b06336P4240l72736
6956e04832J96608F92224J61280c27680B61632J96096n12N41184f97856D19840
6945e54496a71520q9600k24768J85856B19648c41504H32000k94400j9456N86752
6935A104896A28512c09760j37216a57696o19520c66080l1744A89440a57184m096
6925a61280a9968m96128G168J065984D60288R60512f49216F03136c73760p20384
6915a094144H45824D09088M95616m12672K06336c17952J28000A58720e13024J76640
$$ y = [523264, 1128448, -805376, 186368, 8704, 433152, -279040, -617984, 96768, -154112, -441344, 522752, 35840, -664576, 227328, -391168, -1255424, 442880, -43520, -368128, -68608, -128512, 586752, -842240, -616448, -82432, -454144, -511488, 467456, -206336, -132096, -504832, -308224, 692224, 853504, -327680, 261632, 457728, 457216, 998400, -697856, 419840, -554496, -171520, -261120, -485888, -300032, 219648, -341504, 832000, 537600, 518144, 1104896, 128512, -309760, -446976, -157696, -777216, -366080, -397824, 189440, -157184, -161280, -19968, -516096, 7168, 1073152, 460288, 1420800, -649216, 603136, -373760, -1094144, 845824, 409088, 904704, 492032, 698368, -317952, -189952, 158720, -513024, -336384]
6905c36384D40832a354752A26976a000448b71360F85568e90848C88096D608g75680
6894B67264P52128c43552B59584M58240B60608a62304H46336c21024B25280L8912
6884B64192R46176C06688L78368J39776e61152e3248j32608G79776C72224h0384
6873E37088a54112B20160L03104c84512l52256F54848j36192E12J314304a178624
6862e09440B89280r1136J61792O24128j85344a130496B92352e52960l24096G57248
6851A59232a81760p7312B37056A05984i8816A3824a38752r43616D5056I216a024512
6839d608j13664G26528b84160g3216n91872H33536A26976f47680D07040M02944
6829H09984a095168K40128I73312C06176b560A88928L80416K9184p7312a21344
$$ y = [-336384, 440832, -1354752, 126976, -1000448, -271360, 685568, -590848, 388096, 4608, -775680, 267264, 1019392, -343552, 259584, 717824, 260608, -162304, 846336, -321024, 225280, 264192, 1210368, 306688, 685056, 824832, -561152, -53248, -185856, 779776, 372224, -80384, 537088, -154112, 220160, 523264, -384512, -736768, 654848, 518656, 512, 1314816, -1178624, -509440, 289280, 198144, 359936, 984064, 798720, -1130496, 292352, -552960, -877056, 757248, 159232, -181760, -259072, 237056, 105984, -98816, 13824, -138752, -1082368, 45056, 9216, -1024512, -4608, -118272, 726528, -284160, -73216, -665088, 833536, 126976, -647680, 407040, 809984, -1095168, -855040, 973312, 306176, -2560, 188928, 569344, 598528, 521216, -121344]
6818B60608A7920M76160b02240k95936F144K37056N52448A2288Q43264e34016
6807H56064e88288K10432A48992M53632A03936P74656e12512n09952D76672h27392
6796b91840F7072n120O23104E6832P81824i03680b048A128448D32640h83200E5296
6784c69152H1920L20512A44384o8608b71872B141696C30752e8368j60768P5264
6774a43872O7584o23616a32096n40672l03616J45408H98560h60672n36064f36928
6763C7376h66304b560j38752O0928m97152J23904J38752H99584g74656F36928
6752E08928o1952j83808J34656J433600a054720C29728e1200j71520l2256J6384
6742b38592E49888j23392b90816C31776M37248J71008D24960J63840a07008d3008
$$ y = [260608, 17920, 494080, -202240, -498176, 6144, 243200, 795648, 12288, 855552, -534016, 856064, -588288, -377856, 148992, 602624, 103936, 878592, -512512, -1022464, 476672, -827392, -291840, 67072, 61952, 685056, 56832, 838656, -903680, -2048, 1128448, 432640, -883200, 55296, -369152, 81920, 402432, 144384, 75776, -271872, 2141696, 330752, -58368, -219136, -143872, -76288, -699904, -132096, -672768, -976384, -830976, 898560, -860672, -1396736, -636928, 37376, -866304, -2560, -141312, -80384, -577536, -453632, -314880, 899584, -774656, 636928, 508928, 446976, 263168, 397824, 1831424, -1054720, 329728, -51200, -222720, -254976, -238592, 549888, 426496, -290816, 331776, 769024, 940032, 424960, 588800, -107008, -43008]
6731c75808C48160A536c23584j60256b12480F83520A35168O16960j48992f20032
6720b41152k20672F95296h43776F34368e12000C92704A76128L14880i50272M41344
6710e08928k81088E61664o8608b84160l00032G28064k93376E9904M38272k23232
6700B74944j8432A13664f14400E38624P06560a04960H81152o8608b16576B07360
6689A85344b40640C38432c71200j58208G70560b01216j51040N7344A248256g97184
6678e31968B57024a313280E69856c57376G63392b15040A4336O16448e91360A138176
6667h83200D8128L55840a50016k0480C99360a78176k31936B16064b58048D78720
6656D38272D6592e3760A44384Q86272f13888D5056f1952m50048A05472K76480
$$ y = [-375808, 348160, 1536, -323584, -483840, -212480, 683520, 135168, 752128, 603136, -620032, -241152, -461824, 695296, -843776, 634368, -512000, 392704, 176128, 491008, -950272, -508928, -790016, 561664, 493056, -284160, -584192, 728064, 434688, 59904, 498176, 274944, 256512, 113664, -614400, 538624, 1245184, -104960, 881152, 812544, -216576, 207360, 185344, -240640, 338432, -371200, -529408, 770560, -201216, -352256, -294912, 1248256, -797184, -531968, 257024, -1313280, 569856, -357376, 763392, -215040, 14336, 630784, -591360, 1138176, -883200, 48128, 403968, -150016, -170496, 399360, -178176, -410112, 216064, -258048, 478720, 438272, 46592, -53760, 144384, 1030656, -613888, 45056, -61952, -512000, 105472, 381952]
6646C81952A37728J48480P32672c51744A23904b7648B05824J024O29248j0752
6636H25344d16768m2496a93024l7888m22912n4272D17280H0896f43584a84320
6625c12832E01760E1200i216F7584d98176C85536i1648A87392C072h06912b77504
6613f46656A75616D9152P168L26656c072o15936a25952F16448c48672j88416i7280
6601D46976a9456j63328A58208Q19200k36544Q98048G33184I4208d94592A9968
6590H02304j04448P57760c584n32992I23136A6896J337856e00736m98688F15936
6579C91168e2736F72768b15552M4032B85696h13568F36416d20864F4000i42592
6568e99552B10432a001472A142272e05344J57184B38592e8368r58464b24256B54464
$$ y = [381952, 137728, 286208, 1018880, -351744, 123904, -27648, 205824, 206848, 836096, 825344, -416768, -459264, -193024, -230912, -653824, -708096, 417280, 80896, -643584, -184320, -312832, 501760, 51200, -9216, 67584, -498176, 385536, -91648, 187392, 3072, -806912, -277504, -646656, 175616, 49152, 56320, 382976, -3072, -619008, -125952, 616448, -348672, -537088, -97280, 446976, -19456, -182784, 158208, 977408, 740864, 1638912, 733184, 94208, -494592, 19968, 802304, 697856, 1455616, -3584, -536576, 923136, 16896, 1354752, -500736, -999424, 615936, 391168, -52736, 672768, -215552, -171520, 285696, -813568, 636416, -420864, 64000, -942592, -599552, 210432, -1001472, 1142272, -505344, -348160, 238592, -58368, -1016832, -224256, 254464]
6557c45600n4272J69984j1776m78720j23904j60256c38432k45760d5568B15040
6546e9904B8160Q86784D55168f62528h1920n71904D6592Q69888B10944K97472
6536E08416A46944L8400e0688b3040D40832E7856J78688G3216b7136n10464G6800
6524E19168M54656f0416o82496D58752Q14080e70368D23424c25120m6080J33632
6514b37568M9152D1984O71744K18112C58912Q7552N19680D10112a3312A00352
6503b39104B28864j03424K75968A42848K56512q9600J633792d24448B64704j32096
6493A32608R84064a111040A11104K92352R4208c3280C46624a85856E85728d94592
6482H12544i9840B82624J2800c74784D89472L57888C01056m9664O9632J32096
$$ y = [-345600, -399872, -229888, -241664, -720384, -844288, -1004544, -338432, -584192, -45568, 215040, -59904, 28160, 914944, 455168, -662528, -81920, -653824, 46592, 916480, 210944, 508416, 146944, 185344, -50688, -23040, 440832, 57856, 236544, 73216, -27136, -537600, 76800, 519168, 973824, -60416, -742912, 458752, 1272832, -570368, 423424, -325120, -371200, -237568, -188416, 41984, 713728, 931840, 358912, 446464, 966144, 410112, -13312, 100352, -239104, 228864, 125440, 401408, 142848, 399360, 309760, 1943552, -424448, 264704, 132608, 1116672, -1111040, 111104, 403456, 497664, -33280, 346624, -185856, 585728, -494592, 812544, -99840, 282624, 295424, -374784, 489472, 847360, 301056, 251392, 321024, 453120]
6472D53120N91360D17280c11808F09280k26816a4336j204736M18304J88416A040896
6461C70176J66400k40640a170944E22752k30912r2672L1744N22240j58208A19296
6450D61312a59744E22240G2704f656E37088e50912b09408H82176f20544E51424
6439E55008A6896O04160g3216j1264C76320a6384j95584B98496P79264C91680
6428A65888n4272b85184H92416j94048K65216C1232a009664d22400E73440e5808
6417A952768e3760I23648a10592A14688O6048R86112M8128C13856J03936c0208
6406c47136Q8576l02080G9872J206784b32448m74112E19168P4752j54624b12992
6395C10272r4208a4848D75648a003520G17824g30112H04864c06688A95584a42336
$$ y = [453120, 1044480, 417280, -311808, 609280, 382464, -14336, -1219072, -800768, -612352, 1040896, 370176, 536576, 295936, -1170944, 522752, 291840, 199168, 230912, 753152, 594944, 119296, 461312, -159744, 522240, 72704, -6656, 537088, -550912, -209408, 882176, -620544, 551424, 555008, 16896, 621056, -73216, -84480, 376320, -16384, -211968, 298496, 1077760, 391680, 165888, 111616, -285184, 892416, 698368, 963584, 31232, -1009664, -422400, 573440, -55808, 1952768, -53760, 923648, -110592, 114688, 180736, 1166848, 1214976, 313856, 417792, -30208, -347136, -258560, -560640, 79872, 1286656, -232448, -706560, 519168, 593920, 439296, -212992, 310272, 216064, -14848, 475648, -1003520, 717824, -730112, 804864, -306688, 195584, -142336]
6384H34048k85696b33472m86912F96832H2944b18112G4752L97824b06848n65760
6374g72608E40672A03424e25824F62528c23584I38496A41312L7376K58048C4304
6363B9184a577984C03616F656b38592G00928m3520b9184B32960a02400r04192
6353a006592b37568B16576L62496f32832b31424E59104c47648N1200C24608b35520
6342G71584l2256B08896b5088F52288B67264c63008I48224A61792M26496A05984
6331A10592b56000g4752m49024H7552d11136e1712H40704J59744d77184F45120
6320e76000b27840A52064P8848P08096b12480C9424e0176m09088J98656e12G25504
6308B06848h35584B29888A04960D9152M82816j83296P40352a08032m608A2288
$$ y = [834048, 548352, -233472, -720384, 696832, 82944, -218112, 74752, 472576, -206848, -772608, 540672, 103424, -525824, 662528, -323584, 938496, 141312, 178688, 436736, 34304, 29184, -1577984, 303616, 6656, -238592, 700928, 657408, -29184, 232960, -102400, -1006592, -237568, 216576, 579072, -632832, -231424, 559104, -347648, -296448, 324608, -235520, 771584, 739328, 208896, -25088, 652288, 267264, -363008, 948224, 161792, 588288, 105984, 110592, -256000, -74752, -523776, 87552, -411136, -51712, 840704, 1000448, -477184, 645120, -576000, -227840, 152064, 230912, 939008, -212480, 39424, -50176, -459264, -260608, -512, 725504, 206848, -835584, 229888, 104960, 49152, 531968, 348672, 1089024, -108032, -112640, 12288]
6297D38272j53088K53440K05824a54624A344000c33312F73280b61120B60608c02080
6286e0176j8944I8816O4000a041408B06848M10112E8368a22880j52064A76128
6275a53088l55840A048576C64544q0896O53824c18464a51552I31840a99680k38592
6265d38272A042432C13856g4752H6016K75968c74784a03936j7920l08736k76480
6255g07072J78176a6384I98912C99360N67296l35360a45920A376256C21536L4816
6245C56352h77568b71872B32448P3728R0112G8336M27520i03168c38432q9600
6235d28032C88608O70720C01568q704L072a1776A44384K24768j23392D7616d27520
6223A277952C5840c64032A76640h32512C87072N51424f41536H01792k27840B01728
$$ y = [438272, 285184, 538624, 744448, -154624, 1344000, -333312, 673280, -261120, 260608, -302080, -50176, -69120, 98816, 162816, -1041408, 206848, 616960, 58368, -122880, -274944, 176128, -153088, -508928, 1048576, 364544, 283648, 937472, -318464, -151552, 931840, -199680, -438272, 1042432, 313856, -74752, 86016, 361984, -374784, -103936, -121856, -430592, -707072, -528896, -16384, 998912, 399360, 966656, 631296, -145920, 1376256, 321536, 356352, -877568, -271872, 232448, 306176, 396288, 78336, 505856, -903168, -338432, -428032, 388608, 1059328, 301568, 292864, 295936, -11776, 144384, 369152, 245760, 47616, -427520, 1277952, 35840, -364032, 176640, -832512, 387072, 938496, -641536, 801792, 573952, 201728]
6212a42848p3728F57920B0992L82976d56192a57184j62304J5360F92736J39776
6202H32512b23744B10432L36384M94592D47488j9968B2016d35712m52608D13696
6191b0480k68288E37088b34496d3520k47808C92192b47296E90336j79712a83808
6180e22752E79072K00192a46944A57696R90720E25312B57536g2192D80256L45088
6170H25344h3968G36768e7856G21408a45408A75104L39456J25440k34496L81952
6160G87456C89120N27360I5232A4848K71872f2976G91552d608p6288H08960B60096
6148D3520h20224B7648a55136A446400c76320A017344a43360k65728G45472d87936
6137a64352D89472A36192K74432K97984l44576N17632k61120J4848M52608A97120
$$ y = [-142848, -216576, 657920, 20992, 403968, -456192, -157184, -319488, -304128, 692736, 832512, -223744, 210432, 546816, 1041408, 447488, 427520, 22016, -435712, -888320, 413696, -20480, -288768, 537088, -234496, -43520, -291328, 392192, -247296, 590336, 410624, -183808, -522752, 579072, 779264, -146944, 157696, 1148416, 525312, 257536, -72192, 480256, 825344, -83968, 736768, -57856, 721408, -145408, 175104, 514560, 640000, 405504, 787456, 389120, 916480, 95232, 14848, 286720, -62976, 791552, -4608, -80896, 808960, 260096, 43520, -820224, 27648, -155136, 1446400, -376320, 1017344, -143360, -409088, 745472, -487936, -164352, 489472, 136192, 410624, 708608, 364032, 881664, 620544, 635392, 1088000, 197120]
6126A13152J67936L41504d68992E7856P36768B36544b07360G78240B47296o3488
6116A83808J05472N96480B56512L9424c13344E87776K40640g6288D1472a29024
6105D01920J27488K0992a71008Q192q3968I89184B8672j1776i9840D96128K74432
6094G70560D6080N43232j35168H704J182208m30080A56160c2256l00032C23584
6083E73952l8912F8608c01056K6624A060864k10432f51776H4992J82784A5360
6072F9120h97536G50080C2768N20704N92384A34144l584a41312B60608L7376b19136
6060C81440J124352h94464H3456R83552D49024L44064I728O22080f2976A575936
6049D32640J39264d54144G00416C9936J26976L03616R48224a63840J7920I9328
$$ y = [113152, 281088, 622592, -468992, 57856, 794624, 236544, -207360, 778240, 247296, 183808, 289280, 885760, 256512, 295936, -313344, 587776, 828416, -76288, 41472, -129024, 401920, 529408, 550400, -171008, -162816, -246784, 989184, 28672, 16896, -99840, 496128, 770560, 46080, 589312, 454144, 8704, 1190912, 760832, 156160, -32256, -332288, 323584, 573952, 535040, 68608, -301056, -274432, 1060864, 850432, -651776, 84992, 267776, 15360, 69120, -897536, 750080, 32768, 553472, 1145856, 134144, 130560, -141312, 260608, 297984, -219136, 381440, 1505792, -894464, 83456, 1067008, 449024, 793088, 9728, 631808, -62976, 1575936, 432640, 571904, -454144, 700416, 39936, 166912, 470528, 1418752, -163840, -145920, 99328]
6038E74464N63712E51424b68800P7312A170944b57024j61280A36192L27680c98848
6027H3456K294272H80640C01056N73952A1264a1264D08576a35680F33344k45248
6017C88096J9968j98144M14720Q2432a48480H37632A62304a73568G07584J06496
6007H14080k13504O55360D03456N13024A89952a87904l13856A78176b8672E4784
5996A253888i0112F80448D3008J061888A20320J117696a91488I54368A84320L49696
5986E34016J86880k21184c4304G58272B99520K46272b21184A125888C47136a88928
5975a75104k03264G23456j4848B42176k3040M42880k57536f7584D51584O5024
5965E16608k20672M51584a63840C25120J73056R216A76640a47456D24448c88608
$$ y = [574464, 1138176, 551424, -268800, -191488, 1170944, -257024, -418304, 136192, 463872, -398848, 83456, 2377728, 880640, 301056, 875008, 11264, -11264, 408576, -135680, 633344, 388096, 408064, 209920, 624640, 707072, -148480, 837632, 162304, -173568, 707584, 814080, 600576, 1255936, 403456, 916480, 189952, -187904, -501760, 178176, -28672, 54784, 1253888, -90112, 680448, 43008, 1104896, 120320, 1238016, -191488, 954368, 184320, 534016, 720896, 499712, -34304, 758272, 299520, 545792, -221184, 1125888, 347136, -188928, -175104, -378368, 723456, 708608, 242176, 219136, 662016, 404480, -67584, 451584, 516608, 295936, 747520, -163840, 325120, 498176, 507392, 176640, -147456, 424448, -388608]
5954b58560E00224R11872j15200F12864F1952a02400E41696i26208b95424I34912
5943A11616P10656b15552A92000M43904j46432R8816H0896b28864A26976O80960
5933H07936C75296g38816i9328B65728A18784K37056d7616B32960M15232N86752
5923A234944n40672R39520d5568B67776A2288O07744B47808h5504a7920F78400
5912f60992I33888D61824l3280n120m0448L24608b08896E90848J48480j31072
5902F08256J26976A8944N58592a02400D57728K90304f5536e120A47968F6048L93216
5891D59264P2192N17120n6320l28704E2736b31424m8640A074176A1776B048K54976
5880B57024c81952E69344K35520B51392J207296F87104k02752d22912E58592b24768
$$ y = [-258560, 500224, 1412096, 1296896, 612864, 61952, -102400, 541696, -926208, -295424, 934912, 111616, 822272, -215552, 192000, 635904, 489472, 588288, 80896, -228864, 126976, 807936, 375296, -738816, -99328, 265728, 118784, 355840, -47616, 232960, 648192, 1234944, 694272, 1633792, -45568, 267776, 12288, 620032, 247808, -85504, -17920, 678400, -660992, 933888, 461824, 428544, 423424, 382976, 707584, -208896, 590848, 739328, 608256, 735232, 18944, 577536, -102400, 457728, 748032, -65536, -5120, 147968, 66048, 459264, 531456, 1048576, 992256, 663552, 52736, -231424, -280064, 1074176, 11776, 2048, 257024, -381952, 569344, 804864, 251392, 1458688, 687104, 484352, -422912, 558592, -224768]
5869H75520A95072J060352c93728j22880A522176G08608B97984J34656f2976A240576
5858D64896M13184J07520C91168a18272N6320B87232d78208E63200J65888J67424
5848H96512L06176B64704j31584B3552K49344I8816b8672C24608d96128D88960
5837C38432M71552r216K44736o0928A62816J9968J034240n15072l13856j45408
5827B42688K02240b44736F00576L08736B14528K3552O89152l54304k60096L47648
5817F60480B06336J056768m89984p7824f07232b36032E92896K89792C35872M17792
5807G53664b52928G36768J7408l75296D8128J648128A82784a82272j49504F41536
5796C05152A14176J71008M44416j80736A78176J310208n61152e66784E58592k57024
$$ y = [875520, 195072, 1255424, -393728, -516608, 1522176, 708608, 297984, 432640, -62976, 1240576, 464896, 878080, 985600, 391168, -118272, -61952, 287232, -478208, 563200, 729088, 896512, 1202688, 264704, 133120, 23552, 272896, 98816, -28672, 324608, -496128, 488960, 338432, 809984, 800768, 1045504, 984576, 162816, 182784, 1217024, 701952, 388096, 242688, 444928, -244736, 600576, 909312, 214528, 238080, 927232, 572928, 312832, 660480, 206336, 1263104, 773120, 695296, -607232, -236032, 592896, 882688, 335872, 753664, -252928, 736768, 754176, 378880, 48128, 1696256, 182784, -182272, -331776, 641536, 305152, 114176, 285184, 729600, 548864, 178176, 1488384, 927232, -566784, 558592, 301568]
5786C01568J009664o4512K04800D88960B06336J092608n40160A66400c7888n16608
5776e54496i5232E96480j64864N58592D22400M57728A91488B0480Q17664J34144
5766I72288P8336o1952C61472L08736Q15616E42208e26336F68672e6320B83648
5755A77152Q87296B74944a30048C43552A66912J208320m05504R2160r2160D70016
5744A304064m96128E3760e46816F95808J5360K30912A8944M36224j63840c93216
5733A40800J08032P06560m28544L69664f87104F18496O24128D19328J70496j37728
5723D52096N80096E10976J78176j43360j31072a03936C64032j03936P89504j30560
5713I19040C92192a81760B033664d59776F66624A19296L34336J472512b45248
$$ y = [301568, 1311232, 1246720, 1451520, 488960, 206336, 1298944, 758784, 166400, -37888, -554496, -95232, 596480, 431616, 990208, 422400, 880128, 191488, 20480, 838144, 972288, 1050624, 988672, 361472, 670208, 1485824, 542208, -526336, 668672, -56320, 283648, 177152, 1064448, 274944, -130048, 343552, 166912, 1375232, 969728, 1061888, 969728, 470016, 1304064, 807936, 53760, -546816, 695808, 711168, 942080, 18944, 455168, 291328, -393216, 140800, 248832, 955392, 526848, 896512, -687104, 618496, 1242624, 419328, 589824, 452096, 1032192, 510976, 689152, 545792, 414720, -103936, 364032, 260096, 1049600, 919040, 392192, -181760, 2033664, -459776, 666624, 119296, 453632, 1926144, -245248]
5703b59584F38464N95456g48544C11808K83648j36704r3696L69152k22208j12128
5693C99872K91840A92000N41696k50368J084928f7072G57248k21184J091584A97120
5682E96992E7856L26144O30272m28032L7376B63680O29248B07360k9184O32832
5672H11008C54304M92032B08384P1680e25824E19680p7824l4816L88096d85888
5661H23808R1136l98848O42560l32800O75840c58400A348608l66592n5296M13696
5651A340416L55840l45600d60288C22048A46432R83552B05312R08800p8336J64352
5641A200128O144A86880o4000O07744P32160D49536J172480p54688L35360n1712
5631A150976M87424Q192D37248O80960L87584j45920l53280K39616K91328L23584
$$ y = [-259584, 638464, 1233920, -748544, 311808, 595456, 458752, 365056, 734208, 512000, 399872, 691712, 192000, 733696, 483328, 1568256, -67072, 757248, 536064, 1627648, 197120, 596992, 57856, 384000, 1014272, 586240, 623616, 263680, 892928, 207360, 178176, 811008, 354304, 846336, 208384, 280064, -525824, 519680, 441856, 407040, 795136, -485888, 823808, 914944, 516096, 1158656, 825856, 1501696, -358400, 1348608, 982016, 926720, 1340416, 1696256, 1350656, -460288, 322048, 146432, 1129984, 205312, 1114112, 1035776, 1200128, 1206272, 186880, 122880, 730624, 1462784, 449536, 1622016, 867328, 1202688, 1150976, 1638400, 1646592, 437248, 1118208, 1505792, 1359872, 1006592, 1246208, 1537536, 1861120]
5621A861120q11008E15584L15392k5600O8096I4720J351680C99872A56672L23072
5611D79744J83296b89280k0992C91680M85376A78176L05664J95072l27680Q49408
5601A200640f10304A249280m92032l38944K39616O43584n70880A58720R60512
5592A119232D61312D3008L92704L20512L20000o1440J07008n44768O05696A80224
5581I51808K5600L12320m13696J16736B34496P96672b90816e8880E70880M81280
5571A052160e53984B27840L95776a26976d9152p26528E94944b59072A501184i7280
5560D39296a54624A288704m78208A23392a96608E05856b75968j68960G33696j23392
5550F10304J51552A91488J379328N12F16960J08544L49696A98144M23936B89280
$$ y = [1861120, 1050112, 515584, 830976, 805376, 873472, 94720, 1446400, 399872, 156672, 479744, 663040, -289280, -310272, 391680, 877056, 178176, 483840, 678912, 351232, 1200640, -610304, 1249280, 757248, 418304, 657920, 1301504, 730624, 158720, 1119232, 461312, 43008, 435712, 756224, 1076224, 1014784, 1121792, 577024, 1182720, 180224, 951808, 977408, 1289728, 876032, 992768, 234496, 1031168, -290816, -58880, 570880, 1052160, -553984, 227840, 623616, -126976, -49152, -775680, 594944, -259072, 1501184, -97280, 439296, -154624, 1288704, 810496, 123392, -196608, 505856, -275968, -444928, 733696, 610304, 761856, 191488, 1570816, 1571328, 616960, 725504, 1075200, 198144, 622080, 289280]
5539a33632C03616J82784O41024K58560o83520A42848Q81152N23264F47168F0416
5528H14080B02240P69024B88256J67936O64576D26496A38240R4208l072e57568
5517A205248j58208b21696A185280E0176J997312G3728K21696Q44288D15232J307136
5507A722368q08960D39296j53600J536000m59264k05824m48512P62368J65888
5498A636352A54624L77344J77152J31584M90496Q15104b17600A599488m29568
5489A169920k18624J48480j87904k6624M61824N5296k38080n62688K68288k24256
5479F45632L45088N79584k75456k44736o5024p8336M15232B85184J245696n76512
5469I54368N78560l48672n39648N88800m81280P01440K58048n35552K62656A61280
$$ y = [-133632, 303616, 486400, 1127424, 1385984, 702464, 142848, 1024000, 1547264, 647168, 60416, 814080, 202240, 971264, 288256, 456192, 1120768, 426496, 138240, 232448, 229376, -557568, 1205248, 1047040, -221696, 1185280, 50176, 2047488, 73728, 295424, 1139712, 415232, 1722368, 913408, 439296, 285696, 1821696, 1362432, 1156608, 708096, 1470464, 1636352, 154624, 531968, 709120, 840704, 1331200, 2146304, -217600, 1599488, 1169920, 951296, 1099776, 911872, 885248, 1347072, 1402368, 1164288, 601600, 869888, 645632, 990720, 1570304, 1294848, 1050112, 985088, 906752, 1321984, 285184, 1530880, 954368, 1532928, 1184256, 644608, 1233408, 752128, 1453568, 1711616, 1176064, 1438720, 161280]
5458H64768Q73472o7584k80064K94912D92544J38752M62848J18272q704l74272
5448H29440K03264R18016n74464n1712K84672K01728B00192Q13056k46272M52096
5438A219072E43744L31264l00544N82144f9632A124352I5232J994752G96160N65760
5428A361920g9872E04320F4000c30240D72064B30400n9904J495552h0896E51936
5417c08736B3040Q46848K9696L47136l43040c584E05856L33824P55712a8432H09472
5405A881088A59744J076224L21536F19520k95936J566720E81120M32128m18816
5396E94432i8304D63360o5024N69856C95264J162240n49376J57696j62304Q1920
5386A085440J84832m65920e04832A666048B07872J115648a71008F63552N19168
$$ y = [864768, 1738240, 1670656, 1390592, 1685504, 492544, 631296, 1094144, 1212416, 1203712, 829440, 1032704, 1950720, 1376256, 1324544, 1609216, 1810944, 200192, 1013248, 766976, 1219072, 543744, 875008, 574464, 1156608, -69632, 1124352, 95232, 2089984, 796160, 1361920, -79872, 504320, 64000, -330240, 472064, 230400, 170496, 1666048, -80896, 551936, -308736, 23040, 869888, 899584, 1246720, 903680, -3584, 505856, 839680, 1595392, -18432, 809472, 1881088, 159744, 1235968, 1557504, 619520, 323584, 1890304, 581120, 1013248, 594432, -98304, 463360, 398336, 968192, 395264, 1557504, 1008128, 1165824, 1003520, 1085440, 1270272, 804352, -504832, 1666048, 207872, 1323520, -171008, 663552, 1182720]
5377A182720i09312A164800j26976n00224o1440L92704L74272E30432L14368H7040
5366D20864i9840I95840D02432R41568A05472P54176M95104j84320k90304N67808
5356A447936l23584A92512K48832L62496l35360J07008J43360L69152C31264K03776
5346E35040k13504P22944M71040c7888F07232J37728L3792j66400j02912O22080
5336A131520L80928G20384l32800j32096M06528M74624m00384O01600L81440c12320
5325A10080P88992f41536A309184K09920F80448c49696G74144A99680J81760p6288
5315C05152O14912J015808G60832M35712K38080J48992j13664E51424c72736C3792
5304A207296A67424%N09952j08032J036800F12352K48320j72544B07872J616384
$$ y = [1182720, -909312, 1164800, 1037824, 537600, 476160, 868864, 1243136, 530432, 844800, 87040, 420864, -99840, 995840, 402432, 1344000, 105472, 859648, 1354752, 1170432, 880128, 1447936, 1124352, 192512, 441344, 803840, 468480, 575488, 718848, 1088000, 331264, 535040, 321536, 1044480, 1515520, -37888, 607232, 744960, 778752, 612352, 509440, 1131520, 1512448, 720384, 387584, 255488, 662016, 1136640, 736256, 1337856, 1719296, -312320, 110080, 899072, -641536, 1309184, 1519104, 680448, -349696, 774144, 199680, 381440, 305152, 920064, 1935872, 760832, 1196544, 1434624, 1583616, 1469952, 551424, -372736, 33792, 1207296, 167424, 167424, 677376, 569344, 1606144, 612352, 860672, 688128, 207872, 1824256]
5294A824256H56576C45600A54624J347072F71744b43712I90208M09088l85024
5285A014272B44224J173504j02400A91488J343488J11104C16416J074688D62848
5275F25664d5568A776640C20512N76512L09248M27520G53664M72064n99552b67776
5264H71424j4848C31264N06880n120j93024L78368Q17664E58592Q52480D2496
5253H86272M0960A18784R46176L29728j17248B84160J194496n57056M7104M96640
5243A465344G02976k36544B29376L89632M11136B69312K56512M83840m12672J86880
5233G83872M66432j77152n17632R6768K27328J61280m88960Q18176F38976P89504
5223A428480c4304G24992L97824D45952Q88832j93024N12000m65920L6864N66784
$$ y = [1824256, 856576, 345600, 154624, 1501696, 671744, -243712, 990208, 1399296, 1014272, 244224, 1417728, 1315328, 191488, 1534976, 1646080, 316416, 1391104, 462848, 625664, -45568, 1776640, 320512, 897024, 1206272, 1633792, 753664, 1225728, 626176, -267776, 871424, 856576, 331264, 838144, 833024, 640000, 1018368, 1836032, 558592, 1411072, 42496, 886272, 927232, 118784, 1064960, 1394688, 1277440, 284160, 1478656, 921600, 968704, 1465344, 702976, 466432, 229376, 619008, 1030144, 269312, 525824, 1009664, 596992, 783872, 1250304, 1073152, 555520, 652288, 879616, 1040896, 551936, 1370112, 638976, 1428480, -34304, 724992, 1122816, 445952, 1334784, 1141760, 1653760, 1187840, 1224704, 1791488]
5213A791488C52256R92768J283072l00032l64032k69312J80224P84384o43584
5204B015744Q59136k3040l1232n99040r39520M66944J17760p5264o66624A59744
5193A433600n81632B78016O54336K25792K1504j45408n0176J80224m50048l54304
5183C59936J675264p53664A35680d92032A678336l63520J71520G36256N95968
5174A332224C10272Q03840j93536K2016O13376E44768L21024D3520J956352E82144
5163b84160B578944j159680l77856C77856K90816N30944l4816j44384j78176j536
5153H40704A92512L15392n1712J716736I44640K19136K4576j82784j53088O4512
5143I16992N25312D07040M71552j72032K26816L12320k94400J025024G37792L48672
$$ y = [1791488, 352256, 1345024, 2628096, 2328064, 1964032, 1694720, 1874944, 2659328, 2015744, 2874880, 2851840, 2820608, 2221568, 1282048, 1748992, 1866752, 1791488, 1124864, 159744, 1433600, 851968, 278016, 932352, 1158144, 1179648, 1034240, 984064, 1164288, 714240, 359936, 2035200, 1281536, 135680, -492032, 1678336, 1314816, 1486336, 736256, 1332224, 310272, 1114112, 920576, 942592, 1555968, 544768, 865792, 43520, 1999872, 582144, -284160, 2578944, 1419264, 1041408, 377856, 668672, 1199616, 1164800, 1020416, 842240, 840704, 192512, 507904, 456192, 2172928, 944640, 1163776, 1188352, 1005568, 852480, 916992, 1442304, 407040, 878592, 706560, 933376, 1245696, 951296, 1976320, 737792, 1086464]
5133A086464G7312M25984Q40704N12J2800n61152J95584k81088J056768H44288
5122B290176C21536J498624c04128D91008j69984J089536n11488N44256L65056
5113A808384n79584m2496J97632j15712k38592D33664O91200n08928J182208D80256
5102A224192E39136L08736Q75520D64384J622528E62176J042432m9664P6288l68640
5092A262592J017344j006080n88288M51072m67968J055744G76704l25120P68000
5083A219584P66464j16224A67936J557504p1680o55872K53440K71872m03968N39648
5073A658880L73248m3520K23232k46784G12704N99040J6384N42208p78240J216512
5063B308608r05728J440256p72096q90368P40352p35744j16224N36064M14720
$$ y = [1086464, 77312, 503296, 1344000, 1344512, 1357312, 796160, 991744, 710656, 1767424, 844288, 2290176, 321536, 1820160, -304128, 491008, 321024, 1410560, 899072, 1443328, 1808384, 1228800, 1186304, 1383936, 1268224, 1029632, 433664, 1124864, 615936, 1798144, 480256, 1224192, 539136, 847872, 1723392, 464384, 2086912, 562176, 1604608, 1554944, 1631232, 1262592, 2279936, 1273856, 685568, 1136640, 668672, 1724416, 776704, 451584, 1219584, 1986048, 1869824, 167936, 1725440, 1653760, 997888, 1251328, 1523200, 1119232, 1658880, 2032128, 1988608, 2211840, 1965056, 712704, 1311744, 1328128, 1870336, 1092096, 2308608, 1402880, 2843136, 2071040, 1180672, 1921024, 1185280, 1069056, 1605120, 2019840]
5054B019840F5024J995776D79232J178112l48160m71040l26656j59232N42720
5045H94976j17760M95616l16928D65408J403904p37280P96672N1200l33824n12512
5035A133568k51904P94624N0688M608k8160n38112J09568m44928k56000Q58624
5025A432576K71872p6800p3728M65408G94112R25696k12992n74464l32800P62880
5015A362432K58048j01376N7344N07904o69696K81600R9328G32160C56864J198080
5005A554944p17312j70496P58784M56704K69824o23104E70368J42848P42400L8400
4995A494016p02464R49248m0960K46272o02624o12352J207808j62304j99168M1984
4985A619456k93888K25792j84832m50560Q74496o66624Q95488o88640J59744K63680
$$ y = [2019840, 65024, 2060800, 479232, 1657344, 1309184, 838144, 511488, 352256, 894976, 777216, 1272832, 955904, 465408, 1869312, 1132032, 1928704, 1979904, 1646080, 1133568, 881664, 1676288, 1726976, 1731584, 1703424, 1165312, 1274880, 829952, 573952, 1432576, 1704448, 1627648, 1553920, 2019328, 794112, 1719808, 1506816, 932352, 599552, 1362432, 1620480, 1519104, 1576448, 2084352, 1414656, 1696256, 1795584, 732160, 356864, 1554944, 837632, 667136, 1425920, 1882624, 2152448, 1529344, 570368, 713216, 1455616, 1494016, 791552, 1740800, 1699840, 1946112, 1343488, 731136, 1938944, 1776640, 1577472, 1619456, 1325568, 1551360, 1366528, 915968, 1790464, 1123840, 2019328, 1330688, 1490432, 1754112]
4975A754112q75520J268736m92544l46112O79936J3824m59776L52256O55872J815552
4965D366336l94752m80256R28256K88256L23072m63872Q90368K6624r74336q65792
4955C643904O00064j371136q14592j53088p21920J888256r48224n69856J51040
4946A704448o42560M55680m88960L14880M70016j38240n51424E23776M34176R76896
4936A934848l65568k65728P25504l14880K02752p35232j81760K82624m22912l2768
4926H26880P74144O1952o63552P66464p60832G3728J384448J00352G06560J417728
4916B124288q96512c0720B20672R98912m9664o6560L37408n02784N55520K87744
4906A781248q4480k96448L55840L44064j78688I22624m44928P56224A35680J481728
$$ y = [1754112, 878592, 2147328, 1654784, 1308672, 1988608, 2002432, 1542656, 1894912, 2550784, 4366336, 3971584, 3491328, 4419584, 4707840, 5030912, 4567040, 5457408, 5484032, 4509696, 3643904, 4243968, 2872832, 2058240, 1905152, 1183232, 3071488, 2123264, 1553408, 1704448, 1061888, 1517568, 1028608, 1343488, 1813504, 1675264, 1123840, 523776, 957952, 1934848, 1569280, 1303552, 2029056, 1714176, 1916928, 1181696, 999936, 1282560, 859648, 826880, 1601024, 1662976, 999424, 1765888, 1005056, 73728, 1458176, 1558528, 706560, 2124288, 1227776, -30720, 220672, 1219584, 1169920, 1103360, 1440768, 937984, 1493504, 1781248, 1696768, 1400320, 1756160, 2100224, 1921536, 922624, 477696, 1233920, 135680, 1617408]
4896A617408p15776B72896J055232J0752Q66816m74112r3696L78880n64224K49856
4886A702400F76352O87104F09792P63904k48832J333248j058816L96288M17792
4877B213376q46336O41024l71200E28384O04160O74304J21344I63584k0992K41152
4867A183744R20576q07936n8880P12704K49344p83872p1680M21888l40480m34176
4857I91232J581056G57248P25504p3216E00736K7648R09312k53952Q16128k79552
4847A720320J97632l20000q4992G39840J824768r08288N34528m12160L56352J23904
4837B258944C74272J549312p33696P4752k19136p5776R49248q78592K63680L15904
4827A619968P97184o95808N0176L25120m0960K32448r27232R75360H15616J667584
$$ y = [1617408, 901632, 272896, 1328128, 1338880, 2205696, 1731584, 1637888, 2016768, 1452544, 1702400, 676352, 1363456, 609792, 1373696, 1124864, 2458112, 1399296, 1795584, 2213376, 1367040, 2008064, 1636864, 528384, 1132544, 1806848, 1928192, 963584, 942592, 1183744, 2104320, 1296384, 1237504, 1950208, 2199552, 1415680, 1344000, 1765888, 1425408, 991232, 2572288, 757248, 1482752, 1409536, 500736, 528384, 1437696, 1183744, 1999872, 1720320, 1917952, 1597952, 1512960, 739840, 2564608, 1656320, 2190848, 1778688, 2135040, 2258944, 374272, 1923584, 1189888, 1264640, 1045504, 969728, 1918976, 1040384, 1304064, 1619968, 2417152, 1721344, 1771520, 2096640, 2055680, 2288128, 1360896, 2336256, 815616, 2483200]
4817B483200j021952J251840n52448k73920K4064p1168J36704m67456K09920n10464
4807A208320Q09472p15264J8944F41536J064448m63872Q08448k67776E96480J062400
4797A658880K69312k53440L41504J82784m49536M55680l36384l31776J249792
4788B786816%I04192J014272n73952J018368K12480k86208n26336J12640p13728
4778A161728L56864J051136j283072J548288o54336l92192J78176J26976J302016
4769C395584p59808A207296R9328J68960o51264K028032o4512p61344Q0896n76000
4759A531392K19648k29376Q30464k66752o58432J101312q02304N58080n80608
4750A703424L8400J02400J690624j163776j66400k01216O53824o94784N15072
$$ y = [2483200, 1461248, 2713088, 2160640, 1886720, 1910784, 1839616, 1976320, 1508864, 1718784, 1208320, 2017792, 1302528, 1321472, 641536, 1705984, 1242112, 2050560, 1782784, 596480, 1658880, 1928192, 1674752, 2016256, 2199040, 1749504, 2205184, 1868800, 1537024, 2786816, 2786816, 904192, 1918464, 1344512, 2362880, 2575360, 2289152, 1762816, 1875456, 1161728, 1518592, 2569728, 1286656, 2834944, 2180608, 1788416, 1966592, 2093568, 3395584, 2635776, 1207296, 1306624, 1475584, 824320, 2852352, 2787840, 2026496, 2107392, 1531392, 1751040, 1521664, 2352128, 2085376, 1426944, 2528256, 1725952, 2284032, 1703424, 1741824, 1844224, 3534848, 2371072, 2204672, 2003456, 2657280, 1962496, 2477568]
4741B477568n02272M01920M75648o96320o73280M63872L27168L12832M63360k55488
4731B795008K02752n16096L90656p57248p71072L90144P64928m29568K82624p61344
4721A590784M6592k35520L72224P16800m80768N632j0752F85056N23776J142784
4711B351616k93888m14208O92224o01088P32672l36896K02752Q79104n40160l82976
4701B289152M48512R82528o99904P31136q81152L49696r20576Q63232A533440
4691B724352Q9600j128448J507840p09120p13728M95104J16224K67776K11456
4682B861056n15072M03968l37920Q34048o36928l88096m85888K304000j809408
4673B229760P7312L12320l57888K74944O54336n18656P14752l22560L20000R728
$$ y = [2477568, 1975296, 2377216, 2852864, 2156544, 1483264, 1947136, 2274304, 2587136, 3050496, 2795008, 2997760, 2481664, 2872320, 2115072, 1344000, 1734144, 2499072, 2069504, 2352128, 1590784, 1637376, 1401856, 1774080, 2490880, 2010112, 2015744, 2004992, 685056, 1208832, 2351616, 2057728, 1643520, 2335744, 1734656, 2467328, 2130432, 2333184, 3212288, 2672128, 2289152, 2737664, 3720192, 3020288, 3751424, 2870272, 3219968, 2299392, 3162624, 1533440, 2724352, 2813952, 1685504, 3193344, 2484224, 1770496, 2265600, 2381824, 2649600, 2861056, 2345984, 2749952, 2412032, 3246080, 2609152, 2221056, 1735168, 4039168, 2229760, 2307072, 2619392, 2261504, 2536448, 3190784, 2672128, 3386880, 3064320, 3384320, 3394048]
4663C394048N07904N8880l80928K33984j235456o67648J797632n90848l34848
4654B782720K96960O25152n37088n74976J42336N22240J59744q49408l8912M49536
4644B978304o9120k25280j144832M59264j59232m55168J362432l66592A106944
4634A503744M88960q8576H62208J521152j67936j46944M32640o76352l46112Q64768
4624B343424J3312m49024j75104K69824O6048m81792O86592K39104l46112r86624
4614A179648J74080K89280J0752J246720p33184L11296K86720p83360l36896N81632
4604B226688L50208q56576J161728o87616q13056K87744k07360N55008p06048
4595A310720K97984J55136K73408J31584Q9600L90144p05024q24320K052096j140736
$$ y = [3394048, 3901952, 3960832, 3579904, 3813888, 2578432, 1910784, 3708416, 3117568, 2782720, 3079680, 3704832, 3167744, 2592768, 2735104, 3257344, 3417088, 2567680, 2528768, 2978304, 2909184, 2683904, 1539072, 1998336, 1839104, 1383936, 2746368, 2379776, 1106944, 1503744, 1992704, 1904128, 862208, 2383360, 2215424, 2068480, 2501120, 1824768, 1478656, 2343424, 2356736, 1907712, 1732608, 2002432, 2068480, 1586688, 2273280, 2512384, 2166272, 1179648, 1353728, 1643008, 1653760, 2900480, 2167296, 2478592, 2765312, 1981952, 1645056, 2226688, 2576896, 1720320, 2882048, 2194432, 1381376, 1669120, 1461760, 2016768, 1310720, 1608704, 1763840, 2037248, 2168832, 2258432, 2648576, 1943552, 1119232, 3171328, 2030592]
4585B030592P39328j256448P39328j12128j068544J668608j0240P22432j372672
4576B080256J044992q77056n55520O49728J47456K35520J803264B164224M88448
4567B652672N93920q54528J164288l01568r80992J36704J83296l04128J208832
4558C498496l33824L82976p43936O9632P50592p08608L11808m73600M93056o78912
4548B567680K37056m15232Q192M87424L13344p7312o45120P60832j457152P13216
4538B492928N75488p04000n41184L11808n2224m85376R06240r08288P89504G77728
4527B556416j075200j03936J261568J03424m14720q58624Q29952l19488l9936
4518A939456Q02816o11328r46176N72928P12192j175040M55168O11328N65760
$$ y = [2030592, 2769920, 1513472, 2252800, 2140672, 1072128, 2740736, 2730496, 3452928, 2080256, 3125248, 2248192, 1692672, 2342400, 2489856, 2725376, 4528640, 2164224, 2652672, 3246592, 2392064, 3556352, 3254784, 2273792, 2410496, 2593792, 2289664, 3498496, 3164672, 3547648, 2803712, 2873344, 3623936, 2915328, 3227136, 2753536, 3246592, 2567680, 2804736, 2389504, 2397696, 2885120, 3198464, 3121152, 2476032, 3236864, 1779712, 2492928, 3068416, 2364416, 1823232, 2135040, 2082816, 1597440, 2503680, 1595392, 2384896, 777728, 2556416, 1481216, 1377280, 2638848, 2742272, 2327552, 1468928, 2298880, 1979392, 1939456, 2742272, 2130944, 1184768, 1757696, 2469888, 1294848, 1750016, 2361344, 2927104]
4509B927104L0720r40544Q87296K25792p38816L83488J69472k74432L59424m50560
4499B578944n50400M86912Q43776K16576j145856p47520K188288j294848l3280
4490B542592k0992m91520M12160K80576P4240j306112L01056O2464N58080o74816
4480A737728J128448l85536n09440K28352m73600l9936N04320P60832k85184l92192
4470B273792J755648j105920r56416J277440j137152O99904p71584J176576l34336
4461B877952L26144j25952p05536K48320P70048o17472J63840M31616j138688
4452B230272M75648R46688q88832J783296j457152R75872P34720J32608o88128
4443D244992p32160P0144L13856m18304o74816l70176Q63744j224704J122816
$$ y = [2927104, 2957824, 2017280, 2904576, 3130368, 2391552, 2775040, 2944512, 2670080, 3029504, 2578944, 2028544, 2515456, 3359232, 3575808, 2429952, 1682432, 3870720, 2575872, 2542592, 2521600, 2030080, 2442240, 2722816, 2797056, 1490944, 1792000, 1854464, 2412544, 1737728, 2866176, 2480640, 1971200, 2199552, 1725952, 1686016, 2190336, 2951168, 2665984, 2273792, 4029440, 2923520, 1967104, 3244544, 2107392, 2807296, 2035712, 3212288, 2877952, 3204096, 3078144, 2372608, 2620928, 3390976, 2773504, 2937344, 3368960, 2230272, 2705920, 3652608, 2763776, 4547072, 3089920, 4065792, 4800512, 4933120, 4244992, 3512832, 3582976, 3896832, 3478528, 2803712, 2433536, 3297280, 2072576, 3195392]
4434C195392M22400q03840M49536J43360N32992o86080K99520R29280j179648
4425C302912Q13056l59936l41504R13408j318400M8640l2256J242624r40032j88928
4415C139584J261056Q3968j436160J64864J70496M70528J373184j335808J37728
4406D029440o27712M31616O03648k08384L38944j083904J316352k048j277952
4397C520000N57568n8880K93888n12512o0416L84000q91904O34368o71232k96960
4387B897920J030144J6384j049600N92384J16224j011712M84352R26720k37568
4378C765248L61472j89952j459200K47808R04704j47968Q8064n23264r03168R28768
4368C072512J059328j587712J033728j214976L4816Q16640J10080j04448q69376
$$ y = [3195392, 3617792, 2813952, 3263488, 3406848, 3939840, 3253760, 3553280, 4482560, 3302912, 4115968, 3756032, 3414528, 4327936, 3009536, 3058176, 3025920, 4268544, 3328512, 3139584, 4400640, 4484608, 3048448, 3213312, 3383808, 3854336, 5227520, 3891712, 4029440, 3401728, 3833344, 4436992, 4228608, 4567552, 3483648, 4800000, 4797952, 3520000, 4077568, 4018688, 4312576, 3800064, 3739648, 4123648, 3231744, 3866112, 3194880, 2897920, 3928064, 3944448, 2894848, 3487232, 3603456, 2591744, 3076096, 4002816, 3765248, 4126720, 3936768, 2477568, 2725376, 3630080, 3482112, 3570176, 3046912, 2143744, 3072512, 4131840, 2544128, 3577856, 2362880, 2397696, 3214336, 3324416, 3219968, 2350592]
4359B350592J536J575424j389056n72416k42176M43392J474560o95296m63872
4350B482688Q36096o3488o74304J284096r10848K82624K88256n31968p81824r4208
4340B117120M94592m35712L22048M14720m31104K21184j69472j27488l61984Q89856
4330B933760q35072j61792O27200K14016q05888Q63744l83488l072j147392Q45824
4320B147840O09280m28032k50880l36896J341952J84320k61632m87936L01056
4311B819072o80448N84192o38464N96992p23456O34368j45920o16960M2496j02912
4301A768960L43040j28000J81248O79936p73632p63904J730048l21536L80928
4292C097088o9632n55008J19808l79392K81600K31936K76992K59072l69664L49184
$$ y = [2350592, 2352128, 3927552, 2538496, 1966080, 1723904, 2167296, 3641856, 2946560, 2482688, 3318784, 3255296, 2580992, 3865088, 2954240, 3236864, 3525120, 2993152, 2211328, 2117120, 2611712, 2176000, 2498048, 2912768, 2481664, 2702848, 2533376, 2405888, 2043904, 2933760, 2098688, 1936896, 2564096, 2778112, 1972224, 2835968, 2452480, 2449408, 1302016, 2147840, 2757120, 2329088, 2078208, 1741312, 3083264, 3267584, 3005952, 2518016, 2819072, 2138624, 2722816, 2084352, 2681344, 1957888, 2592256, 2446336, 1829376, 1871872, 1768960, 2112000, 1984000, 2165248, 2845184, 2071552, 1307648, 3037696, 2716160, 3097088, 3027456, 2472448, 2592256, 2212864, 2494464, 2726400, 3003392, 3262464, 2892800, 3241984]
4282C241984r24160J04960o57920J019904m93056O93248o67136Q80128j010688
4273B187264P7312J83808l5328j73056l04640J195520m82816L66080j338368J692160
4263C367936J50528n80096l89632K62144p60832N33504R04704o02624P2704l73760
4253B584576Q95488o09792L35872o54336J20832O86080j240064N7344R2672N86240
4243B854912J6896L9424A423360L76320J339904J02400r61024R73824R5744L27680
4233C678208K83648l67616J32608q60672Q77056q06400l22048j80736J541632
4224C975680A984512J629184P04000J129472j138176m96128L55328j33632j52064
4215C882496Q83200k31424m77696O07232n94432j406976J061888R96864m91520
$$ y = [3241984, 2317824, 2422784, 1764864, 2784768, 2291712, 2984960, 2317824, 3197952, 2187264, 2264576, 2448384, 2413056, 2240000, 1935360, 3130880, 2648064, 3014144, 1675776, 3367936, 3518464, 2938368, 2548736, 2810880, 2050048, 2583552, 3488256, 2885632, 2958336, 2584576, 3480064, 2870272, 3206144, 2551808, 2672640, 3358720, 2118656, 2176000, 2268672, 2854912, 2871808, 2911232, 1423360, 1799680, 3139584, 3241984, 2280960, 3254784, 3350528, 3678208, 3961856, 3594240, 3726848, 2866176, 3743232, 2936832, 2614784, 2434048, 3975680, 1984512, 3613696, 4317696, 5447168, 4308992, 3812864, 4168192, 4034560, 3882496, 4765696, 4534272, 4056576, 4663808, 4069376, 2662400, 3724288, 4721152, 4229632]
4206D229632j2288n22240Q0384O1440j061376N21216o30784N57056o61504Q69376
4196C430912l78880n87264Q86784N74976O29248n62176n96992M53632P04512j112576
4186C442176o91200M35712J078784q89856j67424Q2432k25280M25984M07552o55360
4176C243520P9360J98656k08384j234944R79968J70496Q7552K82112L68640j507328
4166B459648J594368k15040J48992j001472J655296j484288J137664K4064M98688
4157D817920P680J95584m52096N96992M53632k79552L06688L83488j41824k554368
4147C334144K663936j562624J450496N05344n19168J345024j333760L54304L42016
4138F579712j052160J155584l89632L21536Q41728k000384J013760J343488j082368
$$ y = [4229632, 4217344, 3695104, 3775488, 3836928, 2775552, 3296768, 2665984, 3223040, 2561536, 3430912, 3052032, 2464768, 3351552, 3926528, 4555776, 3993600, 3396608, 3850240, 4554752, 3442176, 2750976, 3186688, 4265472, 3375616, 3208192, 3290624, 3065344, 3491328, 3898880, 3243520, 3322880, 3521536, 3313152, 2078208, 3058176, 3228672, 3316224, 3598336, 3966976, 2459648, 4054016, 3838976, 3987968, 2986496, 4641792, 3157504, 4295168, 4319232, 4817920, 4825600, 5021184, 4569088, 5166080, 5619712, 5340160, 5646848, 6030336, 5888512, 3334144, 5998080, 4435456, 5885952, 6391296, 5872128, 7217152, 5883392, 6237696, 6579712, 5527552, 6683136, 6293504, 6615040, 7456768, 5456384, 6470144, 7813632, 6731264]
4129F731264J144320J22880k42688j247232O69184J002496j639936Q04864J57696
4120G502848M1984n75488Q00256N34528k37056j33632j98656J56160n10464J825280
4110I205760N92384n57056j93536J479168l59424O93248K37568j35680N22752
4101A1485184q8576L072l28704Q19200J022976M348416m078592J34144J558016
4092A4875136N07392J198080p74656J070080l95776J190912j410048q96512j22368
4083A5242240o11328j420288L60448j82784m52096m63872K91328j417728L06688
4074A1652608p26016j21344r47200j235968m72576q58624J026048l57888Q34560
4065H793600L65056j707008N78560p87968n32992m9664l32288j013760O08768
$$ y = [6731264, 7875584, 7998464, 7755776, 6508544, 7177728, 8180224, 6540288, 7345152, 7502848, 7544832, 6969344, 7769600, 8304128, 8067072, 7933440, 7734784, 7890944, 7380480, 9205760, 9798144, 9241088, 9047552, 10526720, 10167296, 10860544, 11098112, 10962432, 11485184, 11396608, 11399680, 11070976, 11890176, 12913152, 17261568, 13182976, 13317120, 14875136, 15382528, 16580608, 15805952, 16876032, 16480256, 17671168, 16261120, 15364608, 15242240, 14630912, 13210624, 13571072, 13388288, 12936192, 12472320, 12763648, 11345920, 11652608, 10926592, 10805248, 9858048, 8622080, 8149504, 7290880, 8316928, 7959040, 8793600, 9158656, 7451648, 8030208, 7242240, 6709248, 6659584, 6327296, 5313536, 5922304]
4056E922304l99360j008640J570816j226752m56192J74592M89472j99680j188352
4047C678208Q64768k65216j51552K20160O08768K07872m88960M6592n16096J010688
4037E215232k9184k16576k73920K73408J17248k12992q47872O13888R32352j519616
4027D051968L57888j023488N05856K73920j090560N08928P50080o76864K60608
4018C918336Q704q39680J544192l64544N1712l53280l77344P86432r85600j4336
4008C374592N22752P7312L22048p22944K65728q28928N73952K80576p00928J147904
3998D312064o06720M36224r37984L72736k60096R12384k57536r73312J185280
3989D183040j046016M18816R02144M27520j584128N78048L11808l9424n83168
$$ y = [5922304, 5522944, 4514304, 6085120, 4858368, 4402176, 4576768, 5066240, 4866560, 3678208, 4542976, 4277760, 4126208, 4346368, 4955136, 5163008, 4674048, 4720640, 4204544, 5215232, 5186048, 4969472, 4695552, 4968960, 5086208, 4873216, 4025344, 4639232, 5571584, 4051968, 4409856, 3386368, 3892224, 4166144, 3075584, 3584512, 4334592, 3657728, 3918336, 3927040, 3087360, 4631552, 4267008, 4318720, 3965440, 3588096, 4374528, 3388928, 3374592, 3897344, 3974656, 4296704, 3573760, 3839488, 3010560, 3584512, 3865088, 3164160, 4312064, 3705344, 4141568, 3203584, 3576320, 3316224, 4228608, 3971072, 2997760, 4183040, 3137024, 3555840, 4457984, 4885504, 3301376, 3879424, 4191232, 4151808, 3568640]
3980C568640L5840J032192L44064j902592R81504l72224M7104j069056J257984
3971C923456r16992J54112R53856j134080L97312N52448l55840J54112j435136
3962B293248P24480M34176R96352j159680m9152k88768J81760j02400j21344J0752
3952B919424J306112q36608L86560q43776M05504j1264Q6528M45952m6592P28064
3942D539904m4544l66080o31808L11296k47296J19808o74816M93056M53120n18656
3932C433984K4064J797632k357760N02784m9664J9456j70496O73280j166848R63584
3922C670016J23904K54976o53312j02400L20512j97120P70048m60288L51232L38432
3912D416000q93440k66752M34688n5296o90176J687552l89120N09440j692160
$$ y = [3568640, 3604480, 4636672, 4980736, 3078144, 4059648, 3687424, 3734528, 2665472, 3923456, 3006464, 3160576, 4114432, 2980352, 3377664, 3930112, 3574272, 3728384, 2293248, 3017728, 3451904, 4448256, 3288576, 3239424, 2950656, 3132416, 3030016, 2908672, 2919424, 4225536, 3388928, 3775488, 2931712, 3337216, 3325952, 3412480, 3858432, 3811840, 4539904, 4495360, 4129280, 3497472, 3808768, 3561472, 3681280, 3006464, 3499520, 3952640, 3433984, 3458048, 5255680, 2897920, 3400704, 3351040, 3370496, 3200000, 3873280, 2706432, 3670016, 3793920, 4048896, 3395584, 3293184, 3613696, 3416576, 4186624, 3726336, 4077568, 4416000, 3522560, 3255808, 3690496, 3635200, 2945024, 4632576, 4243456, 4752896, 3060736]
3903C060736Q08960j59744m30592j05472K55488k9184L34336l01056M21376K63168
3893D118016k60608n34016M57216n7344m55168J71008M73088m81280M37760J104896
3883D973568j396224M33152J98656l96800q30976P45472K63168N37088M27008
3874D954112M63360j856000K62656J94560l01056J65376q9088N5808J78688O56896
3864D685312n91872k57536O65600l8912P60832j374720p35232J708032p79264
3855D042240J122304l46624p18848N31456j224704Q63232n1712m06528O15424
3846D426240j74592O46144L56864j30560M52608k249216J308672J349632j320448
3837D665344P3728J019392l65056l97312J81248K05312k95424N53984J174528
$$ y = [3060736, 3869696, 3709952, 3279360, 3173888, 3429376, 3400192, 3734528, 3433472, 3854848, 4118016, 3857408, 3323392, 3780608, 3723264, 3268096, 3439104, 3912192, 3430912, 3868672, 4973568, 3577344, 4010496, 4209152, 3812352, 2981376, 3726848, 3990016, 4527104, 4954112, 5417472, 3561472, 3824128, 4018688, 3717632, 3883008, 3793920, 3849728, 4028416, 4685312, 4093440, 3835904, 4501504, 4462592, 5223424, 3848704, 3113472, 4821504, 4042240, 5164544, 4817920, 4099072, 4630528, 3405824, 4269056, 4217344, 3810816, 4426240, 4251648, 4897792, 5254656, 5124096, 5576704, 3327488, 4636160, 5985792, 4665344, 4739072, 5758464, 5393408, 4996096, 5177344, 5382656, 5087232, 5641216, 6815744]
3828F815744j302528J468416j601024J69984L20000j32608j28512J026560O08768
3819G244800n65248r0624M05504k26304J310208j533440P63904K50880p59808
3810F799872L01056J455104p35744J137152j542144J567232n47840J138688l22048
3801I251328K37056K464768l61472n26848J082368l25632K061312J87392J9456
3792A4089728Q03328N73440J180160N55520J690624M59776R69728j30560J447424
3783B1639168J158144J42336J679872l21536J659904J229312O10304J030144J584640
3774C0412288R32864P29600p91040j588224j444864j536000j565184l07712k964480
3765B1877248j637376j381888q22784j467392j356800j525760k69824j061888
$$ y = [6815744, 5513216, 6981632, 5380608, 5550592, 5870592, 5737984, 5609472, 6636032, 7244800, 6679552, 6588928, 6994432, 6768128, 8078336, 6544896, 7308800, 7559680, 6799872, 7100928, 8556032, 7820288, 8957440, 7415296, 8982528, 8434688, 9573376, 9251328, 9488384, 11953152, 11591680, 11064832, 12147200, 11821568, 13882880, 14070272, 14089728, 14893056, 15466496, 16646656, 17202176, 18892800, 19352576, 20322304, 20191744, 21639168, 22797312, 22939648, 24619520, 24297984, 25957888, 27187200, 27797504, 28827648, 30412288, 31345152, 32074752, 31283712, 29695488, 28250624, 26714624, 25149440, 24841728, 21877248, 20239872, 18857984, 18035200, 16567808, 15211008, 13685248, 13415424, 12353536]
3757A2353536L51232k269184P06048M7616r5744O84544k79552j94048j481216
3748I823232o40000R6256k45248j054720P84896K73408l27168N59104J29536L75808
3738I775104j302016m27008M70528L36384q3456p80800J534464n36576O29248
3729I615872o33344L80416j43872r88672J398784O8608J293312J273856K08384
3720A2473344P08096j29024p91552n44256k759680n01760O16960j021440j59744
3711G890944o92736j34656J273344Q43264p32160J4336Q5504j847808J775104
3702H475136p84384L17440O33344n48864j59744j88416L68640l60448l8912K60608
3692G974400k55488J782784j272832R39520l44064L57888q89344o54336O47168
$$ y = [12353536, 12704768, 10435584, 11141632, 11189248, 11093504, 11778048, 11498496, 11304448, 9823232, 9183232, 9279488, 9034240, 7979520, 8764416, 9037824, 8710656, 9269760, 9399296, 9775104, 8473088, 8046080, 8516608, 8852992, 8769536, 7988736, 9523200, 8986624, 9615872, 8982528, 9362944, 9219072, 8230400, 9629184, 9697792, 10991104, 12264960, 12473344, 13181440, 13052416, 12260864, 11716608, 8956928, 8455168, 9072128, 8050688, 7890944, 7198208, 7063552, 8336896, 9180160, 8448000, 8462336, 8547840, 6700032, 8475136, 7690752, 8008192, 8641536, 8092672, 7932928, 7744512, 8113152, 7752704, 7713792, 7974400, 7718912, 9501696, 8228864, 9168384, 8824320, 9182208, 8292864, 7638528, 8285696]
3683H285696k81600p14240j623040J049088P02976j075712O25664m65920O144
3674F509056J776128n62688j648640M04992Q9088r75360J677824l3280j19296
3665G117824K18624r19552J305088o53312m608N37088M96640j694208Q28416K03776
3655G435776O29248r75872J498624j795584N66784R728m3008K2528o87616Q6528
3645F747136L80416L98336J60768O45632m24960n22752p55712J115136P29088
3636H473088j027584M8640p44448p27552J398272o52288K46272O07232p16288
3627F905344J042432K6112l92192P18336n35552K86720n74464J00352m6080J409024
3617H940032j640448Q03328j70496Q7040j46944K99520J066496j304576k94400
$$ y = [8285696, 8004096, 7289856, 5666816, 6715904, 7418880, 6343168, 6968832, 6502912, 6509056, 8285184, 7722496, 6073856, 6478848, 6567936, 5592576, 7270400, 7237120, 7117824, 7336448, 6416896, 7721984, 7068672, 7064064, 7601152, 8097792, 6403584, 7232000, 7435776, 8065024, 7089152, 8587776, 6792192, 7358976, 7368704, 7325696, 7348224, 6660608, 6747136, 7127552, 7525888, 7686656, 8332288, 7907328, 7384576, 6628864, 7744000, 8473088, 7445504, 7494144, 6749696, 6022144, 7420416, 6768128, 7014400, 7621632, 6905344, 7947776, 7973888, 7581696, 8300032, 7764480, 8051200, 7476736, 7577088, 7531008, 8940032, 7299584, 8102912, 7932416, 8019456, 7872512, 8172032, 9238528, 7933952, 7639552]
3608G639552J118208r44128m31616n74464K251776m14720m65920R31840o46656
3599H463872J041408m06528j532416P43936M58240K15040o86080J01888M32128
3590H831488L38944p07584K22208J539584j139712l62496N03296N67296O51776
3581A0444800j187328J2288O25152n91872R63584r70752K36032J174528m11136
3572A0295296n28896J54112J95072L67104l96288J103872j315840M54656M86400
3563A0815488k61632k25792m86912O11328L16416J764864q72960J89440L32288
3554A2182528j60256M13696N30432P24992l38432N04832m1472O15936L97824O00576
3544A5430656J496064O79424M12672J571328m95104M92544k59072O07232K52928
$$ y = [7639552, 8757760, 7813632, 7382016, 6807552, 9059328, 8644608, 8178688, 9110528, 8463872, 9505280, 9098752, 7566336, 8310272, 8768512, 8983552, 8297472, 8399360, 8831488, 9170432, 8462848, 8685056, 10224640, 9084928, 8722432, 9225728, 9793024, 10444800, 9257472, 9269760, 9894912, 9303040, 10266624, 9295872, 9531904, 10706432, 10295296, 9766400, 9920512, 10115584, 10482688, 10086400, 11190272, 9874432, 10329088, 10815488, 10553856, 10328064, 9841152, 10452480, 10768896, 12533760, 11660800, 11850240, 12182528, 12022272, 12435968, 12966400, 13691392, 13352960, 13857792, 13816320, 14432256, 14830080, 15430656, 16926720, 17606144, 18018816, 19590144, 19095040, 19587584, 19328512, 19935744, 20188672]
3535B0188672k245120p0656P51616P62880j95072r1648R216n06368J221120o26176
3525A9198464j298944J876992q07936J564672J64864O02112N69856N03296O55360
3516B3028736K055680o7584Q1920J773056J319424O35392K43200P99232J222144
3507C1091200R29792Q38144j9968J896960O76864J601536J316864K419712K343936
3498D3095040P58784K152448L131392L65056L209216K641920L416576K147840
3490F0918272L063296K560512M766208O252032M372992N360640R256448Q028160
3482A04578560P669760R837568J1459072J0750464J1597312J2858368J3737984
3475A82489088J6150528J8505728J8584064K3135232K6761728K9341184L7234176
$$ y = [20188672, 17943552, 17872896, 18624512, 19387392, 19192320, 19100672, 19109888, 18603520, 19824640, 19198464, 17899520, 19776512, 18968576, 20533248, 20698112, 21300224, 21870080, 22373376, 23028736, 25084416, 25016832, 25098752, 26871808, 28191232, 28826624, 29069824, 29869056, 31091200, 32020992, 32859136, 32839168, 34736128, 35412992, 37014528, 38331392, 40751104, 43095040, 43853824, 46006272, 49137664, 49502720, 52711936, 55353856, 58770432, 60918272, 63981568, 66542080, 71308288, 77560320, 81933312, 87293952, 96550400, 104578560, 112248320, 122085888, 133544960, 144295424, 155892736, 168751104, 182489088, 198639616, 217145344, 235729408, 258864640, 285626368, 314967552, 352201728]
3468C52201728M8175104N9542528P9973376J10860800J50093824K01867776K41426944
3461A244142080K21231616R4407680r7273856k40464896k83722240k49254400
3455F89065984j86276352j27260672q6780416n9033088m2426880l1765504k2952448
3448A32570624j7226240j3841920j1740672q386048p330816p132672n559296n474304
3440E5878656j836032n007360l327488k015232l077120k024960k119168k257920
3432C4213376p02976j663488j245696j698816l47648k378240P168j830400r26208
3423B3427072n34016j434624r40032R62560j069056k026496J266176j048064j34656
3414A8468864q12032o53312p32160q21760r01632N5296Q5504r80480K59072l89632
$$ y = [352201728, 400376832, 459919360, 539892736, 650753536, 800847360, 1002715136, 1244142080, 1465373696, 1559781376, 1462507520, 1222042624, 938320384, 689065984, 502789632, 375528960, 288748544, 229715456, 187288576, 155523072, 132570624, 115344384, 101502464, 89761792, 81375744, 74044928, 66912256, 61352960, 55878656, 54042624, 49035264, 45707776, 43692544, 40615424, 38590464, 36471296, 34213376, 33510400, 31846912, 30601216, 28902400, 28554752, 26176512, 26183680, 24353280, 23427072, 22893056, 21458432, 20518400, 21480960, 20411904, 18385408, 19651584, 18603520, 18468864, 17656832, 17003520, 16271360, 15449600, 14547968, 14603264, 14688768, 13708288, 13967360, 13577728]
3404A3577728K95424p61856n69344L41504r43616l1744q49408j114624N24800
3395A0468864p56224q72448M80768j912320j178624Q9600o69696m58240J20320
3386E312000p53664j60256l71712M33152Q36608L072l45088J718272N89824j67424
3376G094784L74272J104896M42880j074176M56192n02272M14208m4032o61504
3367G605248N01760K62656r18016J728512K8672o89664m58752L15904P35232j384448
3357G727104M37248r89184q6528j374720L97824P0144M85376q24832J148928m53120
3347F538240r45664N40672L39456j816064J752064j226240O19008k53952o09280
3338D938240K58560N22752j372672Q11008L75296n77024q89856j4848J285120
$$ y = [13577728, 13873152, 13111296, 12541952, 12883456, 11939840, 11908096, 11058688, 9944064, 10468864, 9712640, 8840192, 9320960, 7408640, 6230016, 6319616, 5649920, 5191680, 5312000, 4558336, 4398080, 4026368, 4459520, 5296128, 5299200, 4954112, 6672384, 7262208, 7094784, 7469056, 8573952, 9016832, 7942656, 8398848, 7896576, 8310784, 8266752, 7605248, 8107008, 8369664, 7451648, 9180160, 9208832, 8519168, 8060416, 8376320, 9111552, 7727104, 8164352, 7175168, 7088640, 5713920, 6111744, 6181888, 6667264, 5842432, 6991360, 6538240, 5592576, 6133248, 6472704, 4656640, 6408704, 5182464, 5801472, 5547520, 4938240, 5196800, 5719552, 4346880, 5157888, 5533184, 4956160, 4066304, 4051456, 5336576]
3329E336576J7920m48512J78176O8096K41664l26144q07936k22720J41824o14400
3319C564544R89184k25792L8912l55840j64352M38272L32800q192j042432N46304
3309D113408k64192P19360l27680P79776r41056R62560R07264j118208k49344
3300D581888q78592k21696o84544p43936J441792j53600Q96000M096q94976N8880
3290C405312N84192M5056O34880j193984j87392q71424Q58112m30080O68672J88416
3280C701760l80928R20576l34848J302528j165312N75488J255424n89824J406464
3271F691328N53984J094144n06880n28384M49024k121216m04480j065472M22912
3262D584960M75136j502720J62816N83168k06336o40000n26336m88448J255424
$$ y = [5336576, 5354496, 4905984, 5084160, 5152256, 5393920, 5067776, 4259840, 4037120, 4178944, 3564544, 4553728, 4327936, 4366848, 4011008, 3846656, 4284928, 4617728, 4609536, 3567104, 4113408, 3849216, 4568576, 4240896, 5020672, 4079616, 5042176, 5949440, 4831232, 4581888, 3703296, 3481600, 2797056, 2053120, 3494912, 3341312, 4237312, 4241408, 3346432, 3405312, 3989504, 4034560, 4669440, 3475456, 3288064, 2416640, 3274752, 2844672, 3513344, 3701760, 3320832, 4241408, 3906560, 5209088, 4043776, 4619264, 5874688, 5284864, 6691328, 7245312, 8339456, 7832576, 7304192, 7753216, 5632000, 5227520, 4162048, 4584960, 5060096, 3557376, 3720192, 4303360, 4097024, 3457024, 2930688, 2442240, 3697664]
3253C697664r48224O29760j68960L2768m3520l43040J024000o69696m28544L34336
3243C116544N06368l11296L59936m72064K26304p34208K60608J524736o85056
3234C791872M33664r79968K8672k20160J348096r45152j68960P52128k21184O91200
3224D510208J28000J057792p33696M00896l32800N93920M5056l36896J176576
3215F509056q0384O45632q37120N90336Q91392N23264j320448J131008K036736
3206A0089472n37600Q22784N22752k0992N34016N84704J35680J087488r66656
3197A2251648J400320R21088p9872J490944l95264P99744j47968L86560O98880
3188A7326080Q90880K26816j102848M93056j59232O12864j020416P59808J389568
$$ y = [3697664, 2749440, 3379200, 3210240, 3243008, 3199488, 2856448, 3880448, 3210752, 2782208, 3116544, 3622912, 3311616, 3671552, 3199488, 3425792, 2691584, 2952192, 4476928, 3791872, 4225536, 3245568, 3274240, 3054080, 4402176, 3457024, 3288064, 4040192, 3819008, 4510208, 4638208, 5696000, 4962304, 5363200, 5030400, 5624320, 5669376, 5332480, 6509056, 6428672, 7074304, 6237184, 6827520, 7718912, 8242176, 6921728, 8052736, 10089472, 9551872, 10374656, 10897408, 10876416, 11410432, 11995136, 12130816, 13218304, 12251648, 13651968, 14573056, 14493184, 15984128, 15588864, 16388608, 16240640, 16627200, 17326080, 18216960, 18443776, 17340928, 17833984, 17674752, 18287616, 17267200, 18027008, 19416576]
3179A9416576r39520M78720R03168j030656j276416J320448R56928P7824l5328
3170A9871744J570816p81312Q78592Q02304J105920L82464r51296J730560L61472
3161B4971264Q29440j79200O57408k42688r62048Q84736J50016J00352O144N28896
3151B6744320K71360r40544j307136l2768j765888j97120k070528j554432o94784
3142A8452480j899520k091520k056192p58784r46688m98176p70560j53600j475584
3133G801856R16480j188352Q72960j214464m1984k10944J167360r07264M75648
3124G671296m56704R92768r53344k54464M81792k87232K0480j312256N36576O37440
3114G076352j686016Q26368O71744j17248k68288m03968J43872J91488M22912
$$ y = [19416576, 18477056, 18955776, 19858944, 18828288, 17551872, 18872320, 19829248, 19907072, 19871744, 21442560, 20661248, 21539840, 22342144, 23448064, 23830528, 22879232, 24609792, 24971264, 25800704, 25621504, 26278912, 26036224, 25074176, 25958912, 26108928, 26209280, 26215424, 26744320, 27015680, 26075136, 24768000, 24735232, 22969344, 22772224, 20701696, 19147264, 18452480, 16552960, 14461440, 12405248, 11646464, 10699776, 10201600, 9431040, 9277440, 7801856, 8718336, 7529984, 8402944, 7188480, 7146496, 6935552, 8102912, 7195648, 7671296, 7214592, 8207360, 7254016, 6999552, 7481344, 7194112, 7214592, 5902336, 6438912, 7076352, 5390336, 6216704, 6888448, 6771200, 6502912, 6098944, 6242816, 6434304, 6857216]
3105F857216r20576O41024k24768L07200j340928J080832j425920J968128m56704
3096F485504j824256P77216n22240R96864j212928O37952M85888m37248N92896
3087E979648n35040j84320l27168M23936L11808m31104J27488r00096k9696N59616
3077D995072q95488R63584M47488j244672J452032m03968o95808l13344O28736
3068D933632j77664N07904O16960J018368k221056L62496J052672j70496N21728
3059F444544k1504Q69376J83808p45472J16224L13856K27840K68800J65888k00704
3049G622656R44128J576448n23776J982464L714048M634624L388928n69344p01440
3040B2068736K69824j964544n705728l951616k037248k166272r97888N42208p10656
$$ y = [6857216, 5936640, 6577664, 6352896, 6660096, 5319168, 6400000, 4974080, 6942208, 6485504, 4661248, 5438464, 4916224, 5913088, 4700160, 5338112, 5824000, 5386752, 5979648, 5444608, 5260288, 4933120, 5357056, 5668864, 5237760, 5365248, 4465152, 4435456, 4995072, 4099584, 5063168, 5510656, 4265984, 5718016, 5314048, 4618240, 4304896, 4933632, 4755968, 5263872, 5880832, 6899200, 4678144, 5040640, 6093312, 5922816, 6444544, 6423040, 7292416, 7476224, 6730752, 6846976, 7160832, 7388672, 7657472, 7823360, 7622656, 8566784, 10143232, 9619456, 11601920, 15315968, 19950592, 23339520, 22770176, 22068736, 22338560, 20374016, 14668288, 10716672, 8679424, 6513152, 5515264, 6057472, 5346816]
3031E346816N1712r27744R00608k44736O93760p99744J270784k688000J125376
3022D728832k29376o41536J126912O24128p43936q29440p168j38240L14368J098752
3012E303296j097216q7040M71040k56000j07008p72608P91040k87232J253376
3003E211648o16448P20896j149952O13888r11360J144320j598464Q42752k31936
2994D025344J038336q09984k81600N7344J536n39648k68800L93728O78400j381888
2984B912768j21344O00576j28000K65216p24480J662464k47296k19136k01216
2975C799552M62848o33344n11488K65728J025024J71520q64768o0928j70496K80064
2965C763712k94400L35872k01728m20864J025536o40512N93408j161728Q86272
$$ y = [5346816, 5398528, 4470784, 5371392, 5126656, 5820416, 5020672, 6291456, 3603456, 4728832, 4499456, 3857920, 4984832, 5608960, 4865024, 4035584, 4028416, 3890176, 4204544, 5303296, 4206080, 4119040, 4590080, 4334080, 4227072, 3454464, 4245504, 3958272, 5211648, 4595200, 5316096, 4166144, 4780032, 3868672, 5012992, 3414528, 4257280, 4025344, 5063680, 4253696, 3972096, 4029440, 4030976, 3491328, 3222528, 3616256, 4294656, 2912768, 2791424, 3392000, 3264000, 3529216, 2804736, 4467200, 4219904, 4000768, 3799552, 4262400, 3629056, 3117568, 3383296, 4408320, 4579840, 3715072, 3654144, 3483648, 3763712, 3469312, 3805184, 3603456, 3182592, 4208128, 3567616, 4161024, 2999296, 3885568]
2956C885568l61472o70208J409536k47296o74304J272320o36928o3488N51424
2947D465152K43200k8672r31840L39968M92032n4272j208832J860608p99232K52928
2937D631040M79232j417728N46304r11872J200128k4576M22400p49568n08928
2928C666432O48192p51616L06688K60096k70336k00704L56864M45952o17472Q55552
2918D699648l42016j31072L29216q72448J82784N06880p47520J417728m27008
2909D616192l33312N95968k60096R4208q17664P37280N67296q59136P94624K83136
2899E418496r7280q58624K9696j0240Q19200K91328j137152J542656j11104j74080
2889E712896k76992q90880O50752j06496O97344m48000K32960M78208q0896K28352
$$ y = [3885568, 3524096, 2853888, 4263424, 4016128, 3341824, 4614144, 3977216, 3913728, 4465152, 4708352, 4679680, 3747840, 4087808, 4579840, 4525568, 3316736, 5177344, 4378112, 4631040, 5110272, 3692544, 4238848, 3326976, 4527104, 4502528, 4924928, 4175360, 3666432, 4314624, 3563008, 3869696, 4129792, 3859456, 3658752, 4015616, 4461568, 3844096, 4699648, 4357632, 4226560, 4555776, 3683328, 3866112, 4372992, 3625472, 5043200, 4616192, 4282880, 4878848, 4618752, 4712960, 3895296, 4632576, 5199872, 4340736, 5135360, 5418496, 5321216, 4462592, 4492288, 4482048, 5301248, 5592576, 4455424, 5998080, 5886976, 5712896, 5435904, 4545024, 5195776, 5089280, 5786624, 5338624, 5571584, 6049792, 5968896, 6197248]
2879F197248m34176J028096L09760r8304k79040J077760n48864J678336p05536
2870H225280R04192j446400J232384J67936O44608k48832J176576k71360k3040
2861A0361344Q17664R07264l23584P20384o9120J817088j337344J202176J552384
2852A5648256K9696j838080J501696k42176J480704q67840L24096J759744J14688
2843A7910784L02592L56352q34048r25184J045504q34560j25440M67456j60768
2834A7202688n2224r6256j50528K64704q50944n08928r95328J187840L294208
2825A9295232N296128J0578432j612288q824832p430656o086144j743360j976832
2817G495680o93760l3280j287168J273344o62528k16576K70848J2288j777152
$$ y = [6197248, 5763072, 6791168, 7100928, 7002624, 6723584, 7801344, 7252480, 8930816, 8225280, 9129472, 7683072, 8915456, 9083392, 9728000, 9479168, 10655744, 10384384, 10361344, 11179008, 12086272, 11762688, 12483072, 12413952, 14231040, 12893696, 14095872, 15648256, 15677952, 13839872, 15341568, 15099392, 16580096, 15712256, 16036352, 17796096, 17910784, 18213376, 18569728, 17735680, 16810496, 17856000, 17021440, 16896000, 17363456, 17202688, 17150464, 17054208, 16903680, 17168384, 16317440, 15808512, 14813184, 16001024, 19295232, 24591360, 35169792, 33557504, 24732672, 17302016, 11215872, 9472512, 7495680, 6801920, 6768640, 5481472, 6754816, 6092288, 5875712, 6146560, 6158848, 4381696]
2808D381696L21536M11648j438208N10464j42336N89312q34048m52608K151424
2799E498880j106432l68128m41856J478656j651712J210880r76384R06240j246720
2790C303424P50592K17600j36192O33344o28736o0928Q39680R79456j881600n35040
2780C481600K52928O7584J39776o95296J310720j370112O41024N12512j487360
2771B853376J084928K48832k37568K56000m85376R1136O05184n78048J240064
2762E078528o12352m2496j39776J054720j404928M58752K68800J076224j615360
2753D122112J234432L29728p34720J480192j46432N83680j145344N08416J245696
2744G477760L59936q75008J337344O21568J644032L38944K025472M206080O724096
$$ y = [4381696, 4703232, 5114880, 3676672, 4187136, 4044800, 4634112, 3800064, 3347456, 5498880, 4392448, 4024320, 3582464, 5061120, 3409408, 4620288, 3643904, 4550144, 3303424, 4054016, 4271616, 4135424, 4768768, 4140032, 4079104, 4918784, 5898240, 4016640, 3481600, 3734528, 3802112, 3941888, 3246592, 4557312, 3187200, 3828224, 4340736, 2853376, 3938304, 4187136, 3949568, 4205568, 3720192, 3811328, 4416512, 3838464, 5078528, 4466176, 4423680, 4283904, 5338624, 3933696, 4392448, 4661248, 5737472, 4122112, 5356544, 5686272, 4951552, 6431744, 6285312, 6868992, 5723648, 6232064, 7477760, 7837696, 6962688, 8300032, 8921600, 10565632, 10904576, 12930048, 17136128, 23860224]
2735B3860224J1727360J1292160m011008j0359296j1139072n064704l182080N51936
2727A3675520J068032O099968Q527872J404928l429376o269952n466624n44256
2719A5066112r07776L333120P536640J3499904K113536o219264j0242560q335872
2711A5843840l336192o10304J925120M858368P581184J840640l719168p547904
2703A6835584o058496k585600J080832j196544L607040L096576L37408k419712
2695A2697088k912256k534912j778176j432064L4304N07904j20320J09056n93408
2686C977216j502720K32960L70176K5088M52096J080832j482752J257472K39616
2677D649984J434624j167360N80608J002496m78720l47648J000448j266176K99520
$$ y = [23860224, 35587584, 46879744, 42868736, 32509440, 21370368, 16305664, 13123584, 13675520, 14743552, 20843520, 29371392, 30776320, 27346944, 21076992, 15610368, 15066112, 14158336, 17491456, 25028096, 38528000, 40641536, 34422272, 24179712, 15843840, 12507648, 11897344, 13822464, 18680832, 26262016, 28102656, 24383488, 16835584, 10777088, 8191488, 9272320, 8075776, 11682816, 14779392, 15116800, 12697088, 9784832, 7249920, 5471744, 4039680, 4073984, 4581888, 4461568, 4570624, 3977216, 2474496, 2707456, 3077632, 3102720, 3554816, 4635648, 3152896, 4410368, 4649984, 6084608, 4917248, 5497856, 6500352, 6021632, 5673984, 6674432, 5408256, 5707776]
2668E707776j499136O3488l65568q00768J742848j400320O69696j96096j300480
2659B621440n62688o36416L26144J107456n32480M42880m58752k57536O84032
2650B734080j091584J275392j176064J057280r24160J013760G77728J886208j067520
2641A596416J047040n39136l76320n04320L63520N90336J115648A560064J325568
2632B885632p77216k36032J50016L09248L8912p40352P23968p10656J52064j07008
2622A688576k69312P22432M9664J17248O21568j404416j93536n58080Q42240N67808
2612B184192k41664L54816k49856N47328l93216A076736O04672K66752K93376
2603B241536m10624M28544K9184r04192J435648m42368q61184L52768N01760p08608
$$ y = [5707776, 4208640, 4272128, 3906560, 3105792, 4848640, 3448320, 4118016, 3921920, 2621440, 2058752, 1422336, 1748480, 2855936, 2323456, 2766336, 2307584, 2050048, 2734080, 1642496, 2917888, 1741824, 2799104, 1874944, 2888704, 777728, 2663936, 1596416, 2643456, 2104320, 1728000, 1223680, 1587200, 2177536, 3293184, 1560064, 2885632, 2108416, 1872384, 2022400, 2331648, 2370560, 1630208, 2354176, 1643520, 1795584, 1688576, 1419264, 2141696, 2191360, 2308608, 2930176, 1525760, 1332224, 774144, 1616384, 2184192, 1942528, 2297344, 2047488, 2594816, 2201600, 1076736, 1681408, 1948160, 2241536, 1830912, 2259456, 2288640, 1384448, 2820096, 2377728, 1516544, 1869312, 2371072, 1662464]
2593A662464M87424L8912k50880l13344K70336M13696j1264r89696P08608J256960
2583C273216j277440O11840m97152P80288j10592m45440J343488o88128q98048
2574B092032M31616K63168m08576P04000j55136J28000M64384k73408o79936m59776
2564B106368J242624r99424P2704q8576Q68352Q47360j675776O38976M72576j267200
2554B217984O11840L40992r73824M32128P68512r3184m78720L2768k27328j15200
2544B515968O5536L82464r89184Q21248P83872j636864J472512j062912L584J346048
2534C702272j635840K287616j283584O5536R55392j675264N59616k3040K62656
2525C215360j307648R75872K26816k04800j051648P09632k2016o37952O51264
$$ y = [1662464, 2149888, 2188800, 1937920, 1624576, 1894912, 2308608, 2297344, 1307648, 2016256, 3273216, 1995776, 2607616, 2110464, 2890752, 2780160, 2334720, 3678208, 2990080, 2092032, 2523648, 2786816, 2378240, 3082240, 2927104, 3055104, 3519488, 3246080, 2566144, 2106368, 3348992, 2349568, 2422272, 2333696, 3202048, 4049408, 2373632, 3012608, 3485184, 2217984, 2829824, 3170816, 2196992, 2629120, 3397632, 3304448, 2825728, 2858496, 2631168, 2515968, 2581504, 2963968, 1974784, 2796032, 3579904, 1943040, 3415552, 2352640, 2356224, 3702272, 2066432, 4354048, 3070464, 3136000, 4091392, 2416128, 2975744, 2952704, 3215360, 1907712, 2883584, 3110400, 2905600, 1853952, 2563584, 2541568, 1903616, 2554880]
2516B554880P23456m25984m63872j89952m12160j38240M41344l38944J075200
2507B825728L8912q73472N54496o84544m75136R85600K84160K67264j014784P04512
2497B612736j017344J781248j300992J65376n20192J78176M23424K68800J51040
2488B742272j47968J51552r0624N08928J25440o81472Q38144m19840l32288Q77568
2478C571712P23968r35424l48160p3216l584J0752L39456N04320n26848Q6016
2468C348992J09568j101824J833472j028608L56864l7888J11104p63904R25696
2459C753472O03648m35200L26144k00704M16256M20864N87264j453056J141760
2450E160448j654784J167872M34688j632768J359872K80064j496576L32288N80096
$$ y = [2554880, 3278336, 2852352, 2388480, 2198528, 1786368, 1648128, 2089472, 1750528, 2825728, 2864640, 1991168, 2545664, 1861120, 1385984, 2371584, 2655744, 2923008, 1908224, 2612736, 1595392, 3376640, 2075648, 2241024, 1720832, 1899008, 2322432, 2591232, 2742272, 2594304, 2745856, 2655232, 3164160, 3289600, 2608128, 3446272, 3026432, 2694144, 3571712, 4295680, 3360256, 3012096, 2938880, 2935296, 2946048, 3285504, 3789824, 3262976, 3348992, 3458560, 2356736, 4190208, 3161600, 3518464, 3480576, 3591680, 2827776, 3753472, 4357120, 3921920, 4248064, 4047360, 4463616, 4884480, 5471744, 4018688, 5160448, 3505664, 4673536, 5108224, 3475456, 4835328, 5115392, 3618816, 3951104, 4531200]
2441D531200j20320q69888K19136j63840K76480Q24832o68672M90496n52960r85600
2431B980864N68832m58752J081344n86752L45088J970176j457664k46272M2496
2422D239360J163776o78912n00224l08224P68000n70880L90656L55328k87232
2413D571648M57216j135616J222656r43104M34688r39520p00928J034752O656
2404D008448L27680r73824O43072r30304R82528K87744j26976L46112j412608
2395C151872J601024o79424k36544N38624j197056J335296o45632L87584J52576
2386D408320j048064O94784j19296N31968M45952j384448O91200k8672j4848Q19200
2376D996096p18848K35008J95072r66144q55040R66656J060352j088512J36704
$$ y = [4531200, 4410880, 3540992, 3760128, 3596288, 3872768, 4697600, 4028928, 4519424, 3966464, 2980864, 3549696, 3090944, 4172288, 3585536, 3930624, 5900800, 4443136, 4196864, 4239360, 5403136, 4724224, 4224000, 3915776, 4683776, 4112896, 4503552, 4858880, 4571648, 5028864, 3893248, 5115904, 4172800, 4607488, 3667968, 2967040, 4001792, 4008448, 4336128, 3362304, 4005376, 3075072, 4057600, 4345344, 4218368, 4564480, 3151872, 4752896, 4073472, 3836928, 4375552, 3178496, 4513792, 3868160, 4255744, 4408320, 3360256, 4055040, 3935744, 4467712, 4913664, 3529216, 4220416, 4191744, 4176896, 4996096, 4277248, 4512256, 4707328, 3741184, 2886144, 3852800, 4913152, 3824640, 3961344]
2367C961344Q8576n61664n5296J050624j32608j80224P82848n36576n8880m84352
2357C873792J150464j500672N52448m78720R33376k86208N70880j095680J001984
2348D721664l77856M35200N10464j99680k16576l80928Q83712n3248q17664J77152
2338D682240m71040l06688M7616J404928j611776R19552O52288o41536o38464
2329D037120j15200O7072P0144K69312j51040r2672q1408l06176J5360N29408
2319D241920j07008K04800l97824Q51456l94240K6624j096192M88448j95584j46432
2309C475968m71040M17792O19008o01088K84160L6864j69984p41888O57920L51232
2299C858944o85056j08544P31648L04128j074176P51616n92384J50528J176576
$$ y = [3961344, 4049920, 3488256, 3432960, 4483584, 4350976, 4170752, 4953600, 4417024, 4358144, 3873792, 5024256, 3523584, 4076032, 3597312, 4530688, 4244480, 4815360, 3719680, 4721664, 4343808, 4779008, 5289472, 5089792, 4873216, 4492288, 5376000, 5322752, 4505088, 4682240, 4211200, 3904512, 3952128, 5357056, 3745280, 4664832, 5317120, 4675584, 4037120, 3921920, 3988992, 4059136, 4328448, 4177408, 4084736, 4003328, 3697152, 3712512, 4241920, 4134912, 4339712, 3941888, 4793344, 4399104, 4425728, 3329536, 3817984, 3622400, 3475968, 3004928, 3422720, 4041728, 3440640, 3724800, 3761664, 3591680, 2849792, 3507712, 3858944, 3173888, 3065344, 3796992, 4101120, 3026944, 3778560, 3186176, 3336704, 4513280]
2290D513280m78720r67680O94784J04960n10464P85408N13536n93920k24256N49376
2280D386304n07904P23968j093120J137664M52608j05984O6560k44224j41312
2271D674560l26144J47968P42400j720832K316288p37280M1472L64032R00608
2262F403072r39008J403904j74080r3184p00416J381376o38976N02784k2016K3552
2252G147008j413632J10080O76352q32000Q28416k95936j45408p34720J166336
2243F506496l25120Q32000j37216k94400K4576j095168R02144p21408J360896
2234G052800j18272q50432J225728o52800q78080Q12032j79200l11296m07040
2225E693440Q78592p9872n91872k68800j07008L86048Q78592j60256k47808j91488
$$ y = [4513280, 4034560, 3066880, 3761664, 3866624, 3356160, 4141568, 4655104, 4061184, 3836928, 4386304, 3878400, 4602368, 3509248, 4646912, 5099520, 4993536, 5060096, 4815872, 4674560, 4348416, 4496384, 5238784, 3517952, 5834240, 5096960, 5138432, 5502464, 6403072, 5464064, 6867968, 6693888, 6600704, 5900288, 7281664, 6642688, 7145472, 7123456, 7147008, 5733376, 5843456, 6519808, 5687808, 6516224, 6220288, 6074880, 5340160, 6506496, 6181376, 7013376, 6876160, 6581760, 6606336, 5511168, 6413312, 5691904, 7052800, 6934528, 6084096, 7309824, 6657024, 5778944, 6590976, 6411776, 6100480, 5693440, 6572032, 6492160, 5900288, 5631488, 5524480, 5910528, 6789120, 6628864, 6381056, 6189568]
2215F189568R9840m93568n85728L14880J39264O24640j179648J78176Q49408j58208
2205E978624P37280o20032J470464j868288J31072k53952O9120L02080J76128
2196F122496m66944P11680n80096K064896k495488J85344o77376J244672j290240
2187D818944Q64768j264128N38624L85024q08448J1264N42720j564672J095680
2178D619776J083904j022976j10080K88768q23808N88288l46624R89184k41152
2169E025280j44384M32640P12192n08416L30752l51232K96448m57216L19488r54880
2159D700672J596928j52576q22784L33824m85888L64032m89472J296384j00352
2150F240768p94112J175552j284608J838080j099776N8880K09408j340928P63392
$$ y = [6189568, 6289408, 5795840, 5210112, 5524992, 5664256, 6288896, 5109248, 5287424, 6136832, 5978624, 6715904, 6095872, 7566336, 5698048, 5829120, 5575168, 5644288, 5946368, 6122496, 5655552, 6367232, 5787136, 7852032, 5356544, 5541888, 4864512, 6109184, 4818944, 5683712, 4419584, 4958208, 5343232, 4534784, 4546048, 5088768, 3524096, 4619776, 5703680, 4680704, 4570624, 4859392, 4035584, 4623872, 4277248, 5266432, 5025280, 4880896, 5313536, 6025728, 5517312, 5848064, 5496832, 5793280, 5336064, 5655552, 4700672, 6297600, 6145024, 5322240, 5656064, 5170176, 5534208, 5044736, 6341120, 6240768, 5446656, 6622208, 5337600, 7175680, 6075904, 6134784, 6344192, 5003264, 5766656]
2141E766656J24416M02432J349120n82144J94560J76128j65376J31072j57184
2132G239680J462784l85024j453056P01440O01088n35552R07264L47136p44448
2123H141312P39328J4336Q85248j054208l8400J509376m59776m48512K24768j227776
2113H285696J726464M55680j185280l3280k93376M11136L40480o01088J164800
2104A0271232p25504j59232R2160o77376J029120r35424J472512p41888p44960
2095H880640q23808P94624J005056r10336N53472M86400m05504k13504P1168L23072
2085I761280M25984m18304q07936L66080l54304N79072N78048N41696j323008
2076I348608J89440o68672P73632l83488M13184k24768M20864n85728R0112M36224
$$ y = [5766656, 5891072, 6293504, 7642624, 7060480, 7255040, 7431168, 7265792, 7396864, 7239680, 8702464, 8317440, 6864384, 7565824, 8166912, 7631360, 8538624, 8885760, 8141312, 8880640, 8894976, 9780224, 8726016, 8687616, 10196992, 9737216, 9288704, 9513472, 8285696, 10012160, 10467840, 9282560, 9249280, 8955904, 9367040, 9707520, 9106432, 10271232, 9545728, 9386496, 9478656, 8801280, 9830400, 8894976, 10367488, 9625600, 8880640, 8056832, 8851456, 9856512, 8946176, 9499648, 9986048, 9580544, 9367040, 9438208, 9761280, 10187264, 9768960, 8961024, 9327104, 8972800, 9551872, 10129920, 10671616, 9348608, 9538048, 8869376, 9643008, 9259520, 9672704, 9447936, 9868800, 9283072, 9373184, 9809408]
2066I809408m58752J089536L80416K536960K609664P444480O89664n116416l922432
2057A5062528m136960j841152j654272R50272j00352n93920p35232J208320L12320
2048H471552r73824L88608n36576J14176J90464J07008p88480J300480o72768
2039G600640r19040J287168m35712n19680N71392m58240K79552K33984j3824j60768
2029G465472l8400r87648J573376j297920K3552l93216L84512N35552j523200
2020E742080R66656j103872m97664N43232Q3968L38944M49536j837056J069056
2011E754880j684480J037312N33504j532928J251328m31104n76000J78176M10624
2002D941312l10784j069056J689088l99872j378816P13728N02272N99552l47648
$$ y = [9809408, 9350656, 10440192, 10820608, 13357568, 15967232, 23411712, 24101376, 18984960, 15062528, 10925568, 9084416, 7430144, 8380416, 8280064, 7686144, 6950912, 8159232, 8471552, 7497728, 7886336, 7349760, 7463936, 7654400, 7761408, 6972928, 8273408, 7600640, 6681600, 7968768, 7533056, 7013376, 7584768, 7126528, 7406080, 7640064, 7626240, 7465472, 7427072, 6439424, 8012800, 6714880, 6738432, 6345216, 6729728, 7265280, 5742080, 6708736, 5604864, 5107200, 5650432, 5734400, 6073344, 6522880, 4685824, 5754880, 4070400, 5107712, 5641216, 4108288, 5359616, 4928512, 4352512, 4530688, 4941312, 4630528, 3561472, 5250560, 4850688, 3471872, 4185600, 4687872, 5287424, 4939776]
1993D939776M20352r26720k11456O77888M31104n85216L13344m54144M88448j22368
1983D971008N57568N75488q83200p07584K94400N90336j96096n06368J455616
1974F151168j450496J17760m54144L30752J527808k32448j973248J526272k68800
1965E274624J40800L10784m3008p43424j8944R03168q67328R23648p02464L91680
1955E569536k64704k7136Q04864M98688K2528j95584r28768N03296N30944n9904
1945F453760J307648j195520O36928p98208M75136J006080j686528J526272l9424
1936G686144N64736o19520o65088J428992j662464J418752Q22784p40864Q50432
1927I083904j219584q4480M21376M91520L47136K68800Q97024j234432l00032
$$ y = [4939776, 5360128, 4433408, 4221952, 4899840, 5330944, 4745728, 5059072, 4604928, 5093376, 4971008, 5528576, 6104064, 5220864, 4513280, 4807680, 5398016, 5201920, 4695552, 6151168, 4700672, 4818432, 4364288, 4695040, 6222848, 5990400, 4017152, 5543424, 5274624, 5415424, 5726208, 5683200, 4939776, 4920832, 5824000, 4956672, 5880320, 5177856, 5569536, 5304832, 5277696, 6082560, 6581248, 6603776, 6408192, 5479424, 5982720, 6513664, 6453760, 7761408, 6565888, 7202816, 6404608, 6879744, 7885824, 6199296, 7725568, 7686144, 8250880, 7631360, 6966272, 8395264, 6732800, 8151552, 8974336, 8233472, 9083904, 7864320, 7779840, 8201216, 8692736, 9039872, 9308672, 10205696, 8971264, 8671232]
1918H671232Q33536l58912L8400R9840L14880N20192j06496q39168K316288j172992
1908A0316800Q00768M57728l23584J079296J11104j11104l86048N40672P50592
1899A3236224p76192o87616l93728l45600R27744j489920J84832J024j035264
1890I621504Q24832K90304m58752J58720k75968J162752j579008Q09472O22080
1881A1175936j008128o81472L98336O43072O41536r28768L36896m52608n9904
1872A0064896J205248p58272j012736L92192o17472O07232m11648m09088J204736
1863A0265088m55168K36032n84192Q0384k39616n00224Q93440K25792j366528
1854H555008o13376M83840p8336p91552P74656p69536R7280K00192r09312k20160
$$ y = [8671232, 9504768, 9145856, 9184256, 9284096, 9598976, 10119168, 10012672, 9173504, 11489792, 10316800, 11117568, 11575296, 11251712, 12331008, 12442112, 12331008, 11944960, 12485632, 13236224, 12460032, 11772416, 11378688, 11033088, 11960832, 10470912, 10655744, 10656768, 9621504, 10446336, 10736640, 10277888, 10436608, 10160640, 11323392, 9744384, 10553856, 11175936, 10167808, 9486336, 9884672, 10527744, 11169280, 10240512, 10577408, 10124800, 10064896, 11270144, 10511872, 9499136, 9891328, 9273856, 9881088, 9469440, 9060352, 10265088, 9809920, 10045952, 9461760, 9542144, 9302528, 8802304, 9695744, 9921536, 8555008, 7941632, 8425472, 8347136, 7555584, 8330240, 7560704, 7657984, 7858176, 6948864, 6728704]
1844F728704O58944p39840P18848l16416q9600k15552Q6528r9328L40480j143296
1834E929472J530880j492992R43616l76320N6320j5360O20032m85376j22880o6048
1824F521344p74656J188864j033728Q15104l04128L24608j155584Q13568J80736
1815F576128p71584P62368j64864J97120p3728p82848Q39168J580544j627648
1806F534656q76544P69024n46816Q52992r6256Q26880m608M09600m21376N14560
1796G962112L44576r4208l37920l42528j6384J093120J152512r23648K37056L71200
1786I445888r14432Q5504n3760M38272m05504J887232m45440r01120N01248J153024
1776A0790912L01568m21888J201664m81792L69152j03936O16960L01568o1952
$$ y = [6728704, 7387648, 6647808, 7366656, 7050240, 6960640, 6745088, 6831616, 6732288, 7072768, 5929472, 7460352, 5967360, 6910976, 6534656, 6590976, 6575616, 7195648, 6710272, 6587392, 6521344, 5746688, 6935552, 5901824, 6716928, 6412800, 6737408, 5581824, 6395392, 6576128, 5804544, 6566912, 6402048, 6599168, 6525440, 5742592, 6581760, 8162304, 6534656, 5658112, 6427136, 5880320, 6733312, 6637056, 7463936, 7459328, 7868928, 7447552, 7962112, 8306688, 8212480, 7874560, 7532032, 7515648, 8608768, 9761280, 8837632, 9074688, 9445888, 8531456, 8616960, 8563200, 9001472, 8595968, 10483200, 10037760, 9136640, 9637888, 10790912, 11092480, 10670592, 11872256, 11390464, 11759616, 11655680, 12272640, 12574208, 12512256]
1767A2512256L60448R24672j53600O98880O8608k77504L75808O54336K78016Q25344
1757A6267264N77536J054208J302016N74976R216J426944J056256K667008J84320
1748B5119744K030592M28032K006528K210304K02240r46176K413568M16768R32352
1739C4813952L97824J291776M65920J193472L25632Q93952J490944J403904N55520
1730D2832896K000384K143744J902592K081280K673664L476480L661824L403776
1722F4176640N348352N644288O333440Q382464O542848N928960L721728k411008
1714A03667712m271616n398016r351168r127936j0662400j0593280r500160p397376
1706C7365760o111744m459008k831872k987520j466368k828288m71040j79200
$$ y = [12512256, 12872704, 13797376, 13643776, 14342656, 14411264, 14133760, 14509568, 15163904, 15441920, 16267264, 16844800, 17899008, 19201024, 19776000, 19785216, 21212160, 22268416, 24935424, 25119744, 27150336, 27578368, 29584896, 31795200, 31997440, 31051264, 33464832, 33881600, 34813952, 35211776, 36503552, 36969472, 38162944, 38488576, 39382528, 40873472, 42277376, 42832896, 44833280, 46977024, 48879616, 50960896, 53634560, 57111040, 60772864, 64176640, 69524992, 75169280, 81502720, 89885184, 96428032, 102356992, 106078720, 103667712, 99396096, 93998080, 84646912, 75518976, 64856576, 54263296, 44763136, 37365760, 31254016, 26795008, 23963136, 20975616, 19509248, 16680960, 16209920, 16030720]
1698A6030720j597440l47136j279488o92736L24608n38112q29952m32128J98144
1689A0836480l64544p11168m20352N11488L25632j312768m6592k81600r4208j30048
1679H312320O01088J60768j267712n7344m6080K6624o32320K22208k23232p38816
1669F357504O13376k51392r60000Q86272o66624o40000J531904j981440M26496
1660E316096l91680k53952K024448j016832j161728J01376R1136p96160K69312
1651D182016O28224J46432n41696l16928r40032P33696Q41728L85024j789440
1642C329024J675264j083904K46272K0992o17472K94912K69312n86752L60448
1633C908096j184768P09632j88928m13696M15232J139200p69536J96608j51040
$$ y = [16030720, 14433280, 14086144, 12806656, 12113920, 12438528, 11900416, 11070464, 10638336, 10836480, 10471936, 9760768, 9340416, 9851904, 10177536, 8864768, 8818176, 8536576, 8442368, 8312320, 8913408, 9074176, 7806464, 7749120, 7703040, 7729664, 7097344, 7319552, 7096320, 6357504, 6970880, 6719488, 5759488, 6645760, 5979136, 5339136, 6871040, 4889600, 5316096, 4924416, 4670464, 6694912, 5678080, 4516352, 4617728, 4708864, 3912704, 4182016, 4810240, 4956672, 4414976, 4098048, 3158016, 3891712, 4733440, 5118464, 3329024, 5004288, 3920384, 4166656, 4187648, 3570176, 3865088, 4134400, 3547648, 3908096, 2723328, 3432960, 3244032, 2830336, 3245568, 4384768, 3615232, 3811840, 3660800]
1624C660800k7648O81984q11520l36896Q44800j006080P07072R92768j853952
1615B851328Q07936q31488O53312O21568m6080j59744j5872O14400k08896j401344
1605B885120J110528l45600L06688N88800j511936K066944j669632J304064o90176
1596D044800m42880K88256P11168q71936Q04352m67968P18336o86080O62528O97856
1586E458432l38944k73920q9600P46496p21408L14880Q28416l31776m27008M45952
1576E611520P44448q40192J931776j95072k29376K61632M83840l07712L29728
1567G790592Q13056J026560J860096J37216j538048k86208j19808n48864N16608
1558I651200j027072k77504m66432L54816j09056O25664o49216r68192L81440
$$ y = [3660800, 3633152, 4315136, 3503616, 3166720, 4011520, 3005440, 3712512, 4705280, 2851328, 3659264, 2827776, 3481088, 4102656, 4056576, 3896832, 3880960, 4495360, 4286464, 2885120, 3995648, 3650048, 3956736, 4545536, 3033600, 5100544, 3430912, 4734976, 4044800, 3601920, 3890176, 4601344, 3729408, 4533760, 4065792, 4784128, 4098048, 4760576, 5458432, 5119488, 4845568, 4755968, 5502464, 4781056, 5095936, 5924352, 5592576, 5165568, 5611520, 6355968, 5515776, 7447552, 7252480, 7023104, 7284736, 7768576, 7460864, 7790592, 8603648, 9630208, 11490304, 11627520, 10089472, 9803264, 9683456, 9134592, 9651200, 8624128, 8346624, 7880192, 8235008, 8125952, 8751616, 8102400, 7134208, 7515648]
1549G515648l66080P90016m30080Q59648j306112K56512J24416J213952q23808
1540G834112J10080n22752N91872J61792K9184P3216L32800j545216K038272J82784
1530I286144Q88832q7040J175552K79552J08032J477632n01760J05472l55328
1521A2377088j138176K14016k377216j75104r55904k80576r41568K26304j12128
1512F836736n9904K93888o16448o72256M63360R49760j11104p28064L60960L81952
1502G098880k19136P48032J32608K97984j13152J881600K00192Q75008j049600
1493I852416q75008j72544K40640p55712j288192j342976R60512j071104j11616
1484E436416N60128p89504K41664j356288l41504R58464l81952k83648M78720
$$ y = [7515648, 7149568, 7939584, 7509504, 8369152, 7063040, 7319552, 7443968, 8657920, 7834112, 7944192, 7421440, 8013312, 8175104, 8204288, 8277504, 8610304, 7065088, 9103360, 9286144, 10174976, 10087936, 11263488, 11543040, 11651072, 13128704, 12626944, 12732416, 12377088, 11238912, 11452928, 9075712, 8900608, 7944704, 7664128, 6722560, 6948864, 6836736, 6776832, 7070720, 6454272, 5782016, 6245376, 7195136, 7084032, 6355968, 6716928, 7098880, 6879744, 7627776, 7760384, 8058368, 7945216, 9826816, 10027008, 10902016, 9852416, 8977408, 8804864, 9045504, 8289792, 7001600, 5658624, 6619136, 5548032, 5436416, 5996544, 5207040, 5448704, 4092416, 3750912, 4709376, 4327424, 4043776, 4522496]
1475D522496j345536J40288M34176o78912J478144j062400m49024N36064n26848
1466C048448j08544J4848L7376R92768j529856Q49408j149440J469440k04288
1457C420160L25632l46112p55712n12L27680J9456n9392K43712p56736Q70912
1447C289088n23264L74784K02240J316352j711616J25440J026560p48544N08928
1438C859968o5536K69824J73568p93088P40864k50880o03648J013248q68352K16064
1428C692032j027584R81504o10304K96448k40640P69024j71008P58272r41568
1419C506176N31456n62176J59744O27200J1776r11872K69312N46816j39776j92512
1409C846144M7104p59296M26496k66240R58464k64704J7408m87424M20352o53312
$$ y = [4522496, 3176960, 3317248, 3751424, 3072512, 4550656, 3488256, 3039232, 3575296, 3048448, 2939904, 2954752, 2992128, 3984896, 2455040, 3304448, 2155008, 3624448, 3420160, 3745792, 3399680, 2643968, 2643456, 2971136, 2990592, 2931200, 3174912, 2418176, 3289088, 2765824, 3140608, 3342848, 4659200, 2947584, 3073024, 4099584, 3351040, 3859968, 3794432, 4064256, 4237824, 3444736, 4185600, 3934720, 3331072, 4344320, 3475968, 3692032, 2664448, 3645952, 3035648, 3332096, 3091456, 3860480, 3689472, 4447744, 3506176, 4037632, 3475456, 3635200, 4262400, 4274176, 3362304, 3631616, 4178432, 4038656, 3846144, 3893248, 3133952, 3560448, 3294208, 4252672, 3987968, 4005376, 3517952, 3938304, 3284992]
1399C284992J20320n1200L5840o51776M40832O48704L08224j729536P89504k97984
1389B897920J33632j354240J040384q60672k23744J47456J00352j52064o4512
1380A664512j84320K58560K58048J73056j3824j10080n13024R1648Q4480B78528
1369B384896E26336k37568J491456P06560j186816j90464M83840C99872N71904
1360I71776D02432Q55552E48864R216O27200M79232K11968d65408A904128G95648
1349I23136C08736O11328j25952C76320P34720A99168M03456J59232O97344K21184
1339A680384B56512J246720G18848L70688K88256K74432j92000K39104a60768
1329B70336c75808I98912k46784C43552R79456o25664J51040J62304j03936p2704
$$ y = [3284992, 3405312, 3354112, 3389952, 2738176, 3179008, 3827712, 4135936, 2406400, 3195904, 2897920, 3031552, 1677312, 2717696, 1857024, 1633280, 1780736, 1881088, 1729024, 1664512, 1480192, 1738752, 1996800, 2169856, 2156032, 2045952, 1532928, 1624576, 1709056, 278528, 2384896, 526336, 288768, 1780224, 2486784, 1299968, 1109504, 1593344, 399872, 971776, 402432, 1257984, 548864, 558080, 1185280, 1664512, 1876480, -465408, 1904128, 795648, 923136, 308736, 920064, 794112, 376320, 1111040, 199168, 602624, 761856, 1459200, 1680384, 256512, 1503232, 718848, 1089536, 1377792, 1652224, 1460224, 1699328, -160768, 270336, -375808, 998912, 752128, 343552, 1323008, 697344, 848384, 1010688, 906752, 834048]
1319H34048k27328P13728E42208N73952j00864l78880p680k22208j07520J646080
1309A945088o10816E25824J19296R46688E52448K81088l4304l81440K83648N56544
1299A257984E91360k38080j67424J412096F41536P27552l86048K10944n74976
1290F19008f8096A348096M09088C0720M91008J206784C68128M8640j02912J361920
1280A675776E52960A62816P64928M30080C09760L0720C4816d64896A279488j87904
1270A091584m25984O16960m83328J37728O55872K91328H92416j74592M66944R58976
1260B143744a01888H68864M7104R12384C84000j24416J130496l08224J41312I4720
1249A533952p35744k05312K32960J05472K9696P3728j47968o2976C4816L40992
$$ y = [834048, 606720, 1320448, 542208, 1116160, 1015296, 636416, 628736, 406528, 299008, 1945088, 1334272, 525824, 645120, 1591808, 552448, 833536, 799232, 417792, 701440, 1257984, 591360, 353280, 185856, 1597952, 641536, 1369088, 983040, 1193984, 619008, -68096, 1348096, 1757184, 30720, 521728, 1728512, 368128, 416768, 313856, 1675776, 552960, 162816, 927744, 1357824, 309760, 340480, 34816, -464896, 1279488, 1091584, 665600, 1282560, 799232, 936960, 1592832, 1884160, 892416, 717824, 1184768, 2143744, -101888, 868864, 915968, 1828352, 384000, 259584, 1390080, 1081856, 1223168, 94720, 1533952, 798208, 592896, 825856, 931328, 961024, 1034752, 886784, 823808, 34816, 375808]
1239C75808K105344A190400l18464K6112M57728n45792J85344C64544J604096
1230A968640c5328A390592o67136A84320R58464J47968D29056L56864Q51456m22400
1220A214976j83296J10080j14176o144m16768A6384R47200o1440P78752B26304
1209D65920M3008L9936R1648B53440M30080k25792L45600M86912P2704D68992
1198G83872g50592G70048k84672K8160Q99584F11328k32448Q36608l36896l19488
1188E59104N44768b560I61024N0176D94592k11968J244672G15264j26464m3520
1178E45280K87744D16256e3760A720320l85024C96800Q16640o3488B49856R46688
1168A196544n68320K06848J250816G56224A85344N76512Q5504J006080q46336
$$ y = [375808, 2481152, 1190400, 871936, 898048, 1355776, 809984, 995328, 364544, 1968640, -35328, 1390592, 723456, 184320, 1142784, 1290752, 429056, 785920, 1637376, 1214976, 1031680, 1141760, 1027584, 1021440, 604672, 16384, 963584, 902144, 1680896, 226304, 465920, 508928, 548864, 640512, 253440, 683520, 457728, 803328, 1290240, 1362944, 468992, 783872, -750592, 770048, 485376, 513536, 1413120, 611328, 378880, 1215488, 878592, 559104, 1103872, -2560, 961024, 1011200, 494592, 282624, 1527296, 715264, 588800, 545280, 833024, 416256, -53760, 1720320, 1335296, 396800, 1213440, 1149952, 249856, 1196544, 628224, 835072, 2085888, 756224, 185344, 761856, 847360, 1853440, 1007104]
1159A007104j9968l73248J34144A59744L61984M35712J47456k38080L95264l16928
1149I45152l93728J07520R21088J00864m40320n55008K42176m18816J379840J23904
1139B012672G10656J53088R42592o83520K65216J47968k87232m33664Q35072G43936
1128A781760k03264l79904M3520J32096P61856p4752j005056J803264j061376
1119A798144N2224k76480q1920P74656J20320l98848l76320Q14080m41856J077760
1109C061760j56160J058304j131008K47808K97472N18656M6080O1440J722880
1100E727232Q75008J531904L16928j515008j061888J815040m8640O50240N5808
1091H346624J14176J106432J568256O71232K787328J455104M446208P276032J6650240
$$ y = [1007104, 987136, 613888, 748032, 159744, 521728, 957440, 1104896, 866816, 1262080, 945152, 551424, 658944, 1580032, 1680896, 1240576, 685568, 927744, 508928, 1888768, 2012672, 710656, 863744, 1806336, 1122816, 1388032, 1536000, 1248768, 815104, 1650176, 743936, 1781760, 1578496, 1198592, 1242112, 1374208, 2136064, 2061312, 1056256, 2859520, 1798144, 1850368, 1573888, 1491968, 2266624, 2386944, 1988096, 1611776, 2425856, 1984000, 3061760, 2905600, 3963904, 2832896, 3080704, 3378176, 3896832, 3942912, 4004352, 5727232, 6602240, 8134144, 8451072, 6936064, 5874176, 7689216, 7640576, 8290816, 8346624, 8460800, 9567232, 11135488, 11806720, 14594048, 16049152, 20495360, 27771392, 44421632]
1082D4421632L5791360M6446592j1383296m4322816l4352640j6247296q756224
1075A1597312k601984j370112j088512j456128l14880j181184Q78080p23456j054208
1066B684928P86432k09408N42208J373696n71904j88928j239040j137664m88960
1057A551360p0656L97824p71072Q45824l94240K42688M33152l57888q63232M74112
1047A487872J18784E57568J232384n58592n72416Q26368p11680Q32512D59776
1037A498112n25312J260032o19008C94240P81312M4032J48480l10272n10464P32160
1027A279488K64704B5600O93760J287680p34720l81952O12352l59424n59616k78528
1017C05152M8128J60256P8336c24096@C61472O1440A59232c07200A42336J87904
$$ y = [44421632, 80212992, 126659584, 115276288, 70953472, 36600832, 20353536, 11597312, 8995328, 7625216, 6536704, 5080576, 4765696, 3584512, 4462592, 3739136, 2684928, 3471360, 3261952, 3804160, 5177856, 4605952, 4417024, 3177984, 2040320, 1551360, 1480704, 1878528, 1107456, 1953280, 1559040, 1801728, 2234880, 1876992, 1013760, 1487872, 1606656, 557568, 1789952, 1231360, 658944, 1485312, 773632, 1606144, 459776, 1498112, 972800, 2232832, 1613824, 394240, 1175552, 1219584, 1368064, 1057792, 547328, 1279488, 1544192, 25600, 719360, 2007040, 1272320, 890368, 1502720, 1143296, 583680, 305152, 353280, 513536, 591872, -324096, 0, 361472, 422912, 159232, -307200, 142336, 330240]
1006C30240L92192l48160e01760f5536G56736f01600D83840j02400j024N16096
996H96512L8400B44736O78912g47008I09312B94400O79936g680B60096L7376A10080
984A087488J88416C64544d27520D21376c8912k18112a21344A039872G6800f05184
973E99552b58048k20672C65568O61504m89984J11104k78528J39264c50208H54528
962A465856E93920b93888D77696K72896k02752B37056J95072b83136o75840K30912
952g28064A189376n13536P72096m24960m51072A23392K45760A3312K86208N64224
942H63744c4816G05024k49344J77664B20160J62816j33120M30080l3792n120Q2944
931G23968A06496A3312d19328H46848l91680j4848a40800D68480a82272G93600
$$ y = [330240, 722432, 374272, -501760, -65536, 756736, -601600, 483840, 381440, 380416, 896512, 934912, 244736, 923648, -747008, 909312, 294400, 974336, -7680, 260096, 297472, 110080, 1087488, 1275904, 364544, -427520, 421376, -38912, -257024, -121344, 1039872, 76800, -605184, 599552, -258048, -478720, 365568, 1027072, 537088, 648192, 369664, 508928, -350208, 854528, 1465856, 593920, -293888, 477696, 750592, 547840, 237056, 432128, -283136, -958976, -728064, 1189376, 675840, 1447936, 1022976, 571904, 123392, 369152, 13312, 299520, 863744, -34816, 705024, 455680, 633344, 220160, 382976, 249856, 679936, 646144, 641024, 723968, 106496, 13312, -419328, 846848, 455168, 440320, -140800, 468480, -182272, 793600]
920G20384f60480E42720L32288l2768G5264Q1920c17952F25152J00864A45408
909B96448h5504D76160L49184C21536a0752C10784h0384B411008D62848Q3968
899E46816c22560A4336N65760p7824j53600p8336A23392N21728i216H55040j61280
888F93760J07520B12992J95072N85728j21856Q58112C0720e16608j4848R6256
878d35200E35552B22720f73792F86592Q70400j6896h63232C42016l9936a13152
867d76160D59776i7280A048576a15712F48704e18656E50400A60256f68672i6256
856C70176c76832l72224A054208B43712n1712d3008K0480A00352L03104a82784
845c81952D31616J03424h29440A249280m08064m13184E5296R56928c01056B82624
$$ y = [720384, -660480, 542720, 875008, 842240, 75264, 157184, -317952, 625152, 726016, 145408, 296448, -85504, 476160, 825344, 321536, -10752, 310784, -80384, 2411008, 462848, 546816, -322560, 14336, 580096, 502272, 348672, 270336, 123392, 645120, -9216, 855040, 693760, 801280, 212992, 408064, 993792, 871936, 1730048, 30720, -516608, -531456, -435200, 535552, 222720, -673792, 686592, 1556992, 1540096, -863232, 342016, 302080, -113152, -476160, 459776, -97280, 1048576, -115712, 648704, -518656, 550400, 160256, -668672, -96256, 370176, -376832, -749056, 1054208, 243712, 192000, -43008, -22528, 100352, 403456, -182784, -381952, 431616, 535040, -829440, 1249280, 841216, 428032, 55296, 1012224, -301056, 282624]
834A188352a69472B23232M06016b18624D99200e81120j48992C23072a48992G81312
823A00352R33888e8368G24992m7104a98144H55552p5264l70688c3280k62144h7040
811g08096A6384a53088F86080k66240J020928p04000L20512O62528p14240b76480
800c74784B22208e93408H86784c18976G47520j3824e52960A422848o71744P91040
790A542144C96800L79904L91168D60288J014272E86752K22208P37280j35680l16416
780A094144r7280J0752M9664P32672k19648D36736N72928R70752r03168m54144
770F23104N42208l67616k50368N74976O3488M35200q1408a09056A58720b55488
759I28256j92000L05664B27328L16416P74656c98848F93760C19488B4064f21568
$$ y = [1188352, -169472, 223232, 629248, -218624, 499200, -581120, -730112, 323072, -148992, 781312, 100352, 1034240, -58368, 724992, 677888, -198144, 855552, 780288, 409600, -33280, -295424, -87040, -708096, 16384, -153088, 686080, 419840, 1440768, 736768, 1057280, 1719808, 1005568, -276480, -374784, 222208, -593408, 886784, -318976, 747520, 733696, -552960, 1422848, 751104, 1542144, 396800, 776704, 1167872, 460288, 1474560, 586752, 808960, 1546240, 1410560, 1094144, 996864, 1007616, 1057280, 1789952, 1570304, 436736, 1009664, 1980416, 1077248, 623104, 1165312, 797696, 547328, 1122304, 1185792, 1620992, 1539584, -109056, 158720, -255488, 928256, 736256, 1041920, 227328, 543744, 1318400, -398848, 693760, 319488, 24064, -621568]
748F61504j1776R8304C35872e89824I52320B63168b84160I7792O04672d15744
737C99872a31072k86208R5232J11104j26976a56672A054208e06880b02752E49376
726H01792c68128D28544e5808C88608J93024A5360f0928k93376D13696A14688
715H8064N6832J94048J51552a97120C28704K15040B11968J8432M75136k77504
705D28032n632a3312k38592j006080d87424k11456A46432K19136F4000b58048
694C32288e72928g9872c7376l2768o6560B19648a79712I69728A31072J18272a30048
682C79392J6384L17440A9968b31936l63520c0720n60640G8336f03136J02400E57568
670H5504M0960A3824J901568G59296e12512E10464c98336C85536f26688B98496
$$ y = [661504, 649728, 748032, 335872, -589824, 952320, 263168, -284160, 97792, 702464, -415744, 399872, -131072, -417280, -322048, -210944, -337920, -156672, 1054208, -506880, -202752, 549376, 801792, -368128, 428544, -55808, 388608, 581632, 15360, -60928, -354304, 413696, 114688, 88064, 144896, 338944, 490496, -197120, 328704, 543744, 211968, 230400, 705536, 428032, 422400, -13312, -251904, -1257984, -487424, -698880, 146432, 365568, 64000, -258048, 332288, -572928, -79872, -37376, -70144, -136704, 219648, -179712, 969728, 131072, 249344, -130048, 379392, 395776, 713216, 19968, -231936, -595456, -30720, -591360, 78336, -603136, -500736, 557568, 85504, 126464, 13824, 1915392, 759296, -512512, 510464, -398336, 385536, -626688, 298496]
659a38752G56736F5536b67264k44224J26976F08256B65216a224192D73088c73760
648a77152a9456o34368D70528r1136A32096d64896C56864e23264a14688l13344
638d28032l28192A98656b2016m04480A40288a17760A203712D32640F8608M30592
628D99200a45920G3216a75616A73568d71040C50720K84160k17600H0896J25952
618B06848a81248A21856d33152G24480h68864a65888J2288A02400O45632B00192
607G96160c71712j68448a99168O7072m72576h4480n6320F5024K98496g41376J81248
596e60128A204736a359360e49888D98688p6800e38112A47456O99392K3552g21920
585a633792a0752G35744a57696l86560C68640A50016b10944a7408C50720f58432
$$ y = [-138752, 756736, 65536, -267264, -511488, -384512, 608256, 265216, -1224192, 473088, -373760, -177152, -19456, -653824, 470528, 379392, 132096, -464896, 356864, -523264, -114688, -428032, -756224, 198656, -22016, -426496, 140288, -117760, 1203712, 432640, 68608, 499200, -145920, 73216, -175616, 173568, -471040, 350720, 634880, 417280, 80896, 206848, -181248, 121856, -433152, 724480, -868864, -165888, -153600, 102400, 748032, 200192, 796160, -371712, -540160, -199168, -132096, -604672, -84480, -140800, 65024, 363520, -741376, -560128, 1204736, -1359360, -549888, 498688, 421888, -538112, 147456, 846848, 870400, -721920, -1633792, -10752, 735744, -157696, -544256, 368640, 150016, -210944, -17408, 350720, -658432]
574g4240j132032J536G80288G9872c7376n120G0144N91360d80256b17088k88768
563e05856K01728P2704f0416p63904b82112r8304A97120d92032E89824A30048
552d04480a84832j64864H6016J064960f144H192i08800b33984A35168O3488f7584
540B95424b41152E74976d31104c4304n76000h0384m01920N632A82784c39968k11968
529e51936a90464o7584A71008O61504j09056a038848A6896L70688k8672i08288
518B26816G5264d99712G06048e14048l20512l07712C04128I0112e22752J09056
508d13696o23616c5328k9696q65792a69472C82976d57216J44896B44224L73760
498F17984d75136k3040b0992j6896m11136O9632L1744A150464D86400p8336j01376
$$ y = [-74240, -1206272, -1204736, 780288, 79872, -37376, -42496, 70144, 661504, -480256, -217088, -505856, -304128, -231424, -60416, -824320, -282112, -380416, 197120, -492032, 589824, 130048, -404480, -184832, -349696, 86016, 1150976, -6144, 8192, -908800, -233984, 135168, 198656, -67584, 295424, -241152, 574976, -431104, -34304, -610304, -80384, -482304, -476672, 182784, -339968, -551936, -190464, -258048, 171008, 832512, 723456, -1038848, 16896, 387584, 358912, -908288, 226816, 75264, -499712, 706048, -514048, -834560, -1142272, 304128, 90112, -522752, -413696, -1037312, -35328, -65024, -930816, -169472, 382976, -457216, -312320, 244224, 617984, -475136, -498176, -20992, -37888, -449024, -379392, -347648, 1150464, 486400, 408064, 306688]
487C06688L43040e91360C79904n9392j25952L40480j23904j8432P49568c28704
476b21696j92512H37120A4848M53120b33984a08544A74080J104896k61120j39264
466H78592j7408l27680k60608l7376f656F91712Q84736A33120K66752K62144i76384
454C28704M10624j37728A51552O34368B38080b33472A536L91168g2192E08416
443c03104A4848J093632a345536F13376j92000A36704c18976P8336J9456m38272
433f59456K37568J44896m16256H01280e85728a16736B8672d18304m98176a72032
422I25184d41856J90976c2768A18272d42880F97344a93024j17248k23744E01760
411c40992j79200b04800j014784a84832l29728m9664L3280a24928G87456B44736
$$ y = [306688, 649728, -591360, 379904, 320512, 194560, 535040, 411136, 392704, 1142272, -328704, -221696, -414208, 837120, 14848, 467968, -233984, -108544, 174080, 1278976, 1017856, 878592, 861184, 533504, 272896, 235520, -6656, 691712, 1576448, 133120, 399872, 662016, -976384, 328704, 739328, 601600, 151552, 785920, 238080, -233472, 1536, 392704, -72192, 508416, -303104, 14848, 1108480, -1345536, 613376, 421376, 136704, -318976, -240640, -221184, -659456, -421888, -276992, -693248, 801280, -585728, -116736, 28672, -418304, -916480, -172032, 925184, -441856, -250880, -32768, 118272, -442880, 697344, -193024, -310272, -534016, 501760, -340992, -520192, -204800, -1219584, -184832, -514560, -564224, -530944, -124928, 787456, 244736]
400G4240J51552i34400m2496A48480a42336O9632m15744i2672l4304j223168e22752
388a325568C56864h51456F00064a265152B26304e44256j84832B19648a28000j60768
378b88768r63072c01056G24480C28192e58592A70496L05664h17664G15264g74656
367f10304B83136m5056a43360l20512f4000m50048p83872I216i33888C14368g32160
355F7072d50560k83136B64192d4032p91552a05472k85184a5872p44960G57248
344g680m16768h192G67488J9456A97120c65568a15200C53792a56160l15392M5568
333d25984E67808i33888M61312A028096d9664l72224k82112m02432B1504g35744
322g70560E61152b44224L3280n67296L27680B93888h24320B00704h73984b12480
$$ y = [74240, 225792, -934400, -976896, 148480, -142336, -72704, -488448, -92672, -126976, -1350144, -522752, -1325568, 356864, -851456, 600064, -1265152, 226304, -544256, -729088, 219648, -128000, -288768, -1251840, -301056, 724480, 328192, -558592, 170496, 476160, -817664, 715264, -774656, -610304, 283136, 238080, -143360, -463872, -64000, -514048, -1297920, 9216, -933888, 314368, -732160, 67072, -450560, -733696, 264192, -44032, -835584, -105472, -390656, -15872, -760832, 757248, -7680, -424448, -8192, 767488, 786944, 197120, -365568, -115200, 353792, -156160, -471552, -425984, 567808, -933888, -472576, 1028096, -49664, -421888, -704000, -1106432, 21504, -735744, -770560, 561152, -244224, -210944, -778240, -450560, 293888, -824320, 200704, -873984, -212480]
311D21376a261568D85376I2672J247744E57056C3792i2160A69984b37568A054720
300g16288J50528p8848C0208d44928H04352b4576K560j35168j60256q98048b18624
288H4480i3184C45600a60768q05376M54144C36384d5056C81440b66752B92864
277E94432e46304A170944K1504B77504f86592A04448h26368J14688d9152l24608
267c73760l46112J88928E56544d71552C4816K30400b03776A29024l9936a76640
256a038336D39296g22944J48480A66400e40672F9120K64704@C98336h60160B1504
244b02752k59584E43232L33312A4336R03680C61472d51584A87904e10976A14176
233i41056K80576a88928k88256A23392d66944K00704o37440d44928J16224H1408
$$ y = [421376, -1261568, 485376, 92672, 1340416, 557056, 33792, -92160, 169984, -237568, 1054720, -716288, -565760, -644608, 30208, -444928, 804352, -24576, -22016, -157184, -317440, -1215488, -218624, 84480, -93184, 345600, -160768, -966144, -512000, 336384, -45056, 381440, -266752, 292864, 594432, -546304, 1170944, 1192448, 277504, -686592, 104448, -826368, -711680, -49152, -373760, -719872, -530944, 556544, -471552, 34816, 265216, -203776, 129024, 89088, -176640, -1038336, 439296, -722944, -574464, 166400, -540672, 69120, 333824, 0, 398336, -860160, 21504, -202752, -462336, 543232, 876544, 14336, 918016, 361472, -451584, 187904, -510976, 114176, -941056, -660480, -188928, -477184, 123392, -466944, -266240, -903680, -444928, -328704, 81408]
222d74112A87392M65920B62144O55872D46464j09568m4544f31296E43744h2432
211c90144F51264B14528b10944m85376d0960l51744B97984c60960a5360B0992
200b16064E6320O86080i29792D05504M19840g7824j88416A25952a265152G37792
189D32128a026048a4336p27040i0624E70368a19296p45984L9936A111552b30912
178i10848c57888a39264C52256c65568B46784a03936L0720k15552m56192o02624
168a347584f08256H6528a36192j088512A03936a140224m22912c18976k41664D72576
157a012736L63008H43264a33120B76992P2704g69536J56672J32096J80736A98656
146d18816R6256G57760h48384a00352j89952F1440L96288e36064b3040A0752J2288
$$ y = [-474112, 187392, 653312, 262144, 918016, 446464, 336896, 292352, -631296, 543744, -82432, -390144, 651264, 214528, -210944, -696320, -40960, -392704, 297984, -360960, -15360, 20992, -216064, 56320, 742400, -929792, 405504, 825344, -77824, -266240, 125952, -1265152, 737792, 432128, -1026048, -14336, -741376, -90624, 570368, -119296, -865280, -825344, 1111552, -230912, -910848, -357888, -139264, 352256, -365568, 246784, -103936, -73216, -288768, -744960, -1347584, -608256, 86528, -136192, -1224704, 103936, -1140224, -1563136, -318976, -560640, 472576, -1012736, -649728, 843264, -133120, 276992, 349696, -769536, -612864, -480768, -300032, 198656, -418816, -322560, 757760, -848384, -100352, -290304, 61440, 457728, -536064, -23040, 10752, 23040]
135B3040J68448n9904f51264c7376A90976d7104k91328f5024b8160D66944A00352
123e84704K14528a31072M4544m46464b04288C5840e0176A85856O4000f09280K47808
112c61472j63840l04640A25440a1776r38496H76032A98144e92896n28384F25152
101A30048J9968N20192d46976q58112c17440H01280h704j133056A60256a10592
90C51232b17600o48192L05152C73248a28000@E22752a360384B39616R00608B21696
78C66592A33120c84512A80224a019392d41344m01408c74784A16736h26368C97312
67g47008n3760A594368d096A01376N0688f83520K56512I2672f07232c9936m44416
56d84352b08896G88992A58720c05152C89632l0208i03168c58912l60448c48160
$$ y = [23040, 191488, 131584, -651264, -37376, 190976, -47104, -338432, -65024, -28160, 466944, 100352, -584704, -370176, -131072, -86528, -532992, -204288, 35840, -50176, 185856, 249856, -609280, -361472, -525312, -829952, 125440, -11776, -950272, 876032, 198144, -592896, -1121280, 625152, 130048, 150016, 670208, -446976, -1305088, -317440, 801280, -8704, -1141760, 160256, -110592, 351232, -217600, -865792, -560640, 373248, -128000, 0, 522752, -1360384, 239616, 1140224, 221696, 366592, 133120, -384512, 180224, -1019392, -441344, -842752, -374784, 116736, -826368, 397312, -747008, -800768, 1594368, -4096, 101376, 152064, -683520, -427008, 92672, -607232, -39936, -484352, -208896, 788992, 158720, -305152, 389632, 359424, -903168, -358912, -719360, -348160]
45a224704B85184A15712L67616a59232B96960f07744J09568q7040D08576M35712
35H44288d91008m0448m61824C22048c80928F02112f57920D41344e45280R5232
25d50048I33376d37248C67616b73408A6384N84192d56704J36192p38816b57024
14d59264K04288F62528d1472m50560m34688H98048A82272a20832C10784c07200
3f35392A138176a69472D58240
$$ y = [-1224704, 285184, 115712, 483328, -159232, 296960, -607744, -498176, -585216, 408576, 844288, -491008, -531456, -993280, 322048, -380928, 602112, -657920, 441344, -545280, -450048, 933376, -437248, 367616, -273408, 16384, 600576, -456704, -320512, -1059328, -257024, -459264, -254976, 662528, -41472, -492032, -926720, 898048, 182272, -120832, 310784, -307200, -635392, 1138176, -169472, 458240]
##END=
