##TITLE=1431
##JCAMPDX= 6.0         $$ Bruker NMR JCAMP-DX V2.0
##DATA TYPE= NMR SPECTRUM
##DATA CLASS= XYDATA
##ORIGIN= NUTS EXPORT
##OWNER= Administrator
$$ 1.72 TOPSPIN		Version 2.1
$$ 2016-02-23 12:24:23.293 -0800  Administrator@X
$$ Compression mode = diff/dup
##.OBSERVE FREQUENCY= 90.275459
##.ACQUISITION MODE= SIMULTANEOUS (DQD)
##.ACQUISITION SCHEME= undefined
##.AVERAGES= 16
##.DIGITISER RES= 22
##SPECTROMETER/DATA SYSTEM= 
##.PULSE SEQUENCE= zg30
##.SOLVENT NAME= None
##.SHIFT REFERENCE= INTERNAL, None, 1, 14.28858
##AUDIT TRAIL= $$ (NUMBER, WHEN, WHO, WHERE, PROCESS, VERSION, WHAT)
$$ ##TITLE= Audit trail, TOPSPIN		Version 2.1
$$ ##JCAMPDX= 5.01
$$ ##ORIGIN= Bruker BioSpin GmbH
$$ ##OWNER= Administrator
$$ $$ E:/data/jwist/nmr/1431/1/pdata/1/auditp.txt
$$ ##AUDIT TRAIL=  $$ (NUMBER, WHEN, WHO, WHERE, PROCESS, VERSION, WHAT)
(   1,<2016-02-23 09:29:10.793 -0800>,<Administrator>,<X>,<jcamp>,<TOPSPIN 2.1>,
      <fromjdx created from
       E:\data\jwist\nmr\uniandes\1431
       data hash MD5: 8K
       F7 AF 40 D7 EA 19 C8 38 5E 1A A0 3E B6 D1 74 45>)
$$ ##END=
$$ 
$$ $$ hash MD5
$$ $$ DB D2 6B DA 29 40 7E BF DE 30 FB E0 7D 4D 4B F9
##$RELAX= 
$$ Bruker specific parameters
$$ --------------------------
##$DU= <E:>
##$EXPNO= 1
##$NAME= <1431>
##$PROCNO= 1
##$TYPE= <nmr>
##$USER= <jwist>
##$ACQT0= 0
##$AMP= (0..31)
100 100 100 100 100 100 100 100 100 100 100 100 100 100 100 100 100 100
100 100 100 100 100 100 100 100 100 100 100 100 100 100
##$ANAVPT= 1
##$AQSEQ= 0
##$AQ_mod= 3
##$AUNM= <au_zg>
##$AUTOPOS= <>
##$BF1= 90.275459
##$BF2= 400.02
##$BF3= 400.02
##$BF4= 400.02
##$BF5= 400.02
##$BF6= 400.02
##$BF7= 400.02
##$BF8= 400.02
##$BYTORDA= 0
##$CFDGTYP= 0
##$CFRGTYP= 0
##$CHEMSTR= <none>
##$CNST= (0..63)
1 1 145 1 1 1 1 1 1 1 1 1 1 1 1 1 1 1 1 1 1 1 1 1 1 1 1 1 1 1 1 1 1 1 1
1 1 1 1 1 1 1 1 1 1 1 1 1 1 1 1 1 1 1 1 1 1 1 1 1 1 1 1 1
##$CPDPRG= <>
##$CPDPRG1= <>
##$CPDPRG2= <>
##$CPDPRG3= <>
##$CPDPRG4= <mlev>
##$CPDPRG5= <mlev>
##$CPDPRG6= <mlev>
##$CPDPRG7= <mlev>
##$CPDPRG8= <mlev>
##$CPDPRGB= <>
##$CPDPRGT= <>
##$D= (0..63)
0 1 0 0 0 0 0 0 0 0 0 0 0 0 0 0 0 0 0 0 0 0 0 0 0 0 0 0 0 0 0 0 0 0 0 0
0 0 0 0 0 0 0 0 0 0 0 0 0 0 0 0 0 0 0 0 0 0 0 0 0 0 0 0
##$DATE= 0
##$DBL= (0..7)
120 120 120 120 120 120 120 120
##$DBP= (0..7)
150 150 150 150 150 150 150 150
##$DBP07= 0
##$DBPNAM0= <>
##$DBPNAM1= <>
##$DBPNAM2= <>
##$DBPNAM3= <>
##$DBPNAM4= <>
##$DBPNAM5= <>
##$DBPNAM6= <>
##$DBPNAM7= <>
##$DBPOAL= (0..7)
0.5 0.5 0.5 0.5 0.5 0.5 0.5 0.5
##$DBPOFFS= (0..7)
0 0 0 0 0 0 0 0
##$DE= 6.5
##$DECBNUC= <off>
##$DECIM= 2432
##$DECNUC= <off>
##$DECSTAT= 4
##$DIGMOD= 1
##$DIGTYP= 12
##$DL= (0..7)
0 120 120 120 120 120 120 120
##$DP= (0..7)
150 150 150 150 150 150 150 150
##$DP07= 0
##$DPNAME0= <>
##$DPNAME1= <>
##$DPNAME2= <>
##$DPNAME3= <>
##$DPNAME4= <>
##$DPNAME5= <>
##$DPNAME6= <>
##$DPNAME7= <>
##$DPOAL= (0..7)
0.5 0.5 0.5 0.5 0.5 0.5 0.5 0.5
##$DPOFFS= (0..7)
0 0 0 0 0 0 0 0
##$DQDMODE= 0
##$DR= 22
##$DS= 2
##$DSLIST= <SSSSSSSSSSSSSSS>
$$ [...]
##$SPOFFS= (0..31)
0 0 0 0 0 0 0 0 0 0 0 0 0 0 0 0 0 0 0 0 0 0 0 0 0 0 0 0 0 0 0 0
##$SUBNAM0= <"">
##$SUBNAM1= <"">
##$SUBNAM2= <"">
##$SUBNAM3= <"">
##$SUBNAM4= <"">
##$SUBNAM5= <"">
##$SUBNAM6= <"">
##$SUBNAM7= <"">
##$SUBNAM8= <"">
##$SUBNAM9= <"">
##$SW= 20.5580556627758
##$SWIBOX= (0..15)
0 0 3 4 0 0 0 0 0 0 0 0 0 0 0 0
##$SW_h= 8223.68421052631
##$SWfinal= 0
##$TD= 65536
##$TD0= 1
##$TE= 300
##$TE2= 300
##$TE3= 300
##$TEG= 300
##$TL= (0..7)
0 120 120 120 120 120 120 120
##$TP= (0..7)
150 150 150 150 150 150 150 150
##$TP07= 0
##$TPNAME0= <>
##$TPNAME1= <>
##$TPNAME2= <>
##$TPNAME3= <>
##$TPNAME4= <>
##$TPNAME5= <>
##$TPNAME6= <>
##$TPNAME7= <>
##$TPOAL= (0..7)
0.5 0.5 0.5 0.5 0.5 0.5 0.5 0.5
##$TPOFFS= (0..7)
0 0 0 0 0 0 0 0
##$TUNHIN= 0
##$TUNHOUT= 0
##$TUNXOUT= 0
##$USERA1= <user>
##$USERA2= <user>
##$USERA3= <user>
##$USERA4= <user>
##$USERA5= <user>
##$V9= 5
##$VALIST= <valist>
##$VCLIST= <CCCCCCCCCCCCCCC>
##$VD= 0
##$VDLIST= <DDDDDDDDDDDDDDD>
##$VPLIST= <PPPPPPPPPPPPPPP>
##$VTLIST= <TTTTTTTTTTTTTTT>
##$WBST= 1024
##$WBSW= 4
##$XGAIN= (0..3)
0 0 0 0
##$XL= 0
##$YL= 0
##$YMAX_a= 1382390912
##$YMIN_a= -4707318.272
##$ZGOPTNS= <>
##$ZL1= 120
##$ZL2= 120
##$ZL3= 120
##$ZL4= 120
##$ABSF1= 10
##$ABSF2= 0
##$ABSG= 5
##$ABSL= 3
##$ALPHA= 0
##$AQORDER= 0
##$ASSFAC= 0
##$ASSFACI= 0
##$ASSFACX= 0
##$ASSWID= 0
##$AUNMP= <proc_1d>
##$AXLEFT= 0
##$AXNAME= <>
##$AXNUC= <off>
##$AXRIGHT= 0
##$AXTYPE= 0
##$AXUNIT= <>
##$AZFE= 0.1
##$AZFW= 0.1
##$BCFW= 1
##$BC_mod= 2
##$BYTORDP= 0
##$COROFFS= 0
##$CY= 15
##$DATMOD= 1
##$DC= 2
##$DFILT= <>
##$DTYPP= 0
##$F1P= 0
##$F2P= 0
##$FCOR= 0.5
##$FTSIZE= 0
##$FT_mod= 4
##$GAMMA= 1
##$GB= 0
##$INTBC= 1
##$INTSCL= 1
##$ISEN= 128
##$LB= 0.3
##$LEV0= 0
##$LPBIN= 0
##$MAXI= 10000
##$MC2= 0
##$MEAN= 0
##$ME_mod= 0
##$MI= 0
##$NCOEF= 0
##$NC_proc= -9
##$NLEV= 6
##$NOISF1= 0
##$NOISF2= 0
##$NSP= 1
##$NTH_PI= 0
##$NZP= 0
##$OFFSET= 14.28858
##$PC= 1
##$PHC0= 0
##$PHC1= 0
##$PH_mod= 0
##$PKNL= yes
##$PPARMOD= 0
##$PPDIAG= 0
##$PPIPTYP= 0
##$PPMPNUM= 2147483647
##$PPRESOL= 1
##$PSCAL= 4
##$PSIGN= 0
##$PYNMP= <proc.py>
##$REVERSE= no
##$SF= 90.2741691098876
##$SI= 8192
##$SIGF1= 0
##$SIGF2= 0
##$SINO= 400
##$SIOLD= 32768
##$SPECTYP= <>
##$SREGLST= <1H.CDCl3>
##$SSB= 0
##$STSI= 0
##$STSR= 0
##$SW_p= 1497.18866228788
##$SYMM= 0
##$S_DEV= 0
##$TDeff= 0
##$TDoff= 0
##$TI= <>
##$TILT= no
##$TM1= 0
##$TM2= 0
##$TOPLEV= 0
##$USERP1= <user>
##$USERP2= <user>
##$USERP3= <user>
##$USERP4= <user>
##$USERP5= <user>
##$WDW= 1
##$XDIM= 8192
##$YMAX_p= 1382390784
##$YMIN_p= -4706816
##$CURPLOT= <PDFCreator>
##$CURPRIN= <$PDFCreator>
##$DFORMAT= <normdp>
##$LAYOUT= <+/1D_H.xwp>
##$LFORMAT= <normlp>
##$PFORMAT= <normpl>
##$SURQMSG= 1
$$ End of Bruker specific parameters
$$ ---------------------------------
##XUNITS= HZ
##YUNITS= ARBITRARY UNITS
##XFACTOR= 0.182762287876938
##YFACTOR= 1
##DELTAX= -0.182762287876938
##NPOINTS= 8192
##FIRSTX= 1497.0059
##FIRSTY= -4706816
##LASTX= 0
##MAXY= 1382390784
##MINY= -4706816
##XYDATA= (X++(Y..Y))
$$ plain form
8191 -4706816 680448 -1102336 425472 1146880 837632 -1024 872960 -137728 -460800 227328
8180 823296 -404992 1635840 -513536 738816 437248 525824 96256 -920064 -121344 315392
8169 284160 471552 -96768 162304 -202240 640000 -258048 128512 -759808 677888 1415680
8159 1415680 -689664 -907264 984576 877568 301568 -158720 322560 -427008 34816 29696
8149 29696 708096 138752 -169984 946688 490496 -467456 365568 257024 539136 -59392
8138 216064 299008 117760 -599552 34304 677376 -442368 348672 -170496 99840 -841728
8127 361984 272384 -1064448 384000 26624 -348672 862208 -225792 526336 -977920 -142336
8116 -120320 -656896 452096 -81408 -654848 777216 1070592 -450048 -694272 1110528 -107520
$$ packed form
8191d706816F80448a102336D25472P21408l09248a024H72960a37728l23072B27328
8180H23296d04992A635840e13536G38816l01568Q8576I6256i20064a21344C15392
8169B84160J87392i6768A62304b02240F40000b58048A28512g59808F77888P37792
8159A415680f89664k17600I84576j07008C01568a58720C22560d27008C4816n120
8149B9696O78400A38752a69984I46688m56192d67456C65568j08544K82112e9392
8138B16064Q2944A17760e99552C4304O43072d42368C48672a70496I9840h41728
8127C61984q9600a064448C84000B6624c48672H62208b25792E26336i77920a42336
8116a20320n36576D52096h1408n73440G77216K93376d50048k44224A110528a07520
$$ plain form
8105 734720 -762368 -214016 1003008 704000 255488 -937472 -260096 -212480 -667648 529408
8094 -328192 900096 -38912 -71680 244736 1146880 1193472 122368 258048 545280 -692736
8083 593408 714240 972288 -66560 -78336 -798720 210944 -598528 973824 -181760 -821248
8073 -821248 516608 381440 -9216 559616 275968 1025024 798208 229888 157696 -301568
8062 -85504 504832 -150528 951296 226304 378880 509440 1103360 49152 122368 -271872
8051 159232 157184 906240 -268800 -2048 -794112 -579072 97792 278016 392192 195584 121856
8040 121856 539136 1127424 868864 440320 -597504 68608 -299008 136704 735232 509952
8030 509952 575488 443392 1935360 331776 306176 2222080 158720 941056 -454144 1057792
$$ packed form
8105G34720g62368b14016A003008k99008B55488i37472b60096M7616m55168E29408
8094c28192I00096c8912l2768B44736R02144M6592A22368J35680K87232f92736
8083E93408J20832K58048f6560j1776p20384B10944e98528I73824a81760o39488
8073h21248E16608j35168i216E59616B75968P49056k26816B29888p2192c01568
8062h5504E04832a50528I51296B26304J52576J30560N93920D9152P3216b71872
8051A59232k048P49056b68800b048p92064K15040I7792J80224J14176A95584p3728
8040A21856M17280N88288k58560m28544e97504F8608b99008A36704N98528k25280
8030E09952O5536j32096J491968C31776k5600J915904A58720P82336d54144A057792
$$ plain form
8019 542208 -40448 1596928 -24064 1299456 -212480 279040 352768 806400 -420352 -20992
8008 371712 -8704 363520 1006592 -178176 824320 466944 -33280 320000 1033728 -56320
7997 616448 189440 880640 10240 -308224 913408 346112 -549376 3072 108544 -828416
7986 286208 554496 506368 909312 1524736 1005056 156160 -77312 1734656 689664 716288
7976 716288 -65024 1058304 -39424 38912 -27136 313344 759296 816128 2015744 172032
7965 822272 671232 -350208 688640 287744 256000 -144896 708096 518144 -560128 600576
7954 -438784 368640 1295872 202752 352256 276992 816128 341504 337408 946176 1487872
7944 1487872 995840 429056 578560 336384 171008 1500672 55808 581120 364544 1071616
$$ packed form
8019E42208d0448A596928b4064A299456b12480B79040P3728M53632d20352b0992
8008C71712h704C63520O43072a78176H24320l57376c3280C20000P13728e6320
7997F16448A89440O91200A0240c08224I13408C46112e49376C072J05472h28416
7986B86208K68288m8128M02944O15424n19680A56160g7312A734656F89664K6624
7976G16288f5024A058304c9424C8912b7136C13344M45952N6832J199616A72032
7965H22272j51040c50208F88640B87744l1744a44896G08096j89952e60128F00576
7954d38784C68640R27232B02752J49504p5264N39136C41504m096O08768N41696
7944A487872m92032D29056J49504k42176j65376J329664E5808N25312k16576P07072
$$ plain form
7934 1071616 53760 401920 1255424 963584 -310272 -197632 929792 901120 1812480 106496
7923 -93184 1918464 -249856 804352 1336832 750592 506368 1555968 -543232 326144 1091072
7913 1091072 1204736 284160 68096 463872 858624 585728 908800 559104 37376 -501248
7902 1697792 374784 619008 318976 368640 872960 1045504 -657920 927744 -82944 -38912
7891 -72192 681984 494592 601088 -670208 -65024 741376 828928 856576 1773568 657920
7880 661504 239104 478208 639488 -243712 -62976 297472 545792 -185856 826368 297984
7869 1958912 762368 138240 -139776 814592 1123840 714752 700416 161280 33280 863232
7859 863232 1071616 1349120 40960 693248 -437760 1097216 165888 380416 -432128 752640
$$ packed form
7934A071616E3760L48160Q53504k91840c10272J12640I29792k8672R11360A06496
7923i3184A918464b49856H04352N32480n86240k44224J049600e43232C26144P64928
7913A091072J13664B84160F8096L95776L94752k72896L23072l49696C7376e01248
7902A697792C74784K44224l00032M9664N04320J72544f57920I27744h2944c8912
7891g2192F81984j87392J06496f70208f5024G41376Q7552K7648R16992F57920
7880F61504B39104K39104J61280b43712f2976B97472K48320a85856H26368B97984
7869A958912G62368A38240a39776H14592L09248m09088j4336A61280C3280Q29952
7859H63232K08384K77504D0960O52288d37760A097216A65888K14528d32128G52640
$$ plain form
7848 -103936 599552 1103872 985600 787968 978432 977920 293376 753664 359424 890880
7838 890880 158208 710656 95232 -826880 215552 -268800 512512 1237504 -507904 862720
7827 420352 364032 472576 223744 386560 863744 254976 796160 754688 -310784 1245184
7816 648704 413696 649728 1107456 274432 18432 1075712 663040 913408 772608 1330688
7806 1330688 566272 925696 425984 1206784 257536 599552 232448 999424 466432 67072
7795 957440 888832 295424 -246784 137216 856064 874496 1566208 913408 471552 1139712
7785 1139712 1334784 371712 937472 989696 -539136 235520 1120256 506880 -624128 126464
7774 765952 1773568 1253888 1234944 412160 846336 -727040 969216 787968 934400 866816
$$ packed form
7848a03936E99552N04320j18272j97632J90464n12B93376M60288C59424N31456
7838H90880A58208N52448I5232h26880B15552b68800E12512P24992e07904H62720
7827D20352n6320J08544B23744J62816M77184B54976N41184m1472c10784A245184
7816F48704k35008K36032M57728B74432A8432J057280m12672K50368j40800N58080
7806A330688E66272L59424D25984P80800B57536L42016B32448P66976D66432F7072
7795I57440o8608B95424b46784A37216P18848J8432O91712o52800m41856O68160
7785A139712J95072C71712N65760N2224e39136B35520Q84736E06880f24128A26464
7774G65952J007616n19680j8944D12160M34176g27040I69216j81248J46432o7584
$$ plain form
7764 866816 -403968 1021440 392704 312832 964096 -103424 337920 1368576 1198080 1215488
7754 1215488 118784 951296 109056 667136 468992 297984 403456 1979904 617984
7744 866816 1028096 480768 1236992 514048 765952 1202176 208384 1136640 236544 1811968
7734 1811968 399872 929792 516608 7168 1165824 253440 -215552 -133632 457216 522240
7724 522240 254464 1289728 912896 1245184 530944 954368 934912 603136 921088 705536
7714 705536 221184 249344 709632 109568 248320 1302016 1916416 1036288 180224 1579520
7704 1579520 1462272 330240 1046528 854016 407040 81408 261632 233984 418816 -388608
7693 1503744 463872 489984 297472 968192 1080832 762880 1346560 -149504 1162240 1309184
$$ packed form
7764H66816d03968A021440C92704p9872O51264a03424C37920J030656j70496J7408
7754A215488A18784Q32512A09056N58080j98144j71008J05472J576448F17984
7744H66816J61280D80768P56224E14048K51904M36224B08384R28256B36544J575424
7734A811968C99872N29920m13184G168J158656B53440b15552Q1920D57216O5024
7724E22240B54464J035264l76832L32288E30944M23424j9456l31776L17952k15552
7714G05536B21184K8160M60288A09568J38752J053696O14400q80128A80224J399296
7704A579520j17248C30240P16288j92512D07040H1408J80224k7648J84832c88608
7693A503744D63872K6112j92512O70720J12640l17952N83680a49504A162240J46944
$$ plain form
7683 1309184 1000448 1321984 991232 734720 441856 1401856 268288 114688 790528 -429568
7672 424448 375808 1547264 1921024 1991168 1255424 61440 220672 1009664 876032 192512
7661 -210432 866304 296960 139264 1590784 -47616 1438720 881152 770048 92160 321024
7651 321024 861696 705536 1176064 344064 1030656 579584 940032 930304 777216 349696
7640 834560 812032 931328 506368 788480 1014784 640512 784896 807936 538112 1779200
7630 1779200 1589760 445440 1563136 2294272 1392640 731136 462848 1779200 239104
7620 1029120 1692672 666624 708608 308224 798720 -148480 999424 794624 383488 535552
7610 535552 731648 667136 1073152 1375744 1216512 519680 689664 391168 285184 1847296
$$ packed form
7683A309184l08736L21536l30752k56512k92864R60000B68288A14688O75840d29568
7672D24448m8640J171456L73760P0144p35744F1440J59232P88992j33632A92512
7661b10432H66304B96960A39264J451520d7616A438720n57568j11104I2160K28864
7651C21024N40672j56160M70528C44064O86592m51072L60448r728j53088C49696
7640H34560k2528J19296m24960K82112K26304l74272J44384K3040k69824J241088
7630A779200j89440D45440J117696P31136r01632o61504k68288J316352B39104
7620A029120O63552F66624M1984C08224M90496a48480I99424k04800C83488J52064
7610E35552J96096o4512M06016L02592j59232E19680J69984k98496j05984J562112
$$ plain form
7600 1847296 1861120 607744 64000 904704 1337856 1205760 1129472 2386944 1231872 531456
7589 1110016 622080 45568 430592 1081344 131584 1435648 1166336 -196096 636416 288256
7578 21504 757760 860160 -84992 -468480 368128 800768 1436672 682496 1792000 696832
7567 1415680 1274880 544256 -66560 1201664 1869312 751104 904704 411648 1105920 1263616
7557 1263616 563712 -200704 -96768 601600 944640 1124864 882688 939008 1375232 1236992
7547 1236992 1347072 785920 1556992 862208 918528 873472 358912 151040 -513024 1633280
7536 1444864 42496 657920 210944 1625088 1192448 822784 1459200 459776 876544 37376
7525 -145920 1131520 487936 1099264 848896 234496 1886720 1259008 1696256 608256
$$ packed form
7600A847296J3824F07744F4000Q40704M33152j32096p6288J257472j155072E31456
7589A110016m87936D5568L85024O50752A31584J304064k69312a96096F36416B88256
7578B1504P36256J02400h4992l83488C68128M32640O35904F82496J109504F96832
7567A415680j40800E44256f6560A201664O67648G51104J53600D11648O94272J57696
7557A263616E63712b00704i6768F01600L43040J80224k42176N6320M36224j38240
7547A236992J10080n61152P71072o94784N6320m5056C58912A51040e13024A633280
7536A444864D2496O15424B10944J414144m32640l69664O36416D59776M16768C7376
7525a45920A131520D87936O11328k50368B34496J652224o27712M37248F08256
$$ plain form
7515 1290240 547328 578560 747520 680448 887808 323584 714240 1092608 505344 1220096
7505 1220096 778752 833536 771072 1679872 1584640 1436160 664576 1824768 413184 1031680
7495 1031680 119296 2328064 535552 1207808 834560 240640 1313792 244224 693760
7486 693760 1143808 1462272 1162240 896000 -120832 1788928 1053184 1428992 1646592 376832
7475 1439744 1164800 1891840 1043456 1479168 342016 1893888 757760 1708032 712192
7465 709120 1082368 1406976 755200 1287680 1972224 1227264 787968 454144 1080320 1239552
7455 1239552 682496 193024 1319424 554496 1297920 1284096 1011200 1337856 1122816 1170944
7445 1170944 328704 1233920 1089024 441856 477696 491008 611328 1782272 845312 771072
$$ packed form
7515A290240E47328L1232J68960o7072K07360C23584L90656L78368E05344P14752
7505A220096m41344N4784o2464R08800r5232j48480F64576J160192D13184O18496
7495A031680A19296K208768E35552O72256l73248B40640J073152B44224M49536
7486F93760M50048L18464l00032k66240a20832A788928p35744L75808K17600C76832
7475A439744k74944P27040q48384M35712C42016J551872G57760R50272G12192
7465G09120L73248L24608o51776N32480O84544p44960m39296l33824O26176J59232
7455A239552n57056A93024J126400E54496P43424j3824k72896L26656k15040M8128
7445A170944C28704R05216j44896D41856L5840J3312J20320J170944H45312p4240
$$ plain form
7435 771072 1394688 799232 865792 -167936 1074176 319488 560128 1086464 1428480 1417728
7425 1417728 709120 651776 693760 1269248 119296 1946624 1328640 879104 2737152 1591296
7415 1591296 596480 796160 626688 905728 515072 -146432 978944 608256 657920 928256
7405 928256 385536 1094656 1267712 740352 1048576 1779712 1022464 1180160 1147392 575488
7395 575488 1148416 354816 1390592 59904 827392 1295360 956928 822272 715776 1069568
7385 1069568 527360 1510400 514048 770048 1227264 863744 1753088 1359360 -123904 1307648
7374 563712 1604096 1469952 1246720 722432 1074688 1168896 2514944 768512 -220160 1435648
7363 631808 630784 1804800 898048 1303552 1161216 280064 999424 1561600 546816 1645568
$$ packed form
7435G71072O23616n95456O6560a67936A074176C19488K40640N26336L42016j0752
7425A417728p08608n7344M1984N75488A19296J827328o17984m49536J858048j145856
7415A591296E96480J99680j69472K79040l90656a46432I78944l70688M9664K70336
7405I28256C85536P09120J73056n27360L08224P31136p57248J57696l2768n71904
7395E75488N72928C54816J035776E9904P67488M67968l38432j34656j06496L53792
7385A069568E27360R83040E14048K56000M57216l63520Q89344l93728a23904A307648
7374E63712J040384j34144k23232n24288L52256R4208J346048G68512b20160A435648
7363F31808j024J174016H98048M05504j42336B80064P19360N62176E46816J098752
$$ plain form
7353 1645568 1738752 1036288 497152 1593856 1177088 918528 1221632 1955840 77312 464384
7343 464384 233472 1063936 1474560 1104896 -206848 2691072 1120256 1222656 1867264
7334 1867264 1043968 1186304 1333760 423936 923648 1958400 1235968 1007616 945664 565760
7324 565760 -43008 1063936 603648 2079744 276480 1082368 608256 800768 1802752
7315 1802752 1099264 1532416 1752576 1959936 1820672 1127936 845312 864768 287232 1730560
7305 1730560 805376 1868288 1300480 248832 1104384 2411008 2058240 758272 1465856
7296 1465856 1318400 1113088 858624 343552 972800 834560 842240 1073664 35328 1552384
7286 1552384 1385472 357376 1428992 839168 1084928 469504 858112 1231872 1728000
$$ packed form
7353A645568R3184p02464D97152J096704m16768k58560L03104P34208G7312L87072
7343D64384k30912Q30464M10624l69664b06848B691072A120256J02400O44608
7334A867264q23296J42336J47456D23936M99712J034752p22432k28352o1952l79904
7324E65760d3008A063936m60288J476096B76480Q05888m74112J92512J001984
7315A802752p03488M33152K20160K07360j39264o92736k82624J9456B87232J443328
7305A730560H05376J062912n67808B48832Q55552J306624l52768G58272P07584
7296A465856j47456k05312k54464C43552O29248j38240P680K31424C5328J517056
7286A552384j66912C57376J071616n89824K45760D69504L88608L73760M96128
$$ plain form
7277 1728000 1477632 1568768 416256 1851392 333312 653312 1115136 2029056 743424 1135104
7267 1135104 770560 1525760 509440 1943040 9728 1008128 2053632 643072 920576 532992
7257 532992 1468416 1296896 2073600 940032 770560 1988096 737280 1389568 1001472 1645568
7247 1645568 544768 1342464 -119296 1210368 1775104 1402880 1366016 1442304 1364480 1573376
7237 1573376 1725952 399872 1201664 798208 817152 811520 1234944 1356288 2210816 1585152
7227 1585152 1147392 983040 1082368 645632 1753600 1142784 390144 1598464 773632
7217 793600 1583616 1783808 1200128 1382400 932352 1577984 1070592 1483776 2274304 838144
7206 691200 953344 1579520 1313280 2238464 1119744 1319936 812544 2074112 266752
$$ packed form
7277A728000k50368R1136D16256J435136C33312L20000M61824R13920G43424L91680
7267A135104l64544P55200E09440J433600I728R98400J045504F43072K77504l87584
7257E32992R35424j71520P76704I40032j69472J217536G37280O52288l88096O44096
7247A645568E44768P97696a19296A210368N64736l72224l6864P6288p7824K08896
7237A573376J52576C99872Q01792m03456J8944n632M23424J21344Q54528o25664
7227A585152m37760j64352R9328m36736J107968o10816C90144J208320G73632
7217G93600P90016K00192n83680J82272m50048O45632n07392M13184P90528H38144
7206F91200K62144O26176k66240R25184j118720K00192n07392J261568B66752
$$ plain form
7196 1654272 1741824 367616 1283584 1259520 1479168 1651712 1355264 162304 1325056 1541120
7186 1541120 1379328 1246720 818688 1125888 1318400 1343488 1714688 896000 1326080 1242112
7176 1242112 734720 2095616 846848 415232 1459200 2345472 1044992 943104 1867264
7167 1867264 1683968 251904 711168 1185792 1294848 1415168 1061376 1767424 339968 1264128
7157 1264128 1674240 2592768 1116672 845312 1749504 1725952 2087936 1239040 2353664
7148 2353664 1026048 2192896 2427392 1900544 1362432 1703936 885248 537600 1216512
7139 1216512 1563648 1335296 962048 1753088 846848 1230848 1583616 1309184 1057280 2378240
7129 2378240 1679360 688640 1750528 1263104 1711616 1319936 807936 1802752 1242624
$$ packed form
7196A654272Q7552C67616R15968k4064K19648J72544k96448A62304J162752K16064
7186A541120j61792j32608m28032L07200J92512K5088L71200q18688M30080q3968
7176A242112n07392J360896H46848D15232J043968Q86272A044992j01888R24160
7167A867264j83296B51904M59264M74624J09056J20320l53792P06048C39968R24160
7157A264128M10112R18528A116672k71360R04192k3552L61984q48896J114624
7148B353664A026048J166848K34496n26848n38112L41504q18688l47648O78912
7139A216512L47136k28352l73248P91040H46848L84000L52768k74432k51904J320960
7129B378240o98880F88640J061888m87424M48512l91680n12000R94816n60128
$$ plain form
7120 1242624 1963520 1483776 1245184 1388032 1736192 533504 2084864 2205184 1086464
7110 1206272 1312256 1366016 1187328 802816 1010688 1418240 995840 828928 711680 1503744
7100 1503744 353280 947200 1419264 1827840 1676800 1186304 1123840 2169856 1105408
7091 1105408 2009088 1230336 2054144 2269184 1994752 1494528 775168 1226240 1611776 1071104
7081 1071104 2991616 1571840 958976 1478656 25088 1164288 1438208 1499648 67584 1624576
7071 1624576 1265664 1413120 2589696 1388544 1174016 963072 2212864 1260544 1687552
7062 1687552 1098240 1218560 1563648 1461248 2263040 2110464 1750016 681984 765952 1172480
7052 1172480 304128 1570816 1138688 2145280 1572352 1052160 1977344 731648 1126400
$$ packed form
7120A242624P20896m79744k38592J42848L48160E33504J551360J20320A086464
7110A206272J05984N3760j78688l84512K07872M07552m22400j66912j17248P92064
7100A503744C53280N93920M72064M08576j51040m90496o2464J046016j064448
7091A105408R03680p78752Q23808K15040k74432n00224p19360M51072L85536n40672
7081A071104J920512j419776o12864N19680B5088J139200K73920O1440F7584J556992
7071A624576l58912J47456J176576j201152k14528k10944J249792r52320M27008
7062A687552n89312J20320L45088j02400Q01792j52576l60448F81984Q3968M06528
7052A172480C04128J266688m32128J006592n72928n20192R25184G31648L94752
$$ plain form
7043 1126400 1000960 1860096 1396736 900608 1688064 551424 1106944 980992 1606144 2161664
7033 2161664 1893376 655360 1059328 638976 1524736 2143744 1923584 1930752 1709568 1746944
7023 1746944 1128960 2006016 2371072 792064 1060864 2270208 1050112 2399744 1146880
7013 964096 1417216 2190336 2611712 1606656 680448 1211904 1920000 1680896 839680 1632256
7003 1632256 1567744 798720 884224 744960 1650176 1610752 1957376 1020928 2152448 2238976
6993 2238976 2048000 1620480 1348096 2268160 740864 1795584 1313280 833536 880128 898048
6983 898048 962560 1547264 1866240 778240 1140736 2001920 1483776 393216 836608 432640
6973 432640 689152 970752 2129408 -209920 1026560 2908160 1829888 2337280 2157056
$$ packed form
7043A126400j25440Q59136m63360m96128P87456E51424N55520j25952O25152N55520
7033B161664k68288F55360M03968m20352Q85760O19008k20160P168k21184L7376
7023A746944o17984Q77056L65056G92064K68800J209344A050112J349632A146880
7013I64096M53120P73120M21376j005056F80448N31456P08096k39104H39680P92576
7003A632256o4512p69024Q5504j39264R05216l9424L46624r36448J131520Q6528
6993B238976j90976m27520k72384R20064G40864J054720m82304m79744M6592J7920
6983H98048O4512N84704L18976G78240L62496Q61184n18144C93216M43392m03968
6973D32640K56512K81600J158656b09920A026560J881600j078272N07392j80224
$$ plain form
6964 2157056 1796096 1905152 1798656 1731584 1660928 1581568 1285632 940032 1311232 391680
6953 1741312 1724416 1794560 1273344 1310208 711168 922112 1809408 1819136 1853952 1676288 1389568
6942 1389568 1912320 505856 1505280 1764864 2079232 1442816 1366528 1273344 1608704 1427968
6932 1427968 1113600 1739264 1440768 1183744 857600 847360 1262592 2257408 1271808 1572352
6922 1572352 1612288 1490432 613376 2106880 1294848 1302528 2909184 828416 2034688 774656
6911 1461248 1415168 2066944 866304 1664512 1109504 1896960 1416192 1568768 1292800 1240064
6901 1240064 2268160 513024 1948672 1095680 1199616 1464320 1544192 2587136 2669568
6892 2669568 2123264 1651200 1645056 1201152 2302976 1855488 616448 2438656 1232384
$$ packed form
6964B157056l60960J09056j06496o7072p0656p9360k95936l45600L71200C91680
6953A741312j6896P0144n21216L6864n99040K10944Q87296R728L4816j77664k86720
6942A389568N22752E05856R99424K59584L14368o36416p6288r3184L35360j80736
6932A427968l14368O25664k98496k57024l26144j0240M15232R94816r85600L00544
6922A572352L9936j21856F13376J493504q12032P680J606656H28416J206272G74656
6911A461248m6080O51776H66304P98208n55008P87456m80768J52576k75968n2736
6901A240064J028096E13024J435648q52992J03936K64704P9872J042944Q2432
6892B669568n46304m72064o144m43904J101824m47488F16448J822208j206272
$$ plain form
6883 1232384 2296832 1351680 2542592 1779712 2115584 527360 2048000 1795072 662528
6873 2667520 1300480 2346496 1479680 2576384 1144832 2163712 1584128 1691648 1789440
6864 1789440 2349568 1538048 1706496 1930240 890368 943616 1926144 1078784 791040 2617344
6854 2617344 2564096 904192 1169408 709632 34816 1157120 1515008 2480128 2343936 1872384
6844 1872384 1803264 1669632 1755136 927744 1354752 2100736 1484800 1923072 2153472 1159168
6834 1159168 1354240 1065984 1577472 1420800 611840 2155008 2447872 1868288 1904128 1112064
6824 1112064 1957376 1091584 1724928 1430016 1996288 1653248 916480 1168896 1910272 1473536
6814 1473536 1944576 1579008 1069056 250880 2345984 2412032 1337344 1760256 1696768 2505728
$$ packed form
6883A232384J064448r45152J190912p62880L35872E27360J520640k52928F62528
6873B667520A300480J046016q66816J096704A144832J018880n79584J07520R7792
6864A789440N60128q11520J68448K23744H90368N3248R82528q47360k87744J826304
6854B617344n3248I04192K65216m59776C4816J122304L57888R65120j36192m71552
6844A872384o9120j33632Q5504q27392M27008P45984o15936M38272K30400r94304
6834A159168J95072k88256N11488j56672F11840J543168K92864n79584L5840p92064
6824A112064Q45312q65792O33344k94912N66272l43040p36768K52416P41376m36736
6814A473536M71040l65568n09952B50880K095104O6048j074688M22912o3488Q08960
$$ plain form
6804 2505728 1573376 1570816 1901056 1803264 1502720 1509376 1402368 1224704 735744 2210816
6794 2210816 1371136 933888 1187840 1840640 2160640 1629696 1987072 565760 1603072
6785 1603072 769536 2176000 1633792 1164288 1819648 1224192 1660416 1222144 1948672
6776 1948672 1477632 1662976 1375744 2433536 1719808 2146816 1931776 736256 2188800
6767 2188800 1775104 2368512 1558016 1671680 1944064 2338816 2253824 537088 560128 2198016
6757 2198016 2164224 1781760 815104 1745920 1136128 1656320 1462272 1766912 1478656 384000
6746 2299392 1005056 2152448 2125312 1677312 1752064 1086976 1455616 609792 1590272 1140224
6736 1140224 321024 1677824 1524736 1542656 787456 1001984 1599488 1428992 1184768 1178112
$$ packed form
6804B505728r32352k560L30240r7792l00544O656j07008j77664m88960J475072
6794B210816q39680m37248K53952O52800L20000n30944L57376E65760J037312
6785A603072G69536J406464n42208m69504O55360n95456M36224m38272P26528
6776A948672m71040J85344k87232J057792p13728M27008k15040G36256J452544
6767B188800m13696N93408q10496J13664K72384L94752q4992E37088K3040J637888
6757B198016l3792l82464H15104R30816o09792N20192j94048L04640k88256C84000
6746B299392A005056J147392k7136m48000P4752o65088L68640F09792R80480m50048
6736A140224C21024J356800j53088J7920p55200K14528N97504j70496k44224o656
$$ plain form
6726 1178112 1228800 2313728 800256 858112 823808 1275904 1823744 1421312 2123776 1786880
6716 1786880 1767424 1136640 1482240 1763328 1431040 1545728 2939904 2545152 2337792 2611712
6706 2611712 1950720 -45056 636928 806400 2144256 1780224 1629696 1776128 1313792 1465344
6696 1465344 1828352 2369536 1976832 1162752 2551808 1627136 1466368 1351680 2323456
6687 2323456 2071552 1678336 669696 1417728 1152512 2436608 800768 1286144 2137088
6678 2137088 1819648 1798656 1923584 2819584 1384960 1455616 811520 1612800 3034624 1465344
6667 2007040 1961472 1584640 1917440 2165248 1131520 1662464 1478144 1924608 2147840 1464320
6657 1464320 2494976 1528832 1980416 2684416 1758720 1712128 1766400 946176 865792 645120
$$ packed form
6726A178112N0688J084928H00256N7856l4304M52096N47840m02432P02464l36896
6716A786880j9456o30784L45600K81088l32288J14688J394176l94752k07360K73920
6706B611712o60992d5056F36928J69472J337856l64032j50528J46432m62336J51552
6696A465344L63008N41184l92704q14080J389056r24672j60768j14688R71776
6687B323456k51904l93216F69696P48032k65216J284096H00768M85376Q50944
6678B137088l17440k0992J24928Q96000A384960P0656o44096Q01280J421824A465344
6667B007040m5568l76832L32800K47808j033728N30944j84320M46464K23232o83520
6657A464320J030656r66144M51584P04000r25696m6592N4272q20224q0384k20672
$$ plain form
6647 645120 2088448 2037248 1890816 333312 1710592 1062912 845312 2012672 2238464
6638 2238464 1536000 2445824 1357824 2957824 1134592 1385472 1715712 1634304 1801216
6629 1801216 1947648 1874432 1241600 2423808 1310208 2377728 1965568 2571776 1726976
6620 1726976 1610240 1836544 1469952 2920448 1467392 1916416 1381888 1224704 1909760
6611 1909760 1353216 1176576 2311168 2313216 2138112 808960 1199616 1737728 1093120 1211904
6601 1211904 1106944 1106944 2306560 1936384 1309696 1622016 1497088 1889280 1420288 1448448
6591 1448448 1992192 2486784 1364992 519168 1772032 1763328 2609152 1721344 858112 2697728
6581 2697728 1157632 1689600 1048064 1801216 1247744 2166784 1783296 2861056 1871360
$$ packed form
6647F45120J443328n1200j46432C33312J377280o47680k17600J167360K25792
6638B238464p02464R09824j088000J600000A134592K50880L30240q1408J66912
6629A801216J46432p3216o32832J182208j113600J067520m12160O06208q44800
6620A726976j16736K26304l66592J450496j453056M49024n34528j57184O85056
6611A909760n56544j76640J134592K048j75104H08960L90656N38112o44608J18784
6601A211904j04960%J199616l70176o26688L12320j24928L92192m68992K8160
6591A448448N43744M94592j121792E19168J252864q704Q45824q87808H58112J839616
6581B697728A157632N31968o41536P53152n53472R19040l83488J077760r89696
$$ plain form
6572 1871360 1855488 2507264 1676288 1646080 1412608 2363392 2489856 2102272 2350080 2561536
6562 2561536 2140672 2039296 1777152 1665536 1548288 2297344 2714624 2427392 1787904 2731520
6552 2731520 904192 2200576 1357824 1309184 1758720 3260416 1959424 1750528 1140736
6543 1140736 2396672 905728 2127360 942080 2828800 1742336 2704896 2822656 1956352
6534 1956352 1083904 1748480 1724928 1915904 2188800 1558016 908800 2068992 3327488
6525 3327488 2250240 2379264 1884672 2073600 1697280 2188800 1795584 1885184 2160640 1142784
6515 1142784 1351168 1764352 2109440 1893376 959488 1613312 759808 2799104 2040320
6506 2040320 1955840 1593856 3127296 1674240 2383872 1583104 1582080 1873920 2388992 1631232
$$ packed form
6572A871360j5872O51776q30976l0208k33472R50784J26464l87584K47808K11456
6562B561536m20864j01376k62144j11616j17248P49056M17280k87232o39488R43616
6552B731520I04192J296384q42752m8640M49536J501696j300992k08896o09792
6543A140736J255936I05728J221632I42080J886720j086464R62560J17760q66304
6534A956352q72448O64576k3552J90976K72896o30784o49216J160192J258496
6525C327488j077248J29024m94592J88928l76320M91520l93216Q9600K75456j017856
6515A142784K08384M13184L45088k16064r33888O53824G59808K039296p58784
6506B040320q4480l61984J533440j453056P09632q00768j024K91840N15072p57760
$$ plain form
6496 1631232 1219584 1947648 1715712 2201600 2080256 1917952 1379840 1124864 2185728
6487 2185728 1715200 2003456 1946112 1603072 1590784 1659392 1387520 2122240 2495488 1215488
6476 1388032 2440704 1686528 752640 1413632 1505280 1063936 2261504 1776640 2015232
6467 2015232 1797120 2116608 2454528 2210816 2284032 2827776 1671680 1902080 2505728 1549312
6457 1549312 2091520 1072128 1843712 2338816 2015232 2290688 1946624 1219072 2118656
6448 2118656 1725440 2483200 2253824 2045952 3641344 1362432 1451008 2962432 1689600
6439 1689600 2251776 1944064 1374208 1858560 2006016 2474496 2307072 2408960 885248 1148928
6429 1148928 1961472 1872896 847360 2112000 2270208 2880512 2846208 2904064 1891840 2438656
$$ packed form
6496A631232m11648P28064k31936M85888j21344j62304n38112k54976J060864
6487B185728m70528K88256n7344l43040j2288O8608k71872P34720L73248A215488
6476A388032J052672p54176G52640O60992R1648m41344J197568m84864K38592
6467B015232k18112L19488L37920k43712P3216N43744j156096K30400O03648r56416
6457A549312N42208j019392P71584M95104l23584K75456l44064p27552Q99584
6448B118656l93216P57760k29376k07872J595392A362432Q8576J511424j272832
6439A689600N62176l07712n69856M84352J47456M68480j67424J01888H85248K63680
6429A148928Q12544q8576H47360J264640J58208O10304l4304N7856j012224N46816
$$ plain form
6419 2438656 1541120 1176576 1051136 776704 2560512 2625536 2459648 977920 1704448 1414656
6409 1414656 1959936 2052608 1767424 1765376 1071104 1461760 1805824 2365440 2000896 1981440
6399 1981440 2143744 3329536 1355264 2067968 2814976 2110976 3270144 3485696 1931776
6390 1931776 2189824 2244096 1896960 1921024 1240576 1083392 2431488 2574336 1861632 484352
6379 1954816 2147840 1858560 2046464 1094656 2658304 2236416 2233856 1833984 2718208 1283584
6368 1166336 2880000 2366976 2569728 1190400 1591808 2225152 1067008 2676224 1853440
6359 1853440 2784256 1583104 2663424 1830912 2466816 1352704 1922048 1880064 2241536
6350 2241536 2196480 2515456 2781184 2006016 1923072 1334784 2808832 2148352 2316800 2307072
$$ packed form
6419B438656q97536l64544j25440k74432J783808O5024j65888I77920P26528k89792
6409A414656N45280R2672k85184k048o94272L90656L44064N59616l64544j9456
6399A981440J62304J185792A355264P12704P47008p04000J159168K15552j553920
6390A931776K58048N4272l47136K4064o80448j57184J348096J42848p12704D84352
6379A954816J93024k89280J87904r51808J563648m21888k560l99872Q84224A283584
6368A166336J713664n13024K02752A190400M01408O33344A067008J609216q22784
6359A853440R30816j201152J080320q32512O35904j114112N69344m1984L61472
6350B241536m5056L18976K65728p75168q2944n88288J474048o60480J68448r728
$$ plain form
6340 2307072 1434112 1724928 1571328 2739712 2658304 1276416 2445824 2296320 2760704
6331 2760704 2429952 2448896 1811968 1745920 2628608 2051584 1648640 2196480 1390592 2783232
6321 2783232 2011136 1365504 1404928 2068992 2230272 2782720 2868736 2081280 2678784 1919488
6311 1919488 2022400 2656768 1453056 2090496 2048000 1807872 1419264 2645504 1255936
6301 975872 2020352 1724416 2170368 2785280 1750528 1591808 2203136 2814464 2382848
6292 2382848 1819136 1786880 2476544 1551872 1486848 1844736 2417664 2391040 1603072 2178048
6282 2178048 3246080 2874880 2584576 2609664 2160128 3487232 2195968 2436608 2879488
6273 2879488 1708032 2073088 2198016 2222080 2880512 2330112 1543168 1850880 1657344 1590272
$$ packed form
6340B307072q72960K90816j53600J168384q1408A276416J169408j49504M64384
6331B760704l30752J8944o36928o6048Q82688n77024m02944N47840q05888J392640
6321B783232p72096o45632L9424O64064J61280N52448Q6016p87456N97504p59296
6311A919488J02912O34368j203712O37440m2496k40128l88608J226240A255936
6301I75872J044480k95936M45952O14912j034752j58720O11328O11328m31616
6292B382848n63712l2256O89664r24672o5024L57888N72928k6624p87968N74976
6282B178048J068032l71200k90304K5088m49536J327104j291264K40640M42880
6273B879488j171456L65056J24928K4064O58432n50400p86944L07712j93536o7072
$$ plain form
6263 1590272 2599424 1963008 2721280 1936896 1900032 1073664 2353664 1500672 2215936
6254 2215936 3110400 1478656 3148800 2977792 2164224 1927680 1584640 2277888 1480704
6245 1480704 2414080 2351104 3319296 2450944 2144768 1820160 2056704 2072576 2265600 1812480
6235 1812480 2094080 1920000 1647616 3177984 2753536 2147328 904704 2143744 1079296
6226 1079296 1742848 1992192 504832 2814976 1486848 1646592 2347008 1543168 1739264
6217 1739264 1748480 2971136 1546752 1594880 1767936 2270208 2265600 2636288 2854912 1408000
6206 3151360 2979328 1540608 2127360 2125312 2541056 2737152 2014720 2557952 2113024 1794048
6196 1794048 1459200 2014208 1624576 1068032 1641472 1979392 2155008 2245632 1992704 1838592
$$ packed form
6263A590272J009152o36416P58272p84384l6864q26368J280000q52992P15264
6254B215936Q94464A478656J670144j71008q13568k36544l43040O93248p97184
6245A480704R33376o2976R68192q68352l06176l24608K36544J5872J93024m53120
6235A812480K81600j74080k72384J530368m24448o06208I04704J239040j064448
6226A079296O63552K49344E04832K310144j328128J59744P00416q03840J96096
6217A739264R216J222656j424384M8128J73056N02272m608L70688K18624A408000
6206C151360j72032j438720N86752k048M15744J96096p22432N43232m44928l18976
6196A794048l34848N55008l89632n56544N73440L37920J75616R0624k52928j54112
$$ plain form
6186 1838592 1696768 2077696 2331136 1253376 3016704 1410048 1837568 2472960 2486784
6177 2486784 1978880 3284480 2158080 1199104 1910272 2376704 2333696 2296320 2828288 2453504
6167 2453504 2256896 1900032 1400320 3131392 1603072 1987584 1813504 1572864 1486336
6158 1486336 2866688 2581504 2494976 2590208 2012160 1895424 1521152 2123776 1476096 1908736
6148 1908736 2877440 2324992 2176000 1204736 1247232 3214336 2674688 2245632 2600448 2807296
6138 2807296 2640896 3425792 1534976 2693120 3123712 2230784 2448896 1760768 2000896
6129 2000896 3275776 2721792 2846208 2533376 1996288 2602496 2747392 2955264 1420800
6119 2097664 1856512 3138048 2044928 2551808 2754560 1645056 1442304 2799616 2138112
$$ packed form
6186A838592j41824L80928K53440j077760J763328A410048M27520O35392J3824
6177B486784n07904J305600j126400r58976P11168M66432m3008l7376N31968l74784
6167B453504j96608l56864m99712J731072j528320L84512j74080k40640q6528
6158A486336J380352k85184q6528R5232n78048j16736l74272O02624o47680M32640
6148A908736R68704n52448j48992r71264M2496J967104n39648m29056L54816K06848
6138B807296j66400P84896A534976J158144M30592q92928K18112o88128K40128
6129B000896J274880n53984J24416l12832n37088O06208J44896K07872A420800
6119B097664k41152J281536j093120N06880K02752j109504k02752J357312o61504
$$ plain form
6110 2138112 2494976 2869760 1415680 2173952 2179072 2624000 2564608 1955328 1698816 1460224
6100 1460224 3252224 2722816 2092032 1591808 2955264 2694144 2608128 1807360 2788352
6091 2788352 2376192 1117696 662016 2341376 1927680 2903552 2382336 2655744 3351552
6082 3351552 2651136 2084864 2746880 1930752 2216960 1749504 2897408 2540032 2404864
6073 2404864 1078784 1863168 2740224 3003904 2377728 2376704 1946624 1984512 1255936 1781248
6063 1781248 1562112 1238528 2471424 1717760 1976832 3086848 3762688 2934784 2467328
6054 2467328 1852416 2889728 1863168 1982464 2681856 1962496 2267136 3107840 2714624
6045 2714624 1857536 2254336 2349568 2207232 2078208 2240512 1888256 3111936 2109440
$$ packed form
6110B138112L56864L74784A415680P58272N120M44928n9392o09280k56512k38592
6100A460224J792000n29408o30784n00224J363456k61120q6016q00768R80992
6091B788352m12160A117696m55680J679360m13696R75872n21216K73408O95808
6082C351552p00416n66272O62016q16128K86208m67456J147904l57376j35168
6073B404864A078784P84384Q77056K63680o26176j024m30080L7888p28576N25312
6063A781248k19136l23584J232896p53664K59072J110016O75840q27904m67456
6054B467328o14912J037312j026560J19296O99392p19360L04640Q40704l93216
6045B714624q57088L96800R5232j42336j29024J62304l52256J223680j002496
$$ plain form
6036 2109440 1210880 1211904 1677824 2063872 2115584 2181632 1858048 2027008 2523648 1567744
6026 1567744 2290688 3436032 2421248 1608192 902656 1744896 2662400 2174976 2860544
6017 2860544 1312256 2134528 2864128 2490880 2087424 2181632 1959936 2544128 2272256 2690560
6007 2690560 3196928 1532928 1837568 2145792 2179584 3949568 2475008 3074560 2020352
5998 2020352 3566592 2288128 1997312 2876416 1686016 1910784 1966080 1636352 2294784
5989 2294784 2842624 2931200 2396672 2711552 2262528 1621504 1844224 2113024 1735680 2789376
5979 2789376 2476032 2173440 2599936 2893312 3196928 1058304 1323520 3083264 3825152
5970 3825152 1780736 2202112 2374656 2189312 2442752 1694208 1642496 1948672 2664960 2160128
$$ packed form
6036B109440q98560J024M65920L86048N1712O6048l23584J68960M96640r55904
6026A567744P22944J145344j014784q13056p05536Q42240R17504m87424O85568
6017B860544A312256Q22272P29600l73248m03456R4208k21696N84192k71872M18304
6007B690560N06368A532928L04640L08224L3792J769984j474560N99552j054208
5998B020352J546240j278464k90816Q79104j190400K24768N5296l29728O58432
5989B294784N47840Q8576n34528L14880m49024o41024K22720K68800l77344J053696
5979B789376l13344l02592M26496K93376L03616A058304K65216J759744P41888
5970C825152A780736M21376J72544j85344K53440p48544n1712L06176P16288n04832
$$ plain form
5960 2160128 2726912 2289664 1854976 3568640 2046464 2566656 1794048 2612224 2990080
5951 2990080 1990144 1660416 1743872 2366976 3132416 1711616 1496064 1537024 913408 2491392
5941 2491392 1721344 1752064 1869312 2037248 1545216 2855936 1424896 1184768 3424256
5932 3424256 2280960 1851392 1708544 1089024 1879552 2195456 2038784 2349568 2358272 1984512
5922 1984512 2829824 3277824 2403328 2176000 2308608 3515904 2889728 1976320 2716160
5913 2716160 1918976 1479680 2593792 2416640 2291200 2216448 2519552 2125824 1591808 2469376
5903 2469376 1765888 2367488 2491392 3022336 1697792 3059200 3065344 3175424 1958912
5894 1958912 2940928 2262528 1363456 2130944 1831936 2099712 2870784 2756096 3549184 2388480
$$ packed form
5960B160128N66784m37248m34688J713664j522176N20192p72608Q18176L77856
5951B990080r99936l29728Q3456O23104P65440j420800k15552M0960o23616J577984
5941B491392p70048L0720J17248J67936m92032J310720A424896k40128K239488
5932C424256j143296m29568j42848o19520P90528L15904j56672L10784Q704l73760
5922A984512Q45312M48000q74496k27328J32608J207296o26176r13408P39840
5913B716160p97184m39296J114112j77152j25440p4752L03104l93728n34016Q77568
5903B469376p03488O01600J23904N30944j324544J361408O144J10080j216512
5894A958912R82016o78400q99072P67488k99008K67776P71072j14688P93088j160704
$$ plain form
5884 2388480 2988544 2501632 1518080 3140096 3185152 1971200 2530816 2211840 2338304
5875 2338304 3003392 2547712 3458048 2171904 1864704 2316288 2637312 2441728 3341824
5866 3341824 1809408 2465792 2619904 2569216 2566656 2168832 2747904 1655296 2546688 2113536
5856 2113536 2383872 2010624 2512896 751616 2437120 2071040 3076096 1333248 2868224
5847 2868224 1698816 1899008 1831424 2849792 3555328 2498048 3276288 2518528 2344960
5838 2344960 2274304 1572864 2013184 2088960 3416064 2204672 2496512 2700288 2938368 1658368
5828 1658368 2475008 3158016 3006976 2611712 2651136 2903040 2302976 2202624 2488320 2544640
5818 2544640 1738752 1670656 3673600 3522560 2803712 2042880 2629632 2141184 3039232 2814464
$$ packed form
5884B388480O00064m86912r83552J622016M5056j213952N59616l18976J26464
5875B338304O65088m55680R10336j286144l07200M51584L21024j95584R00096
5866C341824j532416O56384J54112n0688k560l97824N79072j092608Q91392m33152
5856B113536K70336l73248N02272G51616J685504l66080J005056A333248J534976
5847B868224j169408K00192o7584J018368P05536j057280P78240p57760j73568
5838B344960p0656p01440M40320P5776J327104j211392K91840K03776K38080j280000
5828A658368Q16640O83008j51040l95264L9424K51904o00064j00352K85696N6320
5818B544640q05888o8096K002944j51040p18848p60832N86752m88448Q98048k24768
$$ plain form
5808 2814464 2185728 1731584 2744320 1697280 2510336 2429440 2085376 2705408 2766336 2485248
5798 2485248 2934784 3877888 2652672 1592320 1971200 2649600 1815040 2916352 2184192
5789 2184192 2893824 2158080 2492928 1933824 4006400 2230784 3226112 2921984 2416640
5780 2416640 3246080 3017216 1339904 2207232 2588160 2553856 2834944 2303488 1804288 1654272
5770 1654272 3743232 1497600 1323520 2324480 2437120 1396224 1049088 2976256 1979904
5761 1979904 2384896 2631168 3450880 1715200 2335744 1801728 1892864 1858048 2249216 2875392
5751 2875392 2739712 2053632 2209792 2023424 2131968 3075072 2234880 2894848 2520064 2611200
5741 2611200 3232768 1921024 2842624 3054592 2615296 3320832 2552832 2421248 3085312
$$ packed form
5808B814464o28736m54144J012736j047040Q13056q0896l44064O20032O0928k81088
5798B485248M49536R43104j225216j060352L78880O78400q34560J101312p32160
5789B184192P09632p35744L34848n59104K072576j775616R95328l04128n05344
5780B416640Q29440k28864A339904Q67328L80928l4304K81088n31456m99200j50016
5770A654272K088960A497600j74080J000960J12640j040896l47136J927168r96352
5761A979904M04992K46272Q19712A715200O20544n34016R1136l4816L91168O26176
5751B875392j35680o86080J56160j86368J08544R43104q40192O59968l74784R1136
5741B611200O21568j311744R21600K11968m39296P05536p68000j31584O64064
$$ plain form
5732 3085312 2524672 1747968 3216896 3987968 2990080 2111488 2228224 2464768 2105856
5723 2105856 2729472 2178048 1903104 2072576 2582528 3676160 3390976 2716672 2841088
5714 2841088 2382336 2918912 2622976 3170816 2788864 3270656 1629184 4236800 3633664
5705 3633664 2717184 2325504 3175424 3762176 2842624 2978816 3499520 2285568 3507712
5696 3507712 2999808 3231232 2895872 2818048 2957824 3261440 2902016 3035648 4123136 4468224
5686 4468224 2537984 4642304 3341312 3738112 3689472 3536384 3589120 3451392 3374080 4086784
5676 4086784 3448320 2873856 4150784 3491840 1411584 3419136 3074560 2764800 2132480
5667 2132480 3559936 2352640 1662976 2703872 2469376 2502656 2090496 3047936 1752576
$$ packed form
5732C085312n60640p76704J468928P71072r97888q78592J16736K36544l58912
5723B105856O23616n51424k74944J69472N09952J093632k85184o74304J24416
5714B841088m58752N36576k95936N47840l81952M81792A629184K607616o03136
5705C633664r16480l91680Q49920N86752r19552J36192N20704j213952J222144
5696C507712n07904K31424l35360p7824J39776L03616l59424J33632J087488L45088
5686D468224j930240K104320j300992L96800m8640j53088N2736j37728p7312P12704
5676D086784o38464n74464J276928o58944A411584K007552l44576l09760o32320
5667B132480J427456j207296o89664J040896k34496L3280m12160R57440j295360
$$ plain form
5658 1752576 3558912 2497024 3224576 2698752 3200000 2918912 3324416 2814976 2669568
5649 2669568 2414592 1270784 2185728 918016 2173440 2160128 2412032 3285504 2670592
5640 2670592 2656768 2163712 3143168 3104768 2482176 2632704 3133952 2194944 2733568 2493440
5630 2493440 2719744 2587136 1541120 2663424 1556992 2720768 3309568 2710528 2017280
5621 2017280 2209280 3312128 1800192 3304448 3811328 3224576 2343936 2332160 3488768
5612 3488768 1964032 2510336 2234880 2340352 2866176 2233344 3615744 1905152 2041344
5603 2041344 2685440 3477504 2352640 1942528 1852416 2843648 2575360 3015168 2864128 2545152
5593 2545152 2186240 1661440 2941952 1433600 2560512 3323904 2472960 2216448 1601024
$$ packed form
5658A752576J806336j061888P27552n25824N01248k81088M05504n09440j45408
5649B669568k54976j143808R14944I18016J255424j3312K51904Q73472o14912
5640B670592j3824m93056R79456l8400o22592J50528N01248r39008N38624k40128
5630B493440K26304j32608j046016J122304j106432J163776N88800n99040o93248
5621B017280J92000J102848j511936J504256N06880n86752q80640j1776J156608
5612C488768j524736N46304k75456J05472N25824o32832J382400j710592J36192
5603B041344O44096P92064j124864m10112r0112R91232k68288M39808j51040l18976
5593B545152l58912n24800J280512A433600J126912P63392q50944k56512o15424
$$ plain form
5584 1601024 2643968 3308032 2615296 3368448 2289152 2687488 2719744 3051520 3105280 1378816
5573 3090944 3366912 2465280 2650112 3035136 1536512 3413504 3928064 2500096 3886080
5564 3886080 3171328 3499008 3887104 3094016 3052544 3319808 3999232 3914240 3438080 3712512
5554 3712512 2999808 3317248 3099136 3021824 3436544 3004928 4338176 2152960 3525120
5545 3525120 2659328 3167744 3382272 3012608 2789376 3010048 2716160 3545088 2671616 3102720
5535 3102720 3220480 3246080 3318784 3683840 3733504 3253248 3209728 3232256 3064320 3236352
5525 3236352 3322880 3366912 2927616 2936320 3014144 3654656 2921984 2436096 4264448 3333632
5515 3333632 3367424 2376192 3041280 3078144 3414016 3200512 3817984 4359168 3494400 2053120
$$ packed form
5584A601024J042944O64064o92736P53152j079296L98336L2256L31776N3760A378816
5573C090944K75968r01632J84832L85024j498624J876992N14560j427968J385984
5564C886080p14752L27680L88096p93088m1472K67264O79424q4992m76160K74432
5554C712512p12704L17440k18112p7312M14720m31616J333248B152960J372160
5545C525120q65792N08416K14528l69664k23232K20672k93888Q28928q73472M31104
5535C102720J17760K5600P2704L65056M9664m80256m3520K2528j67936J72032
5525C236352Q6528M4032m39296Q704P7824O40512p32672m85888J828352r30816
5515C333632L3792r91232O65088L6864L35872k13504O17472N41184q64768j441280
$$ plain form
5505 2053120 3513856 3359744 1926656 3691520 2725888 2848768 2036736 3772928 2236416
5496 2236416 3241472 3177472 3890688 3331072 3174912 2110464 3828736 3424768 2449408
5487 2449408 2337280 2903040 3112960 2302464 2067456 2763264 2871296 2311680 1951232 2052096
5477 2052096 2547200 2196480 1850368 2414080 2591744 2935808 2696192 2775552 2667520 2935808
5467 2935808 3046912 2640896 2823168 2775040 3006464 2502144 3068416 3043840 1866752 2335232
5457 2335232 2338304 1910784 2221056 2445824 2971648 3427840 2925568 3161600 3259392 3134464
5447 3134464 1588736 2695680 2101248 2313728 3153920 3376640 2186240 2738176 2515968
5438 2515968 3255296 2311168 2792448 3608064 2663424 2792448 2336768 2280960 2483712 2760192
$$ packed form
5505B053120J460736j54112j433088J764864r65632J22880q12032J736192j536512
5496B236416J005056o4000P13216n59616j56160j064448J718272m03968r75360
5487B449408j12128N65760K09920q10496k35008O95808J08032n59616l60448J00864
5477B052096M95104l50720l46112N63712J77664L44064k39616P9360j08032K68288
5467B935808J11104m06016J82272m8128K31424n04320N66272k4576j177088M68480
5457B335232L072m27520L10272K24768N25824M56192n02272K36032R7792j24928
5447C134464j545728J106944n94432K12480Q40192K22720j190400N51936k22208
5438B515968P39328r44128M81280Q15616r44640J29024m55680n5808K02752K76480
$$ plain form
5428 2760192 3502592 3325952 3556352 2739200 3437568 2890240 2893824 2947072 3064320 2727424
5418 2727424 2492928 3890176 3065344 3410944 2907648 3655168 3563520 2187776 3284480
5409 3284480 2639872 1490432 2311680 2975232 3217920 2403840 3034624 1974272 3718656
5400 3718656 2291200 3547136 1888256 2378752 2443264 2424320 2305024 3089920 3028992 3103744
5390 3103744 2270208 3563520 3329536 3111936 2825728 2874368 2892288 3278848 3590656 2148864
5380 2148864 2519040 2850304 3411968 2923008 2795008 3935744 2964480 1961472 3768832
5371 3768832 2882560 2055680 3355648 3870208 3156480 3292160 3217920 3406848 3295232 3815424
5361 3815424 2794496 2396160 2590208 2570240 3130880 3972608 2030080 2736128 3259392
$$ packed form
5428B760192P42400j76640K30400q17152O98368n47328L584N3248J17248l36896
5418B727424k34496J397248q24832L45600n03296P47520r1648j375744J096704
5409C284480o44608j149440Q21248O63552K42688q14080O30784j060352J744384
5400C718656j427456J255936j658880M90496O4512j8944j19296P84896o0928P4752
5390C103744q33536J293312k33984k17600k86208M8640J7920L86560L11808j441792
5380B148864L70176L31264N61664m88960j28000J140736r71264j003008J807360
5371C768832q86272q26880J299968N14560p13728J35680p4240J88928j11616N20192
5361C815424j020928l98336J94048j9968N60640Q41728j942528P06048N23264
$$ plain form
5352 3259392 2968064 3843584 2797568 3786240 3017728 2594816 2775552 2159616 2744320
5343 2744320 2981888 2190848 1726464 3153408 3247616 2089472 3803648 2170880 3037696
5334 3037696 2192384 3391488 3293184 2904064 2899456 2981888 2674176 1744384 2967552 3332096
5324 3332096 2547200 2430464 2021376 2479616 3103232 3228160 2799616 2341376 3581440
5315 3581440 3857408 4133888 4310528 3221504 3761152 3529728 2768896 3395584 2555904
5306 2555904 3031040 3252224 2963456 2963456 3454464 3198464 2705408 1342976 2299392 2701312
5296 2701312 3234816 1977856 4232704 3627520 2601472 2608640 2825728 3481088 3102208
5287 3102208 3999232 2442752 2908672 2874880 4112384 2887168 2817024 3952128 3308544
$$ packed form
5352C259392k91328Q75520j046016R88672p68512m22912J80736o15936N84704
5343B744320K37568p91040m64384J426944R4208j158144J714176j632768Q66816
5334C037696q45312J199104r8304l89120m608Q2432l07712r29792J223168L64544
5324C332096p84896j16736m09088M58240O23616J24928m28544m58240J240064
5315C581440K75968K76480J76640j089024N39648k31424p60832O26688q39680
5306B555904M75136K21184k88768%M91008k56000m93056A342976R56416M01920
5296B701312N33504j256960K254848o05184j026048P168K17088O55360l78880
5287C102208Q97024j556480M65920l3792J237504j225216p0144J135104o43584
$$ plain form
5278 3308544 2551808 4272128 4435968 3658752 3723264 2741248 3421184 4032512 3474432 3531264
5268 3531264 3651584 4133376 2810368 4882944 4586496 4228096 5052416 4462080 4822016
5259 4822016 5951488 4515328 4439040 3534336 3344896 2820608 2218496 3109888 3769344
5250 3769344 2492416 3203072 3247104 3260416 3261952 2616832 2195968 3273216 3584512 3907072
5240 3907072 2186752 3216384 2509312 2737152 2920448 2298368 2302976 2970112 2963456 2847744
5230 2847744 3161600 3417088 3103232 3057664 3204608 2892800 3315200 2528256 2291200 1720320
5220 1720320 2996736 4186112 3530240 2754560 3900416 3633664 2588160 2814464 2082304
5211 2082304 1392640 2776576 2786816 3047424 2383872 2772480 2233344 1342976 2949632
$$ packed form
5278C308544p56736J720320J63840p77216O4512r82016O79936O11328n58080N6832
5268C531264J20320M81792j323008K072576k96448l58400Q24320n90336L59936
5259D822016J129472j436160p6288r04704j89440n24288o02112Q91392O59456
5250C769344j276928P10656M4032J3312J536o45120m20864J077248L11296L22560
5240C907072j720320J029632p07072K27840J83296o22080M608O67136o656j15712
5230B847744L13856K55488l13856m5568J46944l11808M22400p86944k37056n70880
5220A720320J276416J189376o55872p75680J145856k66752j045504K26304p32160
5211B082304o89664J383936J0240K60608o63552L88608n39136q90368J606656
$$ plain form
5202 2949632 3040768 2326016 2852864 3844608 3245056 3103232 3149312 2806272 3516416 3151872
5192 3151872 1861120 3475456 2925568 2956288 3309568 2813952 3131904 2508800 3450880
5183 3450880 2678272 3534848 2350592 2662912 3039744 4349952 2600448 3732992 3024896
5174 3024896 2805760 2431488 2860032 3674624 3513344 2864640 2676736 3100672 4064256 2063360
5164 2063360 3784704 3440640 2982912 2832384 3292672 3211264 3429888 4023808 2207232
5155 2207232 4800512 3611648 2864128 3873792 3475456 2899968 3054592 2338304 3418112
5146 3418112 4008448 3786240 3356672 3481088 3560960 4022784 3731968 3228672 3645440 2773504
5136 2773504 3144704 3556864 2781184 3391488 3828736 3363840 4473344 3681280 2958336
$$ packed form
5202B949632R1136p14752N26848R91744n99552j41824M6080l43040P10144l64544
5192C151872j290752J614336n49888L0720L53280m95616L17952o23104R42080
5183C450880p72608Q56576j184256L12320L76832J310208j749504J132544p08096
5174C024896k19136l74272M28544Q14592j61280o48704j87904M23936R63584k000896
5164B063360J721344l44064m57728j50528M60288q1408K18624N93920j816576
5155B207232K593280j188864p47520J009664l98336n75488J54624p16288J079808
5146C418112N90336k22208m29568J24416P9872M61824k90816n03296M16768q71936
5136B773504L71200M12160p75680O10304M37248m64896J109504p92064p22944
$$ plain form
5127 2958336 3132416 4663808 4022784 3592704 4089856 3458560 3410944 3196416 3391488 2576384
5117 2576384 4989440 4175872 2628096 2817024 3754496 4449792 1506304 3424256 3429376
5108 3429376 3425792 3133440 3036672 3919360 3941888 2929152 3200000 3665408 3437056 3219968
5098 3219968 2840576 4385280 3173376 3750912 3334144 3478016 3117568 3155968 2462208
5089 2462208 2901504 3650048 3959296 3703808 3225600 3319296 3144704 2949632 2310144 4182016
5079 4182016 3684864 4005888 3201536 4026880 3404800 2731008 2550784 3701760 3297792
5070 3297792 3096064 3700736 4050944 4032512 3704832 3514368 2999296 3334656 3121152 3255808
5060 3255808 3575296 4397056 2677760 2990592 3316224 4160512 2558464 3674112 3179520
$$ packed form
5127B958336J74080J531392o41024m30080M97152o31296m7616k14528J95072q15104
5117B576384K413056q13568j547776J88928R37472O95296A506304J917952N120
5108C429376l584k92352r6768Q82688K2528j012736K70848M65408k28352k17088
5098C219968l79392J544704j211904N77536m16768J43872l60448L8400o93760
5089B462208M39296P48544L09248k55488m78208R3696j74592j95072o39488J871872
5079D182016m97152L21024q04352Q25344o22080o73792j80224J150976m03968
5070C297792k01728O04672L50208j8432l27680j90464n15072L35360k13504J34656
5060C255808L19488Q21760j719296L12832L25632Q44288j602048J115648m94592
$$ plain form
5051 3179520 2656768 2696704 3203584 3478528 1952768 3345408 3998720 4257280 3302912
5042 3302912 4292608 3959296 3472384 4464640 3586560 4200960 3350016 2819072 5289472
5033 5289472 3512832 3563520 4157952 4944896 3599360 4592640 4625408 3851264 5174272
5024 5174272 4639232 6593024 5280256 5641216 5271552 6148608 7204352 6728704 7841280
5015 7841280 7607296 7145472 6741504 7042048 6310400 6586880 4108800 4004864 3220992
5006 3220992 3317248 2732544 3033088 2294272 2656256 3039744 2540032 3356160 3554816 3405824
4996 3405824 2969600 3270144 3422208 2683904 1757696 3169280 2727936 2684928 2828800 3076096
4986 3076096 2651136 2655232 2743808 3120128 2824192 2784256 3607040 4411904 2755584 3148288
$$ packed form
5051C179520n22752L9936N06880K74944j525760J392640O53312K58560r54368
5042C302912R89696l33312m86912R92256q78080O14400q50944n30944K470400
5033E289472j776640N0688N94432P86944j345536R93280L2768p74144J323008
5024E174272n35040J953792j312768L60960l69664Q77056J055744m75648J112576
5015G841280k33984m61824m03968L00544p31648K76480k478080j03936p83872
5006C220992R6256n84704L00544p38816L61984L83488m99712Q16128J98656j48992
4996C405824m36224L00544J52064p38304r26208J411584m41344m3008J43872K47296
4986C076096m24960M096Q8576L76320k95936l9936Q22784Q04864j656320L92704
$$ plain form
4976 3148288 3471360 3558912 2543104 2102784 3354112 4717056 2810880 3216896 3382272
4967 3382272 3637248 2975232 2286080 3258880 2978304 3235328 2432000 3944960 3779072
4958 3779072 2828800 3414016 2883072 3846656 2639872 2520064 3984896 4461056 3119104
4949 3119104 4257280 4514816 2891776 3632640 3688448 3706368 3485696 2949120 2545664 3815936
4939 3815936 3389952 3013632 3632640 2618368 3259392 3440128 3431424 3792896 3606016 3229184
4929 3229184 3225600 3530240 4348416 3208192 3677696 2546176 2595328 4270080 3923968 2937856
4919 2937856 4387328 4397568 4531200 3745792 4372992 2614272 3592192 2740736 3095040
4910 3095040 2899456 3804160 2497536 3574784 3805184 2674688 3600384 3439616 3996672
$$ packed form
4976C148288L23072Q7552j015808m40320J251328J362944j906176M06016J65376
4967C382272K54976o62016o89152R72800k80576K57024q03328J512960j65888
4958C779072r50272N85216n30944R63584j206784j19808J464832M76160j341952
4949C119104J138176K57536j623040P40864N5808J7920k20672n36576m03456J270272
4939C815936m25984l76320O19008j014272O41024J80736q704L61472j86880l76832
4929C229184l584L04640Q18176j140224M69504j131520M9152J674752l46112r86112
4919B937856J449472J0240J33632p85408O27200j758720R77920q51456L54304
4910C095040j95584R04704j306624J077248K30400j130496R25696j60768N57056
$$ plain form
4901 3996672 2311680 4371968 3188736 2877952 3556352 3785728 3735552 2572288 3922432
4892 3922432 3592192 4103168 4351488 3701760 3082240 2754048 3634688 3482624 3761664 3314688
4882 3314688 3105792 3950080 3383296 3372032 4430336 3057664 3535872 3397120 3413504 3581952
4872 3581952 1794048 3581952 3747328 3301376 3102720 3643392 2761216 3112448 4195840
4863 4195840 3276288 4154368 3290624 3473408 3598848 3878912 3426304 3053056 2856960 2847744
4853 2847744 2464256 4120064 3460096 2555392 3535872 4538880 4656640 3868160 4308480
4844 4308480 4189696 3386368 3378176 4177920 3124736 3042816 4197888 2963968 4590080
4835 4590080 4266496 2577920 4411392 4361216 3128832 2998784 4555776 3623424 3678208
$$ packed form
4901C996672j684992K060288j183232l10784O78400K29376n0176j163264J350144
4892C922432l30240N10976K48320o49728o19520l28192Q80640j52064K79040m46976
4882C314688k08896Q44288n66784j1264J058304j372672M78208j38752J6384J68448
4872C581952j787904J787904J65376m45952j98656N40672q82176L51232J083392
4863D195840r19552Q78080q63744J82784J25440K80064m52608l73248j96096r216
4853B847744l83488J655808o59968r04704R80480J003008J17760p88480M40320
4844D308480j18784q03328q192P99744j053184q1920J155072j233920J626112
4835D590080l23584j688576J833472n0176j232384j30048J556992r32352N4784
$$ plain form
4826 3678208 3325952 4260352 3280384 4431872 3884032 3469824 3695616 2958336 3993600
4817 3993600 3746304 3001856 5086720 3538432 4235776 3466240 2990080 3806208 3417088
4808 3417088 4033024 3901952 3897344 4430848 4193280 5039616 3606016 2965504 3440128 4668928
4798 4668928 3960832 3443712 3975168 5278208 3584512 2670592 4552704 3818496 3371008
4789 3371008 3516928 4102144 3383296 3212288 3844608 3193344 3161088 3282432 2683392 3155968
4779 3155968 3567616 3498496 3537920 3854336 3303936 4524032 3823104 3084288 3109888 3796480
4769 3796480 2770432 3723264 3492864 4095488 3910144 3867136 4898304 5299712 4727296
4760 4727296 2932224 3587584 4545536 4184064 5398016 4909568 4188672 3870720 4293120
$$ packed form
4826C678208l52256R34400r79968J151488n47840m14208K25792p37280J035264
4817C993600k47296p44448K084864j548288O97344p69536m76160Q16128l89120
4808C417088O15936j31072m608N33504k37568Q46336j433600o40512M74624J228800
4798D668928p08096n17120N31456J303040j693696r13920J882112p34208m47488
4789C371008J45920N85216p18848j71008O32320o51264l2256J21344n99040M72576
4779C155968M11648o9120L9424L16416n50400J220096p00928p38816K5600O86592
4769C796480j026048R52832k30400O02624j85344m3008J031168M01408n72416
4760D727296j795072O55360R57952l61472J213952m88448p20896l17952M22400
$$ plain form
4751 4293120 4206592 3825152 3979776 5870592 4554752 4514304 4056576 3540480 4142080 3331072
4741 3331072 3991552 3894784 3933184 3687936 3781120 4377600 4428288 3603968 4282880 3765760
4731 3765760 3033600 3860480 4441600 4920320 3724800 3560448 3224064 4114432 4564480
4722 4564480 4862976 4927488 4221952 4201472 4579840 4889600 4755968 4242944 4595200 5225984
4712 5225984 4562432 4708352 4060160 4899840 4395520 4263936 4210688 5290496 3706368
4703 3706368 4768768 4012032 3826688 3919360 3653632 4949504 3199488 4399616 4033024
4694 4033024 3502592 3949568 3885056 4243456 4347392 3601920 4179968 4191232 3455488 4681728
4684 4681728 4492288 4087296 4499968 4045312 4247552 4262400 2859008 3361280 2656768 3727360
$$ packed form
4751D293120q6528l81440J54624J890816j315840m0448m57728n16096O01600q11008
4741C331072O60480r6768L8400k45248R3184N96480N0688q24320O78912n17120
4731C765760p32160Q26880N81120M78720j195520j64352l36384Q90368M50048
4722D564480K98496O4512p05536k0480L78368L09760j33632n13024L52256O30784
4712E225984o63552J45920o48192Q39680n04320j31584n3248J079808j584128
4703C706368J062400p56736j85344R2672k65728J295872j750016J200128l66592
4694D033024n30432M46976o4512L58400J03936p45472N78048J1264p35744J226240
4684D681728j89440m04992M12672m54656K02240J4848j403392N02272p04512J070592
$$ plain form
4674 3727360 3612672 3984384 3722752 3271680 2751488 2793472 3499520 2714112 2599936 3868160
4664 3868160 3320320 2869248 3890688 3400192 3922944 3496448 3838464 4362240 4774400
4655 4774400 4062720 3855360 4727808 3728384 3695616 3814912 3662848 3676160 3376128 3442176
4645 3442176 3855872 4430336 4957184 4903936 4217344 4226048 4354048 4635648 4717056 4298752
4635 4298752 5019136 3655168 5002240 4046848 4568064 3831808 4974592 4398592 4704256
4626 4704256 5698560 5540352 5200384 5368832 4962304 6292480 3858432 5338624 4851712
4617 4851712 5456384 5234688 3441152 4452864 5410816 4769792 5545472 5334016 5569536
4608 5569536 4642304 5003264 4964864 4538880 4489728 4353536 3512320 4943360 4307968 5507072
$$ packed form
4674C727360j14688L71712k61632m51072n20192M1984P06048p85408j14176J268224
4664C868160n47840m51072J021440m90496N22752m26496L42016N23776M12160
4655D774400p11680k07360Q72448r99424l2768J19296j52064J3312l00032O6048
4645C442176M13696N74464N26848n3248o86592Q704J28000K81600Q1408m18304
4635D298752P20384j363968J347072r55392N21216p36256J142784n76000L05664
4626D704256R94304j58208l39968J68448m06528J330176k434048J480192m86912
4617D851712O04672k21696j793536J011712R57952o41024P75680k11456K35520
4608E569536r27232L60960l8400m25984m9152j36192q41216J431040o35392J199104
$$ plain form
4598 5507072 4533248 4285952 5681664 4527616 3714560 4836352 5348352 4408320 3560960
4589 3560960 4117504 4257792 5290496 2970624 3050496 4234752 3777536 4297728 4058624
4580 4058624 3153408 2553344 3991552 3409408 3867136 4040704 4836864 3908608 4425728
4571 4425728 5125120 5109760 5155840 4304896 4325888 4491776 3813376 4321280 4133376 4737024
4561 4737024 4777472 5225984 4419584 5036544 4160000 4373504 4984320 4448256 4649984 4425216
4551 4425216 4948480 5032960 4068864 4767744 4431360 4605440 5649408 3894784 4093952
4542 4093952 3707392 5384192 4651008 3121664 3819008 4254720 3954176 3531264 2888192
4533 2888192 3772928 3957248 3692544 3214336 2966528 3811328 4113408 3317248 3852800 3511808
$$ packed form
4598E507072r73824k47296J395712j154048q13056J121792N12000r40032q47360
4589C560960N56544J40288J032704k319872P9872J184256m57216N20192k39104
4580D058624r05216o00064J438208n82144M57728J73568P96160r28256N17120
4571D425728O99392j5360M6080q50944K0992J65888o78400N07904j87904O03648
4561D737024M0448M48512q06400O16960q76544K13504O10816n36064K01728k24768
4551D425216N23264Q4480r64096O98880l36384J74080J043968j754624J99168
4542D093952l86560J676800p33184j529344O97344M35712l00544m22912o43072
4533B888192Q84736J84320k64704m78208k47808Q44800L02080p96160N35552l40992
$$ plain form
4523 3511808 3567104 4498432 3256832 4188160 4188672 3850240 4383232 3982336 5321728 5069824
4513 5069824 4204544 4468736 4067840 4059648 4331008 4743168 3872768 4093952 4145664 6486528
4503 6486528 4593152 4326400 5244928 5743616 5533184 5934080 5131264 5929472 5008896
4494 5008896 4488704 4801536 3771392 3667456 4853760 3753984 3664384 3310592 3917824
4485 3917824 3041280 4171776 3401728 3950080 4075008 4678144 3971072 4069376 3902464 3830272
4475 3830272 3374080 4860416 3419648 4327936 4005888 4722176 4265984 4557312 4398080
4466 4398080 4988928 5057024 4419584 5592576 4931584 5219840 3840512 4920832 4730368
4457 4730368 5054976 5211136 4362752 5289984 5369856 4655104 3836928 4850688 4373504 4430848
$$ packed form
4523C511808N5296R31328j241600R31328N12l38432N32992m00896J339392k51904
4513E069824q65280K64192m00896q192K71360M12160q70400K21184N1712K340864
4503F486528j893376k66752R18528M98688k10432M00896q02816P98208r20576
4494E008896n20192L12832j030144j03936J186304j099776q9600l53792O07232
4485C917824q76544J130496p70048N48352J24928O03136p07072R8304j66912p2192
4475C830272m56192J486336j440768R08288l22048P16288m56192K91328j59232
4466D398080N90848O8096o37440J172992o60992K88256j379328J080320j90464
4457D730368L24608J56160q48384R27232P9872p14752q18176J013760m77184N7344
$$ plain form
4447 4430848 4540416 4674560 3698688 3850752 4203520 4347392 3661312 4186624 5196800
4438 5196800 5245440 4459008 4004352 3800064 4390912 4524544 3872768 2713088 3138048 3291136
4428 3291136 4221440 3262464 3941376 4533760 4107264 4633600 4627456 4228608 4055552 3196416
4418 3196416 3467264 5152768 4241920 3791872 4151808 4734976 3231744 3419136 3597312
4409 3597312 3785728 4077056 3807232 2923520 3027968 3570176 2743296 4269568 4603392
4400 4603392 3588608 3900928 5045760 3674112 3768832 2894848 3806208 4515840 4368384
4391 4368384 3668480 4238848 4525568 4344832 4003328 3954688 3825664 3334656 3988992 2938880
4381 2938880 3837952 5210112 4038656 2788352 4019712 4193792 3162624 3619840 3680256
$$ packed form
4447D430848J09568J34144r75872J52064L52768J43872o86080N25312J010176
4438E196800M8640p86432m54656k04288N90848J33632o51776j159680M24960J53088
4428C291136R30304r58976O78912N92384m26496N26336o144l98848j73056q59136
4418C196416K70848J685504r10848m50048L59936N83168j503232J87392J78176
4409C597312J88416K91328k69824q83712J04448N42208q26880J526272L33824
4400D603392j014784L12320J144832j371648R4720q73984R11360P09632j47456
4391D368384o99904N70368K86720j80736l41504m8640j29024m91008O54336j050112
4381B938880Q99072J372160j171456j250304J231360J74080j031168M57216O0416
$$ plain form
4372 3680256 4441600 3594240 4422144 4160000 2820608 4001792 3814400 4340736 3852800
4363 3852800 2889728 4016128 3401728 5109760 3491840 3710976 3739648 4322304 4666880
4354 4666880 3019264 3641856 3297792 3557888 3990528 3817984 5172736 5281792 4115456
4345 4115456 5412864 4792832 4691456 4578816 3522560 2719232 4142080 4748288 4199936
4336 4199936 4818432 3904512 4865024 3932672 4209152 5527040 4399616 4732416 4758016
4327 4758016 4954624 5112832 4912640 5215232 5520384 5012992 5606400 5460480 5491712 5060608
4317 5060608 5111296 4827648 5726208 5996032 4986880 6574080 6136832 5872128 6466560
4308 6466560 7005184 7067648 6706688 6053888 5729280 5689856 5156352 4923392 4312064 5696000
$$ packed form
4372C680256P61344q47360Q27904k62144j339392J181184j87392N26336m87936
4363C852800r63072J126400o14400J708032j617920K19136K8672N82656L44576
4354D666880j647616O22592l44064K60096M32640j72544J354752J09056j166336
4345D115456J297408o20032j01376j12640j056256q03328J422848O06208n48352
4336D199936O18496r13920R60512r32352K76480J317888j127424L32800K5600
4327D758016J96608J58208k00192L02592L05152n07392N93408j45920L1232m31104
4317E060608N0688k83648Q98560K69824j009152J587200m37248k64704N94432
4308F466560N38624O2464l60960o52800l24608l9424n33504k32960o11328J383936
$$ plain form
4298 5696000 4610048 3695616 3653632 4891648 3832832 4023296 5264896 5778432 4359168
4289 4359168 4536320 4940800 5004800 5226496 5484544 4923392 4676096 6268928 5452288 5089280
4279 5089280 5283840 5937152 6206464 6753792 5397504 5911552 6011904 5180928 5561344
4270 5561344 5515776 5643776 5058560 4804608 6018560 5545984 5758976 5589504 4883968 4275712
4260 4275712 5582336 4371456 4591104 2864128 4948480 3879424 4858368 5007360 4089344
4251 4089344 3327488 4640256 4575744 4100608 4816384 5186560 4211712 6616576 4630528
4242 4630528 4874240 4940288 6318080 5596160 4810240 5962752 4616704 4907520 4535296
4233 4535296 3957760 4539904 4824576 3643904 5650944 5388288 5009408 4516352 5518848
$$ packed form
4298E696000j085952r14432m1984J238016j058816J90464J241600N13536j419264
4289D359168J77152M04480O4000K21696K58048n61152k47296J592832q16640l63008
4279E089280J94560O53312K69312N47328j356288N14048J00352q30976L80416
4270E561344m5568J28000n85216k53952J213952m72576K12992j69472p05536o08256
4260D275712J306624j210880K19648j726976K084352j069056R78944J48992r18016
4251D089344p61856J312768o4512m75136P15776L70176r74848K404864j986048
4242D630528K43712O6048J377792p21920p85920J152512j346048K90816l72224
4233D535296n77536N82144K84672j180672K007040k62656l78880m93056J002496
$$ plain form
4224 5518848 4438016 4529664 3922432 4054016 4930560 4751872 4328960 5002752 5761536 5585408
4214 5585408 5265408 4821504 4933120 4700672 5550080 5540864 5441536 5332480 5441536 6266880
4204 6266880 4948992 6160896 5041152 4397568 5714944 4982272 6016512 7042048 5152768
4195 5152768 6093312 4530176 4135424 5424128 5412864 5296640 5472256 5895680 6016000
4186 6016000 6186496 4616704 5507072 5944320 5647872 4332032 4127744 5601792 3879936
4177 3879936 4696064 5245952 4303872 4047872 5029376 4708864 4048384 3435008 4068352 3925504
4167 3925504 3965952 4297728 4466688 3909120 4420096 4574208 4698112 4455424 3429376 3386880
4157 3386880 3619328 4242432 3884544 4944896 4846080 4937728 4536832 4589568 3368960 4307968
$$ packed form
4224E518848j080832R1648o07232J31584Q76544j78688m22912O73792P58784j76128
4214E585408l20000m43904J11616k32448Q49408r216r9328j09056J09056Q25344
4204F266880j317888J211904j119744o43584J317376p32672J034240J025536j889280
4195E152768R40544j563136l94752J288704j1264j16224J75616M23424J20320
4186F016000J70496j569792Q90368M37248k96448j315840k04288J474048j721856
4177C879936Q16128N49888r42080k56000R81504l20512o60480o13376O33344j42848
4167C925504M0448L31776J68960n57568N10976J54112J23904k42688j026048m2496
4157C386880K32448O23104l57888J060352r8816R1648m00896N2736j220608R39008
$$ plain form
4147 4307968 4083712 4074496 4766720 4243968 4329472 3813376 4129280 3972608 3594752 4571648
4137 4571648 3583488 4773888 5961216 3601408 4208128 4896768 4825088 4032512 4449280
4128 4449280 3639808 4405248 4300800 3817472 5136384 4249600 4274688 4052480 5005312 4425728
4118 4425728 4987392 5238784 4523008 4794880 3977216 5545472 5163520 5928448 5796352
4109 5796352 4919808 4546560 5752832 4770304 4970496 4892160 5413376 5058560 5129728 5954048
4099 5954048 5530112 5960704 5872128 10015232 6144512 7562752 5686272 6161920 5617152
4090 5617152 7342592 6047232 5688320 5559808 7009280 5421568 7179264 5899264 6161920
4081 6161920 5655040 4872192 5973504 5210112 7126016 7483392 6383104 6257664 6386688
$$ packed form
4147D307968k24256r216O92224n22752Q5504n16096L15904j56672l77856R76896
4137D571648r88160J190400J187328k359808O06720O88640p1680p92576M16768
4128D449280q09472P65440j04448m83328J318912q86784K5088k22208R52832n79584
4118D425728N61664K51392p15776K71872q17664J568256l81952P64928j32096
4109E796352q76544l73248J206272r82528K00192p8336N21216l54816P1168Q24320
4099E954048m23936M30592q8576M143104l870720J418240j876480M75648n44768
4090E617152J725440j295360l58912j28512J449472j587712J757696j280000K62656
4081F161920n06880p82848J101312p63392J915904L57376j100288j25440J29024
$$ plain form
4072 6386688 6707200 6344192 7678976 7340032 6793728 6978048 7129600 6532096 5808640
4063 5808640 7986176 7288320 7150080 8481280 7451648 7304704 7334400 7900672 7197184
4054 7197184 7955456 8843264 8327680 9926144 10673152 11490816 10831360 12226560 12764160
4045 12764160 12949504 12603392 11170304 9854976 10087936 7903232 8134656 7286272 6638080
4036 6638080 6246912 5140992 6516224 5584896 5791232 5897216 5108736 6038528 4880384
4027 4880384 5489664 4271616 5508096 6296576 4904448 6153216 5231616 4595200 3836928
4018 3836928 5535744 4562432 4857856 4995584 5626880 5896704 5821952 5231104 5801984 4596224
4008 4596224 6409216 4538880 4226560 4116992 5262336 6053888 4634112 5799936 5049344
$$ packed form
4072F386688L20512l63008J334784l38944n46304J84320J51552n97504p23456
4063E808640K177536o97856j38240J331200j029632j46944K9696N66272p03488
4054G197184P58272Q87808n15584J598464P47008Q17664o59456J395200N37600
4045A2764160J85344l46112j433088j315328K32960k184704K31424q48384o48192
4036F638080l91168j105920J375232r31328K06336J05984p88480R29792j158144
4027D880384O09280j218048J236480P88480j392128J248768r21600o36416p58272
4018C836928J698816r73312K95424J37728O31296K69824p4752n90848N70880j205760
4008D596224J812992j870336l12320j09568J145344P91552j419776J165824p50592
$$ plain form
3999 5049344 5231616 5192704 5475840 4841472 5412864 5695488 5798400 5014528 6236672 5006848
3989 5006848 5825536 6406144 5125120 4441088 5514752 5106688 4935680 5998592 5020672
3980 5020672 5784576 4774912 6074880 5724160 4245504 5304320 6073344 5821952 5852160
3971 5852160 4667904 6150656 5415424 5764608 4648960 5420032 5666816 5588480 5741568
3962 5741568 4953088 6241280 4669440 4755968 4542976 5324288 5594624 5704192 5723136 5602304
3952 5602304 5334016 6085632 5958144 5410304 5063168 5477888 5336576 6733824 5579776
3943 5579776 5451264 6320128 6248960 5257728 5925888 4603904 6247424 7089152 6587904
3934 6587904 6771712 5600256 5901824 5438976 5734400 6141952 6171648 5965312 5098496 5904384
$$ packed form
3999E049344J82272l8912K83136o34368N71392K82624J02912p83872J222144j229824
3989E006848Q18688N80608j281024o84032J073664m08064j71008J062912r77920
3980E020672P63904j009664J299968l50720j478656J058816P69024k51392L0208
3971E852160j184256J482752p35232L49184j115648P71072K46784p8336J53088
3962E741568p88480J288192j571840Q6528k12992P81312K70336J09568J8944j20832
3952E602304k68288P51616j27488n47840l47136M14720j41312J397248j154048
3943E579776j28512Q68864p1168r91232O68160j321984J643520Q41728n01248
3934F587904J83808j171456L01568m62848K95424M07552K9696k06336q66816Q05888
$$ plain form
3924 5904384 4887040 5912064 5613568 4441600 4599296 6055424 5911040 5791232 5726720
3915 5726720 5545984 6263296 5686784 5504512 5598208 5298176 5680128 5779456 5558784 5527552
3905 5527552 6290944 6190080 6289920 5760000 6684672 5817344 5734400 6222336 5571584 5341184
3895 5341184 6565888 5599232 6415872 7374848 6306816 5506560 6505472 6010880 6556672
3886 6556672 7196160 6926336 6197760 6301696 7734272 6763008 6551040 6487040 6433280 7217664
3876 7217664 6509056 6848512 7474688 7272448 7684096 6899200 7315456 7041024 8672256
3867 8672256 7816704 6836224 6761472 6887936 6678016 7591936 8128512 8101888 7527936 7430656
3857 7430656 7968256 7656448 8337920 8652800 7731712 7839232 8506880 8717312 11347968
$$ packed form
3924E904384j017344J025024k98496j171968J57696J456128j44384j19808o4512
3915E726720j80736P17312n76512j82272R3696l00032L81952R9328k20672l1232
3905E527552P63392j00864R9840n29920R24672q67328q2944M87936o50752k30400
3895E341184J224704r66656Q16640R58976j068032q00256R98912m94592N45792
3886F556672O39488k69824p28576J03936J432576r71264k11968o4000n3760P84384
3876G217664p08608L39456O26176k02240M11648p84896M16256k74432J631232
3867H672256q55552r80480p4752J26464k09920R13920N36576k6624n73952r7280
3857G430656N37600l11808O81472L14880r21088J07520O67648K10432K630656
$$ plain form
3848 11347968 8981504 8838144 8220160 9081344 8221696 8568832 8552960 9267712 8159744
3839 8159744 7965696 9643520 9214464 10481664 10419200 11277312 11014144 11787776 11533312
3830 11533312 12631552 11985408 12857344 13691904 12731392 12885504 13359104 12694016 13036032
3821 13036032 14366208 14268416 14361088 14750208 15954432 16897536 16645632 17582592 16879104
3812 16879104 19050496 20315648 20796416 22641152 24438784 24483840 25651712 25936896 26282496
3803 26282496 26862592 26975232 27610112 28423680 30259200 28884480 30979072 30830080 31923200
3794 31923200 31948288 33158656 34643456 34566656 34405376 35516416 37141504 39129088 39870464
3785 39870464 40404992 42977280 42606080 42873856 41163776 37662208 33509376 30294016 28744192
$$ packed form
3848A1347968k366464j43360o17984Q61184q59648L47136j5872P14752j107968
3839H159744j94048J677824m29056J267200o2464Q58112k63168P73632k54464
3830A1533312J098240o46144Q71936Q34560r60512J54112M73600o65088L42016
3821A3036032J330176r7792R2672L89120J204224R43104k51904R36960p03488
3812A6879104K171392J265152M80768J844736J797632M5056J167872K85184L45600
3803B6282496N80096J12640O34880Q13568J835520j374720K094592j48992J093120
3794C1923200K5088J210368J484800p6800j61280J111040J625088J987584P41376
3785C9870464N34528K572288l71200K67776j710080l501568m152832l215360j549824
$$ plain form
3776 28744192 27132928 26152960 23845888 21493760 20114944 16508416 16365056 14642176
3768 14642176 13937664 15356416 13172736 13929984 12553216 13235712 13463040 13676032 12075520
3759 12075520 12703744 12546048 12620800 13444608 12362240 12621824 13039616 11773952 11278336
3750 11278336 11433472 10890752 11299328 12647424 11715584 12087808 12606464 11915264 12237824
3741 12237824 11434496 10578432 11079168 10409472 10556416 10233856 8706560 9637888 10174464
3732 10174464 10188800 8870912 8714240 10222592 9693184 9494016 9462272 9760256 7748096
3723 7748096 9278976 10332160 8559104 9317376 9663488 9097728 9616896 8749056 8551936
3714 8551936 9496064 10306560 8331776 9083392 8876544 8916480 9504256 7240192 8171520
$$ packed form
3776B8744192j611264r79968k307072k352128j378816l606528j43360j722880
3768A4642176p04512J418752k183680P57248j376768O82496K27328K12992j600512
3759A2075520O28224j57696P4752Q23808j082368K59584M17792j265664m95616
3750A1278336J55136n42720M08576J348096r31840L72224N18656o91200L22560
3741A2237824q03328q56064N00736o69696J46944l22560j527296R31328N36576
3732A0174464J4336j317888j56672J508352n29408j99168l1744K97984k012160
3723G748096J530880J053184j773056P58272L46112n65760N19168q67840j97120
3714H551936R44128Q10496j974784P51616k06848L9936N87776k264064R31328
$$ plain form
3705 8171520 8722432 9853440 8830464 8489984 9382400 9630720 8409600 8840192 9739264
3696 9739264 9132544 9091584 8528384 9963008 9876480 9599488 9873920 10221056 8926720 9300480
3686 9300480 9607680 9949184 9354240 10226176 9542656 9816576 8539136 10105344 9982976
3677 9982976 9291776 8467968 9467904 9975808 10522112 10211328 9856000 9677824 9761792 9725440
3667 9725440 9509888 10128896 8799744 9445888 8860672 10027520 8963584 9526272 10760704
3658 10760704 10391040 10163200 10581504 9768448 9944064 9591296 10076160 10672640 10514944
3649 10514944 11102208 10092032 9221632 10703360 10933248 11566080 9261056 9302528 10359296
3640 10359296 10184704 9931264 10055168 10428416 11472896 10987520 10931200 10084864 11382272
$$ packed form
3705H171520N50912J131008j022976l40480Q92416K48320j221120M30592Q99072
3696I739264o06720m0960n63200J434624q6528k76992K74432L47136j294336L73760
3686I300480L07200L41504n94944Q71936o83520K73920j277440J566208j22368
3677I982976o91200q23808R99936N07904N46304l10784l55328j78176Q3968l6352
3667I725440k15552O19008j329152O46144n85216J166848j063936N62688J234432
3658A0760704l69664k27840M18304q13056J75616l52768M84864N96480j57696
3649A0514944N87264j010176q70400J481728K29888O32832k305024M1472J056768
3640A0359296j74592k53440J23904L73248J044480m85376n6320q46336J297408
$$ plain form
3631 11382272 10564608 10455552 10648064 11167232 11315200 12422144 13132288 13181952 11970048
3622 11970048 12425216 13008896 13486592 14166528 13883392 14096896 13655040 14308864 14612480
3613 14612480 13782528 13660160 15302656 14834688 14594048 15875072 15895040 15441920 16082432
3604 16082432 16356352 16780800 17623040 18901504 19338240 19253760 21608960 19284480 21011456
3595 21011456 20655616 21222912 22117888 21172736 19987456 19433984 21176832 19969024 21259264
3586 21259264 22388224 22911488 23297536 23325696 23887872 24375296 25586688 26550784 26422784
3577 26422784 27525632 28008448 28912128 28905984 29323264 29497856 31098368 32066048 32606208
3568 32606208 34013184 34859520 35503104 35778560 37471232 38857728 40250368 40713728 43291136
$$ packed form
3631A1382272q17664j09056J92512N19168J47968J106944P10144M9664j211904
3622A1970048M55168N83680M77696O79936k83136K13504m41856O53824L03616
3613A4612480q29952j22368J642496m67968k40640J281024J9968m53120O40512
3604A6082432K73920M24448Q42240J278464M36736q4480K355200k324480J726976
3595B1011456l55840N67296Q94976r45152j185280n53472J742848j207808J290240
3586B1259264J128960N23264L86048K8160N62176M87424J211392R64096j28000
3577B6422784J102848M82816R03680o144M17280J74592J600512R67680N40160
3568C2606208J406976Q46336O43584K75456J692672J386496J392640M63360K577408
$$ plain form
3559 43291136 45839360 47835648 50350080 52896256 54569472 58128384 62891008 66450432
3551 66450432 72523776 76691456 82678784 86112256 93240832 98468864 106136576 113945088
3543 113945088 122948608 132181504 142070272 153310720 162921472 173757440 184636928 199112704
3535 199112704 213443072 229191680 248965632 271275008 296026624 325152256 360953856
3528 360953856 406348288 466344960 546273792 654892544 797648384 973086208 1153276416
3521 1153276416 1303542784 1382390784 1366418432 1247350784 1061048832 850792448
3515 850792448 655753728 499265536 383387648 300000768 240054784 196295168 164643328
3508 164643328 143707136 125933568 110162944 97770496 87442944 79020032 72337408
$$ packed form
3559D3291136K548224J996288K514432K546176J673216L558912M762624L559424
3551F6450432O073344M167680N987328L433472P128576N228032P667712P808512
3543A13945088R003520R232896R888768J1240448R610752J0835968J0879488J4475776
3535A99112704J4330368J5748608J9773952K2309376K4751616K9125632L5801600
3528C60953856M5394432N9996672P9928832J08618752J42755840J75437824J80190208
3521A153276416J50266368P8848000j5972352j19067648j86301952k10256384
3515H50792448j95038720j56488192j15877888q3386880n9945984m3759616l1651840
3508A64643328k0936192j7773568j5770624j2392448j0327552q422912o682624
$$ plain form
3501 72337408 66978304 63180288 60658688 58386432 56172032 55005696 52030976 49466368
3493 49466368 47232000 42942464 40336896 38849024 37133824 35245056 34102272 34422784
3485 34422784 32702464 32049152 30371840 29128704 29432320 28793344 26785792 27482624 26520576
3476 26520576 24268288 23856640 22508032 21880320 20539392 20131328 19290624 18984448 18735104
3467 18735104 17636864 15625216 15342592 16578048 14187008 13943808 15195136 14405632 14224896
3458 14224896 12898304 13732352 13679616 13822976 12516864 12908544 13760000 12372992 13404160
3449 13404160 12891648 12397568 11923968 10423296 8769536 7721984 6916096 6765056 7637504
3440 7637504 7048704 8519680 9240576 9996800 10375168 10993664 10572800 9040384 9922560
$$ packed form
3501G2337408n359104l798016k521600k272256k214400j166336k974720k564608
3493D9466368k234368m289536k605568j487872j715200j888768j142784L20512
3485C4422784j720320o53312j677312j243136L03616o38976k007552O96832r62048
3476B6520576k252288m11648j348608o27712j340928m08064q40704l06176k49344
3467A8735104j098240k011648k82624J235456k391040k43200J251328p89504j80736
3458A4224896j326592Q34048n2736J43360j306112L91680Q51456j387008J031168
3449A3404160n12512m94080m73600j500672j653760j047552q05888j51040Q72448
3440G637504n88800J470976P20896P56224L78368O18496m20864j532416Q82176
$$ plain form
3431 9922560 11081216 10087936 8877568 9316352 8760320 10013184 9234944 9636864 9225728
3422 9225728 10371584 9180160 10153984 10198528 9489920 9309696 8542208 9445888 9626112
3413 9626112 9385472 10293248 9404928 9761280 8400896 7978496 8649728 7730176 8991232
3404 8991232 8882688 7397376 8391680 7773184 8061440 7420928 7206400 7719424 8423424
3395 8423424 8683520 7048704 7156736 6550528 7368192 6105088 6180352 6642176 7300096
3386 7300096 5936128 6594048 6592512 7399424 6342144 7343104 6559744 7078400 6019072
3377 6019072 7294976 7281152 6662144 7158784 7130112 6128640 6009344 6619136 7038464 7248384
3367 7248384 6283776 6359040 6716416 6076416 6607872 6904832 6513664 7044096 7262208 7913472
$$ packed form
3431I922560J158656r93280j210368M38784n56032J252864p78240M01920m11136
3422I225728J145856j191424R73824M4544p08608j80224p67488R03680J80224
3413I626112k40640R07776q88320L56352j360384m22400O71232r19552J261056
3404H991232j08544j485312R94304o18496K88256o40512k14528N13024P04000
3395H423424K60096j634816J08032o06208Q17664j263104P5264M61824O57920
3386G300096j363968O57920j536Q06912j057280J000960p83360N18656j059328
3377F019072J275904j3824o19008M96640k8672j001472j19296O09792M19328K09920
3367G248384r64608P5264L57376o40000N31456K96960l91168N30432K18112O51264
$$ plain form
3357 7913472 6606336 7043072 6669824 6425088 6343680 5443072 6499328 5076480 7150080
3348 7150080 5112832 7000576 6042624 6048768 6655488 5699584 5988864 6571520 5853184 6772224
3338 6772224 6675456 5722112 6573056 7196160 7641600 7591424 7612928 7862272 9102848 9626112
3328 9626112 9867776 10281984 10667520 12191232 11595264 10863104 11042304 11229184 9907712
3319 9907712 8249344 9372672 7558656 7435776 7546880 7768576 8397312 8965120 6938624
3310 6938624 8998400 8282112 8605184 8119808 8559104 9315328 9531904 8830976 8942592
3301 8942592 9570304 8500736 10357760 9506304 10879488 9299456 9626112 10723328 10020352
3292 10020352 10900992 10116096 12238848 11641856 12316672 12951552 13705728 14096896 13987328
$$ packed form
3357G913472j307136M36736l73248k44736q1408r00608J056256j422848K073600
3348G150080k037248J887744r57952O144O06720r55904K89280N82656p18336R19040
3338F772224r6768r53344Q50944O23104M45440n0176K1504K49344J240576N23264
3328I626112K41664M14208L85536J523712n95968p32160J79200J86880j321472
3319I907712j658368J123328j814016j22880J11104K21696O28736N67808k026496
3310F938624K059776p16288L23072m85376M39296P56224K16576p00928J11616
3301H942592O27712j069568J857024q51456J373184j580032L26656J097216p02976
3292A0020352Q80640p84896K122752n96992O74816O34880P54176L91168j09568
$$ plain form
3283 13987328 15391744 15971328 16713216 17020928 18793472 18100224 19991040 19482624 18443776
3274 18443776 19500544 20093952 19880448 20356096 22026240 22039040 21956608 22014464 23207936
3265 23207936 24483328 25773568 26205184 27537920 29910016 30433280 32253952 32157696 33302016
3256 33302016 32445952 30502400 27500032 24808448 21606400 19462144 17430528 16826880
3248 16826880 16058368 15510016 16730112 15284736 14700032 15819264 15273472 13041152 13937664
3239 13937664 13863424 13608448 11697664 12060672 12176896 12655104 12362752 12036608 12216832
3230 12216832 10846720 10441216 10592768 9742848 10116096 8729600 8763392 9779200 8468992
3221 8468992 8528896 8603648 8246784 8109568 7827456 8165376 8548352 7764480 7561728 7005184
$$ packed form
3283A3987328J404416N79584P41888L07712J772544o93248J890816n08416j038848
3274A8443776J056768N93408k13504M75648J670144J2800q2432N7856J193472
3265B3207936J275392J290240M31616J332736K372096N23264J820672r6256J144320
3256C3302016q56064j943552l002368k691584l202048k144256k031616o03648
3248A6826880p68512n48352J220096j445376n84704J119232n45792k232320Q96512
3239A3937664p4240k54976j910784L63008J16224M78208k92352l26144J80224
3230A2216832j370112m05504J51552q49920L73248j386496L3792J015808j310208
3221H468992N9904P4752l56864j37216k82112L37920L82976p83872k02752n56544
$$ plain form
3211 7005184 8507904 8500224 7898112 8020992 8803840 8518144 7119360 8476160 8718848
3202 8718848 8825856 9788416 8790016 8586240 8655360 8712704 8692224 7514624 7579648 8117760
3192 8117760 6974976 6572544 6042112 6201856 6073344 6459392 5774336 6675456 6999040
3183 6999040 6096896 5999104 6640640 5273088 6537216 7007744 6305280 6458880 6711296
3174 6711296 5849600 6906880 6529536 7403008 8290304 6851072 6779904 6509568 6409728 6674944
3164 6674944 6753280 6706176 5776896 7208448 6518784 7054848 7656448 7507456 8387584 7142400
3154 7142400 7063040 7896576 6635008 6207488 6866944 6652928 6939648 6273024 6937600 6119936
3144 6119936 6264320 5736448 5999616 6772224 6025728 6300160 6634496 6240768 5994496 5528064
$$ packed form
3211G005184J502720p680o02112J22880P82848k85696j398784J356800K42688
3202H718848J07008R62560r98400k03776O9120N7344k0480j177600O5024N38112
3192H117760j142784m02432n30432J59744j28512L86048o85056R01120L23584
3183F999040r02144r7792O41536j367552J264128M70528p02464J53600K52416
3174F711296q61696J057280l77344Q73472Q87296j439232p1168k70336r9840K65216
3164F674944P8336m7104r29280J431552o89664N36064O01600j48992Q80128j245184
3154G142400p9360Q33536j261568m27520O59456k14016K86720o66624O64576q17664
3144F119936J44384n27872K63168P72608p46496K74432L34336l93728k46272m66432
$$ plain form
3134 5528064 5497856 6098432 5902848 5147648 4923392 5956096 6181888 5377536 6217728 5876224
3124 5876224 6040576 5118976 6564352 6240768 6142464 7323136 6623232 7135232 6179328
3115 6179328 6494720 5564928 5989888 7467008 7361024 7361536 8372224 9079808 9529856 9719808
3105 9719808 8789504 8389120 10471424 10500608 13490688 15360512 19129856 24227328 27329536
3096 27329536 24709120 24198144 25477120 20595712 14017024 10428416 8538112 6981632
3088 6981632 7011328 6308864 6476288 6784000 5516800 5690880 6084608 6278144 6873600 4923392
3078 4923392 6631424 6673408 6725632 5755904 5332992 6042112 4979712 5600768 5962752 5997056
3068 5997056 5959168 6856704 5611520 5562880 5739008 6767616 6711808 6899712 7549952 6957056
$$ packed form
3134E528064l0208O00576j95584p55200k24256J032704K25792q04352Q40192l41504
3124E876224J64352r21600J445376l23584r8304J180672o99904N12000r55904
3115F179328L15392r29792M24960J477120j05984N12J010688P07584M50048J89952
3105I719808r30304m00384K082304K9184K990080J869824L769344N097472L102208
3096B7329536k620416n10976J278976m881408o578688l588608j890304j556480
3088F981632K9696p02464J67424L07712j267200J74080L93728J93536N95456j950208
3078D923392J708032M1984N2224r69728m22912P09120j062400O21056L61984L4304
3068E997056l7888Q97536j245184m8640J76128J028608n5808J87904O50240n92896
$$ plain form
3058 6957056 6676992 6946304 7676928 6505984 7700992 7149568 6628352 7378432 7188992
3049 7188992 7518208 6760448 6989312 6896128 6551552 7417344 6232576 7041536 6528000 7621120
3039 7621120 6760960 6452224 5544448 7379968 6584832 6982144 7353856 7608832 6525440
3030 6525440 7513600 7170048 7841280 7430656 8517632 8114176 7918080 8274944 9118720
3021 9118720 10024960 11574784 10862592 9157632 10102272 9467392 8678400 10667520 11268608
3012 11268608 10433024 10625536 9994752 11447808 11447296 12000256 10819072 11566080 11900928 12119040
3002 12119040 12887552 12991488 12443648 14385152 15082496 16688128 17604096 18470400 17658880
2993 17658880 17707520 16179200 15452672 14653952 12453888 12548096 9400320 10345472 8417280
$$ packed form
3058F957056k80064K69312P30624j170944J195008n51424n21216P50080j89440
3049G188992L29216p57760K28864r3184l44576Q65792j184768Q08960n13536J093120
3039G621120q60160l08736r07776J835520p95136L97312L71712K54976j083392
3030F525440R88160l43552O71232m10624J086976m03456j96096L56864Q43776
3021I118720R06240J549824p12192j704960R44640o34880p88992J989120O01088
3012A1268608q35584J92512o30784J453056n12N52960j181184P47008L34848K18112
3002A2119040P68512J03936n47840J941504O97344J605632R15968Q66304q11520
2993A7658880M8640j528320p26528p98720k200064R4208l147776R45152j928192
$$ plain form
2984 8417280 9085440 7989248 8486400 8660480 6860288 7140864 7140864 8671744 6729728 6756864
2974 6756864 7036416 7307776 6994432 6603776 6313472 6359552 7031808 6146048 5555200 7111168
2964 7111168 6230528 5455360 6209024 5880832 6432768 5981696 6802432 5892096 7213568
2955 7213568 5217792 6209024 5120512 5510144 5561344 5616640 6706176 5563904 5400576
2946 5400576 6350848 5494784 5560320 5881856 6764032 6279680 6636544 5310976 5843456 4809216
2936 4809216 6489600 5609472 5955584 5358080 4857856 5847552 5810688 5963776 5766656 5492736
2926 5492736 4839424 6430720 5793792 6069248 5648384 4003328 4349952 4385792 5381632
2917 5381632 5047296 4068864 4360192 5043712 6024704 5150720 5510656 5560832 5217792 4883968
$$ packed form
2984H417280O68160j096192M97152J74080j800192K80576%J530880j942016K7136
2974F756864K79552K71360l13344l90656k90304M6080O72256q85760n90848J555968
2964G111168q80640p75168P53664l28192N51936m51072Q20736r10336J321472
2955G213568j995776R91232j088512L89632N1200N5296J089536j142272j63328
2946E400576R50272q56064O5536L21536Q82176m84352L56864j325568N32480j034240
2936D809216J680384q80128L46112n97504n00224R89696l6864J53088j97120k73920
2926E492736o53312J591296o36928K75456m20864j645056L46624L5840R95840
2917E381632l34336r78432K91328O83520R80992q73984L59936N0176l43040l33824
$$ plain form
2907 4883968 4573184 6900736 5729280 3737088 4841984 4962816 5484544 6130688 5118976
2898 5118976 4837888 6083072 5737472 5577728 5933056 5619200 5230592 6011392 6165504
2889 6165504 6928896 7446016 6809088 6396416 6879744 8505856 9191424 10532352 16020992
2880 16020992 21861888 29172224 39190016 31400960 18697216 13634048 10907136 8198144
2872 8198144 7878656 7230976 6008320 5897216 5713408 4439552 5332992 5083136 5239808
2863 5239808 5265920 3773440 4751872 4879360 3824640 5658624 4302336 5451264 4457472
2854 4457472 4461056 5197824 4847104 5495808 3709440 5490176 4844032 5203456 4869632 4627968
2844 4627968 4244992 4867072 4290048 4144128 4477440 5538816 4972544 4908032 4680192 4242944
$$ packed form
2907D883968l10784K327552j171456j992192J104896J20832N21728O46144j011712
2898E118976k81088J245184l45600j59744L55328l13856l88608P80800J54112
2889F165504P63392N17120o36928m12672M83328J626112O85568J340928N488640
2880A6020992N840896P310336J0017792p789056j2703744n063168k726912k708992
2872H198144l19488o47680j222656j11104j83808j273856Q93440k49856J56672
2863E239808K6112j492480R78432J27488j054720J833984j356288J148928r93792
2854D457472L584P36768l50720O48704j786368J780736o46144L59424l33824k41664
2844D627968l82976O22080n77024j45920L33312J061376n66272o4512k27840m37248
$$ plain form
2834 4242944 4648960 4239360 5271040 4884480 4550656 3645952 3829760 4822016 4455424
2825 4455424 3752448 4889600 3129856 4047360 3908096 3321344 3655168 2685440 4729344
2816 4729344 4832256 5285376 3935232 4838912 4342784 5341696 5110272 6241792 6320640
2807 6320640 4513280 5586944 7036928 6528512 5967872 7088640 6435840 6990336 7253504
2798 7253504 8014848 9168896 9286656 10359808 10787328 12102144 16621568 22768128 31576576
2789 31576576 46060032 53714944 43800576 27857920 20675072 18706432 17130496 18246656
2781 18246656 22432256 27758080 38070272 37960192 29929472 20788224 18655744 18710016
2773 18710016 20995584 28614656 34508288 50064384 51839488 36512768 24719360 20007936
$$ packed form
2834D242944M06016m09600J031680l86560l33824r04704J83808R92256l66592
2825D455424p02976J137152j759744R17504j39264n86752L33824r69728K043904
2816D729344J02912M53120j350144R03680m96128R98912k31424J131520P8848
2807F320640j807360J073664J449984n08416n60640J120768o52800N54496K63168
2798G253504P61344J154048J17760J073152M27520J314816M519424O146560Q808448
2789C1576576J4483456P654912r914368j5942656p182848j968640j575936J116160
2781A8246656M185600N325824J0312192j10080q030720r141248k132480N4272
2773A8710016K285568P619072N893632J5556096J775104j5326720j1793408m711424
$$ plain form
2765 20007936 18234368 19499520 22807040 25421312 36361728 36784128 28102656 17020928
2757 17020928 13817856 14541312 13157376 14859776 16206848 22150144 21246976 15944192
2749 15944192 11316736 11089408 8711680 8758784 8508928 7113728 7830528 6976512 8328192
2740 8328192 7817216 6018048 6872576 7971328 7197696 7614976 7514624 8259072 8861696
2731 8861696 9835008 10516480 10477056 9941504 9499648 9903104 8703488 8611840 7460864 7614976
2721 7614976 7815680 7580672 6061568 6796288 7108608 5330432 5585920 3772416 4005376
2712 4005376 5040640 4804096 4844032 5730816 3195904 4027904 4925952 4709888 5948416
2703 5948416 4933632 3579904 4759552 4887040 3853824 3103744 3809792 4357120 4713472
$$ packed form
2765B0007936j773568J265152L307520K614272J0940416M22400q681472j1081728
2757A7020928l203072P23456j383936J702400J347072N943296r03168n302784
2749A5944192m627456k27328k377728M7104k49856j395200P16800q54016J351680
2740H328192n10976j799168Q54528J098752p73632M17280j00352P44448O02624
2731H861696R73312O81472l9424n35552m41856M03456j199616r1648j150976J54112
2721G614976K00704k35008j519104P34720L12320j778176K55488j813504K32960
2712D005376J035264k36544L9936Q86784k534912Q32000Q98048k16064J238528
2703E948416j014784j353728J179648J27488j033216p50080P06048N47328L56352
$$ plain form
2694 4713472 4050432 4265472 3516416 3706368 4072448 3968512 3834368 3664896 3663360 3500544
2684 3500544 3026432 3935232 4084224 3945984 4041216 4396032 3850240 3793408 3902464 3165184
2674 3165184 2885632 2962944 2368512 3623936 4359168 3479040 3598336 2987008 4484608
2665 4484608 2905600 3269120 2669056 3889664 3410944 2719232 2745856 3430400 2998784
2656 2998784 3097088 2908160 3333120 3466240 3869696 3796480 3647488 3475968 3118080 3315200
2646 3315200 3133952 3081216 2825216 3636736 2884608 2245632 3008000 4045312 3079680 3815936
2636 3815936 3506688 3272704 3292672 2310144 2033152 2773504 3377664 2757120 2426368 3066368
2626 3066368 3814400 4193792 2329600 3072512 3049984 3582464 2790400 3319808 4247552 4003328
$$ packed form
2694D713472o63040K15040p49056J89952L66080j03936j34144j69472j536j62816
2684C500544m74112R08800J48992j38240R5232L54816n45792n6832J09056p37280
2674C165184k79552P7312n94432J255424P35232q80128J19296o11328J497600
2665D484608j579008L63520o00064J220608m78720o91712K6624O84544m31616
2656B998784R8304j88928M24960J33120M03456p3216j48992j71520l57888J97120
2646C315200j81248n2736k56000Q11520p52128o38976P62368J037312r65632P36256
2636C815936l09248k33984J9968r82528k76992P40352O04160o20544l30752O40000
2626C066368P48032L79392j864192P42912k2528N32480p92064N29408R27744k44224
$$ plain form
2616 4003328 3395072 4238848 2990080 2825216 3805184 3542016 4106240 2781184 2219520
2607 2219520 3224064 3087360 2998272 3563008 3511296 3282944 4056576 3373056 3268608 2145792
2597 2145792 2638336 3282432 1768960 2926592 2714624 2897408 2249216 3179008 2864128
2588 2864128 2172416 3302912 3312640 3809792 3155456 3150848 2082304 4008448 4409856 3261440
2578 3261440 3079168 4432384 3945984 2990592 3877376 2286592 2685952 3483136 3486208 3498496
2568 3498496 4487680 3470848 2941952 3595264 2684928 4779008 2904064 3480576 3007488
2559 3007488 2929664 3251712 3159552 3959808 3425280 4038656 3005952 3678720 2188800 2869760
2549 2869760 2798080 3824640 3737088 4107264 4408320 3527168 3885056 4105728 3057664 4566528
$$ packed form
2616D003328o08256Q43776j248768j64864R79968k63168N64224j325056n61664
2607B219520J004544j36704q9088N64736n1712k28352P73632o83520j04448j122816
2597B145792M92544O44096j513472J157632k11968J82784o48192R29792l14880
2588B864128o91712J130496R728M97152o54336m608j068544J926144M01408j148416
2578C261440j82272J353216m86400r55392Q86784j590784L99360P97184L072J2288
2568C498496R89184j016832n28896O53312r10336K094080j874944N76512m73088
2559C007488p7824L22048r2160Q00256n34528O13376j032704O72768j489920O80960
2549B869760p1680J026560q7552L70176L01056q81152L57888K20672j048064J508864
$$ plain form
2539 4566528 4326912 4507136 3187712 4959232 4976640 4031488 3437056 3969536 5088768
2530 5088768 5068800 4507648 4649472 4744192 5270016 4692480 4572160 4173312 4500992 4302848
2520 4302848 4904960 4292096 4595712 5264384 3820544 4443648 5010944 4529152 5954560
2511 5954560 5902336 6085120 5773824 5356032 5820928 6157312 5280768 5944320 5564928 5536256
2501 5536256 5130752 5960192 5865472 5640192 4775424 4370432 4904960 4610048 5092352 4498432
2491 4498432 3863040 5020160 3960320 5462528 4549632 4695552 4661760 3888128 4059648
2482 4059648 4772352 3691008 5028864 4172800 4657664 4711424 4346368 4897792 5379072
2473 5379072 3907072 5082624 4990976 4085760 4405248 3430912 4787200 2564096 4706304
$$ packed form
2539D566528k39616J80224j319424J771520J7408r45152n94432N32480J119232
2530E088768j9968n61152J41824R4720N25824n77536j20320l98848L27680j98144
2520D302848O02112o12864L03616O68672j443840O23104N67296m81792J425408
2511E954560n2224J82784l11296m17792M64896L36384q76544O63552l79392k8672
2501E536256m05504Q29440r4720k25280q64768m04992N34528k94912M82304n93920
2491D498432o35392J157120j059840J502208r12896J45920l3792p73632J71520
2482D059648P12704j081344J337856q56064M84864N3760l65056N51424M81280
2473E379072j472000J175552r1648r05216L19488r74336J356288k223104K142208
$$ plain form
2464 4706304 4499968 3486208 4502016 3078144 3821056 4728832 3474944 3094528 3384832
2455 3384832 3538432 3975680 4078592 4059648 3467776 3679232 3596288 3097600 4352000 3926016
2445 3926016 3697152 3747840 4019200 3547136 3758080 3848192 4623872 4917248 3642880 4590080
2435 4590080 4268032 3641344 4168704 3890688 4657664 4193792 4405248 3455488 3965440 2287616
2425 2287616 3219456 2833920 4048384 2685952 3446784 3459072 4343296 3442688 3348480 3677696
2415 3677696 4506112 3952640 4538368 2695680 3746304 4816896 3117568 4527104 3955200
2406 3955200 3559936 4228608 2824704 3236864 3964416 4183040 4205568 4437504 3217408
2397 3217408 3825664 4545536 3373568 4404736 4628480 3909632 3612160 3236864 5374464
$$ packed form
2464D706304k06336j013760J015808j423872P42912R07776j253888l80416K90304
2455C384832J53600M37248J02912j8944n91872K11456q2944m98688J254400m25984
2445C926016k28864N0688K71360m72064K10944R0112P75680K93376j274368R47200
2435D590080l22048o26688N27360k78016P66976m63872K11456r49760N09952j677824
2425B287616R31840l85536J214464j362432P60832J2288Q84224r00608r4208L29216
2415C677696Q28416n53472N85728j842688J050624J070592j699328J409536n71904
2406C955200l95264O68672j403904M12160P27552K18624K2528K31936j220096
2397C217408O08256P19872j171968J031168K23744p18848k97472l75296K137600
$$ plain form
2388 5374464 3507200 4384256 3375616 5029888 3143680 3748864 4348928 5170688 4657664
2379 4657664 4191232 4952064 5037056 4086272 4971520 2498048 4580864 3851776 3220480
2370 3220480 3995648 4689408 3690496 4104192 2903552 3253760 4390400 4080640 2856960
2361 2856960 3460096 3152896 4026880 4196864 3955200 4119552 3805696 3658752 4574720 4699648
2351 4699648 4867584 4272128 4502528 3952128 4383232 4234240 5292544 4244992 4018688
2342 4018688 4124160 4424192 4435968 4305920 4340224 3629568 4276224 4422144 4158976 4316160
2332 4316160 4179456 5668352 4477952 4890624 4776960 5396480 6580224 5782016 4810752
2323 4810752 4845568 5366272 6827520 6106624 7342080 5537280 5879808 7418368 6583296
$$ packed form
2388E374464j867264Q77056j008640J654272j886208O05184O00064Q21760n13024
2379D657664m66432P60832Q4992r50784Q85248k473472K082816p29088o31296
2370C220480P75168O93760r98912M13696j200640L50208J136640l09760j223680
2361B856960O03136l07200Q73984J69984k41664J64352l13856j46944R15968J24928
2351D699648J67936n95456K30400n50400M31104j48992J058304j047552k26304
2342D018688J05472L00032J1776j30048L4304p10656O46656J45920k63168J57184
2332D316160j36704J488896j190400M12672j13664O19520J183744p98208r71264
2323D810752L4816N20704J461248p20896J235456j804800L42528J538560q35072
$$ plain form
2314 6583296 6808576 7453184 7449600 8265216 8296960 8700416 8360960 7607296 7558656 6233088
2304 6233088 6274560 6964224 6889984 7656448 7204352 5912064 7344128 7629312 6807552 7175680
2294 7175680 7680512 7446016 7810560 8465408 6263296 7011840 6998528 7098880 7314944 7434240
2284 7434240 7660544 7907328 6853120 6939136 7029760 6785024 6270464 6797312 6854144 6487552
2274 6487552 6195712 8335360 7506944 8177664 7188480 7334400 7263744 5589504 6851584
2265 6851584 7343104 7390720 5549056 6356992 6709248 7351808 6639616 6066176 8208896
2256 8208896 7363584 7228416 6166016 6325248 7128064 6291456 6512128 6497280 6961664 5679616
2246 5679616 5987328 7963648 6526976 5654528 5374464 6230528 6756864 5389824 5669888
$$ packed form
2314F583296K25280O44608l584Q15616L1744M03456l39456p53664m8640j325568
2304F233088M1472O89664p4240P66464m52096j292288J432064K85184q21760L68128
2294G175680N04832k34496L64544O54848k202112P48544j3312J00352K16064J19296
2284G434240K26304K46784j054208Q6016R0624k44736n14560N26848N6832l66592
2274F487552k91840K139648q28416O70720r89184J45920p0656j674240J262080
2265F851584M91520M7616j841664Q07936L52256O42560p12192n73440K142720
2256H208896q45312j35168j062400J59232Q02816q36608K20672j4848M64384j282048
2246E679616L07712J976320j436672q72448k80064Q56064N26336j367040K80064
$$ plain form
2237 5669888 5190656 5832192 5724672 5236224 5361664 4779520 5366784 4407808 5710848
2228 5710848 5885952 5469184 5569536 5981696 5663232 5852160 4803584 5499392 6395904
2219 6395904 6144000 6289408 5789184 5914112 6438912 5708800 5116416 5382656 5252096 7068672
2209 7068672 5839872 6483456 7713792 6386688 7055360 5948928 7498752 6834688 6759424
2200 6759424 6387712 8136704 7901184 7757312 6844416 6854656 7816192 7473664 7471616 7476224
2190 7476224 6942208 8435200 7323136 8210432 8661504 7242240 9541632 8006656 8632832
2181 8632832 7562752 7785984 7929344 9017344 9740288 10534912 9926144 10123264 9344512
2172 9344512 9478656 10820096 8939520 10490368 10785280 9665536 9582080 9713152 9772032
$$ packed form
2237E669888m79232O41536j07520m88448J25440n82144N87264r58976J303040
2228E710848J75104m16768J00352M12160l18464J88928j048576O95808Q96512
2219F395904k51904J45408n00224J24928N24800p30112n92384K66240j30560J816576
2209G068672j228800O43584J230336j327104O68672j106432J549824o64064p5264
2200F759424l71712J748992k35520j43872r12896J0240R61536l42528k048M608
2190G476224n34016J492992j112064Q87296M51072j419264K299392j534976O26176
2181H632832j070080K23232J43360J088000P22944P94624o08768J97120p78752
2172I344512J34144J341440j880576J550848K94912j119744q3456J31072N8880
$$ plain form
2163 9772032 9570304 8808960 9601024 10092032 8744448 9248256 9901568 10203648 9697792
2154 9697792 9688064 9793024 9371136 8785920 9190400 9642496 9463808 9242112 9997824 9973248
2144 9973248 10081792 10502656 11142144 9895936 9826816 10445824 10644480 9480192 9848832
2135 9848832 10700288 9782272 11080704 10767360 9999360 10876928 9711104 10284032 9376768
2126 9376768 9531392 9368064 10159616 10830848 9524224 10052096 10074624 11156992 12959232
2117 12959232 15833088 19475968 28118528 25538560 18530304 14253568 11703296 10118656
2109 10118656 10815488 9562624 8967680 8532480 8700416 7017472 8844800 8095744 8842752
2100 8842752 8363008 8628736 8507392 8060416 8080896 8099840 7600640 6895104 7131648 7906304
$$ packed form
2163I772032k01728p61344P92064M91008j347584N03808O53312L02080n05856
2154I697792r728J04960m21888n85216M04480M52096j78688k21696P55712k4576
2144I973248J08544M20864O39488j246208o9120O19008J98656j164288L68640
2135I848832Q51456r18016J298432l13344p68000Q77568j165824N72928r07264
2126I376768J54624j63328P91552O71232j306624N27872K2528J082368J802240
2117A2959232K873856L642880Q642560k579968p008256m276736k550272j584640
2109A0118656O96832j252864n94944m35200J67936j682944J827328p49056P47008
2100H842752m79744K65728j21344m46976K0480J8944m99200p05536K36544P74656
$$ plain form
2090 7906304 6524416 7134720 7902720 6840832 7035904 7750144 6701056 6666240 6874112
2081 6874112 5862400 6726144 6949376 7275520 7209472 7752192 6632960 6243328 7667200
2072 7667200 6325248 6361600 6951424 7966208 7064576 6245888 7737344 7090688 6896128
2063 6896128 7955456 7257600 6819328 7207424 7084544 7655936 6849536 8692736 8575488
2054 8575488 7433728 8478720 8432128 8172544 9028096 7027712 8016896 7513600 8516096
2045 8516096 8681984 7571456 8148480 8694272 7375872 8530432 8446464 9330688 9040896
2036 9040896 7300096 8901120 9994240 8566272 8556544 9732096 8583680 8023552 8262144
2027 8262144 7639040 6967296 7725568 7614464 7869440 8372224 7330816 7130624 6398464
$$ packed form
2090G906304j381888O10304P68000j061888J95072P14240j049088l4816K07872
2081F874112j011712Q63744K23232L26144o6048N42720j119232l89632J423872
2072G667200j341952L6352N89824J014784r01632q18688J491456o46656j94560
2063F896128J059328o97856m38272L88096j22880N71392q06400J843200j17248
2054H575488j141760J044992m6592k59584Q55552k000384R89184n03296J002496
2045H516096J65888j110528N77024N45792j318400J154560q3968Q84224k89792
2036I040896j740800J601024J093120j427968r728J175552j148416n60128K38592
2027H262144o23104o71744P58272j11104K54976N02784j041408k00192p32160
$$ plain form
2018 6398464 6809600 6770176 7363072 6647296 5386240 6908416 6682624 6526464 6955520
2009 6955520 6994432 7239168 5410816 6689792 7755264 7304704 7183360 6579200 7731200
2000 7731200 7809024 7104512 6795264 7363584 7323648 7778304 8448000 8498176 8755200 8618496
1990 8618496 7870976 7962624 9195008 8431104 8778752 9174528 8190976 8212480 9482240 8044544
1980 8044544 10656768 8335360 9140736 9498112 9209856 9395200 10216448 10934272 10236928
1971 10236928 10558976 11011072 10428416 11540992 11453952 11136000 10719744 11618816 11987968
1962 11987968 12305920 11405312 13227520 12389376 13857280 13785088 12441088 12224512 13165056
1953 13165056 13195776 12965888 13284352 13185536 14651904 12928000 12834304 11641344 11563520 12139520
$$ packed form
2018F398464M11136l9424N92896p15776j261056J522176k25792j56160M29056
2009F955520L8912K44736j828352J278976J065472m50560j21344o04160J152000
2000G731200P7824p04512l09248N68320l9936M54656O69696N0176K57024j36704
1990H618496p47520R1648J232384p63904L47648L95776r83552K1504J269760j437696
1980H044544K612224k321408Q05376L57376k88256J85344Q21248P17824o97344
1971A0236928L22048M52096n82656J112576q7040l17952m16256Q99072L69152
1962A1987968L17952r00608J822208q38144J467904p2192j344000k16576R40544
1953A3165056L0720k29888L18464r8816J466368j723904r3696j192960p7824N76000
$$ plain form
1943 12139520 11760128 12371456 11666944 11520512 11882496 11766272 11639296 11562496 11958784 11492864
1933 11492864 11219456 12322304 10813952 12169728 12115968 12204032 11876864 10857472 12405248
1924 12405248 11660288 13161472 12367360 11371520 11165696 12563968 11030016 11457024 11087360
1915 11087360 11188736 11227648 11257856 11296256 10215936 10675200 10539520 9275904 9904128 8020992
1905 8020992 10056704 10439680 7811072 8240128 8618496 7341056 9603584 7835136 8402944
1896 8402944 8216064 7848448 8154112 7577600 6972416 8081408 8356352 7588352 7148544
1887 7148544 7870464 7057920 6625280 7809024 8070144 6914048 6094848 6953472 5934080
1878 5934080 6840832 6849024 6912000 6404096 6068736 6134784 6545408 5548032 5716992 6123520
$$ packed form
1943A2139520l79392O11328p04512j46432L61984j16224j26976p6800L96288m65920
1933A1492864k73408J102848j508352J355776n3760Q8064l27168j019392J547776
1924A2405248p44960J501184p94112r95840k05824J398272j533952M27008l69664
1915A1087360J01376L8912L0208L8400j080320M59264j35680j263616O28224j883136
1905H020992K035712L82976k628608M29056L78368j277440K262528j768448N67808
1896H402944j86880l67616L05664n76512o05184J108992K74944p68000m39808
1887G148544P21920q12544m32640J183744K61120j156096q19200Q58624j019392
1878E934080R06752Q192O2976n07904l35360O6048M10624r97376J68960M06528
$$ plain form
1868 6123520 6089728 6157824 6212608 5308416 5210112 6231040 5302784 6279168 5635072 4819456
1858 4819456 5977088 6442496 5598720 5680128 6559744 6883328 6449664 6303744 6886400 7548928
1848 7548928 6193152 7150592 8225792 7115776 9004544 7014400 7617024 8316416 6902272
1839 6902272 7318528 6736896 8229376 8649216 7598592 8757760 8167424 9015296 8258048
1830 8258048 9629184 7711744 9815040 9922560 10279936 10073088 9897984 9660416 10733568
1821 10733568 10024448 11357696 11331584 12782592 11936256 11934208 12274688 13046272 13590016 13570048
1811 13570048 15646720 14863872 16652800 17205248 17350656 19153920 20113408 21547008 22715392
1802 22715392 24582656 25689600 28000768 29114368 30010368 31710208 33090560 32658944
$$ packed form
1868F123520l3792O8096N4784r04192r8304J020928r28256R76384o44096q15616
1858D819456J157632M65408q43776Q1408Q79616L23584m33664j45920N82656O62528
1848G548928j355776R57440J075200j110016J888768j990144O02624O99392j414144
1839F902272M16256n81632J492480M19840j050624J159168n90336Q47872p57248
1830H258048J371136j917440K103296J07520L57376k06848j75104k37568J073152
1821A0733568p09120J333248k6112J451008q46336k048L40480P71584N43744j9968
1811A3570048K076672p82848J788928N52448J45408J803264R59488J433600J168384
1802B2715392J867264J106944K311168J113600Q96000J699840J380352m31616
$$ plain form
1794 32658944 34643456 36219904 35686912 37281280 38450688 40134144 40266240 40412672 42809344
1785 42809344 44027392 46125056 48489984 49869312 53396992 56548864 60924928 65063424
1777 65063424 68948480 77397504 84240896 93248000 102849024 112014336 120428544 123872256
1769 123872256 122909184 118772736 112676352 105020416 93822464 82482176 71969792 63201280
1761 63201280 54974976 49668608 44864000 41522176 38325760 35026432 33376768 31930880
1753 31930880 29596160 28907008 27727872 25711104 26547712 24677888 24099328 24398336 22810624
1744 22810624 23017472 21529600 21015040 20979712 20015616 20047360 19278848 18231296 18266624 18907136
1734 18907136 18376192 18061312 17083904 16451584 15863296 16805888 17444352 14897664 15846400
$$ packed form
1794C2658944J984512J576448n32992J594368J169408J683456J32096J46432K396672
1785D2809344J218048K097664K364928J379328L527680L151872M376064M138496
1777F5063424L885056Q449024O843392R007104R601024R165312Q414208L443712
1769A23872256r63072m136448o096384p655936j1197952j1340288j0512384q768512
1761F3201280q226304n306368m804608l341824l196416l299328j649664j445888
1753C1930880k334720o89152j179136k016768Q36608j869824n78560K99008j587712
1744B2810624K06848j487872n14560l5328r64096L1744p68512j047552L5328O40512
1734A8907136n30944l14880r77408o32320n88288R42592O38464k546688R48736
$$ plain form
1725 15846400 14571008 15569408 14665728 12809216 14133760 13242368 13601280 13757952 13107200
1716 13107200 13360128 12664320 13011968 12266496 11393536 11076608 12096512 11206656 11339264
1707 11339264 12798976 11804672 10978304 10692608 12063232 10995712 9777152 11637760 10489344
1698 10489344 10654208 9433600 9394176 9018368 10059264 9395200 9113088 9108992 9241600 9290752
1688 9290752 10334720 9300480 8349696 9038336 8107520 7949824 8646656 8840704 9016320
1679 9016320 9044992 9203200 8485376 8047616 8228864 7995904 8259072 6757888 7899136
1670 7899136 7632896 6969856 8743936 8032256 8113664 8139264 8289792 8300032 8505856 8701952
1660 8701952 8007168 8305152 7960576 8090112 8004608 7349760 7593984 6092288 7598080
$$ packed form
1725A5846400j275392R98400r03680j856512J324544q91392L58912J56672o50752
1716A3107200K52928o95808L47648p45472q72960l16928J019904q89856J32608
1707A1339264J459712r94304q26368k85696J370624j067520j218560J860608j148416
1698A0489344J64864j220608l9424l75808J040896o64064k82112m096J32608M9152
1688I290752J043968j034240r50784O88640r30816j57696O96832J94048J75616
1679I016320K8672J58208p17824m37760J81248k32960K63168j501184J141248
1670G899136k66240o63040J774080p11680Q1408K5600J50528J0240K05824J96096
1660H701952o94784K97984l44576J29536q5504o54848K44224j501696J505792
$$ plain form
1651 7598080 8017408 7566848 6465536 7233024 7779840 8154112 7510016 8164352 8269824
1642 8269824 7989248 8792064 9350656 9185792 9573888 8804352 9636864 8908800 8474112 9598976
1632 9598976 10180608 9666048 10377216 10877440 9947648 10162688 10775552 9561088 11000320
1623 11000320 11368448 11907072 12875776 15527936 14932992 16205824 14088704 14930432 14628864
1614 14628864 13954560 12770816 12983808 12108800 12379648 11761152 12467712 13557760 13109248
1605 13109248 13025280 12127744 12635648 12621824 12892672 12864512 11663360 12845568 11864576 11746304
1595 11746304 11933696 10814976 12198400 12725248 12006400 11820544 12502528 12077568 14216192
1586 14216192 13334016 13593088 14405632 14562816 16098816 16904192 18201600 18198016 17388544
$$ packed form
1651G598080M19328m50560j101312P67488N46816L74272o44096O54336J05472
1642H269824k80576Q02816N58592j64864L88096p69536Q32512p28064m34688J124864
1632I598976N81632n14560P11168N00224r29792K15040O12864j214464J439232
1623A1000320L68128N38624R68704K652160n94944J272832k117120Q41728l01568
1614A4628864o74304j183744K12992q75008K70848o18496P06560J090048m48512
1605A3109248q3968q97536N07904j3824K70848k8160j201152J182208r80992j18272
1595A1746304J87392j118720J383424N26848p18848j85856O81984m24960K138624
1586A4216192q82176K59072Q12544J57184J536000Q05376J297408l584q09472
$$ plain form
1577 17388544 17958912 19371008 17315328 16374784 15906304 14118400 14023168 13261312 12490752
1568 12490752 12470784 12494848 11698176 11778048 11587584 11985920 11910144 11173376 11503104 11733504
1558 11733504 11055616 13198336 12873728 12150784 12329984 13082112 13622784 15411712 14423040
1549 14423040 15670784 14784000 14321152 15129088 12861952 12261888 12463616 12152320 12786688
1540 12786688 11372032 11919872 11502592 10627072 11970048 10953216 10542592 9796608 9292800
1531 9292800 10085888 9583104 9767424 9569792 9708544 9673728 9042944 9233920 8912896 9046528
1521 9046528 9269248 8496640 8656896 8452096 9220096 8330240 9271296 9031680 9125888 9176576
1511 9176576 8159744 8377344 9369600 9524224 9036288 8878080 9109504 8967168 7878144
$$ packed form
1577A7388544N70368J412096k055680r40544m68480j787904r5232p61856p70560
1568A2490752j9968K4064p96672P9872j90464L98336p5776p36768L29728K30400
1558A1733504o77888K142720l24608p22944J79200P52128N40672J788928r88672
1549A4423040J247744q86784m62848Q07936k267136o00064K01728l11296O34368
1540A2786688j414656N47840m17280q75520J342976j016832m10624p45984n03808
1531I292800P93088n02784J84320j97632J38752l4816o30784J90976l21024J33632
1521I046528K22720p72608J60256k04800P68000q89856R41056k39616R4208N0688
1511I176576j016832K17600R92256J54624m87936j58208K31424j42336j089024
$$ plain form
1502 7878144 7817728 7176704 7867392 6606336 7011840 6881280 6023168 6737408 6802944 5764608
1492 5764608 6068736 6349824 5729280 5922304 7402496 5943296 6063104 6146048 6052352 6073856
1482 6073856 6385152 6174720 5815296 6274560 5514240 5569536 5852160 6078976 5174272 5828608
1472 5828608 5507584 4995584 5364736 5705728 4472832 4382720 4937216 5478400 4418560
1463 4418560 4832768 5046784 4651008 6254080 5704704 5216256 6032384 5308928 5405184 4525568
1453 4525568 4035584 5341184 4870656 5253120 4529152 5538304 5272064 4585472 5218816
1444 5218816 5446656 3487232 4039680 4181504 5522944 3755008 5359616 4224512 5010432
1435 5010432 4745216 3800576 4172800 3863552 4257792 3578368 5014016 3873792 4186112
$$ packed form
1502G878144o0416o41024O90688j261056M05504j30560q58112P14240O5536j038336
1492E764608L04128K81088o20544J93024J480192j459200J19808Q2944r3696K1504
1482F073856L11296k10432l59424M59264p60320N5296K82624K26816r04704O54336
1472E828608l21024n12000L69152L40992j232896r0112N54496N41184j059840
1463D418560M14208K14016l95776J603072n49376m88448Q16128p23456R6256q79616
1453D525568m89984J305600m70528L82464p23968J009152k66240o86592O33344
1444E218816K27840j959424N52448J41824J341440j767936J604608j135104P85920
1435E010432k65216r44640L72224l09248L94240o79424J435648j140224L12320
$$ plain form
1426 4186112 4642304 4430848 4207616 4817920 5971968 4145664 3876864 3806208 5352448
1417 5352448 5445120 4916736 4935680 4701696 4877312 5507072 5758976 4137984 4274176 4075008
1407 4075008 6225408 4765696 6446080 4557312 5129728 5836288 5378048 5837312 6365184
1398 6365184 6662656 7265792 6020096 5715456 6003200 4568576 5617664 5666304 5235712
1389 5235712 4650496 4562432 4685312 4356608 4049920 4270080 4258304 3288064 4375040 3652608
1379 3652608 4481024 3721216 4470272 3779584 4206080 4036096 3522048 4886528 3202560
1370 3202560 4345856 3928576 3107840 4110848 4256768 2790400 3410432 4318720 2932224
1361 2932224 3734528 4323840 3410944 4087296 3576320 3552256 4021760 3079680 4276224 3628032
$$ packed form
1426D186112M56192k11456k23232O10304J154048j826304k68800p0656J546240
1417E352448R2672n28384J8944k33984J75616O29760K51904j620992J36192j99168
1407D075008K150400j459712J680384j888768N72416P06560m58240M59264N27872
1398F365184K97472O03136j245696l04640K87744j434624J049088M8640m30592
1389E235712n85216q8064J22880l28704l06688K20160j1776r70240J086976p22432
1379C652608Q28416p59808P49056o90688M26496j69984n14048J364480j683968
1370C202560J143296m17280q20736J003008J45920j466368O20032R08288j386496
1361B932224Q02304N89312r12896O76352n10976k4064M69504r42080J196544o48192
$$ plain form
1351 3628032 3077632 4624896 3345408 3699200 3672576 2461696 3505664 3229696 3980288
1342 3980288 3761664 2605056 3407360 3283456 3347968 4738048 3097600 3143168 3374592
1333 3374592 3371520 3074048 3856896 4011520 3963392 2612224 2985472 2775552 3545088 2873856
1323 2873856 3249152 4754944 2881024 3774976 2179072 3606528 3562496 2999296 1931264
1314 1931264 4637696 3144192 3686400 1798144 3535360 3174912 2934272 3957760 3644928
1305 3644928 2374144 3853824 3000320 2932736 2595328 2136576 2135552 3014144 3388928 3099648
1295 3099648 3562496 2337280 3710976 2916864 3156992 3482624 3200512 2603008 4302848
1286 4302848 4266496 2552832 2527232 3312128 2830848 3032064 1651712 2354176 3255296 2559488
$$ packed form
1351C628032n50400J547264j279488L53792k6624j210880J043968k75968P50592
1342C980288k18624j156608Q02304j23904O4512J390080j640448M5568K31424
1333C374592l072k97472P82848J54624m8128j351168L73248k09920P69536o71232
1323B873856L75296J505792j873920Q93952j595904J427456m4032n63200j068032
1314A931264K706432j493504N42208A798144J737216l60448k40640J023488l12832
1305C644928j270784J479680q53504o7584l37408m58752j024Q78592L74784k89280
1295C099648M62848j225216J373696p94112K40128L25632k82112n97504J699840
1286D302848l6352j713664k5600P84896m81280K01216j380352P02464R01120o95808
$$ plain form
1276 2559488 2407424 2344960 3105792 2186240 3222016 3120640 2994688 2198016 2561024 3385344
1266 3385344 3231232 2305536 2609664 2596864 3840512 3512832 2430976 2409984 2862592 2863616
1256 2863616 3594240 3251712 3967488 3126272 3580928 2484224 3231744 2732544 2234368
1247 2234368 3072000 3563520 3276288 2205696 2790400 3387904 2730496 2254336 1875968
1238 1875968 2119168 2223104 2103296 1705984 3649024 2826752 2455552 2418176 1825792 1819136
1228 1819136 2141184 2160128 1760256 3202048 1980928 1668096 1591808 1932288 1182208 1050112
1218 1050112 1052672 2804224 1134592 2138624 2366464 2327040 1763840 1708032 1442304 722944
1208 722944 1238528 1938944 2159616 1677824 755200 402944 1376768 855040 1289216 1263104
$$ packed form
1276B559488j52064o2464P60832r19552J035776j01376j25952p96672L63008Q24320
1266C385344j54112r25696L04128j2800J243648l27680j081856k0992M52608J024
1256B863616P30624l42528P15776q41216M54656j096704P47520m99200m98176
1247B234368Q37632M91520k87232j070592N84704N97504o57408m76160l78368
1238A875968K43200J03936j19808l97312J943040q22272l71200l7376n92384o656
1228A819136L22048J8944l99872J441792j221120l12832p6288L40480p50080j32096
1218A050112K560J751552A134592J004032K27840l9424n63200n5808k65728p19360
1208G22944N15584P00416K20672m81792G55200l52256R73824n21728M34176k6112
$$ plain form
1198 1263104 1193984 838656 487424 -121344 1285120 1321984 1671680 592384 923648 -156672
1187 1709568 1913344 1349632 1262592 1276928 253440 -131072 -371200 182272 636416 336384
1177 336384 283136 6656 674304 378880 -94208 -185344 -276992 -633344 -1055744 49664 519168
1166 519168 654848 14848 317440 153600 499712 1015808 1082880 1071616 655872 2082816
1156 2082816 2124800 4260864 4533248 6358016 5677568 3701760 4605440 4464640 3819008
1147 3819008 4328960 3238400 3816960 4087296 4553728 5648384 5874176 8411648 17334784
1138 17334784 39034368 62329856 118348288 177914880 143595520 79183872 55759360
1131 55759360 42123264 33688576 28844544 24112128 20763136 18059776 16324608 15261184
$$ packed form
1198A263104o9120l55328l51232a21344A285120L6864L49696E92384L31264a56672
1187A709568K03776n63712q7040J4336B53440a31072k40128A82272M54144l00032
1177C36384n3248F656O67648k95424i4208r1136r1648l56352m22400D9664M69504
1166E19168J35680A4848L02592A53600L46112N16096O7072j1264m15744J426944
1156B082816M1984K136064K72384J824768o80448j975808R03680j40800o45632
1147C819008N09952j090560N78560K70336M66432J094656K25792K537472Q923136
1138A7334784K1699584K3295488N6018432N9566592l4319360o4411648k3424512
1131E5759360j3636096q434688m844032m732416l348992k703360j735168j063424
$$ plain form
1123 15261184 15062016 13452800 12875776 12554240 12278784 12764160 14223872 13499904 12005888
1114 12005888 11704320 10684928 10641408 9835520 10041344 9896960 9400320 8307200 8651776
1105 8651776 6915584 8096768 7516160 8400896 8090112 7128576 7717888 7358976 6898176
1096 6898176 7908864 6816256 7066624 6717440 7915520 5904896 6142464 6149120 6660608
1087 6660608 7240704 5657088 5867008 6502400 6494720 5245440 5524992 5423104 5117952 4995072
1077 4995072 5534720 4918272 5575168 4783616 6838272 5624832 5950976 4346880 5813760
1068 5813760 5547008 3820032 5324288 4433408 4470784 5422080 4944384 5659136 4290048
1059 4290048 4386816 4630528 4110848 4452864 3522560 4340224 5017600 4337664 3850240 5083648
$$ packed form
1123A5261184j99168j609216n77024l21536k75456M85376J459712p23968j494016
1114A2005888l01568j019392m3520q05888K05824j44384m96640j093120L44576
1105H651776j736192J181184n80608Q84736l10784r61536N89312l58912m60800
1096F898176J010688j092608K50368l49184J198080k010624K37568O656N11488
1087F660608N80096j583616K09920O35392p680j249280K79552j01888l05152j22880
1077D995072N39648o16448O56896p91552K054656j213440L26144j604096J466880
1068E813760k66752j726976J504256q90880L7376R51296m77696P14752j369088
1059D290048R6768K43712n19680L42016r30304Q17664O77376o79936m87424J233408
$$ plain form
1049 5083648 3808768 4083712 3636736 4027392 3710976 4636672 4402176 4446208 3846144 3798016
1039 3798016 3922432 3237888 4869632 3283456 3921408 3933696 2860032 4317184 3668992
1030 3668992 4721152 3441152 4407808 4294656 4274688 3924992 3855360 4503040 4657664 4500480
1020 4500480 4018688 3198976 4334080 3971072 2883072 2863104 3749376 3286016 4423168
1011 4423168 3714560 4240384 3636736 3079168 3706880 3854848 3273728 3586560 3827200 2706944
1001 2706944 2855936 2610688 3548672 3652096 3376128 2049024 2886144 2438656 3498496
992 3498496 3745792 3069952 3024896 2475008 2613760 4578304 2999808 3308544 2502656 3706368
982 3706368 3644416 3503616 3707904 4002816 3807744 1951232 2797568 4436992 2687488
$$ packed form
1049E083648j274880K74944m46976L90656l16416R25696k34496M4032o00064m8128
1039C798016J24416o84544J631744j586176O37952J2288j073664J457152o48192
1030C668992J052160j280000R66656j13152j9968l49696o9632O47680J54624j57184
1020D500480m81792q19712J135104l63008j088000j9968Q86272m63360J137152
1011D423168p08608N25824o03648n57568O27712J47968n81120L12832K40640j120256
1001B706944J48992k45248R37984J03424k75968j327104Q37120m47488J059840
992C498496K47296o75840m5056n49888J38752J964544j578496L08736q05888J203712
982C706368o1952j40800K04288K94912j95072j856512Q46336J639424j749504
$$ plain form
973 2687488 3232768 2902016 3557888 3311616 3379200 1536512 2297856 3345920 3789312 3502592
963 3502592 3019264 2088960 3230720 2277376 2635776 3260928 3061760 2904064 3219456 2964992
953 2964992 2924544 2098688 2036736 3436032 3109376 2544128 1778688 2413568 3414016 2731008
943 2731008 2676736 3495424 1809920 2184704 2560000 1852928 2937856 2138112 2641920 3232256
933 3232256 2294784 3424768 2962432 2964480 2400768 1918976 2676224 2941440 2693632 2583552
923 2583552 2014208 2103808 2789888 1577984 1900032 2168832 2741248 2256896 2909696 2884608
913 2884608 1840640 2649088 2451456 1825280 1671168 2507776 1556992 1548288 2494464 2991104
903 2991104 2895360 2292736 2546176 2372608 2592256 2358272 2759168 2971648 2596352 3009024
$$ packed form
973B687488N45280l30752O55872k46272O7584A536512P61344J048064M43392k86720
963C502592m83328r30304J141760r53344L58400O25152j99168j57696L15392k54464
953B964992m0448q25856o1952J399296l26656n65248p65440O34880J000448o83008
943B731008n4272Q18688j685504L74784L75296p07072J084928p99744N03808N90336
933C232256r37472J129984m62336K048n63712m81792P57248K65216k47808j10080
923B583552n69344Q9600O86080j211904L22048K68800N72416m84352O52800k5088
913B884608j043968Q08448j97632o26176j54112Q36608r50784q704R46176M96640
903B991104r5744o02624K53440j73568K19648k33984M00896K12480l75296M12672
$$ plain form
893 3009024 2369024 3253760 3551232 2760704 3361792 3002368 4383232 2527232 2545664 3234304
883 3234304 2787328 3835392 3521536 2235904 3311104 2371584 2918400 4129792 3368960
874 3368960 4158464 5277184 5423104 4313600 3933184 3033088 3628544 2793984 2646016
865 2646016 3853824 2655232 2540032 2834944 2683392 3373056 2109952 2822656 2798592
856 2798592 3083264 2027520 2480128 1964544 2840576 2651648 2712576 1619456 2157056 2322432
846 2322432 873984 3096576 2611200 2804736 2669056 3422208 1946112 2604544 3087360
837 3087360 2980864 2826240 1872384 2973184 2779648 2284544 2547200 1354752 1961472
828 1961472 2616320 2810368 2207744 2706944 2146304 2516992 2241024 1774592 1977344 2057728
$$ packed form
893C009024o40000Q84736K97472p90528O01088l59424J380864j856000J8432O88640
883C234304m46976J048064l13856j285632J075200r39520N46816J211392p60832
874C368960P89504J118720J45920j109504l80416r00096N95456q34560j47968
865B646016J207808j198592j15200K94912j51552O89664j263104P12704k4064
856B798592K84672j055744M52608n15584Q76032j88928O0928j093120N37600J65376
846B322432H73984K222592m85376J93536j35680P53152j476096O58432M82816
837C087360j06496j54624r53856J100800j93536m95104K62656j192448O06720
828A961472O54848J94048o02624M99200n60640L70688k75968m66432K02752Q0384
$$ plain form
818 2057728 1954816 1922048 1872896 2486784 2467328 3224576 2717696 3283456 2655232 2411520
808 2411520 1872384 2785280 2061312 1559040 2142208 2525184 3220992 1380352 1630208 985088
798 985088 2373120 1393152 2213376 3102720 1998336 581120 2551808 1425408 2116608
789 2116608 2740224 2703360 2566656 2195968 2477056 1353728 1673728 1729536 3214336 1650176
779 1650176 2108928 2615808 1914368 2003456 2820608 2366464 1948160 1437696 2088960 3337728
769 3337728 2482688 1684480 2320896 2460160 2452992 1802240 2028032 1650688 1527296 1707008
759 1707008 3235840 3236864 1725952 1418752 2360832 2446848 1865728 3149312 1277952 1107456
749 1107456 2489856 2225152 2404864 2681344 2034176 2327552 2405376 2435072 2598400 2059776
$$ packed form
818B057728j02912l2768m9152O13888j9456P57248n06880N65760o28224k43712
808B411520n39136R12896p23968n02272N83168L82976O95808A380352K49856o45120
798I85088J388032r79968Q20224Q89344j104384E81120J970688j126400O91200
789B116608O23616l6864j36704l70688K81088j123328L20000N5808J484800j564160
779A650176M58752N06880p01440Q9088Q17152m54144m18304n10464O51264J248768
769C337728q55040p98208O36416J39264p168o50752K25792l77344j23392J79712
759A707008J528832J024j510912l07200R42080Q6016n81120J283584A277952j70496
749A107456J382400k64704J79712K76480o47168K93376P7824K9696J63328n38624
$$ plain form
739 2059776 1373184 1591808 1765888 1958912 3289088 2665984 2165248 769024 1378304 2062848
729 2062848 1569280 1336832 2075648 706048 1734656 629760 1695744 2171392 1068032
719 1015296 1487360 1718272 2260992 1562624 1360896 1639424 2011136 1602048 1809920 1484288
709 1484288 1357824 1951744 1774592 1297920 108544 2187264 2066944 1146368 1615872 730624
698 1478144 1582080 1011200 2386944 1869312 2586624 2076160 1230336 1489920 930304 1733632
688 1733632 1655296 2415616 2252288 2583552 1221120 1072640 1964544 2483200 1735168 1228800
678 1228800 1954304 2411520 1310720 1245184 1530368 2045440 2193920 1602560 1102848 1398272
668 1398272 1537024 1159168 2017792 2081792 358400 1119744 1958400 2422784 1311232 1561088
$$ packed form
739B059776o86592K18624J74080J93024J330176o23104n00736G69024O09280O84544
729B062848m93568k32448P38816G06048J028608F29760J065984M75648A068032
719A015296M72064K30912N42720o98368k01728K78528L71712m09088K07872l25632
709A484288j26464N93920j77152m76672A08544K078720j20320r20576M69504G30624
698A478144J03936n70880J375744n17632P17312n10464q45824K59584n59616Q03328
688A733632p8336P60320j63328L31264A221120j48480Q91904N18656p48032n06368
678A228800P25504M57216j100800o5536K85184N15072J48480n91360m99712K95424
668A398272J38752l77856Q58624O4000C58400P61344Q38656M64384j111552K49856
$$ plain form
658 1561088 1323520 1582080 1700864 546304 1816064 1589248 787456 2967552 1457664
648 1542144 1688064 1647104 975872 2243584 1440768 2464256 324608 1857024 1715712
639 1715712 2267136 1079296 1580544 1861120 1705984 1900544 2507264 2160128 1534464 1250304
629 1250304 2490368 1202688 1035776 1695744 1092608 1640960 2326016 1223168 1843712
620 1843712 2296832 810496 1658368 1614336 1723904 1565696 1980928 1183232 1889280 2579968
610 2579968 2434048 2431488 2716672 2452992 1997824 2057216 1866752 1025024 1788416 1395200
600 1395200 2500608 1237504 1557504 2006016 2186752 1806336 964608 2357760 1715200
591 1715200 869376 1795584 1827840 1157632 1909248 1755648 2043904 1254912 1878528 1138176
$$ packed form
658A561088k37568K58560J18784E46304J269760k26816G87456K180096A457664
648A542144J45920m0960o71232J267712q02816J023488C24608J532416j41312
639A715712N51424A079296N01248K80576j55136J94560O06720l47136o25664k84160
629A250304J240064A202688j66912O59968o03136N48352O85056j102848O20544
620A843712M53120H10496Q47872m4032J09568j58208M15232p97696P06048O90688
610B579968j45920k560K85184k63680m55168N9392j90464q41728P63392l93216
600A395200J105408A237504L20000M48512J80736l80416q41728J393152o42560
591A715200q45824R26208L2256o70208P51616j53600K88256p88992O23616p40352
$$ plain form
581 1138176 391680 1355776 1424384 1267200 1872384 1193472 1275392 930304 965632 2038784
571 2038784 1789952 1184256 1168384 2513408 665088 1209856 1068032 481792 699904 911360
561 911360 1671680 893440 611840 1096704 1216512 1177600 798720 984064 411136 1097216
551 1097216 822784 1318912 1527808 564224 598528 1972736 1393152 1347584 1445376 506880
540 1575424 634880 814592 1854464 1304064 1105920 1350144 1403904 616960 1586176 1284608
530 1284608 392192 1289728 1116672 1043968 2017792 752128 1426432 1079808 1187328 1304064
520 1304064 1860608 1704960 1935872 1014784 1564160 1127424 1506304 849920 1612288 85504
509 1321984 1835520 1422848 1185792 1136640 1250304 1280000 1356800 1809920 489984 1419264
$$ packed form
581A138176C91680R64096O8608j57184O05184o78912Q1920l45088L5328J073152
571B038784k48832o05696j5872J345024F65088N44768j41824D81792K18112K11456
561I11360P60320p78240k81600M84864J19808l8912l78880J85344D11136O86080
551A097216k74432M96128K08896E64224L4304J374208n79584m5568R7792E06880
540A575424F34880J79712J039872n50400j98144K44224N3760F16960R69216l01568
530A284608C92192Q97536j73056p2704R73824G52128O74304l46624J07520J16736
520A304064N56544j55648K30912r21088N49376m36736L78880o56384P62368H5504
509A321984N13536m12672k37056m9152J13664K9696P6800M53120D89984R29280
$$ plain form
499 1419264 1366528 2213376 1725952 1581568 1098240 887296 1276928 1165824 1171968 25088
488 791040 55296 2123776 583680 821760 1047040 2503168 1735168 1618944 652288 283136
477 323584 962048 1010176 1657856 1044992 1845760 1271296 1003520 1562624 1297408 46080
466 1793024 1375744 904192 1175040 769024 1562112 1011712 913408 1461760 1126400 810496
456 810496 1377792 399360 742912 1632256 675328 1611776 -102400 944128 1101312 2141184
446 2141184 992256 1206272 1166336 1597440 1010176 632832 838656 389120 1052160 742400
436 742400 1299968 1028096 794624 1213952 349184 -17408 407552 536576 1030656 979968
426 979968 -231424 799232 -477696 790016 819200 227840 2125312 1588736 1298944 932864
$$ packed form
499A419264n2736Q46848m87424j44384m83328k10944L89632j11104O144B5088
488G91040E5296K068480E83680K38080K25280J456128p68000j16224F52288B83136
477C23584O38464M8128O47680o12864Q00768n74464k67776N59104k65216D6080
466A793024m17280m71552K70848m06016P93088n50400r8304N48352l35360l15904
456H10496N67296C99360L43552Q89344F75328R36448a02400I44128J57184J039872
446B141184I92256K14016l9936M31104n87264l77344K05824C89120O63040l09760
436G42400N57568k71872k33472M19328C49184a7408D07552J29024M94080n0688
426I79968b31424G99232d77696G90016K9184B27840J897472n36576k89792l66080
$$ plain form
416 932864 607744 1043456 1503744 521728 439296 628736 924160 357376 124416 641024
406 641024 824320 552448 2049536 -38912 986112 708096 720384 1009152 1551360 1554432
396 1554432 1191424 193024 1170944 -14336 1614336 1613824 1370624 446976 967680 894976
386 894976 1119744 1023488 -166400 611840 1447424 1228800 1071104 1704960 1370624 1524736
376 1524736 898560 460800 633344 115712 526848 1037312 796160 130560 1157120 1098240
366 1098240 1055232 505856 161280 1034240 132608 1277952 97792 1017856 129024 828928
356 828928 1622528 1653248 1657344 173056 216064 651264 1356288 723456 -130048 618496 1596928
345 1596928 423424 202240 165376 1377280 663552 -219136 431104 1428480 384512 1743360
$$ packed form
416I32864l25120M35712M60288E21728q2432J89440K95424C57376A24416N16608
406F41024J83296k71872J497088c8912I86112k78016J2288K88768N42208L072
396A554432l63008A93024R77920a4336A614336n12k43200D46976N20704p2704
386H94976K24768r6256a66400F11840Q35584k18624j57696O33856l34336J54112
376A524736o26176m37760J72544A15712M11136N10464k41152A30560J026560n8880
366A098240m3008E05856A61280Q72960A32608J145344I7792R20064A29024O99904
356H28928P93600L0720M096A73056M3008M35200P05024o32832a30048F18496R78432
345A596928D23424B02240l6864J211904F63552b19136D31104R97376C84512J358848
$$ plain form
335 1743360 1361408 660992 412160 1323008 998912 -76288 293376 796672 200192 2348032
325 2348032 1019392 740352 574464 850432 46080 1990144 1366016 2248704 660480 1116672
315 1116672 821248 92160 769024 956928 1152000 1588736 710656 1669120 1303552 1117184
305 1117184 1485824 -237568 -485888 1213440 1710592 462336 1767424 -406016 1092608
295 669696 328704 816640 666112 1141248 1167872 933888 1234432 974336 55808 170496
285 170496 427008 498176 323072 -171520 1245184 1156608 1113088 -36864 -92160 1035264
274 741888 1393664 444928 -171008 734208 2206208 824320 -421376 -37376 1105408 654848
264 654848 -168960 199168 1075200 651776 735232 1308160 481792 572928 223744 970752
$$ packed form
335A743360l81952F60992k48832R10848l24096g6288B93376N03296B00192K147840
325B348032A019392k79040j65888K75968D6080J944064o24128Q82688F60480M56192
315A116672k95424I2160O76864J87904J95072M36736G10656R58464l65568j86368
305A117184L68640b37568k48320A213440M97152D62336J305088d06016A092608
295F69696C28704M87936j50528M75136K6624k33984L00544k60096E5808J14688
285A70496K56512P1168j75104a71520A245184q8576m3520c6864n5296A035264
274G41888O51776D44928a71008G34208J472000H24320d21376c7376A105408m50560
264F54848a68960A99168Q76032m23424Q3456N72928D81792R1136B23744P47008
$$ plain form
254 970752 899584 782848 1192960 898048 940032 17408 1276416 958976 442880 -342528
243 1285632 681472 596480 770048 395264 1537536 1102336 694784 29184 1334272 308224
232 1817600 684032 64512 -586240 462848 383488 974336 586752 641536 315904 822272
222 822272 354304 438784 404992 131072 946176 966656 -112128 766976 319488 572928
212 572928 1971712 1236480 1046016 573952 -505344 743424 401408 509440 703488 986624
202 986624 1525760 -59392 836608 -218624 -268800 581632 1188352 1385472 -234496 731136
191 -654336 663040 1084928 1907200 38400 121344 498688 565760 183296 7168 1014784 1614336
180 1614336 1506304 1380864 874496 -742400 629248 -579584 1110016 -455168 610304 1288704
$$ packed form
254I70752p1168j16736M10112k94912M1984A7408J259008l17440D42880c42528
243A285632o04160q4992J73568l74784J142272m35200m07552B9184J305088C08224
232A817600F84032F4512e86240D62848p9360N90848l87584N4784C15904N06368
222H22272C54304Q4480l3792A31072Q15104K0480a12128G66976C19488K53440
212E72928J398784p35232j90464m72064e05344G43424l42016J08032J94048K83136
202I86624N39136e9392H36608b18624n0176E81632O06720J97120b34496G31136
191f54336F63040M21888Q22272C8400Q2944L77344O7072A83296G168J007616N99552
180A614336j08032j25440n06368g42400F29248e79584A110016d55168F10304O78400
$$ plain form
170 1288704 104448 593920 947200 1561600 87040 -111616 745472 -52224 493056 -244224
159 509440 374272 403456 211456 908288 1510912 -276480 151552 746496 -346112 174592
148 -160768 1229312 -632832 -73728 1662464 -186368 -180224 805888 -304640 491008 -301056
137 -499712 313344 -362496 957440 529408 159744 395776 1397248 -576512 235008 -167424
126 444416 -49664 334336 1720832 459264 80896 270336 474112 -922624 119296 989696
116 989696 1035776 126464 883712 1063424 907264 -488960 1083392 330752 -12800 -28672
106 -28672 -233984 1482752 72704 333312 612352 859648 1661952 452096 -584704 -591872
96 -591872 -610304 510464 -130560 1243136 -527872 -19456 672256 434176 -471040 -478720 411136
$$ packed form
170A288704A04448M89472L53280O14400H7040a11616G45472e2224D93056b44224
159E09440j35168K9184j92000O96832O02624b76480A51552N94944c46112A74592
148a60768A229312f32832g3728A662464a86368O144H05888c04640D91008c01056
137d99712C13344c62496I57440m28032A59744K36032J001472e76512B35008a67424
126D44416d9664C34336J386496D59264H0896J89440K03776i22624A19296Q70400
116I89696M6080A26464P57248J79712j56160d88960A083392C30752a2800j5872
106b8672k05312A482752G2704K60608K79040K47296Q02304D52096e84704p168
96e91872j8432E10464a30560A243136e27872a9456F72256k38080d71040p680D11136
$$ plain form
84 332288 528896 320000 738304 -1097728 -122880 -588288 -295424 367104 -407040 665088
73 288256 386560 -76800 764928 775168 -10240 -150016 -290816 487936 -132096 317440 23040
61 -47616 -53760 -480768 1197056 906752 656896 -409600 470528 645120 1092096 -1306112
50 839680 -340480 -1160192 53760 1058304 -282112 -132096 -284160 452608 -70656 162816
39 493568 955904 1422848 609280 40960 509440 -464896 -10240 -207360 -675840 -163840
28 760320 537600 366592 453632 -280576 136192 185344 -292864 90112 -866816 -227840 398848
16 -327680 -187904 -345600 709120 -8704 506368 -992256 -749568 -558080 262656 730624
6 730624 347648 -98816 147456 473600 62464 -262144
$$ packed form
84C32288J96608k08896M18304a097728a22880m65408K92864C67104d07040F65088
73B88256R8304g6800G64928J0240a0240j39776j40800D87936a32096C17440B3040
61d7616o144m27008A197056k90304k49856d09600D70528J74592M46976a306112
50H39680c40480q19712E3760J004544b82112a32096j52064D52608g0656A62816
39D93568M62336M66944F09280D0960M68480d64896a0240j97120m68480a63840
28G60320k22720j71008Q7040b80576A36192M9152b92864I0112h66816b27840C98848
16c27680J39776j57696G09120h704E06368i92256K42688J91488B62656M67968
6G30624C47648i8816A47456L26144F2464b62144
##END=
