##TITLE=141729
##JCAMPDX= 6.0         $$ Bruker NMR JCAMP-DX V2.0
##DATA TYPE= NMR SPECTRUM
##DATA CLASS= XYDATA
##ORIGIN= NUTS EXPORT
##OWNER= Administrator
$$ 1.72 TOPSPIN		Version 2.1
$$ 2016-02-23 12:22:50.761 -0800  Administrator@X
$$ Compression mode = diff/dup
##.OBSERVE FREQUENCY= 90.275459
##.ACQUISITION MODE= SIMULTANEOUS (DQD)
##.ACQUISITION SCHEME= undefined
##.AVERAGES= 16
##.DIGITISER RES= 22
##SPECTROMETER/DATA SYSTEM= 
##.PULSE SEQUENCE= zg30
##.SOLVENT NAME= None
##.SHIFT REFERENCE= INTERNAL, None, 1, 14.99409
##AUDIT TRAIL= $$ (NUMBER, WHEN, WHO, WHERE, PROCESS, VERSION, WHAT)
$$ ##TITLE= Audit trail, TOPSPIN		Version 2.1
$$ ##JCAMPDX= 5.01
$$ ##ORIGIN= Bruker BioSpin GmbH
$$ ##OWNER= Administrator
$$ $$ E:/data/jwist/nmr/1729/1/pdata/1/auditp.txt
$$ ##AUDIT TRAIL=  $$ (NUMBER, WHEN, WHO, WHERE, PROCESS, VERSION, WHAT)
(   1,<2016-02-23 09:32:45.574 -0800>,<Administrator>,<X>,<jcamp>,<TOPSPIN 2.1>,
      <fromjdx created from
       E:\data\jwist\nmr\uniandes\1729
       data hash MD5: 8K
       D3 A1 91 C0 F7 CA ED 0C 4C 45 48 14 ED 5C FC 92>)
$$ ##END=
$$ 
$$ $$ hash MD5
$$ $$ 58 AC 97 29 5D 66 3A 21 7E 78 DF BD 58 0D DE DB
##$RELAX= 
$$ Bruker specific parameters
$$ --------------------------
##$DU= <E:>
##$EXPNO= 1
##$NAME= <141729>
##$PROCNO= 1
##$TYPE= <nmr>
##$USER= <jwist>
##$ACQT0= 0
##$AMP= (0..31)
100 100 100 100 100 100 100 100 100 100 100 100 100 100 100 100 100 100
100 100 100 100 100 100 100 100 100 100 100 100 100 100
##$ANAVPT= 1
##$AQSEQ= 0
##$AQ_mod= 3
##$AUNM= <au_zg>
##$AUTOPOS= <>
##$BF1= 90.275459
##$BF2= 400.02
##$BF3= 400.02
##$BF4= 400.02
##$BF5= 400.02
##$BF6= 400.02
##$BF7= 400.02
##$BF8= 400.02
##$BYTORDA= 0
##$CFDGTYP= 0
##$CFRGTYP= 0
##$CHEMSTR= <none>
##$CNST= (0..63)
1 1 145 1 1 1 1 1 1 1 1 1 1 1 1 1 1 1 1 1 1 1 1 1 1 1 1 1 1 1 1 1 1 1 1
1 1 1 1 1 1 1 1 1 1 1 1 1 1 1 1 1 1 1 1 1 1 1 1 1 1 1 1 1
##$CPDPRG= <>
##$CPDPRG1= <>
##$CPDPRG2= <>
##$CPDPRG3= <>
##$CPDPRG4= <mlev>
##$CPDPRG5= <mlev>
##$CPDPRG6= <mlev>
##$CPDPRG7= <mlev>
##$CPDPRG8= <mlev>
##$CPDPRGB= <>
##$CPDPRGT= <>
##$D= (0..63)
0 1 0 0 0 0 0 0 0 0 0 0 0 0 0 0 0 0 0 0 0 0 0 0 0 0 0 0 0 0 0 0 0 0 0 0
0 0 0 0 0 0 0 0 0 0 0 0 0 0 0 0 0 0 0 0 0 0 0 0 0 0 0 0
##$DATE= 0
##$DBL= (0..7)
120 120 120 120 120 120 120 120
##$DBP= (0..7)
150 150 150 150 150 150 150 150
##$DBP07= 0
##$DBPNAM0= <>
##$DBPNAM1= <>
##$DBPNAM2= <>
##$DBPNAM3= <>
##$DBPNAM4= <>
##$DBPNAM5= <>
##$DBPNAM6= <>
##$DBPNAM7= <>
##$DBPOAL= (0..7)
0.5 0.5 0.5 0.5 0.5 0.5 0.5 0.5
##$DBPOFFS= (0..7)
0 0 0 0 0 0 0 0
##$DE= 6.5
##$DECBNUC= <off>
##$DECIM= 2432
##$DECNUC= <off>
##$DECSTAT= 4
##$DIGMOD= 1
##$DIGTYP= 12
##$DL= (0..7)
0 120 120 120 120 120 120 120
##$DP= (0..7)
150 150 150 150 150 150 150 150
##$DP07= 0
##$DPNAME0= <>
##$DPNAME1= <>
##$DPNAME2= <>
##$DPNAME3= <>
##$DPNAME4= <>
##$DPNAME5= <>
##$DPNAME6= <>
##$DPNAME7= <>
##$DPOAL= (0..7)
0.5 0.5 0.5 0.5 0.5 0.5 0.5 0.5
##$DPOFFS= (0..7)
0 0 0 0 0 0 0 0
##$DQDMODE= 0
##$DR= 22
##$DS= 2
##$DSLIST= <SSSSSSSSSSSSSSS>
$$ [...]
##$SPOFFS= (0..31)
0 0 0 0 0 0 0 0 0 0 0 0 0 0 0 0 0 0 0 0 0 0 0 0 0 0 0 0 0 0 0 0
##$SUBNAM0= <"">
##$SUBNAM1= <"">
##$SUBNAM2= <"">
##$SUBNAM3= <"">
##$SUBNAM4= <"">
##$SUBNAM5= <"">
##$SUBNAM6= <"">
##$SUBNAM7= <"">
##$SUBNAM8= <"">
##$SUBNAM9= <"">
##$SW= 20.5580556627758
##$SWIBOX= (0..15)
0 0 3 4 0 0 0 0 0 0 0 0 0 0 0 0
##$SW_h= 8223.68421052631
##$SWfinal= 0
##$TD= 65536
##$TD0= 1
##$TE= 300
##$TE2= 300
##$TE3= 300
##$TEG= 300
##$TL= (0..7)
0 120 120 120 120 120 120 120
##$TP= (0..7)
150 150 150 150 150 150 150 150
##$TP07= 0
##$TPNAME0= <>
##$TPNAME1= <>
##$TPNAME2= <>
##$TPNAME3= <>
##$TPNAME4= <>
##$TPNAME5= <>
##$TPNAME6= <>
##$TPNAME7= <>
##$TPOAL= (0..7)
0.5 0.5 0.5 0.5 0.5 0.5 0.5 0.5
##$TPOFFS= (0..7)
0 0 0 0 0 0 0 0
##$TUNHIN= 0
##$TUNHOUT= 0
##$TUNXOUT= 0
##$USERA1= <user>
##$USERA2= <user>
##$USERA3= <user>
##$USERA4= <user>
##$USERA5= <user>
##$V9= 5
##$VALIST= <valist>
##$VCLIST= <CCCCCCCCCCCCCCC>
##$VD= 0
##$VDLIST= <DDDDDDDDDDDDDDD>
##$VPLIST= <PPPPPPPPPPPPPPP>
##$VTLIST= <TTTTTTTTTTTTTTT>
##$WBST= 1024
##$WBSW= 4
##$XGAIN= (0..3)
0 0 0 0
##$XL= 0
##$YL= 0
##$YMAX_a= 1871425792
##$YMIN_a= -4398778.368
##$ZGOPTNS= <>
##$ZL1= 120
##$ZL2= 120
##$ZL3= 120
##$ZL4= 120
##$ABSF1= 10
##$ABSF2= 0
##$ABSG= 5
##$ABSL= 3
##$ALPHA= 0
##$AQORDER= 0
##$ASSFAC= 0
##$ASSFACI= 0
##$ASSFACX= 0
##$ASSWID= 0
##$AUNMP= <proc_1d>
##$AXLEFT= 0
##$AXNAME= <>
##$AXNUC= <off>
##$AXRIGHT= 0
##$AXTYPE= 0
##$AXUNIT= <>
##$AZFE= 0.1
##$AZFW= 0.1
##$BCFW= 1
##$BC_mod= 2
##$BYTORDP= 0
##$COROFFS= 0
##$CY= 15
##$DATMOD= 1
##$DC= 2
##$DFILT= <>
##$DTYPP= 0
##$F1P= 0
##$F2P= 0
##$FCOR= 0.5
##$FTSIZE= 0
##$FT_mod= 4
##$GAMMA= 1
##$GB= 0
##$INTBC= 1
##$INTSCL= 1
##$ISEN= 128
##$LB= 0.3
##$LEV0= 0
##$LPBIN= 0
##$MAXI= 10000
##$MC2= 0
##$MEAN= 0
##$ME_mod= 0
##$MI= 0
##$NCOEF= 0
##$NC_proc= -10
##$NLEV= 6
##$NOISF1= 0
##$NOISF2= 0
##$NSP= 1
##$NTH_PI= 0
##$NZP= 0
##$OFFSET= 14.99409
##$PC= 1
##$PHC0= 0
##$PHC1= 0
##$PH_mod= 0
##$PKNL= yes
##$PPARMOD= 0
##$PPDIAG= 0
##$PPIPTYP= 0
##$PPMPNUM= 2147483647
##$PPRESOL= 1
##$PSCAL= 4
##$PSIGN= 0
##$PYNMP= <proc.py>
##$REVERSE= no
##$SF= 90.2741054222758
##$SI= 8192
##$SIGF1= 0
##$SIGF2= 0
##$SINO= 400
##$SIOLD= 32768
##$SPECTYP= <>
##$SREGLST= <1H.CDCl3>
##$SSB= 0
##$STSI= 0
##$STSR= 0
##$SW_p= 1497.18866228788
##$SYMM= 0
##$S_DEV= 0
##$TDeff= 0
##$TDoff= 0
##$TI= <>
##$TILT= no
##$TM1= 0
##$TM2= 0
##$TOPLEV= 0
##$USERP1= <user>
##$USERP2= <user>
##$USERP3= <user>
##$USERP4= <user>
##$USERP5= <user>
##$WDW= 1
##$XDIM= 8192
##$YMAX_p= 1871425702
##$YMIN_p= -4398777
##$CURPLOT= <PDFCreator>
##$CURPRIN= <$PDFCreator>
##$DFORMAT= <normdp>
##$LAYOUT= <+/1D_H.xwp>
##$LFORMAT= <normlp>
##$PFORMAT= <normpl>
##$SURQMSG= 1
$$ End of Bruker specific parameters
$$ ---------------------------------
##XUNITS= HZ
##YUNITS= ARBITRARY UNITS
##XFACTOR= 0.182762287876938
##YFACTOR= 1
##DELTAX= -0.182762287876938
##NPOINTS= 8192
##FIRSTX= 1497.0059
##FIRSTY= -553617
##LASTX= 0
##MAXY= 1871425702
##MINY= -4398777
##XYDATA= (X++(Y..Y))
8191e53617B85978a577494f46579A021623M02006c8729k331141P19957B542848
$$ -553617 285978 -1577494 -646579 1021623 1423629 -38729 -2369870 -1649913 2542848
8181B09697h43624D80959J81068M40219c1269j897355C83252a94747I67144k97152
$$ 209697 -843624 480959 662027 1102246 -31269 -1928624 383252 -194747 967144 669992
8171F69992a258349A471694g7962D22083J0376K24181c5304A039040k33650M9767
$$ 669992 -1258349 1471694 -77962 422083 432459 656640 -35304 1039040 805390 855157
8161H55157d8905A34142a056543J33049I17031J734820r50136a427027b10120
$$ 855157 -48905 134142 -1056543 -923494 917031 2651851 1701715 -1427027 -210120
8151A76801K63754a501084P43444D8118a809750C74737b535197a067912c01010
$$ 176801 440555 -1501084 -757640 48118 -1809750 374737 -2535197 -1067912 -301010
8141h45513B83297d53085l69489a3147k029175D15627a335067p251A735781D35466
$$ -845513 283297 -453085 -822574 -13147 -2042322 415627 -1335067 -1342318 1735781 435466
8130A112519b09691m61783A384023a469010C52272f6639k35289k288195f2631
$$ 1112519 -209691 -671474 1384023 -1469010 352272 -66639 -301928 -2590123 -62631
8120I92861l41272a220845O03316j442478A77382d13095J84894l91401G67290
$$ 992861 651589 -1220845 -617529 -2060007 177382 -413095 -228201 -619602 767290
8110G69626J45749a246318L43230A804650a708500A080571c94052A281761n39977
$$ 769626 915375 -1246318 -903088 1804650 -1708500 1080571 -394052 1281761 741784
8101G41784d89869A240266f86723m9474k227404d5051j04085B566969g65683g8853
$$ 741784 -489869 1240266 -686723 -736197 -2963601 -45051 -149136 2566969 -765683 -78853
8090b114854O17029d04460N0875B55258A17406c37434a34132n49823C50689f65532
$$ -2114854 -1497825 -404460 -353585 255258 117406 -337434 -134132 -683955 350689 -665532
8079B84099a49860F93063b62319k99906A340252a889601c24904B452012D33835
$$ 284099 -149860 693063 -262319 -562225 1340252 -1889601 -324904 2452012 433835
8069a555759o85611M28478A835386b122157B598313f13092B10022a444170q46832
$$ -1555759 -2241370 -1812892 1835386 -2122157 2598313 -613092 210022 -1444170 -2291002
8060b291002A12251L60764d07642A033205C7608c58336j105945A596987o00207
$$ -2291002 112251 473015 -407642 1033205 37608 -358336 -1464281 1596987 996780
8051I96780c95961q70164C5764a677798I26285h96036q96018A489065a723490
$$ 996780 -395961 -1266125 35764 -1677798 926285 -896036 -1792054 1489065 -1723490
8041B40492M47899n8319a010963M24768H84829I2085J036574g48664j328642R29206
$$ 240492 688391 630072 -1010963 -586195 884829 92085 1128659 -748664 -2077306 -1148100
8031a148100D0713f29139A069948f3719l66175F93342a129281j83243M15915b72951
$$ -1148100 40713 -629139 1069948 -63719 -429894 693342 -1129281 -1312524 -896609 -272951
8020c2292q89496j42435J11218A269253a918749c74707O9722k089619J100111
$$ -32292 -921788 -1064223 -953005 1269253 -1918749 -374707 -304985 -2394604 -1294493
8011a294493B15689a274646p54565C90230a479314H49897i04389j164145J30353
$$ -1294493 215689 -1274646 -2029211 390230 -1479314 849897 -904389 -2068534 -1938181
8002a938181A058377l63550a126436A563741g43945q73362f31827p03698j47383
$$ -1938181 1058377 694827 -1126436 1563741 -743945 -1617307 -631827 -1335525 -1482908
7993a482908O00936c75561O0034a04463A136910E48945d89255H06956B49495a73661
$$ -1482908 -881972 -375561 -315527 -104463 1136910 548945 -489255 806956 249495 -173661
7982D25635A42542c94417J97086p90296K42778r29687A44826M51591B97990a191257
$$ 425635 142542 -394417 -197331 -987627 -744849 -1674536 144826 596417 297990 -1191257
7971a281501F800c65158B518124j023240e32731I11241g18366A825730b722416
$$ -1281501 6800 -365158 2518124 1494884 -532731 911241 -718366 1825730 -2722416
7961A65362f43491B21698g40920G85055L15180e44800b7832m33390G80983g36487
$$ 165362 -643491 221698 -740920 785055 1100235 -544800 -27832 -461222 780983 -736487
7950b103698G52808d39869b15663a07612j28395r99531o45427d8391F54039d73720
$$ -2103698 752808 -439869 -215663 -107612 -236007 -1235538 -1880965 -48391 654039 -473720
7939d89067A059269a933256o72450b86061A97083a638359A80542d46055H79499
$$ -489067 1059269 -1933256 -2605706 -286061 197083 -1638359 180542 -446055 879499
7929e95588j09875A535483b729024h74395m20824p42823B004748m74653d63135
$$ -595588 -705463 1535483 -2729024 -874395 -1295219 -2038042 2004748 1530095 -463135
7919g7393l87445k004723e22309E60756a59809B250250E27298a278295e16072
$$ -77393 -464838 -2469561 -522309 560756 -159809 2250250 527298 -1278295 -516072
7909B240833D65762J306065C59378d77320J62527A440527D59931N06209a016041
$$ 2240833 465762 1771827 359378 -477320 -314793 1440527 459931 966140 -1016041
7899C5584b46116H9027J268005a59407k54258F10759d71080A733877F68834K96940
$$ 35584 -246116 89027 1357032 -159407 -413665 610759 -471080 1733877 668834 965774
7889I65774j34583n1549a053229o11691o20302g74160b00415B02700a617191F4059
$$ 965774 831191 779642 -1053229 -1664920 -2285222 -774160 -200415 202700 -1617191 64059
7878c99698j028193j54839H12989b6064j28281B35943N37663a040660N04820E01567
$$ -399698 -1427891 -1582730 812989 -26064 -154345 235943 773606 -1040660 -535840 501567
7867c92554a27838B444331a316451F79290O40945E75825a049828A975705i92026
$$ -392554 -127838 2444331 -1316451 679290 1320235 575825 -1049828 1975705 -992026
7857B2488J91559K10347R85475a899581l33654E02514a00721p89137b82006J22040
$$ 22488 214047 424394 1409869 -1899581 -2233235 502514 -100721 -889858 -282006 -159966
7847a59966p12461r89002P16825m54596A9307a218993A694658I741M37962g07202
$$ -159966 -872427 -1861429 -1144604 -1599200 19307 -1218993 1694658 9741 447703 -707202
7836b040812G89222e32542j52381A62378O22417b98030j51458m20241j3022b28450
$$ -2040812 789222 -532542 -684923 162378 784795 -298030 -449488 -869729 -882751 -228450
7825b267961H18693C26602a296065m36379b5953r01189H94627e22585k82359p15748
$$ -2267961 818693 326602 -1296065 -1732444 -25953 -927142 894627 -522585 -804944 -1520692
7815a520692e43815b13185A159490a992382R19480b427j685924o8868A763707
$$ -1520692 -543815 -213185 1159490 -1992382 -1072902 -2427 -1688351 -1757219 1763707
7805A672968q03992K15953a808945A3970R29036c2823k198044g96766k92383B0307
$$ 1672968 868976 1084929 -1808945 13970 943006 -32823 -2230867 -796766 -1089149 20307
7794e94074A118794e61019G79067j45252b953568g0159B270970a005146d24854
$$ -594074 1118794 -561019 779067 633815 -2953568 -70159 2270970 -1005146 -424854
7784E26091a311468b7925G58374A9384a005352m3270r98246C40011a337137e71466
$$ 526091 -1311468 -27925 758374 19384 -1005352 -1048622 -2046868 340011 -1337137 -571466
7773b497051b68299p61012B94251a298068J24220l51982A953422a062125A328760
$$ -2497051 -268299 -1029311 294251 -1298068 -1173848 -1525830 1953422 -1062125 1328760
7763E321J657819a397855A376803m31357N59448a795404b96910r08729I80794
$$ 5321 1663140 -1397855 1376803 945446 1504894 -1795404 -296910 -1205639 980794
7753f69366L4811A666562C76303J040142b025844F4979a88067I68493i38023q15487
$$ -669366 -634555 1666562 376303 1416445 -2025844 64979 -188067 968493 -938023 -1753510
7743a753510l73180k55447R18316B30828a755392C02240M33017I9444a195753
$$ -1753510 -2126690 -2382137 -1463821 230828 -1755392 302240 735257 99444 -1195753
7733f83851b68834j443410C1493K532R021c61657j087959g12643r04311A300870
$$ -683851 -268834 -1712244 31493 34025 43046 -361657 -1449616 -712643 -1616954 1300870
7722A380704a577548A330485B88723a042425C12858b98161j030590j4500F33589
$$ 1380704 -1577548 1330485 288723 -1042425 312858 -298161 -1328751 -1343251 633589
7712c62306P3135G12144a517664A319113j93353k64882c32327j515769L24244
$$ -362306 -289171 712144 -1517664 1319113 1125760 860878 -332327 -1848096 -1523852
7703a523852e21532P8979j75678j025577A411443f69852j000927B79999a04843
$$ -1523852 -521532 -442553 -618231 -1643808 1411443 -669852 -1670779 279999 -104843
7693I75907a329870J56089r27187g84019I87478B27616p4333e50659A05843P75512
$$ 975907 -1329870 -1173781 -2100968 -784019 987478 227616 153283 -550659 105843 881355
7683H81355a264844D31478a274615N3645A928264b521657C97543J92992b34503
$$ 881355 -1264844 431478 -1274615 -1220970 1928264 -2521657 397543 590535 -234503
7673a335398D18599a034084G86056b888770A064213a942576N83024d06480q0276
$$ -1335398 418599 -1034084 786056 -2888770 1064213 -1942576 -1359552 -406480 -486756
7664d86756C6080a476293A14170Q0767f56801G4909e03379j220092j706551G73422
$$ -486756 36080 -1476293 114170 194937 -656801 74909 -503379 -1723471 -3430022 773422
7653F46816n3894j0389o7137a651217r6841a93091o36521a55757A73301a455335
$$ 646816 592922 582533 515396 -1651217 -1748058 -193091 -829612 -155757 173301 -1455335
7642i7072o50735j068689H64391H6773b5894E37076a848164N09339m67791f80812
$$ -97072 -747807 -1816496 864391 86773 -25894 537076 -1848164 -1338825 -1806616 -680812
7631d49519L3895l28953B79403a58951k284230c58890D68069N58055g08337r23641
$$ -449519 -415624 -744577 279403 -158951 -2443181 -358890 468069 1026124 -708337 -1631978
7621a631978A360901m43829a086545B60069a114194B274636q18911a584251M65006
$$ -1631978 1360901 917072 -1086545 260069 -1114194 2274636 1455725 -1584251 -1119245
7612a119245M47152I12918J85653g65900k002959a46407A519J085397g2655D48006
$$ -1119245 -672093 912918 1098571 -765900 -2768859 -146407 1519 1086916 -72655 448006
7601e95501p21942C8864P33434a883301A348119b66321p44031A813278i01002
$$ -595501 -1317443 38864 772298 -1883301 1348119 -266321 -1010352 1813278 -901002
7591h12758q04132d22609D8356b162546P49278d85869A577444e57368o09369b85719
$$ -812758 -1616890 -422609 48356 -2162546 -1413268 -485869 1577444 -557368 -1166737 -285719
7580a384238K65842a16546D41707M49467f31131A60782b12233b8410p87501b94674
$$ -1384238 -1118396 -116546 441707 891174 -631131 160782 -212233 -28410 -815911 -294674
7569B470925a225037A462391a380498b58234j37841D48396e23083B92018g25906
$$ 2470925 -1225037 1462391 -1380498 -258234 -396075 448396 -523083 292018 -725906
7559i59821G45315g98370F0950Q74715a854403O31262b40223B297964G62276J54677
$$ -959821 745315 -798370 60950 935665 -1854403 -1223141 -240223 2297964 762276 916953
7549I16953j43798a022761m70334D21331L31933a816774q74103c52384A61343
$$ 916953 773155 -1022761 -1493095 421331 753264 -1816774 -2690877 -352384 161343
7539f52833l24655c32257I67098A72116K21282L85981c348582C60620K77104c045271
$$ -652833 -977488 -332257 967098 172116 393398 779379 -3348582 360620 637724 -3045271
7528I35783B77865d6661j193704A540076n98173l80289f02728j188066M82861
$$ 935783 277865 -46661 -1240365 1540076 941903 561614 -602728 -1790794 -1307933
7519a307933A10639g03320n7948c33192A208429a004974J77563k796598J672037
$$ -1307933 110639 -703320 -761268 -333192 1208429 -1004974 -827411 -3624009 -1951972
7510a951972d26932B13332a947896d1860k4083H21563A00315K25800f55960g605
$$ -1951972 -426932 213332 -1947896 -41860 -65943 821563 100315 326115 -655960 -7605
7499C29786Q60559f21603J28054j103454A121649f62793F77308a565215C7154
$$ 329786 1190345 -621603 -493549 -1597003 1121649 -662793 677308 -1565215 37154
7489c95175G48793P618C8921a142183E06577e51110H92762m30355L63929b723660
$$ -395175 748793 756411 38921 -1142183 506577 -551110 892762 462407 826336 -2723660
7478A144400a717591j69219a10262l29871k028900a37735l88833G16053e3197
$$ 1144400 -1717591 -1886810 -110262 -440133 -2469033 -137735 -526568 716053 -53197
7468a902656P87679k66842A300774g22372K3111m44424A545075B01037R76747
$$ -1902656 -1114977 -1381819 1300774 -722372 -699261 -1143685 1545075 201037 1177784
7459A177784b511124i59537j198599M42648L46039M09299j250826H59054B82517
$$ 1177784 -2511124 -959537 -2158136 -1715488 -1369449 -960150 -2210976 859054 282517
7449E97336J22150f91789D53024g77274A478388C96091d13365j008983A024290
$$ 597336 719486 -691789 453024 -777274 1478388 396091 -413365 -1422348 1024290
7439f91610D58577J578265p94787b307775B14226J498559G59296a03800d0689
$$ -691610 458577 2036842 1242055 -2307775 214226 1712785 759296 -103800 -40689
7429A240561m85123a516608A218141b172229f94031Q9733j302695e91321k087524
$$ 1240561 755438 -1516608 1218141 -2172229 -694031 -604298 -1906993 -591321 -2678845
7420b678845E2225f93338j052421j58782A010922f48214A680073e35184A718402
$$ -2678845 52225 -693338 -1745759 -1904541 1010922 -648214 1680073 -535184 1718402
7410A85061a263584H81893F4754J273465C62829K68048g6037k05241k003621B11058
$$ 185061 -1263584 881893 64754 1338219 362829 630877 -76037 -281278 -2284899 211058
7399A294746h99097E96810M93053B6592J388559k11879f59010k68658b33981m02839
$$ 1294746 -899097 596810 1089863 26592 1415151 1203272 -659010 -927668 -233981 -636820
7389f36820J66854k91709j480271R63047d56659a25012l45350k436593A09265
$$ -636820 -469966 -761675 -2241946 -1278899 -456659 -125012 -470362 -2906955 109265
7379I1258R09319c66373k13821p44061F11083a760319L08840O66972k05597L30539
$$ 91258 1000577 -366373 -580194 -1324255 611083 -1760319 -1451479 -784507 -990104 -659565
7369f59565K21643B36593f29267j005003g20280H25798e96829b68192j003793
$$ -659565 -437922 236593 -629267 -1634270 -720280 825798 -596829 -268192 -1271985
7360a271985a65311C43113c062759D23619A20624d2275A964503a338187B31408
$$ -1271985 -165311 343113 -3062759 423619 120624 -42275 1964503 -1338187 231408
7350a880584P04443A038670B15685c47280j564539M58925E7951i35434A020394
$$ -1880584 -1176141 1038670 215685 -347280 -1911819 -1452894 57951 -935434 1020394
7340C79141J085456c5497j88279j548702c25812a44101j784958B64286d08099
$$ 379141 1464597 -35497 -223776 -1772478 -325812 -144101 -1929059 264286 -408099
7330i29674l42323L25721p48618d54097E26019d71833k181614B91816Q22122B28362
$$ -929674 -1271997 -946276 -1694894 -454097 526019 -471833 -2653447 291816 1113938 228362
7319i7320f039j36662G13233a860319A646828B9723f69540E05885i25288J29586
$$ -97320 -6039 -142701 713233 -1860319 1646828 29723 -669540 505885 -925288 -795702
7309g95702J68238D24794b73608P9230l23584j49696d2622H62804k37091a317468
$$ -795702 -627464 424794 -273608 -194378 -517962 -667658 -42622 862804 625713 -1317468
7298a344708A573361H9122N00633R58680f51196l56905A341832a110938H56810
$$ -1344708 1573361 89122 589755 1548435 -651196 -1008101 1341832 -1110938 856810
7288a357390A10258R37445d72193C44708a434547e05601H2553g48615K18335H99603
$$ -1357390 110258 1047703 -472193 344708 -1434547 -505601 82553 -748615 -530280 899603
7277I22651a711065A25258a012172k84780F6768f7590j65170k730108E50861a306033
$$ 922651 -1711065 125258 -1012172 -1296952 66768 -67590 -232760 -2962868 550861 -1306033
7266A095934E2062Q5456e10588m92439a52375j45278k27185m7624K9373a61538
$$ 1095934 52062 137518 -510588 -1003027 -152375 -297653 -524838 -572462 -543089 -161538
7255F96579b514358A2642b290247g01405m86238c65222B09907J422929f47661
$$ 696579 -2514358 12642 -2290247 -701405 -1187643 -365222 209907 1632836 -647661
7245b20787o2996F29259a066029d72506h358o18986b93987O3106o31546A058382
$$ -220787 -283783 629259 -1066029 -472506 -8358 -627344 -293987 -230881 -862427 1058382
7234A529999c32720c6673p49407b79282F87777A79467i61899j546883H08527Q5926
$$ 1529999 -332720 -36673 -786080 -279282 687777 179467 -961899 -2508782 808527 894453
7224H94453b21697q25j67284q73892D94204N88576e8893n423j219901E87133d42352
$$ 894453 -221697 -222522 -389806 -1263698 494204 1082780 -58893 -64316 -1284217 587133 -442352
7212a291094B05766J375502m79012f27463a44159j087594J6935B166173B31440
$$ -1291094 205766 1581268 1102256 -627463 -144159 -1231753 -1214818 2166173 231440
7202i94193H78581d925j075392O8045A14908L34758i17237m23016A829815C92534
$$ -994193 878581 -4925 -1080317 -1012272 114908 449666 -917237 -1340253 1829815 392534
7191a460780a35575j4960H2695f48792H0312O63071j02727c43090B050904i23535
$$ -1460780 -135575 -150535 82695 -648792 80312 743383 640656 -343090 2050904 -923535
7180B77751d85124I54613A85508g15446H22939a456743e85368m06027n56447F02492
$$ 277751 -485124 954613 185508 -715446 822939 -1456743 -585368 -991395 -1547842 602492
7169a690861O41070A568946B67227b003590A621749i52505j56898l86768m45454
$$ -1690861 -1049791 1568946 267227 -2003590 1621749 -952505 -1109403 -1496171 -1941625
7160a941625A264069c66661l06220j3248A21892b241519J040791F22605a240838
$$ -1941625 1264069 -366661 -672881 -686129 121892 -2241519 -1200728 622605 -1240838
7150H13094i21704L57055E2944b192966c03903g8626B57351J42998a248239j225893
$$ 813094 -921704 -564649 52944 -2192966 -303903 -78626 257351 400349 -1248239 -2474132
7140b474132E59059a293193A023749g65563F01120h77350o68528E7462L295914
$$ -2474132 559059 -1293193 1023749 -765563 601120 -877350 -1545878 57462 3353376
7131C353376a876581A32080J296584h655j507895I2623P62528A56263L97058a344773
$$ 3353376 -1876581 132080 1428664 -8655 -1516550 92623 855151 156263 553321 -1344773
7120a158918A700017k19738b55057q77643A47991M84418k92140a350863A439811
$$ -1158918 1700017 1480279 -255057 -1132700 147991 632409 340269 -1350863 1439811
7110C39097K158975A6983b990642a423608c47565j799996E64588h68831B28644
$$ 339097 2498072 16983 -2990642 -1423608 -347565 -2147561 564588 -868831 228644
7100a495600G3743a859794E769M0274a994248Q69457c71098k65193j69329e6239
$$ -1495600 73743 -1859794 5769 46043 -1994248 -1124791 -371098 -636291 -805620 -56239
7089B193189H66281M80071o61084B48598R4576c25176A076703a275297A055362
$$ 2193189 866281 1346352 685268 248598 343174 -325176 1076703 -1275297 1055362
7079I90157P82883D56051d41233k36503f2603F3655J01041a45351o37342m66426
$$ 990157 1773040 456051 -441233 -677736 -62603 63655 164696 -145351 -782693 -1249119
7069a249119N58673J10485i4196l55600j536092G38510d67461F369K72831G0885
$$ -1249119 -690446 -579961 -94196 -449796 -1985888 738510 -467461 6369 279200 70885
7058h07800E75868f83758k21115G70802b25814H75220b077057C150517i02801
$$ -807800 575868 -683758 -904873 770802 -225814 875220 -2077057 3150517 -902801
7048G11499a853741A149983i13703m20491c91254L5324k8484p2189K19517j45614
$$ 711499 -1853741 1149983 -913703 -1334194 -391254 -355930 -384414 -456603 -237086 -382700
7038c82700n38254n09279A012070J30830g86416j655319Q72042P68170F33474
$$ -382700 -920954 -1430233 1012070 1142900 -786416 -2441735 -1569693 -801523 633474
7028d72226A023537h74304A437662d36861j12726p43350a59183j816719C93407
$$ -472226 1023537 -874304 1437662 -436861 -549587 -1292937 -159183 -1975902 393407
7018E04852a676172J42147j76466E25526R88431a022053b09216o95818L60596
$$ 504852 -1676172 -1534025 -1710491 525526 1513957 -1022053 -209216 -905034 -544438
7009e44438h9504q06981D12151a715118D99566g46304j194765I27476D30489c12045
$$ -544438 -89504 -896485 412151 -1715118 499566 -746304 -1941069 927476 430489 -312045
6998i31007L2339l06198d65181m07976A96866a577275F66697a62292A144358Q48699
$$ -931007 -898668 -1204866 -465181 -873157 196866 -1577275 666697 -162292 1144358 1993057
6988A993057C33535f73664C53029f15040k90488A69466L67230a706293F91120
$$ 1993057 333535 -673664 353029 -615040 -905528 169466 536696 -1706293 691120
6978A229461b51854m30654f5296r25049E7618K093168a961647F55952F6455l70
$$ 1229461 -251854 -682508 -65296 -990345 57618 2150786 -1961647 655952 66455 66085
6968F6085c89054m87371D01317a83260A277340m98779k69392e71662j604964f29296
$$ 66085 -389054 -876425 401317 -183260 1277340 778561 509169 -571662 -2176626 -629296
6957b15447j506076A755428n93861E6390P33844B93638J532670M31832B97359
$$ -215447 -1721523 1755428 1161567 56390 790234 293638 1826308 2258140 297359
6947g09944I80911j82035c39162j06444F48187a019546j084055P47003K12824
$$ -709944 980911 798876 -339162 -445606 648187 -1019546 -2103601 -1356598 -1143774
6938a143774B25388c95008C06473d47961A519065d08787j128344C80768a131122
$$ -1143774 225388 -395008 306473 -447961 1519065 -408787 -1537131 380768 -1131122
6928b31595p85327o72303f10621b5710j442488D83057O7620i0694k48436A776973
$$ -231595 -1016922 -1689225 -610621 -25710 -1468198 483057 550677 -90694 -339130 1776973
6917b299364Q01231q1212A87948L62815n4146a362662E92050a247705e89356r99005
$$ -2299364 -1498133 -1579345 187948 550763 496617 -1362662 592050 -1247705 -589356 -1588361
6907a588361e5165k118878G71631i76786j190128B754325a742794P34677A062629
$$ -1588361 -55165 -2174043 771631 -976786 -2166914 2754325 -1742794 -1008117 1062629
6897a274944A59609a781871P2128l58998G26104M29776K78325A13308J0460h03974
$$ -1274944 159609 -1781871 -1709743 -2068741 726104 1155880 1434205 113308 123768 -803974
6886i85924g3486m54966A055004a63491H12302R49208a932986a4038q30614a38696
$$ -985924 -73486 -528452 1055004 -163491 812302 1761510 -1932986 -14038 -844652 -138696
6875A150942c21614H28476d96551E77137a025622q5573m01819B41269a200338
$$ 1150942 -321614 828476 -496551 577137 -1025622 -1111195 -1513014 241269 -1200338
6865b75344q31482b58356G50435d4875D58356K9828A1993P24388g14321r53997
$$ -275344 -1106826 -258356 750435 -44875 458356 488184 11993 736381 -714321 -1668318
6855a668318e03012p90721d29082i503A255199F26876a546083K58754M26486a09310
$$ -1668318 -503012 -1293733 -429082 -9503 1255199 626876 -1546083 -1287329 -860843 -109310
6844F31272a795542b30061F42626c81270A486388i18098j07425H52060c91525
$$ 631272 -1795542 -230061 642626 -381270 1486388 -918098 -1025523 852060 -391525
6834a256511m85073m82132B40358J95651i20608b81443A48977a872202g00283
$$ -1256511 -1741584 -2223716 240358 436009 -920608 -281443 148977 -1872202 -700283
6824e32504A342953C26007b211795F70808i64690a95850F33712J240746g24243
$$ -532504 1342953 326007 -2211795 670808 -964690 -195850 633712 1874458 -724243
6814g33206L27160r0415A464192a592857B582642f20473j746213J074030l05892
$$ -733206 -406046 -496461 1464192 -1592857 2582642 -620473 -2366686 -1292656 -1598548
6805a598548c87748A09035c338373B13353d01195G35288Q25434D05619g71182
$$ -1598548 -387748 109035 -3338373 213353 -401195 735288 1560722 405619 -771182
6795a602063m40079d5693A114741B35913e87952I01273a102582C94473J2421P94930
$$ -1602063 -2042142 -45693 1114741 235913 -587952 901273 -1102582 394473 406894 1201824
6785A201824H291K117344F9947b268924Q54165e05236k278675J018475G24242
$$ 1201824 8291 2125635 69947 -2268924 -1414759 -505236 -2783911 -1765436 724242
6775a199624A003911b859735J428246c09270k084707f62904A033122m18138k62541
$$ -1199624 1003911 -2859735 -1431489 -309270 -2393977 -662904 1033122 614984 352443
6766C52443e88130m07448A693721d45675a90977p80700p03059I23363K44342m23232
$$ 352443 -588130 -995578 1693721 -445675 -190977 -971677 -1674736 923363 1167705 744473
6756G44473J16275o5329a688583c55090A554689a607045g45758o61946J43334
$$ 744473 860748 795419 -1688583 -355090 1554689 -1607045 -745758 -1407704 -1264370
6747a264370F21773K89596b05507E91492g07674L44119j06981j90280E71795a338992
$$ -1264370 621773 911369 -205507 591492 -707674 -363555 -470536 -660816 571795 -1338992
6736f07160N6010A403407E57935F4257b170121I54141l90350b11045M6242j007142
$$ -607160 -551150 1403407 557935 64257 -2170121 954141 563791 -211045 -164803 -1171945
6726a171945a53796j126654L49327A452193d80968m75479H37098a347910a47120
$$ -1171945 -153796 -1280450 -931123 1452193 -480968 -956447 837098 -1347910 -147120
6716b64828m04646r37305A319131B51774J301395C67567d78956j240457a26594
$$ -264828 -669474 -1606779 1319131 251774 1553169 367567 -478956 -1719413 -126594
6706E13400d80424I45556a255113A925854l51925C05049i48306M33688G62859
$$ 513400 -480424 945556 -1255113 1925854 1573929 305049 -948306 -514618 762859
6696b360773N89577C84629e52023A240561i81542g2477o4920A211224a376879
$$ -2360773 -1771196 384629 -552023 1240561 -981542 -72477 -137397 1211224 -1376879
6686E51238J237721J21321o00190b925346A370232a458020C85222O5546f6805
$$ 551238 1788959 1910280 1310090 -2925346 1370232 -1458020 385222 450768 -66805
6676A860983i68537G37626A45934J419516D00206a110378b10191j127186j28262
$$ 1860983 -968537 737626 145934 1565450 400206 -1110378 -210191 -1337377 -1465639
6667a465639A131811a373230b96655m67467o41206L85542b04196B579775o51017
$$ -1465639 1131811 -1373230 -296655 -764122 -1405328 -1019786 -204196 2579775 1928758
6658A928758a708776b73016F89773b121997h63218H06392e58883b18508k78766
$$ 1928758 -1708776 -273016 689773 -2121997 -863218 806392 -558883 -218508 -497274
6649d97274j54487G8698i58144B084083a90230j051904A192442a363262A589024
$$ -497274 -651761 78698 -958144 2084083 -190230 -1242134 1192442 -1363262 1589024
6639D62859k9956c9139n32560A031376G3619b028943f97443I40390G5806K364242
$$ 462859 432903 -39139 -571699 1031376 73619 -2028943 -697443 940390 75806 2440048
6629B440048b108999H43237A7731c028865a167976l230801C51720a499153b26944
$$ 2440048 -2108999 843237 17731 -3028865 -1167976 -4398777 351720 -1499153 -226944
6619I23979b90458C01797g93447B460146a97457R5042A838470E42311b768749
$$ 923979 -290458 301797 -793447 2460146 -197457 -102415 1838470 542311 -2768749
6609b98569H35694b677471A516047b85124A703548E91772a20584r65423l0169
$$ -298569 835694 -2677471 1516047 -285124 1703548 591772 -120584 -1086007 -1116176
6600a116176I35416l99149a059690d61665a2174A919665F08974a333320a56503
$$ -1116176 935416 536267 -1059690 -461665 -12174 1919665 608974 -1333320 -156503
6590c39458C40072K84672h82539A65740N26476d85756B68125J12949J449821b47870
$$ -339458 340072 624744 -882539 165740 692216 -485756 268125 381074 1830895 -247870
6579g27568e2683A026769N9645D97761a208786E14195b179054h03798A295470
$$ -727568 -52683 1026769 1086414 497761 -1208786 514195 -2179054 -803798 1295470
6569H09896M01302a628781E04671a679620D8413K596503b413056a061884B89452
$$ 809896 1211198 -1628781 504671 -1679620 48413 2644916 -2413056 -1061884 289452
6559A233860h3059H72166p7912f14038B6811J39264d22828j295442H51536B86349
$$ 1233860 -83059 872166 794254 -614038 26811 166075 -422828 -1718270 851536 286349
6548a611015g2830k87437j01751D95651a871358e04670a33818k3040A97808J402627
$$ -1611015 -72830 -360267 -462018 495651 -1871358 -504670 -133818 -156858 197808 1600435
6538A600435F62245h49410j468622A073073c050646e35344A302540k43557a338699
$$ 1600435 662245 -849410 -2318032 1073073 -3050646 -535344 1302540 1058983 -1338699
6528C99098J623060f14042J29558q10349A509115q1179J04601b186246C60202
$$ 399098 2022158 -614042 -484484 -1294833 1509115 1427936 1532537 -2186246 360202
6518I25207K33474O65954c55167j63048E39157J241198J64990c52201Q4136j398011
$$ 925207 1158681 1824635 -355167 -518215 539157 1780355 1945345 -352201 -268065 -1666076
6508a666076j83194a94180b2368J1059J996A140485E05033l1059a122637D13922
$$ -1666076 -1849270 -194180 -22368 -11309 -9313 1140485 505033 473974 -1122637 413922
6497a093676a31507j28729A918321C81345a001137b17702L9754e5289k814A440824
$$ -1093676 -131507 -260236 1918321 381345 -1001137 -217702 -177948 -55289 -58103 1440824
6486a227392A935246i63361B517089a093280D603J242769a23461j505563H03440
$$ -1227392 1935246 -963361 2517089 -1093280 4603 1247372 -123461 -1629024 803440
6476A627795a146233B94170a228930l75980A8123M73021a117777J56969A856862
$$ 1627795 -1146233 294170 -1228930 -1604910 18123 491144 -1117777 -960808 1856862
6466a403188c18452H84893g80655p14002b23052E98162K100370a102208B48863
$$ -1403188 -318452 884893 -780655 -1494657 -223052 598162 2698532 -1102208 248863
6456c34482k00148B362304f26802H57269k3945c69990B3416c24726j530725e35914
$$ -334482 -534630 2362304 -626802 857269 833324 -369990 23416 -324726 -1855451 -535914
6445a013163j942949C9134e30615A5009d73564r35733A287704g85797P9080L5218
$$ -1013163 -2956112 39134 -530615 15009 -473564 -1409297 1287704 -785797 -706717 -671499
6435f71499k66252o33310A969768n11663F98659N63224C47141f04782b08272H73277
$$ -671499 -937751 -1571061 1969768 1458105 698659 1261883 347141 -604782 -208272 873277
6424b466000B526078G89011J28155a917997I80748a402861F994a478499A56571
$$ -2466000 2526078 789011 917166 -1917997 980748 -1402861 6994 -1478499 156571
6414c20368k59137A374147b018545L7030O26396A333718a058616b7884A127819
$$ -320368 -579505 1374147 -2018545 -1981515 -1355119 1333718 -1058616 -27884 1127819
6404G56529i49904A31b3983F55834c64335j940084I74456g82438n14345M60789
$$ 756529 -949904 131 -23983 655834 -364335 -2304419 974456 -782438 -1296783 -835994
6394h35994J98711c09917C14934f14734j126508j613303G76364a534645H23409
$$ -835994 -637283 -309917 314934 -614734 -1741242 -3354545 776364 -1534645 823409
6384b23844j571562A442148c05872A069408n13171a002255K59710j284417j598823
$$ -223844 -1795406 1442148 -305872 1069408 556237 -1002255 -742545 -2026962 -3625785
6375c625785c91798C38927c965A760541a207922b07924H76540A26892c96851m49212
$$ -3625785 -391798 338927 -3965 1760541 -1207922 -207924 876540 126892 -396851 -846063
6365h46063a49870A576997g13193C96804N64522L70771K06844h20624K95852A3742
$$ -846063 -149870 1576997 -713193 396804 961326 1332097 1538941 -820624 -524772 13742
6354d62651n83249e0824j066711K42847A799012m35091O41688a709056K81007
$$ -462651 -1045900 -50824 -1117535 -874688 1799012 1363921 2005609 -1709056 -1428049
6345a428049F86042J005857f13560b61872O2405h0621m74990j667606f68490H05463
$$ -1428049 686042 1691899 -613560 -261872 -199467 -80621 -555611 -2223217 -668490 805463
6334f85917o58157A332448i93582k18969R0128d33843B5590a210821D90632g11051
$$ -685917 -1344074 1332448 -993582 -1212551 -1122423 -433843 25590 -1210821 490632 -711051
6323A596618C10228J631059d58838B55221a13016B706916a77979n42235I95643
$$ 1596618 310228 1941287 -458838 255221 -113016 2706916 -177979 -720214 995643
6313d11482m58823F02265A15971P82615f45327n41061A785025B44176N05038j98052
$$ -411482 -870305 602265 115971 898586 -645327 -1186388 1785025 244176 749214 551162
6303E51162J871401A031709J416198a59396c9002I98712l9474i80583m68420C56485
$$ 551162 2422563 1031709 2447907 -159396 -39002 998712 959238 -980583 -1449003 356485
6292e59235a63053j807312A198396f69261b64452k318960c89387G84023b2754
$$ -559235 -163053 -1970365 1198396 -669261 -264452 -2583412 -389387 784023 -22754
6282A35721R04934l38852k48729d8301D25962a26957B076836A91173K59988a457618
$$ 135721 1040655 701803 453074 -48301 425962 -126957 2076836 191173 451161 -1457618
6271C80850b163651a001562A125289D46400b488940C15174j22636e28696B71275
$$ 380850 -2163651 -1001562 1125289 446400 -2488940 315174 192538 -528696 271275
6261a10355C66798e88174l03966d09495l64189A107914a926268d0512c545B12161
$$ -110355 366798 -588174 -892140 -409495 -773684 1107914 -1926268 -40512 -3545 212161
6250A451500g63285o2025B108095C62164K64687g40492m9116B74103J982043e33741
$$ 1451500 -763285 -825310 2108095 362164 626851 -740492 -789608 274103 2256146 -533741
6239A414568g55394C70232a095226F08367J331800o35141b25609l44478p86094
$$ 1414568 -755394 370232 -1095226 608367 1940167 1305026 -225609 -570087 -1356181
6230a356181B243947a017714R6765c91424o18569L5383c19863p26473A40792g86868
$$ -1356181 2243947 -1017714 -920949 -391424 -1009993 -974610 -319863 -1046336 140792 -786868
6219b44872j888653c94717j134899j40933K49289j68426J55943E26617J07299
$$ -244872 -2133525 -394717 -1529616 -1670549 -1421260 -1589686 -1433743 526617 633916
6210F33916a241235k44935H72414R06489f75665A445981i15032c02278j191573
$$ 633916 -1241235 -1486170 872414 1778903 -675665 1445981 -915032 -302278 -1493851
6201a493851k81038E94590a817628f50853E86799K209066H2423J58041j14931
$$ -1493851 -1774889 594590 -1817628 -650853 586799 2795865 82423 240464 125533
6192A25533Q31166b227596A13157e99405E85256K52245a199304p86546g92269
$$ 125533 956699 -2227596 113157 -599405 585256 837501 -1199304 -1985850 -792269
6182G21040a528558L84248N2826j129780p3101A371249a660498f96064L32716
$$ 721040 -1528558 -1144310 -1091484 -2221264 -2294365 1371249 -1660498 -696064 -363348
6173c63348l33131A19185a044083A190169a463057A036655j01497J59546g45828
$$ -363348 -696479 119185 -1044083 1190169 -1463057 1036655 935158 1094704 -745828
6163a694845F25684a427973D09732a299717a71076m75973A035832e79618j313775
$$ -1694845 625684 -1427973 409732 -1299717 -171076 -647049 1035832 -579618 -1893393
6154a893393C38534a085891G40261b045947A146923a423973E96112b254863d3479
$$ -1893393 338534 -1085891 740261 -2045947 1146923 -1423973 596112 -2254863 -43479
6144A160050b58686m39625I18664g3355A775346a154940q3185j039f09018B9552
$$ 1160050 -258686 -698311 918664 -73355 1775346 -1154940 -1238125 -1239164 -609018 29552
6133b795032d22845j980953a087009k90751O26227j670766A373465h27300E89843
$$ -2795032 -422845 -2403798 -1087009 -1377760 -751533 -2422299 1373465 -827300 589843
6123B2813R6676N77922b18731A37461J150537a198582G06095g34355m6804g9719
$$ 22813 119489 697411 -218731 137461 1287998 -1198582 706095 -734355 -781159 -79719
6112D57300c7582j25584E3477i22578K04938A282498L58507e75361p72109k41515
$$ 457300 -37582 -163166 53477 -922578 -717640 1282498 1641005 -575361 -1347470 -1588985
6102a588985a26296C45948M40872g44564K94097j102782C70851P99215D5165b158452
$$ -1588985 -126296 345948 786820 -744564 -450467 -1553249 370851 1170066 45165 -2158452
6091A58771J136749n36294D1699a030583c10975A024303J15974a080571A81405
$$ 158771 1295520 759226 41699 -1030583 -310975 1024303 1140277 -1080571 181405
6081e99226A804509d01648C76390K68865i57393H2609h14410A079380a747049
$$ -599226 1804509 -401648 376390 645255 -957393 82609 -814410 1079380 -1747049
6071a083924n48934c56382F84488f52110i1369F16775c09932E34684J257665C60550
$$ -1083924 -1632858 -356382 684488 -652110 -91369 616775 -309932 534684 1792349 360550
6060A002591h36869p36371M03332r5040j086503G23374h4325m63446C84665O51069
$$ 1002591 -836869 -1573240 -1169908 -1264948 -2351451 723374 -84325 -547771 384665 1035734
6050A035734m82069b352902A357922h5908q70442D6328J95289g84720K64370F54682
$$ 1035734 553665 -2352902 1357922 -85908 -956350 46328 241617 -784720 -520350 654682
6039A033277a681665B294500h33537B918401i41791J65796p50205J59312A945470
$$ 1033277 -1681665 2294500 -833537 2918401 -941791 -775995 -1526200 -1366888 1945470
6029A186046m68164B90453I4065h12790B85776c10711o81647A108012P25736c82142
$$ 1186046 717882 290453 94065 -812790 285776 -310711 -992358 1108012 1833748 -382142
6018B95270M8715a359257A151789b54062k55553J66963C31260J50049a558880
$$ 295270 343985 -1359257 1151789 -254062 -509615 -342652 331260 481309 -1558880
6008d75835J76178j57957j306170A048403b292372Q83666M21629d51115p39139
$$ -475835 -299657 -457614 -1763784 1048403 -2292372 -1408706 -987077 -451115 -1190254
5999a190254M08525B89739a835405A698144f79123A9135R05730g77731A885807
$$ -1190254 -781729 289739 -1835405 1698144 -679123 19135 924865 -777731 1885807
5989D55390c73632j067610D45049P24036C88175k5790d96965k2482o87571D8148
$$ 455390 -373632 -1441242 445049 1169085 388175 362385 -496965 -519447 -1207018 48148
5978I5821b603A790996g96060C06541c370402d70644j071774K96826f04905B65460
$$ 95821 -2603 1790996 -796060 306541 -3370402 -470644 -1542418 -1245592 -604905 265460
5967a022405D69259J42928h51439k35767A281410a437647C13752k5324m1909b406827
$$ -1022405 469259 612187 -851439 -1087206 1281410 -1437647 313752 288428 246519 -2406827
5956A550455c66447E64974i71158j227328B779486d9307B22986l2606J31490a67649
$$ 1550455 -366447 564974 -971158 -2198486 2779486 -49307 222986 190380 321870 -167649
5945A644611a505217b22533m33962H51053a801407A355015a361857K95352j42059
$$ 1644611 -1505217 -222533 -656495 851053 -1801407 1355015 -1361857 -1066505 -1208564
5936a208564L76316A042977J84051n52966j28103Q67865l32583d55198q76741
$$ -1208564 -832248 1042977 1227028 674062 545959 1413824 1081241 -455198 -1331939
5927a331939L59696M1673A629060e66409H36308c47267G3246e14183K39405G69984
$$ -1331939 -972243 -930570 1629060 -566409 836308 -347267 73246 -514183 -274778 769984
5916a943584h44339F83700a02043A354245j43952a143961o79604B29859N19734
$$ -1943584 -844339 683700 -102043 1354245 1210293 -1143961 -1823565 229859 749593
5907G49593a38619n27025b87338m41691H21355d51338l63675Q4363n30645c6121
$$ 749593 -138619 -665644 -287338 -729029 821355 -451338 -815013 -730650 -1261295 -36121
5896a916653A090050L2155J581575b44620j182519K22366C34346A11966N3700
$$ -1916653 1090050 1122205 2703780 -244620 -1427139 -1204773 334346 111966 165666
5887A65666J980957b53561j42168A115570C60948n1089a775027e03616B628888
$$ 165666 2146623 -253561 -395729 1115570 360948 309859 -1775027 -503616 2628888
5877H59616i93021F82704A71064O97461a805778A02460J161565A73820d05907
$$ 859616 -993021 682704 171064 868525 -1805778 102460 1264025 173820 -405907
5867B12454a267282e34568D15551C5268a220432K75330A782198A2274e92002a42672
$$ 212454 -1267282 -534568 415551 35268 -1220432 -945102 1782198 12274 -592002 -142672
5856F6688a006405L2297r20843L10842k18124e56536C01588D741b073070b38215
$$ 66688 -1006405 -974108 -1894951 -1584109 -1802233 -556536 301588 4741 -2073070 -238215
5845A161029a309782H46430G2754J218089a141160A206581l9076a190472c9447
$$ 1161029 -1309782 846430 72754 1290843 -1141160 1206581 1167505 -1190472 -39447
5835a67785A96170i1431J0452B500766g08533A377312n40522k34723k42853c18850
$$ -167785 196170 -91431 -80979 2500766 -708533 1377312 836790 602067 359214 -318850
5824a743986l17195e71628r30107g17125b32014D30695a207342A02347R92026
$$ -1743986 -2061181 -571628 -1501735 -717125 -232014 430695 -1207342 102347 1094373
5815A094373j01161c416779G63821c3085A377218D38217f08829b29785m04278
$$ 1094373 993212 -3416779 763821 -33085 1377218 438217 -608829 -229785 -634063
5806f34063A048082e46013j005328o38188d33775D53352b175347B45186i92985
$$ -634063 1048082 -546013 -1551341 -2189529 -433775 453352 -2175347 245186 -992985
5796i6190B111325a012509I81588a338847q86837A507104l64555b047339A441008
$$ -96190 2111325 -1012509 981588 -1338847 -2225684 1507104 1142549 -2047339 1441008
5786a526898f70374o8109a49542G87365a117283D00428c18678I83524a512043
$$ -1526898 -670374 -738483 -149542 787365 -1117283 400428 -318678 983524 -1512043
5776H92521e27577A608067b02769C84814a802359G60924a813192A738098E04690
$$ 892521 -527577 1608067 -202769 384814 -1802359 760924 -1813192 1738098 504690
5766a343874c11053j22012l19100C32327j48727J071740a786864g48593A329273
$$ -1343874 -311053 -433065 -752165 332327 183600 1255340 -1786864 -748593 1329273
5756B534363j126191A52856g72531E49598a122802i231I73997B63838a061485
$$ 2534363 1408172 152856 -772531 549598 -1122802 -9231 973997 263838 -1061485
5746a409248c72905l84013j009143A681615k10923g98986j477726B549654g74811
$$ -1409248 -372905 -756918 -1766061 1681615 1470692 -798986 -2276712 2549654 -774811
5736a423260G58830d23742b03748p76095H4517f14734J41029A127534k18344a09659
$$ -1423260 758830 -423742 -203748 -979843 84517 -614734 -473705 1127534 909190 -109659
5725a906073G71666d17570J42263B89080P00502l69120a202397A249557J339994
$$ -1906073 771666 -417570 -275307 289080 989582 620462 -1202397 1249557 2589551
5716B589551D0215O08144i71107C483575j025162h10607L75769k29550H80823
$$ 2589551 40215 648359 -971107 3483575 2458413 -810607 -434838 -664388 880823
5706D49062N90497i3274j242134d04066H67687j76490D7021K36061R83939N806
$$ 449062 1039559 -93274 -1335408 -404066 867687 691197 47021 283082 1267021 1272827
5696A272827O11083L28468b562296g11654A997639a285158b830j364795q8849
$$ 1272827 1883910 2212378 -2562296 -711654 1997639 -1285158 -2830 -1367625 -1456474
5687a456474A633743a276564e55293m85175b64587N6576C2412O21799C4439b60852
$$ -1456474 1633743 -1276564 -555293 -1040468 -264587 -208011 32412 654211 34439 -260852
5676G09728a549321q73080A35521f66698A08670J264226N83084e6040k025902
$$ 709728 -1549321 -2422401 135521 -666698 108670 1372896 1955980 -56040 -2081942
5667b081942B90655l7794J347538C28543h55982C99357Q93949c91700D6214d18703
$$ -2081942 290655 252861 1600399 328543 -855982 399357 1293306 -391700 46214 -418703
5656A308286g00746K25270b1186j078249I77090c359671b75030j054703e458C47164
$$ 1308286 -700746 -475476 -21186 -1099435 977090 -3359671 -275030 -1329733 -5458 347164
5645E19844a129892A540261a926105A254700c555714E61123d56325A165212A2782
$$ 519844 -1129892 1540261 -1926105 1254700 -3555714 561123 -456325 1165212 12782
5635C44365R28923a513184b86112i7639j506715B19777P64751K91823b71836a04526
$$ 344365 1273288 -1513184 -286112 -97639 -1604354 219777 984528 1276351 -271836 -104526
5624A173858b66985j114080m111D70699J008809b59271k06571a48661r09265R5145
$$ 1173858 -266985 -1381065 -1385176 470699 1479508 -259271 -465842 -148661 -1057926 -962781
5614i62781m72367D02843D3471J633937A95450b03166A247175J61525a07735E71697
$$ -962781 -1435148 402843 43471 1677408 195450 -203166 1247175 1408700 -107735 571697
5603D54917f2789q56648E02599f79362A911746j68722A03459J65246a604069N43272
$$ 454917 -62789 -919437 502599 -679362 1911746 1743024 103459 268705 -1604069 -1060797
5593a060797e30197b46344i4991l09938F71298B32195J82039a547961c07057j353532
$$ -1060797 -530197 -246344 -94991 -404929 671298 232195 414234 -1547961 -307057 -1660589
5583a660589I24554c52022O1857r9647J22911p80881i9104n0897o47063F70529
$$ -1660589 924554 -352022 -290165 -389812 -266901 -1047782 -99104 -150001 -797064 670529
5572A757265d1430j053751H47932a912163F82762J059255h05308F72822J050312
$$ 1757265 -41430 -1095181 847932 -1912163 682762 1742017 -805308 672822 1723134
5563A723134A36615c42176A132838a063613e8397j550974q96710J211747l74873
$$ 1723134 136615 -342176 1132838 -1063613 -58397 -1609371 -2506081 -1294334 -1669207
5554a669207A025547a219650r54950b15522l50428C1346a636264D59045N36021
$$ -1669207 1025547 -1219650 -2174600 -215522 -565950 31346 -1636264 459045 995066
5545I95066F1835b239417M61502I90823a398368a47961q89459F7238L21323K229766
$$ 995066 61835 -2239417 -1777915 990823 -1398368 -147961 -1037420 67238 388561 2618327
5535B618327h57627B23723K171119a57660p56988m95190r0354A376721D00753
$$ 2618327 -857627 223723 2394842 -157660 -914648 -1409838 -1500192 1376721 400753
5525H74873M018L13033k50247i8995A135725f83574B91354L69657M04713b33407
$$ 874873 878891 1191924 941677 -98995 1135725 -683574 291354 661011 1065724 -233407
5514g56887G55272p7616i05451k34480A346089g77655A063384a483237A417443
$$ -756887 755272 677656 -905451 -1139931 1346089 -777655 1063384 -1483237 1417443
5504A59967K613932n76982b46094l01635p59423B21374L78710O70246c84134J65074
$$ 159967 2773899 2196917 -246094 -547729 -1307152 221374 600084 1270330 -384134 -219060
5494b19060C57713J23621i87980L78887J46259l49785p95371I96747l47017C2553
$$ -219060 357713 481334 -987980 -609093 -462834 -812619 -1607990 996747 649730 32553
5483e97657A705013m04909A51328O13323a156783j443220h4657C36483d60678
$$ -597657 1705013 1300104 151328 764651 -1156783 -2600003 -84657 336483 -460678
5473i99249D20975a114746b30976A728619B70244R96082C23117a6121k06545Q5014
$$ -999249 420975 -1114746 -230976 1728619 270244 1266326 323117 -16121 -222666 -137652
5463a37652B86565Q77789b219739Q86286I26118L98481M95210B80717a314200
$$ -137652 286565 1164354 -2219739 -1333453 926118 1324599 1819809 280717 -1314200
5453E04157L06371a54413A081965B22835i5754D90119J489803h0224q16213E929
$$ 504157 810528 -154413 1081965 222835 -95754 490119 1979922 -80224 -896437 5929
5442h90268k3856A458861h5080j00241j233163E10552K25629C29041f96634l52843
$$ -890268 -914124 1458861 -85080 -185321 -1418484 510552 736181 329041 -696634 -1049477
5432a049477M95167p09435E74888B81419L51259B0626J388765c070733B69110
$$ -1049477 -554310 -1263745 574888 281419 632678 20626 1409391 -3070733 269110
5422C10588J261099a271227J15762A674903b060226M69714G29657a814634C11787
$$ 310588 1571687 -1271227 -1155465 1674903 -2060226 -1590512 729657 -1814634 311787
5412D53959J235223C14734J286858l98865m75784d71570q74892e83152N9198B91523
$$ 453959 1689182 314734 1601592 1202727 726943 -471570 -1346462 -583152 -523954 291523
5401G07318a140865J70083l74278e70256A147525J505792j202367F26419O19277
$$ 707318 -1140865 -970782 -1345060 -570256 1147525 2653317 1450950 626419 1245696
5392A245696b455179A76796f13597C46824K35138B34434J448021o49115a476071
$$ 1245696 -2455179 176796 -613597 346824 581962 234434 1682455 1033340 -1476071
5382c97787A48092J288860b6059I04306a026269L24450l39931A903941J66325
$$ -397787 148092 1436952 -26059 904306 -1026269 -701819 -1041750 1903941 2070266
5373B070266B12569a202727I49090g8394j003832A216683f64741I27294k82662
$$ 2070266 212569 -1202727 949090 -78394 -1082226 1216683 -664741 927294 644632
5364F44632J69835h59225M18981j882169g1647G91244J493323h49867K67768A53649
$$ 644632 814467 -859225 -440244 -2322413 -71647 791244 2284567 -849867 -582099 153649
5353a760452B86051R85318a199507l58365A47405A6385b48152j918944A811958
$$ -1760452 286051 1271369 -1199507 -1557872 147405 16385 -248152 -2167096 1811958
5343D38718M15322M23676J653467f86290d4435C026229D86274O04988D16945J185232
$$ 438718 854040 1277716 2931183 -686290 -44435 3026229 486274 1091262 416945 1602177
5333A602177h73962A229026k2165J726467C69923J768782K03635A162283Q75129
$$ 1602177 -873962 1229026 1206861 2933328 369923 2138705 2342340 1162283 2037412
5324B037412E97836J55967B97304a80917A955021g57818A27476K06519a079969
$$ 2037412 597836 753803 297304 -180917 1955021 -757818 127476 333995 -1079969
5314A832202f51979a77871j666733F77623A85926c85129I91727A4070L243813
$$ 1832202 -651979 -177871 -1844604 677623 185926 -385129 991727 14070 3257883
5305C257883j109755H16458e03468H6810Q37070k35225J72098a496408g5190k34105
$$ 3257883 2148128 816458 -503468 86810 923880 688655 860753 -1496408 -75190 -309295
5295c09295i7024B357391h20427l75754L50795j31141H03760a415993D86026I2858
$$ -309295 -97024 2357391 -820427 -1196181 -845386 -976527 803760 -1415993 486026 92858
5284e7395B33916J253220a59391A782430h19823A366713n81752J394868a147075
$$ -57395 233916 1487136 -159391 1782430 -819823 1366713 784961 2179829 -1147075
5274c76766o66151g2416j430516c07966r45277p19879C14629a118099E02886a34539
$$ -376766 -1042917 -72416 -1502932 -307966 -1253243 -1973122 314629 -1118099 502886 -134539
5263a99103A23112L83566a13260j132252O09981K71982A232748A27147M39093
$$ -199103 123112 506678 -113260 -1245512 -635531 -363549 1232748 127147 566240
5254E66240K093305i4392A23096g83691A490520n87879a393076A52749g23642
$$ 566240 2659545 -94392 123096 -783691 1490520 902641 -1393076 152749 -723642
5244A4652J62636J696813o69131a077761c16281r75839A26782a722482F95903
$$ 14652 177288 1874101 1204970 -1077761 -316281 -1292120 126782 -1722482 695903
5234H57249J248096B17713m2609a235086I16679k29007a77524A433282n78091
$$ 857249 2105345 217713 175104 -1235086 916679 687672 -177524 1433282 855191
5225H55191j94682b13895j406662j323323A799189A42406m2069Q7001K69227J684891
$$ 855191 660509 -213895 -1620557 -2943880 1799189 142406 100337 187338 456565 2141456
5215B141456A027597N57652Q5610b08999F71515c59879k33982A685914N94039
$$ 2141456 1027597 1585249 1670859 -208999 671515 -359879 -593861 1685914 2279953
5206B279953d70116J81371E92532A35538c11917j173751I61030C04467J477521
$$ 2279953 -470116 -288745 592532 135538 -311917 -1485668 961030 304467 1781988
5197A781988H80785O23696a507588G12921Q12157J7815N98240q6205G26586h21445
$$ 1781988 880785 1504481 -1507588 712921 1525078 1542893 2141133 2054928 726586 -821445
5186E41263L59986O66895M27889r66979B84939J893633J1351a239681B630622
$$ 541263 901249 1568144 1996033 1029054 284939 2178572 2189923 -1239681 2630622
5176C161117I77610R5825J207725e15940A086637K138933I41259J687228A258968
$$ 3161117 977610 1073435 2281160 -515940 1086637 3225570 941259 2628487 1258968
5166B873806k48457o52719G23906J909362q36658a36677C459979H97042b44554
$$ 2873806 2625349 1972630 723906 2633268 1796610 -136677 3459979 897042 -244554
5156D44807P54728Q9287k28311p578j44201j39819B94716j24539J061274k930
$$ 444807 1199535 1288822 1060511 1052933 908732 768913 294716 170177 1231451 1228521
5146A228521N88442C88768K603662p44052N17730I27996J85546P83306B570J442167
$$ 1228521 1816963 388768 2992430 2248378 2766108 927996 1113542 1896848 2570 1444737
5136A444737E40989A66545a178589C27014e15019I98552b28338l78634I15610
$$ 1444737 540989 166545 -1178589 327014 -515019 998552 -228338 -606972 915610
5126C33122N50452C39981j40023K57693a053978F14138a394617F08167B51723
$$ 333122 883574 339981 199958 457651 -1053978 614138 -1394617 608167 251723
5116e4871K5340j133147n89285J11039I46409a006054B11356b34714j627917c29697
$$ -54871 -29531 -1162678 -1751963 -1640924 946409 -1006054 211356 -234714 -1862631 -329697
5105i38091r53879A509023a340122f61626j10760F43125B33376K44030A62330
$$ -938091 -1891970 1509023 -1340122 -661626 -772386 643125 233376 477406 162330
5095e16282K2655a79104r35569k71168D95955b17006C10705r8353d38354B139132
$$ -516282 -493627 -179104 -1114673 -1385841 495955 -217006 310705 212352 -438354 2139132
5084a2552C83913e01094B85724j1436J523872d01203a04891j471938D35992a079715
$$ -12552 383913 -501094 285724 274288 1798160 -401203 -104891 -1576829 435992 -1079715
5073a972879C78977a864752I1079K14720J024379K62027m03710K20377F07630
$$ -1972879 378977 -1864752 91079 305799 1330178 1592205 1188495 1408872 607630
5063b579950a157156A298710a499723B278757j100434f11768n46469F73505J142628
$$ -2579950 -1157156 1298710 -1499723 2278757 1178323 -611768 -1158237 673505 1816133
5054A816133m84329h59816B92537L5836J640092a072400I94097D83366a538967
$$ 1816133 1331804 -859816 292537 328373 1968465 -1072400 994097 483366 -1538967
5044f15100b468E09973J524636g36380A056075M41321g7807K7814q30976J48656
$$ -615100 -2468 509973 2034609 -736380 1056075 1497396 -77807 -49993 -880969 -732313
5034g32313B370977J30038a180648F83904L54904d55033J11473I04973m146J552144
$$ -732313 2370977 2501015 -1180648 683904 1038808 -455033 -343560 904973 900827 2452971
5024B452971E90977h53721B120231e38441K2818D49629g94847F86060R28751F6092
$$ 2452971 590977 -853721 2120231 -538441 -515623 449629 -794847 686060 1614811 66092
5013a175643D11059A18393J29378a404384b35878F66253L16027h15699C133297
$$ -1175643 411059 118393 247771 -1404384 -235878 666253 982280 -815699 3133297
5003e12466A780830i05573a14709A513188n32895Q82889h69040A019070C02639
$$ -512466 1780830 -905573 -114709 1513188 980293 1863182 -869040 1019070 302639
4993F96166B06987a212891A77853L720580F50022a122183A10885b658477F59595
$$ 696166 206987 -1212891 177853 3898433 650022 -1122183 110885 -2658477 659595
4983A930081n33863a368436g0898A570408a496289O97008E90376f24579A561254
$$ 1930081 1396218 -1368436 -70898 1570408 -1496289 -799281 590376 -624579 1561254
4973a35464A316480a276374A011181c310704i85834j576826A048901A4512J649293
$$ -135464 1316480 -1276374 1011181 -3310704 -985834 -2562660 1048901 14512 1663805
4964A663805j46529C66199J346108d64168P8338D09843f99419I76561L85724k00738
$$ 1663805 1517276 366199 1712307 -464168 -385830 409843 -699419 976561 1362285 1161547
4954A161547g7091F63119J131566a083865G95350j71855O49620b61169A101632
$$ 1161547 -77091 663119 1794685 -1083865 795350 623495 1273115 -261169 1101632
4944f30671A313930J65543p34637d56545F41166A81822N79092L23844h3478r48735
$$ -630671 1313930 1479473 744836 -456545 641166 181822 760914 1084758 -83478 -1032213
4934a032213I56259Q7677d2344H02080K86621J92143A9394g69755r72731e0900
$$ -1032213 956259 1043936 -42344 802080 1088701 1280844 19394 -769755 -1742486 -50900
4923A58935K055900C0695N58013O22655j10709J119893H45051M47400m65696D05767
$$ 158935 2214835 30695 588708 1211363 1100654 2220547 845051 1292451 826755 405767
4912C120345J511707p35230j150950L718581r30723k439268J461102A780471J119896
$$ 3120345 4632052 3896822 2745872 6464453 5533730 3094462 4555564 1780471 2900367
4903B900367G42543e41035B181791r60712n31573Q47820d10719B369270a724417
$$ 2900367 742543 -541035 2181791 1221079 689506 1537326 -410719 2369270 -1724417
4893e16596K07392I6706J099509n02739F5454e52276A369158E38843d16043p88849
$$ -516596 -309204 96706 1196215 693476 65454 -552276 1369158 538843 -416043 -1204892
4883a204892A066896d5915E16112a315195E41611A61981J200311D61501l6713
$$ -1204892 1066896 -45915 516112 -1315195 541611 161981 1362292 461501 424788
4874D24788O15166m12766d14568J72831C22987P84418a226288e8047p02583o54544
$$ 424788 1039954 627188 -414568 -241737 322987 1107405 -1226288 -58047 -760630 -1415174
4864a415174B214480G67051A3604i33738C8363i10905I57985c25432j948645a89887
$$ -1415174 2214480 767051 13604 -933738 38363 -910905 957985 -325432 -2274077 -189887
4853B86795N86744a975649M26057o8443G21560f22400j84350A92014a104844H94682
$$ 286795 873539 -1975649 -1549592 -1618035 721560 -622400 -806750 192014 -1104844 894682
4842g98312A23499a404590B341583f38643J78262j68611C49022j29025b53596
$$ -798312 123499 -1404590 2341583 -638643 -460381 -628992 349022 219997 -253596
4832D80706f33684B25011h91800a62670A81647Q25373i67257D18170R05309J26631
$$ 480706 -633684 225011 -891800 -162670 181647 1007020 -967257 418170 1323479 1450110
4822A450110b81004a14908F08836c81973A177809E35204a738413f35004A587491
$$ 1450110 -281004 -114908 608836 -381973 1177809 535204 -1738413 -635004 1587491
4812A047569a155719B470953A17216g6612F89453J085323j47428l49607g65292
$$ 1047569 -1155719 2470953 117216 -76612 689453 1774776 1627348 1277741 -765292
4802I9231a296727A710216L10359q82434j82900C57827J344835l02490F14060
$$ 99231 -1296727 1710216 2020575 1138141 955241 357827 1702662 1400172 614060
4792a62825A588647O30604a103021A05797J311676m97872A36569M75243B55081
$$ -162825 1588647 2219251 -1103021 105797 1417473 919601 136569 611812 255081
4782G18916K415651r88380m51346a973385A299219l32807J33726J499401B72841
$$ 718916 3134567 2146187 1694841 -1973385 1299219 966412 1100138 2599539 272841
4772G49076j95681h12981K33108A816923o20900L039505j418958A394742A4341
$$ 749076 553395 -812981 -579873 1816923 1196023 4235528 2816570 1394742 14341
4762a18315C562068A301280K59831j85824N7065a536538B125177C01686R43512
$$ -118315 3562068 1301280 1561111 1375287 1432352 -1536538 2125177 301686 1245198
4753A245198k80085Q90022m54962Q2449Q5601h52417A396074C82987a5520A568066
$$ 1245198 965113 1855135 1400173 1482622 1568223 -852417 1396074 382987 -15520 1568066
4742b908949A338394B96629P18339a278823B74770J36936K629821d17255A536482
$$ -2908949 1338394 296629 1014968 -1278823 274770 411706 3041527 -417255 1536482
4732A349630b01049B9898J844011n69143n78575L00573M79679M96623o67973P18815
$$ 1349630 -201049 29898 1873909 1304766 726191 1026764 1506443 2003066 1335093 2053908
4722B053908p07175A66522B7376L59355a373597I32073j24537J208235G67583
$$ 2053908 1346733 166522 27376 386731 -1373597 932073 807536 2015771 767583
4712C043446b4893j038324B323404i5877j061549c28049A088863A55778K174218
$$ 3043446 -24893 -1063217 2323404 -95877 -1157426 -328049 1088863 155778 2329996
4703B329996D18493a83917B669030a605543b1070F93497N04382C99449b9247j500330
$$ 2329996 418493 -183917 2669030 -1605543 -21070 693497 1197879 399449 -29247 -1529577
4693a529577a64908E6103J510185g79867E70723M48955h30901a40858G7084J494180
$$ -1529577 -164908 56103 1566288 -779867 570723 1019678 -830901 -140858 77084 1571264
4683A571264R41508A156042j50448B77866K352557j279442j58990A25051J271445
$$ 1571264 2512772 1156042 1005594 277866 2630423 1350981 1191991 125051 1396496
4674A396496l5137P73904J632320j152832K284787k397177M972324j894207K298226
$$ 1396496 1361359 2135263 3767583 2614751 4899538 2502361 7474685 5580478 7878704
4665G878704k635073L030433j541930j227738k9297J143328k613229k11690q29661
$$ 7878704 5243631 8274064 6732134 5504396 5475099 6618427 4005198 3793508 2963847
4656B963847O78065j33899A198484K143976j000636G04516L38146J74396m97903
$$ 2963847 3641912 3508013 1198484 3342460 2341824 704516 1042662 1217058 719155
4647G19155J308085G60066P8463i64170P4546L81341B422083G48748l21142K46692
$$ 719155 2027240 760066 838529 -964170 -889624 -508283 2422083 748748 427606 674298
4637F74298a34465C61025P58229a791952P28746E20075J21888J85850J88576a346033
$$ 674298 -134465 361025 1119254 -1791952 -1063206 520075 641963 827813 1016389 -1346033
4626F57241A69247M73786P80332j17550m28806A68745R2794J251863o40812A41230
$$ 657241 169247 643033 1423365 1305815 877009 168745 261539 1513402 872590 141230
4615A502129c82841j14464m92662I15305L92953a070996a67097A515476g74731
$$ 1502129 -382841 -497305 -989967 915305 1308258 -1070996 -167097 1515476 -774731
4605C17314K292247D47096J269212b00702D142811B036623m84957R18294G76225
$$ 317314 2609561 447096 1716308 -200702 4142811 2036623 1551666 2469960 776225
4595a64109D95506K979104j453279m24349b06054B97409P14561N2021a70420A393036
$$ -164109 495506 3474610 2021331 1596982 -206054 297409 1011970 1063991 -170420 1393036
4584a61119A88759L08049K064567D65386g61150J52706A675256p5356G26818R49738
$$ -161119 188759 496808 2561375 465386 -761150 -608444 1675256 1599900 726818 1676556
4574A676556N46286j96811c25693A624311N22305l85833J87985R48283r9869l28685
$$ 1676556 2222842 2026031 -325693 1624311 2146616 1760783 1948768 2897051 2797182 2468497
4564B468497n71208D60780d40795B292504F65275k80154e93736B062125D85423
$$ 2468497 1897289 460780 -440795 2292504 665275 385121 -593736 2062125 485423
4554B71150a45465E03889a701659H87004b191289A328086L66750P63015B6846
$$ 271150 -145465 503889 -1701659 887004 -2191289 1328086 1694836 2457851 26846
4544b549384A712937K64675H7124J984665G75546A11657h45197J81531B270992
$$ -2549384 1712937 1977612 87124 2071789 775546 111657 -845197 -663666 2270992
4534I95245B4152f20286H55977d96942k92921A5854e6904K6011H68171m17090
$$ 995245 24152 -620286 855977 -496942 -789863 15854 -56904 -30893 868171 451081
4524D51081K65313L121187f65523A651017n4112M19753j80794k26596h76955A069963
$$ 451081 716394 3837581 -665523 1651017 1596905 2016658 1835864 1609268 -876955 1069963
4513A175892J260475q74906C11313K610218O71023F71571c90802A731175J751316
$$ 1175892 2436367 1561461 311313 2921531 3592554 671571 -390802 1731175 3482491
4504C482491q05700A90244J408094j952o34670N70803J132883d25511n37249a97748
$$ 3482491 2676791 190244 1598338 1596386 961716 1532519 2665402 -425511 -962760 -197748
4493B158682n97120m7321b66332B112973J433701j626276m17927F67279J424518
$$ 2158682 1561562 1514241 -266332 2112973 3546674 1920398 1502471 667279 2091797
4484B091797b3002B356917q94858J680378r69968L75738o38851J26887p95000
$$ 2091797 -23002 2356917 1462059 3142437 2172469 2548207 1909356 2036243 1241243
4475A241243J042517J3034q48744P10531H71461K196736o325C87551e7978D41571
$$ 1241243 2283760 2296794 1448050 2158581 871461 3068197 3061872 387551 -57978 441571
4464B804197j40166A256863J532275D36433J21784R29837N48763R28521A301069
$$ 2804197 2664031 1256863 2789138 436433 558217 1488054 2036817 2965338 1301069
4454F47358L42677K887145F94458L46210K30149R8752K69230H11462Q78554p63734
$$ 647358 990035 3877180 694458 1040668 1270817 1369569 1638799 811462 1690016 926282
4444I26282O9648L023364j981243r68192J655743A138319L72821o14059d85707
$$ 926282 995930 4019294 2038051 1069859 2725602 1138319 1511140 897081 -485707
4434f2859k27807q50828a75864G71424J563860a58082A480607P81218k07244C84440
$$ -62859 -290666 -1141494 -175864 771424 2335284 -158082 1480607 2261825 2054581 384440
4423B34696Q24027c67817B477678j046770J194505R08428j463827p88048J963881
$$ 234696 1058723 -367817 2477678 1430908 2625413 3533841 2070014 1281966 3245847
4414C245847i55114B779152F79471K159604j96490j069814P34506K31993K905661
$$ 3245847 -955114 2779152 679471 2839075 2642585 1572771 2307277 2539270 5444931
4405E444931k274460J473588A849081J02156J688806j137756N92268l80385K774856
$$ 5444931 3170471 4644059 1849081 1951237 3640043 2502287 3094555 2714170 5489026
4396E489026j424177j184361m57253I97192J484720A173699L0170P79098j48957
$$ 5489026 4064849 2880488 2423235 997192 2481912 1173699 1203869 1982967 1834010
4387A834010p58103C50407K242133a1724C763646A009734K227281A527527Q4224
$$ 1834010 1075907 350407 2592540 -11724 3763646 1009734 3237015 1527527 1611751
4378A611751l77166K185781c24296B465602K079519B248053J717075A598279K902747
$$ 1611751 1234585 3420366 -324296 2465602 4545121 2248053 3965128 1598279 4501026
4369D501026O11584A570281L057378j850511m71017J915085j278618K68587J155629
$$ 4501026 5112610 1570281 4627659 2777148 2306131 4221216 2942598 3211185 4366814
4360D366814j615426L73856o42157o78486J715566P91349j257166p64130J023313
$$ 4366814 2751388 3125244 2483087 1804601 3520167 4311516 3054350 2290220 3313533
4351C313533P02828j168801A023277k22400J930081j029038J86153n7060K601286
$$ 3313533 4016361 2847560 1023277 800877 2730958 1701920 1888073 1831013 4432299
4342D432299A341028j12095K959268A795224H43075j26880d43881r26643C63571
$$ 4432299 1341028 1228933 4188201 1795224 843075 716195 -443881 -1370524 363571
4332B828723o76021H68144P01858n08117J132933J46426a005106B212183a41976
$$ 2828723 2152702 868144 1570002 1061885 2194818 2341244 -1005106 2212183 -141976
4322A161751M50658R93429L54570o26496b14862I12158i75909I19432B29909J253778
$$ 1161751 1612409 2605838 2960408 2333912 -214862 912158 -975909 919432 229909 1483687
4312A483687C01503K092898J49329A270497B87554K650439C51470K84435J153542
$$ 1483687 301503 2394401 2543730 1270497 287554 2937993 351470 635905 1789447
4303A789447N21668q86763K160094A424930l98189J826970r50423j68912G19902
$$ 1789447 2311115 1424352 3584446 1424930 1026741 2853711 1903288 1734376 719902
4293B385728j22286N6530o32451j63825E24120O68892K04607R91617O10044p42072
$$ 2385728 2263442 2319972 1687521 1523696 524120 1193012 1397619 2389236 2999280 2257208
4283B257208L161581b51955B283674l15409r60295J694257d16015A955934K664432
$$ 2257208 5418789 -251955 2283674 1968265 1007970 2702227 -416015 1955934 4620366
4274D620366j849564J824183j589271j35083J129714o42705R58062J9182k12291
$$ 4620366 2770802 4594985 3005714 2870631 4000345 3357640 4315702 4334884 4122593
4265D122593l33207r62894L5234J644768Q43362k195869j18594J411869K14530
$$ 4122593 3789386 2826492 2861726 4506494 5349856 3153987 3035393 4447262 4661792
4256D661792k108461l46429I16927K682033j540542J192244A218125d501A678831
$$ 4661792 2553331 2206902 916927 3598960 2058418 3250662 1218125 -4501 1678831
4246A973401M57506R62375j523021l33473N66632R8697Q2186p33433J583623j140312
$$ 1973401 2430907 3393282 1870261 1536788 2103420 2202117 2284303 1550870 3134493 1994181
4236A994181n91171m43281K055979A385858J043468f14308B094322n10064p64073
$$ 1994181 1403010 959729 3015708 1385858 2429326 -614308 2094322 1584258 820185
4227H20185C36780E6726J719933p57269L267616B095382p57466c57742H04870
$$ 820185 336780 56726 1776659 1019390 4287006 2095382 1337916 -357742 804870
4217C113931j50309M51743F38469K11363J257139K773935B237254K897861k566512
$$ 3113931 2963622 3415365 638469 849832 2106971 4880906 2237254 5135115 2568603
4208B568603J404555M49015k100094l84670J491383J232034j082992J154375j075757
$$ 2568603 3973158 4422173 2322079 1937409 3428792 4660826 3577834 4732209 3656452
4199C656452L02089j686181N98708M40815J576134n90281J69931A683747Q85607
$$ 3656452 3958541 2272360 2871068 3311883 4888017 4297736 4467667 1683747 2569354
4190B569354L01928j40055L87879r77903G16431J411067Q99333N44336j552134
$$ 2569354 2871282 2731227 3119106 2141203 716431 2127498 3026831 3571167 2019033
4181B019033l37704O95092M7093m33937P59161J602020j109707m11896n1089K18502
$$ 2019033 1681329 2376421 2423514 1989577 2748738 4350758 3241051 2829155 2778066 2996568
4171B996568J225532A402401J327839K277460A123737K412735j148238R31599
$$ 2996568 4222100 1402401 2730240 5007700 1123737 3536472 2388234 3319833
4163C319833j201249J046148m24196N37572l5465R39606A408567K308679j360492
$$ 3319833 2118584 3164732 2740536 3278108 3242643 4182249 1408567 3717246 2356754
4154B356754J86219J911353r52617o8298J274657j228840J509491l24971M93918
$$ 2356754 2542973 4454326 3501709 3433411 4708068 3479228 4988719 4663748 5157666
4145E157666p45901M4323o04530j404960J007149F06622B64029K090900J079602
$$ 5157666 4411765 4456088 3851558 2446598 3453747 606622 264029 2354929 3434531
4136C434531A237871M83019J157077l62386q84941P47873K11526A210150J508914
$$ 3434531 1237871 1720890 2877967 2515581 1630640 2378513 2590039 1210150 2719064
4127B719064j268197J315239j003664J740409M7287m76033n33912j026346Q91008
$$ 2719064 1450867 2766106 1762442 3502851 3550138 3074105 2540193 1513847 2404855
4118B404855j162379K490535Q86583A751472o3208k09564N29272O43863j202713
$$ 2404855 1242476 3733011 4619594 1751472 1688264 1478700 2007972 2651835 1449122
4109A449122O12231E72512q4945L654829m53040A319705J181278j048263J516028
$$ 1449122 2061353 572512 487567 4142396 3689356 1319705 2500983 1452720 2968748
4100B968748j26131J290661j284275j052809M212320k286836j111257p30334Q94634
$$ 2968748 2842617 4133278 2849003 1796194 6008514 3721678 2610421 1880087 2774721
4091B774721j44097r47702K41618K60619m24398p71692J782736A221396N04630
$$ 2774721 2630624 1682922 1924540 2185159 1760761 989069 2771805 1221396 1726026
4082A726026A80729L255073A241355N11632M67998L95682p70346K07868r27265
$$ 1726026 180729 3435802 1241355 1752987 2220985 2616667 1846321 2054189 1126924
4073A126924r5918K608868j303973o14476M76937o14972N36058c62270I99369
$$ 1126924 1031006 3639874 2335901 1721425 2198362 1583390 2119448 -362270 999369
4063A587469b34096A325933c22521A388946J59881L5230P90317H34437K16666
$$ 1587469 -234096 1325933 -322521 1388946 1548827 1584057 2374374 834437 1051103
4054A051103i67501D416500j504080B82571J812853l23108N8620l01201J802283
$$ 1051103 -967501 4416500 2912420 282571 2095424 1772316 1830936 1529735 3332018
4045C332018j484623J099787l44604L20281E32553L15055J421480B99621O17948
$$ 3332018 1847395 2947182 2602578 2922859 532553 847608 2269088 299621 917569
4036I17569M13404J06383l15027K34082K86290L33570l97030C65810J058596k18196
$$ 917569 1330973 1437356 1122329 1356411 1642701 1976271 1579241 365810 1424406 1206210
4026A206210n27063N48607Q96979j041255J667189n68171J054684q42499a15286
$$ 1206210 679147 1227754 2124733 1083478 2750667 2182496 3237180 2394681 -115286
4016C528679C06980J442956C09649J126778A61079J013983m65073L13418h13160
$$ 3528679 306980 1749936 309649 1436427 161079 1175062 709989 1023407 -813160
4006C20357J254821p12448l80785J586659o52258j62463j72772K068487j237660
$$ 320357 1575178 862730 481945 2068604 1416346 1253883 1081111 3149598 1911938
3997A911938H46927j16000l05857J690007E31904K070054E55853J070446k89026
$$ 1911938 846927 730927 425070 2115077 531904 2601958 555853 1626299 1337273
3988A337273b88738A481082N39419o478A94912L613711j794122A38391P71741
$$ 1337273 -288738 1481082 2020501 2014023 194912 3808623 2014501 138391 910132
3979I10132L43401O00431c96460B232305L08425J165846A851617E98829L735230
$$ 910132 1253533 1853964 -396460 2232305 2540730 3706576 1851617 598829 4334059
3970D334059q5203A883661J780310j74544J13502p20562j062772J846893A731714
$$ 4334059 4248856 1883661 3663971 3489427 3602929 2882367 1819595 3666488 1731714
3960B556130N90496r26278J512767j007375J12601J870632k05827m48298Q9572
$$ 2556130 3146626 2220348 3733115 2725740 2838341 4708973 4503146 4054848 4144420
3951D144420j461153J849011A609666J20946L16695m31445L577952j715861J99922
$$ 4144420 2683267 4532278 1609666 1730612 2047307 1615862 5193814 3477953 3677875
3942C677875K593482C002209L26698K446644r10777B360609L916665j794936O12463
$$ 3677875 6271357 3002209 3328907 5775551 4864774 2360609 6277274 4482338 5094801
3933E094801p5010J195830r09695j77013K354946J714196l627954J268645P4303
$$ 5094801 5019791 6215621 5305926 5128913 7483859 9198055 5570101 6838746 6913049
3924F913049J389361l017664J937066K610050o49381r85645j839651J585220J116183
$$ 6913049 8302410 5284746 7221812 9831862 9182481 8196836 6357185 7942405 9058588
3915I058588k365355J406842j447841L7049j911188P32153q49320j446627K30742
$$ 9058588 6693233 8100075 6652234 6689283 4778095 5510248 4660928 3214301 3445043
3906C445043l47291Q99108O30453A302652K258880A709113J977440m41513j34038
$$ 3445043 3097752 3996860 4627313 1302652 3561532 1709113 3686553 3245040 3111002
3897C111002P1488N5007M99162r4587K73473J446600j745390Q98961n11096q48819
$$ 3111002 3182490 3237497 3736659 3642072 3915545 5362145 3616755 4515716 4004620 3155801
3887C155801K052629k102698r28790J444564L37613j289225A046075L348658j917887
$$ 3155801 5208430 3105732 2176942 3621506 3959119 2669894 1046075 4394733 2476846
3878B476846N07527K64182J103309B014902N45626Q40763n10911A383356N07255
$$ 2476846 2984373 3248555 4351864 2014902 2560528 3401291 2890380 1383356 1890611
3869A890611K11634o39674J029796R02575A662736o64528L773999k84465o89459
$$ 1890611 2102245 1462571 2492367 3394942 1662736 998208 4772207 4487742 3798283
3860C798283j672361K226060l29150r62036R57943r67861Q93373R14566O82229
$$ 3798283 2125922 4351982 4022832 3060796 4018739 3050878 3944251 4858817 5541046
3851E541046k205132K545784j201856l03657N07514J581296B257605J528106j499289
$$ 5541046 3335914 5881698 4679842 4376185 4883699 6464995 2257605 3785711 2286422
3842B286422J892022O46402n47224N485J112948j062020o75759J15686J120878
$$ 2286422 4178444 4824846 4277622 4283107 5396055 4334035 3658276 3773962 4894840
3833D894840R34250n23272k602865L18888l64574r05855K04027L02869D53050
$$ 4894840 5829090 5305818 2702953 3021841 2657267 1751412 1955439 2258308 453050
3823B423995p75030O6867q37740a650674e62746B167252a68206O5686A54274K164759
$$ 2423995 1648965 1715832 878092 -1650674 -562746 2167252 -168206 -102520 154274 2319033
3813B319033m91565o7012D81603J628501F58703P9006N1861J396909J021102j333134
$$ 2319033 1827468 1760456 481603 2110104 658703 737709 789570 2186479 3207581 1874447
3803A874447c40951A998436I12342C4697J84761L26391R2775L31299Q45946o06610
$$ 1874447 -340951 1998436 912342 34697 219458 545849 638624 969923 1815869 1209259
3793A209259K78355B68315c81214B154201q70642F1540d50729B31074J333738
$$ 1209259 1487614 268315 -381214 2154201 1283559 61540 -450729 231074 1564812
3784A564812a35069A121124E56077J400812H43782O0570J245524I06694J066974
$$ 1564812 -135069 1121124 556077 1956889 843782 904352 2149876 906694 1973668
3775A973668q51746a07940A580648M60250O64667j343410a024591D23595N01521
$$ 1973668 1121922 -107940 1580648 2040898 2705565 1362155 -1024591 423595 925116
3766I25116K798401j014561j101791c62954C776821j228790B39155d90437C838970
$$ 925116 3723517 2708956 1607165 -362954 3776821 2548031 239155 -490437 3838970
3756A755073B53029K156082P6030N58955N37203A308567Q14258Q30806R44649
$$ 1755073 253029 2409111 2485141 3044096 3581299 1308567 2122825 2953631 3898280
3747C898280k54053j461664K119991k75911P64559M56786j859665J430310j374980
$$ 3898280 3644227 2182563 4302554 4026643 4791202 5247988 3388323 4818633 3443653
3738C443653J279465j683946R06192G73088L663753j237991J21031L84888K52930
$$ 3443653 4723118 3039172 3945364 773088 4436841 3198850 3319881 3704769 3957699
3729C957699r95662K70469J008247R95885n57190q33320J478508m99395M42837
$$ 3957699 2962037 3232506 4240753 5236638 4679448 3846128 5324636 4825241 5268078
3720E268078M37867m22542N59112K59692m94534J268386J565512j236565J55414
$$ 5268078 5705945 5283403 5842515 6102207 5607673 6876059 8441571 7205006 7360420
3711G360420Q40042l3888j28174m11213q1074J616058j659634Q47429K147706
$$ 7360420 8200462 8166574 8038400 7627187 7546113 9162171 7502537 8349966 10497672
3702A0497672j071653L40343l40317Q93502p68733J527354L13934r8102K033660
$$ 10497672 9426019 9766362 9426045 10319547 9550814 11078168 11392102 11294000 13327660
3693A3327660m56542K459193k237418K317229p61783k80695L551414K87577R90233
$$ 13327660 12871118 15330311 13092893 15410122 14648339 14367644 17919058 18206635 19196868
3684A9196868j3572k28629K576829K78412K737254J271876j999920K107040J988644
$$ 19196868 19183296 18954667 21531496 21809908 24547162 25819038 23819118 25926158 27914802
3675B7914802K434625K272544J806835M047475R21804O532588P39516K899335
$$ 27914802 30349427 32621971 34428806 38476281 39398085 45930673 46670189 49569524
3667D9569524J414368k322835j614072k754364n121012n854680m032221n534198
$$ 49569524 50983892 48661057 47046985 44292621 39171609 33316929 29284708 23750510
3659B3750510o340596l232944j492796l403452J090864o74185j511583p89107
$$ 23750510 17409914 14176970 12684174 9280722 10371586 9697401 8185818 7396711
3651G396711r28168o32279O77651j391130R16747q71836n57165L78583J09932
$$ 7396711 6468543 5836264 6513915 5122785 6039532 5167696 4610531 4989114 5099046
3642E099046P73189n91573j279520K061829m38812B259442Q77518R02294J060831
$$ 5099046 5872235 5280662 4001142 6062971 5624159 2259442 3136960 4039254 5100085
3633E100085j213649q39646J397794j074740J93096j47770o6810P6672j258970
$$ 5100085 3886436 3046790 4444584 3369844 3562940 3415170 3348360 3425032 2166062
3624B166062M49418J099423J917020A949481o2764J294534j250584J069603K97979
$$ 2166062 2615480 3714903 5631923 1949481 1886717 3181251 1930667 3000270 3298249
3615C298249n37371J124401n41586q7292J340257A61001K970713R34192o81878
$$ 3298249 2760878 3885279 3343693 3256401 4596658 161001 3131714 4065906 3384028
3606C384028k71797m216n32J132585j514827n71569l41854p89011J266179A035754
$$ 3384028 3112231 3108015 3107483 4240068 2725241 2153672 1811818 1022807 2288986 1035754
3595D501131j102288L68500j152845P20769m48255A335502J583099N67981L86126
$$ 4501131 3398843 3767343 2614498 3335267 2887012 1335502 2918601 3486582 3872708
3586C872708j028972A391338K431106p13682k58708J997191j547536l63131p34237
$$ 3872708 2843736 1391338 3822444 3108762 2850054 4847245 3299709 2936578 2202341
3577B202341p968J232576K85678N51561J344246j863373R56499q18394o48411
$$ 2202341 2194373 3426949 3712627 4264188 5608434 3745061 4701560 3883166 3234755
3568C234755G27831P4783L104762A799139k81677n5370J172687M61739A373594
$$ 3234755 727831 802614 3907376 1799139 1517462 1462092 2634779 3096518 1373594
3558A963507L39498l68911L33139q58909m52763J960109F48475K432581j229535
$$ 1963507 2303005 1934094 2267233 1408324 955561 2915670 648475 3081056 1851521
3549A851521g41083B711942a56588C221775D31175O40832j6341P23819J050014
$$ 1851521 -741083 2711942 -156588 3221775 431175 1072007 1055666 1779485 2829499
3540B829499j39095k02927I90934O81870K80256J385946j436008j52968p52238
$$ 2829499 2690404 2487477 990934 1672804 1953060 3339006 1902998 1750030 997792
3531I97792J377821l7562F23685K136023m02109A060793A80086K037335r04513
$$ 997792 2375613 2338051 623685 2759708 2357599 1060793 180086 2217421 1312908
3522A312908J277599I14307J941089n2615j314248m20975J927557j366790J079832
$$ 1312908 2590507 914307 2855396 2802781 1488533 1067558 2995115 1628325 2708157
3513B708157p91013K519524j612966j410848Q46326b55732C069748o85377K400062
$$ 2708157 1917144 4436668 2823702 1412854 2259180 -255732 3069748 2384371 4784433
3504D784433k055307J520095O94135K8753j559329J644802m21682j108353j19945
$$ 4784433 2729126 4249221 4943356 4972109 3412780 5057582 4635900 3527547 3407602
3495C407602L237836k085032k38566n90836J919685o52311o01018J69386M0335
$$ 3407602 6645438 4560406 4321840 3731004 5650689 4998378 4397360 4566746 4607081
3486D607081J91791B182619L407328p37757l42500L65581K76761R00790j869407
$$ 4607081 4798872 2182619 5589947 4852190 4509690 4875271 5152032 6052822 4183415
3477D183415Q32533Q7301m81961j155594K338391J188680C253757K397029J001574
$$ 4183415 5015948 5103249 4621288 3465694 5804085 6992765 3253757 5650786 6652360
3468F652360j519784J823185j22875P36743q15809N62693M2265L226573j486403
$$ 6652360 5132576 6955761 6832886 7569629 6753820 7316513 7358778 10585351 9098948
3459I098948K343924K06508P95479o9314J393260j919565R74249J682042l39518
$$ 9098948 11442872 11649380 12444859 12375545 13768805 11849240 12823489 14505531 14166013
3450A4166013q06176M7260L674641J01434j923767L631478l42267K299154m1924
$$ 14166013 13359837 13407097 17081738 17183172 15259405 18890883 18548616 20847770 20805846
3441B0805846J299888K393040J323431Q81060K780716J172721J156823L984720
$$ 20805846 22105734 24498774 25822205 26703265 29483981 30656702 31813525 35798245
3433C5798245L394992K249256R25612L669944L638560P589283M125892M923524
$$ 35798245 39193237 41442493 42368105 46038049 49676609 57265892 61391784 66315308
3425F6315308L309064N701296j175457L818296m744496Q72217j082313p385551
$$ 66315308 69624372 75325668 74150211 77968507 73224011 74096228 73013915 65628364
3417F5628364n670508p937556m418075n859348n151752m476410k994596k976634
$$ 65628364 59957856 52020300 47602225 41742877 36591125 32114715 29120119 26143485
3409B6143485j603251k539566j159416j80966o49056k926209P44497j17062k408565
$$ 26143485 24540234 22000668 20841252 20660286 20011230 17085021 17829518 17712456 15303891
3400A5303891O23080q94743L30096j158317P62456P94956n43111Q3109k208818
$$ 15303891 15926971 15032228 15362324 14204007 14966463 15761419 15218308 15301417 13092599
3391A3092599m12997o00486l177402M362J630734P884k759475J053996j124089
$$ 13092599 12679602 12079116 8901714 8906076 10536810 10544694 7785219 8839215 7715126
3382G715126j1514K78746L22023j77932k485194j135025L796658j058846j638017
$$ 7715126 7703612 7982358 8304381 8126449 5641255 4506230 8302888 7244042 5606025
3373E606025k423480L688122k51021L73498k605321J290953J66241j119690J198651
$$ 5606025 3182545 6870667 6619646 6993144 4387823 5678776 5845017 4725327 5923978
3364E923978J254625n39839l85785J557344r20236l386840K125262R12053p05133
$$ 5923978 7178603 6638764 6252979 7810323 6890087 3503247 5628509 6540562 5835429
3355E835429m90129B206656L017937P03910j731630J193146k45381k180034J095196
$$ 5835429 5345300 2206656 5224593 5928503 4196873 5390019 5144638 2964604 4059800
3346D059800J089589j340496L71156J246550j195799o64089J378911P83710K9432
$$ 4059800 5149389 3808893 4180049 5426599 4230800 3566711 4945622 5729332 5758764
3337E758764j200291R21622R59108L91029p10143k386817J723731K17008J747813
$$ 5758764 4558473 5480095 6439203 6830232 6120089 3733272 5457003 5674011 7421824
3328G421824k689296r52470K625716o4814m59043j923878P86903J284422j188223
$$ 7421824 4732528 3780058 6405774 6340960 5881917 3958039 4744942 6029364 4841141
3319D841141J856193r03288o81985J255870q12438k099849J386871J019974k521759
$$ 4841141 6697334 5794046 5112061 6367931 5555493 3455644 4842515 5862489 3340730
3310C340730L244872C149883J044454J47415k85628K300066B539664L273443l95181
$$ 3340730 6585602 3149883 4194337 4341752 4056124 6356190 2539664 5813107 5417926
3301E417926O61562p28337k455560J856404O13822q50376j218647J035565K035241
$$ 5417926 6079488 5351151 2895591 4751995 5365817 4515441 3296794 4332359 6367600
3292F367600j646305j028040j62784J866211N23030j22118O32815q42675j679360
$$ 6367600 4721295 3693255 3530471 5396682 5919712 5797594 6430409 5587734 3908374
3283C908374o13858M15575J426773k204500K944124r13701j096876j039853N25828
$$ 3908374 3294516 3710091 5136864 2932364 5876488 4962787 3865911 2826058 3351886
3274C351886J597224p34004j079125M68246j04820J425857R2758l74187K76050
$$ 3351886 4949110 4215106 3135981 3604227 3499407 4925264 5018022 4643835 4919885
3265D919885J856078j839890k10448r01192J69291L24638J231319p87166j408143
$$ 4919885 6775963 4936073 4725625 3824433 3993724 4318362 5549681 4762515 3354372
3256C354372J132252J566584J429767P30575J581632K699773l61077l46728m16016
$$ 3354372 4486624 6053208 7482975 8213550 9795182 12494955 12133878 11787150 11371134
3247A1371134j170576l00224L901296j789486n17499J155652p11925p70399J419031
$$ 11371134 10200558 9900334 13801630 12012144 11494645 12650297 11938372 11167973 12587004
3238A2587004k54622R12692L81868j550367k344145K637586j240313M20778J481342
$$ 12587004 12332382 13245074 13626942 12076575 9732430 12370016 11129703 11550481 13031823
3229A3031823P7149P62056N87499p8718L564223k50752j160066j091449K854005
$$ 13031823 13108972 13871028 14458527 14379809 17944032 17693280 16533214 15441765 18295770
3220A8295770J18392J768076J990278p56390J032836l00298J628695J763540L71674
$$ 18295770 18414162 20182238 22172516 21416126 22448962 22148664 23777359 25540899 25912573
3211B5912573J763914M577506K40643K423982O94007L648756L305588p63749N243604
$$ 25912573 27676487 32253993 32494636 34918618 35612625 39261381 42566969 41803220 47046824
3202D7046824J679193K960635O410304O457952L377312O176951P451776O494192
$$ 47046824 48726017 51686652 58096956 64554908 67932220 74109171 81560947 88055139
3194H8055139J0541151R438391J1185801J2646103K0325966J8036432K3801983
$$ 88055139 98596290 108034681 119220482 131866585 152192551 170228983 194030966
3187A94030966K6985166K8818847L4244303M1413565N1175390O2653341P9913020
$$ 194030966 221016132 249834979 284079282 325492847 376668237 439321578 519234598
3180E19234598J04364411J39220218J78261559K19350006K28372341J99920375
$$ 519234598 623599009 762819227 941080786 1160430792 1388803133 1588723508
3174A588723508J46911737J01224186L4566271n6728446j70606199k45656948
$$ 1588723508 1735635245 1836859431 1871425702 1814697256 1644091057 1398434109
3168A398434109k58335860k24042037j78205560j34637562j01457467p9354908
$$ 1398434109 1140098249 916056212 737850652 603213090 501755623 422400715
3162D22400715o0847870m3128509l6383454k9329919k4447951j9720462j7880064
$$ 422400715 361552845 318424336 282040882 252710963 228263012 208542550 190662486
3155A90662486j2726767j4440752r859984o347775q253488p363959o693936p862351
$$ 190662486 177935719 163494967 153634983 147287208 139033720 131669761 124975825 117113474
3147A17113474n249816n548104k381784n456120m874840l18351l976064m736912
$$ 117113474 111863658 106315554 103933770 98477650 93602810 93284459 89308395 84571483
3139H4571483k037088q32400k776160j705175k999376m442985n01911j204520
$$ 84571483 82534395 81701995 78925835 77220660 74221284 69778299 69276388 68071868
3131F8071868k466084j089128j277156m34368q73144k015732l543660k607159
$$ 68071868 65605784 64516656 63239500 62805132 61931988 59916256 56372596 53765437
3123E3765437k44733J91257j995837J53037p65924p59649J34816k788936k061391
$$ 53765437 53520704 53711961 51716124 51869161 51103237 50343588 50478404 47689468 45628077
3114D5628077j716416j222809l36795k900575J677527k245436q36507J377603
$$ 45628077 43911661 42688852 42352057 39451482 41129009 38883573 38047066 39424669
3106C9424669j760923j570073O23760j800412j654461j227709K808427k93405
$$ 39424669 37663746 36093673 36717433 34917021 33262560 32034851 34843278 34549873
3098C4549873r60380J840149O72636j055205r00904l13988J007121l935753K092830
$$ 34549873 33589493 35429642 36102278 35047073 34146169 33832181 34839302 30903549 32996379
3089C2996379j534047n40092j312045r44499K880147m10811M78978j959485J884649
$$ 32996379 31462332 30922240 29610195 28665696 31545843 31135032 31614010 29654525 31539174
3080C1539174l176066Q11640q20451J184563p25884l763514L701710n8510m33138
$$ 31539174 28363108 29174748 28354297 29538860 28812976 25049462 28751172 28692662 28259524
3071B8259524l37947q43486j772496J641640J465445k969844j59420P12026l194891
$$ 28259524 27921577 27078091 25305595 26947235 28412680 25442836 25283416 25995442 22800551
3062B2800551l30585K453370r83984j775406J439982j387828K377462k336690
$$ 22800551 22469966 24923336 23939352 22163946 23603928 22216100 24593562 22256872
3054B2256872k54734j038212J521446j000176J387918j841456q08766R88252j15330
$$ 22256872 22002138 20963926 22485372 21485196 22873114 21031658 20222892 21211144 21095814
3045B1095814j105254p9794J113774k911624j01626J607468k307872m17443J62644
$$ 21095814 19990560 19910766 21024540 18112916 18011290 19618758 17310886 16893443 17056087
3036A7056087P81799K174354k90020o90852l295165J847825Q81196m43608P82770
$$ 17056087 17837886 20012240 19722220 19031368 15736203 17584028 18465224 18021616 18804386
3027A8804386j752278L258586l217648M063370k754833j018412j941522P21470
$$ 18804386 17052108 20310694 17093046 21156416 18401583 17383171 15441649 16163119
3019A6163119k87291J071870O67480J788248l45274l288941K836599J832889j71909
$$ 16163119 15875828 16947698 17615178 19403426 19058152 15769211 18605810 20438699 20266790
3010B0266790O95128l70110k329193J204251n16379J242421l075726K306468N5530
$$ 20266790 20961918 20591808 18262615 19466866 18950487 20192908 17117182 19423650 19479180
3001A9479180k896931J473577N27108Q50270J972447r36177L70256j009630J643834
$$ 19479180 16582249 18055826 18582934 19433204 21405651 20469474 20839730 19830100 21473934
2992B1473934j098462K109392J107516j045790j048100J840674R33148q98814
$$ 21473934 20375472 22484864 23592380 22546590 21498490 23339164 24272312 23373498
2984B3373498J997507J014133j512616J570324L155974K937430J057580p36323
$$ 23373498 25371005 26385138 24872522 26442846 29598820 32536250 33593830 32857507
2976C2857507J040695J612244L887060o1608j842008r83869k74388j231324n5924
$$ 32857507 33898202 35510446 39397506 39335898 37493890 36510021 36235633 35004309 34948385
2967C4948385r99411J350123M77144K3596J330944j45632J142144k24108O20996
$$ 34948385 33948974 35299097 35776241 35799837 37130781 36985149 38127293 37903185 38524181
2958C8524181L015652n52464j619475J141699r26531L157727N94692J798752j334448
$$ 38524181 41539833 40987369 39367894 40509593 39583062 42740789 43335481 45134233 43799785
2949D3799785N594719q46412j333783M261179M616060J892092L051488N88584
$$ 43799785 49394504 48548092 47214309 51475488 56091548 57983640 61035128 61623712
2941F1623712Q269604J531624L336639M771104M232472M061216O108415K271784
$$ 61623712 69893316 71424940 74761579 79532683 83765155 87826371 93934786 96206570
2933I6206570O682920L672639M366129L283816M281783K782976M23240J420632
$$ 96206570 102889490 106562129 110928258 114212074 118493857 121276833 121700073 123120705
2925A23120705m270928j147319q482369o766471j2712847r951336j0159832p628587
$$ 123120705 118849777 117702458 109220089 102453618 89740771 79789435 69629603 62001016
2917F2001016n522960m588736n180183k864336l491408k642908k008904o59280
$$ 62001016 56478056 51889320 46709137 43844801 40353393 37710485 35701581 35042301
2909C5042301l047606j221991M952j911348K350155j494868n33309m95914K474310
$$ 35042301 31994695 30772704 30777656 28866308 31216463 29721595 29188286 28692372 31166682
2900C1166682k512278j267736K625515o95804j63897O81619j579585O34082R8506
$$ 31166682 28654404 27386668 30012183 29316379 29152482 29834101 28254516 28888598 28987104
2891B8987104L70067k305093j796396N08760j587348L80350j271834J245658j043059
$$ 28987104 29357171 27052078 25255682 25764442 24177094 24557444 23285610 24531268 23488209
2882B3488209k027327Q56864q57230k664450N60062J146872l046776m72732k385160
$$ 23488209 21460882 22317746 21460516 18796066 19356128 20503000 17456224 16983492 14598332
2873A4598332K348548j917665k239327J467925n75708K304431j6952r36854j468511
$$ 14598332 16946880 15029215 12789888 14257813 13682105 15986536 15969584 15032730 13564219
2864A3564219P2764R26330j700967J245412J772398j623639P09540J04272j794544
$$ 13564219 13636983 14563313 12862346 14107758 15880156 14256517 14966057 15070329 13275785
2855A3275785P74768j24508o70673j263200j75974R92574j93866K228799q80960
$$ 13275785 14050553 13926045 13255372 11992172 11816198 12808772 12614906 14843705 13962745
2846A3962745o36164k579117J240874J1660k077172J811805j104436J904299j757964
$$ 13962745 13326581 10747464 11988338 11999998 9922826 11734631 10630195 12534494 10776530
2837A0776530O33157q51737J409598J312033n19766k121282J55645N33048J231673
$$ 10776530 11409687 10557950 11967548 13279581 12759815 10638533 10794178 11327226 12558899
2828A2558899J557117k569956j899189K131090J665058l278952K734100j086605
$$ 12558899 14116016 11546060 9646871 11777961 13443019 10164067 12898167 11811562
2820A1811562l276773L559854l05269m08094R18882o86523p02897O96827p56994
$$ 11811562 8534789 12094643 11789374 11381280 12300162 11613639 10910742 11607569 10850575
2811A0850575Q35127J161976r23505O92470j34320j002412k77965J799102l283693
$$ 10850575 11685702 12847678 11924173 12616643 12482323 11479911 11201946 13001048 9717355
2802I717355K892559j570663k360261R03158p788J158956k50327K292092l042821
$$ 9717355 12609914 11039251 8678990 9582148 9574360 10733316 10482989 12775081 9732260
2793I732260J967555j660808p20896p46194K535253o00548j056749j293460P32285
$$ 9732260 11699815 10039007 9318111 8571917 11107170 10506622 9449873 8156413 8888698
2784H888698K156719j620668K449687k764367J628981j516282K896355j048231
$$ 8888698 11045417 9424749 11874436 9110069 10739050 9222768 12119123 11070892
2776A1070892n13777L73912k130851K176738K01420n01746P58667k749425K206226
$$ 11070892 10557115 10931027 8800176 10976914 11178334 10676588 11435255 8685830 10892056
2767A0892056O24524j263209L147182l995714K236439l264765L579030J884556
$$ 10892056 11516580 10253371 13400553 9404839 11641278 8376513 11955543 13840099
2759A3840099k569440J241776J138696l50207L77866J106296J058936J454394
$$ 13840099 11270659 12512435 13651131 13300924 13678790 14785086 15844022 17298416
2751A7298416J831246N326972Q513343O127800n70576O02384J264416j558988
$$ 17298416 19129662 24456634 32969977 39097777 38527201 39129585 40394001 38835013
2743C8835013q871143m762956p306674j553370j996407j201512M42823j657376
$$ 38835013 29963870 25200914 17894240 16340870 14344463 13142951 13585774 11928398
2735A1928398j58915N18656P42912p78751J935800k910775r68154l8014L518784
$$ 11928398 11769483 12288139 13031051 12252300 14188100 11277325 10309171 10271157 13789941
2726A3789941k709201L65819j418736j677960L016172m78916n28865K185763j882275
$$ 13789941 11080740 11446559 10027823 8349863 11366035 10887119 10358254 12544017 10661742
2717A0661742K175574k837802O09017j034097j63964L066663K111460j281758
$$ 10661742 12837316 9999514 10608531 9574434 9410470 12477133 14588593 13306835
2709A3306835j667129p40514N50566J242767j220959O26830R72960j692146P73915
$$ 13306835 11639706 10899192 11449758 12692525 11471566 12098396 13071356 11379210 12153125
2700A2153125Q18218j63254k472384K909970j053759N70280Q40456N90990K4857
$$ 12153125 12971343 12808089 10335705 13245675 12191916 12762196 13602652 14193642 14218499
2691A4218499L87994J378347r31481K630465j467139K513413P89826J157296L399994
$$ 14218499 14606493 15984840 15053359 17683824 16216685 18730098 19519924 20677220 24077214
2682B4077214L017420K279368K529477K670015J03976K191407l087579K164132
$$ 24077214 27094634 29374002 31903479 34573494 34677470 36868877 33781298 35945430
2674C5945430n302075k794241j954218o294844J98540j902636K501542l200102
$$ 35945430 30643355 27849114 25894896 19600052 19798592 17895956 20397498 17197396
2666A7197396J313372l744770Q47554j501004M9450p92730R51151r26034J02845
$$ 17197396 18510768 14765998 15613552 14112548 14161998 13369268 14320419 13394385 13497230
2657A3497230k38495j46191j038314N43301J598083N8889o77675J569237k701966
$$ 13497230 13258735 13112544 12074230 12617531 14215614 14274503 13596828 15166065 12464099
2648A2464099L93468j849229M522121k622319J505168j771367L78014K61690J115289
$$ 12464099 12857567 11008338 15530459 12908140 14413308 12641941 13019955 13281645 14396934
2639A4396934O16587l372151q22122q6998j560530n1058M33529K917934m21409
$$ 14396934 15013521 11641370 10819248 10732250 9171720 9120662 9554191 12472125 12050716
2630A2050716J628125j624918l20989j033332P37004J73610j08967q77951J161797
$$ 12050716 13678841 12053923 11732934 10699602 11436606 11610216 11501249 10623298 11785095
2621A1785095j89520o60495M09001J00575p93588p31734J146108j77454k996158
$$ 11785095 11595575 10935080 11344081 11444656 10651068 9919334 11065442 10887988 7891830
2612G891830L745254k906256L736891j703144j820325J661417o97733M95374N64437
$$ 7891830 11637084 8730828 12467719 10764575 8944250 10605667 9907934 10403308 10967745
2603A0967745n20391K39966L97858J50878q13329l07433k128030J613080J78542
$$ 10967745 10447354 10687320 11085178 11236056 10422727 10115294 7987264 9600344 9778886
2594I778886k49712L026440l807275l9130K474K683833K39647k180711J615970
$$ 9778886 9529174 12555614 8748339 8709209 8711683 11395516 11635163 9454452 11070422
2585A1070422l520787K036465r24812J091233L37482J874601o228j65254m21428
$$ 11070422 7549635 9586100 8661288 9752521 10090003 11964604 11958376 11793122 11371694
2576A1371694j546898J718963J393264l613235J059810K3937j216092r42588O33102
$$ 11371694 9824796 11543759 12937023 9323788 10383598 10407535 9191443 8248855 8881957
2567H881957R57770k060821J808255J073200l31226j369885K96820K32841j174175
$$ 8881957 9839727 7778906 9587161 10660361 10329135 8959250 9256070 9488911 8314736
2558H314736j40772J902856p7310k021949J853667r53867P60493j144125K477571
$$ 8314736 8173964 10076820 9999510 7977561 9831228 8877361 9637854 8493729 10971300
2549A0971300j412354O12135o27421P78330k615137J676945j344791K72612K738320
$$ 10971300 9558946 10171081 9543660 10321990 7706853 9383798 8039007 8311619 11049939
2540A1049939J785321k285012K165352j780796l89663N66145L007098J675020
$$ 11049939 12835260 10550248 12715600 10934804 10545141 11111286 14118384 15793404
2532A5793404M279624P168198J3367747J3939995l396827j0197988r308797r904790
$$ 15793404 20073028 27241226 40608973 54548968 51152141 40954153 31645356 21740566
2524B1740566l953074j493963k578938n61377k016555M5330J756093k143235J481971
$$ 21740566 17787492 16293529 13714591 13153214 11136659 11181989 12938082 10794847 12276818
2515A2276818m87531j01200j279140j348080O55671l64472N23311j086448J433441
$$ 12276818 11789287 11688087 10408947 9060867 9716538 9352066 9875377 8788929 10222370
2506A0222370M24239j810710M807069m087777Q53822j370926K042230l86139j896329
$$ 10222370 10646609 8835899 13642968 9555191 10409013 9038087 11080317 10694178 8797849
2497H797849L016889k915961o63673j4039K333266k662376L154416r74868L72250
$$ 8797849 11814738 8898777 8235104 8221065 10554331 7891955 11046371 10071503 10443753
2488A0443753n60547j234100J109616q10j152717n45153L318918k540248M87760
$$ 10443753 9883206 8649106 9758722 9757912 8605195 8060042 11378960 8838712 9326472
2479I326472j134092M20198j033297J923128l3833j161422j082343J500434j532683
$$ 9326472 8192380 8612578 7579281 9502409 9468576 8307154 7224811 8725245 7192562
2470G192562j29217Q59907j463127R19692K802325j124904n78881J21710j74368
$$ 7192562 7063345 7923252 6460125 7379817 10182142 9057238 8478357 8600067 8425699
2461H425699Q67678J615218j643399j04969m00569N46979J073447N84516j697771
$$ 8425699 9293377 10908595 9265196 9160227 8759658 9306637 10380084 10964600 9266829
2452I266829J609613J573117j383373L89202O43414J202145K062559L07333J467609
$$ 9266829 10876442 12449559 11066186 11455388 12098802 13300947 15363506 15670839 17138448
2443A7138448P397762M777437J4956050J9704035J5229984o302888j1607572j9411227
$$ 17138448 24536210 29313647 44269697 63973732 79203716 72900828 61293256 41882029
2435D1882029m503463j684637l68548L551732R871631J1660352L984444q060320
$$ 41882029 37378566 35693929 35325381 38877113 48748744 60409096 64393540 56333220
2427E6333220j2756099m769900n965235M443904P597295J4069883K0905087P97320
$$ 56333220 43577121 38807221 32841986 37285890 44883185 58953068 79858155 80655475
2419H0655475j2278887j6477468j2089127o059312J891580L8884Q798540J3324899
$$ 80655475 68376588 51899120 39809993 33750681 35642261 35681145 44479685 57804584
2411E7804584N23308q267264j0656335r208172m801528o28011k45440N271533
$$ 57804584 58327892 50060628 39404293 30196121 25394593 24766582 24521142 29792675
2403B9792675O245378M8817n109439o170673m716152j648542l476275L48195j906426
$$ 29792675 36038053 36086870 30977431 24806758 20090606 18442064 14965789 15313984 13407558
2394A3407558k990312K227350k388651J62610l48173L963363l081610P37332J471854
$$ 13407558 10417246 12644596 10255945 10418555 10070382 14033745 10952135 11689467 13161321
2385A3161321k30271k122371L251837k839921L747776k848123M351148K37781
$$ 13161321 12931050 10808679 14060516 11220595 14968371 12120248 16471396 16709177
2377A6709177j591907j836287M50751m90039k518350Q85470J295474j513279k85370
$$ 16709177 15117270 13280983 13731734 13241695 10723345 11608815 12904289 11391010 11105640
2368A1105640K86200j385645J00540j694365J839089j49666J17278q20722R13751
$$ 11105640 11391840 10006195 10106735 8412370 10251459 10101793 10219071 9398349 10312100
2359A0312100j117821j887808J36247J0085J255589j949585J762645r16483j68188
$$ 10312100 9194279 7306471 7442718 7452803 8708392 6758807 8521452 7604969 7436781
2350G436781M08167J553446k090069r49154J284053q37661k384426L479522k95147
$$ 7436781 7844948 9398394 7308325 6359171 7643224 6805563 4421137 7900659 7605512
2341G605512L21482j22991K183198k419845J325778j763548j188815K137453J948793
$$ 7605512 7926994 7804003 9987201 7567356 8893134 7129586 5940771 8078224 10027017
2332A0027017j043912j94737k377261k219033K674691N39479j613543J62076J230220
$$ 10027017 8983105 8788368 6411107 4192074 6866765 7406244 5792701 5954777 7184997
2323G184997q86307J561825j735406k88216j981223K266637n50839M71338j085289
$$ 7184997 6298690 7860515 6125109 5836893 3855670 6122307 5571468 6042806 4957517
2314D957517M36014K108135j979634J52820j84778R57037J641304l183677J406111
$$ 4957517 5393531 7501666 5522032 5674852 5490074 6447111 8088415 4904738 6310849
2305F310849J501729j299497N31571P8144j556578J096483K932304k279106O66661
$$ 6310849 7812578 6513081 7044652 7122796 5566218 6662701 9595005 7315899 7982560
2296G982560M0545k53593j470133m66816J238654r96101o95800Q66665r23859
$$ 7982560 8023105 7769512 6299379 5832563 7071217 6075116 5379316 6245981 5322122
2287E322122J982960J891246l45776m23455q42450r2390j480639p03687k44677
$$ 5322122 7305082 9196328 8850552 8427097 7584647 7492257 6011618 5307931 5063254
2278E063254J874446m07890k253752K678888l15648q05446j004218K247319j514268
$$ 5063254 6937700 6529810 4276058 6954946 6639298 5833852 4829634 7076953 5562685
2269E562685k35348m02599J710127l2088j272484j884403K284945j340191J658953
$$ 5562685 5327337 4924738 6634865 6602777 5330293 3445890 5730835 4390644 6049597
2260F049597N85707o11372J706098l01668l87116j170884j35233J840913k208892
$$ 6049597 6635304 6023932 7730030 7428362 7041246 5870362 5735129 7576042 5367150
2251E367150J845105O90450B867181K882263J690698B933711J831585j398915
$$ 5367150 7212255 7902705 2867181 5749444 7440142 2933711 4765296 3366381
2243C366381K854783N36410j619875n92071m9084p38767L385179n13212R0247
$$ 3366381 6221164 6757574 5137699 4545628 4496544 3757777 7142956 6629744 6719991
2234F719991J438967k443124j169868K324808j235785O92266N0718k538411R06503
$$ 6719991 8158958 5715834 4545966 6870774 5634989 6327255 6377973 3839562 4746065
2225D746065J873715k015276j230387L689469K48588j611037J996499O65930k582604
$$ 4746065 6619780 4604504 3374117 7063586 7312174 5701137 7697636 8363566 5780962
2216E780962p8280J889390l15952o08736K935347k167506L51089o69385M2107
$$ 5780962 5702682 7592072 7276120 6667384 9602731 7435225 7786314 7116929 7159036
2207G159036K20349K594748l239088n19959K372514j104824K294182k6050k157868
$$ 7159036 7379385 9974133 6735045 6215086 8587600 7482776 9776958 9750908 7593040
2198G593040L040947k298928j77299O80417N77451K382631k04851j203798Q70006
$$ 7593040 10633987 8335059 8157760 8838177 9415628 11798259 11593408 10389610 11259616
2189A1259616j912074L860046J73635k047103K047765j513611j598585J081825
$$ 11259616 9347542 13207588 13381223 11334120 13381885 11868274 10269689 11351514
2181A1351514M11648J198398j504899j135400J706970m16901l16262m46150L43142
$$ 11351514 11763162 12961560 11456661 10321261 12028231 11611330 11295068 10848918 11192060
2172A1192060p67055K295559l309473L115840J79348k057037J064852k833616
$$ 11192060 10425005 12720564 9411091 12526931 12706279 10649242 11714094 8880478
2164H880478K400829M5123j16968O64526L70893k647046K732246k379023J356469
$$ 8880478 11281307 11326430 11209462 11873988 12244881 9597835 12330081 9951058 11307527
2155A1307527N38895j03265j512383r51015L58339j723381J785113j016744l30306
$$ 11307527 11846422 11743157 10230774 9279759 9638098 7914717 9699830 8683086 8352780
2146H352780N49655j376183O53491k72236J929976l19249k622025j809183K949184
$$ 8352780 8902435 7526252 8179743 7907507 9837483 9518234 6896209 5087026 8036210
2137H036210J43067N29659n23708R82553O91321k205728p96658M81336K454669
$$ 8036210 8179277 8708936 8185228 9167781 9859102 7653374 6856716 7338052 9792721
2128I792721k532854J501711p56666J809709j728750q15000r68831O54374J210447
$$ 9792721 7259867 8761578 8004912 9814621 8085871 7270871 6302040 6956414 8166861
2119H166861k044952K344662j436763J269736j547612q98901K83402J488914l85770
$$ 8166861 6121909 8466571 7029808 8299544 6751932 5853031 6136433 7625347 7239577
2110G239577o57807J35295q92270R65784l74330M0335p51201K511723l620943
$$ 7239577 6581770 6717065 5824795 6790579 6416249 6456584 5705383 8217106 4596163
2101D596163K020846j604159L354676k721564K022534M57940j181550p91418J253348
$$ 4596163 6617009 5012850 8367526 5645962 7668496 8126436 6944886 6153468 7406816
2092G406816M04551q04320j83187J364574r82298J08771m41897Q01680j611313
$$ 7406816 7811367 7007047 6823860 8188434 7206136 7314907 6873010 7674690 6063377
2083F063377K850824k9590Q71199o54251k713979M26137K481080k649644P53488
$$ 6063377 8914201 8884611 9755810 9101559 6387580 6813717 9294797 6645153 7398641
2074G398641K87496m83664J470172k07853j079836K082090j737594j199995m66972
$$ 7398641 7686137 7202473 8672645 8464792 7384956 9467046 7729452 6529457 6062485
2065F062485j025628K494940j207281J011014K86553j690378K73315J578720p12985
$$ 6062485 5036857 7531797 6324516 7335530 7622083 5931705 6205020 7783740 7070755
2056G070755J379362k167227M59545J244454j300114M37692l32842K161913r86402
$$ 7070755 8450117 6282890 6742435 7986889 6686775 7124467 6791625 8953538 7967136
2047G967136p99362Q56376o00074J679921j895795L50933J575186k156921J291023
$$ 7967136 7167774 8024150 7424076 9103997 7208202 7559135 9134321 6977400 8268423
2038H268423j280107O50859K617897r58531j455885O48088J042188k988659J54728
$$ 8268423 6988316 7639175 10257072 9298541 7842656 8490744 9532932 6544273 6699001
2029F699001J954489k150961J566402l82031l74093O52051J636240j667871j02673
$$ 6699001 8653490 6502529 8068931 7686900 7312807 7964858 9601098 7933227 7830554
2020G830554P19102L79697O25447k309767K45633o44327n61704j913780K361470
$$ 7830554 8549656 8929353 9554800 7245033 7490666 6846339 6284635 4370855 6732325
2011F732325J024481O9212J27029m85394q55500N69314k191613M527892K16319
$$ 6732325 7756806 7826018 7953047 7467653 6612153 7181467 4989854 9517746 9734065
2002I734065k072433J111390q50227L84988L87126j529958O72172j410074K752993
$$ 9734065 7661632 8773022 7922795 8307783 8694909 7164951 7837123 6427049 9180042
1993I180042j646689p3163O59980O34419K34171n65303j295114R72312k16726
$$ 9180042 7533353 7460190 8120170 8754589 8988760 8423457 7128343 8100655 7883929
1984G883929J923419l22127K94897m09195j21880L1714K043067k230200l67606
$$ 7883929 9807348 9485221 9780118 9370923 9249043 9280757 11323824 9093624 8726018
1975H726018M154245k119824L47201P93484j361310J631529p24869O46601o5858
$$ 8726018 12880263 10760439 11107640 11901124 10539814 12171343 11446474 12093075 12027217
1966A2027217j776424N748357k153776K548111n50520r10335j172722j137326
$$ 12027217 10250793 15999150 13845374 16393485 15842965 14932630 13759908 12622582
1958A2622582K145609J452205l826218P27932o1351r08862M1913O79028K612204
$$ 12622582 14768191 16220396 12394178 13122110 13060759 12151897 12193810 12872838 15485042
1949A5485042j453251r42265P17131K4161M19879K230260p06500j144129o27323
$$ 15485042 14031791 13089526 13806657 13830818 14250697 16480957 15774457 14630328 14003005
1940A4003005O01452J060130l9561K090650j066121J28755O45884o63210P59019
$$ 14003005 14604457 15664587 15625026 17715676 16649555 16778310 17424194 16760984 17520003
1931A7520003j794916k46990K401099Q62616L16076j313585k127006q55872L613343
$$ 17520003 15725087 15478097 17879196 18741812 19057888 17744303 15617297 14761425 18374768
1922A8374768R63244k215231L08953R69458k056207J957329r5114k49582k856483
$$ 18374768 19338012 17122781 17431734 18401192 16344985 18302314 18207200 17957618 15101135
1913A5101135N60166K21299J825267l309888J734829j684152J994075q07822j394267
$$ 15101135 15661301 15882600 17707867 14397979 16132808 14448656 16442731 15634909 14240642
1904A4240642O57113j097027j459214J680366k691102J690502j084271L186522
$$ 14240642 14897755 13800728 12341514 14021880 11330778 13021280 11937009 15123531
1896A5123531j325415j708882r56903L48360j454987J549432k352925J036862
$$ 15123531 13798116 12089234 11132331 11480691 10025704 11575136 9222211 10259073
1888A0259073P39460J31443m83303p85892O73916q23309M51684l90592K96931
$$ 10259073 10998533 11129976 10646673 9860781 10534697 9711388 10163072 9772480 10069411
1879A0069411l43903J139270K737782j786329l494865L656799j643971J61930
$$ 10069411 9725508 10864778 13602560 11816231 8321366 11978165 10334194 10496124
1871A0496124J243744p48041o59210J982524M39724j160357L071480k075076j504346
$$ 10496124 11739868 10991827 10332617 12315141 12754865 11594508 14665988 12590912 11086566
1862A1086566l12142J454328l2602K45417J008592j058581Q7747l289J620294
$$ 11086566 10774424 12228752 12196150 12441567 13450159 12391578 12479325 12476036 14096330
1853A4096330J034819L09052k589988j35596J928911j302675n71638J57351q17413
$$ 14096330 15131149 15440201 12850213 12714617 14643528 13340853 12769215 12926566 12109153
1844A2109153J539138J812440j526986n55077J546015j80311K07260K335060k422529
$$ 12109153 13648291 15460731 13933745 13378668 14924683 14744372 14951632 17286692 14864163
1835A4864163J202064N10127k26632J110582m01412P53646k574103J869918N26289
$$ 14864163 16066227 16576354 16349722 17460304 17058892 17812538 15238435 17108353 17634642
1826A7634642J225496j156239J843125p33537k179330J907245L10712K51686k379352
$$ 17634642 18860138 17703899 19547024 18813487 16634157 18541402 18852114 19103800 16724448
1817A6724448J946730j609726j607899J305373R7192J188944K29362j423426m14569
$$ 16724448 18671178 17061452 15453553 16758926 16856118 18045062 18274424 16850998 16436429
1808A6436429J710735j273746J097094L110n25167o10169R1280J447867k699854
$$ 16436429 18147164 16873418 17970512 17973622 17448455 16838286 16929566 18377433 15677579
1799A5677579L102779j644590Q10114K492422k885564J088794j171090M1844J349162
$$ 15677579 18780358 17135768 17945882 20438304 17552740 18641534 17470444 17512288 18861450
1790A8861450j103600J973502L39470k830862K397534k848340J574398Q06126
$$ 18861450 17757850 19731352 20070822 17239960 19637494 16789154 18363552 19169678
1782A9169678r78357J484286l913737K193524J738720k795818J211794l8084n43595
$$ 19169678 18191321 19675607 15761870 17955394 19694114 16898296 18110090 18072006 17528411
1773A7528411K52328m88803K306170q29146N746873L559909R093800J1490487
$$ 17528411 17780739 17291936 19598106 18768960 24515833 28075742 37169542 48660029
1765D8660029k705448p557651p792044p620602j663428r32816k705060k484787
$$ 48660029 45954581 38396930 30604886 22984284 21320856 20388040 17682980 15198193
1757A5198193J666979l317426K341899j528318N45877N07382j03384P67812j850330
$$ 15198193 16865172 13547746 15889645 14361327 14907204 15414586 15311202 16079014 14228684
1748A4228684q8652J071360q19359j064309m96314L22842J865719k322966J163021
$$ 14228684 14140032 15211392 14392033 13327724 12831410 13154252 15019971 12697005 13860026
1739A3860026O73835k395211J046466k056576K340202J353079p45562o62571j121378
$$ 13860026 14533861 12138650 13185116 11128540 13468742 14821821 14076259 13413688 12292310
1730A2292310m95211J43800q72714P12657K085504l73650q96037J390082k201978
$$ 12292310 11797099 11940899 11068185 11780842 13866346 13492696 12596659 13986741 11784763
1721A1784763k47432J22985k691317L718862P88067k673002J289878O39974j477323
$$ 11784763 11537331 11660316 8968999 12687861 13475928 10802926 12092804 12732778 11255455
1712A1255455J256659j462757R75490m12905p53002j016278J258825R30320R23258
$$ 11255455 12512114 11049357 12024847 11611942 10858940 9842662 11101487 12031807 12955065
1703A2955065Q02279P05126k074952K69159K108028q77024J040832l18911k078552
$$ 12955065 13757344 14462470 12387518 12656677 14764705 13887681 14928513 14609602 12531050
1694A2531050K164730K01586q23060j319548K188841j35295K155760j088786O07765
$$ 12531050 14695780 14897366 14074306 12754758 14943599 14808304 16964064 15875278 16483043
1685A6483043q04864R88117j017044J056432J562328q66402J853320k893770P11710
$$ 16483043 15678179 16666296 15649252 16705684 18268012 17401610 19254930 16361160 17072870
1676A7072870J609298l22913j097961J09212R77202J482378k652514O48336K14
$$ 17072870 18682168 18359255 17261294 17370506 18347708 19830086 17177572 17825908 17826122
1667A7826122J067902l049484J460719n89980k95109m27449r50406j158737K057692
$$ 17826122 18894024 15844540 17305259 16715279 16420170 15992721 15042315 13883578 15941270
1658A5941270M16962k014582K573003j595481j91329o13593L24951k240893J833763
$$ 15941270 16358232 14343650 16916653 15321172 15129843 14516250 14841201 12600308 14434071
1649A4434071K458225j678224R31572J728833j853435M08597j295039L273362
$$ 14434071 16892296 15214072 16145644 17874477 16021042 16429639 15134600 18407962
1641A8407962j937929j250789K967511k584040J653257k801584K801224J98352
$$ 18407962 16470033 15219244 18186755 15602715 17255972 14454388 17255612 17453964
1633A7453964q02069j24161o73048J605606R40162Q03750j093530p25124O30325
$$ 17453964 16651895 16527734 15854686 17460292 18400454 19204204 18110674 17385550 18015875
1624A8015875o53263J329736p76774N43194L77512Q65160N37921r36393Q34860
$$ 18015875 17362612 18692348 17915574 18458768 18836280 19701440 20239361 19302968 20137828
1615B0137828L36132N93050J972956o8928K03814N50698p38843Q70679J457696
$$ 20137828 20473960 21067010 23039966 22971038 23174852 23725550 22986707 23857386 25315082
1606B5315082j629828J808954j073790L21169j522988j787527Q62512O63664j503694
$$ 25315082 23685254 25494208 24420418 24741587 23218599 21431072 22293584 22957248 21453554
1597B1453554P34290R40182j005684j301084J167126p49376q28074L013512k840342
$$ 21453554 22187844 23128026 22122342 20821258 21988384 21239008 20410934 23424446 20584104
1588B0584104N77066R75829k442887Q66580M00458M60000r38310j41472j147348
$$ 20584104 21161170 22136999 19694112 20560692 20961150 21421150 20482840 20341368 19194020
1579A9194020J604308N03038M5484J130560R25630q69296k151226L340913r48979
$$ 19194020 20798328 21301366 21346850 22477410 23403040 22533744 20382518 23723431 22774452
1570B2774452m174462K042818J204638m550610L840194k257914N67536M04610
$$ 22774452 18599990 20642808 21847446 17296836 21137030 18879116 19446652 19851262
1562A9851262J3032J539786k863233o80555R45692J70072m708211L434587l97734
$$ 19851262 19864294 21404080 18540847 17860292 18805984 18976056 14267845 17702432 17304698
1553A7304698j243911j7682j76527l85641O4327l05982J208532n77120O99690
$$ 17304698 16060787 16043105 15866578 15480937 15545264 15239282 16447814 15870694 16570384
1544A6570384j348330P72071k90365l506704K729301M53900k025440M51631m00687
$$ 16570384 15222054 15994125 15703760 12197056 14926357 15380257 13354817 13806448 13405761
1535A3405761K33630O59579j577595n32301J16731P29111j178865J432751k013554
$$ 13405761 13639391 14298970 12721375 12189074 12305805 13034916 11856051 13288802 11275248
1526A1275248L073411j064620j06319k371770K231897J03139J086530J2525j025973
$$ 11275248 14348659 13284039 13177720 10805950 13037847 13140986 14227516 14240041 13214068
1517A3214068J226204k82087j991508J475015j184253n35631L012682m740094
$$ 13214068 14440272 14158185 12166677 13641692 12457439 11921808 14934490 10194396
1509A0194396K805141R09030r62290J094884l83549r75655J038577M5922O85636
$$ 10194396 12999537 13908567 12946277 14041161 13657612 12681957 13720534 13766456 14452092
1500A4452092o33395J055517j854533K136039J832827j085568m027601L764951
$$ 14452092 13818697 14874214 13019681 15155720 16988547 15902979 11875378 15640329
1492A5640329j010485J370262j603718K83944M773212l020994J900620n02674
$$ 15640329 14629844 16000106 14396388 14680332 19453544 16432550 18333170 17830496
1484A7830496m25112J849236L99828j418080J145508J169408M10430q7632L01740
$$ 17830496 17405384 19254620 19654448 18236368 19381876 20551284 20961714 20874082 21175822
1475B1175822n65024k00856j81214M007376n15834j889634L529508K04466N67758
$$ 21175822 20610798 20409942 20228728 24236104 23720270 21830636 25360144 25564610 26132368
1466B6132368j129754K555271N96327O412L801848J97528m1693L133190K729777
$$ 26132368 25002614 27557885 28154212 28160624 31962472 32160000 32118307 35251497 37981274
1457C7981274K074599k10052M152564J754164K733140O07536L993643J983345
$$ 37981274 40055873 39845821 43998385 45752549 48485689 49093225 53086868 55070213
1449E5070213J639575R80048J22720L889136L621124j568164J470603J885740
$$ 55070213 56709788 57689836 57812556 61701692 65322816 63754652 65225255 67110995
1441F7110995J317689J238192L63488L977592J957295K680448N263432K662672
$$ 67110995 68428684 69666876 70030364 74007956 75965251 78645699 83909131 86571803
1433H6571803L672816N854328M350303P793544M674231J2571560O984768J1432031
$$ 86571803 90244619 96098947 100449250 108242794 112917025 125488585 132473353 143905384
1425A43905384J5927584J4573422J5168592J0075055N135457J444272l734832
$$ 143905384 159832968 174406390 189574982 199650037 204785494 206229766 202494934
1418B02494934r714912j3854160j6320879j7712959j8403791j8835951j1256992
$$ 202494934 192780022 178925862 162604983 144892024 126488233 107652282 96395290
1411I6395290j3897966r352417n261807o513924p181628k234416l070187j848488
$$ 96395290 82497324 73144907 67883100 61369176 54187548 51953132 48882945 47034457
1403D7034457l758352k245756k009719k057061o3880l177684J210284k349390
$$ 47034457 43276105 41030349 39020630 36963569 36899689 33722005 34932289 32582899
1395C2582899J22958j359386n23685J593631j853262r81753k350718K418520j066228
$$ 32582899 32705857 31346471 30822786 32416417 30563155 29581402 27230684 29649204 28582976
1386B8582976l539256K050375k713157J898576j275672J435787k821549P70504
$$ 28582976 25043720 27094095 24380938 26279514 25003842 26439629 23618080 24388584
1378B4388584k696000J200520P3786r09190k213770O85068J857452j617026j745060
$$ 24388584 21692584 22893104 22966890 22057700 19843930 20528998 22386450 20769424 19024364
1369A9024364J204104k82436N99308j322370N08276m26753j05539r09306j52794
$$ 19024364 20228468 19946032 20545340 19222970 19731246 19304493 19198954 18289648 18136854
1360A8136854k27689l72273q92234J255398k907018J656515r4339j334314J024739
$$ 18136854 17909165 17536892 16644658 17900056 14993038 16649553 16555214 15220900 16245639
1351A6245639j373432k665332K714652j148945K410817Q48666k250166k787405
$$ 16245639 14872207 12206875 14921527 13772582 16183399 17032065 14781899 11994494
1343A1994494L041081o65654j051602J541167j575941m42248O05674k46658J232246
$$ 11994494 15035575 14369921 13318319 14859486 13283545 12841297 13446971 13200313 14432559
1334A4432559l936680L014970k480329M354548l420682K63812o95324K353780
$$ 14432559 10495879 13510849 11030520 15385068 11964386 12228198 11532874 13886654
1326A3886654j794520k72140J467634j021243Q69385j790261K426614j616556
$$ 13886654 12092134 11819994 13287628 12266385 13135770 11345509 13772123 12155567
1318A2155567p93791Q10830K411725k798816O39596j61541J738324j29833j864087
$$ 12155567 11361776 12172606 14584331 11785515 12425111 12263570 14001894 13872061 12007974
1309A2007974k129017L082517j164701J25550L56576j455127J601161r70178P07740
$$ 12007974 9878957 12961474 11796773 11922323 12278899 10823772 12424933 11454755 12162495
1300A2162495O99684k616588J850872K861823k269691P69297l79600M16826J380665
$$ 12162495 12862179 10245591 12096463 14958286 12688595 13457892 13078292 13495118 14875783
1291A4875783j503484J180249j282715J843576N21515j506649P61290J665196
$$ 14875783 13372299 14552548 13269833 15113409 15634924 14128275 14889565 16554761
1283A6554761N54293j23970K238076r33796J656440P07606l640883K597725j510835
$$ 16554761 17109054 16985084 19223160 18289364 19945804 20653410 17012527 19610252 18099417
1274A8099417J096059K284182K212054J949442J017164R6292J52712l70396o64200
$$ 18099417 19195476 21479658 23691712 25641154 26658318 26754610 26907322 26536926 25872726
1265B5872726k480936o9668k700424K005302k186832J500116j747478K79200k32152
$$ 25872726 23391790 23322122 20621698 22627000 20440168 21940284 20192806 20472006 20239854
1256B0239854O54432j683872J06281J729797M90160k359396N33346K45764j489335
$$ 20239854 20894286 19210414 19316695 21046492 21536652 19177256 19710602 19956366 18467031
1247A8467031Q83665O61472m31310K406250j145144k317068K092928J296728j441572
$$ 18467031 19350696 20012168 19580858 21987108 20841964 18524896 20617824 21914552 20472980
1238B0472980Q81032J924530M98416K732410J427053J952605l514918L945254
$$ 20472980 21354012 23278542 23776958 26509368 27936421 29889026 26374108 30319362
1230C0319362o65561J819113j88267j144196L92809j981952m21984m477138m28458
$$ 30319362 29653801 31472914 31284647 30140451 30533260 28551308 28129324 23652186 23223728
1221B3223728J500040k003550j16404l35980j268210J677610j325028n07360K015826
$$ 23223728 24723768 22720218 22603814 22267834 20999624 22677234 21352206 20844846 22860672
1212B2860672j23076J78280J19215M63245l9196l44416M309179P39884Q17263
$$ 22860672 22737596 22915876 23035091 23498336 23459140 23114724 27423903 28163787 28981050
1203B8981050j044566J098162L089646R30235p31649k752124R86415p25685p14028
$$ 28981050 27936484 29034646 32124292 33054527 32322878 29570754 30557169 29831484 29117456
1194B9117456L53222m277146J413267K200834l236667O17250k805905J770169
$$ 29117456 29470678 25193532 26606799 28807633 25570966 26188216 23382311 25152480
1186B5152480l97k69289j00878l95682p40669J590819j212300p93902P35026J234140
$$ 25152480 25152083 24882794 24781916 24386234 23645565 25236384 24024084 23230182 23965208 25199348
1176B5199348R3008l229042L021225m129993j73644J442270k893356k61428k449354
$$ 25199348 25292356 22063314 25084539 20954546 20780902 22223172 19329816 19068388 16619034
1167A6619034J042060j791469j288609j485729k400956K122078r18186L22447
$$ 16619034 17661094 15869625 14581016 13095287 10694331 12816409 11898223 12220670
1159A2220670k381340K007048k132892p5046Q68838Q5144j314503J594195q57639
$$ 12220670 9839330 11846378 9713486 9638440 10507278 10592422 9277919 10872114 10014475
1150A0014475j427354j75262M186976l722888o9030J81857j58533J294460L40995
$$ 10014475 8587121 8411859 12598835 8875947 8806917 8988774 8830241 10124701 10465696
1141A0465696r38427j430476O04866J276615j460330k6242R0021l210249K613088
$$ 10465696 9527269 8096793 8701659 9978274 8517944 8491702 8581723 5371474 7984562
1132G984562K055780j410449j406577q0085p32684J339434j059737j109987O25972
$$ 7984562 10040342 8629893 7223316 7143231 6410547 7749981 6690244 5580257 6206229
1123F206229N05600P71720n64447j278061m73477M09337K333428j362551M63960
$$ 6206229 6711829 7483549 6919102 5641041 5167564 5576901 7910329 6547778 7011738
1114G011738B968280K464365O44334m06747L025883l766805K963083j782229r90357
$$ 7011738 2968280 5432645 6076979 5670232 8696115 4929310 7892393 6110164 5119807
1105E119807j51670J256979j231565J631358p57970N01276k726321K177493P62587
$$ 5119807 4968137 6225116 4993551 6624909 5866939 6368215 3641894 5819387 6581974
1096F581974j795848N83351j716318R48563K39841K077703j033994M556K5441
$$ 6581974 4786126 5369477 3653159 4601722 4841563 6919266 5885272 5889828 5915269
1087E915269k246574J195922k55293J392492N12687k509650J233554j571537J344504
$$ 5915269 3668695 4864617 4609324 6001816 6514503 4004853 5238407 3666870 5011374
1078E011374M44848J563796k701203n0234J139736o63115J293850p44300j486169
$$ 5011374 5456222 7020018 4318815 4268581 5408317 4745202 6039052 5294752 3808583
1069C808583J068133J233951k23286j312824j371263J475918J081071q76817J898908
$$ 3808583 4876716 6110667 5887381 4574557 3203294 4679212 5760283 4883466 6782374
1060F782374j401892q84634p13762J983907j752126M90620J415648k80953J976539
$$ 6782374 5380482 4495848 3782086 5765993 4013867 4504487 5920135 5639182 7615721
1051G615721n70326k953714K782289Q0242k251178L86850m16048J297654j18140
$$ 7615721 7045395 4091681 6873970 6954212 4703034 5089884 4673836 5971490 5853350
1042E853350J691361m24913k19823J072068M34986j041949Q07791K113018O61375
$$ 5853350 7544711 7119798 6899975 7972043 8407029 7365080 8172871 10285889 10947264
1033A0947264j337582K16798k08304k550991N82600L12723j61666j866374P89507
$$ 10947264 9609682 9826480 9618176 7067185 7649785 7962508 7800842 5934468 6723975
1024F723975j72499j361439K50779m4106K21967K480643k261978K83548O58198
$$ 6723975 6551476 5190037 5440816 5396710 5618677 8099320 5837342 6120890 6779088
1015F779088j905172J988698J194532k002121k060144q30096K299901N652o33514
$$ 6779088 4873916 6862614 8057146 6055025 3994881 3164785 5464686 5470338 4836824
1006D836824J447257j160128J127912k529731J418105K358559j569313o47194
$$ 4836824 6284081 5123953 6251865 3722134 5140239 7498798 5929485 5282291
998E282291J165851j566139m68330o6920m83188J842030j261073J099380n08968
$$ 5282291 6448142 4882003 4413673 4346753 3863565 5705595 4444522 5543902 5034934
989E034934j301167L499152k605686o21429J988370K723453j354644k269311K77042
$$ 5034934 3733767 7232919 4627233 4005804 5994174 8717627 7362983 5093672 5370714
980E370714J90026j160953N89881M76521j09412L96525q03007k65352n5797L9304
$$ 5370714 5560740 4399787 4989668 5466189 5356777 5753302 4950295 4684943 4629146 4668450
970D668450P88214j43288o41732Q62087q68974j078584R17672J587344m95204
$$ 4668450 5456664 5313376 4671644 5533731 4664757 3586173 4503845 6091189 5595985
961E595985R87400k264491J501125J48195j94800j137046J856749k594312j626940
$$ 5595985 6583385 4318894 5820019 5968214 5773414 4636368 6493117 3898805 2271865
952B271865L201117j359482M68742J148305L26368k53881j68904p56484J20041
$$ 2271865 5472982 4113500 4582242 5730547 6056915 5803034 5634130 4877646 4997687
943D997687K7939l7268j724715J559278M1139k04036R96100m53965J445804l71144
$$ 4997687 5025626 4988358 3263643 4822921 4864060 4660024 5656124 5202159 6647963 6276819
933F276819j893085Q88106n88503O96368J095409j219129O60787j197384J363334
$$ 6276819 4383734 5271840 4683337 5379705 6475114 5255985 5916772 4719388 6082722
924F082722p06174J884397r49290l3551m39109j922493j186143K985866k659844
$$ 6082722 5376548 7260945 6311655 6278104 5838995 3916502 2730359 5716225 3056381
915C056381Q94227A637899K509669J423268j160326j057497J266694A955020j96858
$$ 3056381 3950608 1637899 4147568 5570836 4410510 3353013 4619707 1955020 1758162
906A758162O98470k53025J873581j573591k76953o41244K546741r68945H93636
$$ 1758162 2456632 2203607 4077188 2503597 2226644 1585400 4132141 3163196 893636
896C01542K340503K95192J205060A756873m60988L801099A706741J377816A408028
$$ 301542 2642045 2937237 4142297 1756873 1295885 5096984 1706741 3084557 1408028
886C101856j135355J025237K23397H84752J010229k85569n46976J753358A188747
$$ 3101856 1966501 2991738 3215135 884752 1894981 1609412 1062436 2815794 1188747
876C931351j795745M61280H38473J391391O07555C73262K650843J633378A168071
$$ 3931351 2135606 2596886 838473 2229864 2837419 373262 3024105 4657483 1168071
866C753960l0945E9205J78367K292429L75597M58595k54328L07737J2343j25568
$$ 3753960 3723015 59205 237572 2530001 2905598 3364193 3109865 3417602 3429945 3304377
856C304377p01235M54254j196729J389802r25988r81178L82957k42796K219762
$$ 3304377 2603142 3057396 1860667 3250469 2324481 1343303 1726260 1483464 3703226
847C703226j643752r26219N88160K289105K59618B003544J24812q74636M80151
$$ 3703226 2059474 1133255 1721415 4010520 4270138 2003544 2128356 1253720 1733871
838A733871D30253K044983F73733K267028j99085k49678J089726q64718n60098
$$ 1733871 430253 2475236 673733 2940761 2741676 2491998 3581724 2717006 2156908
829B156908K258825k035694K196363k128328j95588r39318N93277J207363k11651
$$ 2156908 4415733 2380039 4576402 2448074 2252486 1313168 1906445 3113808 2902157
820B902157Q99196A207657L068781B010093J265017p18564D51336J468747L40690
$$ 2902157 3801353 1207657 4276438 2010093 3275110 2556546 451336 1920083 2260773
811B260773K91279j270294L824397n32503n54690N948918k091477J829687j782072
$$ 2260773 2552052 1281758 5106155 4573652 4018962 9967880 7876403 9706090 7924018
802G924018m28204m52447K338492n12718J727115k8528L50814N40577N325807
$$ 7924018 7495814 7043367 9381859 8869141 10596256 10567728 10918542 11459119 16784926
793A6784926J720066O270882L773314J4697465K4742655N7759237P5001348K3324992
$$ 16784926 18504992 24775874 28549188 43246653 67989308 125748545 200749893 224074885
785B24074885l8604831p1493588l8801471k1288054j3389972q495956k567760
$$ 224074885 185470054 113976466 75174995 53886941 40496969 32001013 29433253
778B9433253q236395r51208l983230j277571k00390j037398k09713l144912M266586
$$ 29433253 21196858 20245650 16262420 14984849 14784459 13747061 13537348 10392436 14659022
769A4659022M86035M73956p92865k466774l080378L88720L98897J97964j529643
$$ 14659022 15145057 15619013 14826148 12359374 9278996 9667716 10066613 10264577 8734934
760H734934k308337J583669q40539J504550j089849N08175k720040j94017K728196
$$ 8734934 6426597 8010266 7169727 8674277 7584428 8092603 5372563 5178546 7906742
751G906742k740365O69789n58631O56437O69839M45043k590004L51072j137652
$$ 7906742 5166377 5836166 5277535 5933972 6603811 7048854 4458850 4809922 3672270
742C672270L139973j682832N35098L31873k965332J780312j19587J87698J276276
$$ 3672270 6812243 5129411 5664509 5996382 3031050 4811362 4691775 4879473 6155749
733F155749j76503M19130l073682L029766o98998A894697M565828C056824O51552
$$ 6155749 5979246 6398376 3324694 6354460 5655462 1894697 6460525 3056824 3708376
724C708376K795415k318488o80374M943J956551B726906Q25976J207903L99767
$$ 3708376 6503791 4185303 3504929 3509872 5466423 2726906 3552882 4760785 5160552
715E160552B115260J652886p69989J773105k154575J134401J652394j317806o27887
$$ 5160552 2115260 3768146 2998157 4771262 2616687 3751088 5403482 4085676 3457789
706C457789Q27086o00750r30406K298069j4421k29756p3698j535315J08856O9687
$$ 3457789 4284875 3684125 2753719 5051788 5037367 4807611 4733913 3198598 3307454 3377141
696C377141j235326K752762k22045j820380K33488l37084J246981k79993j232509
$$ 3377141 2141815 4894577 4672532 2852152 3085640 2748556 3995537 3715544 2483035
687B483035o50215L304150k171985q15013J122647L541449C049931J98414l37105
$$ 2483035 1832820 5136970 2964985 2149972 3272619 6814068 3049931 3248345 2911240
678B911240J318610J009315j751164L65349O71197K75829C02063K547654A422686
$$ 2911240 4229850 5239165 3488001 3853350 4524547 4800376 302063 2849717 1422686
668B177155G50147J957715j03774L44663j39659I45328K450343n66921L15252
$$ 2177155 750147 2707862 2604088 2948751 2809092 945328 3395671 2828750 3144002
659C144002j342215J698357B53324J406517O84124r56447J906779p44854Q24829
$$ 3144002 1801787 3500144 253324 1659841 2343965 1387518 3294297 2549443 3374272
650C374272p43112f4539B425882l97963N1417P56253q25210J573982A329015K492264
$$ 3374272 2631160 -64539 2425882 2027919 2079336 2835589 2010379 3584361 1329015 3821279
640C821279j025955R08377L40086j065866A434734K573866j378368k69041n04236
$$ 3821279 2795324 3703701 4043787 2977921 1434734 4008600 2630232 2361191 1856955
631A856955a138149A972882J399674q37441k68540l68783o53444R60190E43273
$$ 1856955 -1138149 1972882 3372556 2535115 2266575 1897792 1244348 2204538 543273
621A943289K524290B208948j33205R52793A434578K511010j421799j095722J739169
$$ 1943289 4467579 2208948 2075743 3028536 1434578 3945588 2523789 1428067 3167236
612C167236j506928P10686k30987N99297k99832j00130A59561K907717J007634
$$ 3167236 1660308 2370994 2140007 2739304 2439472 2339342 159561 3067278 4074912
603D074912m21554j816897q25433J064853J149056A95298J640426M88049J81715
$$ 4074912 3653358 1836461 1011028 2075881 3224937 195298 1835724 2323773 2505488
594B505488N14676A121722P99002J010392J46529j511455R48656K537819k407579
$$ 2505488 3020164 1121722 1920724 2931116 3077645 1566190 2514846 5052665 2645086
585B645086L75274n43149R99523l47351L74613A301360O50075K039837r49698
$$ 2645086 3020360 2477211 3476734 3129383 3503996 1301360 1951435 3991272 3041574
576C041574l96710J126903A775305L16236E81318R04517J231769L53023o20662
$$ 3041574 2644864 3771767 1775305 2091541 581318 1485835 2717604 3070627 2449965
567B449965N0378Q17783p62324j64104J591127A290748L148037L52400m91140
$$ 2449965 2500343 3318126 2555802 2391698 3982825 1290748 4438785 4791185 4300045
558D300045M26289k036588p49542J845174O10793J299830J018959p25672J116833
$$ 4300045 4726334 2689746 1940204 3785378 4396171 5696001 6714960 5989288 7106121
549G106121q67028O1359J81492K518801k365681r81386L294150j020416K436331
$$ 7106121 6239093 6300452 6481944 9000745 6635064 5653678 8947828 7927412 10363743
540A0363743k082852J258587j665742L84280r77837J569255m012616n86696j081254
$$ 10363743 8280891 9539478 7873736 8258016 7280179 8849434 4836818 4250122 3168868
531C168868J105854j948864K860826k380920j003691J280626A423770j60671K456055
$$ 3168868 4274722 2325858 5186684 2805764 1802073 3082699 1423770 1263099 3719154
522C719154M06662A717061M12614q63021O62164A27226K156005O49310L29287
$$ 3719154 4125816 1717061 2129675 1266654 1928818 127226 2283231 2932541 3261828
513C261828M00165j656996F17310J818719Q52961O89836I85903N61297O43449
$$ 3261828 3661993 2004997 617310 2436029 3288990 3978826 985903 1547200 2190649
504B190649o28852A41502K055616P80960j252534N76900p55228p23594J458504
$$ 2190649 1561797 141502 2197118 2978078 1725544 2302444 1547216 823622 2282126
495B282126p8766b38159B880502a55485C432096j270430M90634H36641J34547
$$ 2282126 2203360 -238159 2880502 -155485 3432096 2161666 2652300 836641 971188
486I71188J368091O86608q79216j62902E40470J983858M70645N19641r26095P22297
$$ 971188 2339279 3025887 2146671 1983769 540470 2524328 2994973 3514614 2588519 3310816
476C310816j406211l16290O18661O39755r98683M85174E65576K216773p06930
$$ 3310816 1904605 1588315 2206976 2846731 1848048 2333222 565576 2782349 2075419
467B075419R33302a010195A048160L87391K402378j019001m45703J290458A361869
$$ 2075419 3008721 -1010195 1048160 1435551 3837929 2818928 2373225 3663683 1361869
457B486284q10508C38062J146502N65212n30845O84851G36910K755862A413251
$$ 2486284 1675776 338062 1484564 2049776 1518931 2203782 736910 3492772 1413251
447A408461j18755K59538l77623D90198K423107j309741o43904Q40840J206737
$$ 1408461 1289706 1549244 1171621 490198 2913305 1603564 959660 1800500 3007237
438C007237j431921n72976J085436l18063M73002k88632C72126Q57341J656189
$$ 3007237 1575316 1002340 2087776 1769713 2242715 1954083 372126 1229467 2885656
429B885656F88349P73068C60972J661428K54932K15882j210225R20354r47441
$$ 2885656 688349 1461417 360972 2022400 2277332 2493214 1282989 2203343 1255902
420A255902i39680A579380l39647J007357G76734P85124L70556q40112J377891
$$ 1255902 -939680 1579380 1239733 2247090 776734 1561858 1932414 1092302 2470193
411B470193n07376l62950o32037O07408j18530J049036n79070q69692J47045A69542
$$ 2470193 1962817 1599867 967830 1575238 1456708 2505744 1926674 1056982 1204027 169542
400A739266k46939r8780a37586r584A099220a576748D579997b58952A164928K76122
$$ 1739266 1492327 1393547 -137586 -147170 1099220 -1576748 4579997 -258952 1164928 1441050
390A441050j96376K57610K031350j757821K12930G52708J710917m37037A87858
$$ 1441050 1244674 1502284 3533634 1775813 1988743 752708 2463625 2026588 187858
380d44815A568984o04842q7434J538329e3125A269989F4077N52764Q19394j82425
$$ -444815 1568984 964142 876708 2415037 -53125 1269989 64077 616841 1436235 1253810
370A253810E73245P60177o33401K725077A29214J088356n3529R44944A4322J795670
$$ 1253810 573245 1333422 700021 3425098 129214 1217570 1164041 2108985 14322 1809992
360A809992J390319b43810A89079k9070J762119H22603b5987B518429l60909F94390
$$ 1809992 3200311 -243810 189079 160009 1922128 822603 -25987 2518429 2157520 694390
349A088594j26800P86270C53807i04989A119911n6353l17597B17668M036130F68721
$$ 1088594 961794 1748064 353807 -904989 1119911 1063558 745961 217668 4253798 668721
338B230533r40105K64364a051945H68025O72909o56405J98429K580074A787778
$$ 2230533 1290428 1554792 -1051945 868025 1540934 884529 1082958 3663032 1787778
328I0659L7942d56950A944732N76043H11112K256971q32259G21821A10576L20042
$$ 90659 128601 -456950 1944732 2520775 811112 3068083 2235824 721821 110576 430618
318D30618Q77207J89142B99340J31009K048727r26475C55019d52805F30057l05186
$$ 430618 1307825 1496967 299340 430349 2479076 1552601 355019 -452805 630057 324871
308C24871d78014J22458I18780J893443m03785A115979J644617M14202n28987
$$ 324871 -478014 -355556 918780 2812223 2408438 1115979 2760596 3174798 2645811
299B645811R11997I62681I3789D183K926220J874244j945001J632867l07704j350484
$$ 2645811 3557808 962681 93789 4183 2930403 4804647 2859646 4492513 4184809 2834325
289B834325q86492m74621J072134J374443r56116A334924q1198J521343j275286
$$ 2834325 1947833 1473212 2545346 3919789 2963673 1334924 1253726 2775069 1499783
280A499783M77961I61551l09455J27043J616948G55841J167027f57803B717132
$$ 1499783 1977744 961551 652096 779139 2396087 755841 1922868 -657803 2717132
270B310953m14711q85281C58510K168257a091148H00269l41052H9362b422520
$$ 2310953 1896242 1010961 358510 2526767 -1091148 800269 459217 89362 -2422520
260D38249J06849J450400A73557a422514A145873N80341J99654J601112D72284
$$ 438249 545098 1995498 173557 -1422514 1145873 1726214 1925868 3526980 472284
250A508076L80681D70754J935566a63138A927084p34246n88250a4233A085590
$$ 1508076 1888757 470754 2406320 -163138 1927084 1192838 604588 -14233 1085590
240A048522d8855o60012F61525J403598a228577C3608N05781K282268h77518A973354
$$ 1048522 -48855 -708867 661525 2065123 -1228577 33608 539389 2821657 -877518 1973354
229C564826a195529A105320a37979j828542C287729F39952e99573A345828B92505
$$ 3564826 -1195529 1105320 -137979 -1966521 3287729 639952 -599573 1345828 292505
219B189831a625430c60127H45146l04344A03392K378835e1158m13273A864667
$$ 2189831 -1625430 -360127 845146 540802 103392 2482227 -51158 -464431 1864667
209A268102M77823n69327A84985J77423K07656J826396A90899m0103K75765J58803
$$ 1268102 1745925 1176598 184985 362408 570064 2396460 190899 150796 426561 585364
199E85364A63120Q66760A9259M38030J111471G6663K658949j352282n85986J075859
$$ 585364 163120 1029880 19259 457289 1568760 76663 2735612 1383330 797344 1873203
189A873203e02939b7753l59737B87833A13587c11940G90155b96165A205720a526796
$$ 1873203 -502939 -27753 -387490 287833 113587 -311940 790155 -296165 1205720 -1526796
178A50993e02520B01196O96897m08970c07608j04750A155503b46463A414228N59316
$$ 150993 -502520 201196 898093 489123 -307608 -412358 1155503 -246463 1414228 1973544
168A973544G88278J844228A311245j15025R3158m19382b173887f17274a56437
$$ 1973544 788278 2632506 1311245 1196220 1289378 869996 -2173887 -617274 -156437
158a506866A441710J5579m28519k89015i97828r9986F05271a49B74823N00059
$$ -1506866 1441710 1457289 1028770 739755 -997828 -1097814 605271 -149 274823 774882
148G74882C36771K062222G49637J054445D43479A04032J055748c11866B012618
$$ 774882 336771 2398993 749637 1804082 443479 104032 1159780 -311866 2012618
138A46477J619943A15779L71105J731478j51596F73036a228768E43292a05082
$$ 146477 1766420 115779 486884 2218362 2066766 673036 -1228768 543292 -105082
128A781258a23180F79979k15166a350788a79786h3901G52324B62451M43122B95939
$$ 1781258 -123180 679979 464813 -1350788 -179786 -83901 752324 262451 705573 295939
117H41759j75122R5273J265194a62954A703802P43395m89825E79382f27225a94666
$$ 841759 666637 761910 2027104 -162954 1703802 2447197 1957372 579382 -627225 -194666
106C1893J102414i77497B70305a66335C100502A300654k17079f2294H69951J35953
$$ 31893 1134307 -977497 270305 -166335 3100502 1300654 1083575 -62294 869951 1005904
96A005904a372566D8905J689724F24694O849a267409d88441N5665A147109e57231
$$ 1005904 -1372566 48905 1738629 624694 631543 -1267409 -488441 -432776 1147109 -557231
85C60157h8503j570147g07652F28838a155529d77902G12086l45571D2440K78580
$$ 360157 -88503 -1658650 -707652 628838 -1155529 -477902 712086 366515 42440 321020
75C21020N23792a808507A367940a02718A099439l81534K381490A465682D41220
$$ 321020 844812 -1808507 1367940 -102718 1099439 717905 3099395 1465682 441220
65F87503K8033a126406D44973e69041o23262e60733F2267d53339B621726q54242
$$ 687503 715536 -1126406 444973 -569041 -1192303 -560733 62267 -453339 2621726 1767484
55A767484j12560l15142l4750h18060A024266b200896H07451g7618m20357B70433
$$ 1767484 1654924 1339782 1305032 -818060 1024266 -2200896 807451 -77618 -497975 270433
44A82818a05585j928740G79496B37306d04580H84921B71847J39458q897O78407
$$ 182818 -105585 -2034325 779496 237306 -404580 884921 271847 411305 402408 1080815
34A080815J109881F05976e56213H72390f22031h1581B93298J7505e51436A36764
$$ 1080815 2190696 605976 -556213 872390 -622031 -81581 293298 310803 -551436 136764
23b8634A61807J995116h77772B91827M24192h45389K89810D9536b053365i55530
$$ -28634 161807 2156923 -877772 291827 716019 -845389 -555579 49536 -2053365 -955530
12e82723C07402f4059D38752J574501B17896d3770k140537I74485Q7521P2911
$$ -582723 307402 -64059 438752 2013253 217896 -43770 -2184307 974485 1062006 1134917
2A134917C89964g10042
$$ 1134917 389964 -710042
##END=
