##TITLE=141740
##JCAMPDX= 6.0         $$ Bruker NMR JCAMP-DX V2.0
##DATA TYPE= NMR SPECTRUM
##DATA CLASS= XYDATA
##ORIGIN= NUTS EXPORT
##OWNER= Administrator
$$ 1.72 TOPSPIN		Version 2.1
$$ 2016-02-23 12:23:03.699 -0800  Administrator@X
$$ Compression mode = diff/dup
##.OBSERVE FREQUENCY= 90.275459
##.ACQUISITION MODE= SIMULTANEOUS (DQD)
##.ACQUISITION SCHEME= undefined
##.AVERAGES= 16
##.DIGITISER RES= 22
##SPECTROMETER/DATA SYSTEM= 
##.PULSE SEQUENCE= zg30
##.SOLVENT NAME= None
##.SHIFT REFERENCE= INTERNAL, None, 1, 14.41344
##AUDIT TRAIL= $$ (NUMBER, WHEN, WHO, WHERE, PROCESS, VERSION, WHAT)
$$ ##TITLE= Audit trail, TOPSPIN		Version 2.1
$$ ##JCAMPDX= 5.01
$$ ##ORIGIN= Bruker BioSpin GmbH
$$ ##OWNER= Administrator
$$ $$ E:/data/jwist/nmr/1740/1/pdata/1/auditp.txt
$$ ##AUDIT TRAIL=  $$ (NUMBER, WHEN, WHO, WHERE, PROCESS, VERSION, WHAT)
(   1,<2016-02-23 09:33:47.402 -0800>,<Administrator>,<X>,<jcamp>,<TOPSPIN 2.1>,
      <fromjdx created from
       E:\data\jwist\nmr\uniandes\1740
       data hash MD5: 8K
       70 27 7E 87 63 90 AE 33 D8 C1 21 BA 8A 3E 75 FC>)
$$ ##END=
$$ 
$$ $$ hash MD5
$$ $$ 42 67 3D 63 D9 E1 F7 D0 17 E0 EE 96 F4 B7 D4 81
##$RELAX= 
$$ Bruker specific parameters
$$ --------------------------
##$DU= <E:>
##$EXPNO= 1
##$NAME= <141740>
##$PROCNO= 1
##$TYPE= <nmr>
##$USER= <jwist>
##$ACQT0= 0
##$AMP= (0..31)
100 100 100 100 100 100 100 100 100 100 100 100 100 100 100 100 100 100
100 100 100 100 100 100 100 100 100 100 100 100 100 100
##$ANAVPT= 1
##$AQSEQ= 0
##$AQ_mod= 3
##$AUNM= <au_zg>
##$AUTOPOS= <>
##$BF1= 90.275459
##$BF2= 400.02
##$BF3= 400.02
##$BF4= 400.02
##$BF5= 400.02
##$BF6= 400.02
##$BF7= 400.02
##$BF8= 400.02
##$BYTORDA= 0
##$CFDGTYP= 0
##$CFRGTYP= 0
##$CHEMSTR= <none>
##$CNST= (0..63)
1 1 145 1 1 1 1 1 1 1 1 1 1 1 1 1 1 1 1 1 1 1 1 1 1 1 1 1 1 1 1 1 1 1 1
1 1 1 1 1 1 1 1 1 1 1 1 1 1 1 1 1 1 1 1 1 1 1 1 1 1 1 1 1
##$CPDPRG= <>
##$CPDPRG1= <>
##$CPDPRG2= <>
##$CPDPRG3= <>
##$CPDPRG4= <mlev>
##$CPDPRG5= <mlev>
##$CPDPRG6= <mlev>
##$CPDPRG7= <mlev>
##$CPDPRG8= <mlev>
##$CPDPRGB= <>
##$CPDPRGT= <>
##$D= (0..63)
0 1 0 0 0 0 0 0 0 0 0 0 0 0 0 0 0 0 0 0 0 0 0 0 0 0 0 0 0 0 0 0 0 0 0 0
0 0 0 0 0 0 0 0 0 0 0 0 0 0 0 0 0 0 0 0 0 0 0 0 0 0 0 0
##$DATE= 0
##$DBL= (0..7)
120 120 120 120 120 120 120 120
##$DBP= (0..7)
150 150 150 150 150 150 150 150
##$DBP07= 0
##$DBPNAM0= <>
##$DBPNAM1= <>
##$DBPNAM2= <>
##$DBPNAM3= <>
##$DBPNAM4= <>
##$DBPNAM5= <>
##$DBPNAM6= <>
##$DBPNAM7= <>
##$DBPOAL= (0..7)
0.5 0.5 0.5 0.5 0.5 0.5 0.5 0.5
##$DBPOFFS= (0..7)
0 0 0 0 0 0 0 0
##$DE= 6.5
##$DECBNUC= <off>
##$DECIM= 2432
##$DECNUC= <off>
##$DECSTAT= 4
##$DIGMOD= 1
##$DIGTYP= 12
##$DL= (0..7)
0 120 120 120 120 120 120 120
##$DP= (0..7)
150 150 150 150 150 150 150 150
##$DP07= 0
##$DPNAME0= <>
##$DPNAME1= <>
##$DPNAME2= <>
##$DPNAME3= <>
##$DPNAME4= <>
##$DPNAME5= <>
##$DPNAME6= <>
##$DPNAME7= <>
##$DPOAL= (0..7)
0.5 0.5 0.5 0.5 0.5 0.5 0.5 0.5
##$DPOFFS= (0..7)
0 0 0 0 0 0 0 0
##$DQDMODE= 0
##$DR= 22
##$DS= 2
##$DSLIST= <SSSSSSSSSSSSSSS>
$$ [...]
##$SPOFFS= (0..31)
0 0 0 0 0 0 0 0 0 0 0 0 0 0 0 0 0 0 0 0 0 0 0 0 0 0 0 0 0 0 0 0
##$SUBNAM0= <"">
##$SUBNAM1= <"">
##$SUBNAM2= <"">
##$SUBNAM3= <"">
##$SUBNAM4= <"">
##$SUBNAM5= <"">
##$SUBNAM6= <"">
##$SUBNAM7= <"">
##$SUBNAM8= <"">
##$SUBNAM9= <"">
##$SW= 20.5580556627758
##$SWIBOX= (0..15)
0 0 3 4 0 0 0 0 0 0 0 0 0 0 0 0
##$SW_h= 8223.68421052631
##$SWfinal= 0
##$TD= 65536
##$TD0= 1
##$TE= 300
##$TE2= 300
##$TE3= 300
##$TEG= 300
##$TL= (0..7)
0 120 120 120 120 120 120 120
##$TP= (0..7)
150 150 150 150 150 150 150 150
##$TP07= 0
##$TPNAME0= <>
##$TPNAME1= <>
##$TPNAME2= <>
##$TPNAME3= <>
##$TPNAME4= <>
##$TPNAME5= <>
##$TPNAME6= <>
##$TPNAME7= <>
##$TPOAL= (0..7)
0.5 0.5 0.5 0.5 0.5 0.5 0.5 0.5
##$TPOFFS= (0..7)
0 0 0 0 0 0 0 0
##$TUNHIN= 0
##$TUNHOUT= 0
##$TUNXOUT= 0
##$USERA1= <user>
##$USERA2= <user>
##$USERA3= <user>
##$USERA4= <user>
##$USERA5= <user>
##$V9= 5
##$VALIST= <valist>
##$VCLIST= <CCCCCCCCCCCCCCC>
##$VD= 0
##$VDLIST= <DDDDDDDDDDDDDDD>
##$VPLIST= <PPPPPPPPPPPPPPP>
##$VTLIST= <TTTTTTTTTTTTTTT>
##$WBST= 1024
##$WBSW= 4
##$XGAIN= (0..3)
0 0 0 0
##$XL= 0
##$YL= 0
##$YMAX_a= 1246813952
##$YMIN_a= -1375415.296
##$ZGOPTNS= <>
##$ZL1= 120
##$ZL2= 120
##$ZL3= 120
##$ZL4= 120
##$ABSF1= 10
##$ABSF2= 0
##$ABSG= 5
##$ABSL= 3
##$ALPHA= 0
##$AQORDER= 0
##$ASSFAC= 0
##$ASSFACI= 0
##$ASSFACX= 0
##$ASSWID= 0
##$AUNMP= <proc_1d>
##$AXLEFT= 0
##$AXNAME= <>
##$AXNUC= <off>
##$AXRIGHT= 0
##$AXTYPE= 0
##$AXUNIT= <>
##$AZFE= 0.1
##$AZFW= 0.1
##$BCFW= 1
##$BC_mod= 2
##$BYTORDP= 0
##$COROFFS= 0
##$CY= 15
##$DATMOD= 1
##$DC= 2
##$DFILT= <>
##$DTYPP= 0
##$F1P= 0
##$F2P= 0
##$FCOR= 0.5
##$FTSIZE= 0
##$FT_mod= 4
##$GAMMA= 1
##$GB= 0
##$INTBC= 1
##$INTSCL= 1
##$ISEN= 128
##$LB= 0.3
##$LEV0= 0
##$LPBIN= 0
##$MAXI= 10000
##$MC2= 0
##$MEAN= 0
##$ME_mod= 0
##$MI= 0
##$NCOEF= 0
##$NC_proc= -9
##$NLEV= 6
##$NOISF1= 0
##$NOISF2= 0
##$NSP= 1
##$NTH_PI= 0
##$NZP= 0
##$OFFSET= 14.41344
##$PC= 1
##$PHC0= 0
##$PHC1= 0
##$PH_mod= 0
##$PKNL= yes
##$PPARMOD= 0
##$PPDIAG= 0
##$PPIPTYP= 0
##$PPMPNUM= 2147483647
##$PPRESOL= 1
##$PSCAL= 4
##$PSIGN= 0
##$PYNMP= <proc.py>
##$REVERSE= no
##$SF= 90.2741578387789
##$SI= 8192
##$SIGF1= 0
##$SIGF2= 0
##$SINO= 400
##$SIOLD= 32768
##$SPECTYP= <>
##$SREGLST= <1H.CDCl3>
##$SSB= 0
##$STSI= 0
##$STSR= 0
##$SW_p= 1497.18866228788
##$SYMM= 0
##$S_DEV= 0
##$TDeff= 0
##$TDoff= 0
##$TI= <>
##$TILT= no
##$TM1= 0
##$TM2= 0
##$TOPLEV= 0
##$USERP1= <user>
##$USERP2= <user>
##$USERP3= <user>
##$USERP4= <user>
##$USERP5= <user>
##$WDW= 1
##$XDIM= 8192
##$YMAX_p= 1246813696
##$YMIN_p= -1375232
##$CURPLOT= <PDFCreator>
##$CURPRIN= <$PDFCreator>
##$DFORMAT= <normdp>
##$LAYOUT= <+/1D_H.xwp>
##$LFORMAT= <normlp>
##$PFORMAT= <normpl>
##$SURQMSG= 1
$$ End of Bruker specific parameters
$$ ---------------------------------
##XUNITS= HZ
##YUNITS= ARBITRARY UNITS
##XFACTOR= 0.182762287876938
##YFACTOR= 1
##DELTAX= -0.182762287876938
##NPOINTS= 8192
##FIRSTX= 1497.0059
##FIRSTY= -757760
##LASTX= 0
##MAXY= 1246813696
##MINY= -1375232
##XYDATA= (X++(Y..Y))
8191 -757760 592896 495616 -411136 -252928 -455680 25600 504320 872960 16896 60928
8181 60928 320512 180224 -100864 -450560 -628736 -242688 454144 -200192 -200192 -188928 -20992
8169 -188928 515072 -637952 139264 22528 -223744 231424 484352 417280 258560 336384
8159 336384 -110592 -736256 396288 -652288 -802304 396288 529920 858112 -379904 -637440
8149 -637440 -435200 621056 -333312 524800 -25088 361984 -176640 -624128 112640 620544
8139 620544 -52224 236544 195584 162816 -610304 41984 103936 337920 55296 538624 -756736
8127 289280 -581632 309760 19968 -323584 60928 -939008 459264 -1218560 -130048 -512512
8117 -512512 -303616 -78848 224768 806400 337408 -242688 -145920 734720 -317952 -48128
8106 -30208 451584 199680 93696 236544 -517120 342528 -959488 -790528 -159232 873984
8095 587264 -444416 491008 181248 885760 -493568 587776 -283648 906752 247296 -64000
8084 -192512 -69632 -41984 811520 832000 123904 124928 148992 2048 12800 -635392 -355840
8073 -355840 -1137664 -354816 -796672 79360 -1375232 167936 -995840 224768 429568 -165376
8062 -364544 -156160 -514560 571392 187392 -627200 282112 -881152 -824320 -524288 -133632
8051 199680 491520 240640 557568 297472 -173568 -989696 -13312 -104448 773632 374784
8040 1036288 4608 615424 1550848 384000 -740352 1307648 844288 -153600 -12800 -331264
8030 -331264 -390656 692224 419840 737280 -555008 -540160 447488 -408064 501760 346624
8020 346624 847872 1010176 788992 -1003008 78848 572416 -417280 864768 897024 133120
8009 201216 -780800 955392 1424896 593920 -272384 611328 822784 -79872 241664 452608
7999 452608 -335872 791040 -65024 231424 -955392 -193536 153088 -87552 -233472 -228352
7989 -228352 -203776 -85504 -28160 -195584 -370176 -374784 -761856 310272 302080 452608 -489984
7977 -155648 358400 603648 412160 -183808 -30720 -170496 243712 110080 137728 58880
7966 -291840 64512 -348160 268800 399872 743936 -36864 1180672 -308736 401920 485376
7956 485376 -669184 -410624 349696 -118784 -804352 377344 -1066496 125440 -559616 3584
7945 734720 -690176 420864 -596992 174080 -698368 -998912 140800 -218624 -224768 429568
7934 -410624 86528 -116224 -10240 -573952 -62464 1369088 9216 -542208 210944 342016
7924 342016 -168448 599552 354304 -722432 -334336 -204288 -236544 216064 -457216 794112
7913 -233984 -104960 -38400 -111104 277504 -278528 142848 -245248 -333824 -486400 867328
7902 -53248 -583168 -9216 -143360 1244672 -340992 614400 1092608 1193984 -364544 -695808
7892 -695808 636928 -499712 -538112 537600 -707072 -536064 378368 -571904 1200128 817152
7882 817152 1132032 534528 -510464 -240640 -61952 -595968 108544 -424448 -800256 339456
7871 -93184 -253440 196608 -269312 344064 -624128 91648 105472 -940544 253952 -196096
7860 -1174016 -235520 -809472 622080 -152576 758272 -1268224 -90112 207872 493056 -28160
7849 -138240 -70144 750080 -247808 -196096 332288 -255488 210432 503808 423936 -559616
7838 240640 1027072 399872 267776 -429056 -138240 702976 -207360 1014784 -438272 449024
7827 524288 -9728 437760 24576 40448 571392 456192 399360 -585728 176640 599552 -246272
7815 -258560 -807936 288768 -447488 705024 547840 -472064 -161280 -86528 75776 -516608
7804 226304 274432 -121344 642560 386560 249344 -186368 419840 496640 -15360 305664
7793 -492032 -193024 129536 -485888 699904 -475648 -253952 225792 -573952 -1044992 151040
7782 168960 54784 196096 156672 605184 30720 -406016 -645120 -194048 283136 326656
7772 326656 -510464 -316416 -4096 449536 283648 162816 51200 545792 701440 808448
7762 808448 226304 1218560 584704 -668672 -80896 370688 -559616 503296 -796160 731648
7751 312320 716800 -61440 1063936 332288 826368 -220160 773120 -10240 -485888 558592
7740 198656 -257536 -5120 486400 160256 1027072 189440 422912 842240 -216064 238080
7729 -356352 10752 -801792 -865280 -723968 -166912 730112 487424 -266240 82432 -752640
7718 -55296 -702976 -56832 372224 -205824 877568 -792064 727552 -123904 1513984 -287232
7707 189952 -372224 -403456 52224 -244736 1155072 -145920 742912 568832 1171456 -85504
7696 162816 677376 936960 29696 -400384 91136 -276992 8704 -7680 116736 -263168 25088
7684 769536 711680 -48128 -583168 -81408 499712 -63488 498688 -885760 870912 -888832
7673 -324096 -262656 -381440 -984576 -325120 -244224 -114688 449536 -64000 -293376 -26112
7662 570368 1111040 494592 338432 673280 245248 1032192 169472 1288704 -696320 -25088
7651 236032 387584 -673792 120320 -117248 878592 221696 -32256 544256 -583680 -359424
7641 -359424 -30208 502784 435712 -408576 370688 158720 888320 -25088 -374272 514560
7630 -150528 694784 -158720 -450560 422400 192512 288256 41984 414208 546816 -318976
7619 413696 -688128 -243712 402432 -695808 1837056 477696 729088 154112 -242688 -355328
7609 -355328 680448 940032 744960 274944 -527360 418304 -131584 300032 -34304 877568
7598 89088 -462848 -22016 281600 -151040 -1036800 396800 -219136 -494592 -286208 29696
7587 888320 -72192 435712 316416 211968 1039872 -590848 15360 448512 184320 -339968
7576 774144 1353728 -675840 632832 -296960 184832 -341504 -882688 -287232 346624 862208
7566 862208 -206336 324096 -122368 -537600 -404480 -297984 150016 -296448 -72192 -130048
7556 -130048 557568 -872448 30208 1064448 387584 239104 657408 634880 701440 131072
7545 574464 110592 82432 -20992 294400 714752 689152 -415744 -320512 303616 5120 258560
7534 258560 459776 594944 -449536 79360 325120 249856 459776 -216064 287744 -70656
7523 -96768 508416 -561664 241664 -79360 -907264 -762880 1351168 -1180672 643072 26624
7512 -285696 209920 -95232 179200 119296 491008 167424 96256 303616 -397824 -110080
7501 155136 418304 675328 -109056 1178112 494592 302592 247296 267776 -165888 555520
7490 122368 -4608 277504 239104 -676864 747520 834048 -652800 424960 755712 562688
7480 562688 716800 1523712 72192 360448 672256 -116736 -159744 922112 -600576 282624
7469 876032 749056 -649216 814080 175616 621056 -366080 419328 -77824 271360 165888
7459 165888 326656 464384 1335296 463872 906752 39424 112128 1282048 62976 -544768
7448 1073664 591872 680960 494592 614912 66560 100864 -458240 218624 747008 -152064
7437 1093120 1236480 1024000 896000 148480 87040 608768 445952 305152 13312 465408
7427 465408 133632 -856576 920064 375808 318976 1124864 666112 -272896 776704 1090048
7417 1090048 1065472 559616 280064 -510464 136192 57344 -136192 -425472 47104 364544
7407 364544 -35328 367616 371712 -690688 162816 81920 157696 -35328 -451072 315904 888832
7396 888832 255488 157184 984064 410624 1115136 902144 -532992 -155136 157696 -147968
7385 -957952 623616 1120256 254464 -222208 -50176 50688 832512 -540160 1210368 415232
7374 573440 353280 -637952 155648 356864 134144 585216 -530944 -126976 -143872 432128
7363 376320 1028096 -176128 -793088 -213504 675840 -536576 -509952 -299008 -246784 -283136
7353 -283136 436736 420864 -79872 218112 547328 198656 -428032 -334336 -2560 -346112 141824
7341 -515072 1155584 -463360 149504 -176128 -252416 221696 445952 18432 18432 620032 293888
7329 614912 262144 743936 1159680 187392 -99840 -141824 299520 498176 -33792 318464
7318 -230912 461312 384000 -152064 680448 398848 -648704 1140736 773120 -336384 352768
7307 -608256 -230400 729600 -829952 -299520 687616 -198656 885760 383488 751616 227840
7296 799744 -318976 -169984 873472 242688 867840 -38400 188928 446976 -169984 771072
7285 874496 -312320 -108544 -820224 219648 1285632 -719872 -440320 524800 82432 88064
7275 88064 -220672 -68096 488960 67072 90624 -548864 -197120 689152 132096 1024 755712
7264 755712 364544 27136 448000 806400 -610304 -631296 -117248 93184 578560 484352
7254 484352 565760 57856 698880 -1277440 -102912 530944 1118720 551936 -68096 327680
7243 -882688 629248 214528 30208 -99840 246272 697856 153600 371712 -505856 612864
7232 -833024 1034240 -355328 -150016 -237056 0 1158656 80384 912384 626176 1136128 -336896
7220 -448512 -260608 -117760 310272 1136640 785408 619520 620544 227840 711168 -842752
7209 589312 764928 382464 16384 369664 556544 -19968 79360 -497152 622592 641024
7199 641024 266752 1224192 117248 -182784 537088 866304 961536 359936 -900096 330240
7188 -204288 -95744 1163776 382976 624640 -210944 416256 603136 458240 653824 -92160
7177 416256 -253952 87040 -79872 -335360 193536 -287744 199680 -152576 -434176 -656896
7167 -656896 -967680 668672 -77824 839168 881664 418816 377856 -586240 -81408 881152
7156 750592 907776 230912 174080 840704 -229888 -89088 1020416 25088 757248 -138752
7145 86528 735232 -330752 397824 181248 -735744 942592 197120 -365056 606208 1262080
7135 1262080 675328 409600 -154624 -320000 87040 538112 -519680 911872 509440 69632
7124 433152 113664 402944 165376 378880 50176 527872 -342016 -405504 797184 15360
7113 223232 264704 725504 1211904 802304 -973312 1056768 292352 -463872 -369152 477184
7102 279552 -293376 189440 439296 313856 596480 165376 806400 155648 678400 660480
7092 660480 356864 765952 357376 -213504 235520 -253952 187904 535552 563200 107520
7081 163328 1005056 -628736 -72704 1250304 387072 -1110016 492032 -421376 355328 -566784
7070 190464 174592 -279040 -41984 -260096 988160 694784 -825344 1026560 908288 303104
7059 -215552 395264 1128960 496640 298496 -108032 1202176 93184 370688 1035776 -186368
7048 643072 -754176 36864 -593920 609280 -148992 788992 816640 445952 -113152 -283136
7038 -283136 670720 1197056 -331776 150528 -201216 159744 29696 914944 3072 530944
7028 530944 71168 171520 -391680 -467968 -451584 772608 -707584 75776 -606720 327168
7017 -887808 817152 861184 22016 788992 216064 -644608 249344 -184832 -10752 190976
7006 246784 -404480 -417792 316928 164352 670208 357376 301056 1072128 114688 -208896
6995 216064 447488 539648 -261632 -239616 974848 -348160 -116224 382976 563200 731136
6985 731136 -179200 670720 836096 192512 -58368 111616 -66560 -145408 332288 -153088
6974 -378368 1074176 660480 -835072 313856 1029632 218624 397824 -143872 -224768 -152064
6964 -152064 -1065472 782336 505856 342528 403968 718336 392704 -129536 70144 313344
6954 313344 352768 509440 -292352 147456 598016 -188416 1203200 -345088 747008 -135168
6943 669696 251904 421376 413696 365568 336384 129536 -688128 276992 -38912 107008 -168960
6931 766976 -8704 494592 423936 100864 910336 -476672 -381952 1405952 -245760 -93184
6920 1035264 232960 49152 336384 -259584 1014784 1330176 -290304 -14336 31232 -475136
6909 -208896 109056 569344 421888 690688 886784 942080 -59392 6656 746496 -204800
6898 -287744 467968 361472 814080 959488 274944 299008 91136 397312 -399360 244736
6887 1029120 -240128 888832 743424 248832 -237056 1065472 600064 -982528 208896
6877 352256 74240 -385024 580608 -461824 366080 260608 -75776 -374784 983040 796160
6867 796160 339456 391168 414208 213504 -264704 159232 -479232 1101312 854528 868352
6857 868352 787456 -33792 1291264 484352 -135168 357888 343552 -176640 768512 415232
6847 415232 -507904 951296 415232 645632 1254912 150016 -372736 18432 1538048 -87040
6836 327680 268800 609280 -241664 379392 133120 1271296 520192 1186304 525312 428032
6826 428032 256000 307200 -172544 852992 361472 -834560 1340928 179712 767488 435712
6816 435712 678912 647168 662528 -76800 345088 497664 -378880 325632 786944 -28672
6805 -617984 870400 334336 25088 -467968 698368 -279040 -199680 -273408 -25088 708096
6794 991744 44032 -460288 358912 -178688 -452096 925696 811008 226304 960000 297472
6783 142848 -74752 -307712 470016 520192 -272384 292352 1353728 750080 -28160 -142336
6773 -142336 145920 1313280 732160 977920 532992 196608 -112640 -778752 624640 2048
6762 1615360 -594944 131072 38912 653312 628736 1185792 313856 200192 247296 936448
6752 936448 299008 -137728 357888 578560 1032704 65536 1091584 -70144 56832 467456
6742 467456 920576 583680 1105920 -582656 -396288 340992 389120 112128 870912 83456
6731 161280 1120256 -381952 404480 265728 1169920 575488 1503744 669184 212992 209920
6721 209920 172032 983552 -714240 565248 -600576 1084416 1028096 -492032 164352 -749568
6710 412160 -450048 1421824 -144896 1375232 12800 -219648 700928 1263104 186880 720384
6700 720384 1257984 -25600 383488 2048 -596480 721408 929280 -334848 652288 850432
6690 850432 1034752 417280 -302080 214016 -606208 1138688 355328 794112 48640 658944
6680 658944 690176 1162752 817664 242176 -102400 398336 728576 1046016 78336 215552
6670 215552 381952 -724480 566784 -224768 -32256 88064 1364480 241152 -428032 441856
6659 518144 94208 -14848 -1321984 640512 1409024 68608 562688 841728 437760 135168
6648 -95744 -934400 323072 479744 144896 -130048 -358912 660992 981504 1181184 -51200
6637 -510976 -437248 338432 341504 490496 617472 1183232 654848 2312192 391168 1406464
6627 1406464 332288 50688 280576 -379392 563200 635904 117760 -116224 -335360 578048
6616 961024 -439808 252928 323072 1001472 2171392 -431616 282624 723456 549888 919552
6606 919552 955904 899584 101888 732672 624128 72704 450560 819200 736768 -20992 1053184
6594 143360 228864 248320 472064 752128 -232960 361984 377344 21504 -72704 34816 -395264
6582 746496 175104 668672 52736 972800 258560 321536 -415232 712704 1244160 431104
6571 1972736 991744 -693760 626688 338432 177664 -101376 200192 473600 -68608 264704
6560 167936 1382400 -377344 -84992 308736 371200 850944 88064 839680 -766976 37888
6549 -202240 -30208 1196544 1380864 376832 25088 217600 354816 1022976 463360 44544
6538 1381888 775680 741888 606208 159744 834560 239616 185856 332288 574976 699904
6528 699904 803328 260096 -1192960 928256 1234432 537088 1148928 1311232 -86528 611328
6517 1093632 297984 819200 494592 -769024 524288 308224 548864 -86528 1224704 361984
6506 117760 525824 705536 1528832 638976 405504 434688 1282560 -29696 -520192 317440
6495 1411584 -81408 963584 -549376 559616 463872 729600 399872 996864 6144 1131520
6485 1131520 335360 -151552 761344 781824 1032704 820224 572416 233984 -82432 1096192
6474 217600 431616 480256 501760 891392 881152 -26112 1396736 451584 302080 608256
6464 608256 282112 1106432 692224 -611840 710656 374784 696832 1042432 824320 -11776
6453 -301568 1084928 -279552 779264 955392 47104 619008 -342016 366080 173056 -60928
6442 -500224 558592 47104 94720 307200 1184256 278016 421888 661504 844800 -61440
6431 506368 757760 242688 1026048 596992 -963072 1089024 777216 -12800 -512512 194048
6420 -199680 1313280 -837120 1138176 801792 753152 524800 -28160 -52224 -17920 249344
6409 150016 1617408 571904 588800 467968 542208 -251392 189440 543744 622592 672256
6399 672256 673280 -31232 -396288 467968 524800 420352 -17408 11776 939520 418304 247296
6388 247296 -658432 272384 432128 644096 568320 -97280 517120 458240 285696 809984
6378 809984 292352 1199616 1082368 556032 1048576 168960 871424 954368 -92672 996352
6367 657408 694784 -512 690688 683008 1267200 172032 97280 887808 -414208 -388608 -88576
6355 1341952 863232 891904 858624 101888 -190976 153600 121856 1618944 -219648 301056
6344 804352 403968 929280 636928 1679872 -221696 608768 990720 300032 984576 645120
6334 645120 906240 195584 1011712 880640 51200 1009664 1536512 217600 1164800 695808
6324 695808 563712 1313792 164864 981504 793600 1106432 154112 -663552 52224 1051136
6314 1051136 391680 954368 1045504 -356352 965120 182272 310272 -311296 -439808 -96256
6303 174080 1241088 395264 1277440 -145408 582656 -251904 268288 1163264 337408 -107008
6292 -390144 -11776 1227264 247296 953856 537088 -144896 -438784 638976 546816 1089536
6282 1089536 520192 -364544 507904 61440 220672 981504 875008 -13312 -162816 429056
6271 785408 -76800 828928 -481792 -3072 175104 8704 916480 974848 675840 1051648 822272
6260 822272 862720 -601088 446976 143872 112640 603648 1412096 396288 537088 -116224
6249 996864 208384 -31232 411136 586752 848896 875520 956416 591872 438784 454656
6239 454656 351232 -266240 714240 -76800 812544 305152 540672 899072 1637888 263168
6228 820224 815616 1111552 233984 519680 -229376 -196096 -265216 -567808 252928 -353280
6217 1432576 433664 77824 2053120 2136576 399872 738304 645632 787456 233472 1188864
6207 1188864 429568 454656 -151552 350720 465920 485376 963584 296960 505344 -55808
6196 -178688 5120 236544 -11776 502784 534528 375808 489984 -75776 398848 351232 186368
6185 186368 941056 641024 565248 753664 -550400 692224 -489472 1187328 370688 508928
6175 508928 891904 239104 230912 367104 151040 1084928 -264704 763904 -246272 -430592
6165 -430592 1211904 237568 506880 -239104 679424 288256 654336 529920 586752 -15360
6154 1089024 161792 889344 417792 1225216 543744 1139200 1664000 48640 -392704 416256
6143 1087488 833536 331264 840704 724480 960000 -306176 749056 642048 176128 -458240
6132 -15872 952832 793600 278528 282624 1391616 333312 748544 419840 -273408 -470528
6122 -470528 1093632 108032 665600 238592 473088 662528 2102784 379904 -561664
6112 1300480 1237504 730624 512512 987648 849920 774144 792576 613888 400384 833536
6102 833536 689664 230400 1501696 328704 -302080 360448 386560 888832 273920 599040
6092 599040 274944 849920 553984 227328 1656832 1444864 0 1136640 -58880 664064
6081 235520 208896 731136 136704 24064 1252352 1675264 350208 1060864 1341440 696832
6071 696832 828416 1083392 -28160 1519104 -109568 1253376 55296 359936 544768 -105984
6060 400896 920576 390144 -397824 577536 971776 639488 502784 331264 587264 189952
6049 925696 831488 411136 341504 132096 -49152 131584 261120 1223680 837632 898048
6039 898048 1541632 508416 990720 241152 804352 809984 843264 -35328 1268224 806400
6029 806400 297984 2015232 1055232 1117696 1396736 1381888 76800 1133568 521728 506880
6019 506880 588288 643072 241152 -24064 368128 1125376 -236544 601600 392704 -37376
6008 894464 1262080 626176 1313792 1172480 -220672 -50688 297472 916992 509952 901632
5998 901632 696832 -218112 711168 -436736 162304 242688 455680 745984 406528 1253376
5988 1253376 997376 14848 146432 934912 673280 831488 324608 1382400 60928 600576
5978 600576 1046528 766464 1453056 155136 227328 174592 -183808 518656 781312 125440
5967 1154560 584704 874496 -67072 197120 401920 342016 773632 1061376 738816 -92160
5956 766976 660480 135680 945664 143872 1760256 -154112 646656 504320 513536 1821696
5946 1821696 -43520 273408 726528 31232 1190912 913408 574976 1083904 934912 1801216
5936 1801216 1507328 1260032 380928 476160 -483328 102912 595456 839168 -82432 651776
5925 349696 695296 80384 750080 -495104 756224 -181760 641024 715776 14848 -237568
5914 412160 1463296 -658944 983552 368640 874496 624128 844800 1323008 619008 1493504
5904 1493504 189952 556544 580608 906240 734208 548352 -576000 659456 1161728 746496
5894 746496 443904 1383424 621056 1084928 848896 256512 574976 -53248 935424 1118720
5884 1118720 453632 1485312 522752 183808 -359936 -163840 1006080 922112 702976
5875 702976 893952 1166336 264192 500736 -378368 1190400 349184 1149440 506880 695808
5865 695808 258560 782848 244736 -22528 731136 780800 861696 607232 1211904 1027584
5855 1027584 265728 1434112 266752 1011200 955904 -159232 -145920 576000 559104 626688
5845 626688 1883648 -85504 593920 367616 536064 1022464 534528 769024 1222656 663552
5835 663552 1201664 621568 284160 1164288 2286592 468992 792576 225280 427008 434176
5825 434176 572928 1073664 601600 1101824 -44544 828416 1375744 899072 470016 395264
5815 395264 413696 736768 1915904 97792 1521664 1950208 441856 451072 1242624 -398848
5804 251392 701952 886272 610816 479744 480768 231936 282112 371200 1379328 818176
5794 818176 1224704 563712 83968 631808 198144 1478144 338944 896512 78848 1120256
5784 1120256 -59392 1439744 1500672 173056 201728 535552 1094144 566784 522752 755712
5774 755712 503808 156160 258048 -92160 951296 1073152 1062400 342528 1058816 1005568
5764 1005568 459264 1097216 284672 212480 235520 132096 278528 -2560 799744 -786944
5753 514048 978432 521216 304640 971264 1302528 592896 -57856 1272832 832512 1110016
5743 1110016 576000 38912 1525760 591360 574976 1110528 580096 275456 415744 955392
5733 955392 991232 768000 1729536 -128000 742912 219136 887808 157696 1337344 638976
5722 672768 411136 316928 618496 1259008 261120 385024 616960 953856 673280 735232
5712 735232 43008 1167360 53760 -81408 31744 484352 163840 215552 521216 171008
5701 -1052672 464896 1092608 477696 1017344 669184 494080 1055232 159232 993280 245248
5690 1984000 553984 417280 1556480 93696 782848 1522688 792576 1060864 803840 -125952
5679 1114112 613376 912896 919552 947712 524800 813568 1618432 1051648 1274880 140288
5668 253952 1408000 1303040 -619008 1036800 1519104 863744 931328 542720 1530368 -201728
5657 971264 1128960 689152 1013760 1374720 1567232 1146368 655360 677888 1027072 1240576
5647 1240576 1544192 1022976 873472 1757696 708608 766464 452096 1126400 388608 788480
5637 788480 1150464 651776 850944 649728 1329664 993792 1181696 1556992 926208 1734656
5627 1734656 1781760 1443328 1677312 1012736 1801216 1624064 1093120 516608 1099264 1854976
5617 1854976 1434624 1943552 1426944 1318912 1468416 1659392 935424 1073152 2189312
5608 2189312 1525248 1411584 404992 799232 1350144 1409536 1735168 931840 1160192 1161216
5598 1161216 1476096 1178112 556032 790016 722432 1042432 561152 1178624 1199104 1644544
5588 1644544 1200640 99840 1042432 327680 1008128 877056 1354752 777728 1395712 378368
5577 1839616 672256 1665536 1054720 1378304 973312 -388608 1385472 439296 651264
5568 651264 985088 833536 1182208 1645056 1001984 1169408 1333760 771072 1063424 1255936
5558 1255936 1161728 1247744 727552 886784 918016 1218048 1181696 1419264 326144 1586176
5548 1586176 678912 264704 592896 1284096 1325056 439296 272896 739840 943616 1498624
5538 1498624 640000 532480 1779712 1247232 727552 1030656 -236032 624128 1725440
5529 1725440 726528 1087488 1225216 1111040 735744 1686016 222720 1155584 1376768 1703936
5519 1703936 100352 886784 939008 1869312 1094144 1678848 761856 202752 722432 1567232
5509 1567232 1926656 899072 1497088 400896 559616 1393664 1168384 1690112 1594880 1065472
5499 1065472 1532416 634880 752640 918528 1252352 535552 1586688 2061824 1851392
5490 1851392 1443840 428544 691712 1191424 1196544 1241600 1734656 560128 798720 1149440
5480 1149440 1218560 1516544 1060352 386048 715264 973312 2948096 1449472 1176576
5471 1176576 916480 929792 1335296 353792 230400 1722880 940544 1805312 801280 2009088
5461 2009088 1106944 1531904 1897472 1466368 1578496 2292736 2690048 1522176 1909760
5452 1909760 2097664 572416 1331712 647680 1674752 1861120 1093632 1859072 1431552
5443 1431552 1356800 420864 1428992 1990656 1504256 1303552 1781760 1642496 437760 1259008
5433 1259008 726016 1729024 1872896 166912 1539584 400896 1356288 681984 1277952
5424 1277952 1122304 757248 1226752 1631744 1377280 1352704 1593344 2120704 1859072 663552
5413 905728 753152 1218560 9216 1446912 1334784 1323008 1330688 1130496 1360384 2221056
5403 2221056 725504 637440 2065920 764928 1817600 494592 1140736 1408512 593408
5393 339968 893952 1740288 1168896 1196544 776192 642560 582144 1189376 615936 1013760
5383 1013760 766976 295936 982016 1468928 1422848 520704 1948160 1542144 1043456 1637888
5373 1637888 1389056 1559552 1364992 808960 1188352 1042944 811008 1139200 30720 548864
5363 548864 1190912 1233408 1374208 1428480 709632 1165824 527872 1146368 321024 1708544
5353 1708544 484352 960512 1267200 1329152 1919488 1089536 461824 237568 1538560 1213952
5343 1213952 2044928 1090048 1220608 1408512 1362432 753152 242688 1005568 812544 984576
5333 984576 1803776 855040 1515008 1610240 668672 1179136 1677312 1514496 848384 1403904
5323 1403904 830976 125440 393216 1275904 1525248 1060352 553984 700416 1423872 844288
5313 844288 1171968 1146880 802304 1406464 1047552 534016 1178112 1435648 855552 1021440
5303 1021440 1778176 2071040 1174016 1256960 1280000 308224 709632 351232 605696 839680
5293 839680 1556992 1190912 650752 1839104 1024512 -227840 1155072 910848 958976 315392
5282 1584640 409600 1337344 964608 799232 1144320 1116160 1197568 300032 1465344 1643008
5272 1643008 958976 1485824 -450560 1164288 1883136 1212928 306688 613888 575488 944640
5262 944640 1940992 1504256 2392064 756736 887296 635392 1954304 1008128 638976 1658368
5252 1658368 1076224 1498112 1469952 1547264 565248 996864 1338368 523264 1166336 1619968
5242 1619968 671232 2197504 906240 932352 1239040 797184 1363456 1072128 103424 1064448
5232 1064448 162304 1718272 1700864 1261568 1362944 2067456 515584 1396224 1349120 1702912
5222 1702912 1448448 581120 1351680 1272832 965632 1704448 1341440 1410048 1491456 1295872
5212 1295872 1999360 749056 1282048 1245184 1185280 1347584 1527808 2126848 2332672 2320896
5202 2320896 3076096 3477504 3269120 2783744 1558016 1645056 2187264 2212864 2021376 1022976
5192 1022976 1971200 755200 1803264 827904 1662976 1182208 1250304 1191424 745984 1439744
5182 1439744 1294336 1781248 991232 2629120 1978368 1395200 1153536 1594880 1560064 686080
5171 1609728 1377280 637952 977408 979968 1709568 463872 890368 1314816 1180672 1906688
5161 1906688 1434112 2056704 919552 548864 514560 1222656 845312 1018368 2229248 1329152
5151 1329152 2566656 1253888 1131520 910848 1630208 1081856 1604608 353280 1745920
5142 1745920 772608 799232 1220096 1876480 819200 1499136 1181184 1672192 939008 413184
5131 812544 1899008 691200 1028608 1396224 994304 591872 991232 1365504 2082816 1500672
5121 1500672 2259456 945152 1391616 483328 694272 1171968 1429504 1162240 2983936
5112 2983936 2564096 1455104 1647104 1627648 896000 1116160 1168384 2398208 2214912 2054656
5102 2054656 1567744 409600 1314816 2042368 1165312 1264640 1690112 1343488 1202688 1219584
5092 1219584 1529856 1751040 1634304 2053632 1412608 1644544 1821184 2240512 2253824 873984
5081 1442816 1275392 2358272 812544 1442816 672768 379904 1654272 1233408 1325056
5072 1325056 1414656 1721344 1456640 657920 1782272 565760 1666048 1515520 2041344
5063 2041344 1643008 1551360 706048 1287680 2364928 1881088 1367552 1650688 1154048 2284544
5053 2284544 1462272 1050624 2482688 1614848 1662976 1412096 1696256 1427456 1569280 1748992
5043 1748992 968192 2008064 1397248 1589248 1583616 1626112 1344000 1274880 1263616 1138176
5033 1138176 1782272 1220608 1551360 2037760 1319424 1140736 1369088 1740800 764416 638976
5023 638976 1630208 1407488 1860096 2571264 331264 2384896 2221056 2186752 1942528 1003520
5013 1003520 1177600 2659840 2942464 1127424 2051072 1637376 1338368 1574912 1107456
5004 1107456 1686016 1632256 1744384 1884672 1703936 2366976 1532416 1405440 1603072 1848320
4994 1848320 1822208 1644032 1204224 1668096 1710592 1453056 1775104 1394688 2097664 1691648
4984 1691648 1365504 2304000 1212416 1568256 2387456 2165248 1184768 1279488 1257472 1693184
4974 1693184 1138688 875520 2075648 2265600 2580480 2156544 2130432 2375680 1699328 1501696
4964 1501696 1368064 2029056 2896384 3109376 3465216 2458624 3187712 2592768 3981824
4955 3981824 3769856 4118016 5885952 4951040 4199936 4391936 3719680 4119040 5530624
4946 5530624 3524608 1662976 2513408 1246720 2436608 1579008 515072 1714688 1064448
4937 1064448 1310720 2132992 277504 1238016 1150976 1640960 1235968 1440768 1714688 2750976
4927 2750976 1004544 1612800 766976 877056 1142272 1233408 1156608 2217984 1829376 1416704
4917 1416704 1112576 1953280 956416 1061888 2189824 1511936 979968 2350080 1599488
4908 1599488 1120768 1856512 752128 1495552 1636864 1611776 1475584 1808384 1706496 1982976
4898 1982976 1544704 1364992 2726400 2237440 1623040 1837056 1769984 600064 1211392 1642496
4888 1642496 2093568 2722816 1119232 985088 1979904 1942016 1375744 1626112 926720 2224640
4878 2224640 1094144 1334784 1695744 1800704 1121280 1616896 1391616 1654784 1828352
4869 1828352 316928 2468864 1155584 307712 1503232 1829888 898048 1034240 1517056
4860 1517056 2312704 1461248 1593344 2567680 1961472 1694208 1978368 2076672 2031104 973312
4849 1379840 1462272 1238016 1970176 1426432 1525760 1776128 2024960 1134080 2101248 1903104
4839 1903104 1442304 1257472 739328 1955840 1713664 2025472 1449984 1039360 2143232
4830 2143232 2289152 2243072 2856960 1699328 1414144 1298432 2244608 1940480 2288128 903680
4819 2007040 780800 1604096 1049088 2079744 1972224 1275904 1020928 1505280 1780224
4810 1780224 874496 2520576 2754048 2574336 1732096 2289664 1805824 2219520 2292224 2239488
4800 2239488 2974720 2641408 1546240 1801728 1676288 2600960 2286592 2216448 1356288 1718784
4790 1718784 2392064 2760192 1955840 1051136 2472448 1277440 1244672 2332672 1306624
4781 1306624 2525184 2022912 2659328 2333696 1972736 1789440 2368000 1757184 2544640
4772 2544640 2024448 1809408 1595392 2771456 1991680 2816000 2498560 2330112 3240960
4763 3240960 2600448 2652160 2436608 1805312 1894400 1880576 2404352 1071616 1870848 1681920
4753 1681920 1717248 2006016 2281472 2426880 1787904 2480128 2942464 2642432 2704896 2216448
4743 2216448 2244608 2022912 2002944 1947136 1869824 1929728 1622528 2472960 862208 1131520
4733 1131520 2367488 2508800 1480704 2593280 1879040 2120192 2092032 2255360 1481216
4724 1481216 2574848 2445824 3227136 2758144 1958400 2159616 2501632 1485312 1349120
4715 1349120 1932800 2691072 1759232 1740800 1840128 2492416 1815552 2958848 3444736 1656320
4704 2393088 2960384 2091008 2190336 2768896 2265600 3673600 3027456 2248704 2885632 3967488
4694 3967488 2877952 3300352 4088320 3495424 3308032 3470848 2365952 1383424 2772992
4685 2772992 3609600 3171840 3409408 3234816 2201088 2560000 2465792 2406400 2264064 2087424
4675 2087424 2079232 2638336 2356224 2900480 3106816 1770496 1610752 1737728 2724352 2548736
4665 2548736 2688000 2681344 1338880 1530368 2158592 2959872 1877504 2467328 3013120 2875904
4655 2875904 3284992 2923008 4039168 3807744 3458560 2565632 3394048 3474432 3046912 2885632
4645 2885632 2846720 2925568 2579968 2898944 3016192 2370048 2408448 1669632 1674240 1868800
4635 1868800 2279936 2436608 2313728 2375680 1504768 2643456 1796096 2451968 1877504 3224576
4625 3224576 2440192 2347008 1220608 2040320 2112000 1004032 1867264 1896448 1586176 894976
4615 894976 1650688 1872896 1509888 1903104 1281536 1756672 1556992 2265600 1843712 2176512
4605 2176512 2473984 1669120 2130944 3068416 1392640 2372096 2811392 1357312 2199040
4596 2199040 1408000 2066432 1368576 3391488 1941504 2891776 2186752 2362368 1675776
4587 1675776 1430528 2421248 1589248 1462784 1958912 2717696 1781248 2220032 1671680 3303936
4577 3303936 2652160 2385920 2744832 2619904 1926144 1994752 2892800 2496000 3452416 3067392
4567 3067392 3288576 2822656 2931712 3015680 2488320 2530304 3136000 4029440 3653632 3540992
4557 3540992 3228672 3702272 2394624 3605504 2379776 4581376 3447808 4082688 4241408
4548 4241408 4147712 3655680 3401728 3009536 2882560 3168768 3700736 2349056 2829312 2681344
4538 2681344 2101248 2308608 3109888 3304960 2600960 2851328 2940928 1184256 2454528
4529 2454528 3969024 2523648 1696768 2176000 2744320 2825216 2029056 1527808 3208192
4520 3208192 2387968 2165248 2148352 2557952 2537472 1953792 2119680 2282496 3104256 1873408
4510 1873408 2642944 2440704 3448320 2183168 2648576 3005952 2614784 2586624 1969152
4501 1969152 2648576 2978304 4212736 3137536 2777088 2306560 2638336 2359296 2864128
4492 2864128 2953216 2824192 2696704 2905600 2977280 3645440 2862592 2105856 2988544 3077632
4482 3077632 2814976 2621952 3569152 1935360 2744832 2480640 2034176 2084864 1739264 2326016
4472 2326016 2366976 3217920 2737664 2970624 2518528 2741248 2440192 2719232 2359808 2780160
4462 2780160 1294336 2418688 2904064 2111488 2467328 1804800 2907648 2882560 1896448
4453 1896448 1585152 2048512 3731456 2968576 2803712 3335168 2689024 3143168 3725312
4444 3725312 3136000 2871296 3333120 3128320 3849728 4614144 4730368 4158464 3884544 3684352
4434 3684352 3587584 2656768 2667008 2460672 2798080 3894784 2799104 2587136 3325440 3347456
4424 3347456 3285504 2711552 2945536 2949120 2613760 3117568 2956288 2677760 3289088 4580864
4414 4580864 4273152 2574848 4418048 2855424 3173376 3412992 3210752 3579392 3869184
4405 3869184 3256832 3543552 3562496 3318784 3110912 3957248 3062272 3991040 4544512 4175360
4395 4175360 4036096 4724224 3632640 4533760 5362176 4646912 5491200 4276736 3905024
4386 3905024 5050880 4691456 3521024 3356672 4142592 3966464 3551744 3674112 4104192
4377 4104192 3563008 4576256 4187648 4526080 4079104 3744256 3058688 4753920 4107776
4368 4107776 3359744 3591168 2165760 2630656 2846208 3378176 2518528 3351552 3486208
4359 3486208 2700288 2207232 3479040 2777088 2896384 3443200 2071552 3168768 2838528
4350 2838528 2071552 2839040 2535936 2826240 3720704 3043840 1959936 3235328 3072000
4341 3072000 2341376 3639296 3022336 3218432 2680832 2530304 2899456 2496512 2659840
4332 2659840 2490368 3146752 2498560 3512320 2525184 2703872 1923584 3500544 2615296
4323 2615296 2519040 2264064 3077120 2514432 3818496 2951680 3226624 2497536 2070528 2079232
4313 2079232 2959872 2161152 2805760 3506688 2677760 2730496 2360320 2677760 2456576 2279936
4303 2279936 2228736 1773056 2159616 1628160 2563584 2524672 2972160 1931776 2598912 1712128
4293 1712128 3037184 2472960 2063872 2659328 2429952 2519552 2546176 2364416 1492480 1913344
4283 1913344 2928640 2788864 2461184 3786752 3363328 2290176 3652096 1678336 3206656
4274 3206656 2084864 2804224 1888256 1664512 2324480 1597440 1802752 2678272 2272256
4265 2272256 2373632 3036160 2003968 2099712 3033088 1267200 3134976 2427392 2799104
4256 2799104 2193408 2987008 2561024 2685440 2842624 4355584 3501568 1883136 3113472
4247 3113472 3000832 2235904 2023936 3095040 1379328 2582016 3282432 3009536 2080768
4238 2080768 3020800 2114048 3105280 3534336 3767296 1492992 3126784 2337792 3169280
4229 3169280 3159552 3453440 3694080 2992128 3908608 3167232 3047936 2685952 2839552 3921408
4219 3921408 3468288 3323392 3057664 3389440 4944896 3778048 4327424 4045312 4045312 4175360
4209 4175360 3588608 4273152 4591104 4297728 3143680 3695616 4219904 3460096 3596288
4200 3596288 3146752 3364864 4163072 3513856 3714048 2912256 4150272 2919424 2806784
4191 2806784 2934784 2652160 3001856 2755584 3339264 4141568 3757056 2616832 3183616
4182 3183616 3765760 3373056 3811328 3693568 3524096 3378176 2593280 4496384 2558464
4173 2558464 2541568 4078080 3327488 2810880 3256832 3613696 3911168 3662848 3549184 3779072
4163 3779072 3541504 3844096 2841088 2642944 3015168 3388416 3054592 3969024 3826688
4154 3826688 3581952 3379712 3288576 3295744 3037696 3737088 4094464 4144128 4617216 4116480
4144 4116480 3808768 3638272 4297728 4489216 3571712 4443648 4981760 4425216 4395008 5459968
4134 5459968 5946368 5067264 5074432 5380096 3721216 4855296 4590592 5419520 5362176 5876736
4124 5876736 5288448 6444544 6604288 7061504 6352896 5822464 5700096 5860352 5312512
4115 5312512 6685184 6163456 5198336 5369856 5454336 4909056 6214144 5741056 6237696
4106 6237696 6001664 6985216 5822976 5506560 6785024 6625280 5764608 6567936 7220224
4097 7220224 7348736 11295232 7775232 6682112 8076800 6942720 8164352 7685120 8973312
4088 8973312 8595968 9368576 10068992 9387008 10561024 10655232 11761152 11287552 11674112
4079 11674112 10988032 11071488 11298304 11950080 13178368 11877888 12475392 13011456 13638144
4070 13638144 14731264 14102528 15200768 15549952 17559552 18445312 18806784 18541568 16824832
4061 16824832 13643776 12312576 9586688 8595456 6526976 6443520 4357632 5130752 4727808
4052 4727808 5323264 4742144 4337664 5275136 3705856 5062656 4837888 5493760 3827200
4043 3827200 4866560 4262912 4387328 4033536 4580864 4291072 4520960 4952064 5201920
4034 5201920 4439552 4341760 4823552 4635136 4377600 4250624 4612608 4428288 5134848 5401088
4024 5401088 4078080 5505536 4151296 3884032 4033024 3938816 3368960 4176896 4871680
4015 4871680 3677184 4579328 4048384 2850304 3398656 4849664 2771456 3707904 3420160
4006 3420160 3678208 3547648 3816448 4168704 3905024 3489280 2713088 3712000 3521024 3374592
3996 3374592 3424256 3766272 3861504 3506688 3908096 3462144 2938880 3447296 2796032 3148288
3986 3148288 5043712 3634688 4285952 3355648 3924480 4664320 4391936 4773376 4218368
3977 4218368 3259392 4319744 4036608 4277248 4042752 3545088 3874816 4483584 3657216
3968 3657216 4102656 3705344 2750464 3699712 4145152 2850816 3279360 3490816 3914752
3959 3914752 2951168 3595264 3554816 2960384 3248128 2120704 3733504 3603968 3718144
3950 3718144 3463680 3504640 4099584 3524096 3883008 2699264 3752448 2831872 3529216
3941 3529216 3983360 3936256 3238400 3602944 2933248 3170304 2624512 4521984 4003328 3486208
3931 3486208 2962432 3416064 2855424 3647488 4428288 2591232 4064768 3570688 4119552
3922 4119552 3198464 2982912 3301888 3460096 2196480 3572224 3155456 3416064 4047360
3913 4047360 2874880 3509760 3258880 4145152 4408832 3602944 3483136 3101696 3310592
3904 3310592 3123200 3861504 2914816 4155392 3607040 4537856 3172352 3427328 4618240
3895 4618240 3485696 3911680 4139520 3127296 3623424 3396608 3169792 4235776 3613696
3886 3613696 3777024 3826176 3877376 4345344 3822592 3438080 3825152 4007424 3353600 3182080
3876 3182080 3985408 3684864 3739648 4286976 4002816 3722752 3714048 4933120 4507136 4216320
3866 4216320 4530688 3378176 3999232 3879424 3784192 4238336 3428352 2965504 5274112
3857 5274112 3686912 5333504 4656640 5072384 4781568 4216320 3981824 4681728 4588544
3848 4588544 3897344 4469760 3923968 3456512 3935232 3296256 3733504 4328448 3694592 3265024
3838 3265024 4246016 3246592 5746176 4788736 4350976 4951552 4978176 4692992 4360192 5079040
3828 5079040 4826624 4528128 5347840 4036096 4548096 5231616 6142464 5316096 5572608
3819 5572608 5336576 5385728 4407808 5042176 3578880 5752832 5571584 5141504 5331456
3810 5331456 5290496 7047680 5865984 6894080 6656000 6610432 7439872 6983168 7170560
3801 7170560 7613952 7555072 6972928 6835200 6737920 7671296 7814144 8009728 9229824 8557056
3791 8557056 8134144 9601024 8431104 9383424 10069504 10032128 10831872 11158528 12077568
3782 12077568 13899264 14617088 15047168 14220288 15950848 16293888 16200704 16606720 17850880
3773 17850880 17426432 19352064 19228672 20615680 20137984 20460032 22106624 22489088 23956480
3764 23956480 23955968 25361920 25442816 26811392 28476928 29242368 28504064 26444800 22461952
3755 22461952 20321792 15491072 13259264 12395008 10617856 11143168 10040320 9420288 10201600
3746 10201600 10318848 10081280 9457664 9080832 9624064 8645632 8527872 7652352 7552000
3737 7552000 9139712 8446976 8003584 8267264 7525376 8136704 7608832 8199680 7366144
3728 7366144 7979520 8237056 7498240 7363584 8522752 7753728 8207872 8192000 8397824 8670208
3718 8670208 8414720 8845312 9650688 10338304 11579904 12007936 12049920 11532800 10529792
3709 10529792 9320448 8195584 8127488 7314432 7670272 7233536 6616576 6972416 7439360
3700 7439360 7081472 7247360 6946816 7211008 7811584 6614016 7812096 7813120 8179200 7940608
3690 7940608 7732224 6869504 6891008 8063488 6477824 6379520 6263808 7637504 7821824
3681 7821824 8627200 8919552 7862272 7267328 7115776 6966784 6223872 5874176 6113792
3672 6113792 6316544 5186048 6484992 6012928 5552640 5773824 6536192 7087616 7364608
3663 7364608 5801472 6140416 6043136 6975488 6757888 6945792 6175232 6469632 6648320 6204416
3653 6204416 6444544 6204416 6323712 5208064 6883840 6024704 7242240 7174656 6673408
3644 6673408 6688256 6684672 7022592 6718976 6431744 6847488 6476288 5469696 6520832 6985728
3634 6985728 6458368 7284736 6320640 6740480 6767104 7454208 6995456 7199232 6573568 5957120
3624 5957120 6766080 7202304 6669312 6948864 7382528 6795264 6545920 7127040 7544320 8059392
3614 8059392 8008192 6861312 6492160 6717440 7180288 7571456 6761472 7133696 6768128 6661120
3604 6661120 6897664 6630400 6749696 7537664 7227392 7990272 7262208 6525440 6942208 7572480
3594 7572480 7014400 8273408 8282624 7328256 8076800 9209344 8259584 8353792 7464448 8452608
3584 8452608 8978432 8175104 9332736 8179712 8684032 8999424 8796160 8074240 7855104
3575 7855104 9044480 8902656 9007616 8903680 9575424 9290752 9366016 8976384 8998400 7736320
3565 7736320 8811520 10158080 9679872 8817152 9694720 10210816 9462272 9561600 9602048 9166336
3555 9166336 9851392 10315264 9976832 9777152 11416064 10947584 10690560 10606080 10827776 10977280
3545 10977280 11182592 10664960 11331584 11104768 11407360 12452352 12061184 13216256 13664256
3536 13664256 13794816 12792832 14474240 13934592 13882368 15231488 14786048 14203904 14381056
3527 14381056 14405120 13498368 14967296 13585408 13643776 13275136 14370816 16047104 16131584
3518 16131584 17536512 16923648 16892416 17584640 17165824 17555968 18851840 18453504 19320320
3509 19320320 20954624 20931072 21727232 21914112 22134784 23476736 23688704 24129024 23866368
3500 23866368 26569728 26576896 26116096 27525632 28392448 30072320 30663680 31692288 33456128
3491 33456128 35491328 36158976 37382656 39026176 40762368 43365888 44246528 47122944
3483 47122944 49455616 52485632 54444544 58073088 62460928 67060736 72294912 79113216
3475 79113216 86385152 93745664 102681088 110598144 120109568 130155008 138866688 150728704
3467 150728704 162249216 175865344 191128064 210308096 230527488 256898048 286870528
3460 286870528 325114880 372772352 436895744 525299712 649982976 824340480 1035644416
3453 1035644416 1220997632 1246813696 1064870400 808616960 588107264 425915392
3447 425915392 313683456 235220480 182104576 145694208 119738880 100926976 86846976
3440 86846976 75387904 66650624 60543488 53318144 49644032 45411328 41269248 38844928
3432 38844928 37445120 35479040 34579968 31933440 31059456 29607424 27427328 26071552
3424 26071552 25299968 22778368 22974464 21071872 21534208 20114432 19816960 18292224 18237952
3415 18237952 17862656 16681472 16381952 15792640 15529472 15238144 14204416 14789632 13505536
3406 13505536 12420608 13214208 11740672 11957248 11936768 10402304 10892288 10948608 10497024
3397 10497024 11316224 10484224 10013696 9949696 10229760 9005056 9364992 9798144 9104896
3388 9104896 9005568 7682560 6474752 8590848 7376896 7826432 7453696 7165952 6893568
3379 6893568 5766144 5808128 5434880 4449792 5368320 5726720 5992448 5894656 5569536 4579328
3369 4579328 5580288 6008320 4104192 5519360 5591040 6039552 6135808 6742528 4976128
3360 4976128 6455296 5818368 5731840 6226944 5325312 5530624 5135360 5957632 5697024 5809152
3350 5809152 5835264 5916672 6519296 4995072 4956160 4662784 4157952 4407296 3914752 4874752
3340 4874752 5436928 5074432 5265408 5342208 5291520 4245504 4194304 4364800 2808832 4531712
3330 4531712 3885056 4421120 4801536 4139008 4669440 4291584 4167680 4941312 4264448 3724288
3320 3724288 3787264 4180992 4332544 4463104 3976192 3994112 3998720 3512320 4140032 4718592
3310 4718592 3336704 3431936 3956736 3353088 3720704 3699712 4200960 2766848 4020736
3301 4020736 3462144 3656192 2611712 4110848 4721664 4838912 3223552 4330496 3400192
3292 3400192 3107328 2800128 3614208 4000768 3229184 4030976 4300800 3183104 2861056
3283 2861056 3778048 3646976 2910720 3078144 3698176 3591168 3008512 3902464 3739136 2995712
3273 2995712 2947584 4315136 3230208 3889152 4919296 4567552 4346880 6083072 6775808
3264 6775808 7352320 7126528 8396800 8160256 6933504 5944832 5218304 6038016 5248000
3255 5248000 3497472 3220992 3424256 3786240 3047936 3034112 2923008 3982848 2830336
3246 2830336 3247616 3330560 3280384 2928640 3341824 2767360 3662336 3044352 3018752 3688448
3236 3688448 2477568 3973120 4516864 3911680 3765760 3748352 3615232 3396096 2697728
3227 2697728 2231296 3318272 3104768 3776512 3880960 3976704 3408896 4246528 3956224 4162048
3217 4162048 3881984 4669952 4638208 5422080 5261312 6586368 6284288 6771200 6895616 6996992
3207 6996992 7625216 7739392 8832512 7729152 8715264 8673792 8896000 8811008 10010624
3198 10010624 8505344 10712064 10293760 10409472 11722240 12460032 12104192 12381184 13663232
3189 13663232 12727296 13962752 15235584 15736832 14968832 14970368 16250880 16468992 16796672
3180 16796672 16669696 16506368 15802368 16572416 15721984 16720384 16505344 16456704 16224768 15764992
3170 15764992 16737792 16654848 17562112 17318400 17937408 18053632 17755136 19337728 18812416
3161 18812416 18858496 19125248 19735040 19800064 19740160 20618752 21151744 21222912 22203392 21731840
3151 21731840 22717440 23180800 24332800 24478720 25929728 24800256 23944704 20036096 18316288
3142 18316288 14952448 13103616 11452416 10049024 8415744 8591360 7753728 7787008 8198656
3133 8198656 7583744 7727104 6636544 6872064 7325696 5857280 6242304 6802432 5628928
3124 5628928 5443072 4995072 5684736 4891136 4470784 4652032 5869056 4986880 5673984
3115 5673984 5220352 5421056 6430208 4337664 5452288 4728832 5383168 4943360 4475392
3106 4475392 4821504 4915712 5326848 4772864 5602304 5254656 5605376 4682752 5842432 5182976
3096 5182976 4968448 6438912 5380096 5209600 5930496 5206016 4968448 5033472 5422080
3087 5422080 5065728 4451328 4751360 4875776 4734464 3924480 3347456 4940288 4577280
3078 4577280 3877376 4134912 4365312 4440064 4156928 4577792 4127232 4058624 5271040 3780096
3068 3780096 4551680 3911168 5028864 4485120 4103680 4548608 4544512 4660224 4292096 4684800
3058 4684800 4357632 5570048 5949440 5173248 6000640 5579776 5285376 5809664 5459456
3049 5459456 6217728 5969408 5911552 7172096 6481408 6807040 7723008 8493568 8028160 8934912
3039 8934912 10160640 11127296 15486464 21213184 25090560 20332032 19210752 24481792
3031 24481792 19471360 11104768 6853120 6851072 6045184 5436928 4720640 5770240 4705792
3022 4705792 4237824 5096960 4605440 4992512 5571584 4361216 4531712 5000192 4392448
3013 4392448 4136448 4005376 4855808 2988032 3969536 4891648 3668480 3833856 4823040
3004 4823040 3888128 4262912 3450368 3484672 4278272 3857408 3967488 4521984 4835328 4419584
2994 4419584 3856384 3258368 3606016 3130368 4267008 4017152 4034048 3583488 3008000 4296704
2984 4296704 4041728 3261440 3824640 4095488 3928576 3224064 2983424 3531264 3266560 3628032
2974 3628032 3334656 4716032 3851264 3248640 3732480 3619328 3334656 3724288 4374016
2965 4374016 3868672 4138496 3273216 4089344 4163072 4232704 3342848 5019136 4531200 5407232
2955 5407232 3018240 2446336 5184512 3450368 4250624 3960320 3975680 3369472 4254720
2946 4254720 4169216 3523072 3535872 4291584 3336704 4039168 4393984 4015104 2650624 3898880
2936 3898880 4858880 5363200 3599360 4125696 4059136 4868096 3921920 5050368 3946496
2927 3946496 4508672 4967936 3218432 3028992 3189248 4532224 3397632 3734528 4457984
2918 4457984 4700672 5224448 3868672 4458496 4882432 4358144 3529728 3268608 3601920
2909 3601920 5263360 4693504 3597824 4229120 4130304 4562944 4826112 4471296 4443136 4629504
2899 4629504 4583424 3346432 4306432 3543040 5145600 4822016 5059072 4039680 4062720
2890 4062720 3080704 5225472 3893248 4140544 5231616 4385792 4078080 5134336 4868096
2881 4868096 5041152 4998144 4956160 4518912 4511232 4765696 4927488 4840960 5729792 5370880
2871 5370880 5600768 6095872 6607360 7269888 6452736 8200704 8515584 9317376 9879552
2862 9879552 8972288 10971648 12084224 11402752 11107840 12659200 12144640 13372928 12407296
2853 12407296 13737984 13718016 13757440 15170048 13539840 14661632 15952384 15511552 16689664
2844 16689664 18012160 19761664 21342720 22550528 22464000 20865024 18108416 15428608
2836 15428608 13494272 11856384 10687488 9681920 7834112 6931456 8414720 9142784
2828 9142784 7485952 7510016 6820864 7730688 8882688 7811584 8847360 8736256 9871872
2819 9871872 11155968 15816192 26515456 44209152 31241216 15789568 10215936 8919040
2811 8919040 6974976 6057472 5755392 5469696 3996160 4941824 5080064 4755968 3600384
2802 3600384 4690944 4048384 3666432 3931648 4211712 3324928 3607552 4290560 3467776
2793 3467776 3794432 4422144 4036608 3910144 3573248 3707904 4483584 4027904 3721728 4710912
2783 4710912 4230656 3365888 4491776 2753536 4225536 4371968 4995072 3585536 4018688
2774 4018688 4550656 3283968 3847680 3259392 4292608 3940864 4064256 3484160 3528192
2765 3528192 3492352 4273664 3950080 3359744 4076032 3654144 3747840 4365824 3621376 3552256
2755 3552256 3953152 3767808 4182016 4406272 4526592 3268608 5179392 4182016 4727296
2746 4727296 4329984 5665280 5522944 5526528 4617216 6329856 5368320 6337024 6876160 7494656
2736 7494656 7031808 7497728 9500160 9385984 9914368 10943488 12049920 16244736 23477760
2727 23477760 39947776 57833472 37412352 20864512 16081920 12548096 10952192 12719616
2719 12719616 13408768 19075072 31476224 33985536 17757696 13722624 12795904 12585984
2711 12585984 12410368 16276480 24262144 40932352 44804608 23678464 15101952 11344384
2703 11344384 11094016 10994688 12639744 17317888 28004352 31369728 16210432 11836928
2695 11836928 7881216 7230976 6117888 7030784 10607616 13644288 16582144 8988160
2687 8988160 5822464 5421568 4311040 4088320 3676160 2485248 3718656 4730368 3751936
2678 3751936 3601920 4761600 4426240 3240960 3921408 4417536 5084160 5171712 5193216 5393408
2668 5393408 6249984 5808640 5822464 6045184 6510592 5604864 4399104 5403648 3501056
2659 3501056 3821056 3723776 4142080 5011968 3704832 4300800 3260416 2926080 2592768
2650 2592768 2363904 2313728 1806336 2390016 2240512 3057152 2590208 2476032 2078720 1139200
2640 1139200 2212352 1980416 2651136 2357248 2663936 1832960 1930752 1465856 2093056 1025536
2629 2079232 2183680 1519616 2874368 2803200 1906176 2471424 1586688 1977344 1620992 1330176
2619 1330176 2442752 1552384 1581056 1895424 1528832 1929728 2467840 2235904 2223616 1583104
2609 1583104 2365952 2357760 2358784 1858048 2425856 1555968 699392 1280512 1065472 1252864
2599 1252864 2112000 2068480 2766848 2667520 2082816 1617920 1519616 1408000 1967616 1588736
2589 1588736 2448384 2820096 3050496 2647040 2004992 2896896 2515456 3260416 2028032
2580 2028032 2486272 2589696 2619392 2824192 1661440 2059776 2230272 2381824 3248128 3557888
2570 3557888 2947584 2515968 2273280 3217408 2068992 2506240 2563584 2514944 3084800 2522624
2560 2522624 2540544 3384832 2808320 3395072 2506240 3101696 3120640 2529280 2609152 3999744
2550 3999744 3332096 2458624 2820608 3444736 2846720 3112448 3027456 2787840 2619904 2996224
2540 2996224 2905600 3304448 2909184 3205632 2229248 4260864 2822656 3867136 3807744
2531 3807744 3194368 2030080 2992640 2516992 2110464 2809344 2285056 2060800 2773504
2522 2773504 1942016 3374592 1958400 1740288 1888256 2012160 2262528 2253312 2944000 3291136
2512 3291136 1953792 2658816 2407936 2120192 2431488 2637824 2456064 2113024 3312128
2503 3312128 3170304 2827264 2755584 2341376 2414592 2053120 2384384 2642944 1712640 3154432
2493 3154432 1803264 1678336 2587648 2699776 2242048 2988544 3538432 2862080 4002304
2484 4002304 2306048 2717184 2813440 2930688 3197440 3502080 2851328 3112448 3405824 3441152
2474 3441152 3644416 3845632 3442688 3327488 3055104 3174400 3132928 2787840 2946048 3876352
2464 3876352 3510272 3874304 3682304 3896832 3412480 3752960 3370496 4089344 3112960 4609024
2454 4609024 3518976 3572224 4315136 4570624 4296704 4264448 4056064 4801536 5187072 3948032
2444 3948032 4615680 6124544 4231680 5251072 5251072 4328960 4072960 3828736 4749824 3578368
2434 3578368 3068416 3549184 4740096 3385856 3815936 5501952 4747264 4524544 3730432
2425 3730432 5194240 3799552 4527616 4816896 4122112 4294144 4632064 4151296 5078528
2416 5078528 5240832 4357120 4665856 3864064 3961856 4251136 4518912 2742784 4187136
2407 4187136 4390912 4463616 3100160 3062272 4639744 4215296 3445248 3859456 3880448 4169216
2397 4169216 3588608 3419648 3609600 3834368 3685376 3522048 4266496 4555776 4342784 3322880
2387 3322880 2783232 4354560 3552256 2216960 3825664 3614720 4914688 4632576 3799552
2378 3799552 2996736 3346432 4079616 4644864 4441088 4376064 4499968 4153856 3868160 3956736
2368 3956736 4999168 4193792 4079616 4333568 4421632 3510784 4747776 4636672 3990016
2359 3990016 3811840 4602368 4056064 4550656 4371456 3422720 3276800 4355072 5085184
2350 5085184 4670976 3901440 3985920 4361728 3342848 4550144 5249536 4205568 4887552
2341 4887552 4999168 4790784 4752384 5336576 5243392 5178368 5120512 5021696 5201408 6008832
2331 6008832 4688896 5431808 5069312 5303296 4827136 5715968 5705728 5937664 5022720 5660672
2321 5660672 4740608 5334528 4894720 4975104 4306944 4950528 5163008 4747264 4372480 3688448
2311 3688448 4080128 4584448 4171264 4476416 3668480 5386240 3861504 3932160 4382208
2302 4382208 3237888 3998208 3723264 3294720 4145152 4430336 4125696 3503616 4125696
2293 4125696 3987456 4230656 3831808 3539968 3290112 3189760 5197312 4560384 3851776
2284 3851776 3762688 4566016 3865600 4256256 5042688 3129856 4988928 5189632 3738112
2275 3738112 4550144 4826112 4738560 5070336 4324864 5110784 4875264 5406208 5511680 4426240
2265 4426240 5061632 5246464 4974080 6009344 5117952 5515776 6955008 5376000 6253056
2256 6253056 4688896 5645312 5013504 6080512 6212608 7768576 6791168 6962176 6838272
2247 6838272 6664704 7630848 7286272 6675456 6474752 6261248 6147072 7203328 6014464
2238 6014464 5947904 6022144 6146560 5348352 5829120 7299584 6824960 6215168 6334464 6625280
2228 6625280 6678528 6392832 6724096 6081024 6801920 7089664 6535168 6938624 6708224 6682624
2218 6682624 6104064 6935552 6062080 6416896 6613504 6287360 6913024 6802432 6824960 6488064
2208 6488064 6819328 6646272 6597120 6546432 7143936 6307840 5820928 5104128 4463104 5845504
2198 5845504 5443584 5435904 6476288 4695040 6355456 6110720 4682240 4864512 5341184
2189 5341184 5786624 5541376 5764096 6340608 5926400 6542336 7187456 5414912 5778944
2180 5778944 4970496 5475840 4624896 4890112 5597184 4596224 4423680 5386752 5130752
2171 5130752 5633536 5222912 5267968 5275136 4672512 4434944 5335040 4199936 4928512 5785600
2161 5785600 4786688 4338176 5421056 5352960 5553664 5281280 6734336 5425152 5641728
2152 5641728 4717568 5526016 6081536 5590016 6192640 6403072 6422528 6266368 6564864 6281728
2142 6281728 6264320 6216192 7074304 7232000 6225408 7010304 7665152 7401984 6005760 6726144
2132 6726144 7014912 7853056 8092160 7434752 7142912 8491008 7962112 8474112 8123904
2123 8123904 7592960 7612928 9117184 7648768 7781376 9345536 8820224 8094720 9615872
2114 9615872 9509888 10633216 9065984 10252800 9901568 8644096 9710080 8924672 9758720
2105 9758720 8604672 9808896 10242048 8697856 8998912 9475072 9738752 8762880 9829888
2096 9829888 10043904 8664576 9996800 8409600 9538048 8768000 9500160 8603136 8156672
2087 8156672 9302016 9526784 9530880 8973824 8790016 8598016 9562112 8203776 9401856
2078 9401856 9343488 10164736 8988672 9331712 8774144 9145344 10219008 9775616 9673216
2069 9673216 9313280 8275968 8952320 8532480 9415168 7351808 9568768 9920512 8474112
2060 8474112 9069056 9285632 10440704 10784256 10463232 13029376 18289152 28399104 34168320
2051 34168320 18491904 12430336 9278976 9475584 8578560 8646144 8169472 7220736 7065600
2042 7065600 7672832 7606272 7054336 7830528 7373824 7225856 7147520 7538688 8003584 7046144
2032 7046144 7332864 6835712 7905792 7001088 7602688 7651840 6886912 6392320 7164928 7366144
2022 7366144 6686720 7767552 7556608 7165440 8016896 6626816 6827520 6736384 7569920
2013 7569920 6888960 7652864 7300096 6306304 7456256 7320064 5619200 5243904 5141504
2004 5141504 4573696 5171712 5759488 5250560 5142528 4320256 4184576 3914752 4428800 4511744
1994 4511744 4860416 5103104 5192704 4808192 4920320 4240384 5287424 4694528 4229120 5770240
1984 5770240 4629504 4278272 4015104 5351936 4896256 5992960 4637696 5673472 4879872
1975 4879872 6880256 6073856 4813312 6091264 5252608 5784576 5328384 5246976 6334464
1966 6334464 5864960 5230080 5491712 4599296 5852672 4963328 4270080 5518336 4601344
1957 4601344 5223936 5735936 5517312 4760064 4979712 4933120 4755456 7090176 6052864
1948 6052864 5320192 5842944 5153792 4844544 6717440 5215744 6489088 6636032 5814784
1939 5814784 5815808 6947840 7635968 7398400 7159808 7833088 7944704 6949888 7458816 6949888
1929 6949888 7447040 7144448 7763456 7070720 8497152 8241152 8016896 7682048 8405504
1920 8405504 7374848 8115712 8915456 8019456 8445440 8163328 8885760 9461248 8986112
1911 8986112 9615872 10104832 9643520 10151936 9121280 10177024 10295296 9126400 10499584
1902 10499584 10289664 10788864 10478592 11463680 11832320 10976768 11473408 11756032 12293632
1893 12293632 11336192 12603904 11134976 11246080 10948096 10968064 10512896 10548736 10718720
1884 10718720 10839552 10696704 10294272 10398208 11237376 9546240 8883200 10680832 10362880
1875 10362880 9164800 9937408 9753600 10672640 9174016 10146304 9593856 9817088 10587136
1866 10587136 10611712 8637440 10013184 10060288 10458624 9845760 10098688 10288640 9498624
1857 9498624 9147392 9798656 9506816 8783872 9383936 8168448 8900096 9788416 8844800
1848 8844800 8677376 8256000 8920064 7536128 6756352 8058368 6878720 6742016 7601152
1839 7601152 6664704 7039488 6927360 6546432 7714304 7644160 7082496 7228416 7978496 6904320
1829 6904320 7889408 7016448 6330880 6444032 6572032 5998592 6144000 6820864 6164992 6627328
1819 6627328 6464000 5564928 6474752 6156800 7271936 5619200 7096320 6076928 6048768
1810 6048768 6993920 6562816 6380544 6322688 6877696 5586432 6206464 6611968 5806592 6974976
1800 6974976 7244800 7106560 6022656 6093824 7474176 5708288 7336448 6707712 7736832
1791 7736832 7586816 6910464 7505408 7177728 7949312 7803904 8680448 7478784 8454656
1782 8454656 8921088 8066048 8419328 8220672 9860096 8968704 8796160 8514048 9972736
1773 9972736 9615872 10314240 10550272 10235904 10177024 10909696 10560000 11101184 11149312 11500032
1763 11500032 11645952 12262400 12298752 12329472 11452928 13506048 13090816 13686784 14006784 15347200
1753 15347200 14908416 16466432 17381376 17432576 16844800 18480640 19896320 20199936 20998656
1744 20998656 22152704 22078976 23868416 24778752 25900032 26816000 28585472 28924416 30609920
1735 30609920 31723008 32285696 32454656 32856576 35352064 33464320 34755072 35799552 37971968
1726 37971968 37726208 39732224 40941056 43542016 44197888 45460480 48937984 50513408
1718 50513408 52892672 56565248 59755520 64095232 68370432 74968576 82160640 88413184
1710 88413184 96209920 100573184 100685312 97416192 92138496 86035968 78474752 68331008
1702 68331008 56476672 45601280 36798464 30209024 26269696 23090176 19934208 19035136
1694 19035136 17630720 15869440 14802432 14772736 12794880 13277184 12333568 12636672 11508224
1685 11508224 11563008 11089920 10403840 10909184 10619904 8854016 9111552 8372224 9141248
1676 9141248 8677888 8333312 8698368 7962624 7675904 7868416 7875072 6574592 7066112 6298624
1666 6298624 7261184 8150016 6242816 5985792 5521408 5374464 6232064 5795328 5416448
1657 5416448 5303808 5443584 5816320 5310464 4850688 4771328 4629504 5213184 5062656 5274624
1647 5274624 5181440 5995008 4020224 5026304 4038656 4558336 4050944 3670016 4276736
1638 4276736 4969472 4491776 3397120 5016064 3902464 4348928 3534848 3105792 2929152
1629 2929152 3998208 3187200 4443648 2731008 3750912 3100160 2980352 2840576 4049920
1620 4049920 3244544 2710528 3487744 3667968 4081152 4285440 4477952 3506688 3731968 3713536
1610 3713536 3145728 3638272 2624512 4388352 2379776 3671552 2449920 3287040 3387904
1601 3387904 3270144 3333120 3958784 2753536 3683328 3167744 3696640 4116992 3878400 3644928
1591 3644928 3848192 3856896 3601920 3717120 4161024 5314560 5002752 4148224 3925504 3374592
1581 3374592 4687360 4695552 5307904 5754880 5376000 5409280 5480960 5193216 5789184 5232640
1571 5232640 5468160 6239232 4887040 6876160 5895168 6600704 7203328 6628352 7094272
1562 7094272 8216576 8235008 9501184 9732096 11382784 11245056 12226560 11478016 10579968
1553 10579968 8237056 8195584 8084992 8640000 7266816 7193600 7934976 7606784 7816192
1544 7816192 6452224 7494656 8210432 8146432 8257536 7134720 7849984 7676416 8346624
1535 8346624 7074304 7068160 6890496 6804480 8401408 7073792 7180800 7223808 7979520 8883200
1525 8883200 8274432 8844288 9132032 10543616 10943488 11138560 11431424 11957248 11758592
1516 11758592 12424192 11754496 12438016 10285056 8667136 8957440 7705600 8066048 6555136
1507 6555136 5854720 5986304 6218240 6315008 5214720 5952512 6012416 7109632 5490688
1498 5490688 6172672 5876224 4644864 7083008 6483968 7790592 8343040 8514560 8500224
1489 8500224 8925184 9202176 9681408 8325120 9017344 7594496 7629824 7929856 5759488
1480 5759488 6554624 5081600 5520896 5186560 5134336 4453888 5112832 4214784 4472320 5166592
1470 5166592 4242432 3728384 3634176 4303872 3633152 4196864 2702336 3756032 3278336
1461 3278336 3984384 3924992 4856832 3628544 3409408 2308608 3087872 3521536 3863040
1452 3863040 3722240 3186688 2443264 3203072 2561024 2839040 3394560 3032576 3421184 3979776
1442 3979776 3097600 2730496 2177024 3467264 3042304 3394048 4272640 3817472 3418112
1433 3418112 3578368 2995200 3733504 3310080 3902464 3441152 3156992 3193344 3116544 3462656
1423 3462656 3501568 3826176 3786752 3679744 3342848 3087872 2849792 3198464 3700224 3302912
1413 3302912 3844096 3869696 4410368 3576832 3900416 4302336 4154880 3417600 3521536 4122112
1403 4122112 3716096 4659712 4442624 4615168 3488768 3189760 3942400 2868736 3884544
1394 3884544 2110976 3064320 3397632 1675264 2301952 3056128 1895936 2884608 3417088
1385 3417088 2849280 2577920 3047936 2169344 2720256 3165184 3269632 3335168 2061312 2949632
1375 2949632 1007104 2259968 1184768 1815040 1366016 1566720 2214400 1570304 1931264
1366 1931264 2132480 1225728 1188864 1883648 2246144 -22528 134656 2230272 2374656 1047552
1355 1518080 719872 778240 1444352 1764864 1578496 1751040 366080 979456 216576 1690624
1345 1690624 1408000 393216 800256 -318464 791552 1520640 1550848 2018816 1481216 796160
1335 796160 1254400 123392 1575936 1913344 1688064 759808 1183232 1461760 1389056 1731072
1325 1731072 1602560 133120 751104 494080 1055744 759296 547840 731648 179712 1373696
1315 1373696 1166336 862720 1063424 807936 1163776 754688 1032704 466944 1705472
1306 1705472 869888 291328 604160 174592 1539584 1467904 1291776 138752 1625600
1297 1625600 1181184 2412544 1401344 1317376 316928 644608 513024 -279040 1480192
1287 1322496 1168384 1177600 1317888 1174016 185856 396288 651264 1796096 1076736 1311744
1277 1311744 1331712 787968 1079808 1652224 949760 752640 1218560 125952 190976 484352
1267 484352 1236992 1275904 1456128 1620992 1368064 712192 984576 600576 774144 988160
1257 988160 1674240 1088000 601600 988160 1972224 667648 1936896 1310208 320512 2498560
1247 2498560 963072 1179648 1742336 954368 339456 162816 1210880 1057280 261120
1237 1488384 1243648 1083904 1081856 1008640 1173504 1528320 665088 436736 1232896 1446912
1227 1446912 1196032 1249280 1711104 445440 871936 1623552 868352 302080 1344512 1051136
1217 1051136 1590784 866816 854528 1441792 -287744 1381888 1604096 1197568 1244672 883200
1207 883200 919040 945152 260096 903680 -378880 1146880 764928 654336 690176 455168
1197 455168 1510912 89088 1164288 761344 1248256 1308672 314368 1219072 396288 503808
1187 503808 1128960 1178624 353280 817664 673792 1294336 47104 1102848 587264 1498112
1177 1498112 918016 683520 655872 435712 822784 1529344 1115136 1363456 1085952 780800
1167 780800 286208 1000448 986624 1505792 1261568 1381376 1111040 861184 1018368 1065472
1157 1065472 1120768 -117248 739328 1289728 1126912 434176 1391104 -73728 432128 859648
1147 859648 780288 1057792 642560 396288 584704 1910784 1429504 1708544 2040832 1852928
1137 1852928 2102272 2380800 1020416 2001920 226816 1399296 1844224 1709568 1317888
1128 1317888 1484800 2257920 1904640 1219584 1951232 1730560 2539008 1460736 2204160
1119 2204160 1611264 2014208 2412544 2392064 3076608 2875904 2277888 1703936 1946112 3090944
1109 3090944 3548672 2882048 2802688 2832384 3002368 2693120 3283968 4015104 3429888 3302912
1099 3302912 4573184 4632064 5084672 4912640 5155328 5659648 6174720 7649280 10422784
1090 10422784 7873536 6692864 6494208 7257600 6475776 6388224 8823296 9588736 8964096
1081 8964096 11546624 12541440 13194240 15582720 18874368 26246656 47432192 98137600
1073 98137600 176183296 69358080 33176576 17675776 13376512 10147840 7226368 6442496
1065 6442496 4791808 4537856 4832256 2799616 3617280 2994688 3190272 2751488 3112960
1056 3112960 4971008 7163904 2983936 3266560 2312192 2076672 2446848 1597440 844288
1047 844288 763904 1644544 1399296 2460672 1550336 1585664 872960 1760256 1267712 1334784
1037 1334784 2063872 1297408 1817600 1211904 1353216 1631232 614912 2139136 1559552
1028 1559552 937984 1324544 1347072 1104896 -125440 794624 1163264 1374208 389120 749056
1018 749056 924672 1242112 799744 852480 1202176 2040320 32768 331776 267776 392192
1008 392192 708096 714752 22528 1760768 1289728 1297408 1930752 1664512 1038848 -458240
997 1041408 692736 1182208 653312 797696 -296448 1429504 688128 525824 893440 301056
986 891904 572928 722432 -25088 1717760 906752 475648 74752 95744 728576 603136
976 603136 -997376 315392 1028608 1540608 1607168 202752 1018880 80384 593920 1037824
966 1037824 529920 1587200 1398272 882176 1197568 233472 444928 198656 277504 194560
956 194560 1026048 1442304 477696 1284096 499200 646656 462336 742912 922112 734720
946 734720 668160 534528 1836544 1437696 1423360 -490496 245760 315392 915968 1641472
936 1641472 1126912 332288 1229312 911872 -796672 -261120 933376 310784 338432 566784
926 566784 1090560 396288 -287232 -58880 1528832 761344 1918976 287232 1163776 501760
915 568832 268288 -600576 -430080 809984 190464 1138176 546304 -253440 -235520 605696
904 422912 679936 -269312 -124928 159744 -415232 218112 1534976 1404416 -513024 1199104
893 465920 340992 621568 -471552 784896 411648 337920 576512 -353792 253952 617984
883 617984 332800 338432 195072 -228864 570368 610816 972800 327680 1520640 543232
872 850432 -515072 788992 124416 730112 -416768 64512 335360 335360 -126464 591360 975360
861 975360 512000 424448 302592 -574976 138240 838656 653312 944128 241664 27648
850 45056 -536064 860672 649216 889344 25600 279552 -2560 -30720 675328 847872 142848
838 1232384 -45568 880640 169984 743936 219136 -510464 614400 351744 1145344 -97280
827 -480768 -331776 172032 1496064 265728 207872 560640 581120 84992 -79872 -578048
817 -578048 1134592 -201728 511488 171008 82432 927232 692224 90112 167424 1317888
807 1317888 1372672 261120 530432 220160 846848 413184 481792 393728 750592 965632
797 965632 485376 -280064 750080 1165312 120832 158208 1205248 571904 592896 1027072
787 1027072 612864 1097216 99840 1278464 509440 1059328 1280512 643584 219136 519168
777 519168 201728 1438720 842240 739328 1575936 1580032 316416 1631744 1803264 2032128
767 2032128 1609216 1891328 1944064 476160 2176512 644096 785408 342016 587264 456192
757 456192 -429056 575488 -179200 877056 315392 871424 -133632 749568 1548800 949760
747 949760 1196032 986112 -814080 229888 -101376 761344 64000 -16896 559104 616448
737 616448 899072 660992 100864 630784 -86016 80384 628736 421888 -71680 735744
726 326656 385536 486400 17920 498176 -26624 633856 11776 284672 233472 721920 -384512
714 269824 289792 349696 -253952 154112 125952 100352 332288 888320 294912 530432 488960
703 488960 757760 -111616 -6144 173056 539136 1594368 -316416 580608 1119744 -1288704
692 164352 -646144 -394752 184832 411136 859136 1271808 -967168 614912 -942592 115712
681 563712 126464 483840 -202752 403968 -16384 473088 -243200 904704 -1035776 303104
670 539648 843776 406528 -419328 539136 93184 1533440 -371200 143360 -209408 -451072
660 -451072 -720896 696320 331264 352256 654848 758784 130560 237056 349696 -18944
649 427520 280064 -159232 911872 66560 -274432 -531456 -129024 591872 1800704 390656
638 112128 987648 500224 -181248 177152 382976 585216 886784 657920 -748032 433152
627 238592 -323072 656384 227840 1238528 148992 27648 45056 807424 -455680 -1163264
617 -1163264 -427520 968192 -31744 609792 -268800 1148928 470016 728576 162304 646656
607 646656 941056 114688 602112 378368 -698880 -186368 -7168 1364992 -299008 -148992
596 -199168 249344 1123328 24576 -359424 722432 -262656 -47616 368128 -302080 713216
585 506880 625152 -464896 645632 125952 127488 259584 99840 57344 488960 -91648 581632
573 123904 446464 -1162240 858112 727040 -1230848 179200 296960 33280 -405504 -16384
562 -165376 161280 225792 330240 264192 1098240 518656 -141824 14336 467456 616960
552 616960 502784 131584 166912 -835072 -57344 -248832 1028096 -290816 394240 -208384
541 -118784 143872 -553472 15360 -261632 1045504 -487424 432128 -26624 36864 159744
531 159744 -4096 -681472 354304 327168 -891392 20992 988160 435200 -90624 -499200 1042432
519 111104 448000 -394752 -349184 -231424 -46592 1020416 529408 679424 -481280 251392
508 552960 -721920 1312256 806400 152576 345088 666112 685056 55808 664064 -143360
497 102912 320000 -82944 -95232 120320 492544 276480 151040 1024000 -88576 699392
486 -11776 204800 775168 601600 361472 581120 87040 1072128 527360 760832 1510400
476 1510400 1859584 1213440 671232 1042944 1351680 924160 595456 644608 838656 491520
466 491520 -173056 490496 460800 1120768 2191360 1599488 982016 -58880 444416 -230912
455 541184 643072 481280 1301504 736256 -702976 604672 -603648 184832 -210944 700928
444 445952 1647616 46592 462848 -989696 284160 -599552 240640 -444416 356864 794624
434 794624 328192 -360960 -81920 834048 327680 626176 1374720 1232384 1254400 -397824
423 -129024 -45568 608768 574464 -513536 630784 136704 453120 -1119744 173568 -257536
412 868352 633856 415744 496128 392192 -848896 -179200 -138752 187392 -601088 167936
401 -82432 187392 -117760 -388608 958976 812032 782336 421888 -216064 -4608 615936 261632
389 -204800 40960 -112128 180736 -143872 313344 340480 -114688 -211456 317952 -315392
378 -6656 62464 679936 376832 25088 739328 -210432 515072 153088 209408 1059840 482304
366 446464 621568 354816 1102336 -67584 563712 415744 414720 883200 481792 -96256 52736
354 21504 -1012736 -5632 85504 225280 -378368 -265216 -30720 -373760 208896 -293888 274944
342 224768 350720 -693760 -134656 -609792 307200 -367104 -139776 -708608 -429568 -13824
331 -562176 973312 -716800 238080 -205824 872448 58880 -183296 114176 212992 563712
321 563712 -243712 -326144 -130560 964608 -67584 103936 771584 509952 218112 -240640
310 -476160 1400320 -322048 928256 90624 175616 250368 -13312 368640 -260608 588800
299 782336 477184 -356352 712704 -125440 328192 256512 971776 1136640 52224 836608
289 836608 189952 451584 404480 -524800 285696 -302080 79360 311296 -796160 129536
278 311296 -1070080 -189952 706560 -309760 442368 502784 805376 401408 -118272 273920
267 -47616 -184320 -781312 -809472 1024 -359936 538112 -1347072 -35328 -450048 112128 226816
256 226816 527360 15872 -99328 1306112 446976 -166912 -104960 157696 -417280 139264
245 171008 815104 -262656 67584 710656 644096 363008 792576 -161792 531968 107008
234 -205824 448512 513024 583168 353792 624128 -358912 184832 -262656 -401920 254976
223 -95232 579072 -276992 -588288 272896 -439808 -465920 -533504 142848 893440 -71168 212480
211 388096 77824 -460288 23040 437248 1020416 1436672 844288 618496 1189888 55808
200 7680 -479232 -201216 23552 801280 1069056 481792 -318976 -90112 757760 756736 -268800
188 426496 314368 -95744 604160 288256 1227264 1068544 600064 156672 379392 -999424
177 -222208 1086464 -1093632 578560 -1117184 479232 295936 -57856 185344 582656 536064
167 536064 58880 -69632 -19456 -257536 745984 -302080 346624 -733696 -144384 -22528 -32256
156 -32256 343552 667136 911360 1102848 -179200 43520 -424448 1264128 154112 -1008128
145 485888 -129024 393216 -795648 -238592 51712 826880 -256512 607232 -98304 -970752
135 -970752 633344 401920 -478208 -868864 -34304 941568 717312 -15872 998912 634880
125 634880 263680 -104960 -185344 673280 101376 415744 243712 169472 -103424 -480256
115 -480256 -178176 -159232 -107008 75264 -177664 814080 490496 -518656 704512 -404480
104 1158144 104448 -199168 796160 215552 -30720 -631808 259584 805888 475648 222208
93 891904 -354816 752640 -683520 483328 -300032 -448512 540672 336896 -34304 214528
82 -100864 372224 959488 -349184 104960 -115200 -102912 -5120 515584 386048 528896 -939008
70 -1329664 266752 305664 227328 792064 -708096 -200192 -45056 -401408 198144 -595456
59 -243200 64000 -398336 156672 1192960 163840 804352 1032704 1077760 100352 -577536
48 730624 285696 441856 -549888 292352 195584 -494592 114176 -65024 625664 727552
38 727552 138752 636416 599040 253440 -374784 -67584 226304 -230912 539136 764928
28 764928 467456 977408 792064 173568 814592 444416 22528 260608 -421888 -306176
18 -306176 179712 689664 552960 -10752 -270336 -171520 86528 974336 110080 -779264 517632
6 540160 547328 138752 -134656 -736256 -978432 -401408
##END=
