##TITLE=141744
##JCAMPDX= 6.0         $$ Bruker NMR JCAMP-DX V2.0
##DATA TYPE= NMR SPECTRUM
##DATA CLASS= XYDATA
##ORIGIN= NUTS EXPORT
##OWNER= Administrator
$$ 1.72 TOPSPIN		Version 2.1
$$ 2016-02-23 12:23:15.590 -0800  Administrator@X
$$ Compression mode = diff/dup
##.OBSERVE FREQUENCY= 90.275459
##.ACQUISITION MODE= SIMULTANEOUS (DQD)
##.ACQUISITION SCHEME= undefined
##.AVERAGES= 16
##.DIGITISER RES= 22
##SPECTROMETER/DATA SYSTEM= 
##.PULSE SEQUENCE= zg30
##.SOLVENT NAME= None
##.SHIFT REFERENCE= INTERNAL, None, 1, 14.42901
##AUDIT TRAIL= $$ (NUMBER, WHEN, WHO, WHERE, PROCESS, VERSION, WHAT)
$$ ##TITLE= Audit trail, TOPSPIN		Version 2.1
$$ ##JCAMPDX= 5.01
$$ ##ORIGIN= Bruker BioSpin GmbH
$$ ##OWNER= Administrator
$$ $$ E:/data/jwist/nmr/1744/1/pdata/1/auditp.txt
$$ ##AUDIT TRAIL=  $$ (NUMBER, WHEN, WHO, WHERE, PROCESS, VERSION, WHAT)
(   1,<2016-02-23 09:34:51.980 -0800>,<Administrator>,<X>,<jcamp>,<TOPSPIN 2.1>,
      <fromjdx created from
       E:\data\jwist\nmr\uniandes\1744
       data hash MD5: 8K
       7A 0B 23 B0 BF 4F 99 85 1D D5 8C 02 8C B5 3F D9>)
$$ ##END=
$$ 
$$ $$ hash MD5
$$ $$ FC CC B0 0A A8 E1 06 F0 FF 19 AD 4D 75 A8 7B 62
##$RELAX= 
$$ Bruker specific parameters
$$ --------------------------
##$DU= <E:>
##$EXPNO= 1
##$NAME= <141744>
##$PROCNO= 1
##$TYPE= <nmr>
##$USER= <jwist>
##$ACQT0= 0
##$AMP= (0..31)
100 100 100 100 100 100 100 100 100 100 100 100 100 100 100 100 100 100
100 100 100 100 100 100 100 100 100 100 100 100 100 100
##$ANAVPT= 1
##$AQSEQ= 0
##$AQ_mod= 3
##$AUNM= <au_zg>
##$AUTOPOS= <>
##$BF1= 90.275459
##$BF2= 400.02
##$BF3= 400.02
##$BF4= 400.02
##$BF5= 400.02
##$BF6= 400.02
##$BF7= 400.02
##$BF8= 400.02
##$BYTORDA= 0
##$CFDGTYP= 0
##$CFRGTYP= 0
##$CHEMSTR= <none>
##$CNST= (0..63)
1 1 145 1 1 1 1 1 1 1 1 1 1 1 1 1 1 1 1 1 1 1 1 1 1 1 1 1 1 1 1 1 1 1 1
1 1 1 1 1 1 1 1 1 1 1 1 1 1 1 1 1 1 1 1 1 1 1 1 1 1 1 1 1
##$CPDPRG= <>
##$CPDPRG1= <>
##$CPDPRG2= <>
##$CPDPRG3= <>
##$CPDPRG4= <mlev>
##$CPDPRG5= <mlev>
##$CPDPRG6= <mlev>
##$CPDPRG7= <mlev>
##$CPDPRG8= <mlev>
##$CPDPRGB= <>
##$CPDPRGT= <>
##$D= (0..63)
0 1 0 0 0 0 0 0 0 0 0 0 0 0 0 0 0 0 0 0 0 0 0 0 0 0 0 0 0 0 0 0 0 0 0 0
0 0 0 0 0 0 0 0 0 0 0 0 0 0 0 0 0 0 0 0 0 0 0 0 0 0 0 0
##$DATE= 0
##$DBL= (0..7)
120 120 120 120 120 120 120 120
##$DBP= (0..7)
150 150 150 150 150 150 150 150
##$DBP07= 0
##$DBPNAM0= <>
##$DBPNAM1= <>
##$DBPNAM2= <>
##$DBPNAM3= <>
##$DBPNAM4= <>
##$DBPNAM5= <>
##$DBPNAM6= <>
##$DBPNAM7= <>
##$DBPOAL= (0..7)
0.5 0.5 0.5 0.5 0.5 0.5 0.5 0.5
##$DBPOFFS= (0..7)
0 0 0 0 0 0 0 0
##$DE= 6.5
##$DECBNUC= <off>
##$DECIM= 2432
##$DECNUC= <off>
##$DECSTAT= 4
##$DIGMOD= 1
##$DIGTYP= 12
##$DL= (0..7)
0 120 120 120 120 120 120 120
##$DP= (0..7)
150 150 150 150 150 150 150 150
##$DP07= 0
##$DPNAME0= <>
##$DPNAME1= <>
##$DPNAME2= <>
##$DPNAME3= <>
##$DPNAME4= <>
##$DPNAME5= <>
##$DPNAME6= <>
##$DPNAME7= <>
##$DPOAL= (0..7)
0.5 0.5 0.5 0.5 0.5 0.5 0.5 0.5
##$DPOFFS= (0..7)
0 0 0 0 0 0 0 0
##$DQDMODE= 0
##$DR= 22
##$DS= 2
##$DSLIST= <SSSSSSSSSSSSSSS>
$$ [...]
##$SPOFFS= (0..31)
0 0 0 0 0 0 0 0 0 0 0 0 0 0 0 0 0 0 0 0 0 0 0 0 0 0 0 0 0 0 0 0
##$SUBNAM0= <"">
##$SUBNAM1= <"">
##$SUBNAM2= <"">
##$SUBNAM3= <"">
##$SUBNAM4= <"">
##$SUBNAM5= <"">
##$SUBNAM6= <"">
##$SUBNAM7= <"">
##$SUBNAM8= <"">
##$SUBNAM9= <"">
##$SW= 20.5580556627758
##$SWIBOX= (0..15)
0 0 3 4 0 0 0 0 0 0 0 0 0 0 0 0
##$SW_h= 8223.68421052631
##$SWfinal= 0
##$TD= 65536
##$TD0= 1
##$TE= 300
##$TE2= 300
##$TE3= 300
##$TEG= 300
##$TL= (0..7)
0 120 120 120 120 120 120 120
##$TP= (0..7)
150 150 150 150 150 150 150 150
##$TP07= 0
##$TPNAME0= <>
##$TPNAME1= <>
##$TPNAME2= <>
##$TPNAME3= <>
##$TPNAME4= <>
##$TPNAME5= <>
##$TPNAME6= <>
##$TPNAME7= <>
##$TPOAL= (0..7)
0.5 0.5 0.5 0.5 0.5 0.5 0.5 0.5
##$TPOFFS= (0..7)
0 0 0 0 0 0 0 0
##$TUNHIN= 0
##$TUNHOUT= 0
##$TUNXOUT= 0
##$USERA1= <user>
##$USERA2= <user>
##$USERA3= <user>
##$USERA4= <user>
##$USERA5= <user>
##$V9= 5
##$VALIST= <valist>
##$VCLIST= <CCCCCCCCCCCCCCC>
##$VD= 0
##$VDLIST= <DDDDDDDDDDDDDDD>
##$VPLIST= <PPPPPPPPPPPPPPP>
##$VTLIST= <TTTTTTTTTTTTTTT>
##$WBST= 1024
##$WBSW= 4
##$XGAIN= (0..3)
0 0 0 0
##$XL= 0
##$YL= 0
##$YMAX_a= 1078398848
##$YMIN_a= -1532473.344
##$ZGOPTNS= <>
##$ZL1= 120
##$ZL2= 120
##$ZL3= 120
##$ZL4= 120
##$ABSF1= 10
##$ABSF2= 0
##$ABSG= 5
##$ABSL= 3
##$ALPHA= 0
##$AQORDER= 0
##$ASSFAC= 0
##$ASSFACI= 0
##$ASSFACX= 0
##$ASSWID= 0
##$AUNMP= <proc_1d>
##$AXLEFT= 0
##$AXNAME= <>
##$AXNUC= <off>
##$AXRIGHT= 0
##$AXTYPE= 0
##$AXUNIT= <>
##$AZFE= 0.1
##$AZFW= 0.1
##$BCFW= 1
##$BC_mod= 2
##$BYTORDP= 0
##$COROFFS= 0
##$CY= 15
##$DATMOD= 1
##$DC= 2
##$DFILT= <>
##$DTYPP= 0
##$F1P= 0
##$F2P= 0
##$FCOR= 0.5
##$FTSIZE= 0
##$FT_mod= 4
##$GAMMA= 1
##$GB= 0
##$INTBC= 1
##$INTSCL= 1
##$ISEN= 128
##$LB= 0.3
##$LEV0= 0
##$LPBIN= 0
##$MAXI= 10000
##$MC2= 0
##$MEAN= 0
##$ME_mod= 0
##$MI= 0
##$NCOEF= 0
##$NC_proc= -9
##$NLEV= 6
##$NOISF1= 0
##$NOISF2= 0
##$NSP= 1
##$NTH_PI= 0
##$NZP= 0
##$OFFSET= 14.42901
##$PC= 1
##$PHC0= 0
##$PHC1= 0
##$PH_mod= 0
##$PKNL= yes
##$PPARMOD= 0
##$PPDIAG= 0
##$PPIPTYP= 0
##$PPMPNUM= 2147483647
##$PPRESOL= 1
##$PSCAL= 4
##$PSIGN= 0
##$PYNMP= <proc.py>
##$REVERSE= no
##$SF= 90.2741564329144
##$SI= 8192
##$SIGF1= 0
##$SIGF2= 0
##$SINO= 400
##$SIOLD= 32768
##$SPECTYP= <>
##$SREGLST= <1H.CDCl3>
##$SSB= 0
##$STSI= 0
##$STSR= 0
##$SW_p= 1497.18866228788
##$SYMM= 0
##$S_DEV= 0
##$TDeff= 0
##$TDoff= 0
##$TI= <>
##$TILT= no
##$TM1= 0
##$TM2= 0
##$TOPLEV= 0
##$USERP1= <user>
##$USERP2= <user>
##$USERP3= <user>
##$USERP4= <user>
##$USERP5= <user>
##$WDW= 1
##$XDIM= 8192
##$YMAX_p= 1078398796
##$YMIN_p= -1532472
##$CURPLOT= <PDFCreator>
##$CURPRIN= <$PDFCreator>
##$DFORMAT= <normdp>
##$LAYOUT= <+/1D_H.xwp>
##$LFORMAT= <normlp>
##$PFORMAT= <normpl>
##$SURQMSG= 1
$$ End of Bruker specific parameters
$$ ---------------------------------
##XUNITS= HZ
##YUNITS= ARBITRARY UNITS
##XFACTOR= 0.182762287876938
##YFACTOR= 1
##DELTAX= -0.182762287876938
##NPOINTS= 8192
##FIRSTX= 1497.0059
##FIRSTY= -1031359
##LASTX= 0
##MAXY= 1078398796
##MINY= -1532472
##XYDATA= (X++(Y..Y))
8191a031359A086137a129k8633C77008d88486C47931A00739l4387J44529i02274
8180F3373c32608E63735c29859C07472M68874J057217C184J046957b77507e3561
8169b12030D94729j65411N7276Q79230g92076L27540B93184O89297h92958b41046
8158d1087l98645D99625c61345j90775l77598E08494j97623K79378A7221g64132
8147E93841H0645g7407F64029j06651d91952D67501J77644G5650L23394c03797
8136G5558f9663B75588c21r95024a82704F46464B70301L14670h55364L6452h7324
8124b7559C22494N997e23799H35997j6111n9465a89119F92082j29926b54085j023055
8113a277140a09170E14559q4683j5226d49419a5329G0486c7677o72059b50333
$$ y = [-1031359, 1086137, -1129, -29762, 377008, -488486, 347931, 100739, 66352, 210881, -902274, 63373, -332608, 563735, -329859, 307472, 776346, 1833563, 3184, 1050141, -277507, -53561, -212030, 494729, 329318, 386594, 1265824, -792076, -464536, 293184, 982481, -892958, -241046, -41087, -439732, 499625, -361345, -552120, -929718, 508494, 310871, 590249, 17221, -764132, 593841, 80645, -77407, 664029, 557378, -491952, 467501, 645145, 75650, 399044, -303797, 75558, -69663, 275588, -321, -995345, -182704, 646464, 270301, 584971, -855364, -818912, -87324, -27559, 322494, 328491, -523799, 835997, 819886, 760421, -189119, 692082, 562156, -254085, -1277140, -109170, 514559, 429876, 414650, -449419, -15329, 70486, -37677, -709736, -250333]
8102f5698D67815j35370d91773b20692A23621g53904A31944b50904I57735b54425
8091b1308F13996k54376P26060d33807A45164b30963a05945B27566k0453K98279
8081E05392f706j32455k21503C59500R88712n65357l75530c1690j01781D43289
8070C38383r6332N79223b73302M7077n79885H58109H6853d56732A43166f22142
8059A147059B7052P017N48461k66565k6691f6756l54578D93122c46304E20613
8048G11698A96432L00023K93916c20472A11660K69049K1847q0755P14272J68223
8038A204296C0413d8271G16510k08825a186051e33022A439633C5038e03114A147223
8027A713M54860b85139M6225A093144b69384j114737D2772j1194b98024C9546
$$ y = [-65698, 467815, 332445, -491773, -220692, 123621, -753904, 131944, -250904, 957735, -254425, -21308, 613996, 359620, 1085680, -433807, 145164, -230963, -105945, 227566, 207113, 505392, -6706, -139161, -360664, 359500, 1348212, 782855, 407325, -31690, -133471, 443289, 338383, 242051, 821274, -273302, -226225, -806110, 858109, 86853, -456732, 143166, -622142, 1147059, 27052, 34069, 582530, 315965, 289274, -66756, -421334, 493122, -346304, 520613, 711698, 196432, 496455, 790371, -320472, 111660, 380709, 402556, 321801, 1036073, 1204296, 30413, -48271, 716510, 507685, -1186051, -533022, 1439633, 35038, -503114, 1147223, 1713, 456573, -285139, -238914, 1093144, -269384, -1384121, 42772, 31578, -298024, 39546]
8016B56212c17310d954l6022A29248f59521D57036J53915e09014b22917m21305
8006f44222J99980G2508d74105b24574m0259A65793h34072A48519d53731C728
7995B2002O02201L15788a93393D02168c9958q11816c47411A08283P15400J82638
7985A006321A65664M35088K19832B07755c30996H5026N47636B98969b13800n18438
7975g32238G69060A60291N60002C26645L43643c36151F55279J14980j96231N851
7965E79879A60160c9997G81086c23171B15683K68904R7034B53886a37174k6440
7955a63614B07931N68808d12769b9895o7827B03608r7428R5830M18502d36055
7944E41501g258L83C15994b9915G19928I4705a05276A17051P8983h6972D29175
$$ y = [256212, -317310, -4954, -40976, 129248, -659521, 457036, 610951, -509014, -222917, -644222, -444242, 72508, -474105, -224574, -264833, 165793, -834072, 148519, -453731, 3728, 22002, 624203, 939991, -193393, 402168, -39958, -851774, -347411, 108283, 823683, 1006321, 165664, 600752, 820584, 207755, -330996, 85026, 632662, 298969, -213800, -732238, 769060, 160291, 720293, 326645, 670288, -336151, 655279, 770259, 574028, 579879, 160160, -39997, 781086, -323171, 215683, 484587, 581621, 253886, -137174, -163614, 207931, 776739, -412769, -29895, -97722, 203608, 106180, 202010, 620512, -436055, 541501, -7258, -6875, 315994, -29915, 719928, 94705, -105276, 117051, 196034, -86972, 429175]
7932B07878a34269E70447a40215F06548P75874D4612d70329J38100c1595k117
7922c3712A71732c80194A55850Q5888G4061L11489b52850C63801O69893J12441
7912A146135A82935J037362A68350Q05023j46374e7462o42043B28202N85433d4080
7901A83322d50549F72781B28491b69550o39832a86496B99581a87659j75939k73383
7891f36981b0549o39413l30518F16508A5162f17537H54234L93218D93255a64144
7880D19596a77019A57008i8014E70254A28596b52115m7978G9140R2657O31361
7870H03158l59351e11508A34731R73092E27386j46393i63408D21894L41398J09269
7860H72561i78245a31408I224Q42117h21153a00557H68374f44901a56027e045
$$ y = [207878, -134269, 570447, -140215, 606548, 1382422, 44612, -470329, -332229, -31595, -33712, 171732, -380194, 155850, 241738, 74061, 385550, -252850, 363801, 1033694, 1146135, 182935, 1220297, 168350, 973373, 826999, -57462, -699505, 228202, 813635, -44080, 183322, -450549, 672781, 228491, -269550, -909382, -186496, 299581, -187659, -363598, -636981, -20549, -659962, -990480, 616508, 15162, -617537, 854234, 1247452, 493255, -164144, 419596, -177019, 157008, -98014, 570254, 128596, -252115, -300093, 79140, 171797, 803158, 443807, -511508, 134731, 1107823, 527386, 380993, -963408, 421894, 763292, 872561, -978245, -131408, 9224, 851341, -821153, -100557, 868374, -644901, -156027, -5045]
7849B02867J014783a09726K4339G67570d73946f5883F44159B36256h4261A02912
7838H96205a74373A4104J14271L27882h96235A356374b40147F15872g88652F99546
7827i64443C42996N9674L80908c71231B45201a94683A57437i3347j70887G29370
7816I66053k58206k70806L05029C33808G4249F256c21049J40557G55354B71649
7805f8960n44709G71524e13668C96548O8257c34472R1352l20151B91635o9581
7795B22054F7073M24989c25902A89063f33279l8101b06881P7017G50113B04304
7784A5413O6914h6558l37226E13034d92990B05978e46505G82404B15407L13310
7774E28717Q29018C40997O31926k28342B26257i5521E05358O13835b66501B04971
$$ y = [202867, 1217650, -109726, -85387, 767570, -473946, -65883, 644159, 236256, -84261, 102912, 896205, -174373, 14104, 128375, 456257, -896235, 1356374, -240147, 615872, -788652, 699546, -964443, 342996, 402670, 783578, -371231, 245201, -194683, 157437, -93347, -264234, 729370, 966053, 707847, 437041, 742070, 333808, 74249, 6256, -321049, -180492, 755354, 271649, -68960, -613669, 771524, -513668, 396548, 464805, -334472, -243120, -563271, 291635, 222054, 67073, 492062, -325902, 189063, -633279, -671380, -206881, -129864, 750113, 204304, 15413, 82327, -86558, -423784, 513034, -492990, 205978, -546505, 782404, 215407, 528717, 1357735, 340997, 972923, 744581, 226257, -95521, 505358, 1119193, -266501, 204971]
7763F46261M01044g50636H4108f3785E78357L9606M41137B01601J56200f79335
7752b02428G84830d0098F47907i6642C90853a64894o20070E81743o486d78987
7741f8570I42858j96690F3029g4237B57325P8166M91010d1605l70396D86650k28074
7730B58576a87356C23905N31596A98153a72996L5663n4925q1252D98177j9949
7720D78228b72425A02562f1256A396443F58515b23816B13093N84565a354702A071526
7709b37114l01388J05600A20454g2502E97033j69246e46015a2509l58951A3288
7698B80979c7100A03919K66569M31230L7673L7694k42676k06872K66346B53157
7687a093180G35388h9269c568p16092b11830A38154M56154a104727a97411k72969
$$ y = [646261, 1047305, -750636, 84108, -63785, 578357, 617963, 1059100, 201601, 357801, -679335, -202428, 784830, -40098, 647907, -96642, 390853, -164894, -784964, 581743, 575257, -478987, -68570, 942858, 746168, 63029, -74237, 257325, 335491, 826501, -41605, -412001, 486650, 258576, -187356, 323905, 855501, 198153, -172996, -137333, -192258, -273510, 498177, 478228, -272425, 102562, -61256, 1396443, 658515, -223816, 213093, 797658, -1354702, 1071526, -237114, -538502, -432902, 120454, -72502, 597033, 427787, -546015, -12509, -371460, 13288, 280979, -37100, 103919, 370488, 801718, 839391, 877085, 634409, 427537, 693883, 253157, -1093180, 735388, -89269, -3568, -719660, -211830, 138154, 594308, -1104727, -197411, -470380]
7677d70380b22774A23758g44550J08523m9815e5805A1505d48690A67774h34644
7666b00031I71335l67829j97986h8985F84106B56878d2532j03049B4401M8571
7656G2972M3217k4562N76711b01463B27204O6338K80662E1532a60830D41932J4752
7645D56684a079396E21822b51629F09913g24599F58188N82696a51782k20494D64360
7634a76485A64999O17048a10537C65082J24639e98459C92134A32509E8425L21787
7624C80212j83341a52919N1121J7618H97078g45498K48546Q3747F1054b60906
7613D86196B28381b21166r7791o2194E62145O8278A46840f7817m69921C15423
7602d93587C41376a13589D90664R17243F86327a02443p08811E49641c22424A254204
$$ y = [-470380, -222774, 123758, -744550, -636027, -685842, -55805, 11505, -448690, 167774, -834644, -200031, 971335, 603506, 405520, -88985, 684106, 256878, -42532, -145581, 24401, 72972, 116189, 91627, 668338, -201463, 227204, 293542, 574204, 51532, -160830, 441932, 456684, -1079396, 521822, -251629, 609913, -724599, 658188, 1240884, -151782, -372276, 464360, -176485, 164999, 782047, -110537, 365082, 489721, -598459, 392134, 132509, 58425, 380212, 196871, -152919, -101798, -84180, 897078, -745498, -496952, -413205, 61054, -260906, 486196, 228381, -221166, -318957, -381151, 562145, 630423, 146840, -67817, -537738, 315423, -493587, 341376, -113589, 490664, 1407907, 686327, -102443, -811254, 549641, -322424, 1254204]
7591A116039A85742a13232o69537D73157A812R79916L78348D7721J46684f31347
7580b36800l60118A015371c48407A54890J35645M49715K64760B53453Q99354g78663
7569G55328j67244a20848l54849a02373A90114G1367J68490L43708B24388b5199
7558c69795B59833K62793l6255K2709b57423j73125B08180d94032I45506E5806
7547e08047H97123F5786e59210K20266a67770n34252G6225e79065p02890e38753
7536D23820i1513l09035F22442e43853a13344A207033b3091G90013f26691P8627
7526e48064A42706R03810O0394e28368C50638G6637b7420k51179I29627a148125
7515b16028N8632I05664m48986o5787k4951D5574b5056m08987E56582j12622c55180
$$ y = [1116039, 185742, -113232, -782769, 473157, 1812, 981728, 1360076, 47721, 194405, -631347, -236800, -596918, 1015371, -348407, 154890, 290535, 740250, 1005010, 253453, 1152807, -778663, 755328, 588084, -120848, -475697, -102373, 190114, 71367, 239857, 583565, 224388, -25199, -369795, 259833, 522626, 486371, 509080, -257423, -430548, 208180, -494032, 945506, 55806, -508047, 897123, 65786, -559210, -338944, -167770, -702022, 76225, -579065, -1281955, -538753, 423820, -91513, -400548, 622442, -543853, -113344, 1207033, -23091, 790013, -626691, -548064, 142706, 1046516, 1106910, -528368, 350638, 76637, -27420, -278599, 929627, -1148125, -216028, -157396, 905664, 456678, 390891, 365940, 45574, -25056, -434043, 556582, 443960, -355180]
7503c70821R1829E3797d34988D17606J7204c30735G3504L17854L7861K33429C9133
7491E07764o2279J08385c12733A55627C1206g96344c32792l80041J25894E29986
7480A68713K6311N49441K818B96089Q999L70225r0444B39044f54777G39849i57250
7468g78534H67032b93276l07657b26043o7351E36137k20445A3324L82550M27711
7458H23585A83904J24136P46944m29697D2637e17898C52560b7212j41299k93771
7448d62282E51403e68486C41407O84658D87665h41123a01710F7435f2922j27220
7438a90142C30979d5820C08571N00409b99531Q178E20574J02963L77643h6438
7427C91994j80344g15048B84431a49635l0262k0073C81049b45341A51143E6294
$$ y = [-370821, -278992, 53797, -434988, 417606, 434810, -330735, 73504, 391358, 429219, 662648, 39133, 507764, 445485, 553870, -312733, 155627, 31206, -796344, -332792, -712833, -586939, 529986, 168713, 195024, 744465, 747283, 296089, 305088, 675313, 584869, 239044, -654777, 739849, -957250, -778534, 867032, -293276, -600933, -226043, -293394, 536137, 315692, 13324, 395874, 823585, 183904, 308040, 1054984, 625287, 42637, -517898, 352560, -27212, -168511, -462282, 551403, -568486, 341407, 1026065, 487665, -841123, -101710, 67435, -62922, -190142, 330979, -45820, 308571, 808980, -299531, -291353, 520574, 623537, 1001180, -86438, 391994, 211650, -715048, 284431, -149635, -179897, -199970, 381049, -245341, 151143, 56294]
7416C29595r3304O50710j69968M11294g00318a60331o70194D56286q124k1196
7406D26966E2783O18185i8835k80423D5866J53654M55001K0930k33700L6356M73259
7395I51366J90098n39061j25541k06611f43553K71418M9221C67178g18056n553
7385g23609F69452k39872b08979o5622C5690J480158a7963n86768D16311n4504
7375C61807j12847M23822A7538a11859A36263J5973L22130A40220n0454l5016
7365E4750c21066i9838n3629I85829d6710H82690L6628f39033B27132O47050B06512
7353a9408F92963b45943E39133r1367B0019P5722Q00349j46113k09512a013551
7342d5134A037030B75761Q56108k26774N9367k64467k17638a06192D29051c88390
$$ y = [329595, 236291, 887001, 717033, 1128327, -700318, -160331, -830525, 456286, 448162, 426966, 52783, 670968, -98835, -379258, 45866, 199520, 654521, 675451, 441751, 478107, 951366, 1141464, 602403, 476862, 270251, -643553, -372135, -322914, 367178, -718056, -723609, 669452, 429580, -208979, -274601, 35690, 1515848, -17963, -604731, 416311, 361807, 248960, 672782, 17538, -111859, 136263, 152236, 474366, 140220, 89766, 54750, -321066, -99838, -153467, 985829, -46710, 882690, 919318, -639033, 227132, 874182, 206512, -19408, 692963, -245943, 539133, 447766, 20019, 95741, 896090, 749977, 540465, -1013551, -45134, 1037030, 275761, 1131869, 905095, 964462, 699995, 482357, -106192, 429051, -388390]
7331F90255O1582d21792A25355M31766B0226J423285E91952k95411c73392F54015
7320B48294a004438a61862A094022a24534I25795b40946n6385F82888f14264B10822
7309C40012K09888j11526b20980l81127D42210j54345q794A33932L21755A50664
7298I5582K56782o6739L07998B7556c52622F21161a3904H1572f6434D59190a276737
7286H26825k24967P2915k4252R9525C04649q1451b85911C7143P49133k24786l0408
7275E31082a76217j18499j14224a58591B78697a48876D24508K62152H2542b69330
7264D58315K68424C40355c10337J4926j74786A51517L47081c32318B49498c48933
7253B55611c75275j67083C33023E5905J07835K74991e59533K32984B76037J19000
$$ y = [690255, 751837, -421792, 125355, 557121, 20226, 1443511, 591952, 296541, -373392, 654015, 248294, -1004438, -161862, 1094022, -124534, 925795, -240946, -297331, 682888, -614264, 210822, 340012, 549900, 438374, -220980, -602107, 442210, 287865, 279071, 133932, 455687, 150664, 95582, 352364, 285625, 593623, 27556, -352622, 621161, -13904, 81572, -66434, 459190, -1276737, 826825, 601858, 674773, 650521, 750046, 304649, 223198, -285911, 37143, 786276, 561490, 531082, -176217, -294716, -408940, -158591, 278697, -148876, 424508, 686660, 82542, -269330, 458315, 726739, 340355, -310337, -295411, -470197, 151517, 498598, -332318, 249498, -348933, 255611, -375275, -542358, 333023, 55905, 163740, 438731, -559533, -326549, 276037, 395037]
7243C95037j47506a32484m68146F75947J51585c05488D03020L34809a81421k07140
7233c88561k48657H24114C11391H9394M31971M70683D50471J53963H1726P83475
7223H65201l61391G9116N58726f36587c01205G76501g25471F78282C08311c58491
7212g15683F72802C02319O91627B96403a391230G8776N66092k49882R99175I0238
7201i5477L6739I86923j1842j29009h6704l13990E01576b90184I09401e89334
7190g2302B64794c12978E82787j81028a68662I99870l56484a59618B51122a42422
7179C79542O307O57057A37940J02415J56661O50631c67387B00031R04657k25199
7169H79489G8817J12022Q56868D89408A08161K96595c40561k4050l354n68136
$$ y = [395037, 247531, -132484, -600630, 675947, 827532, -305488, 403020, 737829, -181421, -388561, -637218, 824114, 311391, 89394, 521365, 992048, 450471, 604434, 81726, 865201, 503810, 79116, 637842, -636587, -301205, 776501, -725471, 678282, 308311, -358491, -715683, 672802, 302319, 993946, 296403, -1391230, 78776, 644868, 394986, 1394161, 90238, -95477, -58738, 986923, 975081, 846072, -86704, -400694, 501576, -290184, 909401, -589334, -72302, 264794, -312978, 582787, 401759, -168662, 999870, 643386, -159618, 251122, -142422, 379542, 385849, 1042906, 137940, 240355, 397016, 1047647, -367387, 200031, 1104688, 879489, 78817, 190839, 1047707, 489408, 108161, 404756, -340561, -364611, -367965, -936101]
7159i36101c88709E67853k01963j55571a64362n48861D39209A28943K88431M42968
7149H60342K75781D0686N77798d0767E88988k54777O16962B88630P26176b5236
7138e5553H95377k21817k28815c33936C51574L2636f93266A73038Q5969L16311
7128E75318j08640g0518C44116j31317J16920R3725G3710e32365c5204F82121
7117A37585O74279A87808h23250F81347e47925A00243f14303H19117J093497b35142
7106A79551M06023a24723E418Q18480I9739J67905J44866M46503l65315d4905
7095d59285D12836b14979n4997a01391E35877e3264j01458H14996A841c12988
7084H2405Q83587j79832B04265d83314J57115j87440H59261H3011a68682d1194
$$ y = [-936101, -388709, 567853, 365890, 210319, -164362, -713223, 439209, 128943, 417374, 860342, 1136123, 40686, 618484, -40767, 588988, 334211, 951173, 288630, 1014806, -25236, -55553, 895377, 673560, 444745, -333936, 351574, 384210, -693266, 173038, 259007, 575318, 466678, -70518, 344116, 212799, 329719, 423444, 73710, -532365, -35204, 682121, 137585, 811864, 187808, -823250, 681347, -547925, 100243, -614303, 819117, 1912614, -235142, 179551, 585574, -124723, 5418, 823898, 99739, 267644, 412510, 859013, 493698, -44905, -459285, 412836, -214979, -269976, -101391, 535877, -53264, -154722, 814996, 1841, -312988, 82405, 965992, 786160, 204265, -483314, -326199, -513639, 859261, 83011, -168682, -41194]
7073A206211e25908M7824D51427c15250E46486N361c97850H28338K01224l29164
7063G00398N75730n87557k12367L00316a32079I63994C10009G6567M87238O6824
7053F30629a07560A191067d31924B43221e14124E98772l945M38919l01415i457
7042H42800l66228o2427K55092J25041l42099K27228f1049b0737E55268e1197
7031E4728M56596h0837n38551H36077a05316G30019A49684L79209r8884j4831
7021D15178A23298N97591A87659M5021P26154J30609E01732N2824J83407a17947
7010a82829C90573b88252n05589I81782D66329K87007j92314R2244K3344f40282
6999D70241b07839A121700g56112l13290C07923f23224H47744D06853c1086F90131
$$ y = [1206211, -525908, -478084, 451427, -315250, 546486, 551847, -397850, 828338, 1029562, 700398, 1276128, 688571, 476204, 776520, -132079, 963994, 310009, 76567, 563805, 630629, -107560, 1191067, -431924, 243221, -514124, 598772, 594827, 1033746, 732331, -9457, 842800, 476572, 414145, 669237, 794278, 452179, 679407, -61049, -20737, 555268, -51197, 54728, 511324, -80837, -619388, 836077, -105316, 730019, 149684, 528893, 430009, 415178, 123298, 720889, 187659, 232680, 958834, 1089443, 501732, 554556, 737963, -117947, -182829, 390573, -288252, -793841, 981782, 466329, 753336, 561022, 653266, 676610, -640282, 470241, -207839, 1121700, -756112, -1069402, 307923, -623224, 847744, 406853, -31086, 690131]
6988C8136b0791A21987k0675N14090G1255L30047F0795J845723a5487p1116p5840
6977a62443G64239f23421C20819M04045l50587J90469j16441L85558a07465F3472
6966A257961m44695c01908C1294N40274d65054r53171c62080P7733J16957F31694
6955a97432D32375a23629k616G21467D3213L73585A70224R8461Q40085m77099
6945F31671G5897J40388c37073E58123M86214k84592b37478A42298N42676k68426
6935D16548L15322h35000I24327m02826q8742l760c26527A120L32637c7579D58283
6923I02819k10977l33031H3047N06917q912B49870L6046J20504N51676k29005
6913G29091A02019b02729A85909g64940H87306l62687b63123A81382c11357p06241
$$ y = [38136, -20791, 121987, 101312, 615402, 71255, 401302, 60795, 1906518, -15487, -86603, -162443, 764239, -623421, 320819, 724864, 374277, 564746, 448305, 833863, -107465, 63472, 1257961, 813266, -301908, 31294, 571568, -465054, -1418225, -362080, -284347, -167390, 631694, -197432, 432375, -123629, -126245, 721467, 43213, 416798, 170224, 268685, 1108770, 631671, 75897, 216285, -337073, 558123, 1044337, 759745, -237478, 142298, 684974, 416548, 731870, -835000, 924327, 521501, 432759, 428999, -326527, 1120, 333757, -37579, 458283, 902819, 691842, 358811, 83047, 589964, 581052, 249870, 285916, 406420, 958096, 729091, 102019, -202729, 185909, -764940, 887306, 524619, -263123, 181382, -311357, -1017598]
6903a017598C0034f30477c1215F48765n6870d26556H28831g03757a21295j47966
6893b69261B36789L00717R92591C95429Q32584A2617J159562A76729P50690C08709
6882i57097A227262b05252A251058l33273H9157h14768H98186C86468K33359a75631
6871D07297Q5858k1491N20953p7563L55519b2436B93868b38609A70313O79639
6861H49952A96508p7958M52479L11883c28474B19392M60391j69102J35007D4162
6850G93358F5676a76803E80934A68758n0531a00887F92196B19085k2894K17652
6840D13843L37590N2212d3816G57486k0336K44342i7289D41069N70M68613B78527
6828b66158B39922M01404c6145E95041j71056k9032J044061B75167J55976j76430
$$ y = [-1017598, 30034, -630477, -31215, 648765, 591895, -426556, 828831, -703757, -121295, -269261, 236789, 537506, 1530097, 395429, 1228013, 12617, 1172179, 176729, 927419, 308709, -957097, 1227262, -205252, 1251058, 917785, 89157, -814768, 898186, 386468, 619827, -175631, 407297, 493155, 471664, 992617, 915054, 1270573, -22436, 293868, -238609, 170313, 849952, 196508, 118550, 571029, 882912, -328474, 219392, 679783, 510681, 645688, 44162, 793358, 65676, -176803, 580934, 168758, 118227, -100887, 692196, 219085, 196191, 413843, 751433, 803645, -43816, 757486, 737150, 981492, -97289, 441069, 441639, 910252, 278527, -266158, 239922, 641326, -36145, 595041, 423985, 394953, 1439014, 275167, 431143, 254713]
6818B54713J55358O64391l84768h12E19900L41878D01408J30073L7796b76570
6807a88023d7294I4304K94310P9330f27804E3242O71866C35819N27682a57149
6796I07728A24010N12940F9721R4419L89962c9402n8214l53611C45539J34596
6786D80135I7906O78724K55618C57268H8499L79451O63952C68432A21575J080065
6776A201640l31797B83650L22819K77220O9917k98461K89103B07696L75149H2632
6765d61000G48594d12190A08611e23407F17352N23646C74538b71294E42532M17427
6755I59959g37388C3583M8923K00839P42308c2674A111779f282p247A291821g8671
6743G7870P75653g07000C29362J004876m45010k97423J770B92094e30545m20700
$$ y = [254713, 410071, 1074462, 689694, -812, 519900, 861778, 401408, 531481, 569277, -276570, -188023, -47294, 94304, 388614, 467944, -627804, 53242, 725108, 335819, 863501, -157149, 907728, 124010, 636950, 69721, 164140, 554102, -39402, -97616, -451227, 345539, 480135, 97906, 776630, 1032248, 357268, 88499, 467950, 1131902, 368432, 121575, 1201640, 869843, 283650, 606469, 883689, 953606, 655145, 944248, 207696, 582845, 82632, -461000, 748594, -412190, 108611, -523407, 617352, 1140998, 374538, -271294, 542532, 959959, -737388, 33583, 82506, 283345, 1025653, -32674, 1111779, -6282, -13529, 1291821, -78671, 77870, 853523, -707000, 329362, 1334238, 889228, 591805, 593575, 292094, -530545, -951245]
6733i51245C13276J2509J117457B23425L23199L39543e54699H33844C6475P39056
6723G75531e93469C31099J96989P17190D49819M95632L88162c17525B19677J4788
6713B34465L80188k37321Q41421n16302b05241B21168l620K23757a051718d36291
6702D21070a39256E82599O36793D28578j15964b8722D01363m1931g9662F23075
6691I35809m15107b81136g1952C29097N26158j5587d40483n483C31695M08089
6681G39784B94862J07431F7427O5325a16277A29057L42925k16764b92945A049087
6670B98713A03308f4542E38186j46320j89132K00044A49282M634b29070H80796
6659E38301g8208F91854J900d14897A053329C33118j7392P93008J69640D49092
$$ y = [-951245, 313276, 325785, 1443242, 223425, 546624, 886167, -554699, 833844, 36475, 775531, -593469, 331099, 528088, 1245278, 449819, 945451, 1333613, -317525, 219677, 234465, 614653, 377332, 1218753, 702451, -205241, 221168, 217548, 441305, -1051718, -436291, 421070, -139256, 582599, 1219392, 428578, 312614, -28722, 401363, 359432, -79662, 623075, 935809, 520702, -281136, -71952, 329097, 855255, 839668, -440483, -445966, 331695, 739784, 294862, 402293, 67427, 132752, -116277, 129057, 471982, 255218, -292945, 1049087, 298713, 103308, -64542, 538186, 391866, 202734, 402778, 149282, 153916, -229070, 880796, 538301, -78208, 691854, 693754, -414897, 1053329, 333118, 315726, 1108734, 1278374, 449092]
6648C44556N13944j69566O75508A11238K5718K05540r7346J26917M16418Q41742
6638A630227G47062L091l08555Q44067m41271B23528M9814M16460R2012j44296
6628F37518d42370B80355a44154H16691C42977g3596E45687L7531G3050Q33037
6618I06087e13248H95022A26375c95960H12549J88838d64010F5819Q48246k50565
6608F63500J100886A48822L44092j92186E0560J436135b43641o64663A94914J07508
6598C02422h57352G6108J121088m58090A32093L82399e7051j316C11350O32111
6588I43461C57901L47960j51679J27389A62696b79338B55880d95036F38446L38472
6578I76918L3134l09706d8146A142294C11816L0318O95198h2306j5559D58589
$$ y = [344556, 858500, 688934, 1364442, 111238, 136956, 342496, 245150, 372067, 788485, 1630227, 747062, 750153, 441598, 1285665, 844394, 223528, 273342, 689802, 781814, 637518, -442370, 280355, -144154, 816691, 342977, -73596, 545687, 583218, 73050, 906087, -513248, 895022, 126375, -395960, 812549, 1001387, -464010, 65819, 914065, 663500, 1764386, 148822, 492914, 300728, 50560, 1486695, -243641, -908304, 194914, 302422, -857352, 76108, 1197196, 739106, 132093, 514492, -57051, -58367, 311350, 943461, 357901, 705861, 554182, 681571, 162696, -279338, 255880, -495036, 638446, 976918, 1010052, 700346, -48146, 1142294, 311816, 342134, 1037332, -82306, -97865, 458589]
6567a356893M58234G22968d38007B21175P5811d61327D02050R96773m00108c25715
6556I3824Q34067B13943b24751F01417A22157c6398B30149a199909e38247L5858
6546e02389A19046h55522K51524B60827R58783a40895C75728P41450A74583P65177
6536I39760P10118C07540L63816a19005E53062d0632F05823i32106C25576N69101
6526H94677A63237l0540c44288e2779A57507d2403H96339b56373H90461O901Q30266
6515A727628B84154b8379E04052A50451J02727P00741l80972L53167a116A113725
6504c04958F59784L9647k63385A03276M3757P57203m51843j28039J14236a30255
6493D58117L26379h3923A034623E4422L70335P886A71163L24185L94348f43751
$$ y = [-1356893, -898659, 722968, -438007, 221175, 296986, -461327, 402050, 1398823, 998715, -325715, 93824, 927891, 213943, -224751, 601417, 122157, -36398, 230149, -1199909, -538247, -502389, 119046, -855522, -603998, 260827, 1219610, -140895, 375728, 1117178, 174583, 939760, 1649878, 307540, 671356, -119005, 553062, -40632, 605823, -932106, 325576, 894677, 163237, 132697, -344288, -52779, 157507, -42403, 896339, -256373, 890461, 897362, 1727628, 284154, -28379, 504052, 150451, 253178, 953919, 572947, 926114, -1116, 1113725, -304958, 659784, 699431, 436046, 103276, 147033, 904236, 452393, 324354, 438590, -130255, 458117, 784496, -83923, 1034623, 54422, 424757, 432643, 171163, 495348, 889696, -643751]
6482D88678L9222M67791D44497J11485l9183i8013F23888c69104D83092O61659
6472A144751d49224m2691H80964c67742H38124l16906D7582K53259K71239Q57739
6462A429819n20539A12542N00073B55590J80054R6839M69802j89517j77124e79840
6451E58169Q3097E2022M04705j71862b7138l70903G72590e56849G99420l53888
6441D45532C6672L32765L67321K71237c02815D30213A04340P04713a26236A8953
6430A245318l85740A03367a92331A305746E69699H8380k9583a83077A468151f87914
6419A42596Q05584a92269A29959J028233a30251C18551d18216E11846c8867F76421
6408b77779J00875D36730J54554b6593E18373m644M23815C80125M59290N47773
$$ y = [488678, 527900, 995691, 444497, 555982, 516799, -98013, 623888, -369104, 483092, 1144751, -449224, -491915, 880964, -367742, 838124, 521218, 47582, 300841, 572080, 1429819, 909280, 112542, 612615, 255590, 435644, 532483, 1002285, 812768, 635644, -579840, 558169, 641266, 52022, 456727, 284865, -27138, -398041, 772590, -556849, 799420, 445532, 36672, 369437, 736758, 1007995, -302815, 430213, 104340, 809053, -126236, 18953, 1245318, 859578, 103367, -192331, 1305746, 569699, 88380, 58797, -183077, 1468151, -687914, 142596, 948180, -192269, 129959, 1158192, -130251, 318551, -418216, 511846, -38867, 676421, -277779, -176904, 436730, 591284, -26593, 518373, 513729, 937544, 380125, 839415, 1387188]
6398A387188B46845K32383J417179n60332m68215B14615P07709N43969F20468
6388A689969E38048L36968a24270B15406L15156J029850B31175Q18962m39513
6379F10624a85411k82944A61313O14133a89562C75854L00043a52784A307388d26105
6368H10177l4402C51862M89995l91775K44681c57600f7180E06997j40580b77443
6357e14888D20304K12278c44804I32075d43594C18868b44439C40616h4083A452011
6346B03008P32704a81206q7200C04140O48067K0946l74068M89136E24398j5403
6336E08995K02447A844P80766J012416H45089j74556A08686g3391G93514k77848
6326E15666a65652B3028K56484c2209F34758d04824G89379j65893N00504n49014
$$ y = [1387188, 246845, 479228, 1896407, 1336075, 867860, 214615, 922324, 1466293, 620468, 1689969, 538048, 875016, -124270, 215406, 530562, 1560412, 231175, 1050137, 610624, -185411, -468355, 161313, 775446, -189562, 375854, 675897, -152784, 1307388, -426105, 810177, 775775, 351862, 841857, 450082, 694763, -357600, -67180, 506997, 366417, -277443, -514888, 420304, 632582, -344804, 932075, -443594, 318868, -244439, 340616, -84083, 1452011, 203008, 935712, -181206, -268406, 304140, 952207, 973153, 599085, 1088221, 524398, 508995, 711442, 1844, 782610, 1795026, 845089, 670533, 108686, -73391, 793514, 515666, -165652, 23028, 279512, -32209, 634758, -404824, 789379, 623486, 1123990, 574976]
6316E74976O95573n33384B97157M88728h5850G6697d91991B246276g26525D11736
6305A250818j02681E09712A32150K68927D1648K11247P2964e17590a03743K6350
6295g7393A309269E61386a18685E6324P84257c2621E31059d98765A212122l4931
6285A177191l36217C30738P02983k95325C15246O04696m49724A99200r2885M32426
6275E38741B50125P84150j10172B22358b26534C34051j44284l0845O59780e9990
6264c55987I37831l95002m1902Q27910a18116F05066M43999A73909b85313c4338
6253A23674A0093M17435N11040c43447d4182m88288a93582C14627j03021D3761
6242H76150k86207G865P2178J500030C76253K5556K13920O43075M48490F08765
$$ y = [574976, 1270549, 737165, 297157, 785885, -85850, 76697, -491991, 2246276, -726525, 411736, 1250818, 1148137, 509712, 132150, 401077, 41648, 252895, 325859, -517590, -103743, -77393, 1309269, 561386, -118685, 56324, 840581, -32621, 531059, -498765, 1212122, 1177191, 840974, 330738, 1033721, 738396, 315246, 919942, 470218, 199200, 106315, 538741, 250125, 1034275, 924103, 222358, -226534, 334051, 189767, 158922, 818702, -59990, -355987, 937831, 542829, 500927, 1328837, -118116, 605066, 1049065, 173909, -285313, -34338, 123674, 10093, 427528, 938568, -343447, -44182, -532470, -193582, 314627, 211606, 43761, 876150, 589943, 7865, 80043, 1580073, 376253, 401809, 615729, 1258804, 1707294, 608765]
6231B10576i55852g8850I04680a75564F6025P30530A9393L9525h27841I22381
6220B28928Q28861m812B69526P83355a44926A200890a69652E62317L64683B4567
6209B80557K24545a13375E97099M5518B39001L22525f41217b49913G49510k92518
6199D56992L3911L94038j44854m6697A38603N57257a243338B08850a81437q90903
6189a072340c49321k81676A127852D1966f18724B44937D0018M459L39889N55023
6179I39389O88228l08578n63369K25042E9344J161685m5788E14120O62803I6060
6168A205125L31554d18312A253562k82907k17153E5008P91302k39854m7625b03907
6157A466067o35904A71273R12474l48379k87598d84090B96794J749303C88341
$$ y = [210576, -955852, -78850, 904680, -175564, 66025, 796555, 19393, 58918, -827841, 922381, 228928, 1057789, 1052977, 269526, 1052881, -144926, 1200890, -169652, 562317, 927000, 24567, 280557, 505102, -113375, 597099, 642617, 239001, 561526, -641217, -249913, 749510, 456992, 490903, 884941, 740087, 693390, 138603, 695860, -1243338, 208850, -181437, -1072340, -349321, -630997, 1127852, 41966, -618724, 244937, 40018, 44477, 384366, 939389, 1627617, 1319039, 755670, 980712, 59344, 1221029, 1175241, 514120, 1176923, 96060, 1205125, 1536679, -418312, 1253562, 970655, 753502, 55008, 846310, 606456, 558831, -203907, 1466067, 830163, 171273, 1083747, 735368, 447770, -484090, 296794, 2046097, 388341]
6147A79730M12054A22526L04612b89153D65421c40059G43083K8303c8509q39215
6137h77724I12919f14681I4142Q71898n0679m05500o3765Q37968c53153A58653
6126E66429R3342B64540O82988B84443d6197A215502g20926C39035L42785N45496
6116A227316B69771Q7772M94990a22046D91527M7776k28775q5652N13386k49046
6106D89216j01223L55843B03637b45728G38277a39993C73589J95551J0335j74969
6096D04506M50938l09046j32410J04522n5754b74781H0575M79493K0648a98660
6085D14616A84187M56931A84557M18658A59830M80516j19300R6565L05862j7242
6075I06231L75399D57053J17920d36815F73224a34967D5128J001332J74113o02191
$$ y = [179730, 591784, 122526, 427138, -289153, 465421, -340059, 743083, 771386, -38509, -877724, 912919, -614681, 94142, 966040, 915361, 509861, 446096, 1284064, -353153, 158653, 566429, 659771, 264540, 947528, 284443, -46197, 1215502, -720926, 339035, 681820, 1227316, 269771, 357543, 852533, -122046, 491527, 539303, 310528, 224876, 738262, 489216, 387993, 743836, 203637, -245728, 738277, -139993, 373589, 569140, 579475, 404506, 855444, 546398, 413988, 518510, 462756, -274781, 80575, 560068, 580716, -198660, 414616, 184187, 641118, 184557, 603215, 159830, 640346, 521046, 617611, 923473, 906231, 1281630, 457053, 574973, -436815, 673224, -134967, 45128, 1046460, 1220573, 618382]
6065F18382d42417A435552n39898f74973A129086j37519k34694d75359I57025
6055A084771k80205A86110J59193K73145a74641F85325C15343N49026J67269C39449
6044A247299N69769I7697K30236N32473a49190F05812d83322C15943M21113f88503
6033A089744k73195k82425L64527l95017M71113a70917E99479d8437H72516A96720
6022A418599L79049g2396C42724M276H1628E479P34896B6051N65319P8108B60075
6010E69569A97196b76091g2661A060235A77213H0615a48120e4505B91958J1578
6000C03536N07987n5977N97699k05287B24023O35224c52240l19846C22139N9991
5990C82130L56689J24309k68197B61982K90193k9741N11652B78418R4921K05218
$$ y = [618382, -442417, 1435552, 895654, -674973, 1129086, 991567, 756873, -475359, 957025, 1084771, 804566, 186110, 345303, 618448, -174641, 685325, 315343, 864369, 1031638, 339449, 1247299, 1817068, 97697, 327933, 860406, -149190, 605812, -483322, 315943, 737056, -688503, 1089744, 816549, 534124, 898651, 503634, 974747, -170917, 599479, -48437, 872516, 196720, 1418599, 1797648, -72396, 342724, 347000, 81628, 5479, 740375, 26051, 591370, 669478, 260075, 569569, 197196, -276091, -72661, 1060235, 177213, 80615, -148120, -54505, 291958, 303536, 811523, 755546, 1353245, 1147958, 224023, 859247, -352240, -672086, 322139, 382130, 738819, 863128, 594931, 261982, 552175, 522434, 1034086, 278418, 373339, 578557]
5980E78557N16435l41581B12945J247856E00596r5568M19063K57204E31947L06196
5970H38143k59027L61344a12245A27910a04565F82004j97591M66282a53212F76941
5959I04443E1653J383812n97939a86106A591099c86370F79806j11564N54649J82583
5949A305474i323E14098J128588E45222K69467l86000R78712a36781D97033Q33998
5939A331031G8230J005646C73269L25911K77821J97085K15244Q5912G00067p9425
5929F20642K2961k98080M07747Q4255k36790d91992H13555C4498N25044P715j06197
5918D61060N8382K59637B80984e1582A203369D05284P58332m15463A39138P52090
5908H91228C51630A66033p1561M41134O95K16395J41052L54159e0153D91214K30258
$$ y = [578557, 1094992, 753411, 212945, 1460801, 500596, 405028, 824091, 1081295, 531947, 838143, 579116, 940460, -112245, 127910, -104565, 682004, 484413, 950695, -153212, 676941, 904443, 51653, 1435465, 837526, -186106, 1591099, -386370, 679806, 568242, 1122891, 1305474, -9323, 514098, 1642686, 545222, 814689, 428689, 1407401, -136781, 497033, 1331031, 78230, 1083876, 373269, 699180, 977001, 1174086, 1389330, 1475242, 700067, 620642, 643603, 345523, 753270, 837525, 600735, -491992, 813555, 34498, 559542, 567257, 461060, 519442, 779079, 280984, -51582, 1203369, 405284, 1163616, 748153, 139138, 891228, 351630, 166033, 94472, 535606, 536301, 752696, 893748, 1247907, -50153, 491214, 721472]
5897G21472Q7299o8144k64705A89125L92885K77408k51484L32369C29145J9254
5887C48399R44190o05922c54689E33102p931A81345C1181O25451J35426L19219
5877A111277m68178J64713L49690B10814P51196K56899l85369H2152J460291A17744
5866H63764A57115N39042J76110l20348L53893a17689G40617L19721D14272q6231
5856C28041l397I1296K28944M29869B06604O65688I85M27194d00233b5153H4290
5844C19501K41466K03316B43716O34902J10669J65443L01498B52023M38182l14428
5834C75777R1420J124643e0392H50449e37422D41582K97315a70483A689475E31436
5823H47097L90634a83949k53202A299031j31469m16575O95852C31406P10859j63099
$$ y = [721472, 808771, 740627, 475922, 189125, 582010, 859418, 607934, 940303, 329145, 348399, 1292589, 686667, -354689, 533102, 525171, 181345, 31181, 656632, 792058, 1111277, 643099, 807812, 1157502, 210814, 962010, 1218909, 833540, 82152, 1542443, 117744, 863764, 157115, 696157, 872267, 551919, 905812, -117689, 740617, 1060338, 414272, 328041, 324644, 91296, 320240, 750109, 206604, 872292, 985, 428179, -400233, -25153, 84290, 319501, 560967, 764283, 243716, 878618, 989287, 1154730, 1456228, 252023, 690205, 375777, 467197, 1591840, -50392, 850449, -537422, 441582, 738897, -170483, 1689475, 531436, 847097, 1237731, -183949, -437151, 1299031, 1167562, 750987, 1446839, 331406, 1042265, 879166]
5813H79166M26245j20636m97436C15924J014787b34279A39529P49389l52029O21180
5803A158069f7304F89099B44665N32201j60328c08612A682311G88228k22154J038676
5793A604750c03150j26321A88908J03551O03578q3592B78631N56649J069311q63801
5783A040790a08608A500352E52872h1684F47701J210529H26352A20448Q65853
5774I86301l94072J09699L38141a532472A415750m46030j55119C58135O25777
5765I83912Q6322m57342A99429L60848J182787D80815g0297m02284E05851O029
5755E11880b42049E67669j70723O91224p3427k12675j95268R33074G24067O4480
5745G88547q1097J93714r4877K11380K92814d56650A075867c74653A093624m86928
$$ y = [879166, 1305411, 1184775, 687339, 315924, 1330711, -234279, 139529, 888918, 536889, 1158069, -67304, 689099, 244665, 776866, 616538, -308612, 1682311, 788228, 566074, 1604750, -303150, -429471, 188908, 292459, 896037, 812445, 278631, 835280, 1904591, 1040790, -108608, 1500352, 552872, -81684, 647701, 1858230, 826352, 120448, 986301, 592229, 701928, 1040069, -1532472, 1415750, 969720, 814601, 358135, 983912, 1070234, 612892, 199429, 560277, 1743064, 480815, -70297, -472581, 505851, 511880, -242049, 567669, 396946, 1088170, 1014743, 802068, 606800, 1539874, 724067, 788547, 707450, 901164, 806287, 1017667, 1310481, -456650, 1075867, -374653, 1093624, 606696]
5735F06696a51555A199690K6882b24198E13175K59298B48152J067772o30793L27897
5725A013028L07862o09076B70188b08488D12227b72982C11511q2438M70620J77369
5715H77062L41368B53737J04818N39294l09043N79175m16961M21408k46921L02659
5705A228166B89322J181535G10466l40860q9716A11880R11203j21891A67506C0978
5694a23853H50011o564j53215P14264E36204B61139Q94853J2524K41992F9747
5683A691362E71387O19020B00383N48366L03129B29076J163262A14738O99990
5674H14728J049276b45374H57120o6513N34552A82571J445112j54259n14333D51760
5663A046848C26886K84715M572L61582m34933J01625K72957k65433l17453J528772
$$ y = [606696, -151555, 1199690, 1226572, -224198, 513175, 772473, 248152, 1315924, 685131, 1013028, 1320890, 711814, 270188, -208488, 412227, -272982, 311511, 229073, 699693, 877062, 1218430, 253737, 358555, 897849, 588806, 1167981, 751020, 1172428, 925507, 1228166, 289322, 1470857, 710466, 369606, 279890, 111880, 1023083, 901192, 167506, 30978, -123853, 850011, 843447, 690232, 1404496, 536204, 261139, 1155992, 1168516, 1410508, 69747, 1691362, 571387, 1190407, 200383, 748749, 1051878, 229076, 1392338, 114738, 814728, 1864004, -245374, 857120, 790607, 1325159, 182571, 1627683, 1473424, 959091, 451760, 1046848, 326886, 611601, 616173, 977755, 542822, 644447, 917404, 651971, 334518, 1863290]
5653A863290F15318O14056m99465A68381O42006A15436K35444e4500j61997G61174
5642I80065l79478B82688N29674k64058P6042N8305j35727K91807k01704O11822
5632A248849P426k58471L11437L03625B98448O26671K12849m66012m6527J277686
5622A903115H92325M75420K38286j76660K19509G43201K89188J8728m62047R59734
5612A548804L68809q040o86676K90604D85882R83568D77878K46466L72138J19125
5602A215607N06392m30842J13546L02462F24395L62373l90029J71077Q16374F94312
5591C26324o1388J061418C21882L41508P48313K04434G25681L56222n32077f6955
5580C91430Q11863l29333j84096O36175k07450m5744k71764l93925j65181Q67425
$$ y = [1863290, 615318, 1229374, 729909, 168381, 810387, 115436, 350880, -54500, -216497, 761174, 980065, 600587, 282688, 812362, 548304, 624346, 682651, 546924, 838731, 637027, 1248849, 1256275, 997804, 1309241, 1612866, 298448, 925119, 1137968, 671956, 625429, 1903115, 892325, 1367745, 1606031, 1429371, 1648880, 743201, 1032389, 1051117, 589070, 1548804, 1917613, 1909573, 1222897, 1513501, 485882, 1469450, 477878, 724344, 1096482, 1215607, 1721999, 1291157, 1404703, 1707165, 624395, 986768, 596739, 767816, 1584190, 694312, 326324, 264936, 1326354, 321882, 663390, 1411703, 1616137, 725681, 1081903, 549826, -66955, 391430, 1203293, 873960, 689864, 1326039, 1118589, 1072845, 801081, 407156, 241975, 1109400]
5570A109400k71647m2296c9677A054633j22453l24007J011736F31873j28440J81901
5560F85334c17229I39613m60468M03356K79892k80456m04795N7976J83189M75091
5550A193398C67374d772r9207D09293j02350A01956P68104D20762P84779E50184
5539A267784D01993A95886M87572O16250k38591K77464C14935P72498l57696n1620
5529F78117R5705Q55449F89084N20921k84813A88516P38251M29528J27582F01303
5518I82968O66340g13931A286051B21957h0851A024817L781C33314M57838O51779
5508A442931D07661P15559k60720l77842N99123J54791K28355K97191m75712r8273
5498A190133m31025Q53123J032920p90340H53903J185057G77136q2123Q49675
$$ y = [1109400, 837753, 795457, -39677, 1054633, 932180, 608173, 1619909, 631873, 503433, 685334, -317229, 939613, 479145, 882501, 1162393, 881937, 477142, 535118, 718307, 1193398, 367374, -4772, -103979, 409293, 306943, 101956, 870060, 420762, 1205541, 550184, 1267784, 401993, 195886, 683458, 1299708, 1061117, 1338581, 314935, 1087433, 729737, 678117, 773822, 1629271, 689084, 1210005, 925192, 188516, 926767, 1356295, 1483877, 601303, 982968, 1649308, -713931, 1286051, 221957, -80851, 1024817, 1028598, 333314, 791152, 1442931, 407661, 1123220, 862500, 484658, 1083781, 1238572, 1466927, 1764118, 1288406, 1190133, 759108, 1612231, 2645151, 1854811, 853903, 2038960, 777136, 695013, 1544688]
5489A544688G07594K69928O8710P22840n92117j70838J1787L12191O41035M59284
5479B430414j035534j63042j43339P59954n78478D15623K77554L30155k04805
5470H18527l25931J242513C57160J327295o70215K93287m55698Q3177J07385j450
5460A040941l57172J470408G98099e9155I68543J461325p11421q29263Q96249
5451A785433F66679j86620J068677o04509B27565J235500O13970k44842m54287
5442A377906J76171B15141P88591J46710E02217P89822E46598l4144Q08784n56510
5432G64728L20367Q16394n18295m14714m51636J392361m03125k46523j12855m80055
5422F66647J100394m97395J8243m0674k21690m02399j26261L26390R35126C92206
$$ y = [1544688, 707594, 977522, 1046232, 1769072, 1176955, 1006117, 1017904, 1330095, 1971130, 2430414, 1394880, 1231838, 1088499, 1848453, 1269975, 415623, 693177, 1023332, 818527, 492596, 1735109, 357160, 1684455, 1014240, 1307527, 851829, 935006, 1042391, 1040941, 683769, 2154177, 798099, -59155, 968543, 2429868, 1718447, 889184, 1785433, 666679, 480059, 1548736, 944227, 227565, 1463065, 2077035, 1832193, 1377906, 1554077, 215141, 1003732, 1150442, 502217, 1292039, 546598, 512454, 1321238, 764728, 1085095, 1901489, 1383194, 968480, 516844, 1909205, 1506080, 1259557, 1146702, 666647, 1767041, 1269646, 1287889, 1247215, 1025525, 623126, 496865, 823255, 1758381, 392206]
5411A028037Q1890K51134K21280m07243d2980A284356C01423M50592K43030m91292
5401E03753K86730A25632P26565l44746L30068J53129K9100C74821P9385N0739
5391E04945j0728p5701o1181j36551P02709l47983Q10785l65367k12630L74915
5381A183213A5559L76201M90997L36342r6892a24554F33829e40599A73259M31001
5371F04260k52309O1076P91081J83616D12298L41716e14663I29832D56118M47696
5361I03814M31891g1336C49805R76380E95435K34083C53455J540543n60334C77051
5350E26839J0294J338654o08534E48280J001460D56755P2285J05448M76050K17787
5340A328325j53196l83474Q98321f961A603365m41306m64524i0836H91819Q1307
$$ y = [1028037, 1109927, 1361061, 1582341, 1175098, -42980, 1284356, 301423, 752015, 995045, 503753, 790483, 125632, 852197, 507451, 837519, 990648, 1019748, 374821, 454206, 504945, 494217, 418516, 357335, 220784, 923493, 575510, 1386295, 1020928, 808298, 1183213, 15559, 391760, 882757, 1219099, 1122207, -124554, 633829, -540599, 173259, 604260, 351951, 413027, 1204108, 1387724, 412298, 754014, -514663, 929832, 456118, 903814, 1335705, -71336, 349805, 1326185, 595435, 829518, 353455, 1893998, 1333664, 377051, 526839, 537133, 1875787, 1267253, 548280, 1549740, 456755, 529040, 634488, 1110538, 1328325, 1175129, 791655, 1689976, -6961, 1603365, 1162059, 697535, -90836, 891819, 973126]
5330I73126K14598O62353E91438R5220P89944E92176Q90271a1736G26066j19075
5320F06991P64811q5363L68086J84638k84295j38390m01393K21623J73641R1061
5310A501410m34984J511771D05780L51043k03328P11149L93247B91759L79663
5301F71422B94960P35644J98012k86831K06300E21932e2229A125831j43457C24105
5290A689260C16403M99939Q38516j56873F69144p0826L21793p4332j82778L8085
5280G01086L24653l52804K43467k88075p063j41827J347092J93687p90468M3716
5270A273464l3673n92596P06523k80702j30485m69044J632988G27415K0696l8387
5260G09724M48453K16097j96130M62386K77445I06971C17833K02972P64174k59041
$$ y = [973126, 1187724, 1850077, 591438, 686658, 1476602, 592176, 1482447, -11736, 726066, 606991, 1371802, 1286439, 1654525, 1839163, 1554868, 1416478, 1015085, 1236708, 1410349, 1501410, 1066426, 2578197, 405780, 756823, 553495, 1264644, 1657891, 291759, 671422, 294960, 1030604, 1228616, 941785, 1148085, 521932, -52229, 1125831, 982374, 324105, 1689260, 316403, 816342, 1654858, 1497985, 669144, 598318, 920111, 845779, 663001, 701086, 1025739, 672935, 916402, 628327, 621264, 479437, 1826529, 2020216, 1229748, 1273464, 1239791, 647195, 1353718, 1073016, 942531, 473487, 2106475, 727415, 748111, 709724, 1158177, 1374274, 1178144, 1640530, 1917975, 906971, 317833, 520805, 1284979, 1025938]
5250A025938C96568K33291R7731j90457P35778l17143N22487E67558Q27427o48296
5240G46689C44576J35648I0293O23139J288970q79012L20701n50821N36203k03724
5230A225749N59642k15576l38299R19038R52659M8184r28924L60983j89048A115491
5219A125606J80408N62648H50275k10514k32959L1739J68836J19723J65207P57314
5209A649621E08738P09845E67771K53750n4564J229734r64356C41145J51641P70395
5199A263181m01179Q89484G36836M62526J78804J9370F81888O47410l59704m23166
5189E46428R09390k07869k78568J73045n24401k32524J13021K63896J414046E75737
5178H55644K61224k81471R44272M878F49262O61541a390F57686J037686o73893
$$ y = [1025938, 396568, 629859, 727590, 537133, 1272911, 955768, 1478255, 567558, 1394985, 746689, 344576, 480224, 90293, 713432, 2002402, 1123390, 1444091, 893270, 1429473, 1225749, 1785391, 1569815, 1231516, 2150554, 3103213, 3151397, 2222473, 2583456, 2394408, 1115491, 1125606, 1306014, 1868662, 850275, 639761, 406802, 438541, 607377, 727100, 892307, 1649621, 508738, 1218583, 567771, 821521, 766957, 1996691, 1032335, 341145, 492786, 1263181, 862002, 1751486, 736836, 1199362, 1378166, 1397536, 681888, 1329298, 969594, 546428, 1455818, 1247949, 969381, 1142426, 618025, 385501, 498522, 762418, 2176464, 575737, 855644, 1116868, 835397, 1779669, 1784547, 649262, 1310803, -1390, 657686, 1695372, 1021479]
5168A021479l50575C16941P73166K98362k31951n35276N75883D85932O47623j90501
5158I43054B3295L22946M45913k55347K29748r1330C21098J46942O41756j62077
5148I47719L71334D38801O36081A80605N24869O14965E43291c3994A090175k67750
5138H22425J02098C55200L88449N86317n4282F36739L99445O6544N08844k9886
5128A581686o73348Q09727o77232P72849E97914N16986l53055L40311o7191J01464
5118A136429p8976j54121O2921P41215l84888Q70342G52616M09115j88877l30745
5108F42109l09446P79006l20662i7272A802606K19042r34720M9939E04891Q76928
5098A381819K16146G31164J76563l5737P66596B22198J593364p40072J023519
$$ y = [1021479, 670904, 316941, 1090107, 1388469, 1156518, 621242, 1197125, 485932, 1133555, 943054, 23295, 346241, 792154, 536807, 766555, 675225, 321098, 468040, 1109796, 947719, 1319053, 438801, 1074882, 180605, 705474, 1320439, 543291, -33994, 1090175, 822425, 924523, 355200, 743649, 1329966, 1275684, 636739, 1036184, 1102728, 1611572, 1581686, 908338, 1718065, 1040833, 1813682, 597914, 1114900, 761845, 1102156, 1034965, 1136429, 1057453, 903332, 966253, 1707468, 1322580, 2192922, 752616, 1161731, 972854, 642109, 332663, 1111669, 791007, -97272, 1802606, 2021648, 1086928, 1136867, 504891, 1381819, 1597965, 731164, 907727, 871990, 1638586, 222198, 1815562, 1075490, 2099009]
5089B099009o99823m42459O4413M14399j15222L02189n94018M42203p34583O85838
5079A421946m74148J428079A156996j67603J173007H87452N10829L13246L29126
5070B040653o66596j05393M72246k87763C45660N39954P40079j25377J63379L04689
5060A968384J298704G27708k2219J040802l44232j16512M99995k01559L01848
5051A885831o47417M35783K84207E04166R19982n7720L14997j85979M35266J096718
5041C027430j497539O23982F43712J289222m11206J2376E13036R22779A58870
5031G25967Q80913M51149q92182Q13778n65655M73655p34970R17276m88421a2451
5020A033153J082192l31842o65725Q47442q71190J193102I61954K27451P38048
$$ y = [2099009, 1399186, 956727, 1021140, 1435539, 1320317, 1622506, 1028488, 1470691, 736108, 1421946, 947798, 2375877, 1156996, 989393, 2162400, 887452, 1398281, 1711527, 2040653, 1374057, 1268664, 1740910, 1453147, 345660, 885614, 1625693, 1500316, 1663695, 1968384, 3267088, 727708, 705489, 1746291, 1402059, 1285547, 1785542, 1583983, 1885831, 1238414, 1674197, 1958404, 504166, 1424148, 1366428, 1681425, 1495446, 1930712, 3027430, 1529891, 2153873, 643712, 1932934, 1521728, 1534104, 513036, 1435815, 158870, 725967, 1606880, 2058029, 1165847, 1979625, 1413970, 1887625, 1152655, 2069931, 1581510, -12451, 1033153, 2115345, 1783503, 1117778, 1965220, 1094030, 2287132, 961954, 1189405, 1927453]
5011A927453L32915G65377J234838q08838l61509J138347j77044m67740N84602
5002A908033R60178A357805O80528l49968p01633P10653l46624K47263k23470
4993A374554O5585m00412J000799m81097O1201m78364m64840A44060J832520o92183
4983A284397J05088P67154K19610A100155J143128H10100R196M50377m9441C95376
4972A762398n71333m4698L87980R70927j88348o71230M41171q35974J085123j109031
4962A226985J10999J40276n79340J254152o81396N3799J328214A012936Q11415
4953A824351L303J122318l05598M94597l14871P81822J40632R79993M82233n4027
4943E154753j155679L61065r45748Q8325r72669M78022j059031l49719Q64476
$$ y = [1927453, 2260368, 765377, 2000215, 1191377, 829868, 1968215, 1791171, 1323431, 1908033, 2868211, 1357805, 2038333, 1688365, 986732, 1697385, 1350761, 1598024, 1374554, 1440139, 1039727, 2040526, 1559429, 1620630, 1142266, 677426, 144060, 1976580, 1284397, 1389485, 2156639, 2376249, 1100155, 2243283, 810100, 819296, 1269673, 1220232, 395376, 1762398, 1191065, 1146367, 1534347, 2505274, 2316926, 1645696, 2086867, 1250893, 2336016, 1226985, 1337984, 1478260, 898920, 2153072, 1471676, 1525475, 2853689, 1012936, 1824351, 1827654, 2949972, 2644374, 3138971, 2824100, 3605922, 3746554, 4726547, 5208780, 5154753, 3999074, 4360139, 3414391, 3502716, 2530047, 3008069, 1949038, 1599319, 2463795]
4934B463795j98402F53457J091806l90662N4334o055k58473k61462O86157n94905
4924I74197M73045l83088j66571j43507M51275M23603o58361j28267j52076P31024
4914A421274k2690K25658N24151q11730C00961K281025n14218o86220n42257J142005
4904A981296F11347O58200L96377n53577M99097j31753O03929L4204q21879Q23791
4894B119736M1553p55822L01940m37113l59466C21953J617318l85884N17281n47952
4884A522716l77493j33832K38557O18575q44852K10697N59720B58059M73530P3017
4874H04606P66708l05925J31528J01960l13231J188908A040201k85522l55122
4865C99557Q47486P13978L39078E70708P83655L9516J80140D12812R01387m7621
$$ y = [2463795, 2265393, 653457, 1745263, 1354601, 1408935, 1402880, 1144407, 882945, 1569102, 974197, 1447242, 1064154, 897583, 754076, 1205351, 1628954, 970593, 842326, 690250, 1421274, 1398584, 1624242, 2148393, 1336663, 300961, 2581986, 2067768, 1381548, 839291, 1981296, 611347, 1269547, 1665924, 1112347, 1611444, 1479691, 2083620, 2117824, 1295945, 2119736, 2161289, 1405467, 1707407, 1270294, 910828, 321953, 1939271, 1553387, 2070668, 1522716, 1145223, 1011391, 1249948, 1868523, 1023671, 1234368, 1794088, 258059, 731589, 804606, 1571314, 1265389, 1396917, 1498877, 1185646, 2374554, 1040201, 754679, 399557, 1247043, 1961021, 2300099, 570708, 1354363, 1393879, 1574019, 412812, 1314199, 1266578]
4855A266578J129038H51399l96O0336M32097o8742K11702o87412N8210M52696
4845A309890M25558n99217J7780K49523l17388k59100R62022j60378l44879A77901
4834A657637H19664R44228B55912K056041l94764r9043q9857o68280J74195m78647
4824G55557J165449o34137M43328J26979q86266R75614O22215A130192P24229
4815A854421l10321k73043K19186o12673N28969m69862J61705N6116Q74602o740
4805B022360n72078K55374q29967R32935L10657p87068L92275p10749J184497
4796B198236o61130k73035K65022m81036R53988p34788P51846j8916M02880j162643
4786A240424M5593O61699I58132N33252j30679L93714l22039N31456p77020R4569
$$ y = [1266578, 2395616, 851399, 851003, 911339, 1343436, 1274694, 1486396, 798984, 857194, 1309890, 1735448, 1136231, 1154011, 1403534, 1086146, 827046, 1789068, 1628690, 1283811, 177901, 1657637, 819664, 1763892, 255912, 2311953, 1917189, 1818146, 1728289, 1060009, 1234204, 755557, 1921006, 1286869, 1730197, 1857176, 970910, 1946524, 2568739, 1130192, 1854421, 1544100, 1271057, 1490243, 877570, 1406539, 936677, 1098382, 1154498, 2029100, 2022360, 1450282, 1705656, 875689, 1808624, 2119281, 1332213, 1724488, 1013739, 2198236, 1537106, 1264071, 1529093, 1048057, 2002045, 1267257, 2019103, 2000187, 2403067, 1240424, 1286017, 1947716, 958132, 1491384, 1360705, 1754419, 1432380, 1963836, 1186816, 1281385]
4776A281385N45879k21936N20404m90955l83413R65474r42699M11794j98994J266269
4766B753208q71061j46703r7983O85279P816k40312L96651k41370p63744K64655
4756A746436n8238l55053N4591R03899P60533j090243E45988J194359Q16204r59543
4746A597008K08760k64033l12558K8022J098845n32252l46416N20608K85529n82828
4736A700685K651n9538Q96205k63111j01887K71892m53249j4709j31705J05627
4726A952861J21978H31456J711675q56934l24691A19066J259650J595033r25457
4717B048292A014149L89236N35909K04134j04714K64655M64245j37231K84327
4708B914710A371284O33617p91820J333181k42809k67337j33591N05238j26221
$$ y = [1281385, 1827264, 1605328, 2125732, 1634777, 1251364, 2216838, 1274139, 1685933, 1486939, 2753208, 1882147, 1735444, 1637461, 2322740, 2330556, 2090244, 2486895, 2245525, 1481781, 1746436, 1688198, 1333145, 1387736, 2291635, 3052168, 1961925, 545988, 1740347, 2556551, 1597008, 1805768, 1541735, 1229177, 1257199, 2356044, 1823792, 1477376, 1997984, 2283513, 1700685, 1703336, 1643798, 2540003, 2276892, 2175005, 2446897, 1993648, 1978939, 1847234, 1952861, 2074839, 831456, 2543131, 1686197, 1361506, 119066, 1378716, 2973749, 2048292, 1014149, 1403385, 1939294, 2143428, 2038714, 2303369, 2767614, 2630383, 2914710, 1371284, 2004901, 1213081, 2546262, 2303453, 2036116, 1902525, 2407763, 2281542]
4699B281542o47567N04792M11769A269399J467178r29813J067479l36121J074100
4690C612222j265357K4744N28559j89425J092875N8513m48888J059231j605098
4681B867376j00089q8813P17742p08263O99751q5215m58566R25651j390990Q1004
4671B459588j90557k63252J05703q32601K80892L9786q773Q42456N040J60879
4661B599161j181235O70262K71935O5548j173456Q23857J076080r00688Q05429
4652C056893p2402k00600r55297R15436j187909J611989J015600j213147o11459
4643B359104L00388J50600J445436B004613J539742l39072k4895o09015K29202
4634B800575j038230J558625j058499n44470N10489m00731O05889k68682b62269
$$ y = [2281542, 1633975, 2138767, 2550536, 1269399, 2736577, 1806764, 2874243, 2538122, 3612222, 2346865, 2371609, 2900168, 2710743, 3803618, 3862131, 3413243, 4472474, 2867376, 2767287, 2678474, 3396216, 2687953, 3387704, 3302489, 2843923, 3769574, 2378584, 2459588, 2269031, 2005779, 2111482, 1278881, 1559773, 1599559, 1590786, 2433242, 2438282, 2599161, 1417926, 2088188, 2360123, 2425671, 1252215, 2076072, 3152152, 2251464, 3056893, 2984491, 2783891, 1828594, 2744030, 1556121, 3168110, 4183710, 2970563, 2359104, 2659492, 2810092, 4255528, 2004613, 3544355, 3205283, 3180388, 2571373, 2800575, 1762345, 3320970, 2262471, 1718001, 2228490, 1827759, 2433648, 2164966, -262269]
4624A792645O54042O7293K37945m35081r8214m59842J167851A203354J318248
4615B521602j096636J276445I44621J09800J213786Q1525A144858M18693k09641
4606A353910m3152L47016m08685O41520D38870R48495N72776K52349K9156o3837
4596B177809M13226q85195N6179J25460L28812J09555j154547N14009k84731K19611
4586A620188K7838k70632P22821K09911n27362j74378N82078k06517j37304k78154
4576A568489N44863q81137P41030Q22102m45639A144094J117725N98601J81571
4567C041991F41966J619085R91512o90447j56623J34189A264900P69028R3802
4558B127730O17376l32282O07546o48136n52019O90083O49169M62626A718882
$$ y = [1792645, 2446687, 2513980, 2751925, 2316844, 2218630, 1758788, 2926639, 1203354, 2521602, 1424966, 2701411, 944621, 1054421, 2268207, 2349732, 1144858, 1563551, 1353910, 1310758, 1657774, 1249089, 1890609, 438870, 1387365, 1960141, 2212490, 2241646, 2177809, 2591035, 1705840, 1762019, 1887479, 2216291, 2325846, 1171299, 1685308, 1400577, 1620188, 1648026, 1377394, 2100215, 2310126, 1782764, 1608386, 2190464, 1983947, 1846643, 1568489, 2113352, 1232215, 1973245, 2795347, 2349708, 1144094, 2261819, 2860420, 3041991, 641966, 2261051, 3252563, 2562116, 2405493, 2539682, 1264900, 2033928, 2127730, 2745106, 2412824, 3020370, 2372234, 1820215, 2510298, 3159467, 3622093, 1718882]
4548A555930P01966Q22585j23016j58012o49178O76107j31727o48807P69087O766
4538B821701m49153j69442R50438j208253P69393r69738N07368M99263k04381
4529B547196l33219j43268P78549J75629n57505q48892L5825M0583P42833n07585
4519A930146L36418j011572O94885P7005n17874Q51982m47390m1920P36475A068805
4508A668696M69828m14271j36873M90395l77319M03112R65064j354810K87819
4499B001641r01027J590354j192078N80888K36143K27456k03659p85963n8207
4490A495548O37346j21485N96400k09867O94556q80496o26429K173233j052293
4481B706513n18179j24188J093611j103015M29071o389o46404J7784J104023j322354
$$ y = [1555930, 2257896, 3080481, 2957465, 2799453, 2150275, 2826382, 2694655, 2045848, 2814935, 2821701, 2372548, 2203106, 3153544, 1945291, 2714684, 1744946, 2252314, 2751577, 2547196, 2213977, 2070709, 2849258, 3024887, 2467382, 1618490, 1654315, 1694898, 2437731, 1930146, 2266564, 1254992, 1949877, 2026882, 1509008, 2360990, 1913600, 1871680, 2608155, 1068805, 1668696, 2138524, 1724253, 1587380, 2077775, 1700456, 2103568, 3068632, 1713822, 2001641, 1100614, 2690968, 1498890, 2079778, 2315921, 2543377, 2339718, 1553755, 1495548, 2132894, 2011409, 2607809, 2397942, 3092498, 2212002, 1585573, 3758806, 2706513, 2188334, 2064146, 3157757, 2054742, 2483813, 2477424, 1831020, 1848804, 2952827, 1630473]
4471A630473j54896J867046j425685L49157p15117J025898q69371K22934o47061
4462A283378M55650j61304M21084L52554j28426J63342J322781j017670j92048
4453B499341o57343I02775J047700k99610R92261J26878l81687L53783k46347
4444B495753Q78122O2651o36005n13303M41906k61474J333190j387841j0196L14782
4434B717585M94528k7329k2412Q71967l16947L91411m53953j72248L60909K54936
4424D098447j871984J104664L02479j047618K00988L06175k49005J30328O30616
4415C605090J1097n57262M19467K47398j228951J27993L72062L07411m59942k38602
4405B605761J9954R6315J024366L95611j11520o68732k32432N12150K04867P99148
$$ y = [1630473, 1475577, 3342623, 1916938, 2266095, 1550978, 2576876, 1707505, 1930439, 1283378, 1739028, 1577724, 1998808, 2351362, 2222936, 2386278, 3709059, 2691389, 2499341, 1841998, 902775, 1950475, 1650865, 2643126, 2770004, 2388317, 2742100, 2495753, 3373875, 3436526, 2800521, 2287218, 2729124, 2467650, 3800840, 2412999, 2402803, 2717585, 3212113, 3184784, 3162372, 4034339, 3717392, 4108803, 3654850, 3482602, 3843511, 4098447, 2226463, 3331127, 3633606, 2585988, 2786976, 3093151, 2844146, 2974474, 3605090, 3616187, 3058925, 3478392, 3725790, 2496839, 2624832, 2996894, 3304305, 2844363, 2605761, 2625715, 2722030, 3746396, 4142007, 4030487, 3361755, 3129323, 3641473, 3846340, 4645488]
4395D645488j520524J250181r31753k047M53981n49455J248722j102185M68406
4386C960814p19344N70529O1354o25219R01111n97120k16217Q3888o37935R58707
4376C740568j802408J784195m66271J22370j220441Q74205K02412j030917J16367
4367B320080j25570L45262N18755o02348k43586Q48821k85856M27595k28544j18566
4357B856043p34292j1431p84206J373245Q85794j771947P57456K61598k91692
4348B540568J12515J109382o64381k97319k38277K27351o28561J180443q5906
4339C255815q74465N21781j65326l78740K88701n75427J042365j221787L15754
4330B208671J98033P2531O33159O13587j344583m62638J158179j532678J114973
$$ y = [4645488, 3124964, 4375145, 3443392, 3441345, 3895326, 3345871, 4594593, 3492408, 3960814, 3241470, 3811999, 3873353, 3248134, 4149245, 3552125, 3335908, 3419796, 2781861, 3740568, 1938160, 3722355, 3256084, 3378454, 2158013, 3032218, 3234630, 2203713, 2320080, 2194510, 2539772, 3058527, 2456179, 2212593, 3061414, 2775558, 3203153, 2974609, 2856043, 2121751, 2110320, 1326114, 2699359, 3585153, 1813206, 2570662, 2832260, 2540568, 2653083, 3762465, 3098084, 2800765, 2562488, 2789839, 2161278, 3341721, 3255815, 2381350, 2903131, 2737805, 2359065, 2647766, 2072339, 3114704, 1892917, 2208671, 2406704, 2479235, 3112394, 3725981, 2381398, 1918760, 3076939, 1544261, 2659234]
4321B659234P93613j097618J904943k082294M66355n34736L83864q55955J201478
4312B838884n91655m03017R35953R700p05026O61428o79439J142857q80201R58745
4302C288229j216607j87887J017128n19344J210881j533466K82787n8842L90305
4293B673184m35012j008385J75959J900878q08935p24638m79690Q39120j49401
4284A983080k56218M14202R17961m27697o54269l59816J797068p08679m23185
4275B282447k55341P66916o04466M03325n70454m55725Q83165A109125J172964
4266B282089j2796K2451M0643J26311r41207J267165n04029l79881L99520j80685
4256B119581J032609j095519M90086o90289P20716l3883J25538N20909p06033
$$ y = [2659234, 3452847, 2355229, 4260172, 2177878, 2644233, 2109497, 2493361, 1637406, 2838884, 2247229, 1844212, 2780165, 2789865, 2084839, 2746267, 2066828, 3209685, 2329484, 3288229, 2071622, 1883735, 2900863, 2381519, 3592400, 2058934, 2341721, 2282879, 2673184, 2238172, 1229787, 1405746, 3306624, 2497689, 1773051, 1293361, 2132481, 1983080, 1726862, 2141064, 3059025, 2631328, 1977059, 1617243, 3414311, 2705632, 2282447, 2027106, 2794022, 2189556, 2592881, 2022427, 1566702, 2449867, 1109125, 2282089, 2269293, 2291744, 2332387, 2458698, 1517491, 2784656, 2280627, 1900746, 2300266, 2119581, 3152190, 2056671, 2546757, 1856468, 2577184, 2543301, 2668839, 3189748, 2483715]
4247B483715q10722K94724N56320o5172A127178J071729K51349j10731m28917
4238A910608K90993J75826P77713q83668l59969P02010R2000m81824Q15661J4310
4228C053660k58740p21755m66636J744038n65813R02696o46433k78256o07765
4219B154996J495426o9300p16576L5048M99953j67821j92656J53218N93369L58808
4209D144465m44783O91980q80656R08041P16000j019865L43764Q25812n70215
4200D714543l0520n05676L53056k31498m611r34585O16383J111005j635648J343459
4190D795908n38965m94458j17825l2996j314558J13845L87283K90854m95933l34504
4180B258651Q44817P2609L40805j81392n94050M21097O60021N41622j115070j26390
$$ y = [2483715, 1672993, 1967717, 2524037, 2458865, 1127178, 2198907, 2450256, 2339525, 1910608, 2201601, 2377427, 3155140, 2271472, 1911503, 2613513, 2705513, 2223689, 3039350, 3053660, 2794920, 2073165, 1606529, 3350567, 2784754, 3687450, 3041017, 2762761, 2154996, 3650422, 3581122, 2864546, 2899594, 3399547, 3231726, 3039070, 3192288, 3785657, 4144465, 3699682, 4391662, 3511006, 4419047, 5135047, 4115182, 4458946, 5284758, 4714543, 4684023, 4178347, 4531403, 4299905, 4295294, 3360709, 3977092, 5088097, 3452449, 4795908, 4256943, 3762485, 3644660, 3611664, 2297106, 2410951, 2798234, 3089088, 2593155, 2258651, 3103468, 3176077, 3516882, 3335490, 2741440, 3162537, 3822558, 4364180, 3249110, 3122720]
4170C122720J086855o49621K85536q03012O66972r30328M23591M09499r38688
4161B673524J050191p36943k29298J017092p23701J542593j946877Q3766L78211
4152C108558o47472j31982J332680P2166j326585L19304m30124J172409k24552
4143C244402K96273m1463J71897m00883J792549q36684o55136J123555n26594
4134D167916N66169m49974J13571M11827M7160L05241j52851k62073R91156m81410
4124E256732J22102J84958M32597M18698j039483j23828J9527J416091O6231L16245
4114G069870k08417J40303q06251Q5162m18492J038082p87907m98339l63299J362783
4104F613495j365789J082912N7290p53598Q62679J26586R27321N07699L50978
$$ y = [3122720, 4209575, 3559954, 3845490, 3042478, 3709450, 2779122, 3202713, 3612212, 2673524, 3723715, 2986772, 2757474, 3774566, 3050865, 4593458, 2646581, 2730347, 3108558, 2461086, 2329104, 3661784, 3733950, 2407365, 2726669, 2296545, 3468954, 3244402, 3540675, 3499212, 3671109, 3270226, 5062775, 4226091, 3570955, 4694510, 4167916, 4734085, 4284111, 4397682, 4809509, 4856669, 5161910, 5009059, 4746986, 5738142, 5256732, 5378834, 5563792, 5996389, 6415087, 5375604, 5251776, 5271303, 6687394, 6753625, 7069870, 6861453, 7001756, 6195505, 6280667, 5862175, 6900257, 6112350, 5614011, 5250712, 6613495, 5247706, 6330618, 6387908, 5634310, 6496989, 6623575, 7550896, 8058595, 8409573]
4095H409573p96973N92240l32951J081090K40409l20741M37006L80597N08877
4086A0199127m00138R72155m99401J058930K23854O11335j538765J80191J060651
4077A1867939N39530O1497r13239K273244n2809J501030L51899J37193M59858
4068A6226142k605931j466839j739162j309451j959192j012386j09766n72027
4060E451388Q93045j078445p51884L12632k04101j18723n46536P54444q97938
4051C813882R17913j44544j057365P84269p03843n7538J317268j271640m12977
4042C185425K75757K88879P25454K77095k307278J546779p56480P222Q00390K56653
4032D299896P44486j317092L18572O1818l45006J290028o46856k20123J011785
$$ y = [8409573, 7612600, 8204840, 7871889, 8952979, 9193388, 8872647, 9309653, 9690250, 10199127, 9798989, 10771144, 10271743, 11330673, 11554527, 12165862, 10627097, 10807288, 11867939, 12407469, 12468966, 11555727, 13828971, 13776162, 15277192, 15629091, 15766284, 16226142, 13620211, 12153372, 10414210, 9104759, 7145567, 6133181, 6023415, 5451388, 6344433, 5265988, 4514104, 4826736, 4622635, 4503912, 3957376, 4711820, 3813882, 4731795, 4587251, 3529886, 4314155, 3610312, 3552774, 4870042, 3598402, 3185425, 3461182, 3750061, 4475515, 4752610, 2445332, 3992111, 3235631, 3242853, 4043243, 4299896, 5044382, 3727290, 4045862, 4107680, 3762674, 5052702, 4405846, 4185723, 5197508]
4023E197508M8644k43680K65074q46954L85687N86445j606636J763583k036209
4014C513462m36244K67905O38698P1047n84147P8709k10914n60451m1573O94184
4004C430676l98510P03684m26916j47184k6181j139101J271964j067014K076113
3995D277531r85815p38033J162923r84275O12198q05834Q21737N60149m26907
3986C493674j59457q22895J000913A585588L29498J976466l01245p15324Q81995
3977C756978o62416O31464l78634p05956J295213n30738K67135k38567L16993
3968C751472J8775j63702p73846R95954n61627M81819J24030p39378j77220R04232
3958C860509o00575m42478R05769o14546m61539P51602J08570n3042N35481q68500
$$ y = [5197508, 5246152, 5002472, 5267546, 4420592, 4806279, 5392724, 3786088, 5549671, 3513462, 3077218, 3345123, 3983821, 4054868, 3470721, 3549430, 3338516, 2778065, 2736492, 3430676, 3032166, 3735850, 3308934, 3161750, 3135569, 1996468, 3268432, 2201418, 4277531, 3291716, 2553683, 3716606, 2732331, 3344529, 2538695, 3360432, 3920581, 3493674, 3334217, 2511322, 3512235, 1585588, 1915086, 3891552, 3590307, 2874983, 3756978, 3094562, 3726026, 3347392, 2641436, 3936649, 3405911, 3673046, 3434479, 3751472, 3770247, 3606545, 2832699, 3828653, 3267026, 3748845, 3872875, 3133497, 2956277, 3860509, 3259934, 2817456, 3723225, 3108679, 2647140, 3398742, 3507312, 3454270, 3989751, 3121251]
3948C121251q7075M22897j127420N71348J567837j793633J006039P18015j017262
3939C381997n82092K05071J10406n85352R20092q12743J220558o73562L50531
3930C534906k72717k42298n02658n46232J388665r37808O97621l92707q77320
3921A849452J251952M85686j416116P6815L75306O74893k71384M92059m1198j110661
3911B366804J005218k3812L61256j018623R87060L76815j372565L07657J62487
3902C152297k55240j15486J086827l2473r81415J242335L3581o91361J15510M16769
3892C971344k84484k05470O99419j259607M91505M16888m45498Q21710j218763
3883B987044Q51592j030390M15700K63149j651496J908397K05179l22496K91374
$$ y = [3121251, 3034176, 3457073, 2329653, 2901001, 4468838, 2675205, 3681244, 4399259, 3381997, 2799905, 3004976, 3115382, 2530030, 3450122, 2637379, 3857937, 3184375, 3534906, 3262189, 3019891, 2517233, 1971001, 3359666, 2421858, 3119479, 2726772, 1849452, 3101404, 3587090, 2170974, 2247789, 2623095, 3297988, 3026604, 3518663, 3477465, 2366804, 3372022, 3348210, 3709466, 2690843, 3677903, 4054718, 2682153, 2989810, 3152297, 2897057, 2781571, 3868398, 3835925, 2854510, 4096845, 4130426, 3439065, 3554575, 3971344, 3686860, 3481390, 4180809, 2921202, 3412707, 3829595, 3384097, 4205807, 2987044, 3838636, 2808246, 3223946, 3487095, 1835599, 3743996, 3949175, 3626679, 3918053]
3874C918053K53103K39920j659661J177424o82391k5458J330363l32546l48241
3865C870566j057653O71744M57456q63900N70314m34086L16154N95884r0885K10814
3855D246408j96458j503420K074034m88211j060335N35769R5810j054193J523947
3846D173351O81028j655815l09015P97033R65765p24848o36488N17204K08543
3837D016758q78456O21568L49861l26090o34957J976974j4764j64175j344545
3828C602174R49034j459334K227616l59805r87258O81889l90973R54178j059796
3819D157725k9870n52924J389887L94997L69772j154599K44267j34745Q23076
3810E507586q36941M00055J73279R17549n42234N81182Q98971j624818M82211
$$ y = [3918053, 4171156, 4411076, 2751415, 3928839, 3246448, 3220990, 4551353, 4218807, 3870566, 2812913, 3484657, 3942113, 3078213, 3648527, 3214441, 3530595, 4126479, 4035594, 4246408, 4049950, 2546530, 4620564, 4132353, 3072018, 3607787, 3703597, 2649404, 4173351, 4854379, 3198564, 2889549, 3686582, 4652347, 3927499, 3291011, 3808215, 4016758, 3138302, 3759870, 4109731, 3783641, 3148684, 5125658, 5110894, 4946719, 3602174, 4551208, 3091874, 5319490, 4959685, 3972427, 4654316, 4263343, 5217521, 4157725, 4127855, 3574931, 4964818, 5359815, 5729587, 4574988, 4819255, 4684510, 5507586, 4670645, 5070700, 5243979, 6161528, 5619294, 6200476, 7099447, 5474629, 5956840]
3801E956840M75234o84160J174657o41843J031495O95382r81759R67949m95104
3792G498691M41205o99772J441987k53797j024694J669880o91256K191623q46746
3783I727121J309628J768698p18356K10108R92984J794107K79804l10091N53862
3774A5607865J141928N02443r32568J803427M96121P26776M51268J866114j108976
3765B0554398K524850q76320J188770P90226j65910J244394r02438j644228j965944
3756B0747798k988448l261755k317725j889352K17763p34096k580885J201549
3748H394849j387292L08713Q87539j161179O96618k70207l30238l36968N93150
3739G394985J260142j306317J544751J009611q54970P8243k363784Q08264m72130
$$ y = [5956840, 6432074, 5747914, 6922571, 6280728, 7312223, 8007605, 7025846, 7993795, 7498691, 7939896, 7240124, 8682111, 8428314, 7403620, 9073500, 8382244, 10573867, 9727121, 11036749, 12805447, 12087091, 12297199, 13290183, 15084290, 15364094, 15054003, 15607865, 16749793, 17252236, 16319668, 18123095, 18619216, 19345992, 19797260, 21663374, 20554398, 23079248, 22202928, 23391698, 24181924, 24016014, 25260408, 24357970, 22713742, 20747798, 17759350, 14497595, 12179870, 10290518, 10508281, 9774185, 7193300, 8394849, 7007557, 7316270, 8203809, 7042630, 7739248, 7469041, 7138803, 6801835, 7394985, 8655127, 7348810, 8893561, 9903172, 9048202, 9126445, 6762661, 7570925, 7098795]
3730G098795P61442k24842R12502p50971j510938M23777P08528Q90315j18190
3721H190418o02044l29596p10018M44676N58399K92210n61267J63513k6575k22132
3711G197584P46649k44119N58195J672172L22855J017867J766840J13681j884864
3702A1266860m87421j962234l51130m21823j359994J39050k31561P49409m67253
3693F873903j86729j10052M45754q55959J336406j80272L48984R24021j562294
3684G033762l0552O16540r34133k52802L93859k22269K80854n9210J32017N46852
3674G504918J21208O7658L52125j466466L00651q07358J171814j240370P8556
3665F082736n92462r61721J158854J86846k54026p65271J463526r28480K07682
$$ y = [7098795, 7860237, 7635395, 8547897, 7796926, 6285988, 6709765, 7418293, 8308608, 8190418, 7588374, 7258778, 6548760, 6993436, 7551835, 7844045, 7282778, 7446291, 7419716, 7197584, 7944233, 7700114, 8258309, 9930481, 10253336, 11271203, 13038043, 13151724, 11266860, 10779439, 8817205, 8466075, 8044252, 6684258, 6823308, 6591747, 7341156, 6873903, 6687174, 6577122, 7022876, 6166917, 7503323, 7323051, 7672035, 8596056, 7033762, 7003210, 7619750, 6685617, 6432815, 6826674, 6604405, 6885259, 6826049, 6958066, 7504918, 7626126, 7693784, 8045909, 6579443, 6880094, 6072736, 7244550, 6004180, 6082736, 5490274, 4528553, 5687407, 5874253, 5620227, 4854956, 6318482, 5390002, 5597684]
3656E597684M48045q82777m9536M83859M39059l92364O53569j414365K352590
3647G235764j659519O77975m05239K72991K400n72042O29803n31280j10010q13518
3637D727325J145328L26452o96780K21663k87804J506375l81352m09802J67486
3628F318891L6169Q89127m66619r50461M98248J88744m21910p68505P47736M09429
3618F480849K66966j029597P48649k13295J71806O3536q890j70366M67321n2553
3608F724426N3235q1042r4993K07213N78033l0962q78634O38883q11841R3691
3598F398009Q7113O79706n72415M17444J299022q21363o74908N5032L73348p4691
3588G166297N0849j46855k23378M61823k17395p5930J259755j331480O7140K47864
$$ y = [5597684, 6045729, 5162952, 5113416, 5597275, 6036334, 5643970, 6297539, 4883174, 7235764, 5576245, 6254220, 5848981, 6121972, 6124372, 5552330, 6182133, 5650853, 5540843, 4727325, 5872653, 6199105, 5502325, 5723988, 5436184, 6942559, 6561207, 6151405, 6318891, 6355060, 7244187, 6777568, 5827107, 6325355, 6514099, 6092189, 5323684, 6071420, 6480849, 6747815, 5718218, 6466867, 6253572, 6425378, 6488914, 6480024, 6309658, 6776979, 6724426, 6777661, 6696619, 6601626, 6808839, 7386872, 7355910, 6477276, 7116159, 6304318, 6398009, 6485122, 7164828, 6592413, 7009857, 8308879, 7487516, 6812608, 6867640, 7240988, 7166297, 7217146, 7070291, 6846913, 7308736, 7091341, 7015411, 8275166, 6943686, 7010826, 7258690]
3578G258690j1817N89106k31004k34524Q2833K67538R53062l84129N3662k18114
3568H125303Q68927q73609K81735Q31321p50175J11752m27460J435058p72598
3559H830254q87574N41747N25137o40932L86400M07024r9484N44793j094153Q74792
3549I388004o33923J030296L45455q94709Q60906O87893j426953R09471k95385
3540I971055l11688M31594O10141J206742p46948J116085o47022J8321m11359
3531A1236921L59749q22625M06859K01497r69326J306132m70329P57094J172473
3522A3178445J99028K16521l12624J9561j038648J235681K12769j10900L30402
3513A3930235O70462k96129R23944o39321P6992k71J429100p11815K076116K05537
$$ y = [7258690, 7246873, 7835979, 7604975, 7370451, 7453284, 7720822, 8673884, 8289755, 8343417, 8125303, 8994230, 8120621, 8402356, 9233677, 8483502, 8595254, 8167794, 9602852, 8830254, 7942680, 8484427, 9009564, 8368632, 8755032, 9162056, 9062572, 9607365, 8513212, 9388004, 8754081, 9784377, 10129832, 9235123, 10096029, 10783922, 9356969, 10266440, 9971055, 9659367, 10090961, 10701102, 11907844, 11160896, 12276981, 11629959, 11648280, 11236921, 11596670, 10774045, 11180904, 11382401, 10413075, 11719207, 11248878, 12005972, 13178445, 13377473, 13593994, 13281370, 13300931, 12262283, 13497964, 13710733, 13599833, 13930235, 14600697, 14304568, 15228512, 14589191, 14666183, 14665912, 16095012, 15383197, 17459313, 17664850]
3503A7664850J34690R21253R06873N52800R23736L05942n3936J992746Q98692
3494B4247646J043982J11050J091742J036234J395812M44994J347604J161730
3486C1880794J536004J158308J387343J996041P15847K105476K470624K602740
3478D5853177K252960L715360K970172M588139L476708N369144N545024O240463
3470H0011147O906416P734008O745879Q702176R178480R049103J0523760J2419503
3462A51270472J3430383J4692800J7791615K0295887K4925327K9203134L6332895
3455C07942513M5947037N9666782Q2269948J11223418J44356794J67702647J36417466
3448A055526605K2872191j22342010j97898935j89771383j46877529j06166907
$$ y = [17664850, 17799540, 18720793, 19627666, 20180466, 21104202, 21410144, 21356208, 23348954, 24247646, 25291628, 25402678, 26494420, 27530654, 28926466, 29371460, 30719064, 31880794, 33416798, 34575106, 35962449, 37958490, 38674337, 40779813, 43250437, 45853177, 48106137, 51821497, 54791669, 59379808, 62856516, 68225660, 73770684, 80011147, 86917563, 94651571, 101397450, 110099626, 119278106, 128327209, 138850969, 151270472, 164700855, 179393655, 197185270, 217481157, 242406484, 271609618, 307942513, 353889550, 413556332, 495826280, 607049698, 751406492, 919109139, 1055526605, 1078398796, 956056786, 758157851, 568386468, 421508939, 315342032]
3442C15342032p3517164n1080590l6628862k5332751k1257951j5116807j0000424
3435H2407483r420447p135500o445952n755235l692836l862452j932032m340464
3427C9822565j641116k037520k788351k616120r47010k255940m00194n19470j516566
3418B5100278j803350P14896j920290m64316k185172P07744j674072j282066P74071
3409A7967723r67225J13873j779376M27109n32813o12241j71779n12340O27178
3400A4560109q1791r52663m489m06663j272314Q15116j03741n31791p08779Q40935
3390A2153929n03382r64023M34269n3208r89757l70041L43419p90381J93866j518965
3380G935726Q52424o35113n9108p69613O50835r94381L05034j30436J59140J583096
$$ y = [315342032, 241824868, 190744278, 154115416, 128782665, 107524714, 92407907, 82407483, 72987036, 65851536, 59405584, 53650349, 49957513, 46095061, 44163029, 39822565, 38181449, 36143929, 33355578, 30739458, 29792448, 27536508, 27136314, 26616844, 25100278, 23296928, 24011824, 22091534, 21627218, 19442046, 20149790, 18475718, 17193652, 17967723, 17000498, 17114371, 15334995, 15762104, 15229291, 14617050, 14445271, 13932931, 14560109, 14478318, 13525655, 13521166, 13114503, 11842189, 12657305, 12553564, 12021773, 11312994, 12153929, 11650547, 10686524, 11120793, 11067585, 10077828, 9707787, 10051206, 9260825, 9454691, 7935726, 8788150, 8153037, 8093929, 7324316, 7975151, 6980770, 7285804, 7155368, 7314508, 8897604]
3370H897604k145876j116r7255l10738l08511N80479j173816l82423l99360P07002
3360E365990J46929K53401M47983p73348O59522j471990R00268p7847r12916N67604
3350E105596K65355q8755k66928J92591j96684R17749R3399n13453m21444K13116
3340E300542K32975p54824l70083K10152O12968m12238m31363l59774L21434r85970
3330C363819m42839J014248O08362l65281N67757J372911j118371o05454j934214
3321B460938K523705q04744l1024m08815K75016j088444O54418Q76220m30337
3312D026933q62983K68256N07504k04291o60271O78265o04496J12004M98447l78554
3302C380814m07056j90970J068613p66994J683338j939647J39945m7851J120198
$$ y = [8897604, 6751728, 6750612, 6653357, 6342619, 6034108, 6614587, 5440771, 5058348, 4658988, 5365990, 5512919, 5766320, 6214303, 5440955, 6100477, 4628487, 5528755, 5450908, 4537992, 5105596, 5370951, 5282196, 5015268, 5207859, 5011175, 5928924, 6022323, 5508870, 5087426, 5300542, 5533517, 4778693, 4408610, 4618762, 5231730, 4819492, 4388129, 4028355, 4349789, 3363819, 2920980, 3935228, 4543590, 4178309, 4746066, 6118977, 5000606, 4395152, 2460938, 4984643, 4179899, 4148875, 3740060, 4015076, 2926632, 3581050, 4457270, 4026933, 3163950, 3432206, 3939710, 3735419, 3075148, 3753413, 3148917, 3260921, 3759368, 3380814, 2973758, 2782788, 3851401, 3084407, 4767745, 2828098, 2968043, 2920192, 4040390]
3293D040390q63896R87831r76369L6213K028807r45600P84415q83918N06034j350989
3283C362918l44799M34697k17888o2848J65260j478588K165626j367159k14851
3274B442368J072623K5655J83846q16004J674512j027740r43435J88702P35148
3265C535675p4675m54721J403138p06802M98482k68559O33829j8080J646502L93294
3255F588083J196220j598333J14534O10955k006365R07286j530514L62279o80122
3246C964023K24034q23083O53766o84686N28325L56981A979424K322092l98633
3237C902883k35715L24243j362908Q3679p37469N32830m42427L77083O66165k73307
3227B835057m33849Q83435j120915P04464Q55769j352774N99665J453l70001R47848
$$ y = [4040390, 3176494, 4164325, 3187956, 3224169, 5252976, 4307376, 5091791, 4207873, 4713907, 3362918, 3018119, 3452816, 3234928, 3172080, 3337340, 1858752, 4024378, 2657219, 2442368, 3514991, 3540646, 3724492, 2908488, 4583000, 3555260, 2611825, 2800527, 3535675, 3461000, 3006279, 4409417, 3702615, 4201097, 3932538, 4566367, 4548287, 6194789, 6588083, 7784303, 6185970, 6300504, 6911459, 4905094, 5812380, 4281866, 4644145, 3964023, 4188057, 3364974, 4018740, 3334054, 3862379, 4219360, 1979424, 4301516, 3902883, 3667168, 3991411, 2628503, 2712182, 1974713, 2507543, 2065116, 2442199, 3108364, 2835057, 2401208, 3284643, 2163728, 2868192, 3723961, 2371187, 2970852, 2972305, 2602304, 3550152]
3217C550152j026635J140228L17847k99923L3053P41454j00755M02738j050843
3208C707316O98370n93293J299337m19056N96101p0904n96617N52406Q20615J072526
3198G066801m44153L452N71387M69585L39912k22027l11838R04690J369667j035886
3188H711590J064381L10161K80575Q14948M60701M19448o39138J190930M43078
3179A3056674Q25939J20559M98594Q90283M04658j73980L79006m41662J206248
3170A6766319n15833l23065m84692N276M27338j08080M1224n07889L57156J41619
3160A5799373r1026K71867L29441p71837K18788J225462m68192L43552P03822
3151A7561250m67670Q31534O29734N832L71046j67969j06255J995348N86040M42600
$$ y = [3550152, 2523517, 3663745, 3981592, 3681669, 3714722, 4456176, 4355421, 4758159, 3707316, 4405686, 3812393, 5111730, 4692674, 5288775, 5217871, 4621254, 5173660, 5994275, 7066801, 6622648, 6626100, 7197487, 7667072, 8006984, 7784957, 7473119, 8377809, 9747476, 8711590, 9775971, 10086132, 10366707, 11181655, 11642356, 12061804, 11422666, 12613596, 13056674, 13882613, 14003172, 14501766, 15392049, 15796707, 15622727, 16001733, 15560071, 16766319, 16250486, 15927421, 15442729, 15448005, 15875343, 15767263, 15808487, 15300598, 15657754, 15799373, 15708347, 15980214, 16309655, 15537818, 15756606, 16982068, 16513876, 16857428, 17561250, 17093580, 17925114, 18554848, 18560680, 18931726, 18763757, 18657502, 20652850, 21238890, 21681490]
3141B1681490M90602p9436R04002J483900l64946k707648k150474k773230k315734
3132A4168526j513747j908852q57356j758517O06220j8343j19931j616608j3723
3123F967669m9292p24660J117082o29909k66990j25646L10714j355897N18073
3114E761144r2360K72722J12804l07018q9081j05754n39624J500176r6349j082222
3104E334438R8310o98576Q72233n59700J506557o65558j67451j41818l58829j532799
3094C686807J434479J36526o57508J075139m03137r04694J282267N38713m04044
3085E784548l24415n01336O9885O02733j181802J120317j548441J075637j078991
3076D018135J033263K39310p37466L70109r34876j40543O45266K89213P37907
$$ y = [21681490, 22172092, 22092656, 22996658, 24480558, 24115612, 21407964, 19257490, 16484260, 14168526, 12654779, 10745927, 9888571, 8130054, 8736274, 8717931, 8598000, 6981392, 6967669, 6918377, 6193717, 7310799, 6680890, 6413900, 6288254, 6598968, 5243071, 5761144, 5668784, 5941506, 6054310, 5747292, 5658211, 5552457, 5012833, 6513009, 6416660, 5334438, 5432748, 4734172, 5606405, 5046705, 6553262, 5887704, 5720253, 5578435, 5219606, 3686807, 5121286, 5257812, 4600304, 5675443, 5272306, 4367612, 5649879, 6188592, 5784548, 5460133, 4958797, 5028682, 5631415, 4449613, 5569930, 4021489, 5097126, 4018135, 5051398, 5290708, 4553242, 4923351, 3988475, 3847932, 4493198, 4782411, 5520318]
3067E520318j884150J113661k80890P0560p40698P97174M31262M053l58739j49094
3057D523457Q79184j119223k93409M75404q88484O51604L26519m26252j2640j1904
3047D104256J586477j394176K33929J551280m29731j028964J596183m63054l57669
3038E398531R39831k04864r76599J588212k28151J239909P60462J075661K483876
3029A2076868L296115N886707J131252l730353J69211K526488m735259o486051
3021A0134978k873501j471287o45424M82615L10414l74866K86288r16347K31065
3012E163935n20374J71034J66506j12486m97630n0666j08425j77085o46677Q79869
3002D268001o44468L23811J77287q5420Q56184j763384J635718l35470p62781
$$ y = [5520318, 3636168, 4749829, 4468939, 4539499, 3798801, 4595975, 5027237, 5031290, 4672551, 4523457, 5402641, 4283418, 3990009, 4465413, 3576929, 4228533, 4555052, 4128800, 4116160, 4104256, 5690733, 4296557, 4530486, 6081766, 5652035, 4623071, 6219254, 5756200, 5398531, 6338362, 6133498, 5156899, 6745111, 6516960, 7756869, 8517331, 9592992, 12076868, 15372983, 21259690, 22390942, 18660589, 18829800, 21356288, 16621029, 10134978, 7261477, 5790190, 5144766, 5627381, 5937795, 5562929, 5849217, 4932870, 5163935, 4643561, 4814595, 4981101, 4868615, 4370985, 4320319, 4211894, 4034809, 3388132, 4268001, 3623533, 3947344, 4124631, 4039211, 4895395, 3132011, 4767729, 4432259, 3669478]
2993C669478n31953J342319p72853O19274j022318j4127J171891O0569l76669
2984D145611k80623j169340J521522j439183P00967m67336M65933l60600J776268
2975D893219j920619O06891m46046J119955j054615M17869J75991k51784n2350
2966C488511n97651m54936J199612L39950j278315J473773k33733l52735k32550
2957C351926J319131p28398m77416N16673m46728m34992R38910l51123m18978
2948C269005O72693L82291j042267n55492O92259j58593n5950j01254J295684
2939D398376p78131l76936n05808J06271J932512j690418p29338J00392J337197
2930C794117N6344l43961P29702j249989O75189J54061o84248K22540J96095L76074
$$ y = [3669478, 3137525, 4479844, 3706991, 4326265, 3303947, 3289820, 4461711, 4522280, 4145611, 3864988, 2695648, 4217170, 2777987, 3478954, 3011618, 3477551, 3116951, 4893219, 2972600, 3579491, 3133445, 4253400, 3198785, 3616654, 3792645, 3540861, 3488511, 2890860, 2435924, 3635536, 3975486, 2697171, 4170944, 3937211, 3584476, 3351926, 4671057, 3942659, 3465243, 3981916, 3535188, 3100196, 4039106, 3687983, 3269005, 3941698, 4323989, 3281722, 2726230, 3418489, 3259896, 3203946, 3102692, 4398376, 3620245, 3243309, 2737501, 2843772, 4776284, 3085866, 2356528, 2456920, 3794117, 3850461, 3506500, 4236202, 2986213, 3661402, 3815463, 3131215, 3353755, 3549850, 3925924]
2920C925924r04729P15282J59900m48800q16539J987767o35609k03195L34864
2911D114865j70638J07075n27212R84929j188855R69942q43398N14494m44648
2902C516554M00989J2067R9392k44941k6551p09803J157204p8142l76652Q08283
2892D558400q63911p10137J128818K44666J72316q22151R42050r98449k66417
2883C385185Q37401k94347L98453l43779N50131q67772P03007j49969o73190N41595
2873D086715J15504M21671O07855q67114q85580K282137q27634L3494N21565p6707
2863E411906q64131J141535n07092j52030P90476K74256M21527j181347Q2497
2854E417597J434260n84312N16266J100510q32934J277663J09901K56829J341469
$$ y = [3925924, 3021195, 3736477, 3896377, 3447577, 2631038, 4618805, 3983196, 3780001, 4114865, 3944227, 4051302, 3524090, 4509019, 3320164, 4290106, 3446708, 3961202, 3516554, 3917543, 3929610, 4029002, 3784061, 3757510, 3047707, 4204911, 4126769, 3750117, 4558400, 3694489, 2984352, 4113170, 4357836, 4530152, 3708001, 4650051, 3651602, 3385185, 4222586, 3928239, 4326692, 3982913, 4533044, 3665272, 4368279, 4218310, 3545120, 4086715, 4202219, 4623890, 5231745, 4364631, 3479051, 5761188, 4933554, 4967048, 5488613, 5411906, 4547775, 5689310, 5182218, 5030188, 5820664, 6094920, 6516447, 5335100, 5417597, 6851857, 6267545, 6783811, 7884321, 7051387, 8329050, 8438951, 8695780, 10037249]
2845A0037249Q19703o91280J137062K86863N58127J7330m10105J186035k46801
2836A2694183J312977n17542Q37797p60884J251002J463854K76749M67502K39124
2827A7264762J040268J291722k145805j556347j573083j226299r32945k799077
2819I363196l43942n69009o80478P02536M92785j07500J68196K567907J480976
2810A3074667O278347J0206270P773701j2611153j0989252l354567l603624K14017
2802F988406k060062L61066j294965L96399J18879J72615K1106M6983l92058O55192
2792E013561J95481r09487q83528L90845L03802O51315K2479j096922j75027J234671
2782D747190j111752q95996K053141j519193P20889k0464J0944R93611j695436
$$ y = [10037249, 10856952, 10165672, 11302734, 11589597, 12147724, 12165054, 11754949, 12940984, 12694183, 14007160, 13489618, 14327415, 13566531, 14817533, 16281387, 16558136, 17025638, 17264762, 18305030, 19596752, 17450947, 15894600, 14321517, 13095218, 12162273, 9363196, 9019254, 8450245, 7769767, 8472303, 8965088, 8857588, 9025784, 11593691, 13074667, 19353014, 29559284, 37332985, 24721832, 13732580, 10378013, 6774389, 6988406, 4928344, 5289410, 3994445, 4390844, 4509723, 4682338, 4703444, 4750427, 4358369, 5013561, 5209042, 4299555, 3416027, 3806872, 4110674, 4761989, 4784468, 3687546, 3512519, 4747190, 3635438, 2739442, 4792583, 3273390, 3994279, 3973815, 3984759, 4978370, 3282934]
2773C282934J019763n09324O76132l17911J15672K48777J65409k053272J546614
2764D174794k02824j06213J38540r36289K17493K71953Q81987k74088m86822l62769
2754C315762q97880Q24724l39735R01340M87961m20478m746l91338P15220Q44579
2744E035409j393923M75235l21623M41687l61860L28473J195094k17676Q0061
2735E260877r67900R05758J172980J50265p90157m61423J318586J51715R01022
2726G641723J849419j221733J734163J514004K284286N102468Q060052J5943819
2718D2908201M269684j4997917j2289400o075881j365348r69198M02347L944133
2710A5826621O352247R663774j665962r270080o320018k146235k34415K050477
$$ y = [3282934, 4302697, 3793373, 4469505, 4151594, 4267266, 4516043, 4681452, 2628180, 4174794, 3971970, 3865757, 4004297, 3068008, 3285501, 3557454, 4439441, 4165353, 3678531, 3315762, 2417882, 3242606, 2902871, 3804211, 4292172, 3871694, 3866948, 3475610, 4190830, 5035409, 3641486, 4116721, 3795098, 4236785, 3874925, 4203398, 5398492, 5180816, 5260877, 4292977, 5198735, 6371715, 6521980, 5731823, 5270400, 6588986, 6740701, 7641723, 9491142, 8269409, 10003572, 11517576, 13801862, 18904330, 26964382, 42908201, 47177885, 32179968, 19890568, 13814687, 12449339, 11480141, 11882488, 15826621, 22178868, 31842642, 30176680, 20906600, 14586582, 12440347, 12205932, 14256409]
2702A4256409M176861R264678J5674713k077556j7876349p976568m235107k14285
2694A0992796N06859J798363N961228J0470670p62766j1792039o565409k770039
2686G839663k86732j88432J706421J996648M268395J361579o268535m424599j238409
2677D765999n50942L34748j00040j037376K57265Q14574j164510J350345j186605
2668C483458J147748j205809J306384j105376J325042l0720j78095P95327M78817
2659F016776n51294J599352j175068j252184k3777M07079J98624j083089O39361
2650D775780p65417j31022O17987j029034J328812q93918j141089N32231L9978
2641C334308J16330q08338m31458R72710A262358K147907A613852R76404l18622
$$ y = [14256409, 18433270, 27697948, 43372661, 41295105, 23418756, 15442188, 11207081, 10992796, 11499655, 13298018, 19259246, 29729916, 28967150, 17175111, 10609702, 7839663, 7552931, 7364499, 9070920, 11067568, 15335963, 16697542, 10429007, 6004408, 4765999, 4215057, 4549805, 4449765, 3412389, 3669654, 4484228, 3319718, 4670063, 3483458, 4631206, 3425397, 4731781, 3626405, 4951447, 4920727, 4742632, 5537959, 6016776, 5465482, 7064834, 5889766, 4637582, 4613805, 5020884, 5219508, 4136419, 4775780, 4010363, 3879341, 4497328, 3468294, 4797106, 3903188, 2762099, 3294330, 3334308, 3450638, 2642300, 2210842, 3183552, 1262358, 3410265, 1613852, 2590256, 2271634]
2632B271634n68966j72407P87366p33028P35004J34019o09372J60079M33357J83788
2622B621474r58680K97655L63455j04915A002176Q13193m17165R05444j80564
2613B123084l51228H56339K119263q78436G52397Q23359K94810p67561R44296
2604B047301l00991M11032J38677q29010l58100J063345m33515k9562L76319p0156
2594B015340O67562r73402K51819k97292M47598j23458m87030K36293K19615M70055
2584B427100k00442m05565J12206M18123J59659m98112P939l46199K78135Q21273
2574B774117j092509l22942O65203p8187J301660q88806N0055k39908l75177L49544
2564B143050K37904k10417J259623p37879O08283l33846j03183p99290K06596
$$ y = [2271634, 1702668, 1530261, 2317627, 1584599, 2319603, 2453622, 1844250, 2004329, 2437686, 2621474, 1662794, 1960449, 2323904, 2218989, 1002176, 1815369, 1398204, 2303648, 2123084, 1771856, 856339, 2975602, 2097166, 752397, 1575756, 1870566, 1103005, 2047301, 1746310, 2157342, 2296019, 1467009, 1108909, 2172254, 1738739, 1709177, 2085496, 2015340, 2682902, 1709500, 1961319, 1664027, 2111625, 1988167, 1501137, 1737430, 1957045, 2427100, 2226658, 1821093, 1933299, 2351422, 2511081, 2012969, 2020908, 1674709, 1952844, 2774117, 1681608, 1358666, 2023869, 1945682, 3247342, 2358536, 2408591, 2168683, 1793506, 2143050, 2380954, 2170537, 3430160, 2692281, 3300564, 2966718, 2863535, 2064245, 2270841]
2555B270841l35540P14979o34080P31030m07797l82294O45139l13901L38450L4180
2545B661007Q5164L74584R99945A566458J772228L5824j082149P96038m20764
2536B667635P83793l47612p58877o09815J490503k75719m122Q05226j307548J55452
2526B598916L90812M3464L74746j268449J332983j25978O46683q71391m8103j094767
2516A978916J373967Q93721l40560o87519q96669K16479J232213r98714J34486
2507B906320k74646n05499r4989R55416l85497k4328n75532j02144O90367P29996
2497C319464J47979j731197O49473q75870J291760n00354K76363L53745n27089
2488B404274k88748R59867j238926J350685m94946l40004Q3604J9592o28676J381755
$$ y = [2270841, 1935301, 2650280, 2016200, 2747230, 2339433, 1957139, 2602278, 2288377, 2626827, 2661007, 2746171, 3120755, 4120700, 1566458, 3338686, 3374510, 2292361, 3088399, 2667635, 3451428, 3103816, 2344939, 1735124, 3225627, 2949908, 2945786, 3751012, 2443464, 2598916, 2989728, 3033192, 3407938, 2139489, 3472472, 3346494, 3993177, 3121786, 3073683, 1978916, 3352883, 4246604, 3906044, 3218525, 2321856, 2538335, 3770548, 2771834, 2906320, 2631674, 2126175, 2031186, 2986602, 2601105, 2576777, 2001245, 1899101, 2589468, 3319464, 3467443, 1736246, 2385719, 1509849, 2801609, 2301255, 2577618, 2931363, 2404274, 2115526, 3075393, 1836467, 3187152, 2692206, 2352202, 2435806, 2455398, 1826722, 3208477]
2478C208477P9675j641552Q64260K98355K74551q22909n7320J064346k93580K96199
2468C270502P15416q30470l04312R8848K57045O48062J6951j118734Q23736J54014
2458C731058r56633J421783j923004M55948R23410l78901p00831O18008o66732
2449B524106K69444O63000K45790p78494l92038R44600M02194K59829N12182j283783
2439C366830J041773j47509M04844L62111q65739Q65306p76763n44977l07661
2430C398215J282045j804097J429704K11648n11519j98162L83659r19932J913332
2421E184893k071804J222562L49050p45721M36876p33758O07106J29726q0263
2412D298667l40504j43206R97491K80658p18577n88215Q15184L65110l22855L73526
$$ y = [3208477, 3288152, 1646600, 2510860, 2809215, 3083766, 2260857, 2203537, 3267883, 2974303, 3270502, 3985918, 3155448, 2851136, 2949984, 3207029, 3855091, 3872042, 2753308, 3577044, 3731058, 2774425, 4196208, 2273204, 2729152, 3652562, 3273661, 2572830, 3190838, 2524106, 2793550, 3456550, 3702340, 2923846, 2531808, 3476408, 3878602, 4138431, 4650613, 3366830, 4408603, 4261094, 4665938, 5028049, 4162310, 5027616, 4250853, 3705876, 3398215, 4680260, 2876163, 4305867, 4517515, 4005996, 3807834, 4191493, 3271561, 5184893, 3113089, 4335651, 4684701, 3938980, 4375856, 3642098, 4249204, 4378930, 4298667, 3958163, 3814957, 4812448, 5093106, 4374529, 3786314, 4601498, 4966608, 4643753, 5017279]
2402E017279l45505k40859l31875K98034M0140J12246j59072j125339J148656
2393D413705n34792J018303j438312J178604k19518L33108L01101j406672M62730
2384D108257M0676k11604K30814N39896j236553R43404q94349M33178K07969n80088
2374C581600M17498J193615j106115M86938p79273Q41781m92802P31303R6533
2365D971078L05484j395458J268548j25509r08014L79153O29523j87049k66147
2356D671609O84782m98073n85779J28798j04085N77281l41068P67453j528051
2347C772867L30682N92168q97476Q02863J05737J349084r38604l22048M06459
2338E201732j10873n15272Q58669j573090R14953M4654P70521l67811R99860m73928
$$ y = [5017279, 4671774, 4430915, 4099040, 4397074, 4437214, 4549460, 4390388, 3265049, 4413705, 3878913, 4897216, 3458904, 4637508, 4417990, 4751098, 5052199, 3645527, 4108257, 4148933, 3937329, 4168143, 4708039, 3471486, 4414890, 3520541, 3953719, 4161688, 3581600, 3999098, 5192713, 4086598, 4573536, 3794263, 4636044, 4143242, 4874545, 4971078, 5276562, 3881104, 5149652, 5024143, 4116129, 4495282, 5124805, 4937756, 4671609, 5356391, 4858318, 4272539, 4401337, 4297252, 4874533, 4533465, 5300918, 3772867, 4103549, 4695717, 3798241, 4601104, 4706841, 6055925, 5117321, 4795273, 5201732, 5090859, 4575587, 5434256, 3861166, 4776119, 4820773, 5591294, 5223483, 6223343, 5749415]
2328E749415k37060k73781J416855q89440L6073n61964J054839j261093l26083
2319D707761L16792M01298p26628r9784L86825J9752N3764j365667J245659j10716
2309D829056r82070R4100Q13508L46068j056860k31054L66570N08336m20770M71334
2299D738218p67854n11489J040745m28272p97787M16754K66386k79016j66285
2290C511400K32176Q77006m55060j302687J046582p16925Q99581J30904k52475
2281C970502K28271J214429j077058L28361R61561j053345p3494Q55150j831824
2272C522553J237865o45350N13811M10263j464067Q46008k86196O18851k44288
2263D509450R6133J39769L13158k22076O07092n28400Q57925k47818M51781K15474
$$ y = [5749415, 5512355, 5238574, 6655429, 5765989, 5802062, 5240098, 6294937, 5033844, 4707761, 5024553, 5425851, 4699223, 4599439, 4986264, 5006016, 5059780, 3694113, 4939772, 4829056, 3846986, 3941086, 4754594, 5100662, 4043802, 3812748, 4179318, 4687654, 4266884, 4738218, 3970364, 3458875, 4499620, 4071348, 3273561, 3690315, 3956701, 3677685, 3511400, 3743576, 4620582, 4165522, 2862835, 3909417, 3192492, 4092073, 4222977, 3970502, 4198773, 5413202, 4336144, 4664505, 5626066, 4572721, 4499227, 5354377, 3522553, 4760418, 4115068, 4628879, 5039142, 3575075, 4421083, 4134887, 4753738, 4509450, 4605583, 4745352, 5058510, 4836434, 5443526, 4915126, 5773051, 5525233, 5977014, 6192488]
2253F192488m67267l67322O00958K96823l1668j03606L25406J2501M35828J043598
2243G937739o90158K37107m26201L4706J475211r50436j413145O71980n92520
2234F284283p99772p2211J286224L62954Q3150p94974J48962l59763L63360O96283
2224G198496j007838J292195o62129N75840j614563J514407p65825j59936Q52045
2215G222692N12277p49747M66061n27867O32683j192815P89332j13834J05424
2206G144206q48890J130074n78846m8186O68951K58360q21059L19784j4199j043951
2196F166244o75992L18334J59062q54240L40909K08847O88913j27776p8369K41132
2186F387064j90031q3826o72764M98356O44121J79962m34196Q91735j930192R13489
$$ y = [6192488, 5725221, 5357899, 5958857, 6255680, 6224012, 6120406, 6445812, 6458313, 6894141, 7937739, 7247581, 7484688, 7058487, 7093193, 8568404, 7617968, 6204823, 6876803, 6284283, 5484511, 5412300, 6698524, 7061478, 7144628, 6349654, 6498616, 6138853, 6502213, 7198496, 6190658, 7482853, 6820724, 7396564, 5782001, 7296408, 6530583, 6370647, 7222692, 7734969, 6985222, 7451283, 6923416, 7556099, 6363284, 7152616, 7038782, 7144206, 6295316, 7425390, 6846544, 6798358, 7467309, 7725669, 6904610, 7224394, 7210195, 6166244, 5490252, 5808586, 5967648, 5113408, 5454317, 5663164, 6352077, 6224301, 6145932, 6387064, 6197033, 6113207, 5440443, 5938799, 6582920, 6762882, 6328686, 7220421, 5290229, 6203718]
2176F203718R1607N93512n73397K60291j330593k94862N28560l53668j64148P25860
2166E686880p54073p47950O88543P2117j06591J569936j264740K42853m70532
2157D916443j15209J67043J018659j32996m26406P19597J06205m68915n8113N07955
2147F234263j373230J476937j355722R81343k06674l42626P35291r03426J434880
2138F681036q77670J974570q60136n18089j95814Q88316l94702j70387M21193
2129F948317j046489J71116J213784j00300j225072N92096o86748J062240j85703
2120F743241M56677K79101j43179N77738p4300l18934o1479L29458K21138l1311
2110G978150P50131K56941p27073Q02828o2843p09405Q49283j206551J726494
$$ y = [6203718, 6295325, 6888837, 6315440, 6575731, 5245138, 4950276, 5478836, 5125168, 4961020, 5686880, 4932807, 4184857, 4873400, 4945517, 4838926, 6408862, 5144122, 5386975, 4916443, 4801234, 4968277, 5986936, 5853940, 5427534, 6147131, 6253336, 5784421, 5726308, 6234263, 4861033, 6337970, 4982248, 5963591, 5756917, 5414291, 6149582, 5246156, 6681036, 5803366, 7777936, 6917800, 6399711, 6203897, 7092213, 6697511, 6527124, 6948317, 5901828, 6072944, 7286728, 7186428, 5961356, 6553452, 5866704, 6928944, 6743241, 7199918, 7479019, 7335840, 7913578, 7839278, 7520344, 7458865, 7788323, 8009461, 7978150, 8728281, 8985222, 8258149, 9060977, 8998134, 8288729, 9138012, 7931461, 9657955]
2101I657955k43843j3516o20428N74407J85336j82932m43246P59797p60590Q05027
2091I717967n71536q8230L54456k08597J012945j492724O25417L2340P61502j293554
2081H849986j220884P20054Q08218R97627l22541L12324O38018j872761J10826
2072I020867J135762p89525N67231L39271p25413j68287q8270m02206p66367J915453
2062A0038516O90919q54995q45465J27111J388313k36662j162641k19364L22259
2053I247991M05169n4212N20906j13989j276042J174481J06871J731787J394419
2044A3137381K696457Q825916P245754j1770356p364730k227080p22740q43582
2036H977020O49531j706141J191894q30133M21672L1908n13415j55554P02034
$$ y = [9657955, 9414112, 9400596, 8780168, 9354575, 9539911, 9356979, 8913733, 9673530, 8912940, 9717967, 9146431, 9058201, 9412657, 9204060, 10217005, 8724281, 9349698, 9382038, 10143540, 8849986, 7629102, 8349156, 9157374, 10155001, 9832460, 10144784, 10782802, 8910041, 9020867, 10156629, 9367104, 9934335, 10273606, 9548193, 9379906, 9291636, 8889430, 8123063, 10038516, 10729435, 9874440, 9028975, 9156086, 10544399, 10307737, 9145096, 8925732, 9247991, 9653160, 9598948, 10119854, 10005865, 8729823, 9904304, 10011175, 11742962, 13137381, 15833838, 24659754, 31905508, 20135152, 12770422, 10543342, 9820602, 8977020, 9626551, 7920410, 9112304, 8282171, 8703843, 8735751, 8222336, 8066782, 8768816]
2027H768816m28177n19636Q89932K62292o90616l74794j52632J45557J099725
2018I000467j022737q6953Q43153j050326L02581O483J154670j010614j8551j224018
2008F894155O63706L96624m77982j461703L79109l50986Q35906j74499j280759
1999E423571J461413k147240J582130l13516m01880M9438j77582k7794L98049
1990E846589n84947L02746q18143M17058j77851P56733L3238q33797M04825R22226
1980F268677p72941l93108L87432k59456M60354m13409j08413k83522J081613
1971E967227K9845j480783J52690J355904L17748p97159P60870K48177p02054
1962E852465q2737K16810p04185Q40556l40874N21981k12191l19787N59479p40054
$$ y = [8768816, 8340639, 7821003, 8710935, 8973227, 8282611, 7907817, 7755185, 7900742, 9000467, 7977730, 7890777, 8733930, 7683604, 7986185, 7992668, 9147338, 8136724, 8118173, 6894155, 7557861, 7954485, 7476503, 6014800, 6393909, 6042923, 6878829, 6704330, 5423571, 6884984, 4737744, 6319874, 6006358, 5604478, 5653916, 5476334, 5448540, 5846589, 5261642, 5564388, 4746245, 5163303, 4985452, 5742185, 5775423, 4941626, 5346451, 6268677, 5495736, 5102628, 5490060, 5230604, 5690958, 5277549, 5169136, 4885614, 5967227, 5997072, 4516289, 4668979, 6024883, 6342631, 5545472, 6306342, 6554519, 5852465, 5769728, 5986538, 5282353, 6122909, 5782035, 6304016, 6091825, 5772038, 6331517, 5591463]
1952E591463M72523j19848M67405K85984j216353P31134k02359K90869j75639
1943F125179K99799j39228R09572Q0085j119315O80507r48827R62639P92502K09316
1933G852229m49649K43357p2752J65694m95246J729039j559490N36435J144631
1924I094248o81079J17412P42941m16800J16258p98634P31233m27501Q0632P56240
1914I314950J51908j16195L28628m63244L74245M32801J47301K02038j86824K083733
1904A2269341j045091j138360Q84561k74789J034858r79096K327945q47298J21348
1895A2353419m40469m84987J544082n69205R29965J57841J19480j005224J405885
1886A4010787k0412l49686p48703n21972Q53245k53452j112279P70920O53673
$$ y = [5591463, 6063986, 5944138, 6411543, 6697527, 5481174, 6212308, 6009949, 6300818, 6125179, 6424978, 6285750, 7195322, 7275407, 6156092, 6836599, 5887772, 6850411, 7642913, 7852229, 7402580, 7645937, 7573185, 7738879, 7243633, 8972672, 7413182, 7949617, 9094248, 8413169, 8530581, 9273522, 8856722, 8972980, 8174346, 8905579, 8478078, 8558710, 9314950, 9466858, 9350663, 9679291, 9216047, 9590292, 10023093, 10170394, 10372432, 10185608, 12269341, 11224250, 10085890, 10970451, 10695662, 11730520, 10751424, 13079369, 12232071, 12353419, 11912950, 11427963, 12972045, 12402840, 13332805, 13490646, 13610126, 12604902, 14010787, 13990375, 13640689, 12891986, 12370014, 13223259, 12969807, 11857528, 12628448, 13282121]
1877A3282121r97997k70404l32703n06569M32157L64179J2196J30489l05571J86687
1867A1994585j41184k56624L39681k46374M70228l40326m19271m79240Q86665
1858A1808140l83122p4513q7894M63515L01990m01158n45723m75142P87654k98762
1848A1094985q91961N31573o50123P91083r28697l9857K74913q89045l39110J38690
1838I092451O79893m86155j447913J612887J86660j583025J060360k04675k09725
1829H700758n53911k16836l26510J132172j372057J352335p40247p99503L53614
1820G529815p64506P89349M20434n60984r30329J092966q71963O24911J64616
1811G494309j243787J703591j207606O17686j005226J562713p31726j501071J215054
$$ y = [13282121, 12284124, 12013720, 11681017, 11174448, 11606605, 11970784, 11982980, 12113469, 11807898, 11994585, 11853401, 11596777, 11936458, 11690084, 12160312, 11819986, 11400715, 10921475, 11808140, 11425018, 11350505, 11262611, 11726126, 12028116, 11626958, 11081235, 10606093, 11393747, 11094985, 10203024, 10734597, 10084474, 10875557, 9946860, 9907003, 10181916, 9292871, 8953761, 9092451, 9772344, 9286189, 7838276, 9451163, 9637823, 8054798, 9115158, 8910483, 8700758, 8146847, 7930011, 7603501, 8735673, 7363616, 8715951, 7975704, 7176201, 7529815, 6765309, 7554658, 7975092, 7414108, 6483779, 7576745, 6704782, 7329693, 7494309, 6250522, 7954113, 6746507, 7364193, 6358967, 7921680, 7189954, 5688883, 6903937]
1802F903937p45016K15963r86896J800714r47130O45921O72325n36383j054309
1793E969126L11140O72001K15523o35843K251891n56324r53052M70419L18837
1784H063718K19849k17122P69798j072573P37598K70771o32592P41968j16924
1775H764491R96714m34845J44861M36129n88538n65043J36431J792286J91632
1766A0874118p38380Q02253J10342O809J58450O93760j067411J342636Q15160
1757A2997737p49668j87450R18746r65652R66127l55475K090649j073693J150403
1748A4791724n10382J052091K0351J417081J546201n36572J812300j229794R61534
1739A9324534K673920l28658M83080K358390J681698k6878K068596l7516K810890
$$ y = [6903937, 6158921, 6374884, 5387988, 7188702, 6241572, 6887493, 7559818, 7023435, 5969126, 6280266, 6952267, 7167790, 6531947, 8783838, 8227514, 7274462, 7744881, 8063718, 8283567, 8066445, 8836243, 7763670, 8501268, 8772039, 8139447, 8881415, 8764491, 9761205, 9326360, 9471221, 9907350, 9318812, 8753769, 8890200, 10682486, 10874118, 10135738, 10937991, 11048333, 11055142, 11213592, 11907352, 10839941, 12182577, 12997737, 12248069, 12060619, 12979365, 12013713, 12979840, 12624365, 14715014, 13641321, 14791724, 14281342, 15333433, 15353784, 16770865, 18317066, 17780494, 19592794, 18363000, 19324534, 21998454, 21669796, 22152876, 24511266, 26192964, 26166086, 28234682, 28197166, 31008056]
1730C1008056J183552J336146Q76840J396827q26580m7747J363424N43452J925619
1721C8759589J101008O17084J587060N64524R60292K352332J296416L123384J533428
1712E1895117K739064J808112M152235L696500L299784M847032O627831N460224
1704H4525899Q857008Q433151O019680M900528Q99992m938832p320200p717903
1696I3659323r216296j1862807j1694243j0956888q551659o020840n058712n213264
1688B5084614k083136n69404k391492j266134j469684r56231j227156j210474
1680A3910903l31756m25539j087605L22309o14067k99245l79703r29175q41131
1671I324991L21509L92818n75361K57843p53523O51664j697803J87269O57191
$$ y = [31008056, 32191608, 33527754, 34404594, 35801421, 34974841, 34927094, 36290518, 36833970, 38759589, 39860597, 40477681, 42064741, 42629265, 43589557, 45941889, 47238305, 50361689, 51895117, 54634181, 56442293, 60594528, 64291028, 67590812, 72437844, 79065675, 84525899, 93382907, 101816058, 107835738, 112736266, 113636258, 108697426, 101377226, 93659323, 84443027, 72580220, 60885977, 49929089, 41377430, 35356590, 30297878, 25084614, 23001478, 22432074, 20040582, 18774448, 17304764, 16348533, 15121377, 13910903, 13579147, 13153608, 12066003, 12388312, 11774245, 11475000, 11095297, 10166122, 9324991, 9646500, 10039318, 9463957, 9721800, 8968277, 9619941, 7922138, 8109407, 8766598]
1662H766598m08245l50110o8422j59876m97719q7645l21602r8384n47198k79360
1652E948037J149206k37862q9994j028453N55892p73721j35897J442619j456045
1643E373782R95754j553446O01919J111967j572440m25158J234497r25845j04402
1634D736628O6561K95269N88080p11541q90593N02985m00257o2827L55835m88735
1624C991405p0613Q01873O6175j056428L75797j90059K10009j705318J937448
1615D360289j428468M30223P62374j588678J482163n59301P82544k22697Q50317
1606D868766k116876J05019O55043n5495J022984k00298k71765o95859P11199
1597D022718j017806J023267N08861l26481P1884l39808j4016L81321l83986O01055
$$ y = [8766598, 8358353, 8008243, 7939821, 7779945, 7282226, 7194581, 6872979, 6774595, 6227397, 5948037, 7097243, 6859381, 6769387, 5740934, 6296826, 5523105, 5387208, 6829827, 5373782, 6369536, 4816090, 5418009, 6529976, 4957536, 4532378, 5766875, 4841030, 4736628, 4803189, 5098458, 5686538, 4974997, 4084404, 4587389, 4187132, 4124305, 4480140, 3991405, 3920792, 4722665, 4788840, 3732412, 4108209, 3918150, 4128159, 2422841, 4360289, 2931821, 3362044, 4124418, 2535740, 4017903, 3458602, 4241146, 4018449, 4868766, 2751890, 2856909, 3511952, 3456457, 4479441, 4279143, 4007378, 3311519, 4022718, 3004912, 4028179, 4537040, 4210559, 4282443, 3942635, 3928619, 4309940, 3925954, 4527009]
1587D527009K77721o3976j3272j208062j31158L66256J54185j151144N98333R43536
1577D299428j010178J849850j17210R45600j136682J117393k46377p8884O71124
1568F294064o63161R98921m18439K42241l74690L67486l46163M86334Q73562O56460
1558H116615r61811J327433m95212N98230Q69849R96542K63279J600675J270053
1549A3585653P87719N01572r29224l214742M01219q78313j506179R99407j32210
1540I614902r4457p00571J062447l87020j051056K36040P26775j06221j45125
1531I155714r58472M21947j284149J656733k88092J39710j239333N2938r1325
1522G565671J27034j05545O88006O39935k4838M6901k71361J341902j47002K619852
$$ y = [4527009, 4804730, 4740754, 4727482, 3519420, 3388262, 3754518, 3908703, 2757559, 3355892, 4299428, 3289250, 5139100, 5021890, 5967490, 4830808, 5948201, 5701824, 5622940, 6294064, 5630903, 6629824, 6211385, 6453626, 6078936, 6446422, 6100259, 6586593, 7460155, 8116615, 7154804, 8482237, 7987025, 8585255, 9455104, 10451646, 10714925, 12315600, 13585653, 14373372, 14874944, 13945720, 10730978, 11132197, 10253884, 8747705, 9747112, 9614902, 9520445, 8819874, 9882321, 9495301, 8444245, 8680285, 9407060, 9300839, 9155714, 8197242, 8619189, 7335040, 8991773, 8703681, 8843391, 7604058, 7656996, 7565671, 7692705, 7587160, 8275166, 8915101, 8890263, 8937164, 8665803, 10007705, 9860703, 12480555]
1512A2480555J05250O19412J40338J02840J050777j643368j111829K30092j844258
1503A0129809r05461r34988r72257O41965n13261l24303N60983N1910q87769O80106
1493G526734m76105k99371P08235j004785J177926k83954p61082J508810m86221
1484G610187K65680J506370k93569J343524k32040M71282j348541M34845j459683
1475H298055n95182j048775O77405j007859J3263j653941R23401l92291N84743
1466E798819k018464J070283l33300L22969k00067j007870l17921N58956M94756
1457D368161j007659j6694J254713q64245l84461j19314K16303j535559K614035
1448D525280j900362M36370Q59723A569971K202450A702299J841362N0625n23638
$$ y = [12480555, 12585805, 13205217, 13345555, 13448395, 14499172, 12855804, 11743975, 11974067, 10129809, 9224348, 8289360, 7317103, 7959068, 7445807, 7121504, 7682487, 7734397, 6846628, 7526734, 7050629, 6751258, 7459493, 6454708, 7632634, 7348680, 6587598, 8096408, 7610187, 7875867, 9382237, 9088668, 10432192, 10200152, 10671434, 9322893, 9757738, 8298055, 7702873, 6654098, 7331503, 6323644, 6336907, 4682966, 5606367, 5214076, 5798819, 3780355, 4850638, 4517338, 4840307, 4640240, 3632370, 3314449, 3873405, 4368161, 3360502, 3343808, 4598521, 3734276, 3349815, 3230501, 3446804, 1911245, 4525280, 2624918, 3061288, 3921011, 1569971, 3772421, 1702299, 3543661, 3594286, 3070648]
1439C070648M26797j251989J667360o13921O34249q42921j79233J86705n9193
1430C038502O77601j6891N9020j364262J405564K11189j91390M5218l35459J450731
1420D979823r35170l11717n7606Q17380n2162j976220J796381j018495k75843
1411B966371J159362r95192P48905m23979K98714M09352j20764M18536n75895
1402C885410O04675l73433o36947J689535j164620L4977J261469j381036J6210
1393C936240J031488m93771m68728N28874n79778O16204J84974J14214k73767
1384D595950M62747q12503R214j623735J029817j135542R82170l55127K84734
1375C437725q40239k00575q7985j003458O9073O2068O57680o21023K63860C03036
$$ y = [3070648, 3497445, 2245456, 3912816, 3298895, 3933144, 3090223, 2910990, 3097695, 3038502, 3716103, 3699212, 3758232, 2393970, 3799534, 4010723, 3819333, 3864551, 3529092, 4979823, 4044653, 3732936, 3675330, 4492710, 4440548, 2464328, 4260709, 3242214, 2966371, 4125733, 3130541, 3879446, 3455467, 3754181, 4163533, 4042769, 4461305, 3885410, 4490085, 4116652, 3479705, 5169240, 4004620, 4039597, 5301066, 3920030, 3936240, 4967728, 4473957, 4005229, 4534103, 3954325, 4570529, 4755503, 4869717, 4595950, 5058697, 4246194, 4255408, 2631673, 3661490, 2525948, 3508118, 3152991, 3437725, 2597486, 2396911, 2308926, 1305468, 1374541, 1436609, 2094289, 1473266, 1737126, 303036]
1364A539658M9797O4255j61497L33293J08277E06092M22599M73810l59385l99971
1354F43145J197744A18212J499193F65417Q96889n96746M84687K57572n34113
1345A173706M84720m42295m47916k75873Q80828m01431K21252j36912q0240K96520
1335A272359j85879Q19881H24780l8424O21691L28717G23075J133895m16673L03625
1325A743922j91452n10898A56677J633662K80694I95948O01993E21961j73767
1316C48194Q65478m31678O90251F74038O0368J07890L23703l16144j77428M34158
1306A106585q1688j81660k849Q17461l51270o09700K05679Q64116p90949L23481
1296A299206j52138N73893m17787n78753M6207M46774K42810E88675M62080d7109
$$ y = [1539658, 1589455, 1653710, 1492213, 1825506, 1933783, 506092, 928691, 1402501, 1043116, 643145, 1840889, 118212, 1617405, 665417, 1562306, 965560, 1450247, 1707819, 1173706, 1658426, 1216131, 768215, 492342, 1373170, 971739, 1192991, 1056079, 975839, 1272359, 1086480, 1906361, 824780, 786356, 1408047, 1736764, 723075, 1856970, 1440297, 1743922, 1552470, 1041572, 156677, 1790339, 2071033, 995948, 1597941, 521961, 348194, 1213672, 781994, 1472245, 674038, 734406, 842296, 1165999, 849855, 672427, 1106585, 1024897, 843237, 840388, 1657849, 1306579, 696879, 902558, 1766674, 975725, 1299206, 1147068, 1720961, 1303174, 724421, 770628, 1217402, 1460212, 588675, 1050755, -47109]
1285G33526i6901E38524Q65727J05729J04539j23225D12730p9086j01151J015183
1275A247676A34503M85182k85072d8237C18169L3535j33035J104108E89752J74097
1265G63849L26883l78098j15841D3964P97235P91954o6802E65287M31686K20734
1255A217707K28368J060952H92649J03858P7937L71253F43125J311449m81637
1246A472937k91452D39674R41579L75118E52391O47956N87526F56121Q50245m64852
1236A041514P6123Q0861N90915o62123l70860Q14306O63719A041272k59429g89197
1225A935384k8704F55946n8753J31549R83635H09379O83317p14861L62640k99393
1215H41082j96602N42937n91935N59448E3566P06694k67436M15324l04483J403836
$$ y = [733526, -96901, 538524, 1404251, 1509980, 1614519, 1491294, 412730, 333644, 232493, 1247676, 134503, 619685, 334613, -48237, 318169, 351704, 218669, 1322777, 589752, 763849, 1090732, 712634, 596793, 43964, 841199, 1633153, 1566351, 565287, 996973, 1217707, 1446075, 2507027, 892649, 996507, 1074444, 1445697, 643125, 1954574, 1472937, 1181485, 439674, 1381253, 1756371, 552391, 1200347, 1787873, 656121, 1506366, 1041514, 1117637, 1198498, 1789413, 1127290, 756430, 1570736, 2234455, 1041272, 781843, -789197, 1935384, 1906680, 655946, 597193, 728742, 1712377, 809379, 1492696, 777835, 1140475, 841082, 644480, 1187417, 595482, 1154930, 53566, 760260, 492824, 908148, 603665, 2007501]
1205B007501r78859M75449j17788J016685A176036N82487l41090B70250O17776
1196H88026J24035C28749P2778C8348J582824B18860M41943J29577K41060l36992
1186F94448K32415J86656J29213L57192D48082R99927c5653I19331N56944A85965
1175A070808J87999j6382k71743L5385N13500D3763O18165J40253j03213A34049
1164A143746J81621n29674M53873q5924k08753C80983O81579C62583L73380M88979
1154A224942D70656O02501E13769O18991M42418o43278K54211I7403J200796B58784
1143A096543J3646j82121L47697l39489J60579A84489K19480J89058N7160K97853
1133I48040m70713e6683H59140C89526J238567p20539O25147P1769l23622N092
$$ y = [2007501, 1028642, 1504091, 1386303, 2402988, 1176036, 1758523, 1417433, 270250, 888026, 1012061, 328749, 401527, 38348, 1621172, 218860, 660803, 790380, 1031440, 694448, 926863, 1113519, 1242732, 1599924, 448082, 1448009, -35653, 919331, 1476275, 185965, 1070808, 1258807, 1242425, 970682, 1006067, 1519567, 43763, 661928, 802181, 698968, 134049, 1143746, 1325367, 795693, 1249566, 1163642, 954889, 380983, 1062562, 362583, 735963, 1224942, 470656, 1073157, 513769, 1132760, 1575178, 931900, 1186111, 97403, 1298199, 258784, 1096543, 1110189, 928068, 1275765, 936276, 1096855, 184489, 403969, 593027, 650187, 948040, 477327, -56683, 859140, 389526, 1628093, 907554, 1532701, 1604470, 1280848, 1285940]
1123A285940K8493C18988J311814J33852o02315L71189m93251L75609l56127M26085
1113A485844N42142H89233J025467N97911O5457n31645N5245Q45638m24066o08450
1103A914790M18461k43410P82251r1140r83915J507541j444871J538253R3571
1094C491531j504461R65154O10891K54885O60268m96695J860066k72957N34499
1085F103181J232435J476755m23287J97291k411786J900455j74499R60346m67655
1076H393236R54307J526106k54865M54203L567126J268462K665621N403758J1402704
1067C5380658K6410194O4162989J8248343F2726036B9390956j4256585l672646
1060A1461725j735299l782329O24338j931502p58715j27023j011053J327657j9122
$$ y = [1285940, 1314433, 318988, 1630802, 1764654, 1162339, 1533528, 1040277, 1415886, 1059759, 1485844, 2027986, 889233, 1914700, 2512611, 2578068, 2046423, 2101668, 2947306, 2523240, 1914790, 2333251, 2089841, 2872092, 2780952, 1797037, 3304578, 1859707, 3397960, 3491531, 1987070, 2952224, 3563115, 3818000, 4478268, 3981573, 5841639, 5568682, 6103181, 7335616, 8812371, 8389084, 8586375, 6174589, 8075044, 7900545, 8860891, 8393236, 9347543, 10873649, 10618784, 11072987, 14640113, 15908575, 18574196, 23977954, 35380658, 61790852, 125953841, 144202184, 62726036, 29390956, 15134371, 11461725, 9726426, 5944097, 6568435, 4636933, 3878218, 3751195, 2740142, 4067799, 4048677]
1051D048677j487361L15753J116257P50751J565472k099429q02844n46081j056309
1042A804886J111066p91673k26853H46935L03055p6298m13885J180677o9422m91348
1032A279714j30521E35311M80586J193254n92080L711K2839o30841L54881D61869
1021A653381F30394K42335R85249k05018D92845Q67001D95525M30825j24659j13464
1011F88227J011486p94989J50673j39786k74699L40743m29280j48672L36502k02362
1001E37843d13406A513873m40495B3887N71147j78852J83801L21887L17750a50676
990B19289a5967H21517d7921C60576L84890J011408C40603A31937a03730j22906
980b26636A146558D22243o636M88176d06070a53532B98707N35049G6484N87360
$$ y = [4048677, 2561316, 2877069, 3993326, 4744077, 6309549, 4210120, 3407276, 2861195, 1804886, 2915952, 2124279, 1897426, 846935, 1149990, 1073692, 659807, 1840484, 1771062, 1279714, 1149193, 535311, 1015897, 2209151, 1617071, 1620782, 1643621, 1012780, 1367661, 461869, 1653381, 630394, 872729, 1857978, 1652960, 492845, 1359846, 495525, 926350, 801691, 688227, 1699713, 904724, 1055397, 915611, 640912, 981655, 552375, 403703, 740205, 537843, -413406, 1513873, 1073378, 23887, 595034, 416182, 599983, 921870, 1239620, -150676, 219289, -15967, 821517, -47921, 360576, 745466, 1756874, 340603, 131937, -103730, -226636, 1146558, 422243, 415607, 903783, -406070, -153532, 298707, 833756, 76484, 663844]
970F63844k79415O8109L69660d18164H94772R9575P62475c51676C94852a58367
959E76856K36880l7171A99093k5922d81768A619467E38249k5522D0088N93849
949F33937L03015k25574A75416N95457F7333J049951C32109q8807O4429k6247
939B81484K45510m4962K902E5662K27627M82021j1229C23478L33957B19746f38133
927A89715M22153k56909a31206A54319J134515E35813k10260P11157q6578F8128
916d3587D53005L71853l44506b14703F49067A63650J551012D00504c75198l74691
906g49889H96821a79805B52765M3881K16127K25027g5287E22228K52490e56672
895C7534d33499H51848o100B72987b69558C81769J206405C69931j17119J082740
$$ y = [663844, 384429, 452538, 822198, -418164, 894772, 994347, 1756822, -351676, 394852, -158367, 576856, 813736, 776565, 199093, 173171, -481768, 1619467, 538249, 512727, 40088, 633937, 936952, 711378, 175416, 770873, 67333, 1117284, 332109, 243302, 307731, 281484, 526994, 482032, 484934, 55662, 283289, 765310, 754081, 323478, 657435, 219746, -638133, 189715, 611868, 354959, -131206, 154319, 1288834, 535813, 325553, 1036710, 950132, 68128, -43587, 453005, 824858, 480352, -214703, 649067, 163650, 1714662, 400504, -375198, -749889, 896821, -179805, 252765, 296646, 512773, 737800, -75287, 522228, 774718, -556672, 37534, -433499, 851848, 845748, 272987, -269558, 381769, 1588174, 369931, 252812, 1335552]
885A335552m83869c70842C50041M7267I5749Q16721l22593r2950M1673A99278
874H85390k2189J14594c9960E31609L61699d00148D96407B00074r7034K72706
864C75746J086395n44642l51838J0031Q31970B3538J652958A18572c58326J2680
854c45646J09363a16462F81384L1300e1115B06420J05680K12451B20565K12196
844D32761A71930O77568k11737C08167g38866C92410O27882G7843J228512A60831
833G64697l17153A08567a77112k0498m70288d8635l85993l2108C31439O5595a9111
821A004317h21751J70779D25966c99646C07165J530531G71015a7885A09018J49681
811B58699N2412O88392L82490N9058F60964g29365C0543b79019B51417F6939P56621
$$ y = [1335552, 851683, -370842, 350041, 397308, 95749, 912470, 589877, 496927, 538600, 199278, 885390, 863201, 977795, -39960, 531609, 893308, -400148, 496407, 200074, 103040, 375746, 1462141, 917499, 565661, 575692, 1407662, 23538, 1676496, 118572, -358326, -345646, -236283, -116462, 681384, 712684, -51115, 206420, 312100, 524551, 220565, 432761, 171930, 849498, 637761, 308167, -738866, 392410, 1020292, 77843, 1306355, 160831, 764697, 447544, 108567, -177112, -197610, -667898, -48635, -434628, -466736, 331439, 397034, -19111, 1004317, -821751, -650972, 425966, -399646, 307165, 1837696, 771015, -17885, 109018, 258699, 311111, 999503, 1381993, 1441051, 660964, -729365, 30543, -279019, 251417, 66939, 823560]
800H23560Q27240E92150a26657F27582c25828C00852A00934L29298O22215l08650
790G43797J06837k41934A39292a29711A838f2553A82173J528797G49127M83117
780A232244A84857N16053R41874C12130J74190N35345m54227N44129N88546A77334
769h8249G62668k9474p804a49475A807066l96211D82882N97834C36330R12157
759A248487k89100N41795o60195P06698j8770J079746o24818O2927D14120l9814
749C74306L45582b61097H04011c26438B50488L07343A05565P84808c26854A351829
738F68660i8831A24085K86206Q56210d88047f3905p93964M03046b05205A06310
727d31873G88246P77769D41036P50468c8029B20244K25567h6758A84299f44971
$$ y = [823560, 1650800, 592150, -126657, 627582, -325828, 300852, 100934, 430232, 1052447, 743797, 850634, 608700, 139292, -129711, 1838, -62553, 182173, 1710970, 749127, 1232244, 184857, 700910, 1642784, 312130, 486320, 1021665, 567438, 1111567, 1700113, 177334, -88249, 762668, 733194, 725390, -149475, 1807066, 1410855, 482882, 1080716, 336330, 1248487, 959387, 1501182, 840987, 1547685, 1528915, 2608661, 1983843, 2046770, 414120, 374306, 719888, -261097, 804011, -326438, 250488, 557831, 105565, 890373, -326854, 1351829, 668660, -98831, 124085, 410291, 1266501, -488047, -63905, -857869, -454823, -205205, 106310, -431873, 788246, 1566015, 441036, 1191504, -38029, 220244, 445811, -86758, 184299, -644971]
716f25133a51855C87763a31463k3828k08910J68134D65513F864i6095r89658a04123
704A011104a44151G93503d90716A213517e36908j4709I20062e70784A157976m46251
694G11725O1600a75936C65410a36195m62849a76253C47119d42000a17377j04644
684b22021n26938f2960H0207O36293J55113a95541G13139a016844I618c2537j303955
673a336492c14002C74444i48838K17760F24805M25591b80688B96002c54843B1529
662a84481G92155b35485L4514k94971a03913I31335m63829i5750c2324k1823A7480
650b25725p1006p82146A03144e19658a63529G1147g00240K85926C25866a41481
639H40370A39584N81018k89891D0554a120841A05722g4069j08316j44481J27232
$$ y = [-625133, -151855, 387763, -131463, -155291, -364201, -196067, 465513, 6864, -96095, -1085753, -104123, 1011104, -144151, 793503, -490716, 1213517, -536908, -551617, 920062, -570784, 1157976, 711725, 773325, -175936, 365410, -136195, -599044, -176253, 347119, -442000, -117377, -222021, -748959, -62960, 80207, 716500, 871613, -195541, 713139, -1016844, 9618, -32537, -1336492, -314002, 374444, -948838, -731078, 624805, 1050396, -280688, 296002, -354843, 21529, -184481, 792155, -235485, -200971, -495942, -103913, 931335, 467506, -95750, -32324, -54147, 17480, -225725, -296731, -1078877, 103144, -519658, -163529, 71147, -700240, -414314, 325866, -141481, 840370, 139584, 720602, 430711, 40554, -1120841, 105722, -74069, -182385, -326866, -199634]
629a99634C87515L9025b39753C22117i7453H46079j11102c46004B83168c03622
618H23988j36345b11590g1612A91474L31456O8986O5536M1890C10650f85449L22057
607c63392B16926b65369d5888A54001J97252K79793B11117L24615I7746f85246
596a037953B14544K87591e2577p77881E78569e3833l90297p16654M18560F6332
585c66345A09503l9706e26748a27634k51060i4669k04235E60473k29322J59573
575D90724N21316j9683G2079L68657b21517C35645a70612k87160C07605A07653
564d59991l58308c53895C4682g12866B56732d61782G4617J86612G8417N3186Q90339
553A021942a25020A34048D7260N71692d59374I85713C99565K69210i24295F44058
$$ y = [-199634, 387515, 426540, -239753, 322117, -97453, 846079, 734977, -346004, 283168, -303622, 823988, 687643, -211590, -71612, 191474, 522930, 591916, 657452, 699342, 310650, -685449, -363392, 216926, -265369, -45888, 154001, 351253, 631046, 211117, 535732, 97746, -685246, -1037953, 214544, 502135, -52577, -830458, 578569, -53833, -444130, -1160784, -742224, 66332, -366345, 109503, 69797, -526748, -127634, -378694, -94669, -298904, 560473, 331151, 490724, 1012040, 992357, 72079, 440736, -221517, 335645, -170612, -457772, 307605, 107653, -459991, -818299, -353895, 34682, -712866, 256732, -461782, 74617, 261229, 78417, 131603, 1021942, -125020, 134048, 47260, 618952, -459374, 985713, 399565, 668775, -924295, 644058]
542B00683o492n4929R19922d79928C9558f20059m66618M71484a70881B24589L97834
531F22423h92450K92068N9406B13858d67635q1502O2129a36632D92874o8438m975
520D19461M0586A35900a67567I38223D50050O6346f4191A345227b8371H71229
509c84910E91376A6261i0555m55886F29254c25219B39448c96496a67300r5322
499b62622D99229d10426D09196J00393f9680A254045d7330K910C30771B2550a163105
487c19563e1860p58884G83010i80580H64426C90476b71902D6001a12028K5981
477h6047l1619n87756J0392D94518A23188B1575N97927M40240P7839i9220G71397
465F82088d08689a43182K7165M9790C27905Q2606L86641C58422Q8791N81095j87706
$$ y = [200683, 194191, 139262, 1059184, -479928, 39558, -620059, -1086677, -615193, -170881, 224589, 622423, -892450, -600382, -540976, 213858, -467635, -549137, -487008, -136632, 492874, 424436, 419461, 460047, 135900, -167567, 938223, 450050, 516396, -64191, 1345227, -28371, 871229, -384910, 591376, 16261, -90555, -546441, 629254, -325219, 239448, -396496, -167300, -262622, 499229, -410426, 409196, 509589, -69680, 1254045, -47330, -44420, 330771, 22550, -1163105, -319563, -51860, -810744, 783010, -980580, 864426, 390476, -271902, 46001, -112028, -86047, -117666, -705422, -695030, 494518, 123188, 21575, 619502, 1059742, 1137581, -99220, 771397, 682088, -408689, -143182, -116017, -66227, 327905, 410511, 797152, 358422, 447213, 1028308, 840602]
454H40602J40622C54407r9513A04107c29512m64682c36003I42584D54461O93510
444A147971L24440L17233G67693J87349D20974K00178A96033R81254D9734N58569
434F08303k11743K83108N78e11991F9424J16747K66639N19998C8638L38778c40768
422E74793c33221C58249d49156a64515I67121a33576E95926C3653g47786H05153
411e82134j21235a60413n9107I81313a3218j67230D8463L02292a68193B81919
400i7768C36549j02994r3997K13241d36899j45950E0694k3407L07279j07186a229686
388C62915P71555F4124b6211E39363b26749e2197F6036d84356F37651e0029B74488
376a003973a34916q9872p0128A60463K53718j61432b34621k15653a1396B04457
$$ y = [840602, 981224, 354407, 254894, 104107, -329512, -794194, -336003, 942584, 454461, 1147971, 1472411, 1789644, 767693, 955042, 420974, 621152, 196033, 1177287, 49734, 608303, 396560, 679668, 680246, -511991, 69424, 186171, 452810, 972808, 38638, 377416, -340768, 574793, -333221, 358249, -449156, -164515, 967121, -133576, 595926, 33653, -747786, 805153, -582134, -703369, -160413, -219520, 981313, -13218, -180448, 48463, 350755, -168193, 281919, -97768, 336549, 233555, 139558, 352799, -436899, -582849, 50694, 27287, 334566, 227380, -1229686, 362915, 1134470, 64124, -26211, 539363, -226749, -52197, 66036, -484356, 637651, -50029, 274488, -1003973, -134916, -224788, -294916, 160463, 414181, 252749, -234621, -450274, -11396, 204457]
365h74416F16774K93664J47361n17075c47333j99369H27081d90503B13924R995
355B23919a130437I8894d42065o3519q06221C64676b59117D80388b7034E13992
344f26640k74810m46510f52147j16169j94161B94645b05719A76629a5256j177022
334a192278K90770a49111H14705K20213A89349q305N0235J602K40911a056745
323c07652q75229F91507d85829F77509d15639a30788k86149D35255B9650i4018
312G88273k92749a012104b60282D62724b29481f1566l97501A81576P22766c8169
301D7322a09209j04364A088772h35660c17773o2019l01714k71944j0819C05592
290f25869b00101j31796q7299O9925G3525M1139c32241e2291k5159D09381g6746
$$ y = [-874416, 616774, 910438, 1057799, 540724, -347333, -546702, 827081, -490503, 213924, 223919, -1130437, 98894, -442065, -505584, -1311805, 364676, -259117, 480388, -27034, 513992, -626640, -901450, -1347960, -652147, -768316, -962477, 294645, -205719, 176629, -15256, -1192278, -901508, -149111, 814705, 1034918, 189349, 181044, 231279, 232881, 473792, -1056745, -307652, -1182881, 691507, -485829, 677509, -415639, -130788, -416937, 435255, 29650, -94018, 788273, 495524, -1012104, -260282, 462724, -229481, -61566, -459067, 181576, 904342, -38169, 47322, -109209, -213573, 1088772, -835660, -317773, -379792, -681506, -953450, -964269, 305592, -625869, -200101, -331897, -419196, -349271, 73525, 114664, -332241, -52291, -77450, 409381, -76746]
278B4427Q08131l81731a19239A41980d18124l50695K14155E76949j58800f41887
267c72732D73713A52126K31669a30918o10825c39941J27908l61487b40294C35642
256D06276I8606e39053B37216d14622p729k67807c42929k84960C59345a73280
245b61792l99723D56279b59184C76141E4179b77462B88830P3460h41979e8856
234F4007a19408k97098o62667K89463J61766a76731j31652p27109a05793D1492
223e69084G08644b51630O3685I8924f57150p645B22419J66862E7373N75589a456281
211C74702b72561j5306A081125g26393J36381E29109d756B4846e47858H31905
200c93566A54342d58153J46060A33205f63917b15101N7520B35061e51238M2900
$$ y = [24427, 832558, 450827, -119239, 141980, -418124, -768819, -554664, 576949, 418149, -641887, -372732, 473713, 152126, 383795, -130918, -741743, -339941, -212033, -573520, -240294, 335642, 406276, 98606, -539053, 237216, -414622, -422351, -690158, -342929, -627889, 359345, -173280, -261792, -661515, 456279, -259184, 376141, 54179, -277462, 288830, 362290, -841979, -58856, 64007, -119408, -416506, -1079173, -789710, -627944, -176731, -308383, -1035492, -105793, 41492, -569084, 708644, -251630, -187945, 98924, -657150, -664795, 222419, 389281, 57373, 632962, -1456281, 374702, -272561, -287867, 1081125, -726393, -590012, 529109, -4756, 24846, -547858, 831905, -393566, 154342, -458153, -312093, 133205, -663917, -215101, -157581, 235061, -551238, -508338]
190e08338a20942D58209g07459c1758j54879h0192k20050p90941D95508j94413
180C01095k1118a432454d49427l52845B27628c70036M3901I7082e20269k75682
170g95951M7185K0543C61153K72686f13353I64377A81438a13035D03364k996P4791
159D75159l3497e25628A434874c53733n3554G3228c86208D81767c26606E46769
148E88300f18008A79863a65679C21593b59956D98633c06146K4462A96626N34478
138G31104l49150K55269a38213n94512b71860n19671i9761A35638b23959B68066
127B25658b30452J6171k26035d0978A18574b10038j5342o40297K26541K55108
117c84028c4037l96403a71556H24760d56601p916k61989M9234a6542j063749J01434
$$ y = [-508338, -120942, 458209, -707459, -31758, -186637, -80192, -300242, -1091183, 495508, 301095, 279977, -1432454, -449427, -802272, 227628, -370036, -326135, 97082, -520269, -795951, -748766, -728223, 361153, 633839, -613353, 964377, 181438, -113035, 403364, 400368, 475159, 441662, -525628, 1434874, -353733, -407287, 73228, -386208, 481767, -326606, 546769, 588300, -618008, 179863, -165679, 321593, -259956, 498633, -306146, -281684, 196626, 731104, 381954, 637223, -138213, -732725, -271860, -791531, -99761, 135638, -223959, 268066, 225658, -230452, -214281, -440316, -40978, 118574, -210038, -225380, -865677, -639136, -384028, -34037, -430440, -171556, 824760, -456601, -464517, -726506, -677272, -16542, -1080291, -978857]
106i78857F15620A899J104856a259405a52065B47366h23073A32451f35258E41516
95C7933i36186F29865a92399R0972B16578h1909A86481d59422F25716A48209O07105
84G55314i091r86025L54949N865k04224i5994k09659Q8567F17187c88045A17279
72C81638g40471L30369E37584j43563O7684b53172j69330A40007E8176i17981
61d3245l88429g7685C9300h20712a51305B96924d32141m41358b75240l90455a74918
49c58003a62977n56714b73548j67122a51471A5172a219483A276292m71356i5773
38A3737K63285e71419B48247p395d3822C97628a87475o13221F19505i2652o3063
27a55715j668B56889a02327B22193c0183D2777N78438b99849C85446a70828A18437
$$ y = [-978857, 615620, 1899, 1106755, -1259405, -152065, 247366, -823073, 132451, -635258, 541516, 37933, -936186, 629865, -192399, -101427, 216578, -81909, 186481, -459422, 625716, 148209, 755314, -9091, -995116, -640167, -634302, -838526, -95994, -305653, -217086, 617187, -388045, 117279, 381638, -740471, -410102, 537584, 394021, 461705, -253172, -422502, 140007, 58176, -917981, -43245, -431674, -77685, 39300, -820712, -151305, 296924, -432141, -873499, -275240, -665695, -174918, -358003, -162977, -719691, -273548, -440670, -151471, 15172, -1219483, 1276292, 804936, -95773, 13737, 277022, -571419, 248247, 240852, -43822, 397628, -187475, -800696, 619505, -92652, -155715, -157383, 256889, -102327, 222193, -30183, 42777, 621215, -299849, 385446, -170828, 118437]
15E3577O9464a42194A01464c43345r0798C0322O3562J28872K04118c84220e2780
3b9656A6479a26265D34965
$$ y = [53577, 123041, -142194, 101464, -343345, -434143, 30322, 93884, 222756, 426874, -384220, -52780, -29656, 16479, -126265, 434965]
##END=
