##TITLE=141756
##JCAMPDX= 6.0         $$ Bruker NMR JCAMP-DX V2.0
##DATA TYPE= NMR SPECTRUM
##DATA CLASS= XYDATA
##ORIGIN= NUTS EXPORT
##OWNER= Administrator
$$ 1.72 TOPSPIN		Version 2.1
$$ 2016-02-23 12:23:26.183 -0800  Administrator@X
$$ Compression mode = diff/dup
##.OBSERVE FREQUENCY= 90.275459
##.ACQUISITION MODE= SIMULTANEOUS (DQD)
##.ACQUISITION SCHEME= undefined
##.AVERAGES= 16
##.DIGITISER RES= 22
##SPECTROMETER/DATA SYSTEM= 
##.PULSE SEQUENCE= zg30
##.SOLVENT NAME= None
##.SHIFT REFERENCE= INTERNAL, None, 1, 14.39828
##AUDIT TRAIL= $$ (NUMBER, WHEN, WHO, WHERE, PROCESS, VERSION, WHAT)
$$ ##TITLE= Audit trail, TOPSPIN		Version 2.1
$$ ##JCAMPDX= 5.01
$$ ##ORIGIN= Bruker BioSpin GmbH
$$ ##OWNER= Administrator
$$ $$ E:/data/jwist/nmr/1756/1/pdata/1/auditp.txt
$$ ##AUDIT TRAIL=  $$ (NUMBER, WHEN, WHO, WHERE, PROCESS, VERSION, WHAT)
(   1,<2016-02-23 09:35:56.355 -0800>,<Administrator>,<X>,<jcamp>,<TOPSPIN 2.1>,
      <fromjdx created from
       E:\data\jwist\nmr\uniandes\1756
       data hash MD5: 8K
       AB 27 5B D0 F0 C8 C5 FA C1 E9 C6 73 2F 8C 7F F2>)
$$ ##END=
$$ 
$$ $$ hash MD5
$$ $$ 41 65 4E C7 81 91 C9 A6 C3 A3 E5 E0 80 E7 4C 57
##$RELAX= 
$$ Bruker specific parameters
$$ --------------------------
##$DU= <E:>
##$EXPNO= 1
##$NAME= <141756>
##$PROCNO= 1
##$TYPE= <nmr>
##$USER= <jwist>
##$ACQT0= 0
##$AMP= (0..31)
100 100 100 100 100 100 100 100 100 100 100 100 100 100 100 100 100 100
100 100 100 100 100 100 100 100 100 100 100 100 100 100
##$ANAVPT= 1
##$AQSEQ= 0
##$AQ_mod= 3
##$AUNM= <au_zg>
##$AUTOPOS= <>
##$BF1= 90.275459
##$BF2= 400.02
##$BF3= 400.02
##$BF4= 400.02
##$BF5= 400.02
##$BF6= 400.02
##$BF7= 400.02
##$BF8= 400.02
##$BYTORDA= 0
##$CFDGTYP= 0
##$CFRGTYP= 0
##$CHEMSTR= <none>
##$CNST= (0..63)
1 1 145 1 1 1 1 1 1 1 1 1 1 1 1 1 1 1 1 1 1 1 1 1 1 1 1 1 1 1 1 1 1 1 1
1 1 1 1 1 1 1 1 1 1 1 1 1 1 1 1 1 1 1 1 1 1 1 1 1 1 1 1 1
##$CPDPRG= <>
##$CPDPRG1= <>
##$CPDPRG2= <>
##$CPDPRG3= <>
##$CPDPRG4= <mlev>
##$CPDPRG5= <mlev>
##$CPDPRG6= <mlev>
##$CPDPRG7= <mlev>
##$CPDPRG8= <mlev>
##$CPDPRGB= <>
##$CPDPRGT= <>
##$D= (0..63)
0 1 0 0 0 0 0 0 0 0 0 0 0 0 0 0 0 0 0 0 0 0 0 0 0 0 0 0 0 0 0 0 0 0 0 0
0 0 0 0 0 0 0 0 0 0 0 0 0 0 0 0 0 0 0 0 0 0 0 0 0 0 0 0
##$DATE= 0
##$DBL= (0..7)
120 120 120 120 120 120 120 120
##$DBP= (0..7)
150 150 150 150 150 150 150 150
##$DBP07= 0
##$DBPNAM0= <>
##$DBPNAM1= <>
##$DBPNAM2= <>
##$DBPNAM3= <>
##$DBPNAM4= <>
##$DBPNAM5= <>
##$DBPNAM6= <>
##$DBPNAM7= <>
##$DBPOAL= (0..7)
0.5 0.5 0.5 0.5 0.5 0.5 0.5 0.5
##$DBPOFFS= (0..7)
0 0 0 0 0 0 0 0
##$DE= 6.5
##$DECBNUC= <off>
##$DECIM= 2432
##$DECNUC= <off>
##$DECSTAT= 4
##$DIGMOD= 1
##$DIGTYP= 12
##$DL= (0..7)
0 120 120 120 120 120 120 120
##$DP= (0..7)
150 150 150 150 150 150 150 150
##$DP07= 0
##$DPNAME0= <>
##$DPNAME1= <>
##$DPNAME2= <>
##$DPNAME3= <>
##$DPNAME4= <>
##$DPNAME5= <>
##$DPNAME6= <>
##$DPNAME7= <>
##$DPOAL= (0..7)
0.5 0.5 0.5 0.5 0.5 0.5 0.5 0.5
##$DPOFFS= (0..7)
0 0 0 0 0 0 0 0
##$DQDMODE= 0
##$DR= 22
##$DS= 2
##$DSLIST= <SSSSSSSSSSSSSSS>
$$ [...]
##$SPOFFS= (0..31)
0 0 0 0 0 0 0 0 0 0 0 0 0 0 0 0 0 0 0 0 0 0 0 0 0 0 0 0 0 0 0 0
##$SUBNAM0= <"">
##$SUBNAM1= <"">
##$SUBNAM2= <"">
##$SUBNAM3= <"">
##$SUBNAM4= <"">
##$SUBNAM5= <"">
##$SUBNAM6= <"">
##$SUBNAM7= <"">
##$SUBNAM8= <"">
##$SUBNAM9= <"">
##$SW= 20.5580556627758
##$SWIBOX= (0..15)
0 0 3 4 0 0 0 0 0 0 0 0 0 0 0 0
##$SW_h= 8223.68421052631
##$SWfinal= 0
##$TD= 65536
##$TD0= 1
##$TE= 300
##$TE2= 300
##$TE3= 300
##$TEG= 300
##$TL= (0..7)
0 120 120 120 120 120 120 120
##$TP= (0..7)
150 150 150 150 150 150 150 150
##$TP07= 0
##$TPNAME0= <>
##$TPNAME1= <>
##$TPNAME2= <>
##$TPNAME3= <>
##$TPNAME4= <>
##$TPNAME5= <>
##$TPNAME6= <>
##$TPNAME7= <>
##$TPOAL= (0..7)
0.5 0.5 0.5 0.5 0.5 0.5 0.5 0.5
##$TPOFFS= (0..7)
0 0 0 0 0 0 0 0
##$TUNHIN= 0
##$TUNHOUT= 0
##$TUNXOUT= 0
##$USERA1= <user>
##$USERA2= <user>
##$USERA3= <user>
##$USERA4= <user>
##$USERA5= <user>
##$V9= 5
##$VALIST= <valist>
##$VCLIST= <CCCCCCCCCCCCCCC>
##$VD= 0
##$VDLIST= <DDDDDDDDDDDDDDD>
##$VPLIST= <PPPPPPPPPPPPPPP>
##$VTLIST= <TTTTTTTTTTTTTTT>
##$WBST= 1024
##$WBSW= 4
##$XGAIN= (0..3)
0 0 0 0
##$XL= 0
##$YL= 0
##$YMAX_a= 1947233408
##$YMIN_a= -3574798.336
##$ZGOPTNS= <>
##$ZL1= 120
##$ZL2= 120
##$ZL3= 120
##$ZL4= 120
##$ABSF1= 10
##$ABSF2= 0
##$ABSG= 5
##$ABSL= 3
##$ALPHA= 0
##$AQORDER= 0
##$ASSFAC= 0
##$ASSFACI= 0
##$ASSFACX= 0
##$ASSWID= 0
##$AUNMP= <proc_1d>
##$AXLEFT= 0
##$AXNAME= <>
##$AXNUC= <off>
##$AXRIGHT= 0
##$AXTYPE= 0
##$AXUNIT= <>
##$AZFE= 0.1
##$AZFW= 0.1
##$BCFW= 1
##$BC_mod= 2
##$BYTORDP= 0
##$COROFFS= 0
##$CY= 15
##$DATMOD= 1
##$DC= 2
##$DFILT= <>
##$DTYPP= 0
##$F1P= 0
##$F2P= 0
##$FCOR= 0.5
##$FTSIZE= 0
##$FT_mod= 4
##$GAMMA= 1
##$GB= 0
##$INTBC= 1
##$INTSCL= 1
##$ISEN= 128
##$LB= 0.3
##$LEV0= 0
##$LPBIN= 0
##$MAXI= 10000
##$MC2= 0
##$MEAN= 0
##$ME_mod= 0
##$MI= 0
##$NCOEF= 0
##$NC_proc= -10
##$NLEV= 6
##$NOISF1= 0
##$NOISF2= 0
##$NSP= 1
##$NTH_PI= 0
##$NZP= 0
##$OFFSET= 14.39828
##$PC= 1
##$PHC0= 0
##$PHC1= 0
##$PH_mod= 0
##$PKNL= yes
##$PPARMOD= 0
##$PPDIAG= 0
##$PPIPTYP= 0
##$PPMPNUM= 2147483647
##$PPRESOL= 1
##$PSCAL= 4
##$PSIGN= 0
##$PYNMP= <proc.py>
##$REVERSE= no
##$SF= 90.2741592072799
##$SI= 8192
##$SIGF1= 0
##$SIGF2= 0
##$SINO= 400
##$SIOLD= 32768
##$SPECTYP= <>
##$SREGLST= <1H.CDCl3>
##$SSB= 0
##$STSI= 0
##$STSR= 0
##$SW_p= 1497.18866228788
##$SYMM= 0
##$S_DEV= 0
##$TDeff= 0
##$TDoff= 0
##$TI= <>
##$TILT= no
##$TM1= 0
##$TM2= 0
##$TOPLEV= 0
##$USERP1= <user>
##$USERP2= <user>
##$USERP3= <user>
##$USERP4= <user>
##$USERP5= <user>
##$WDW= 1
##$XDIM= 8192
##$YMAX_p= 1947233314
##$YMIN_p= -3574797
##$CURPLOT= <PDFCreator>
##$CURPRIN= <$PDFCreator>
##$DFORMAT= <normdp>
##$LAYOUT= <+/1D_H.xwp>
##$LFORMAT= <normlp>
##$PFORMAT= <normpl>
##$SURQMSG= 1
$$ End of Bruker specific parameters
$$ ---------------------------------
##XUNITS= HZ
##YUNITS= ARBITRARY UNITS
##XFACTOR= 0.182762287876938
##YFACTOR= 1
##DELTAX= -0.182762287876938
##NPOINTS= 8192
##FIRSTX= 1497.0059
##FIRSTY= -2333813
##LASTX= 0
##MAXY= 1947233314
##MINY= -3574797
##XYDATA= (X++(Y..Y))
8191 -2333813 410384 339287 -664047 -798494 1988574 -746355 723245 1816835 -1082651
8181 425940 276171 86376 363465 552216 -1312103 396855 655974 -580318 -1069329 1679298
8170 173017 2521247 1566916 -39786 1226571 -863041 182657 -1058726 -454423 1452525
8160 2106326 210048 -1748454 832026 -447100 861825 2235493 820613 -398351 -285117
8151 -285117 1544953 123949 -1063628 169159 49159 -324090 -425992 906035 -2636694
8141 -1480371 403322 -231904 -32409 995350 173867 -1043486 -779484 2503620 50545 2576700
8131 2576700 -401270 174206 2221759 420704 1170031 833347 -1367540 -2404904 836091
8121 -279364 -66282 2604421 467976 677622 -278585 1588097 -208034 -483789 327876 1815844
8111 1815844 370038 780574 -827746 120897 1120321 -1553999 -778858 600605 -1695585
8101 2593218 -1117109 1593182 70609 1548322 1082672 534699 -773282 -345689 1279457
8091 1227810 69570 503307 282092 134675 1827319 -842588 406189 1390519 -1047185
8081 1063544 123617 -560424 -1153599 1031046 1555318 472482 1331878 -657139 -85323 -98084
8071 -98084 335766 688465 -329283 220780 1083546 369797 402689 -198761 412817 -1028202
8060 -645321 -44291 1039504 13856 -1479140 -1664305 -222759 1702820 1154959 91031 421775
8050 421775 1621753 515211 739252 1212948 -1190775 -186687 957544 572167 662503 2556979
8040 2556979 -1072318 1161351 1543173 -350294 728240 -847758 1641165 -874203 1231636
8030 1098727 1844480 1547849 854062 448224 821116 1307582 861129 650309 854515 592243
8020 592243 -1427007 -504193 -317270 1956581 155297 1599606 2093822 294113 -1411756
8010 1476225 1069233 2429822 1760280 891385 -1925294 1450722 2027294 285109 651201
8001 651201 1229735 29077 -1220970 1311837 -454735 -824927 1189737 450993 342863
7992 342863 488332 162337 946661 1427870 1960501 -3328086 585384 -1425460 961154
7982 654032 -168990 799221 -1290934 251211 -538450 -428473 -16359 742204 322573 -357137
7971 772017 -446459 1379810 -1823792 909266 1280166 1859974 95680 159087 334745 577771
7961 577771 1708993 929132 -193746 -96818 715927 -79196 -1302048 2096053 -1359093
7951 690084 1372248 -67652 663064 439756 877852 420656 372772 -882104 -742528 1337213
7940 28129 235375 -22704 124496 -343307 -610660 -314086 -1123568 -528664 17410 -814245
7929 709983 2366489 -1107083 -395939 917041 895789 262798 -1013650 1209035 1791886
7920 1791886 1655778 581090 1455401 2507654 1942853 -131477 424768 413333 79955 -2693857
7909 1311400 2182843 -1687777 136741 -13033 -2067938 632084 133031 1182910 1798889
7900 1798889 1106530 -1238724 1500019 -5663 1708011 783630 42091 -1811977 131568
7890 742469 -2177481 2166437 -564029 1209909 987838 950891 -1335309 171732 1908397
7881 1908397 264004 -615075 -232531 2535613 -1007166 917844 980523 380972 997952
7872 997952 -1125296 344380 1023598 620167 -1281461 -161231 -671859 1636325 1097563
7863 1097563 -476736 1026550 -681188 -1323345 1429168 -585773 442826 1459214 1626697
7854 1626697 148124 -113707 754952 122692 -902488 -15096 -878034 -312834 2854708 410983
7843 648596 638596 1690516 1405116 1103498 2691921 563497 1894941 1029494 346294
7833 2839385 1123938 -726697 13835 1048170 1242117 1193073 339003 952590 89016 -78104
7822 -16160 1323957 1508039 2857586 358999 -200291 -1640390 355625 -92677 72941 3176114
7812 3176114 -588822 1724902 1573744 1262491 278859 331616 -1119512 79880 280271 1619895
7802 1619895 1429714 -22301 -272570 1249026 -705042 2221694 8715 -233125 -61077 508052
7791 -2832390 -993674 890181 1820285 384860 -904114 -1855971 403244 -510659 2243540
7781 2154517 1302336 791206 1691241 980402 2458604 -1665111 1795454 1505228 459833
7771 1512610 1192916 525002 385270 1129974 840866 2019592 759853 2321370 511473
7761 -1918212 1207036 1162864 -33944 -71622 2161473 969697 -2028564 1026177 927930 965543
7751 965543 -439697 1342662 2243597 284988 2407197 165329 -877818 207916 -100421
7741 951095 819739 -829356 76857 1218734 513346 807761 -331743 -116126 3057142 2285887
7731 2285887 324360 952491 2215245 366107 1998011 2562820 -1389907 -1061376 480709
7721 244986 -1445407 1125142 1287985 -2329484 2511474 949256 -73801 1612874 -631664
7711 1431124 653497 566398 2058240 -669541 1260546 197575 9447 241588 1612608 540678
7700 1420633 513452 173469 -1312229 218312 1543023 435779 2042756 -118599 431559
7690 -741932 489457 -858620 -226113 -731636 491866 -144258 1870361 1746989 -206923 -1346827
7680 -1346827 3273658 1273706 274444 352557 792806 -125170 -1840809 943251 -2068852
7670 1223080 658906 1570926 -1290889 40452 -839011 669307 2295023 816876 -595731
7660 1014342 -223287 1028556 1278306 -368313 1074049 423101 1185758 997405 301596
7650 -151163 782865 -86063 2707858 1045340 1007306 1376205 65812 1022986 1518470 -646560
7639 -1169169 1521973 -1580827 1999624 752785 1855664 1331898 785091 769371 -100617
7629 621341 -1705764 497842 1928613 634428 829489 1642078 1136035 1438594 1910523
7620 1910523 1317899 248603 -983045 -458676 484903 -26702 295742 1592241 -511068 -318022
7610 -318022 -358352 517761 1740325 2478348 -295665 2740978 -32745 515070 -76131 -344767
7600 -344767 612159 -27550 2542053 1880240 -178534 613133 693355 1478277 2276740 -793259
7589 847180 846152 1524839 1645500 -563731 2219906 1332637 -818390 -1068557 1423125 1186248
7579 1186248 1120381 418097 2165484 -522582 -487388 939121 302028 755300 1786955 463440
7568 -2117852 937827 684721 1336742 -1537802 2173570 1679432 225360 1433323 126355
7558 638893 981798 -1253556 -36676 1221963 -406055 270792 -1051166 985694 328208
7548 1762279 1598568 2606633 -211796 3072221 1788102 1041461 1017031 -98106 -279238
7539 -279238 -1506826 124062 381985 336123 2071922 135547 1142264 -937219 -86423 234660
7528 1426887 1159063 -104065 1839362 1472910 2418111 -1873171 -116938 -1205771 1349683
7518 896945 1050642 -1382130 -1436846 -63876 -500768 -302243 538806 435133 1549105 -318444
7507 1606615 1422498 1788454 -1922912 3505935 1309260 769945 441955 1010584 1784410
7498 1784410 1491627 63423 1290445 636851 1202847 422589 1233757 78149 971122 1174306
7488 1174306 -263490 1915446 1064744 4285620 1424761 2080571 234935 -104425 1871592
7478 1758546 2812662 2134166 1676241 778510 269846 -188463 -1113881 -133032 1918678
7468 869094 -218272 736834 55764 185784 -1095789 1062275 -753166 -606427 1477079
7458 -1513609 -57344 1714931 1738649 1138227 -321771 370757 497250 1114846 2223111 862125
7447 1137990 2396514 1467214 678948 503533 533125 -343694 1471930 1878091 1669969
7438 1669969 843768 1606172 -1181523 -577512 1812251 2012993 1623590 1119726 -1044940
7428 -31141 726468 2027663 2368911 1593304 273580 -720331 1130102 1076642 3108720 -782706
7417 -433222 1917640 337519 1152505 -50320 1490781 -134382 -374004 427336 -2719118
7407 1077234 -220690 392215 1423096 641045 -1448406 -207118 424341 2058941 779474
7397 -259211 1161180 -599680 195943 1648277 -400512 891399 829507 2418035 921578
7387 1135393 577262 1589886 424302 1764806 1375497 1291295 2825699 1243049 3525810
7378 3525810 2252775 1181977 2642459 276413 310328 719437 1798297 2232112 488629
7368 -1335398 1354400 2243809 2154194 2673284 -1831428 1198080 2202093 18444 792809
7359 792809 2039188 -1036106 972734 1432774 1773631 191030 564994 18083 -334654 831328
7348 461752 2102586 2329762 134844 1093010 1774757 1781070 -57365 1097289 -1510247 650106
7337 -59129 1298178 1840016 -350590 1295335 1023860 834440 2945579 2658659 21963 1238507
7327 1238507 2064251 -1309033 -7604 707189 -1264766 736616 1318755 914260 1765216 1294453
7317 1294453 826175 -84830 -596645 1026274 603213 626666 346130 1617680 2230361 1038653
7306 3049268 1716965 818760 20067 -419374 -519000 1556052 85694 2576309 1402653
7297 1402653 21617 1101472 1875514 303237 2018155 724722 2247612 960619 1346746
7288 1346746 -354320 1217002 921591 2904547 1509606 467557 235439 -705875 2159807
7278 597633 1324034 1796334 940319 353223 962262 717501 382879 716371 834798 1881510
7268 1881510 1271072 -737191 -433503 1451032 1796573 2867834 1764332 -1160640 -837999
7259 -837999 763090 631962 2015611 2039290 2027320 1796934 218778 2910244 -769246 1695247
7248 768325 920352 2110664 198471 818827 -808347 469908 -951786 1081117 1957489
7239 1957489 -639167 997131 -583232 315036 1773160 -282185 -111091 551019 1732501
7230 1732501 2749608 -343016 1042207 1158504 520882 1366389 1519661 518014 -84205
7220 -370437 1783371 2020495 -63149 -2406 102506 2521877 346753 632395 2775926 1111514
7209 2497305 1711164 3727125 1411252 1787614 1533273 1485599 -1145067 657614 -2071120
7199 -188112 1862626 -25955 1535591 2000330 3272859 3633971 2927771 1509733 161882
7189 2262063 1147517 2531010 -352613 363342 476656 1607653 1987551 2132552 1204406
7180 1204406 -531013 2345027 1138975 2787680 737405 1045020 1487028 854344 -292678
7170 -987868 688292 -1516335 2026201 279218 2019947 514605 1429143 998810 2201480
7161 2201480 1908942 745031 475599 451575 150726 1849968 1092629 1208554 1546999 390445
7150 1738748 1254728 1415179 1355575 188585 -731132 -1308515 -1092788 691623 1988581 15519
7139 1276343 926593 2454074 821107 2119809 13526 1652741 1780927 -740412 -58216
7129 2379542 1989002 685203 184094 846356 432765 1311950 2032723 479921 3174763
7120 3174763 1645547 -85299 865707 952156 2080685 1076593 1041150 1204134 406151 1382509
7110 1382509 1169562 1342651 1476342 -595319 -87579 1195198 1457908 109826 2218340
7101 2218340 712612 591781 480638 -280720 1526189 -397588 695519 -190444 -1308973
7092 -1308973 -106355 2082542 256479 531837 2060673 39720 1409119 854827 865207
7083 865207 2480136 -278319 1474078 -4971 -93235 1465112 2038105 -772844 2409915 1364618
7073 1364618 1826594 1039716 464995 2186029 2052122 1617796 1614590 1903697 1854454 717096
7062 3611887 1355880 -972715 1043821 1045165 -125598 1666503 905213 1679542 -104476
7052 1429542 2780316 -197820 1686933 2076520 1702924 -226897 -353656 642526 1388649
7043 1388649 -404694 1544743 133591 1681743 2156509 26594 446800 59901 884852 2838507
7033 2838507 1335401 2293762 435781 2276345 1074057 863685 2380589 363036 2930477
7024 2930477 246147 615744 645697 862269 165836 -4092 1568388 1672679 -47369 1728713
7013 -557768 1319654 315113 2068502 2394276 1290334 1705224 636845 2572262 2231953
7004 2231953 1741754 1890349 2327290 129614 1258192 1356725 -311629 2950940 -378831
6994 1702716 921320 415546 2206907 1608232 1858134 -1226066 -989235 1230288 -1061473
6984 667509 900238 -1653394 1517801 2895746 1433337 1065128 1149634 69229 1837945
6975 1837945 407128 1234776 143269 46427 -48334 2849208 1786969 -837279 2363862
6965 753717 712755 1680389 1286089 1379079 1726179 -52780 2065252 1698269 222465 2268756
6955 2268756 759433 480356 -1254696 289585 1323024 2489160 526011 -1087203 574401
6945 1141465 2621529 1028823 984887 1070679 43365 3992758 1687126 46714 2534266
6936 2534266 1458170 -105047 605620 619358 773139 977392 199280 493250 -191527 2460913
6925 2111553 376136 30685 25206 289198 1442436 789502 953146 1262539 1891818 1251152
6915 1251152 -142271 2020328 1372127 916389 992136 1323131 1287529 2188021 1140838 -510725
6904 1781169 1853187 376361 231151 491657 1323034 1555750 2145823 2610704 323490 -680965
6893 2280929 254581 236126 1451369 -1476172 1014062 2369219 1593935 1081753 646958
6884 646958 1815312 -14612 91991 900001 187414 1408944 1999889 1520691 1343221 3691973
6874 3691973 1623706 162533 257787 -519817 941511 1897391 1184856 1073740 1087102 469606
6863 1082878 1769433 1729494 3004281 3539492 1111300 347143 331781 1485980 747235
6854 747235 2136675 2468677 234280 -662531 -642199 327379 2083506 2524890 614167 548943
6844 548943 2702417 1591686 407133 304237 640139 -197018 87235 317630 1544994
6835 1544994 1449335 1433671 1055888 1494624 1270845 1110566 186656 1065654 3176152 1512479
6824 2991895 1848739 2490948 1576253 1857459 2516992 -608818 1937686 2584892 1253883
6814 3092745 843640 -693750 2573048 1282843 1654204 703971 1223268 -793194 439587
6804 2245120 536868 2277351 711550 1666 2059234 856071 829079 557989 917366 1755542
6794 1755542 1318088 1577422 -422067 1537172 1312159 2870217 2126437 1060251 1433676
6785 1433676 2871862 14525 -1592550 50601 641095 -410769 1433838 483317 1055975
6776 1055975 -186081 2538010 2617012 274514 -230551 2662298 2800109 962749 1874516
6767 1874516 1281589 1095699 2243588 1776540 457713 -677611 674032 731367 2107671
6758 2107671 541235 2173768 2877068 1327288 -233681 2628076 2564386 739280 504919
6749 504919 166067 727810 1706565 3112211 1259219 428480 1576598 1277286 2110334
6740 2110334 2149266 1982061 664619 1859349 1806810 815812 2919328 1941024 -172440 1075002
6729 1453857 679723 269380 1385312 695659 99930 2110864 2259908 1192404 254218
6719 780825 3497337 69358 -1503204 1115890 -465840 2985100 -643550 -306239 1930779
6709 2105008 1610511 1651635 827125 2228018 245562 863634 593487 -10972 823360 2761567
6699 2761567 363693 737575 415129 1196013 -790967 3166864 2083266 1890557 1147149
6690 1147149 733785 1186481 2438032 588001 1880702 1006110 1523546 -931456 1124939
6680 204201 2877820 2891895 778899 3351780 33745 1293670 136243 2431113 -65753 1940934
6669 2617474 1172087 1996294 555823 1199751 -107409 1612656 337170 2047742 2331383
6660 2331383 -141034 911074 2922152 1144557 1047467 768521 1922866 1507270 -190539
6650 -353564 320922 -122956 1210386 1890371 1273447 -66402 1370572 1528849 671459 -183507
6639 1691070 2854083 1496811 -787618 -259309 1716384 3206169 2180135 3465294 1811142
6630 1811142 69720 2808283 259552 444991 2553974 474500 384406 757409 2260595
6621 2260595 1224334 827027 3269161 2467928 -367510 1177682 118097 -305933 2645131
6611 1899164 1832050 1856139 110721 1179662 -177203 1118200 290718 2494857 1913247
6602 1913247 -587958 1580903 -822472 1871187 -22166 1048413 900509 1384613 754156
6593 754156 1485882 2184685 996069 4195674 3032680 -63078 1809157 635671 998868
6584 998868 1503760 3507184 1430401 2269664 2664976 1086215 1728575 2532785 2510480
6575 2510480 69446 1004027 731254 956119 1199581 1050675 2281441 1401708 1786652 745307
6564 1205207 1727282 -1184701 432757 760292 1560844 2351577 1557972 2409287 3653737
6555 3653737 1211172 1593647 627353 178619 1034611 274827 2307252 2592525 1716576
6546 1716576 1399822 1486104 2706548 1309051 1618892 1780470 1498 2304183 1474563 2171297
6536 2171297 2514983 1714655 2319295 1898531 1934674 2802870 2389478 878661 2358630 1215614
6526 1215614 2553202 2638414 269205 1778549 2976934 1171491 711472 528189 3381456
6517 3381456 2194253 714972 1427381 248231 1375897 2446495 1011587 2116770 3822584
6508 3822584 1341164 -105476 1331170 2436323 2412258 232335 1722438 2021471 1899741
6499 1899741 248003 2970835 3588859 2979703 2212810 907765 3949719 3604730 1856253
6490 1856253 1944658 295340 913849 1750432 2701773 1671360 2046763 2808228 2412876 551598
6479 1527644 434757 533718 -551711 1078306 2536762 797301 2061429 2556719 2523875
6470 2523875 738363 1910568 115707 829783 800966 -337936 434669 2050478 1378161
6461 1378161 1551532 -440534 1182202 3176974 1580728 985510 1197681 1755625 974926
6452 974926 1259224 -247665 3595538 1145239 1775546 2565057 2170165 3278060 2328131
6443 2328131 3298219 3566989 128296 1625679 5978 2922216 1399784 1957238 973478
6433 1856565 1702836 -14382 1347309 1133911 1384190 1120198 683504 2300843 1651311
6424 1651311 -382636 3037794 613231 960348 482740 1753419 997616 3373359 2253635
6415 2253635 696547 2353059 1111498 1835101 204266 -178180 2202493 1871225 1936059
6406 1936059 1878038 3536280 1219742 1963124 3430157 2855694 809562 -293495 2031631
6396 849803 1027248 823483 2552794 1414774 2007951 1933513 1349229 1903521 721599 2731326
6386 2731326 1740643 1234337 1865797 1543174 1464688 1789389 1639896 2499330 1030834 1271364
6376 1271364 2062725 3285696 665997 2121437 2985662 4731170 28913 -399817 2817742
6366 2620247 1424494 2337243 3289909 1965378 1989645 1356953 1212486 2459428 1874482
6357 1874482 677378 1584695 507698 1059840 2610440 1979413 400706 2709758 -50688
6347 1397347 2184938 1608180 2489478 1720377 1563521 763846 -14613 501542 2500272 3072518
6337 3072518 1048840 2598523 108960 1603928 2430752 1602288 2047787 314856 1264094
6328 1264094 2562109 2164147 1962710 1188117 319545 2042205 3399709 2623719 985886
6318 813411 1903338 1460462 2306743 -222400 2276554 2041203 3462960 1535959 2303851
6309 2303851 1704599 898860 1025577 2077780 958280 1245895 1535255 923524 2868790
6300 2868790 1598916 -353320 1249326 3193867 -430704 1955284 630817 1608642 76417
6290 -71571 1747704 2914741 717633 1088798 1383971 2812707 2919259 2611380 3274240
6281 3274240 4387210 1548910 2522150 2604248 2241404 910962 213456 542428 2575474
6272 2575474 1641772 2821266 918675 2118448 1637630 1171024 3438427 350136 2524394
6263 2524394 2666014 1949069 718843 3268297 1761379 2578733 1464513 2289355 1908641
6254 1908641 2052993 3117988 1521374 1446935 1145349 849804 2821429 4242089 3626882
6245 3626882 1732133 -660310 1020006 1163569 2223016 1422706 1834038 -678585 1552295
6235 834340 2546521 1677065 2302295 1062642 2955138 1577585 1271120 3159250 2248113
6226 2248113 1024514 595096 1942523 948758 1627985 2820132 2701008 -1079227 2266180
6216 2228401 1032822 1926016 357408 819423 1333642 1302409 1699714 2386544 849990 2169151
6206 2169151 1639757 2051612 1330232 1155466 1238908 1623058 1573854 1811320 1583646 1439737
6196 1439737 2917925 1954122 1710332 652451 3962724 1661989 2633508 2076538 1574752
6187 1574752 642222 1551131 1770389 1959625 2624241 3631610 1742772 1946328 486338
6177 2577177 3529580 2004835 2736167 2988804 2880792 995087 748995 1818092 1217070
6168 1217070 820235 2337071 1720377 1774260 2109689 2190590 2940344 1216905 332973 1021485
6158 1021485 3054983 1975421 4259884 2155507 886176 979805 838147 2652778 418461
6148 2150684 2529465 2729415 2056005 1936400 685924 2935420 1175831 3029556 3444390
6139 3444390 3358547 2375574 1828387 2614171 1186177 -300357 2041344 1767921 923413
6130 923413 590950 2930483 1121693 2465146 1799203 605960 1866353 3419792 1274771
6120 2072560 2291654 1209472 -386085 4574883 2189606 2841067 5081315 1481279 3449944
6111 3449944 3743006 1551898 1667222 2658120 3183226 626479 1819717 2212123 1320077
6102 1320077 3841836 2345767 1666508 3037914 2061877 1412233 1398699 1179729 1929096
6093 1929096 729837 3018490 3092075 3040122 1552628 603886 1188361 1517503 3405315
6084 3405315 1914700 656562 3719813 3411180 2674140 2727701 2574801 1352201 1757888
6075 1757888 1080422 1155646 2004133 2216034 3531427 2055535 1105517 1321134 990197
6066 990197 1551779 2731816 1792497 3833657 3087611 1719457 1425105 2904442 2417240
6057 2417240 1319680 415278 2703634 2206496 4798006 2147959 1542756 3259151 1874969
6048 1874969 625216 2144730 2509758 806363 1369790 1791766 2958140 2690365 1750094
6039 1750094 2215050 2616331 2279211 1615229 1799975 238758 1175757 825350 1683663 1718802
6029 1718802 2521917 2212843 2349916 1572826 2803101 491523 3563052 1134180 2630622
6020 2630622 3173046 1879114 2880594 4038870 795728 2111263 801950 2934023 4839974
6011 4839974 2267163 1898952 2720303 1995499 2214289 1605111 3085508 2400925 1966091
6002 1966091 1863533 1407332 3245631 2193913 866520 2670170 1415954 3876341 2073681
5993 2073681 2837499 1635894 1745766 2126024 1617952 3277329 1447458 997787 449566
5983 2066023 2369757 2544740 3426940 1672674 2696653 1895028 148662 2144633 3408265
5974 3408265 2628130 1989878 4834076 1406019 1874172 2779339 -831375 2737382 1371451
5965 1371451 3084047 2517890 4263942 1596024 3228690 4721548 1204133 2417478
5957 2417478 2572808 1040420 1620251 2455975 2568462 3181857 2462028 229209 1433531
5948 1433531 4127765 2575352 2171661 2083105 1666347 2328608 1446117 1370640 1610782 1430192
5938 1430192 2361998 1925208 2583947 2818348 4020601 2261245 2018012 2890421 2399170
5929 2399170 2081727 3776129 3367750 2167461 1912857 -648382 72975 857852 4051260
5920 4051260 1959902 2222377 2041091 2329427 2880299 1598147 3310882 1611307 2993515
5911 2993515 1861564 1978302 538609 4921551 3946053 1992402 2758849 762734 2759336
5902 2759336 4275889 1485531 2235711 1084397 3164701 455302 2332021 1156392 2548211
5893 2548211 2507526 3572758 2451305 1322267 1184980 1294590 2049048 1765329 2647027
5884 2647027 3041385 1969860 1390649 1794227 4027087 2906880 4802293 2827567 1233789
5874 1108561 3402983 2089600 4667547 1934927 922246 1146116 1776168 2973583 3790014
5865 3790014 2985675 2341895 2957818 2034784 2597701 2731780 2580669 2748093 1319441
5855 2744735 2800885 1302891 3883935 2256122 2530860 1473425 1547310 2732620 5006
5845 1690469 4159344 1953525 1175928 3030631 3393044 3795082 2647664 2445587 3439937
5836 3439937 1812513 2423400 877908 4752001 1146267 3389944 1580320 2264818 3243181
5827 3243181 2475723 2654622 713604 847015 4108659 773361 2666988 2001363 596587
5817 511547 4165507 3622380 2585518 4020224 1005873 3100889 937518 2387259 2691201
5808 2691201 3030427 3738348 2424942 1768915 2432039 2922005 2064444 2950787 3409809
5799 3409809 3306210 2161991 2970992 2977232 1723769 2181504 1672150 1908525 2993343
5790 2993343 3440254 2368350 3228391 921458 2052407 1464388 2704911 2543033 2316035
5781 2316035 2464729 3462054 1637711 2837030 1382008 2916066 2621872 3473624 3666759
5772 3666759 -263560 1778626 3380840 2396070 2091625 4486351 4288053 3502185 2624134
5763 2624134 1334424 3676614 2091194 3533392 2565594 5485307 3347086 2884032 2136006
5754 2136006 1216256 4469553 1338713 2201256 2474384 1471354 895763 4658416 3972888
5745 3972888 2729310 5023538 3165436 2248562 3633862 2000082 5131978 5576584 1452763
5735 2610361 3785859 1732048 1419501 1978998 1942621 2585148 2877357 2451929 3171491
5726 3171491 1267979 2857520 2031742 2127286 3482892 2635084 3694570 2444502 2775687
5717 2775687 1090059 2688434 3194135 3184995 2712766 3284443 2796147 2782688 2599943 2385277
5707 2385277 1182897 3153165 2289021 2243180 3188116 3500122 2927712 2164325 2499037
5698 2499037 2361875 5443987 686715 2642837 1362122 2450010 2650052 1640123 2008544
5689 2008544 3990824 2687705 2207712 2641443 2173191 1973450 3839559 3188984 3563935
5680 3563935 1842349 1138675 3720921 1744765 2410800 4352619 3531601 2664774 2972944
5671 2972944 937274 1705916 2499328 4034386 3922065 1702556 2018640 4977179 4385643
5662 4385643 2103276 1701234 3715746 516867 2098489 1803460 1887082 3000068 3708952
5653 3708952 3425248 2365539 3512572 4108424 3531728 3048090 3758398 3729395 2495720
5644 2495720 4415308 3585474 1776823 3950806 5939269 4171592 3716423 3728861 3356875
5635 3356875 5813299 4063499 2763150 4171396 4865277 4334527 4089417 5312703 2422285
5625 5656183 2237688 3962258 1911175 2662250 3631998 1210912 2755659 4134107 5395863
5616 5395863 2323642 5190031 3117051 3382875 1308263 2305874 2855371 3388142 1744787
5607 1744787 1321078 2410853 2369504 2743763 2725997 1908430 3398917 3971390 2368654
5598 2368654 314619 3200444 3664292 2481888 2563032 4200422 4379565 2713209 4647135
5589 4647135 3299347 4653454 2253899 1168969 1702407 2861986 3060533 2183279 2583314
5580 2583314 3448372 2465953 2127016 1384936 2773030 751854 1197079 4596036 4131023
5571 4131023 2078098 2365822 3699819 1874125 2414200 1270829 2275210 3299186 4602234
5562 4602234 1904741 2428403 1908658 1421208 1695471 1412047 3835870 3949834 4361847
5553 4361847 2625481 2188646 4844238 1084556 3633284 2131399 2863026 3614898 2572027
5544 2572027 2649747 2355714 2676133 3169699 1982917 2551425 2140768 1431017 3776552
5535 3776552 4718469 543673 1267914 2032018 2888331 2920722 3292585 2939849 4285780 5138464
5525 5138464 3024962 3761704 3228100 4517422 -154557 3734979 1780795 3025882 3254716
5516 3254716 4056326 1491878 3688920 3779210 3942857 3083790 2611826 5741806 3584878
5507 3584878 4972164 5587007 4631355 2360715 5174908 4683840 3459148 4393626 1314795
5497 3452542 4167070 2819096 2621498 2127943 3561673 2972391 2953490 2933309 4575650
5488 4575650 2400838 4459042 3883681 2746445 4080285 4059532 4389672 3788569 3405880
5479 3405880 5443780 3074153 4866321 4464571 4337406 6276225 5327588 2399721 3582139
5470 3582139 4079077 5775830 4317804 5142031 2120940 2110929 3660667 4306311 5322861
5461 5322861 2680449 4727842 2776078 4861358 4286027 3038723 3096168 1549179 2073628
5452 2073628 5007164 1829335 2876338 2867425 3166198 3235121 5482291 2618647 3118595
5443 3118595 2969291 3226761 3308104 3004177 6611703 3620529 4112655 2432269 2133082
5434 2133082 2920669 3904994 4128617 5351085 4271693 3418597 3351538 1582678 2448253
5425 2448253 1478217 4159847 2104752 3391502 3770857 924231 4859211 430728 2580803
5416 2580803 3642778 1748695 3919604 3274531 3682542 2768313 2577413 4265086 2779670
5407 2779670 3910504 2422982 2674726 3537984 4154870 433471 3029112 2598240 3071257
5398 3071257 2427837 2402702 1101297 2918584 3584000 1399709 4206377 3270210 3593517
5389 3593517 2518374 2673592 1328382 1946181 2341017 2596300 4344891 3132796 2943764
5380 2943764 4699059 2305155 3865819 5298020 1834257 2085687 2648568 3572862 3557806
5371 3557806 1343795 1739917 1815009 4761630 1010782 1242924 1744881 3525307 3309945
5362 3309945 1958877 1938123 3488017 876273 4962426 2271440 3007556 1301689 3275835
5353 3275835 4044678 2342674 2275412 4453533 2411671 4355178 3490225 1658559 1465959
5344 1465959 3726717 2549204 4159711 2236577 571778 1488788 5549875 5364802 3325786
5335 3325786 2695817 3705965 4111591 2874396 4273866 4376227 5127309 2506270 3877012
5326 3877012 3081635 3692086 3577332 2205957 2555810 3361155 3168975 3642157 3664561 2668344
5316 2668344 4017885 -379944 4397115 1939899 4119110 2275416 2703954 2392273 2197645
5307 2197645 2863703 2858039 2498808 2985485 1916521 2647692 1958538 4179511 3543045 3224459
5297 3224459 4128124 3476768 4573824 3382693 3599700 2564075 3098219 3454297 3881324
5288 3881324 3075560 3140976 2419167 1239375 3693954 2089640 2962654 3237048 1626122
5279 1626122 2505974 2984355 4749085 2177903 3029220 2986615 4075017 2584655 3795166
5270 3795166 3350088 6128131 3236419 1668547 2670531 2327703 2737557 2903038 2443923
5261 2443923 3985879 3259388 3371268 4442881 2805677 4598486 3696051 3739528 4111997
5252 4111997 1855310 4422493 3226578 2397179 3344829 2571986 2347052 2136769 2792505
5243 2792505 5306034 2473603 2903608 3868467 1494297 3553820 5879945 4428100 3605729
5234 3605729 2946414 4001848 2468625 4039686 4273190 3597658 5474143 6060654 3419833
5225 3419833 3861557 5997468 3407963 6910748 5197221 2766221 5435277 5036926 4324221
5216 4324221 4871109 6297569 7554516 7719199 7055854 5067796 4755667 3368804 4725574
5207 4725574 4328729 3736012 3292386 3177687 2937160 3169273 4220657 5819010 2639518
5197 2888941 4913538 3379649 1745982 1819384 2953176 5247433 3230766 3559146 4068349
5188 4068349 2972753 3903815 3980274 3705888 6294337 4276378 4464329 3973262 3922938
5179 3922938 3576166 3957282 3115006 2591142 4069285 3312182 3406997 2967762 2845864 4489162
5169 4489162 1566152 2009655 5316093 2893295 3413824 3238350 3276400 4015211 2909652
5160 2909652 4585112 2638363 1884677 5407083 1986611 4500892 4247160 3622085 1816720
5151 1816720 4175730 2516396 2376940 4581208 3965800 3675209 3564895 2556461 2904558
5142 2904558 4172320 4401980 4297288 3196571 3888185 2380483 3207816 5586210 2536361
5132 3075544 4578850 3781603 4533617 3187742 2686427 6259613 3329680 2235469 4487298
5123 4487298 5339312 3092212 2728632 2259058 4103690 4099971 4026549 3909058 6210368 3795262
5113 3795262 4421316 5044340 4468729 4288270 3932358 4447775 3826379 2778608 5243718
5104 5243718 3786804 4603378 3915389 3953445 4657743 5209532 4083779 3914901 5613673
5095 5613673 5473123 4113550 3726454 3997363 3948380 6214932 5731709 3665137 4411985
5086 4411985 2665500 2316870 4336156 4652840 3767106 5618994 2296510 5136505 3547741
5077 3547741 3523716 3005586 4636794 5786034 4545003 4709863 6018690 3807653 3569604
5068 3569604 4911916 4897522 5045460 3984488 3693333 4789751 5619708 4863541 4321863
5059 4321863 4279532 3855926 4557289 4536673 5057417 5386050 3547877 5007732 2672455
5050 2672455 4126451 4619980 5841564 2997321 5318325 4685848 1941961 4915459 3770029
5041 3770029 5075803 4068687 1521210 4036810 3543759 5086253 4364619 3329723 4815309
5032 4815309 3890121 2226008 4753226 3659340 4726311 3007220 4541404 4257079 4322852
5023 4322852 3443316 3446452 4090980 2408247 3732678 4806524 3241946 4432152 4410134
5014 4410134 6119119 4871409 3504053 4335384 3475361 3323924 5872410 4605579 2911700
5005 2911700 4989345 4297867 2561188 3734036 3619353 4344398 3967805 3127243 3731860
4996 3731860 4168259 3532106 5989968 3712596 3427865 5152490 3571375 3939135 4535562
4987 4535562 3168201 4699359 4534144 3095604 4170168 4041957 4605058 5023143 4520198
4978 4520198 5089331 5985045 5065307 5269692 4679967 6206672 5024621 4824177 5025171
4969 5025171 5084196 7729145 5052744 5419569 7914723 7320271 7400625 10081492 11820676
4960 11820676 10866758 10169861 9889869 10984600 9715080 10041059 5905264 4317529 6823472
4951 6823472 3515419 5349748 4718502 3950944 3800847 4511041 4267569 3389104 5052755
4942 5052755 3338901 5720098 4927925 1638337 2965874 2687394 3281236 2577381 4893727
4933 4893727 5269525 6190099 3921398 4676616 2883530 3104717 5534453 3961524 3707875
4924 3707875 5732528 5208422 7029969 2998363 3948307 3911687 4877514 3944074 4109321
4915 4109321 4599510 6094387 3083121 4529052 2567491 4861694 6215608 4086020
4907 4086020 4913083 2199537 3905583 4283403 2799174 2758316 5297949 3498689 5953786
4898 5953786 2444199 4295706 4698174 4893587 5467143 5160617 4288637 5667453 5007576
4889 5007576 5018789 5590623 3014084 5141167 4047302 4399370 4882616 4630904 3354651
4880 3354651 4426641 4513528 3366121 4053827 4402861 3682910 4742725 4418843 4810855
4871 4810855 5237665 5037539 4937836 3238724 3987065 5769738 4156659 6735515 5390176
4862 5390176 7104481 5264358 3838958 6872805 5320685 6031423 4969252 4289690 4373789
4853 4373789 2467303 6387111 5104896 3848655 4706966 3592157 4398303 4298648 3720009
4844 3720009 3931345 4911818 5219449 4134962 6594580 4305830 2527791 5204938 3721679
4835 3721679 4609490 6219805 4991044 6982362 3575512 4625034 4662043 4330905 5619902
4826 5619902 4517797 6311709 4199980 5590933 3165558 5130070 5739277 2836568
4817 5299954 3841174 5603435 4409745 4583764 6826319 3491584 6069999 5595770 4681733
4808 4681733 3442036 4859403 5312094 3418216 4864821 5081376 5653504 5240382 5013599
4799 5013599 6380899 2965838 4693621 4904252 5445711 6295661 5716156 4700535 5011139
4790 5011139 3889772 6099599 2991666 6555778 3778023 5086843 7416969 4506375
4782 4506375 4395940 4622229 7004149 7571850 7204273 7618746 5640100 5429549 6018702
4773 6018702 4990473 3617080 5205419 5780820 4838928 5550546 5850404 6050334 5990290
4764 5990290 4762133 7121160 7008261 4573038 4655093 5883229 4849662 4953852 5478919
4755 5478919 6025694 3153172 3369504 8131728 4320187 5409859 4680767 5896288 6983901
4746 6983901 7161451 5350336 4147518 6821639 4897266 6036799 4332436 5968974
4738 5968974 5017042 6355305 5067708 4697135 4373685 4962528 4427427 5109891 4785426
4729 4785426 3573993 3240458 3468286 6684380 5245387 4923226 4922470 4446386 4949152 6697307
4719 6697307 5612008 4768545 5013112 6156250 4647855 6617182 6166562 6060791 5679160
4710 5679160 3781656 9118934 6055236 6477689 5023801 6953165 6822118 8537091 8276622
4701 8276622 7617288 8789932 7237563 5104653 4810451 5684369 5207407 6235297 5961660
4692 5961660 7435061 7560107 6636304 5755046 7093609 5781063 5893885 5226152 5810123
4683 5810123 5377540 4503495 4762134 3699461 6778891 5507615 4296916 5563724 3836990
4674 3836990 6475044 5318250 5197854 6338584 6265503 7477340 6145976 6676848 6618362
4665 6618362 7494154 6051220 5899199 6737280 9272791 8270982 7773304 7834656 6135025
4656 6135025 7289823 6083173 8350872 7258635 8737653 7683090 7021984 6795044 7041500
4647 7041500 7019811 6612005 6302998 6537362 4388157 3970755 4769789 4697373 3436812 5247305
4637 5247305 6981172 7974470 6278750 7662528 8710583 6379281 5701860 6884393 4527885
4628 4527885 6112035 2632476 5826743 3274787 4959559 5666789 4822199 6232849 5235466
4619 5235466 6252856 5273009 4068758 5803179 4954114 5887682 5867364 5450894 6483014
4610 6483014 6495720 5909698 5571007 6087260 6808924 6537449 5690721 4617154 4799498 4369264
4600 4369264 4405851 6753142 5174061 5481225 7731391 8288914 3980291 6073903 5560357
4591 5560357 7232155 4841039 7111332 6491943 4249328 5414142 7529469 6500871
4583 6500871 4139777 5302012 7703999 6225465 6554543 5522716 6919869 6309328 6880368
4574 6880368 5390146 6341214 6131096 7090990 11088176 6423759 7848531 8311538 6671333
4565 6671333 6110636 7557985 7883372 6887264 7026087 7617953 6804988 7395487 7459269 7082968
4555 7082968 8078796 8004593 7415486 4739591 6584936 8473229 6840548 6543082 5848878
4546 5848878 5964727 5857819 6901801 6930364 7453283 6765220 6682761 6836148 6409410 6182566
4536 6182566 7802028 5855876 6437554 9638721 5241084 6987565 5766371 5188130 6614177
4527 6614177 6923752 5318063 6835061 5516802 3205699 5593270 4931708 5072643 5741836
4518 5741836 6639031 7109445 6173375 5756549 6368515 6538628 7278255 6354798 7409982
4509 7409982 6088118 6339479 8274053 7192062 9439884 8543342 6039206 5378482 5783595
4500 5783595 5806295 6909434 7471645 9329565 8507919 5662254 6605898 6479156 7744083
4491 7744083 7876555 6027406 5823527 5532887 5139777 6025765 7052263 7107100 6576075
4482 6576075 7765752 7211639 6401195 6870418 3696479 7601104 5989975 5309721 5668346
4473 5668346 4915059 6472177 5948890 5348383 6800037 5848509 4969142 7390648 6667503
4464 6667503 8082890 6246224 6626075 6905416 5578287 6500294 8717163 5796981 8531220
4455 8531220 6327649 7861329 7613863 7835955 7913999 6538640 7406534 9580256 10247964
4446 10247964 9223606 7932199 7365392 6910942 8813746 7577392 6997104 7942835 8484264
4437 8484264 6685096 6946758 5482190 6270473 4512980 6680100 7311013 7406949 7839283
4428 7839283 6054707 5004650 5626651 7335487 4509112 6739306 6315377 5718001 8066050
4419 8066050 9788054 7850681 7623460 6653073 7128574 8164983 6210085 7584917 6483730
4410 6483730 6602504 6850919 6883027 6995704 8427118 8000541 7645007 7887341 6929278 7250932
4400 7250932 9278700 8823553 8761523 9238986 10457868 7325614 6751158 9137446 8905124
4391 8905124 7069220 6797328 6198972 7798033 7722691 8579468 5823321 8069853 6012603
4382 6012603 6630438 7826392 7668166 5417302 4341385 9341865 6718513 5134402 7343841
4373 7343841 6891942 9660940 7237932 6634051 6853387 9690164 3823336 6359801 5892601
4364 5892601 7844395 6286725 9753318 9028679 7251801 8296806 6508511 5927349 6099851
4355 6099851 5196964 5643396 7056801 7778236 8288047 8119889 7663557 7219310 5593346
4346 5593346 7602258 6890423 7415455 5733045 5686032 6568619 6821151 6872048 5683876
4337 5683876 7115117 6427997 6377391 7835157 7243931 7163383 7798844 8091665 5837210
4328 5837210 3966690 6902779 7220748 5945840 6322071 7574558 6364459 5364197 6727354
4319 6727354 7448619 6198280 6220820 5350768 5364240 6671495 6552632 6867991 6671468 6033207
4309 6033207 7513029 6740820 6530191 6684364 8003400 5427398 6580623 4184348 6641929
4300 6641929 7392717 7778571 5526706 8408182 7098121 7417656 8074970 6578192 7590909
4291 7590909 5279428 6024159 6756082 6528927 5851627 5303265 7681225 6207991 7351136
4282 7351136 8415910 6397276 7649529 7764873 9550347 5641318 7629670 5968986
4274 5968986 7111866 8750049 5779661 7105860 8697957 6686468 6121360 8521788
4266 8521788 6747881 7164215 7943605 7256805 8334390 8200221 9501144 6468159 6230927
4257 6230927 8234520 6150795 8961010 8572896 6473609 7291047 5897894 7813803 8053602
4248 8053602 6029102 7813445 7567900 7295734 7897562 7672779 8189285 7997117 6266508
4239 6266508 7681326 6296945 7070561 6450378 7778066 8601027 9528417 9282405 9363948
4230 9363948 7851157 6978654 7086815 8023341 7617853 5422047 6786625 9300594 8655444
4221 8655444 7576693 7960908 9099534 10370542 9709192 10432809 9828439 8819113 8680338
4212 8680338 8788326 8989104 8952072 9404838 9894852 10889243 10736433 9796653 7989424 7544983
4202 7544983 7899546 10561952 8206471 8574419 8085611 8349026 7766724 7345266 11025142
4193 11025142 9466110 10586155 10795673 9195251 11130683 13124890 10363853 10541476
4185 10541476 10591765 11853796 10503042 12750290 9801781 10966041 10113170 10847730 10090622
4176 10090622 10409500 8581657 9821227 10380423 10134467 10663073 8892723 10915868 10949171
4167 10949171 10815595 10036374 10553922 11627932 10714872 11287224 13790218 11016798 14020241
4158 14020241 13483347 15172517 14092883 12791380 16075300 16881190 15311265 14845357 13828987
4149 13828987 15355245 14843688 13833870 14642752 17535514 14686125 15747713 14775375 15844611
4140 15844611 16655214 14499872 12705094 13903637 13552745 11952479 12885446 9909076 11988478
4131 11988478 11254807 11142152 10223578 7672915 10212982 10851705 8648333 8953374 8589875
4122 8589875 9370651 9703796 8493806 8532538 9707067 8048816 7758242 6784180 7221089
4113 7221089 7662508 8421176 6612617 6351780 7917374 7924984 8299713 7581580 7243474 7995408
4103 7995408 7699963 7043283 8183180 6386144 7893358 7718706 5536555 15090401 7622799
4094 7622799 5988567 6881819 8297600 8201031 8568456 6516093 8727501 9164044 8076388
4085 8076388 8763493 8143429 5412578 8380463 8699595 8848474 6146105 7839611 6959878
4076 6959878 8619202 8066154 7989462 6623744 5353482 7551135 8188082 6961989 8013043
4067 8013043 8446297 7663392 7408791 7227471 9211700 6603001 9784220 8028419 9387528
4058 9387528 6068311 9193536 8765936 7417441 8480308 8103651 9302023 8927271 7520161
4049 7520161 8215628 7458098 7947726 6618460 10744274 9791798 7544709 9141437 7716079
4040 7716079 9195512 8659149 9842365 7785336 9057212 10661385 10315691 10613446 9170426
4031 9170426 8590205 8943236 7222173 9137282 9151990 8136430 9307244 9167484 8578137
4022 8578137 8582961 9146562 7649988 10552004 8245423 6973978 5505508 10760388 9899381
4013 9899381 8348133 7457346 8275997 7883288 8233627 6443074 8132453 8603132 10484001
4004 10484001 9319019 8852553 9548736 10201979 9161357 7850032 9439409 8547115 8271717
3995 8271717 8874747 10547063 10802436 10095184 8417943 11245578 10397645 11023062 10987182
3986 10987182 9026071 10188462 11201755 9712055 9866080 11397977 10885482 12276675
3978 12276675 10325852 10672041 10927895 12600911 12681687 11677014 11911985 14140941 12130009
3969 12130009 12034754 12137816 11795812 12216035 12119539 14734112 14753420 14425735 12436794 14607312
3959 14607312 13279404 15210444 13692983 13845743 15042785 14418588 13356563 14947363
3951 14947363 16495732 16383178 15481868 17943164 17652814 19678650 19028576 18789864 18139220
3942 18139220 19800036 20901682 20329824 19472680 19917844 19181278 21424342 22773150 23897604
3933 23897604 24228070 25278344 26509314 24689573 27166117 27661366 26371308 29111436
3925 29111436 29399552 31708147 30158237 31059722 31873468 33251795 34492302 34681430 39885637
3916 39885637 40793225 42296441 42999581 46801165 45882161 43025633 40232509 33199756 29064364
3907 29064364 22561148 18537740 15368131 14135485 15109307 13156498 11660719 12537790
3899 12537790 12319896 12130177 12601515 9648157 10491586 10424837 10495340 10139898 12777673
3890 12777673 10163766 10083630 11021513 9577912 11197720 9076794 14008248 10221680 10995020
3881 10995020 9210352 8514437 11022389 11012761 11513603 11217146 11358768 11045522 11495525
3872 11495525 9964526 9779392 8403692 9124352 10124990 10755937 12649030 9547282 10179866
3863 10179866 9784284 9318279 11272183 13216356 11253030 10393851 10850790 10473220 8518510
3854 8518510 10565090 12062654 10725092 10418546 10372371 11484710 11336902 12061011 11259387
3845 11259387 12511176 9225078 11188141 10094219 11994138 11842914 12220363 11725393 13205226
3836 13205226 13084129 9654699 10128408 8361232 9891862 11759665 10491212 12395032
3828 12395032 10958099 11908754 10713458 12704998 9868497 12781937 9786319 11828988
3820 11828988 12931874 10554342 10000027 11527557 10250249 10639925 11858518 10009762
3812 10009762 11420812 10420783 11545803 11391092 13296062 11474309 11313092 11731619 11822208
3803 11822208 10532122 11189841 11228841 12590907 11332963 10921019 13607737 11618181 11927860
3794 11927860 12090667 11163411 11975235 9826791 10702431 9836584 8705389 12763817 10102914
3785 10102914 11747709 11786539 11215114 13107614 11172855 13221565 13198879 10641691 11508057
3776 11508057 11878659 13462929 11896775 13687888 12058641 12891113 12641544 14939894 11617968
3767 11617968 13521489 15976939 13730717 12595059 14208080 13579648 15541725 14283261
3759 14283261 15390826 15574536 15908209 14476817 17486056 17602647 18238516 17801496 19903308
3750 19903308 19432632 18033648 18980836 16335215 16130510 18765408 17847576 15924812 17950646
3741 17950646 19469355 17652026 19356654 20871852 18897804 19854324 16331128 18796762
3733 18796762 19191842 19839661 20666500 22339086 20342530 23657714 20202186 23279120 23753112
3724 23753112 23910670 24790472 28936389 30658832 30966886 30538626 29358199 30846384 26360256
3715 26360256 25876236 26706637 26501810 29369312 29259689 32741292 34039485 38328957 37860937
3706 37860937 43368744 43119285 43759897 45593596 47394541 49581209 50456025 48999160 51800868
3697 51800868 54211028 56453716 58024464 59633748 60108424 64364508 66229604 69448324
3689 69448324 72747308 74741755 74490515 68119052 57893136 46446917 37649901 30736686
3681 30736686 27308258 21968338 21791838 18148804 19990704 16990167 16966498 16278274 16837889
3672 16837889 14859796 15093770 16114278 17456811 14925743 16432943 15448814 15529905 15498827
3663 15498827 16697167 13706024 14571251 13009485 15373252 15441921 13717133 12736731 14828056
3654 14828056 13701750 13481492 15727091 15803957 14818608 12977171 14665229 12962361 12338098
3645 12338098 13940464 12223707 13959731 16409282 11616008 13849830 13309704 14376418
3637 14376418 15482445 14739209 16815067 13765523 16294804 14920761 13509850 15221334
3629 15221334 17163164 16451909 16403187 15448576 14178851 17589830 14922882 16020859 12972911
3620 12972911 15080431 14620873 14924498 17164094 15635398 16834196 15083924 18911880
3612 18911880 18539966 16282199 15516002 17672844 15849338 15919591 15702266 18248584 15691440
3603 15691440 16835922 16003055 17753832 19476013 16101789 16817844 17211376 18465348 19732500
3594 19732500 19157834 19226574 19419194 18983878 18184281 18310666 18990670 19371124 20628142
3585 20628142 20534738 20027376 20129864 17472120 20279736 20743948 19799188 18714576 18941418
3576 18941418 21102818 20622638 21256962 20848811 19948676 21901542 23392272 21528352 21044894
3567 21044894 21534984 21377936 21498056 22282126 19987842 23624834 19579238 22412464 24615052
3558 24615052 22345822 26458535 25361562 25687969 23542223 23533905 25912686 25923188 25270863
3549 25270863 24978228 25466508 26866410 26056756 25893438 27990047 26315954 28330550 26093139
3540 26093139 27617202 26471249 26396974 29866363 30590570 30364993 33948065 34177762 31935706
3531 31935706 34828621 34059394 36126225 35548689 37589969 37329097 38461305 36831249 37493550
3522 37493550 39029038 41086513 42297453 40181885 42182773 41737953 44493041 42525577
3514 42525577 44609108 47179609 46959129 49966225 50139405 51924176 53577376 55676528
3506 55676528 54723696 59263340 59744164 63724904 61604225 63402736 66211875 70115116
3498 70115116 70797324 73342195 77188475 80381043 82856595 87996035 90697875 93193754
3490 93193754 101189723 103365547 110362994 115861770 127247193 136122809 146718008 159601127
3482 159601127 172130455 186104358 200946837 215864692 236260932 256167603 277616914
3475 277616914 303687632 333880175 366305198 408012140 459682121 521648903 605391522
3468 605391522 718363805 868679318 1084112203 1377638462 1711052974 1947233314
3462 1947233314 1877423141 1500505016 1062389964 716201117 484644904 334531503
3456 334531503 239809315 181759239 137649608 109020146 86519418 73534587 61934000
3449 61934000 50991337 45673733 40753957 35909493 32988785 29741805 26244859 24946050
3441 24946050 23796336 22157046 20629676 18839072 16889018 18011234 15767693 14041129
3433 14041129 12226407 12167334 12345502 11369298 8629856 8046073 8458556 9111801 9123356
3424 9123356 7962804 6057124 6026607 7933721 5134660 4453257 3895833 6443018 8161048
3415 8161048 5496750 3774158 3809509 4973992 6395177 5594384 6183528 5206524 6402318
3406 6402318 2931804 3133959 3303655 2895602 2368609 361443 2817934 3724391 2550321
3397 2550321 3898607 3155201 2720006 3615803 3107520 1790521 3605169 4019448 4864228
3388 4864228 4633071 4846497 5981529 5659012 3463723 4052533 3448683 4105271 2252384
3379 2252384 3275090 3768550 4479019 2652408 3098946 2874246 2413645 2016373 2752403
3370 2752403 2267369 3111733 378264 3476678 2162205 2780891 2861952 1242172 2637663
3361 2637663 3203596 4926833 1363767 3474729 2486734 3039141 1497886 2573607 2241982
3352 2241982 2458615 876888 1299350 1909171 1663457 3921119 1568166 2859453 2268987
3343 2268987 2895382 1465240 2392248 1523642 3739427 1505660 1380127 2534410 1633212
3334 1633212 2567886 1021310 2740111 3527538 1962204 3800264 1525016 3890563 1889107
3324 3569158 3790592 4586505 2438679 2554850 2822160 3364422 3486984 4257683 3452739
3315 3452739 3506252 4695795 3386608 4359349 5040241 4377390 4396681 6124265 6816866
3306 6816866 8378348 8096475 6509702 8723052 8713011 9469111 10743421 12536860 11974790
3297 11974790 15348007 15114629 14828308 15384347 15092318 16024644 16889080 16379706 15831990
3288 15831990 19259854 18919124 17986004 17092894 18651512 17624036 19506580 20915064 20394432
3279 20394432 21948980 21418456 23959384 25422056 25487441 27310547 29592112 32934441 32834146
3270 32834146 32182165 35044621 33166973 32941463 32020456 29330492 28517745 27315806 29642611
3261 29642611 26981422 30425893 30534450 32606596 31411304 34639769 35151757 36905562
3253 36905562 34004905 37535238 38392841 39257697 39470565 41055749 40626341 42597416 43322573
3244 43322573 45858296 48512193 48911421 49423952 53449049 53845836 52863484 50834004 43982529
3235 43982529 35954946 29861762 25217894 21180798 17721298 15162717 13870813 13251144
3227 13251144 13341780 10939531 11972460 13163518 12120089 12048102 12172356 12391294 10490602
3218 10490602 10435070 11095827 10012443 9082667 8999307 10383920 10331852 8991021 11130494
3209 11130494 10878137 10457156 9318505 12489832 9103491 9253472 12587900 10927992 12342265
3200 12342265 11698076 12967014 14412147 15668383 13910447 15081036 15327686 15233221 14410626
3191 14410626 13492370 16094712 16341915 15814040 19143166 16028252 14835642 13102955 15023276
3182 15023276 14532379 14739076 14739055 13473305 13811129 14581176 12151066 12231194 10358829 11086015
3172 11086015 10575806 9382497 9981020 9483435 8639596 10724331 8842585 7662953 8378761
3163 8378761 10221528 9272384 7392411 8380199 9757847 8340242 8746442 8492901 8828575
3154 8828575 9908328 10685475 9941181 8298677 10001198 9164905 8506242 8869275 9564664
3145 9564664 8666562 8636189 9724451 10711106 8546755 8359463 7551919 7122340 8160459
3136 8160459 7922152 6328195 7902140 10062617 9127762 7071816 6632664 6886692 8547647
3127 8547647 7513384 9176336 6929126 6957061 5409181 9156179 7024552 8177092 7303903
3118 7303903 10740137 7162801 7922396 8279398 8485181 6663692 8186831 8014368 8815229
3109 8815229 9067506 6349020 9845814 8458734 8932539 9068407 9595955 6860354 9983269
3100 9983269 8341286 8582598 7128616 9773278 8442851 8969894 10599792 6452019 8748059
3091 8748059 10352535 8251882 9497306 9700169 9811233 9908435 8167940 10890650 8715212
3082 8715212 7082973 7868507 9003198 10723811 8537273 10478658 11423473 10421678 9650800
3073 9650800 10999998 10987721 9462950 10150553 10814759 11441462 10351955 11049449 11575041
3064 11575041 10744663 10480234 10390879 13261631 13413359 13485462 12001747 11414833 14997441
3055 14997441 15373687 15841982 16362549 16522982 17562245 19142436 18926798 20108428 22073952
3046 22073952 23468362 28466245 33061669 45062809 47925853 42065693 42424645 45391605
3038 45391605 35393122 25734618 21431592 22820320 23199118 26207062 26053310 26774431 28260954
3029 28260954 29645234 30590956 32583721 33559837 34034805 35922913 34065634 37754242 39348997
3020 39348997 40297201 39356153 41610341 43323997 45993497 46561817 49146828 49042189 46169561
3011 46169561 44745201 37881385 31809575 25792975 21340048 17005368 16823041 15609385
3003 15609385 13939657 14095630 13132734 11258139 11364833 9581697 10050714 10948546 8589268
2994 8589268 9384097 9744807 8912316 9245974 7978512 8473050 9571161 9175649 8023094
2985 8023094 7352644 8145201 9171396 9666977 7334259 8293346 7520972 8766858 10497725
2976 10497725 7908546 8871409 8297812 8186332 9619565 9912713 7317721 9532957 8482359
2967 8482359 8681899 9912485 6710631 10964218 7445527 8026262 7564384 11747419 9254800
2958 9254800 10278942 7654475 10354546 9301285 8368774 8834172 10759668 10509329 9493029
2949 9493029 9657649 7882614 9057406 6963431 9163047 8881456 8910504 9393901 11163282
2940 11163282 10933950 9953255 10736026 9745118 7707452 9895008 9437195 9885725 8860785
2931 8860785 8669073 8566213 8048136 7554432 6768695 6819836 7564580 8222223 9915747 8054790
2921 8054790 9186393 7248167 8756386 7000107 7281328 6868396 9727668 8389186 8193864
2912 8193864 8085128 6523127 8227845 6288944 8006140 7898308 8425469 7677940 6339993
2903 6339993 5487500 5419488 8863417 5196954 6769907 7486647 7063715 5063823 7089540
2894 7089540 7548951 7787838 6382445 6585016 6420944 6666962 7738774 7206535 4699895
2885 4699895 5463300 6689478 3998425 6430704 7329201 7072655 5249505 6743259 7357594
2876 7357594 6858748 7128135 8982237 9115961 9774056 8839789 8315797 7575987 8805426
2867 8805426 7027543 7308720 7896328 6743938 8300607 8325975 9920159 8491057 8856814
2858 8856814 7269906 8947235 8869534 8896798 7283676 8305067 8174135 9033265 8030197
2849 8030197 8812329 10189984 7141035 9485361 7614507 11033815 9513797 8544859 9128356
2840 9128356 9070272 10771220 8508050 7593967 10428329 9581688 10459236 13245603 14142510
2831 14142510 13415811 12776311 15425789 18069652 19581642 23721260 35863781 50374757
2823 50374757 67419444 48652185 26873954 15262356 11544635 9631121 9117417 10626502
2815 10626502 8996727 10913973 9495141 8353448 9148042 6992821 9114753 7756730
2807 7756730 8495506 9656509 9507227 9450835 9663303 9079026 8783961 8321093 10211055
2798 10211055 6914340 10305994 10382818 9694571 10242538 10836268 10358947 9181280 8495244
2789 8495244 9162731 9298950 7961315 10063744 8675618 10437115 10958973 8218270 7246215
2780 7246215 8201520 7482550 6966434 6100916 5916467 6448761 5636050 6038027 7124873
2771 7124873 7302697 5638295 6358361 4410357 5150732 6570103 8219223 6478049 7095574
2762 7095574 6880497 7243057 6794484 9439746 6527287 8375142 7806754 6981472 7358121
2753 7358121 8458122 8312188 9633875 9937487 11634978 10372457 9258846 11640373 13878836
2744 13878836 14560939 13936569 13204236 17083546 16395758 17646792 19245950 24236832 33347273
2735 33347273 50429757 77306028 85453371 61216772 34145617 24090232 21523940
2728 21523940 19089286 22683047 29931020 42198401 55553121 50824916 33211052 23307343
2720 23307343 21963868 18755287 26276104 33056178 53027433 73132676 68201740 37502005
2712 37502005 23344190 17236382 16965928 18489475 23146300 35807746 48324132 46849713
2704 46849713 26613363 16862330 10688958 10588369 11988504 14418638 18019532 26916467
2696 26916467 24319308 13639994 8589920 5846451 5357377 5216205 6744331 5297390
2688 5297390 8892426 5992502 6137143 8256664 8329412 7467099 6921460 6287047 9561566
2679 9561566 6627553 9216966 8958230 10684608 10433553 12655691 13689773 12484299 10402250
2670 10402250 10412593 8919800 10227738 7497282 9262840 10769557 8632131 8227770 7762402
2661 7762402 6679153 6488312 4921821 6115202 4374284 3773630 3495073 1948899 3807250
2652 3807250 4348869 4664342 3874087 6172780 6851035 2475930 4395711 2177943 5648983
2643 5648983 3614661 4007331 4372157 4024292 2443711 3397354 3071116 4196823 5091970
2634 5091970 3154556 4093069 4595787 5621788 4451913 4303775 3648375 4294511 5446483
2625 5446483 3803238 5111958 4337704 3842849 3930278 3825465 3137557 3951533 4897649
2616 4897649 3106962 6403768 5369145 3148566 5585402 6325926 5806894 3586699 4610123
2607 4610123 5917424 4263747 5949020 4983644 5860577 5419593 5255108 6681032 5379306
2598 5379306 6173432 6032834 4809951 5897167 3586386 5845619 6306259 4305529 5612104
2589 5612104 5107893 5960104 6046225 4978223 5045778 5105410 3956965 4125631 3503742 3628954
2579 3628954 4176204 6033689 6262633 4062360 4627682 6094348 4775708 2964291 2944655
2570 2944655 5080227 4322554 5051734 4592635 5004498 4217552 5163494 4126360 5440665
2561 5440665 3823169 5401197 4574731 4737511 5087223 2293544 4606745 7232381 4767265
2552 4767265 4542996 5471034 3271322 4328926 6290915 4235181 5150628 6099776 5048674
2543 5048674 4968378 4006863 7452069 3455742 6654089 6437842 5548857 4271448 5868205
2534 5868205 5933435 4731330 5274669 7454271 6192239 6380255 4638093 5417502 4189544
2525 4189544 7101480 4845223 7862675 5832658 5166377 5291087 7899546 7724041 4891693
2516 4891693 6738567 8254533 6763625 7380159 4742267 6565058 8004877 5368787
2508 5368787 8598765 7742367 5973293 7583024 6993034 5419576 7431243 4946122 7551297
2499 7551297 8021042 8473293 7157367 7188301 7782516 7244388 6339348 7936801 9600441
2490 9600441 7961001 8923508 7186801 7393896 5927932 8609633 9045454 8450044 8154046
2481 8154046 10172084 8205899 7291431 8541571 7415974 5232424 7208651 8053541 5694332
2472 5694332 7306754 5700445 6875183 7998382 6118633 6592495 6725191 8392158 6464233
2463 6464233 7780826 5639196 8104372 9009167 6584558 8258171 7423112 6446629 8530668
2454 8530668 8726897 8304601 9137088 10441291 10848415 9446809 7843751 7752347 8799973
2445 8799973 7158239 8837952 7988228 9450818 7841577 6861833 5921472 7069981 7000261
2436 7000261 5699745 5094502 8143855 7769740 8814205 7875903 7333591 7072966 6011547
2427 6011547 6733990 6085174 7498189 7522518 7664921 8072357 7550394 9600677 6667192
2418 6667192 7104623 6966986 9910888 6377746 8357182 5385456 8077488 8989902 7665995
2409 7665995 6952395 6512893 8923484 8067875 6213739 6686470 8270121 7865895 6866229
2400 6866229 6958024 7773063 6971407 8167558 6462401 7385464 9714774 8948461 6942073
2391 6942073 7694541 8166360 8289197 8383941 9369404 7534234 10356552 8565736 8600522
2382 8600522 6264786 6703308 7058803 8554824 7761150 10140138 6419237 8130557 9035631
2373 9035631 7581608 8933399 7068431 7696540 8407363 6117134 8318339 7095414 6738403
2364 6738403 8193314 7227331 7563611 6797926 7223009 7214499 8282096 7964012 7004155 7764215
2354 7764215 6410712 8609421 7510806 8698506 6968259 8893571 8402241 9112324 8286541
2345 8286541 7082119 9729077 10137707 10180831 9279785 9293157 9664549 9888949 6327663
2336 6327663 8023153 8869906 8589362 8283377 9929536 9865224 10138563 9149501 8089374
2327 8089374 9459884 7417262 9100703 7931610 9462123 9365383 9390029 9584744 9620733
2318 9620733 9220786 8319116 5354925 7431345 9159720 8194111 9964294 7596850 8459079
2309 8459079 7738291 7815799 7635233 7309888 7810977 7997900 8315484 7232677 10283043
2300 10283043 8936948 7862286 9029126 10066880 10190808 11150893 8629486 9466345 9381120
2291 9381120 12119049 11027860 10785425 10564560 9708337 11334171 12333441 13164319 12868217
2282 12868217 10979603 11453665 11278614 11781573 11930791 12205320 11119362 13875692 12413257
2273 12413257 10400490 12069109 11337651 11938208 13238884 12416664 13021541 13921887 15575910
2264 15575910 13226712 13890697 14666894 15278471 13734562 13941685 13344136 14260457 14690103
2255 14690103 16637054 15897149 15054710 13659338 13446435 10130794 12698481 12174513 11946918
2246 11946918 12998201 11079488 11771666 12201012 11887397 11776397 11540243 12711382 11310756
2237 11310756 12623941 11384876 12771375 13484654 13548263 15083245 16183571 14708547 15229997
2228 15229997 14453400 14640783 13098796 15139761 12394237 15081669 14763210 14377811 14713533
2219 14713533 12659034 14483936 15016390 16623076 15633448 12526505 14422191 14023945 13669670
2210 13669670 13045646 13122693 14520813 12590235 13468865 11381391 13302773 13929088 13086897
2201 13086897 13969239 13028669 14383611 14329908 14574189 15247504 16137184 13158962 14987456
2192 14987456 13877116 15346797 15610370 13620387 14023283 12892628 13695884 13629714 12569872
2183 12569872 13237335 13738398 12393550 11927987 14297132 14179893 13633778 15107649 13865244
2174 13865244 15450316 16439756 14424857 14115345 16190667 15764298 15980437 17352082 16058901
2165 16058901 15943201 16105055 17654370 16681963 16195818 15628461 15683587 14946209 14433461
2156 14433461 13481866 13504318 14554202 15191783 15024302 14638136 14741572 13840015 16073997
2147 16073997 13738724 13374588 12894204 15335947 13929437 14532945 15762135 14312896 12612214
2138 12612214 15114640 14357357 13943009 16193275 14319532 18199716 14973466 15749173 18444132
2129 18444132 17134420 16233152 15521205 16731081 17825810 17526270 18423622 18635330 17686782
2120 17686782 20061399 19577930 17978760 18414886 19303074 18026960 17077664 17426354 17780282
2111 17780282 17063562 17082280 17801777 17149322 16561141 18022422 16998628 17380962 18247218
2102 18247218 16755010 17849393 17738066 18229352 18090224 17021518 18704458 16965284 15151621
2093 15151621 17259013 17587136 15349448 17876274 19037918 18633788 17740744 18521780 18509402
2084 18509402 19316964 18722691 17335090 16940734 17459350 18584270 18236161 16705344 17260356
2075 17260356 17966412 17203476 17562826 16658204 17610078 17683245 17426477 17141154 17951964 17249384
2065 17249384 18642412 19524382 21631792 24738378 34452861 52479056 61990740 39298053
2057 39298053 24353354 18909074 12968076 15327489 15864558 12775038 12797338 13983184
2049 13983184 13163825 11580620 14794157 11757355 12717504 11284929 9413292 10954586
2041 10954586 11864337 8598676 10088563 11076137 11632593 12507211 9466674 10339506 11047776
2032 11047776 11209345 11575957 11602419 9761715 11101672 10115146 9363109 12269415 11538664
2023 11538664 10042205 12078874 8822435 11291932 12065047 10671502 10382886 13555536
2015 13555536 10868262 13251784 11558814 10768068 8520504 7597724 9382647 9747579 9450847
2006 9450847 11112512 10755323 12118409 9520855 11383964 11799852 12885447 10402906 10662352
1997 10662352 11066484 9913371 12264379 11794420 10475043 12296817 13238196 11262491 11079925
1988 11079925 11138223 13560014 12637614 13334042 11624559 13322744 11978244 12387259 14337485
1979 14337485 13013637 14765010 12150890 13968003 15201631 12160977 15177411 14924647
1971 14924647 13834430 14128339 14544841 13586866 16215458 14030605 16635955 17298580 16354119
1962 16354119 14912294 17157297 16610100 17086970 16484745 16807694 16560670 16256965 17502637
1953 17502637 18645126 19319150 19175694 18355432 19785256 20507652 21340582 21190966 20683192
1944 20683192 21758938 20893490 22459618 22021274 22000770 23896072 22457511 21055540 20639534
1935 20639534 22088008 18905238 19631772 17579358 16755965 18693656 16379616 18398639
1927 18398639 17158344 17480283 17394696 19202264 19533710 19929175 17047171 17162088 18213174
1918 18213174 18571353 18329815 18820560 21885062 19532576 19374698 19292128 19231444 22399548
1909 22399548 22102122 23918102 22518486 22810736 23828356 22650234 22508672 23420296 23611494
1900 23611494 23832054 23604702 23664710 21889422 22099948 22646720 22777362 20376684 20174778
1891 20174778 20723010 21370486 19799924 21531736 19563718 19079470 20264656 19339428 18440734
1882 18440734 20387316 19899137 19597022 17447872 20535462 19645474 18852060 21021900 19829138
1873 19829138 17911469 17298738 20431182 17932348 18979228 20306412 17698450 18917232
1865 18917232 19202812 18507118 19647186 20466494 18006844 17387040 16998871 18257281 15916135
1856 15916135 16196829 17902150 16251673 19539394 17759575 16294626 14722189 13284711
1848 13284711 12030841 13644979 15321308 13519128 13848627 16535445 16667248 12675048
1840 12675048 13317615 12031105 13615455 14273674 14172393 13800767 14015741 12533790 12814627
1831 12814627 14343731 12387212 11197442 12055687 9890688 11229265 11628593 13701492
1823 13701492 13352474 9899634 12903823 12447512 12796048 11299667 12231327 11769108 13574277
1814 13574277 10848674 12113191 11697254 11694558 12454302 11987473 12810084 12829771 13193871 13138753
1804 13138753 14839814 13801103 14526516 13665161 14169551 13922846 15233796 15171612 15262804
1795 15262804 16941434 15667540 17309684 17348702 17428702 16624136 17412651 17146862 17303800
1786 17303800 16431357 17107480 16757014 17940988 20258456 20412226 20461926 23192270 22500336
1777 22500336 21309340 22239342 24087226 22342084 24035970 24134716 24280008 24932131 25097908
1768 25097908 23179210 24514422 26368675 28060197 27820992 26748312 27997894 28999291
1760 28999291 30496736 30095213 31836615 34464342 33796505 37769397 38833973 39244581 42328761
1751 42328761 43214337 45213633 47768345 48620232 52734160 51591076 56873536 56795269 58721969
1742 58721969 60731924 60956121 62045584 63848076 63138772 65220668 67332492 68708980
1734 68708980 70885155 73602979 74884971 78776123 84285667 86927923 90981955 93566219
1726 93566219 97536683 103784706 109856522 118443274 129048137 137104632 150651960 166065752
1718 166065752 180099734 190737702 197637126 193598854 186201815 176352775 158964727 141920504
1710 141920504 118087713 96817474 76439867 62812288 50489433 42578277 40024933
1703 40024933 34851529 32352445 29225174 28880656 25557638 24611692 22096798 21559112 20381108
1694 20381108 18202974 19142520 21082932 18005224 16917918 17058653 16634955 16427882 15052499
1685 15052499 15407631 15732086 16109843 14971381 13595043 14833467 13513186 13614018 13846371
1676 13846371 13252999 12262046 13238213 10812872 13475935 11772306 10635489 11839832 12185205
1667 12185205 10907792 12764347 10646995 10673446 10758719 11648955 9860905 9208392 10298134
1658 10298134 7619352 9126765 6412840 7105841 7447456 7820766 7171888 8445990 8329650
1649 8329650 8458222 8312230 9453589 6614511 8025819 5009717 7637464 6162811 7974188
1640 7974188 6345996 6996575 6292822 5496676 4470662 7392122 7666257 5346467 6486837
1631 6486837 5377461 5133424 5349669 5972754 6545871 5103715 5942456 7046830 6344716
1622 6344716 7335503 6674329 6844000 6633009 5390120 5823263 8290927 6814968 6787418
1613 6787418 7792087 6798908 5709550 5875615 6062154 5994123 4678767 5402904 5788114
1604 5788114 5999838 6318371 6226910 6249767 6946592 6309306 6859011 6230585 6051939 5967073
1594 5967073 7133646 6471281 7279768 7885407 8572295 8825859 10670941 9837205 9584105
1585 9584105 10027258 9931432 11555985 9028012 10636922 10318502 11730960 9831268 11201851
1576 11201851 9370974 10569088 12885504 11223052 12273983 12199407 11891311 13890542 15481256
1567 15481256 17253624 19696218 21147658 22331746 21028734 20528754 17787910 18146590
1559 18146590 17399032 18635514 16190788 14036521 16268582 15924766 15469912 17400652 16520978
1550 16520978 17990192 16279809 15089721 15473557 18942838 17205591 18070617 15411640
1542 15411640 17038851 16944286 16957192 19132312 18872566 16474568 18518752 16782935 17480442
1533 17480442 21328574 22284786 22070250 23130770 25680062 26568110 28273529 25885204 24603150
1524 24603150 26927204 27035771 26492502 24108560 24955320 23922072 20215018 18387442 18795186
1515 18795186 16209727 17142974 18011536 19107716 15490589 17191066 17025073 16312085 19214474
1506 19214474 18141783 17103065 15793623 18489946 17893274 21163388 19555008 21355204
1498 21355204 21977034 25804218 24082650 24988298 23728898 21421106 24293238 21644640
1490 21644640 18586480 17108196 16790082 14792340 14467597 12353838 10716789 11063042 9204387
1481 9204387 9080499 7537927 7140538 7680142 7765750 6363672 6083453 7671511 7641225
1472 7641225 6704367 5636064 7611338 8336578 6265199 5295633 5811241 5416881 2736516
1463 2736516 4072879 2598165 4411793 5950617 5353927 4963705 4456591 4000996 4307319
1454 4307319 3000193 4868776 4338200 4214183 5054864 3799555 3929097 3364699 5040735
1445 5040735 4699868 4137028 4032431 3530962 3217647 2989295 3195197 1901693 4541629
1436 4541629 4742774 4337823 4067078 3534529 3688441 3737436 2390128 3548244 1860476
1427 1860476 1861320 3292670 1596963 1273665 1648132 3020058 3078925 1655612 3177776
1418 3177776 3893586 4018745 401230 4631796 2120846 4428846 2801272 3261278 2414093
1409 2414093 2259478 2376077 4406348 3250948 4701037 2609916 1136678 3771799 4692780
1400 4692780 1795020 3078891 3653616 2148598 1755047 1359325 2805198 4537459 2597258
1391 2597258 1860215 1719237 3587961 1621810 2805771 1765740 2982894 3287822 4111582
1382 4111582 3615067 2887625 2273853 3548641 3550695 1368934 3634595 326329 1546129
1373 1546129 441198 2395599 2073811 3001019 1903991 3370272 1581412 4491976 1572805
1363 1199381 -334752 2098929 1810914 2554461 1141522 2129169 3344828 2913646 4206112
1354 4206112 3087283 3265425 802540 3422709 1633555 2501515 3600105 1281783 1177991
1345 1177991 1760524 2396695 2391479 3105957 3245594 3707711 2678715 3871516 2790339
1336 2790339 516489 5352805 1912246 2431414 5150686 3923170 3407152 4662838 3121404
1327 3121404 4588906 5021891 3708898 5248587 6591709 5713890 5766601 6135394 4921241
1318 4921241 4887081 5817288 4372043 3052761 6415712 6750896 5419727 6955315 6297815
1309 6297815 7057145 7958336 7840139 7204759 8907765 9276288 5927488 7504677 3827182
1300 3827182 4192187 7055452 6374125 4397903 5838443 4921693 4577016 4205049 4231582
1291 4231582 4938202 7552195 6172339 4351977 4818856 7007093 5798498 6252596 7704739
1282 7704739 5639451 4884024 6680104 6418729 5916408 6090035 8168954 5040542 8063625
1273 8063625 7052140 8850088 6643544 6966840 6508988 7416876 6055751 9723753 7250514
1264 7250514 5213834 6392123 6005079 6937920 4876098 2769934 4920698 1965600 1975932
1255 1975932 3595032 3036008 1131363 1319942 2361056 1610786 1373047 2360400 4490820
1246 4490820 338735 2527938 1902908 1891415 1577541 4270282 2743983 -224911 3091030
1236 2989700 1373892 3328539 2809574 260877 49732 2456183 2896297 2503885 3743281
1227 3743281 1058495 930306 1356454 1412699 394033 1951142 48755 3005568 3137570
1218 3137570 1725199 1933241 2961482 3510461 729307 2083376 1294895 3544080 487600
1208 1002988 1778612 2034188 -528600 615140 -325139 2936302 696218 4100113 1038500
1198 1200109 1155919 874739 32314 681625 717944 811341 96453 2147748 1447715 2665070
1188 2665070 1158083 777999 1181897 2508844 1004546 1424344 1813419 641721 1895059
1179 1895059 925457 1808340 1720198 707753 476078 -1504556 610809 800317 1380678 -145550
1168 -678193 1176821 2079547 2843960 1503798 -1741693 -954047 3554840 2210457 2038408
1159 2038408 139872 -349725 1967541 452193 1468723 -373881 64447 1977719 2675972
1150 2675972 2832192 1414378 723540 1833519 1102492 3386594 1333519 2715452 2252942
1141 2252942 1359045 513410 2069451 2127812 2002135 2187171 832098 3526304 313942
1131 2203652 547369 2376934 1896842 1394326 161155 2402839 1540233 1344504 982085
1122 982085 3647832 2301669 648535 1650159 3705944 4169427 3246906 2826491 3606801
1113 3606801 5250826 4263622 2781847 3636504 4227477 1460151 3496898 4977162 4209475
1104 4209475 3009857 4835201 6062820 8007055 9295684 13303321 13532848 8247033
1096 8247033 9340148 9509211 11852905 11091012 10902770 12542325 17154135 18352792 19728848
1087 19728848 21900292 28447758 31527910 40786017 68306844 130510233 230121748 223316485
1079 223316485 100488115 40135086 21313400 15373655 11705490 9706375 7122965
1072 7122965 4187948 6147329 4822009 4676152 5674413 2550728 5036844 5707101 6962230
1063 6962230 8739262 10310170 4928939 5754279 3728162 5713963 2590141 3641767
1055 3641767 3514437 2757486 3204713 4470428 3163173 1953159 2319505 2199973 3497456
1046 3497456 2398082 1870318 2079577 1897485 2326958 1063454 2396050 3026768 588265
1036 478432 2162561 1308967 625511 767764 779753 -94941 2107436 1331456 767064 3011664
1026 3011664 2215752 1370876 805264 1493143 1153018 523213 1302597 1502646 879656 244458
1015 1830894 2942540 -186398 1582879 209942 3295381 2097490 171081 31299 814327
1006 814327 815218 1435555 1638941 932825 1973836 -198019 -57852 1265659 2235943 1799770
996 1799770 1794441 -810191 113738 882880 221826 875938 -1002695 -1442827 11353 709256
986 709256 1032884 25101 1626475 1559473 1970614 2231857 114570 2267451 226852 1578208
976 1578208 696271 756086 1664405 1107324 -1286374 376880 734255 -535041 992652 -1030345
965 922045 -961281 1353920 -988560 2437125 186676 -499897 462014 -3274029 579310
955 -290696 586589 -413712 3243128 444162 -2670129 76541 415186 380987 247928 -316771
944 633814 -499034 -342290 25708 208283 61037 727151 -1027605 322367 1528609 662683
933 -73203 -398880 -279199 415174 1162099 462476 -229419 -1309063 -195781 463218 -673389
922 585741 -476360 1492592 54256 439033 1245473 -427092 -63947 296040 2955420 1181703
911 611620 495470 977531 1752370 228324 -398540 199559 2280814 839103 1344425 2301553
901 2301553 120752 2062883 1266032 2089312 707503 2041293 1826989 2736438 375856
891 2196999 2621837 1026434 1176023 2315275 1006885 1743298 1013562 1873797 1206598
882 1206598 3265 1909976 1572233 1986914 2505183 3090278 2721786 3360375 981057 2092067
872 2092067 1191343 2966444 2972013 1907272 533640 3069688 2151780 1515298 1240805 2772759
862 2772759 2004248 2422383 3777380 1718234 1312789 4181664 4512709 4869198 4494045
853 4494045 1545033 2713634 241400 1459791 -784467 1178999 715575 239555 164637
844 164637 -1089387 1440421 696420 531527 762664 1126838 816598 -700493 544993 607032
834 607032 1623313 1332245 -280107 -162107 3549064 1684107 1525028 538684 -359633
824 1284612 996273 2851930 840818 1700359 914243 620470 29444 103162 1318782 1487294
814 1487294 1809435 782910 1763686 1209800 575726 748672 528007 639719 1107044 570867
804 570867 1157261 2373480 1292657 1921825 2328280 -58020 -497353 1905566 -566232 -158696
793 1364897 1091319 1042964 -715962 -1885971 2263999 402046 1356706 -1187389 -133743
783 -2262454 1625850 13564 -910644 -1511439 70104 -255281 1622091 -775329 740968 1244500
773 1244500 79156 1083742 1741880 2927123 -1421854 644222 81207 276227 1137208 -775354
762 1090397 -1275539 2434635 743266 1589757 270035 2759634 -74730 -1256576 2896356
752 535954 -97737 806194 -197545 -435639 1966990 -779879 1337222 164592 872971 1471870
742 1471870 -669404 19579 696822 1709702 1051822 991347 940863 16194 226972 1080034
732 1080034 -795862 -477748 1256750 -1829870 -317415 -219387 -2115549 530805 480075 -822189
721 372536 599496 1114609 1051206 2111001 518789 1255333 93008 -1051554 1478945 -207419
710 366625 549439 -415180 562740 104986 -133707 892442 437104 -1729583 1128897 -660595
699 877954 -615304 415509 529337 -731584 -252082 -322243 -1384741 1401249 -209480 1653420
688 -226000 -485740 651551 1549092 886432 -216623 1489779 -1591286 303047 1379440
679 1379440 813594 57412 2927022 1325622 799164 604319 -575506 332647 702583 -77628
668 361245 664424 1553036 -1633298 -408883 -1196870 405289 -201322 -1111272 2611996 1092175
657 -640406 -11249 164339 1000813 1935875 -759221 -526809 1000286 957887 803564 296212
646 1105524 -664091 1508186 -130609 980839 2574798 1831095 300268 1350839 2150924
637 2150924 1144205 1483628 1849333 4311480 3035253 5338506 4062044 3762304 3838085
628 3838085 3496120 1440088 1068896 539224 837939 -961808 -560560 1516560 -384604
618 1448401 -951537 -26007 -579946 -287227 346534 114188 936025 465833 1119143 -1353474
607 1303804 253731 -195561 -461739 -335554 1169799 -713830 395937 -955405 1378639
597 -630915 -70591 -73455 -315297 1041894 71750 -277029 -831205 -375512 1081227 514481
586 -58665 2387174 610900 -1207940 1047871 -1975386 222424 -5879 768676 422361 -1601442
575 -136113 -235103 -1754307 -980091 -1350258 -498720 -1624055 -124128 -2427887 2471424
565 81969 895480 1163265 584607 -136483 -366777 -485104 -839953 -749159 -406554 1662923
554 304067 -162684 -170122 604234 -476841 2524668 2076456 1279877 -275591 631508 -499924
543 -654185 143731 667078 -59940 -710395 897357 1393424 516139 -755060 121148 943483
533 943483 454958 424017 -1473844 2304824 -386017 -825716 1237161 -1064085 227062
523 -612295 491614 1596012 1449206 519705 255505 101159 -1230197 -1811130 688916 -1331395
512 44134 -845720 -738665 1119719 1544557 -1369362 -1430541 -869695 526395 -28729 -305592
502 -305592 1570537 1143155 -1261791 796138 1395818 355674 758554 -510196 906214 -216694
491 -134943 1401702 -696647 -575890 386399 -98848 -1282405 -336176 652712 323218 -3042372
480 -1105991 1776101 -319348 89335 75904 1421302 1460031 1087318 -1241484 -619360 359625
469 -1928135 1710908 1554622 -707561 -266194 1050098 788849 9385 -207572 929282 2831856
459 2831856 -1156874 268082 428109 -2070237 -899340 584606 -1737670 966732 1393182
450 1393182 1501555 2319379 -565067 1908695 -319304 -618094 471736 545967 490876 97653
439 -1594220 -8498 -670157 -704269 -922986 328124 -360762 -1729077 2474894 -757817 -2301752
429 -2301752 1073566 123242 -318912 75961 3093242 -758438 -280729 505505 547319 2158489
419 2158489 300226 -177439 1029472 -1351879 -1587704 -265828 -1594929 -448360 255906
409 -1010845 378848 290699 1764429 -1432691 173059 541535 -131556 -1446240 -60449 854501
398 -766580 255948 53280 768831 2415962 -551885 23208 -798930 779379 584899 -93388
387 1729918 -767114 1635919 1664312 362525 450790 1172742 -975009 -942332 1806519 683308
376 417086 576936 -596046 622513 -2291466 -798200 1512692 -1892612 160295 -2305 701930
365 -1810486 741638 -1074597 610116 -565768 -664230 -1897195 -542827 -1222050 542411 833664
355 833664 849222 1719023 -214366 572623 -388216 1388696 -636228 -1990061 338296 -2907137
344 1561730 -837014 -612226 1728011 -319697 -788590 -1049932 281506 -59913 1878153 -205227
333 815821 309830 128302 -219745 -28322 -455285 2083506 597761 -1086887 -1509514 -81733
322 1292049 -139750 -9840 178281 -835939 -163348 555564 -146385 -1725229 860588 1879343
312 1879343 -100919 -65678 475458 -1027615 -382330 -137207 900504 249443 -223619 892841
301 1172990 -909572 332796 -351673 -618387 -567506 1056086 -670658 546975 -444511 -510657
291 -510657 606200 -1022133 921225 1055929 -148535 -70453 -283872 -42316 335469 821554
281 821554 227859 253480 -1147914 -203552 -1151766 606179 1445273 916054 810177 -923316
270 966059 893759 -1820940 1180770 -2410509 -190341 938733 -101237 -1250461 646676
260 94692 -167221 -1180627 559864 -469008 345369 106569 3422202 219259 -1133928 -983701
250 -983701 565407 -838230 972827 410921 631972 937142 1081185 -554226 74589 110904
240 110904 -206491 931309 380410 1116613 -1326596 -996847 1247353 11671 -410561 756334
229 1544170 33688 1124923 -251746 -793570 -686990 1000054 1123079 -674952 1799158
219 -474733 882046 1204897 -22991 -2048851 -80356 -161721 -1715126 1644269 1751100 169348
208 187592 820957 93473 502422 765816 -1502664 -312054 751282 -224045 -729512 450230
197 -77879 -444588 1495400 -953880 -6859 -529964 -1084610 -770520 111165 1309172 -346343
186 -504816 127645 1473831 1463682 2289067 1619716 2015397 -1118424 2461922 -424371 220895
175 -901827 -562652 440060 1329611 -1024819 2084206 -480726 -210155 -759156 1384477
165 -580507 -399195 1910359 907517 208790 485954 663367 615121 826653 2025432 1491992
155 1491992 854353 -11027 -1148285 133632 -111601 -46398 -212449 436738 -1071399 -594111
145 -594111 1189263 -680339 214335 1506848 1509097 -504144 -568403 -577032 2059572 -2336256
134 1248404 -861793 945103 846800 1543058 -2475226 -27240 -474310 -159214 -15940 -97591
124 -97591 -876650 -512700 488298 -829615 239356 -48452 672516 2344366 -1292786 1017865
113 -116502 -1056403 3000528 483638 706327 1046087 587322 -1449026 -443686 -143840 1975145
102 -44476 1591188 -79593 1295045 1055625 -2013399 -1286822 1371737 -1052239 648847
92 -2090466 -592583 452987 381692 1071939 -1103765 -258051 153865 2408345 -2008181 536184
81 3166520 -596848 190253 1138656 569746 -1457183 -1740960 -3574797 -1177016 576093
71 644124 861901 -411408 -373078 -773335 1495280 944907 539452 -585207 561657 118081
60 -20060 1359485 371156 52400 239864 471344 -776835 94626 1569447 673921 421116
50 421116 1434185 -480276 584354 -648956 -3103816 1212219 -365277 -397208 886378 2351505
40 2351505 681742 2713099 -956906 -1243800 -1188768 990049 -517326 -1988338 -193393 152501
29 2136992 207417 1411425 -115895 1552761 -1003902 -146141 26536 -12339 -169999 -548386
19 -548386 1267878 -38955 1359759 404359 -1952297 -850509 1691558 -116172 1752621
9 -1091605 104603 388106 -176591 724075 -1040192 -370556 568820 1411394 -1472785
##END=
