##TITLE=141757
##JCAMPDX= 6.0         $$ Bruker NMR JCAMP-DX V2.0
##DATA TYPE= NMR SPECTRUM
##DATA CLASS= XYDATA
##ORIGIN= NUTS EXPORT
##OWNER= Administrator
$$ 1.72 TOPSPIN		Version 2.1
$$ 2016-02-23 12:23:41.761 -0800  Administrator@X
$$ Compression mode = diff/dup
##.OBSERVE FREQUENCY= 90.275459
##.ACQUISITION MODE= SIMULTANEOUS (DQD)
##.ACQUISITION SCHEME= undefined
##.AVERAGES= 16
##.DIGITISER RES= 22
##SPECTROMETER/DATA SYSTEM= 
##.PULSE SEQUENCE= zg30
##.SOLVENT NAME= None
##.SHIFT REFERENCE= INTERNAL, None, 1, 14.5348
##AUDIT TRAIL= $$ (NUMBER, WHEN, WHO, WHERE, PROCESS, VERSION, WHAT)
$$ ##TITLE= Audit trail, TOPSPIN		Version 2.1
$$ ##JCAMPDX= 5.01
$$ ##ORIGIN= Bruker BioSpin GmbH
$$ ##OWNER= Administrator
$$ $$ E:/data/jwist/nmr/1757/1/pdata/1/auditp.txt
$$ ##AUDIT TRAIL=  $$ (NUMBER, WHEN, WHO, WHERE, PROCESS, VERSION, WHAT)
(   1,<2016-02-23 09:37:53.027 -0800>,<Administrator>,<X>,<jcamp>,<TOPSPIN 2.1>,
      <fromjdx created from
       E:\data\jwist\nmr\uniandes\1757
       data hash MD5: 8K
       56 F9 A2 83 69 A2 E8 E7 B4 84 C5 8D 3B 64 DA B2>)
$$ ##END=
$$ 
$$ $$ hash MD5
$$ $$ AC AF CE 69 49 78 C7 8F 27 B9 68 66 36 90 45 CA
##$RELAX= 
$$ Bruker specific parameters
$$ --------------------------
##$DU= <E:>
##$EXPNO= 1
##$NAME= <141757>
##$PROCNO= 1
##$TYPE= <nmr>
##$USER= <jwist>
##$ACQT0= 0
##$AMP= (0..31)
100 100 100 100 100 100 100 100 100 100 100 100 100 100 100 100 100 100
100 100 100 100 100 100 100 100 100 100 100 100 100 100
##$ANAVPT= 1
##$AQSEQ= 0
##$AQ_mod= 3
##$AUNM= <au_zg>
##$AUTOPOS= <>
##$BF1= 90.275459
##$BF2= 400.02
##$BF3= 400.02
##$BF4= 400.02
##$BF5= 400.02
##$BF6= 400.02
##$BF7= 400.02
##$BF8= 400.02
##$BYTORDA= 0
##$CFDGTYP= 0
##$CFRGTYP= 0
##$CHEMSTR= <none>
##$CNST= (0..63)
1 1 145 1 1 1 1 1 1 1 1 1 1 1 1 1 1 1 1 1 1 1 1 1 1 1 1 1 1 1 1 1 1 1 1
1 1 1 1 1 1 1 1 1 1 1 1 1 1 1 1 1 1 1 1 1 1 1 1 1 1 1 1 1
##$CPDPRG= <>
##$CPDPRG1= <>
##$CPDPRG2= <>
##$CPDPRG3= <>
##$CPDPRG4= <mlev>
##$CPDPRG5= <mlev>
##$CPDPRG6= <mlev>
##$CPDPRG7= <mlev>
##$CPDPRG8= <mlev>
##$CPDPRGB= <>
##$CPDPRGT= <>
##$D= (0..63)
0 1 0 0 0 0 0 0 0 0 0 0 0 0 0 0 0 0 0 0 0 0 0 0 0 0 0 0 0 0 0 0 0 0 0 0
0 0 0 0 0 0 0 0 0 0 0 0 0 0 0 0 0 0 0 0 0 0 0 0 0 0 0 0
##$DATE= 0
##$DBL= (0..7)
120 120 120 120 120 120 120 120
##$DBP= (0..7)
150 150 150 150 150 150 150 150
##$DBP07= 0
##$DBPNAM0= <>
##$DBPNAM1= <>
##$DBPNAM2= <>
##$DBPNAM3= <>
##$DBPNAM4= <>
##$DBPNAM5= <>
##$DBPNAM6= <>
##$DBPNAM7= <>
##$DBPOAL= (0..7)
0.5 0.5 0.5 0.5 0.5 0.5 0.5 0.5
##$DBPOFFS= (0..7)
0 0 0 0 0 0 0 0
##$DE= 6.5
##$DECBNUC= <off>
##$DECIM= 2432
##$DECNUC= <off>
##$DECSTAT= 4
##$DIGMOD= 1
##$DIGTYP= 12
##$DL= (0..7)
0 120 120 120 120 120 120 120
##$DP= (0..7)
150 150 150 150 150 150 150 150
##$DP07= 0
##$DPNAME0= <>
##$DPNAME1= <>
##$DPNAME2= <>
##$DPNAME3= <>
##$DPNAME4= <>
##$DPNAME5= <>
##$DPNAME6= <>
##$DPNAME7= <>
##$DPOAL= (0..7)
0.5 0.5 0.5 0.5 0.5 0.5 0.5 0.5
##$DPOFFS= (0..7)
0 0 0 0 0 0 0 0
##$DQDMODE= 0
##$DR= 22
##$DS= 2
##$DSLIST= <SSSSSSSSSSSSSSS>
$$ [...]
##$SPOFFS= (0..31)
0 0 0 0 0 0 0 0 0 0 0 0 0 0 0 0 0 0 0 0 0 0 0 0 0 0 0 0 0 0 0 0
##$SUBNAM0= <"">
##$SUBNAM1= <"">
##$SUBNAM2= <"">
##$SUBNAM3= <"">
##$SUBNAM4= <"">
##$SUBNAM5= <"">
##$SUBNAM6= <"">
##$SUBNAM7= <"">
##$SUBNAM8= <"">
##$SUBNAM9= <"">
##$SW= 20.5580556627758
##$SWIBOX= (0..15)
0 0 3 4 0 0 0 0 0 0 0 0 0 0 0 0
##$SW_h= 8223.68421052631
##$SWfinal= 0
##$TD= 65536
##$TD0= 1
##$TE= 300
##$TE2= 300
##$TE3= 300
##$TEG= 300
##$TL= (0..7)
0 120 120 120 120 120 120 120
##$TP= (0..7)
150 150 150 150 150 150 150 150
##$TP07= 0
##$TPNAME0= <>
##$TPNAME1= <>
##$TPNAME2= <>
##$TPNAME3= <>
##$TPNAME4= <>
##$TPNAME5= <>
##$TPNAME6= <>
##$TPNAME7= <>
##$TPOAL= (0..7)
0.5 0.5 0.5 0.5 0.5 0.5 0.5 0.5
##$TPOFFS= (0..7)
0 0 0 0 0 0 0 0
##$TUNHIN= 0
##$TUNHOUT= 0
##$TUNXOUT= 0
##$USERA1= <user>
##$USERA2= <user>
##$USERA3= <user>
##$USERA4= <user>
##$USERA5= <user>
##$V9= 5
##$VALIST= <valist>
##$VCLIST= <CCCCCCCCCCCCCCC>
##$VD= 0
##$VDLIST= <DDDDDDDDDDDDDDD>
##$VPLIST= <PPPPPPPPPPPPPPP>
##$VTLIST= <TTTTTTTTTTTTTTT>
##$WBST= 1024
##$WBSW= 4
##$XGAIN= (0..3)
0 0 0 0
##$XL= 0
##$YL= 0
##$YMAX_a= 1850273024
##$YMIN_a= -3468099.584
##$ZGOPTNS= <>
##$ZL1= 120
##$ZL2= 120
##$ZL3= 120
##$ZL4= 120
##$ABSF1= 10
##$ABSF2= 0
##$ABSG= 5
##$ABSL= 3
##$ALPHA= 0
##$AQORDER= 0
##$ASSFAC= 0
##$ASSFACI= 0
##$ASSFACX= 0
##$ASSWID= 0
##$AUNMP= <proc_1d>
##$AXLEFT= 0
##$AXNAME= <>
##$AXNUC= <off>
##$AXRIGHT= 0
##$AXTYPE= 0
##$AXUNIT= <>
##$AZFE= 0.1
##$AZFW= 0.1
##$BCFW= 1
##$BC_mod= 2
##$BYTORDP= 0
##$COROFFS= 0
##$CY= 15
##$DATMOD= 1
##$DC= 2
##$DFILT= <>
##$DTYPP= 0
##$F1P= 0
##$F2P= 0
##$FCOR= 0.5
##$FTSIZE= 0
##$FT_mod= 4
##$GAMMA= 1
##$GB= 0
##$INTBC= 1
##$INTSCL= 1
##$ISEN= 128
##$LB= 0.3
##$LEV0= 0
##$LPBIN= 0
##$MAXI= 10000
##$MC2= 0
##$MEAN= 0
##$ME_mod= 0
##$MI= 0
##$NCOEF= 0
##$NC_proc= -10
##$NLEV= 6
##$NOISF1= 0
##$NOISF2= 0
##$NSP= 1
##$NTH_PI= 0
##$NZP= 0
##$OFFSET= 14.5348
##$PC= 1
##$PHC0= 0
##$PHC1= 0
##$PH_mod= 0
##$PKNL= yes
##$PPARMOD= 0
##$PPDIAG= 0
##$PPIPTYP= 0
##$PPMPNUM= 2147483647
##$PPRESOL= 1
##$PSCAL= 4
##$PSIGN= 0
##$PYNMP= <proc.py>
##$REVERSE= no
##$SF= 90.2741468837125
##$SI= 8192
##$SIGF1= 0
##$SIGF2= 0
##$SINO= 400
##$SIOLD= 32768
##$SPECTYP= <>
##$SREGLST= <1H.CDCl3>
##$SSB= 0
##$STSI= 0
##$STSR= 0
##$SW_p= 1497.18866228788
##$SYMM= 0
##$S_DEV= 0
##$TDeff= 0
##$TDoff= 0
##$TI= <>
##$TILT= no
##$TM1= 0
##$TM2= 0
##$TOPLEV= 0
##$USERP1= <user>
##$USERP2= <user>
##$USERP3= <user>
##$USERP4= <user>
##$USERP5= <user>
##$WDW= 1
##$XDIM= 8192
##$YMAX_p= 1850272935
##$YMIN_p= -3468098
##$CURPLOT= <PDFCreator>
##$CURPRIN= <$PDFCreator>
##$DFORMAT= <normdp>
##$LAYOUT= <+/1D_H.xwp>
##$LFORMAT= <normlp>
##$PFORMAT= <normpl>
##$SURQMSG= 1
$$ End of Bruker specific parameters
$$ ---------------------------------
##XUNITS= HZ
##YUNITS= ARBITRARY UNITS
##XFACTOR= 0.182762287876938
##YFACTOR= 1
##DELTAX= -0.182762287876938
##NPOINTS= 8192
##FIRSTX= 1497.0059
##FIRSTY= -3171453
##LASTX= 0
##MAXY= 1850272935
##MINY= -3468098
##XYDATA= (X++(Y..Y))
$$ plain form
8191 -3171453 735033 -626750 2474770 -360620 -1190962 194604 495147 438668 -592756 -346736
8181 -346736 1096205 -213158 3477828 -2160689 -230189 613599 -111295 -860234 -2570546
8172 -2570546 1657472 829393 747245 491744 -1801395 2093982 1148871 367678 -1649675
8162 243006 -661041 -2400440 372319 423383 -819154 941152 -1305890 -126468 880323 1965710
8152 1965710 -1642523 -355226 1074105 -1114650 430470 -574697 -222319 154349 1536088
8143 1536088 319614 -875759 969353 -462457 276453 -236908 -1254871 -597888 381560
8133 771683 1964510 -1269525 -1279935 157910 -1220175 435807 -602247 1665062 -1257504
8123 3296988 407751 -541465 -1139449 -1085888 -629549 -448756 -880418 2026286 -483569 -1517587
$$ packed form
8191c171453G35033f26750B474770c60620q30342A94604L00543n6479e92756K46020
8181c46736A096205b13158C477828b160689b30189F13599a11295p48939j710312
8172b570546A657472q28079q2148k55501a801395B093982r45111C67678a649675
8162B43006f61041j739399C72319N1064h19154I41152a305890a26468H80323J085387
8152A965710a642523c55226A074105a114650D30470e74697b22319A54349J381739
8143A536088C19614h75759I69353d62457B76453b36908j017963e97888C81560
8133G71683J192827a269525j0410A57910a220175D35807f02247A665062a257504
8123C296988D07751e41465n97984N3561M56339J80793m31662B026286d83569j034018
$$ plain form
8113 -1517587 1094923 -1733638 -367654 445212 -410926 -201250 -1401374 -976212 28450
8103 2200899 -309143 -815417 -499984 198182 458171 1350766 1350541 -1043691 -1420035 -2197688
8093 -2197688 313850 -961851 1957136 -442691 -247270 221563 -763074 29301 121984 275815
8083 275815 -980017 -485981 -970821 -1417630 -428604 121566 -26800 -786318 -129941 -200628
8073 -200628 69831 834617 1443489 -418921 1088345 771737 -874094 587302 1413594 -449908
8062 -580330 -1387278 -259387 1901990 -295235 468443 -464956 -468004 -402198 -569911 65155
8051 73788 -471694 511604 -211148 -225733 -366626 -30309 -519458 -1564165 1746106 -700189
8040 -982670 -432053 1184588 -237353 948445 -2456380 816907 891243 865429 1345708 -1317614
$$ packed form
8113a517587A094923a733638c67654D45212d10926b01250j200124M25162B8450
8103B200899c09143n06274L15433A98182K59989Q92595k25a043691l76344p77653
8093b197688C13850i61851A957136d42691J95421B21563g63074B9301R2683J53831
8083B75815i80017d85981m84840m46809d28604A21566b6800p59518a29941p0687
8073b00628F9831P64786O08872d18921A088345l16608h74094E87302Q26292d49908
8062e80330q06948b59387A901990b95235D68443d64956l048O5806j67713F5155
8051G3788d71694E11604b11148j4585j40893c0309m89149j044707A746106g00189
8040i82670d32053A184588b37353I48445b456380H16907P4336k5814M80279a317614
$$ plain form
8029 355184 -170327 838626 969126 -303583 881982 754096 -1358871 -757116 -925933 -944902
8019 -944902 -17300 -1339335 -1603554 -518088 210351 -1737394 719979 316185 -1015144
8009 -366917 821023 1132877 535743 344757 -2179555 534895 -441981 716151 557086 -914527
7998 1103694 -237126 349368 -1515110 1019899 -96366 803076 -426240 1120745 136058
7988 -253187 -440115 119676 112252 1929997 -431352 -1389429 -121 611806 440711 -580468
7977 -2939600 1511868 -925469 580219 -831464 -188079 131728 -1486376 -275026 -874677
7968 -874677 -355734 1025498 -1164413 -3188671 -519723 1203589 278090 399209 632333
7959 632333 -58954 -808459 1167253 -110222 1983367 2166338 -375173 -1155170 -1042134 -1427252
$$ packed form
8029C55184a70327H38626J30500c03583H81982j27886a358871O01755j68817j8969
8019i44902a7300j322035k64219e18088B10351a737394G19979C16185a015144
8009c66917H21023L11854E35743j90986b179555E34895d41981G16151j59065i14527
7998A103694b37126C49368a515110A019899i6366H03076d26240A120745A36058
7988b53187j86928A19676p424J817745d31352r58077a21F11806j71095e80468
7977b939600A511868i25469E80219h31464a88079A31728a486376b75026n99651
7968h74677c55734A025498a164413k024258e19723A203589B78090J21119K33124
7959F32333e8954p49505A167253a10222A983367J82971c75173p79997J13036l85118
$$ plain form
7949 -1427252 99636 -933945 287144 1021000 -753775 880933 -1406038 -894202 1013688
7939 -928415 -932858 -320301 383215 499330 -1709223 -1118620 221545 76324 1058045 365547
7928 1012035 -409102 -1695361 1548460 86624 501242 -100664 353946 -1671972 1611427
7918 -123908 -199644 -282829 -1721378 299202 -219095 -501872 -13749 -587799 -1225056 221241
7907 -421468 1212827 -1432943 66035 -797911 1117908 -394478 -1077141 -2579 -251198 -1798929
7897 -1798929 -108744 -41880 -207380 -193185 -651970 -347960 -1485468 503749 486478 -1127149
7886 670915 -1096371 -414305 -1664129 231884 1464712 -1058761 1067806 -235097 -117388
7876 -344994 1279365 -1127737 -1895556 964840 833281 -27676 4764 347811 2558739 892773
$$ packed form
7949a427252I9636i33945B87144P33856g53775H80933a406038N11836A013688
7939i28415m443c20301C83215J16115a709223N90603B21545G6324R81721C65547
7928A012035d09102j286259A548460H6624M14618a00664C53946a671972A611427
7918a23908p5736q3185j438549B99202b19095k82777a3749n74050o37257B21241
7907d21468A212827a432943F6035g97911A117908c94478o82663b579k48619j547731
7897a798929a08744d1880j65500J4195m58785L04010j137508E03749j7271a127149
7886F70915a096371d14305j249824B31884J232828a058761A067806b35097a17388
7876c44994A279365a127737p67819I64840j31559b7676D764L43047K210928H92773
$$ plain form
7865 -1141915 1309533 187883 -1444915 -642822 -1033616 -147940 -883902 -401405 -774089
7856 -774089 1006204 -1242357 487724 146301 347544 -1974776 -1064053 791194 -848781
7846 297937 1521458 -254413 -692806 -1787104 230063 1193707 1839015 -631495 76658 -1470566
7835 1601376 -105470 514995 1031661 -156562 -1959331 -211042 -217070 -712455 1218382 1310282
7825 1310282 737443 254425 -152033 1546240 423278 -197470 26747 -477393 886410 -387718
7814 -61335 -921763 1116420 440792 -1776828 -1854765 -353856 -985186 1616168 -728237 5718
7803 -503884 -146232 221118 864403 405646 -137854 1904958 24358 -232962 321367 -157849
7792 1285692 -345584 908903 948256 -880632 42293 1806569 483952 -1792504 660578 -1687022
$$ packed form
7865a141915A309533A87883a444915f42822l90794a47940p35962d01405l72684
7856g74089A006204a242357D87724A46301K01243a974776R10723G91194h48781
7846B97937J223521b54413m38393j094298B30063R63644O45308f31495G6658a470566
7835A601376a05470E14995N16666a56562j802769b11042o028m95385A218382R1900
7825A310282n72839B54425a52033A546240D23278a97470B6747d77393H86410c87718
7814f1335q60428A116420D40792a776828p7937c53856o31330A616168g28237E718
7803e03884a46232B21118O43285D05646a37854A904958B4358b32962C21367a57849
7792A285692c45584I08903L9353h80632D2293J764276D83952a792504F60578a687022
$$ plain form
7781 -385253 -1057471 -442597 -891802 -106760 -417633 -1633580 718577 535363 -1062042
7771 -192749 646596 1206348 94886 936120 99620 -762335 -1390516 -433700 868927 -1514334
7760 511339 -470360 379683 -903343 -25042 -2171624 1326690 1013988 972942 -1205106 495588
7749 955781 1531879 -964096 -576376 1052863 602554 -821789 -935156 -23563 -88546 -915776
7739 -915776 -1198456 -217778 594984 -1483330 -1285440 -1079885 151277 -1733557 -487156
7729 184150 -1064195 480100 500789 -1018424 -949017 -1451390 -655080 132637 -1233130 65635
7718 22059 -438132 1426855 152999 562189 183117 -1667110 -502180 -2153796 122707
7708 -1087032 -3468098 781490 1833536 -371518 -1190469 1135345 -652899 -954234 971703
$$ packed form
7781c85253o72218d42597m49205a06760l10873j215947G18577j83214a062042
7771a92749F46596N59752I4886Q41234I9620g62335o28181d33700H68927a514334
7760E11339d70360C79683i03343b5042k146582A326690l12702m1046a205106D95588
7749I55781N76098i64096L87720A052863m50309h21789j13367b3563o4983q27230
7739i15776k82680b17778E94984a483330J97890K05555A51277a733557d87156
7729A84150a064195D80100K0689a018424O9407n02373f55080A32637a233130F5635
7718B2059d38132A426855A52999M09190A83117a667110e02180j651616A22707
7708a087032k381066G81490J052046c71518q18951A135345f52899l01335I71703
$$ plain form
7698 -474865 671656 763034 -777978 126173 -519262 -25769 -752849 628733 464164 192344
7687 -381453 1364962 -2531680 905277 942075 -1477021 -158507 -1136795 -1415905 773579
7677 407802 1142872 135450 -1433942 -907924 1334446 -1206775 -1867 -1232973 1097804
7667 1345297 -1857270 -1689270 316692 -329745 1368207 -255803 18700 739121 -313199
7657 -839288 988691 1985809 358540 411356 -672606 1138011 157836 -505893 -50185 961892
7646 -548539 -457015 678075 411532 -1111645 1176707 238389 921467 -300581 -1445876
7637 -1445876 1102460 718869 638970 245834 700855 1626963 -550901 1323980 594076
7627 -313687 1095219 1540581 654035 234694 -238254 -1594993 -767374 -989576 -1015001 876396
$$ packed form
7698d74865F71656R1378g77978A26173e19262b5769p27080F28733j64569A92344
7687c81453A364962b531680I05277L6798a477021a58507r78288k79110G73579
7677D07802P35070A35450a433942N26018A334446a206775a867j231106A097804
7667A345297a857270J68000C16692c29745A368207b55803A8700P20421c13199
7657h39288I88691R97118C58540N2816f72606A138011A57836e05893e0185I61892
7646e48539R1524F78075k66543a111645A176707B38389O83078c00581j145295
7637a445876A102460l83591p9899B45834M55021R26108e50901A323980E94076
7627c13687A095219M45362F54035B34694b38254j356739g67374k22202k5425H76396
$$ plain form
7616 -48400 -3413941 398247 227936 -189280 1767149 559436 6720 -724342 -1001134 -352666
7605 473283 1912679 -1359233 699720 505775 -134062 -96218 -393969 -491141 -1086520 716565
7594 -356454 -1037910 -166785 1714692 116391 1120150 -1411813 775818 -660576 -450865
7585 -450865 288284 144758 -410388 59256 -1767697 1190588 65073 427966 -1521452 -876118
7575 -876118 646071 68797 2276105 2010476 410790 -255842 332932 817585 604840 -735323
7564 939192 -906986 -2599771 151417 -1625833 -37844 -1681401 -979713 581910 -755798
7554 1261460 1621967 544731 661982 1020617 57762 -65069 387517 -480932 755864 626099
7544 626099 24603 -435379 -94670 -139893 -528964 1893659 734401 1933168 -616990 204162
$$ packed form
7616d8400l365541C98247j70311a89280A767149E59436F720g24342k76792c52666
7605D73283J439396a359233F99720j93945a34062L7844k97751r7172n95379G16565
7594c56454o81456a66785A714692A16391J003759a411813G75818f60576K09711
7585d50865B88284j43526d10388E9256a767697A190588F5073L62893a521452O45334
7575h76118F46071F8797K207308k65629D10790b55842C32932M84653k12745g35323
7564I39192i06986j692785A51417a625833c7844j643557P01688E81910g55798
7554A261460L60507E44731J17251L58635E7762f5069C87517d80932G55864j29765
7544F26099B4603d35379i4670m5223l89071A893659G34401J198767f16990B04162
$$ plain form
7533 -429411 840471 1195612 -612347 -323326 1204410 -133070 537699 -3106521 -941356
7523 493623 40822 292840 -595375 -1892329 -792314 1244662 394855 650537 1816219
7514 1816219 768560 -1560875 2117675 -564507 -2006519 1025714 1292021 941887 600057
7505 600057 -276907 -478597 279650 1092055 1615566 505739 -271063 769364 -1103013 -489246
7494 2416344 954525 1091367 774329 353412 765611 518578 -597220 -460376 -666179 -142606
7483 77820 430402 -1109621 -1247241 -293553 568484 430313 -628128 -1831604 1706481
7473 -1123972 -665018 -709099 1105990 -452233 420110 130688 1777807 -801101 -1251428
7464 -1251428 82235 -1489239 954715 -415606 1395215 172738 1304616 57591 -2450323
$$ packed form
7533d29411H40471L55141f12347K89021A204410a33070E37699c106521i41356
7523D93623D0822K52018e95375j296954g92314A244662C94855K55682J165682
7514A816219G68560a560875B117675e64507j442012A025714K66307l50134l41830
7505F00057b76907k01690B79650Q12405N23511E05739b71063G69364a103013d89246
7494B416344I54525J36842l17038C53412M12199k47033e97220J36844k05803a42606
7483G7820L52582a109621j37620b93553E68484j38171f28128j203476A706481
7473a123972M58954m4081A105990d52233D20110A30688J647119h01101m50327
7464a251428H2235a489239I54715d15606A395215A72738J131878E7591b450323
$$ plain form
7454 1565041 -862118 -624423 1301963 1127134 394535 -617195 -1958842 1020453 -146165
7444 -1086647 509595 252098 -291863 1274492 2886117 206811 -1991613 -179135 80917
7434 -1482684 106770 2008041 -550779 2037157 1576464 -597457 349578 1053532 -602628
7424 790173 910556 -1352107 346668 504269 -775975 -99542 517936 859943 -828080 -197798
7413 -286752 -342695 322877 -815396 -1197546 229136 -1519931 -221146 1003858 2035037
7404 2035037 1843313 1001608 2810003 -228310 -346591 695779 351845 1925579 1619235
7395 1619235 -617653 -1766999 -807347 941316 2055858 -304122 -729731 -404563 -345490
7386 -345490 3011145 1450948 -813455 54384 1102341 -319837 -2535271 801249 1665298
$$ packed form
7454A565041h62118K37695A301963j74829C94535f17195j341647A020453a46165
7444a086647E09595B52098b91863A274492J611625B06811a991613a79135H0917
7434a482684A06770J901271e50779B037157m60693e97457C49578P03954f02628
7424G90173J20383a352107C46668J57601g75975i9542E17936L42007h28080a97798
7413b86752n5943C22877h15396l82150B29136a519931b21146A003858J031179
7404B035037j91724q41705J808395b28310j18281F95779l43934J573734l06344
7395A619235f17653j149346h07347I41316J114542c04122m25609L25168N9073
7386c45490C011145A450948h13455E4384J047957c19837k215434H01249Q64049
$$ plain form
7377 1665298 704173 329646 -1291232 -485331 119221 -2475638 1647997 -1466369 665999
7367 -488951 -1988151 -946551 -1530415 -1583467 495247 724577 -1375498 1693514 638262
7357 1158348 21006 -266376 36656 -206871 -280125 -1101080 1766100 -899077 90243 -332944
7346 -1837118 2305468 874320 1076188 -1769075 3052564 1139735 710688 503412 864490
7337 864490 -469125 229794 -296474 199553 364921 -851051 -290069 975820 1854727 920861
7326 -2320119 1209886 315322 -224083 573716 232344 -1433334 -572464 -750223 -73895
7316 814254 687467 -1321390 425448 -119441 577070 -996219 390955 -1115799 274705
7306 114718 437207 1145192 -1328576 -1519717 264101 -343011 -167925 436948 836110 1398165
$$ packed form
7377A665298G04173C29646a291232d85331A19221b475638A647997a466369F65999
7367d88951j499200i46551n83864n3052D95247K29330a375498A693514F38262
7357A158348B1006b66376C6656b06871p3254q20955A766100h99077I0243c32944
7346a837118B305468H74320K01868a769075C052564A139735m29047k07276L61078
7337H64490d69125B29794b96474A99553J65368h51051b90069I75820Q78907I20861
7326b320119A209886C15322b24083E73716B32344a433334e72464j77759g3895
7316H14254j26787a321390D25448a19441E77070i96219C90955a115799B74705
7306A14718L22489P07985a328576j91141B64101c43011a67925D36948L99162N62055
$$ plain form
7296 1398165 -2687175 -426522 645161 805688 -202873 249408 -1067801 -2292147 -1758035
7287 -1758035 1594707 1023597 874832 1539574 -345746 -423301 490089 351514 -566131 -581171
7277 -581171 -561102 332750 -470905 376162 269702 -3272591 -2038127 1172865 302192
7267 -78589 -674355 1808591 -1266805 -779311 -878101 581268 -944893 -2846708 -1081068
7257 630310 -595606 -1312195 -40180 194876 -372442 1028890 -499304 1146527 912734 -22473
7246 -836555 435965 -1789840 -400453 -1691282 -1605768 1315659 1673834 -785172 1895784
7236 1559733 857864 -1127668 561128 -1387705 1310861 942750 -648820 233332 1126594
7227 1126594 308526 -236843 -321775 -787135 105654 -457829 987512 1210576 164398 141179
$$ packed form
7296A398165b687175d26522F45161J60527b02873B49408a067801j224346N34112
7287a758035A594707n71110j48765O64742c45746p7555D90089j38575e66131j5040
7277e81171K0069C32750d70905C76162j06460c272591J234464A172865C02192
7267g8589n95766A808591a266805M87494r8790E81268i44893j901815a081068
7257F30310e95606p16589d0180A94876c72442A028890d99304A146527k33793b2473
7246h36555D35965a789840d00453j290829Q5514A315659L58175g85172A895784
7236A559733p01869a127668E61128a387705A310861l68111f48820B33332Q93262
7227A126594C08526b36843q4932m65360A05654d57829I87512K23064A64398k3219
$$ plain form
7217 141179 1360702 -1888512 557377 906241 -885943 874625 -847739 510995 18099 1320674
7207 1320674 -1266982 -208162 -911766 -339578 -1422447 -234593 -469256 -255704 1775958
7197 -712229 -1490565 -491350 -1427937 1177719 -2430583 1953273 69712 -1953758 55273
7187 285375 1161952 -1127303 -160809 909529 730818 485929 -384312 353340 -644908 -331298
7177 -331298 -1864599 -158300 915357 -339695 1168467 -1455492 -1639667 1622863 -826182
7167 644925 621895 -1183971 -390027 495751 -2362200 75079 812578 1717393 510865 981689
7157 981689 -206533 1018175 -1435527 -1048408 -1085087 932399 674824 1115125 -55456 -931970
7147 -931970 -603727 1435804 499215 1090045 -94597 1442149 2065233 1491107 -395857 -1084773
$$ packed form
7217A41179J219523a888512E57377L48864h85943H74625h47739E10995A8099J302575
7207A320674a266982b08162p03604c39578j082869b34593k34663K13552A775958
7197g12229p78336d91350r36587A177719b430583A953273F9712a953758E5273
7187B85375Q76577a127303a60809I09529j78711k44889c84312C53340f44908L13610
7177c31298j533301a58300I15357c39695A168467a455492j84175A622863h26182
7167F44925k3030a183971c90027D95751b362200G5079P37499R04815E10865M70824
7157I81689b06533A018175a435527L87119l6679I32399k57575M40301e5456q76514
7147i31970L28243A435804D99215N90830i4597A442149O23084n74126c95857o88916
$$ plain form
7137 -1084773 828474 -1850368 1449322 1936834 556327 506107 1808239 20075 -857178
7127 -2732728 992094 58110 1154388 895235 -848918 578843 1054874 -353203 -45012 1275928
7116 -852496 734627 451098 -322855 1542160 322941 -579466 -159229 -796268 -583778 182926
7105 1105802 234949 -218940 652041 711232 -528923 709496 -61245 -1369390 1340228 -374833
7094 -774280 788100 394571 -896961 -51822 -1771274 -77715 275933 714412 -156442 -243284
7084 -243284 -1795491 -793692 958336 2676989 411708 -2167815 -994424 -72850 1828853
7074 -934362 1234382 -137054 -844698 -902347 -763832 1672842 169483 -212990 2114909
7064 2762609 2109374 -86722 1299932 2477634 -1089213 1140269 2115644 -938729 -1741663
$$ packed form
7137a084773H28474a850368A449322M87512E56327n0220J302132B0075h57178
7127b732728I92094E8110J096278k59153h48918E78843M76031c53203d5012A275928
7116h52496G34627k83529c22855A542160C22941e79466a59229o37039K12490A82926
7105A105802B34949b18940F52041N9191e28923G09496f1245j308145A340228c74833
7094g74280G88100l93529h96961e1822j719452g7715B75933M38479a56442q6842
7084b43284j552207g93692I58336J718653D11708b167815i94424g2850A828853
7074i34362A234382a37054p07644n7649J38515A672842A69483b12990B114909
7064B762609o53235h6722A299932J177702a089213A140269R75375i38729q02934
$$ plain form
7055 -1741663 2887922 316672 1213548 -9630 854068 1496627 -821480 345289 756870 -1296996
7044 1931630 2790581 -85530 32391 -517321 -1469024 674266 -2183644 -222999 2002949 1192072
7034 1192072 913508 2012496 -486214 -1076815 121894 -1614148 -244073 457320 -243317
7024 -1840950 129326 1578871 -63240 279654 -380258 -671360 -336917 809556 2077373
7015 2077373 -252164 401047 706082 -999535 -717456 -1038313 -161277 -775013 376946 -1955916
7004 244172 1226843 -446859 1855462 -538611 -715048 704835 -480905 1949936 778604
6994 910501 -606014 1048686 -654468 491103 -814219 -2368303 489196 486746 -381115 1197268
6983 -558688 826671 -1004266 -721310 -1513170 119249 -947585 -33545 878453 108527 801173
$$ packed form
7055a741663B887922C16672Q96876i630H54068O42559h21480C45289M11581a296996
7044A931630Q58951h5530C2391e17321r51703F74266b183644b22999B002949q10877
7034A192072k78564J098988d86214n90601A21894a614148b44073D57320b43317
7024a840950A29326J449545f3240B79654c80258k91102L34443H09556J267817
7015B077373b52164D01047L05035i99535K82079l20857a61277o13736C76946a955916
7004B44172R82671d46859A855462e38611j76437G04835d80905A949936G78604
6994I10501f06014A048686f54468D91103h14219j554084D89196k450c81115A197268
6983e58688H26671a004266K82956p91860A19249i47585c3545H78453A08527O92646
$$ plain form
6973 801173 -507669 861238 666462 498862 1388902 859842 -1788818 -711118 432600 -812969
6962 1914218 29912 1179945 -2411991 1783860 -766351 1508330 1431221 167127 -211301
6952 1083089 -454019 1125690 350585 -1295040 51969 1581242 621017 325311 648699
6943 648699 2505201 -1065344 -394139 2264109 946593 -92073 290472 -50588 1333127
6933 -939855 -1080258 1134325 -1650084 -728083 1464638 609007 82998 -670013 581036
6923 960696 -408700 1320894 -1099041 -1041441 688302 -344855 -337255 -440328 187670 -716641
6912 121680 -233849 -551961 -1101454 2876193 885924 -545010 808691 2275575 1880678
6903 1880678 1617788 -243663 1568508 -2147543 -162750 461292 230790 1676035 3168805
$$ packed form
6973H01173e07669H61238j94776j67600Q90040n29060a788818g11118D32600h12969
6962A914218B9912J150033b411991A783860g66351A508330p7109A67127b11301
6952A083089d54019A125690C50585a295040E1969J529273F21017k95706L23388
6943F48699J856502a065344c94139B264109I46593i2073B90472e0588A333127
6933i39855j40403A134325a650084g28083A464638F09007H2998f70013E81036
6923I60696d08700A320894a099041N7600F88302c44855P600j03073A87670g16641
6912A21680b33849l18112n49493B876193H85924e45010H08691J466884l94897
6903A880678k62890b43663A568508b147543a62750D61292k30502J445245J492770
$$ plain form
6894 3168805 -248196 -427362 2289424 555846 -237405 -903500 1423046 2635781 981364
6884 -649889 -2736547 -185353 -803904 1635468 61028 -1910707 1227151 1806838 -160466
6874 -881607 1733262 -1978647 -496442 619325 810466 -362241 140344 522451 -596610
6864 721155 1860228 883086 680982 1547969 355227 718748 -733821 -752544 308779 -600276
6853 -587290 475489 -479521 -1099484 -217117 -1338658 -3270486 794718 688963 617924 454960
6843 454960 165569 -837221 1075650 -328809 815494 343530 390098 -119589 -376900 -455249
6833 -455249 305770 259377 -242281 172995 1290124 1625963 -149272 -325141 270925 -320334
6822 551605 -521870 -939490 -1707788 215137 1172035 -313870 991712 2393935 1238108
$$ packed form
6894C168805b48196j79166B289424E55846b37405o66095A423046J212735I81364
6884f49889k086658a85353o18551A635468F1028a910707A227151N79687a60466
6874h81607A733262a978647d96442F19325J91141c62241A40344L82107e96610
6864G21155J139073H83086k02104Q66987C55227L63521g33821j8723C08779f00276
6853e87290D75489d79521o19963b17117j121541j931828G94718j05755p1039j62964
6843D54960A65569h37221A075650c28809H15494C43530M6568a19589k57311p8349
6833d55249C05770m6393b42281A72995J117129L35839a49272j75869B70925c20334
6822E51605e21870m17620p68298B15137R56898c13870I91712J402223j155827
$$ plain form
6813 1238108 1112792 868409 -1514638 1483401 1234766 1344475 1324500 -549297 1364818
6803 632255 1480113 -2762416 -622569 -674171 1521937 444589 2102445 68957 -2364380
6793 2741387 2061392 -1029983 866467 -166157 464515 654087 1044904 583360 656245 665670
6783 665670 254604 1871553 -845319 -625817 56706 180711 -279760 619027 576570 -811554
6772 -964334 -309106 -35584 243668 -1069616 -784956 1707282 2067018 -45279 1129862 1510048
6762 1510048 296781 1092241 -1132940 -567504 -694739 -1468200 -16736 421292 -1680312
6752 364707 803505 1818205 -710675 682161 -222639 1769403 -463205 636323 -1775644
6742 163123 1006187 1712831 -908691 117465 1331133 1969915 1638656 221271 -2370359
$$ packed form
6813A238108j25316k44383a514638A483401k48635J09709j9975e49297A364818
6803F32255Q47858b762416f22569n1602A521937D44589J657856F8957b364380
6793B741387o79995a029983H66467a66157D64515J89572L90817m61544P2885R425
6783F65670B54604J616949h45319K19502E6706J24005b79760F19027m2457h11554
6772i64334c09106c5584B43668a069616K84660A707282L59736d5279A129862L80186
6762A510048B96781P95460a132940N65436j27235p73461a6736D21292a680312
6752C64707M38798J014700g10675F82161b22639A769403d63205F36323a775644
6742A63123Q43064P06644i08691A17465J213668O38782l31259B21271b370359
$$ plain form
6732 219295 281722 809554 -660297 1786780 -707188 -1730616 -689544 -805827 1178737
6722 1865 -742239 -1565417 2329297 1638913 -1460748 2673674 349350 1018315 98338 1818871
6712 1818871 -22823 -323184 -985957 785514 -416259 696276 28386 481057 -2892637 1234562
6701 619402 559566 -360033 -327110 36584 792855 1960719 725904 -795846 -1055411 842788
6690 2557651 349606 555530 -131740 1677271 -916964 1166822 647393 -1161294 1574951
6680 -122713 336292 -348341 -1795515 1043692 23023 357888 578108 -241018 -354062 -373310
6670 -373310 642052 -164317 -842207 -277257 808863 184825 -73571 725008 331592 33517
6659 622625 212733 857368 -216117 885037 -1193707 -1989506 -299614 988866 -1779597
$$ packed form
6732B19295O2427N27832f60297A786780g07188j023428f89544j16283A178737
6722A865g42239q23178B329297o90384a460748B673674C49350O68965I8338J720533
6712A818871b2823l00361o62773G85514d16259F96276B8386M52671b892637A234562
6701F19402n9836c60033L2923C6584P56271J167864G25904g95846k59565H42788
6690B557651C49606K05924a31740A677271i16964A166822n19429a161294A574951
6680a22713C36292c48341j447174A043692B3023L34865K20220b41018j13044j9248
6670c73310F42052a64317o77890b77257H08863A84825g3571G25008C31592C3517
6659F22625B12733O44635b16117H85037a193707p95799b99614I88866a779597
$$ plain form
6649 -668919 3014 -1792047 895173 -2075124 535299 -173310 2337414 1852689 1573653 -350181
6638 345 72689 -95672 882832 -1034372 152610 -1089303 -650322 2606573 2307984 -1107463
6627 199129 -845224 -1080504 -379179 1489497 -891750 -312787 -1044045 1144768 410984
6617 423704 1399369 -453295 -327650 -813904 766767 -392840 -110962 684056 494580 688376
6607 688376 -730416 337583 449937 155698 7596 -3107582 -202265 463081 -220594 1202068
6596 -494608 1462135 -845845 714577 133212 905951 -1163286 -898117 1503853 397727
6586 3546260 529065 1750757 1986665 -281820 722894 -509028 297627 768775 -928926
6576 990027 -103361 423739 886392 627522 -738240 148930 1177191 292023 926042 1416448
$$ packed form
6649f68919C014a792047H95173b075124E35299a73310B337414m84725k79036c50181
6638C45P2344i5672H82832a034372A52610a089303M38981B606573k98589a107463
6627A99129h45224k35280c79179A489497h91750c12787p31258A144768D10984
6617D23704R75665d53295J25645m86254G66767c92840a10962F84056j89476J93796
6607F88376g30416C37583J12354A55698G596c107582b02265D63081b20594A202068
6596d94608A462135h45845G14577A33212P72739a163286K65169A503853C97727
6586C546260E29065J221692K35908b81820G22894e09028B97627M71148i28926
6576I90027a03361D23739M62653k58870g38240A48930J028261B92023O34019M90406
$$ plain form
6566 1416448 -396237 631502 1012517 -1645332 -1814176 392311 513462 2246854 -1575528
6556 898048 -1602230 35848 647366 747849 -906620 1721520 452336 853213 -18263 -120091
6546 -120091 181124 646926 2227788 86199 344591 -1166232 -262695 -254355 1202956 2184029
6536 2184029 602806 -140502 855633 -108785 408173 488093 1409479 180347 1670551 -755886
6525 -2010798 27650 1464726 -542382 2179328 139488 806806 1200428 -863181 -755423
6516 -755423 1042069 -895911 -394454 -279585 -501323 2407942 -1465182 -2082 2701664
6506 1322151 -2628922 -849424 765603 -1968599 327112 -354671 -165846 1198416 -354511
6496 1748507 1106755 680357 -704202 -790090 85093 1856016 3206610 -1812898 369837
$$ packed form
6566A416448c96237F31502L81015a645332j68844C92311J21151J733392a575528
6556H98048a602230C5848O11518J00483i06620A721520D52336M00877a8263j01828
6546a20091A81124M65802J580862H6199K58392a166232b62695Q340A202956R81073
6536B184029F02806a40502H55633a08785D08173P9920R21386A80347J490204g55886
6525b010798B7650J437076e42382B179328A39488O67318L93622h63181J07758
6516g55423A042069h95911c94454J14869k21738B407942a465182b082B701664
6506A322151b628922h49424G65603a968599C27112c54671a65846A198416c54511
6496A748507o41752m26398g04202q5888H5093J770923J350594a812898C69837
$$ plain form
6486 -1105848 435409 1107587 -84934 552674 2301745 -252125 1614364 3890433 2743038
6477 2743038 246460 1494245 1072121 -1277323 1662304 1306702 652450 -179832 189188
6467 1424095 1342142 241935 -46978 2176991 -602532 1278384 285484 -10888 252725 -1691843
6456 140763 -228465 -1632327 933954 829553 752638 1895110 933381 -156198 1089190
6446 -209444 2661877 708160 874320 275311 874454 194006 1513527 2411148 592101
6436 231669 1486812 141363 -179501 -661030 392069 1583561 -114089 -928571 2263286
6426 984796 -1267012 -2009565 -1393171 1767612 206822 -290570 944567 -8290 685577 -937973
6415 -189493 1357071 1245763 108281 1049332 1037542 633610 1603862 -57070 56689 -10194
$$ packed form
6486a105848D35409O72178h4934E52674J749071b52125A614364K276069j147395
6477B743038B46460J247785m22124a277323A662304l55602F52450a79832A89188
6467A424095q1953B41935d6978B176991f02532A278384B85484a0888B52725a691843
6456A40763b28465j403862I33954j04401p6915J142472I33381a56198A089190
6446b09444B661877G08160J66160B75311N99143A94006J319521Q97621E92101
6436B31669J255143A41363a79501m81529C92069J191492a14089q14482B263286
6426I84796a267012p42553O16394A767612B06822b90570I44567h290F85577i37973
6415a89493A357071j11308A08281R41051j1790m03932R70252e7070E6689a0194
$$ plain form
6404 -13984 -217466 -1519051 608061 -1176928 -657254 357984 -1811074 67227 262289 2378646
6394 2378646 -1500207 -992561 2753312 1485887 4069213 -512359 -710939 -744890 1099917
6384 -2031863 1177296 113428 575751 -1855750 79091 2088830 -780643 3014317 -1379943
6374 1424786 1582935 -506296 -593824 1034394 290136 -638991 1015762 1785571 -512572
6364 1213248 327533 292154 -1172071 1537386 868635 800709 3034038 815791 -374333
6354 1278625 660632 109808 492771 188960 1337703 -410968 1296209 1435345 829430
6345 829430 742723 -337691 2055951 -488900 1547898 2867718 1358021 -2410594 78362
6335 -598759 1748943 1636510 -454455 586446 -124293 1671015 -225802 1106136 1104352 1521929
$$ packed form
6404a3984k03482j301585F08061a176928N19674C57984a811074F7227J95062K116357
6394B378646a500207N07646B753312j267425K583326e12359j98580l3951A099917
6384b031863A177296A13428M62323a855750G9091K009739g80643C014317a379943
6374A424786J58149e06296q7528A034394B90136f38991A015762P69809e12572
6364A213248C27533l5379a172071A537386o68751o7926K233329H15791c74333
6354A278625o17993A09808L82963A88960J148743d10968A296209J39136o05915
6345H29430q6707c37691B055951d88900A547898J319820A358021b410594G8362
6335e98759A748943j12433d54455E86446a24293A671015b25802A106136j784M17577
$$ plain form
6325 1521929 2571636 242722 584797 -888031 1370939 1417773 -218403 1097083 806650
6316 806650 -195684 478769 1665744 760140 2561936 971409 -276249 5006085 512063
6306 1919638 1162469 712840 626779 170606 574937 -1573645 -48840 1575981 895609 -335209
6295 -61808 -241250 -294423 16098 717791 1928049 1457419 1410683 -925122 1404978 186725
6284 -1186665 -486411 1619192 670672 1077045 509594 -1499154 -639552 1010468 227396
6274 -879153 850403 -664892 1215940 1087369 800243 -1236963 96561 1391325 488634
6264 2534373 1159598 103800 442235 -198313 -231127 941483 2001805 841358 -630808
6254 704270 -578629 2131432 1192540 1809238 -481739 186004 2891548 489795 1225198
$$ packed form
6325A521929J049707B42722L42075h88031A370939M6834b18403A097083k90433
6316H06650a95684D78769J186975G60140J801796I71409b76249E006085E12063
6306A919638p57169m49629q6061A70606M04331a573645d8840A575981o80372c35209
6295f1808j79442n3173A6098P01693J210258m70630m6736i25122A404978A86725
6284a186665d86411A619192F70672M06373E09594a499154f39552A010468B27396
6274h79153H50403f64892A215940j28571k87126a236963I6561J294764D88634
6264B534373A159598A03800L38435a98313l2814I41483J060322H41358f30808
6254G04270e78629B131432r38892O16698d81739A86004K705544D89795P35403
$$ plain form
6245 1225198 -545926 800486 1368784 2108865 986710 2558221 -556437 1131813 1172023
6236 1172023 1459777 495338 552983 927177 580298 737178 1152843 -321062 -43973 1667291
6225 1732239 -1856323 1234274 749669 758559 192811 361584 765294 3137762 1337488
6215 371584 -1970704 616324 933903 319718 817801 -2304679 -1008285 1203155 252743
6205 -1049063 -753299 705943 922840 509790 198130 678735 -126916 1088 -2319275 1795128
6194 1658368 813650 324856 202420 -825793 33754 1135451 -836416 -85578 -1043434 1227358
6183 -487100 -2292767 1987816 348919 1043597 1068416 737688 -443469 1375302 1744207
6174 1744207 1214308 693459 529434 863332 -192901 -959584 -115013 1168568 813640
$$ packed form
6245A225198e45926H00486N68298P40081I86710J571511e56437A131813M0210
6236A172023K87754D95338N7645L74194l46879J56880M15665c21062d3973A667291
6225A732239a856323A234274m84605Q890A92811J68773M03710K372468A337488
6215C71584a970704F16324L17579C19718M98083b304679a008285A203155B52743
6205a049063K95764G05943K16897m13050A98130M80605a26916A088b319275A795128
6194A658368H13650C24856j22436h25793C3754J101697h36416h5578r57856A227358
6183d87100j805667A987816C48919O94678K4819l30728d43469A375302L68905
6174A744207n29899n20849j64025L33898a92901p66683a15013A168568l54928
$$ plain form
6165 813640 2221492 -614632 -336826 839305 1986975 2486 826564 1650801 -1596428 1090849
6154 1709953 2101594 1435284 626779 1010521 783386 -1150391 1025282 725671 -358674
6144 1437818 738976 870333 2714253 356075 1670908 5523 1949731 582220 1378982
6135 1378982 1028705 863477 526741 132719 1170598 -701127 1774317 436638 -2234954
6125 -178147 1876845 1388674 1406119 -86720 -313504 1259575 721902 2127179 799757 1051868
6115 1051868 274269 -1181209 -784022 920480 242465 1041932 -592361 -1810698 1187051
6105 1195078 -242914 1893789 -183164 427057 -13762 479822 562330 -1704691 1146915
6095 780541 -1083836 -274151 48958 363788 296181 -772562 -362935 969910 -491198 1724280
$$ packed form
6165H13640J407852f14632K77806H39305J147670B486Q24078Q24237a596428A090849
6154A709953L91641o66310F26779L83742k27135a150391A025282k99611c58674
6144A437818o98842J31357J843920C56075J314833E523J944208E82220P96762
6135A378982l50277j65228l36736A32719J037879g01127A774317D36638b234954
6125a78147A876845m88171J7445h6720k26784A259575n37673J405277G99757K52111
6115A051868B74269a181209L97187I20480B42465P99467e92361j218337A187051
6105A195078b42914A893789a83164D27057a3762D79822Q2508a704691A146915
6095G80541a083836b74151D8958L14830o7607g72562c62935I69910d91198A724280
$$ plain form
6084 544018 -110562 -1256663 -447552 -1704836 808785 -693381 -416649 1963031 -1730807
6074 1465201 1209255 1017886 -1922330 1504596 -734351 220051 -384239 613027 1713330
6065 1713330 1385340 -1264205 -383174 -1449001 -1756059 1898158 1484270 2079918 611279
6055 285885 1777992 -455786 66034 -503888 401310 1359991 -911511 347718 1302209 -205772
6044 545136 1470178 95765 1022654 2206017 -300233 149939 -465504 1073586 1546919 2135475
6034 2135475 2374873 1340620 2352190 1109286 689905 304245 1028550 458020 574539
6025 574539 2212530 -1047675 1704823 -326280 425493 1649132 -248606 -2085157 1143735
6015 26653 -810813 -971140 -1867976 -95216 -227105 -983437 -1276710 812291 -487464 1315756
$$ packed form
6084E44018a10562j146101d47552j257284H08785f93381K76732A963031a730807
6074A465201k55946j91369a922330A504596g34351B20051c84239F13027J100303
6065A713330l27990a264205c83174j065827l07058A898158m13888N95648F11279
6055B85885J492107d55786F6034e03888D01310R58681i11511C47718R54491b05772
6044E45136R25042I5765R26889J183363c00233A49939d65504A073586M73333N88556
6034B135475K39398j034253J011570A109286m19381C04245P24305D58020J16519
6025E74539J637991a047675A704823c26280D25493J223639b48606j836551A143735
6015B6653h10813j60327q96836i5216j31889p56332k93273H12291d87464A315756
$$ plain form
6004 -277898 2847420 2833567 -183896 287042 -182448 2143603 1686565 -451167 3253955
5994 -758049 947689 28560 -394752 2594364 1345557 -1004414 1221667 473409 405670
5985 405670 993273 126807 -47946 1495146 -224238 -677391 -227139 1103158 985324 -620359
5974 178128 2924770 1364823 -196216 558472 1372451 935859 -1840202 -267893 655087
5964 1595047 -270220 472511 -95347 -401552 28569 -904844 176049 -1807749 2699522 381748
5953 1312792 752540 975529 2173287 451446 362240 588205 -13621 1299588 790167 1191357
5943 1191357 -68397 -45597 2944888 -1122971 99955 1010420 729717 1303622 1666978 83831
5932 393206 269239 187425 -348775 265334 2111426 -544830 927801 55535 1737938 15446
$$ packed form
6004b77898B847420j3853a83896B87042a82448B143603m57038d51167C253955
5994g58049I47689B8560c94752B594364j248807a004414A221667D73409o7739
5985D05670N87603A26807d7946A495146b24238m53153b27139A103158j17834f20359
5974A78128K746642A364823a96216E58472Q13979m36592a840202b67893F55087
5964A595047b70220D72511i5347l06205B8569i04844A76049a807749B699522C81748
5953A312792n60252K22989J197758D51446q9206K25965a3621A299588n09421M01190
5943A191357f8397K2800B944888a122971I9955R10465k80703N73905L63356H3831
5932C93206j23967q1814c48775B65334J846092e44830I27801E5535J682403A5446
$$ plain form
5921 -1305674 2242679 -419094 -27316 1766982 990299 848676 195478 928857 814490
5912 814490 1577618 -1413224 1390948 1201348 1881963 1620901 1307422 1648009 2021765
5903 2021765 610544 1122151 803056 -11420 1635145 -150110 -60048 1527056 -1423208
5893 939901 2127495 75222 1283493 -1202737 1759668 1163275 209254 1606577 -2517713
5883 934122 1756210 -810956 -106073 1985667 730284 1504556 -1283292 1257579 1110171
5874 1110171 2023414 1546437 -611847 469844 2785812 392559 -605769 336526 970903
5865 970903 1970302 -2092255 1367103 1890213 37439 151202 2064906 3225067 2308790
5856 2308790 1709139 -391247 1326348 1621400 888096 1338531 2644475 1144988 727846
$$ packed form
5921a305674B242679d19094b7316A766982p76683j41623A95478P33379j14367
5912H14490P63128a413224A390948j89600O80615k61062l13479L40587L73756
5903B021765F10544N11607l19095a1420A635145a50110f0048A527056a423208
5893I39901J187594G5222J208271a202737A759668n96393B09254J397323b517713
5883I34122Q22088h10956a06073A985667G30284P74272a283292A257579j47408
5874A110171R13243m76977f11847D69844K315968C92559f05769C36526O34377
5865I70903R99399b092255A367103N23110C7439J13763J913704J160161r16277
5856B308790n99651c91247A326348K95052p33304M50435J305944A144988m17142
$$ plain form
5847 727846 2462006 1627630 1878833 1295571 199814 2637763 -799960 -6639 1078506 1086116
5837 1086116 1636899 2756000 1001627 1166096 886919 -361643 1258939 -966982 -994563
5828 -994563 742864 9824 1046964 1323359 -810683 2358765 751269 2821051 843655 2412363
5818 2412363 961427 520123 417616 -305333 1653198 554525 478557 506157 -195320 26106
5807 1226368 939039 1138968 2119861 1461807 734462 2864129 1082941 419623 2523094
5798 2523094 1559898 1061989 -523371 -1931774 1622474 -624553 -1149809 768478 191600
5788 1151245 686837 -27464 -457991 480210 1059499 1803508 2530226 827994 1094376 510921
5777 -295410 -117814 1746105 1726618 687467 -419215 -931047 252920 1412301 -476625 2003200
$$ packed form
5847G27846J734160q34376K51203n83262A99814K437949g99960f639A078506P610
5837A086116N50783J119101A001627J64469k79177c61643A258939i66982k7581
5828i94563G42864I824J037140K76395h10683B358765G51269K069782H43655J568708
5818B412363I61427m41304j02507c05333A653198E54525p5968K7600a95320B6106
5807A226368k87329J99929R80893o58054p27345K129667A082941D19623K103471
5798B523094r63196m97909e23371j408403A622474f24553n25256G68478A91600
5788A151245m64408b7464m30527D80210N79289P44009P26718H27994K66382E10921
5777b95410a17814A746105j9487F87467d19215n11832B52920J159381d76625B003200
$$ plain form
5766 3343004 454276 1421526 651321 2263091 1290846 1605449 114903 293339 860012
5757 860012 699739 211178 1674048 89341 760800 1110000 1022999 1664386 1798859 900985
5747 900985 497827 -1050887 -1524228 1756531 267036 -264953 316806 -419260 248085
5737 1301768 -780941 -2056852 621845 1248362 2250429 -141894 1313243 784855 2269073
5728 2269073 -647052 2693732 -423173 2665552 -150519 2031740 -273069 1876570 717449
5718 1799054 1164272 342277 -95281 2730774 -81434 -43644 3080434 956861 -262909 1017597
5707 531302 2091319 -163796 1599477 1024030 1547411 1338935 1272973 2604893 1358301
5698 1358301 -538681 1929461 2212869 2216135 708813 2547284 163992 2736996 415692
$$ packed form
5766C343004D54276R67250F51321J611770r72245L14603A14903J78436N66673
5757H60012j60273B11178J462870H9341O71459L49200q7001O41387J34473q97874
5747I00985m03158a050887m73341A756531B67036b64953C16806d19260B48085
5737A301768g80941j275911F21845O26517J002067a41894A313243n28388J484218
5728B269073f47052B693732d23173B665552a50519B031740b73069A876570G17449
5718A799054o34782C42277i5281B730774h1434L7790C080434I56861b62909A017597
5707E31302J560017a63796A599477n75447N23381k08476o5962J331920j246592
5698A358301e38681A929461K83408L266G08813J838471A63992K573004D15692
$$ plain form
5688 1619390 1567716 472204 1077534 2551777 81807 2049263 -1070422 113595 726914
5679 726914 -2354882 552989 436933 1488053 -764833 2145777 2527707 3835643 -669440
5669 2110357 -166988 766058 946430 -166012 806528 1965696 573345 222004 -1145844
5659 707686 1500834 1848038 185312 109142 498563 1516922 -944525 2982768 266633 335065
5649 335065 -594623 -653855 651291 2541235 718883 -1003066 1058309 2105351 349262
5639 1096809 -737794 -128478 -376189 -1126918 207773 -49540 138155 83945 1538911 -201397
5628 -1604048 -444175 1853073 -153631 747160 -445831 797480 259508 -58578 1107447
5618 3892719 801600 449009 2865213 848609 78186 -491167 1319378 980222 922258 3035602
$$ packed form
5688A619390n1674D72204O05330J474243H1807J967456a070422A13595O13319
5679G26914b354882E52989j16056J051120g64833B145777L81930J307936f69440
5669B110357a66988G66058J80372a66012H06528J159168E73345B22004a145844
5659G07686P93148L47204A85312p6170L89421J018359i44525B982768B66633O8432
5649C35065e94623n9232F51291J889944G18883a003066A058309J047042C49262
5639A096809g37794a28478k47711p50729B07773d9540A38155n4210J454966b01397
5628a604048d44175A853073a53631G47160d45831G97480B59508e8578A107447
5618C892719H01600l52591K416204H48609G8186d91167A319378l39156n7964K113344
$$ plain form
5608 3035602 632803 2515698 374179 816233 1921065 265492 1637099 2399828 2882826
5599 2882826 381386 -26942 -36480 937419 -1310917 -2010254 2676662 1281128 2603006
5590 2603006 -673596 427009 1122134 2772279 1678066 468813 2634425 732182 2051581
5581 2051581 10289 -1381155 2195860 -20384 -682478 651399 279113 1392261 1728021
5572 1728021 976033 2975742 902684 2449222 2273352 2022820 3193029 2578648 1712282
5563 1712282 2206725 3438956 4572929 51787 1701088 -301747 3504430 2667812 890941
5553 3505546 2905500 3631867 2895450 2131761 1901573 264287 1427240 1056975 1175216
5544 1175216 1270424 479430 -245737 1030113 2575560 1376453 2945566 2551610 382460
$$ packed form
5608C035602F32803J882895C74179M42054J104832B65492J371607P62729M82998
5599B882826C81386b6942r538I37419a310917o99337B676662A281128J321878
5590B603006f73596D27009O95125J650145j094213D68813K165612G32182J319399
5581B051581A0289a381155B195860b0384o62094F51399B79113J113148L35760
5572A728021p51988J999709I02684J546538j75870k50532J170209o14381q66366
5563A712282M94443J232231J133973E1787J649301c01747C504430q36618H90941
5553C505546o00046P26367p36417p63689k30188B64287J162953l70265J18241
5544A175216R5208D79430b45737A030113J545447j199107J569113l93956C82460
$$ plain form
5534 -337645 992844 2048931 -264847 1988571 2820606 517004 1093081 2089268 1601243
5525 1601243 1911027 1051082 1440363 2512811 3936524 974816 412533 1172972 1826164
5516 1826164 1325329 478077 -169742 1849867 1522733 -934811 1333981 44172 1751616
5507 1751616 479824 1319136 373815 -406240 4039164 1863794 1388383 434740 -364218
5497 -147694 1026100 1135164 -542964 942819 1685893 840602 1496539 2300733 814532 1504694
5487 1504694 1432825 1314144 443324 1319235 1917362 2148671 1201921 1494925 484946 154918
5476 923905 2450974 2903199 517043 270904 3246113 3306655 1311788 678548 503993
5467 503993 1716044 1830847 232065 1253933 -89985 105949 1360857 2044601 -474787
$$ packed form
5534c37645I92844J056087b64847A988571Q32035E17004N76077R96187m88025
5525A601243L09784q59945L89281J072448J423713I74816D12533P60439O53192
5516A826164n00835D78077a69742A849867l27134i34811A333981D4172J707444
5507A751616D79824Q39312C73815d06240D039164A863794m75411D34740c64218
5497a47694A026100J09064e42964I42819P43074H40602O55937Q04194H14532O90162
5487A504694p1869j18681D43324Q75911N98127K31309r46750K93004D84946A54918
5476I23905J527069M52225E17043k46139K975209O0542A311788o33240j74555
5467E03993J212051J14803B32065J021868h9985A05949J254908O83744d74787
$$ plain form
5457 2784783 3169773 1865492 1811654 2153865 -449409 1693491 1832227 2432361 536115
5447 1356284 1199584 2157544 548271 553506 1025201 1280331 2758772 3925174 -529615 181389
5436 1144123 1757942 2538213 1655226 2025824 1282822 647383 1567825 2863228 2391859
5427 2391859 2209865 1928863 1339743 745675 1939705 993432 233736 252059 1142800 2118762
5417 2118762 3438336 1477865 119464 361603 1833345 1536741 -405782 2900040 1356696
5407 3937956 2643311 464225 1099136 3407754 1961564 2760493 3166489 3216729 2809277
5398 2809277 4032958 2582400 702667 3069675 2003213 951595 2282083 2711391 4403759
5389 4403759 4068739 1298436 2846545 3037800 3804723 1588890 2649049 951042 3122945
$$ packed form
5457B784783L84990j304281n3838L42211d49409A693491J38736O00134E36115
5447A356284j56700R57960E48271N235M71695K55130J478441J166402e29615A81389
5436A144123O13819P80271q82987L70598p43002o35439R20442J295403m71369
5427B391859j81994k81002n89120n94068J194030r46273B33736J8323Q90741R75962
5417B118762J319574A477865A19464K42139J471742k96604d05782B900040A356696
5407C937956j294645D64225O34911K308618j446190P98929M05996N0240m07452
5398B809277J223681j450558G02667K367008j066462I51595J330488M29308J692368
5389D403759l35020A298436J548109J91255P66923A588890J060159I51042K171903
$$ plain form
5380 3122945 3089213 2714119 2146396 180018 3257194 1478648 3143207 603752 -415154
5370 3341448 2932412 1186644 2411432 3174777 3096204 1869887 1113292 96637 -47717 2772503
5359 1434068 2813440 2304777 117457 1597108 1973987 -861181 463647 -376307 2706342
5349 2342472 1518477 -652036 -689140 1302942 531066 2567111 2810438 1202193 3300051
5340 3300051 1313935 1608 857068 148743 2046170 820120 347232 2828011 2296523
5331 2296523 2564250 2740789 561626 316683 1678827 2536549 1950656 257326 871278
5322 871278 270908 2399246 -438187 1575891 410983 824677 395959 1628001 2534704
5313 2534704 113021 2465978 -881817 768964 2571635 579738 994895 1039593 -114022
$$ packed form
5380C122945l3732l75094n67723A80018L077176A478648J664559F03752d15154
5370C341448m09036A186644J224788P63345p8573j226317p56595I6637d7717B772503
5359A434068J379372n08663A17457J479651L76879h61181D63647c76307B706342
5349B342472q23995f52036l7104A302942E31066K036045K43327A202193K097858
5340C300051A313935A608Q55460A48743J897427H20120C47232K480779n31488
5331B296523K67727J76539E61626k44943J362144Q57722n85893B57326O13952
5322H71278B70908K128338d38187A575891D10983M13694C95959J232042R06703
5313B534704A13021K352957h81817G68964J802671E79738M15157M4698a14022
$$ plain form
5303 134514 -655926 -1414033 3527736 -122356 3251961 2170259 415850 3026236 302809
5293 299190 1030171 127027 -2024 2386183 1634558 2080818 1984157 1913368 947045 889230
5283 889230 1465317 1436952 111635 54587 1478080 2433400 1909220 142518 3565678 270648
5272 297716 394200 1721222 302128 81140 2784603 768039 2709078 3118939 1224651
5262 1148688 -863503 41995 1141310 1866404 150390 404337 2151581 2918379 585267
5252 20672 2942497 4080460 876843 1444874 2740356 1334072 2638924 1756724 11977
5242 -657503 2909199 4093032 930866 969022 1314946 261544 1961079 1446966 2711592
5233 2711592 2323224 1709312 1331855 2831111 3098266 2485972 29095 2522347 76414 2768618
$$ packed form
5303A34514f55926p58107C527736a22356C251961j081702D15850K610386C02809
5293B99190P30981A27027b024B386183p51625M46260r6661p0789I47045n7815
5283H89230N76087k8365A11635E4587J423493R55320n24180A42518L423160B70648
5272B97716R6484J327022C02128H1140K703463G68039J941039M09861A224651
5262A148688h63503D1995J099315P25094A50390K53947J747244P66798E85267
5252B0672K921825J137963H76843N68031J295482A334072J304852q82200A1977
5242f57503B909199J183833I30866L8156L45924B61544J699535n14113J264626
5233B711592l88368o13912l77457J499256K67155o12294B9095K493252G6414K692204
$$ plain form
5223 2768618 1022071 1209388 1785908 1303566 800798 2242296 3503564 1164519 1191355
5214 1191355 783325 1238374 946066 2870622 2820756 3115167 2847245 2467595 2629445 2276663
5204 2276663 2289567 -60747 1196994 1555486 2574663 774601 1665192 1420214 524778 1175568
5194 1175568 1961655 2591167 1878028 1605744 612978 1602237 1570720 1417009 1652287 2350039
5184 2350039 3836787 1692795 3809540 2036862 2248457 1129947 1744297 1227844 86542
5174 2234763 2788857 2550714 2044994 2471745 1201775 993608 1604124 2262611 708698
5164 2888002 1619116 1728970 1453549 1029750 3696381 4049476 3331870 5096717 6722109
5155 6722109 6019356 3956282 3446969 5668009 3839473 4005931 3271478 1510833 2087104
$$ packed form
5223B768618A022071J87317N76520m82342n02768J441498J261268A164519K6836
5214A191355m08030M55049k92308J924556m9866K94411k67922l79650J61850l52782
5204B276663J2904f0747A196994L58492J019177G74601Q90591k44978E24778O50790
5194A175568P86087O29512p13139k72284F12978R89259l1517j53711K35278O97752
5184B350039J486748A692795K116745j772678K11595j118510O14350n16453H6542
5174B234763N54094k38143n05720M26751A201775k08167O10516O58487G08698
5164B888002j268886J09854k75421m23799K666631L53095p17606J764847J625392
5155F722109p02753k063074n09313K221040j828536J66458p34453A510833N76271
$$ plain form
5146 2087104 -791617 1184869 2744908 1999467 -865696 139722 735954 1956490 579676
5136 605201 1424125 1578083 1437483 212183 2575219 2928168 731499 63257 968442 1049536
5126 1049536 906045 2093259 1123217 2171018 3026110 3493967 369697 2415294 2500700
5117 2500700 3827297 609167 1384475 574108 1222770 2767117 1075566 -1041456 436898
5107 1450404 1649941 35687 2139790 2439762 2279410 609651 1370124 2668999 2712587 2000671
5097 2000671 1287061 1047916 167821 2146110 2194816 324528 466287 2519361 2888777
5088 2888777 2209220 2586040 319546 2962831 1541918 52865 3052564 1171560 3130551
5079 3130551 1596521 2177145 3761438 -444243 2165249 2224901 1045829 3212334 3707705
$$ packed form
5146B087104g91617A184869J560039p45441h65696A39722N96232J220536E79676
5136F05201Q18924J53958j40600B12183K363036L52949G31499F3257R05185Q1094
5126A049536j43491J187214r70042J047801Q55092M67857C69697K045597Q5406
5117B500700J326597F09167P75308E74108O48662J544347A075566a041456D36898
5107A450404J99537C5687K104103K99972j60352F09651P60473J298875M3588p11916
5097B000671p13610k39145A67821J978289M8706C24528J41759K053074L69416
5088B888777o79557L76820C19546K643285j420913E2865K999699A171560J958991
5079C130551j534030N80624J584293d44243B165249N9652A045829K166505M95371
$$ plain form
5070 3707705 79048 1232801 1916655 657765 1395653 3105406 300426 2207611 142804
5060 2572645 407091 1967365 2326793 3470726 1995804 1149385 929891 1896118 620099
5050 1614283 2148044 -1817942 2088760 2483642 2263602 2074768 1597506 -355888 3683398
5040 1980840 2293736 1201543 1136415 2131208 2290757 3264987 2054803 2774196 988794
5030 2224423 779460 2430767 1895839 2090967 3011460 2643127 3196408 2371663 2596840
5021 2596840 3206336 3479533 1092408 2121470 3405767 2349846 2216579 1155699 2599984
5012 2599984 3099251 2114179 2694990 1674895 2421688 -518713 2991462 2306463 670349
5002 3856394 4250147 1974509 435151 3933151 2628150 1566086 1753745 820217 2450209
$$ packed form
5070C707705G9048J153753O83854F57765P37888J709753C00426J907185A42804
5060B572645D07091J560274L59428J143933j474922q46419k19494R66227F20099
5050A614283N33761a817942B088760L94882k20040j88834m77262c55888C683398
5040A980840L12896j092193o5128R94793J59549R74230j210184P19393I88794
5030B224423G79460J651307n34928J95128R20493l68333N53281q24745K25177
5021B596840O09496K73197A092408J029062J284297j055921j33267j060880J444285
5012B599984M99267r85072N80811j020095P46793e18713B991462o84999F70349
5002C856394L93753A974509D35151L498000j305001j062064J87659H20217J629992
$$ plain form
4993 2450209 2947228 4574425 2780555 2055742 1328661 4837646 3279118 1361968 3639570
4984 3639570 2669545 1821149 3113187 2272939 2827929 2574967 299273 1214070 1277629 4010103
4974 4010103 214617 2282765 3740820 1874484 1869735 3418671 1996311 2340933 1195884
4965 1195884 2341621 2010813 2518072 3759085 723959 73379 3050209 3499316 3232718
4956 3232718 1470321 2994390 2497156 2860063 1597759 -435052 -511310 2689433 2205193
4947 2205193 2473218 1534768 503837 2094703 2495640 2137393 2556506 1467332 781285
4938 781285 1291667 3094598 2367940 3089807 3072694 1444386 2251158 1007006 917051 2328300
4928 2328300 2635355 1834990 4482443 318545 1941223 1950965 377576 3629685 4895193
$$ packed form
4993B450209M97019J627197j793870p24813p27081L508985j558528A361968K277602
4984C639570r70025q48396J292038q40248N54990k52962B99273R14797O3559K732474
4974D010103B14617K068148J458055j866336m749J548936j422360L44622j145049
4965A195884J145737l30808N07259J241013G23959G3379K976830M49107k66598
4956C232718A470321J524069m97234L62907j262304d35052p6258B689433m84240
4947B205193K68025r38450E03837J590866M00937l58247M19113j089174o86047
4938G81285N10382J802931p26658P21867j7113A444386Q06772A007006q9955J411249
4928B328300L07055q00365K647453C18545J622678R742C77576L252109J265508
$$ plain form
4919 4895193 1681904 2633146 665804 3877257 2693415 2111351 3034247 4099742 2119392
4910 2119392 3512090 1612111 3955288 4136868 2796909 2204049 2542632 2638213 3134017
4901 3134017 4634563 3179345 5346759 4231571 7308404 6842010 7942201 8426650 9753530
4892 9753530 8930993 8784593 7754398 7335061 6680625 8657655 5231408 4879969 4039890
4883 4039890 3805835 3813434 1429008 3166296 1150260 3041595 976059 3777892 1832368
4873 2649720 2029868 4062838 1099274 2956234 3495329 1714468 622050 1898754 2325026
4864 2325026 1619974 1666264 1218838 3572529 1222892 1593549 2927661 3254822 2173561
4855 2173561 2244998 300651 2086042 -295017 2905926 2073362 464331 909655 303405
$$ packed form
4919D895193A681904R51242F65804L211453j183842n82064R22896J065495j980350
4910B119392J392698A612111K343177J81580j339959n92860L38583R5581M95804
4901C134017J500546j455218K167414j115188L076833m66394J100191M84449J326880
4892I753530q22537j46400j030195m19337o54436J977030l426247l51439q40079
4883D039890k34055P599A429008J737288A150260J891335I76059K801833A832368
4873B649720o19852K032970A099274J856960N39095A714468F22050J276704M26272
4864B325026p05052M6290m47426K353691A222892L70657J334112L27161j081261
4855B173561P1437C00651J785391b95017B905926q32564D64331M45324C03405
$$ plain form
4845 2057180 2332252 3264647 4024446 2184317 421783 666964 5027231 2945221 1197940
4835 4103362 1729203 2257709 826904 1975334 979176 1624601 1978022 1736088 482059
4825 1648577 4475009 1977394 2102291 3933680 -375178 1509292 3031618 4152139 2536023
4816 2536023 1691876 3079093 2697844 1815495 1691429 2403335 2711886 1369403 1831766
4807 1831766 1876124 3210619 1075788 1226493 1582667 4364544 1490524 2559708 1994818
4798 1994818 2495515 914397 2600552 1858777 1118981 3561647 1084232 3384297 2040655
4789 2040655 1744595 2109926 1163520 1605864 3028417 2723606 2440881 2938296 2221969
4780 2221969 1653668 1653420 3256774 3397723 1907356 3608524 1547210 2512644 -969252
$$ packed form
4845B057180K75072R32395P59799j840129D21783K45181M360267k082010A197940
4835D103362A729203N28506H26904J148430I79176O45425L53421k41934D82059
4825A648577K826432A977394J24897J831389c75178A509292J522326J120521j616116
4816B536023q44147J387217l81249q82349j24066P11906L08551j342483M62363
4807A831766M4358J334495A075788J50705L56174K781877A490524J069184n64890
4798A994818N00697I14397J686155p41775p39796K442666A084232K300065j343642
4789B040655k96060L65331r46406M42344J422553l04811k82725M97415p16327
4780B221969n68301k48J603354J40949j490367J701168A547210R65434i69252
$$ plain form
4770 1246498 1742945 1990433 2181795 2012545 91991 2583352 4314064 4231963 2938385
4761 2938385 1292971 1572065 1261649 1607178 3615629 43997 1614472 964791 3440834
4752 3440834 4231821 2309231 3531794 1996274 292118 2659210 2661835 2101022 3476999
4743 3476999 1123720 879741 2751878 1931416 4492239 3068994 4257397 2671323 4149822
4734 4149822 2315887 3928504 3112518 1307265 424762 934111 3760971 1565012 3583952
4725 3583952 1200052 4042090 2114923 4425614 -208908 2981775 4101952 1440671
4716 2201106 1127560 4435661 3590192 3694140 3376006 5373507 3587978 2407171 1835548
4707 1835548 5447042 5261185 4041228 4503790 683498 4928260 2958243 3760378 4112402
$$ packed form
4770A246498M96447K47488J91362j69250I1991K491361J730712q2101j293578
4761B938385A292971K79094l10416L45529K008451D3997J570475o49681K476043
4752C440834P90987j922590J222563j535520B92118K367092K625n60813J375977
4743C476999A123720k43979J872137q20462K560823j423245J188403j586074J478499
4734D149822j833935J612617q15986A307265D24762N09349K826860A565012K018940
4725C583952A200052K842038j927167K310691b08908B981775J120177A440671
4716B201106j073546L308101q45469J03948l18134J997501j785529j180807n71623
4707A835548L611494j85857j219957M62562F83498M244762j970017Q02135L52024
$$ plain form
4698 4112402 4369541 2164861 2371749 4380327 2101498 3387811 2720358 3525855 2644875
4689 2644875 4855422 4862993 3067768 3380768 3671644 3310863 1839337 4932811 772311
4679 2233123 2515559 3247139 4662008 1402500 4036321 1266226 3192819 3491819 1981469
4670 1981469 2057722 3213046 2604547 1941990 6207253 1451075 5016204 2712321 3146209
4661 3146209 665100 2176709 1804896 3035076 4618592 3044760 2128145 4062991 3808232
4652 3808232 2718393 4132771 3388593 3968324 3592719 3012562 2154387 2935997 1884371
4643 1884371 1866067 962229 2560410 2738867 3735302 4655251 5112592 3478356 4561797
4634 4561797 3942757 6382478 7557035 7103302 2612042 4086241 4055892 4875871 4459737
$$ packed form
4698D112402K57139B164861K06888K008578B101498J286313o67453Q05497q80980
4689B644875K210547P571j795225L13000K90876l60781j471526L093474G72311
4679B233123K82436P31580J414869A402500K633821A266226J926593K99000j510350
4670A981469P6253J155324o08499o62557M265263A451075L565129k303883M33888
4661C146209F65100J511609l71813J230180J583516j573832r16615J934846k54759
4652C808232j089839J414378p44178N79731l75605n80157q58175P81610j051626
4643A884371j8304r03838J598181J78457R96435R19949M57341j634236J083441
4634D561797o19040K439721J174557m53733B612042J474199l0349Q19979m16134
$$ plain form
4625 4459737 5462472 6806135 4040611 4737253 4490521 5883785 3595608 3630750 3909090
4616 3909090 3597860 3003500 4583200 1743842 3641749 3197846 3120766 2865889 2798203
4607 2798203 3503824 4085406 4761554 4258785 3116258 4879166 3792804 4843573 5722791
4598 5722791 5195599 3988595 5732100 4454245 3752990 4315292 6878538 5941735 7014385
4589 7014385 4120316 5951426 4687416 4528817 5877124 6274296 5191245 4800146 4489257
4580 4489257 3601635 1927103 4976134 3347137 1096614 2422481 2867509 1798695 2885542
4571 2885542 3427155 2444715 1172388 3349262 3345858 4036167 3656737 2281694 2610274
4562 2610274 1699000 1368768 3618673 2608732 2047831 2385003 1759932 4648463 3754596
$$ packed form
4625D459737J002735J343663k765524O96642k46732J393264k288177L5142K78340
4616C909090l11230n94360J579700A743842J897907m43903p7080k54877o7686
4607B798203P05621N81582O76148n02769j142527J762908j086362J050769Q79218
4598E722791n27192j207004J743505j277855p01255N62302K563246r36803J072650
4589G014385k894069J831110j264010j58599J348307L97172j083051l91099l10889
4580D489257q87622j674532L049031j628997A096614J325867M45028j068814J086847
4571B885542N41613r82440A172388K176874l404O90309l79430j375043L28580
4562B610274r11274l30232K249905j009941n60901L37172o25071K888531q93867
$$ plain form
4553 3754596 4310690 4191756 1677606 2150644 3846576 1923880 1345587 575319 1592086
4544 1592086 1730068 4194698 5019810 4877497 3641151 1960674 1948000 1806302 2409274
4535 2409274 2211808 3437589 3178323 502695 3154239 4206870 4448845 1777366 2821653
4526 2821653 2260297 3611713 2056466 5159879 2776630 4896158 3541952 3296371 3489470
4517 3489470 5636953 3724994 3883371 7379150 5099155 2947670 4967488 2029968
4508 3715894 3999117 1847447 4434084 4777754 5100296 5699118 5482265 5088595 4620843
4499 4620843 6988487 5601607 6911672 6223013 6287946 5287187 7312397 4802061 6434275
4490 6434275 3722725 4358889 6995658 6319873 6943211 4596392 6095882 3619264 3780212
$$ packed form
4553C754596N56094j18934A677606M73038J695932j922696n78293E75319J016767
4544A592086J37982K464630Q25112j42313j236346j680477j2674j41698O02972
4535B409274j97466J225781k59266E02695K651544J052631K41975A777366J044287
4526B821653n61356J351416j555247L103413k383249K119528j354206k45581J93099
4517C489470K147483j911959J58377L495779k279995k151485K019818B029968
4508C715894K83223A847447K586637L43670L22542N98822k16853l93670m67752
4499D620843K367644j386880J310065o88659O4933j000759K025210k510336J632214
4490F434275k711550O36164K636769o75785O23338k346819J499490k476618J60948
$$ plain form
4481 3780212 4425160 4225006 3750693 3619776 4881234 3617685 4094133 3158225 4084417
4472 4084417 3051032 3345468 4987333 3774379 4232587 2361917 3169443 5250164 3207554
4463 3207554 3595092 5233323 3883887 1744290 1457510 3081188 4497303 2422799 3892232
4454 3892232 3367432 3351864 4673346 1667105 3610232 3232564 4470557 2348261 3725477
4445 3725477 3853130 3664181 5377467 4454359 3084087 4707094 6418657 5095769 5810409
4436 5810409 5695821 4964305 3769926 3910216 4775889 3692273 5428278 4455373 3916541
4427 3916541 5214757 4444506 5653001 6691896 4153486 3243610 2245974 3582698 748815
4417 1875912 3151088 3400878 3464720 3667262 1697424 3137438 3959296 3087468 4261469
$$ packed form
4481C780212O44948k00154m74313j30917J261458j263549M76448r35908R26192
4472D084417j033385K94436J641865j212954M58208j870670Q07526K080721k042610
4463C207554L87538J638231j349436A744290k86780J623678J416115k074504J469433
4454C892232n24800j5568J321482A667105J943127l77668J237993k122296J377216
4445C725477J27653j88949J713286r23108j370272J623007J711563j322888P14640
4436E810409j14588p31516j194379J40290Q65673j083616J736005r72905n38832
4427C916541J298216p70251J208495J038895k538410r09876r97636J336724G48815
4417A875912J275176K49790O3842K02542A697424J440014Q21858q71828J174001
$$ plain form
4408 4261469 5208056 4726021 2618521 1997730 2624851 4548905 5385812 3193733 3684395
4399 3684395 3738192 4651070 6317025 2261685 3175094 2896161 4222821 5128719 3982125
4390 3982125 4409543 4033628 4734838 4675753 6049912 4079428 5055887 5273470 5877726
4381 5877726 5074014 6598427 6535792 8103108 6357902 8294220 6497501 6449764 7209837
4372 7209837 6160217 7799760 4773177 6497152 4995112 3011751 6611320 3926019
4364 3926019 5500516 3906680 6634267 4460712 5322756 8013289 6185529 6775248 5520706
4355 5520706 3608261 4188398 5152401 3403524 3962673 4087753 5290800 3276813 4753617
4346 4753617 3035860 5177781 7059693 6765711 5756755 6639358 4300381 4255071 6208463
$$ packed form
4408D261469R46587m82035k107500o20791O27121J924054Q36907k192079M90662
4399C684395N3797R12878J665955B261685R13409k78933J326660R05898j146594
4390C982125M27418l75915P01210n9085J374159j970484R76459K17583O04256
4381E877726q03712J524413o2635J567316j745206J936318j796719m7737P60073
4372G209837j049620J639543l026583J723975j502040j983361L599569k685301
4364C926019J574497j593836K727587k173555Q62044K690533j827760N89719j254542
4355E520706j912445N80137R64003j748877N59149J25080J203047k013987J476804
4346D753617j717757K141921J881912k93982j008956Q82603k338977m5310J953392
$$ plain form
4337 6208463 6077230 6852436 5148425 5525051 3624265 5488896 5346251 5108166 4046282
4328 4046282 3329329 3806437 4672438 3952644 4540207 3446278 4210556 4696744 4709435 4714874
4318 4714874 3908431 3918205 3949321 4177884 3716808 5031341 4935565 2909833 4958660 4606336
4308 4606336 5407154 3763991 4044178 2011680 3329589 4586428 3345778 3974447 4128203
4299 4128203 4253217 5627797 4520452 3018862 5088153 4791916 3479905 3722170 2900493
4290 2900493 3233952 5879833 4601905 3759042 3753872 5196166 5059530 3861506 5206731
4281 5206731 3461379 1834841 3590141 5046159 4945333 3726319 2360961 4769091
4273 4769091 2739429 4318244 3300894 4634874 5451209 3456148 4175760 3383512 5578032
$$ packed form
4337F208463j31233P75206j704011L76626j900786J864631j42645k38085j061884
4328D046282p16953M77108Q66001p19794N87563j093929P64278M86188J2691N439
4318D714874q06443R774L1116K28563m61076J314533r5776k025732K048827l52324
4308D606336Q00818j643163K80187B011680J317909J256839j240650O28669J53756
4299D128203J25014J374580j107345j501590K069291k96237j312011K42265q21677
4290B900493L33459K645881j277928q42863n170J442294j36636j198024J345225
4281E206731j745352j626538J755300J456018j00826j219014j365358K408130
4273D769091k029662J578815j017350J333980Q16335j995061P19612p92248K194520
$$ plain form
4264 5578032 4788276 2956318 4216102 4435642 2940341 3074444 3721047 1930378 2461339
4255 2461339 2803060 4615471 2934436 1028551 1922720 4107631 3985200 4679359 1865865
4245 2347549 3432857 3747116 3017974 2730747 5833660 4502446 4111328 1751370 2512580
4236 2512580 4342452 3970892 3295781 5590492 3992683 3906412 2342545 2025478 2783333
4227 2783333 4185034 4714536 5550309 4712647 3586034 4201273 3835956 2592927 3133356
4218 3133356 2971216 3061497 2569430 2107059 3265303 3732629 4220182 3128573 3587966
4209 3587966 2302939 6177125 1845966 4850076 4228936 2561019 5275784 5170283 4981943
4200 4981943 3093313 1795968 4125538 4388150 5197108 2042122 2986174 3635942 3534896
$$ packed form
4264E578032p89756j831958J259784K19540j495301J34103O46603j790669N30961
4255B461339L41721J812411j681035A028551Q94169K184911j22431O94159A865865
4245B347549J085308L14259p29142k87227L102913j331214l91118A751370P61210
4236B512580J829872l71560o75111K294711j597809q6271j563867l17067P57855
4227B783333J401701N29502Q35773q37662j126613O15239l65317j243029N40429
4218C133356j62140R0281m92067m62371J158244M67326M87553j091609M59393
4209C587966j285027L874186A845966L004110o21140j667917K714765j05501j88340
4200D981943j888630j297345K329570K62612Q08958B042122R44052O49768j01046
$$ plain form
4191 3534896 2245349 5151839 4022383 3617614 4142321 3628251 4679832 3296549 5199640
4182 5199640 2428831 3041684 3760562 3869636 5395206 3387558 2778716 3767859 3078562
4173 3078562 5494337 3720465 4486965 4258417 1994987 4765650 4943969 4673034 4904801
4164 4904801 4707441 6123933 4099807 3680652 4572064 4656854 4814237 6525637 5848364
4155 5848364 7230427 7916846 6382244 7084274 6826418 5568714 6854184 5015043 7314775
4146 7314775 7419899 7285979 6731557 6575557 5976351 6709574 5542360 4603532 7469130
4137 7469130 5587193 7284766 4373352 5271219 5968873 4974949 4954795 4355894 5090421
4128 5090421 5749602 4170384 3548432 5497224 4509643 6613900 6265700 5881623 5078187
$$ packed form
4191C534896j289547K906490j129456m04769N24707n14070J051581j383283J903091
4182E199640B428831O12853P18878J09074J525570k007648o08842R89143o89297
4173C078562K415775j773872P66500k28548A994987K770663J78319k70935K31767
4164D904801j97360J416492k024126m19155Q91412Q4790J57383J711400o77273
4155E848364J382063O86419j534602P02030k57856j257704J285470j839141K299732
4146G314775J05124j33920n54422j56000n99206P33223j167214r38828K865598
4137G469130j881937J697573k911414Q97867O97654r93924k0154n98901P34527
4128E090421O59181j579218o21952J948792r87581K104257l48200l84077q03436
$$ plain form
4119 5078187 5876937 7089927 6149900 5815124 7832982 4886910 5777849 2655179 4159065
4110 4159065 5141197 3626234 6276368 5947385 4298864 2890340 4083724 4191228 4764531
4101 4764531 6825353 3234000 4818565 4489397 3812828 12272428 4989698 6696821 2248127
4091 4231446 7098117 6426574 6235779 7900522 7858038 7599465 9669075 7222965 7416006
4082 7416006 9098004 8378526 5948401 8145202 9441646 9399785 9683094 9348806 9549057
4073 9549057 10895816 9433917 9089223 8650142 9909387 10926200 11241980 11766474 7974585
4064 7974585 9489694 10786233 10109391 11846297 11543889 8500445 11038263 8325141 10849505
4055 10849505 10723553 8502099 8981140 9601362 11615327 10764009 11398138 11607698 10839715
$$ packed form
4119E078187P98750J212990r40027l34776K017858k946072Q90939B655179J503886
4110D159065R82132j514963K650134l28983j648521j408524J193384J07504N73303
4101D764531K060822C234000J584565l29168o76569Q459600D989698J707123B248127
4091D231446K866671o71543j90795J664743m2484k58573K069610k446110J93041
4082G416006J681998p19478k430125K196801J296444m1861K83309l34288K00251
4073I549057J346759j461899l44694m39081J259245J016813L15780N24494l791889
4064G974585J515109J296539o76842J736906l02408l043444K537818k713122K524364
4055A0849505j25952k221454M79041O20222K013965q51318O34129K09560p67983
$$ plain form
4046 10839715 14071164 14690149 13930839 12271069 14276564 13968026 14684444 17707132 15561545
4037 15561545 16909434 17004572 17501792 15619717 16761922 19678558 15677708 17877763 20881016
4028 20881016 20963502 22571049 21990596 24853932 26831353 21936272 19721106 14656803 13201599
4019 13201599 12940928 11050701 9475190 6619734 4934079 7522794 6673302 8295060
4011 8295060 5980745 6497857 6876507 4254036 6268555 6010547 6182369 5316000 4054033
4002 4054033 6280345 7592034 6667470 6725019 4170323 5063312 4860317 3729351 4807497
3993 4807497 5831127 4183290 5933043 6842479 4532555 5048105 5165265 5077092 5859831
3984 5859831 5927995 7002077 5693228 6251588 6832786 3640825 7254361 5768750 6343345
$$ packed form
4046A0839715L231449O18985p59310j659770K005495l08538P16418L022688k145587
4037A5561545J347889R5138M97220j882075J142205K916636m000850K200055L003253
4028B0881016Q2486J607547n80453K863336J977421m895081k215166n064303j455204
4019A3201599k60671j890227j575511k855456j685655K588715q49492J621758
4011H295060k314315N17112L78650k622471K014519k58008J71822q66369j261967
4002D054033K226312J311689r24564N7549k554696Q92989k02995j130966J078146
3993D807497J023630j647837J749753R09436k309924N15550J17160q8173P82739
3984E859831O8164J074082j308849N58360N81198l191961L613536j485611N74595
$$ plain form
3975 6343345 6814879 5542510 5632299 8908864 7331031 7565296 5446747 6316143 6988659
3966 6988659 5436566 6040652 6527629 3363066 5918186 6823173 5614775 5498919 4629628
3957 4629628 4827073 4071785 4256608 4439761 6108899 6431035 4617616 3623618 4698942
3948 4698942 2848140 5832235 4492101 4772027 3692496 6176186 5102355 5656488 4253388
3939 4253388 5067554 3070770 4086231 5868155 5739399 5241613 3488073 6452461 4805111
3930 4805111 5497259 3921314 2983164 4118018 5420701 4309663 5582159 6616056 5078697
3921 5078697 5013878 4627439 5924467 3421814 5453135 4516480 3005304 5693606 4951431
3912 4951431 5025894 5521924 5177655 4410856 5793483 4538726 5883274 5303079 4442831
$$ packed form
3975F343345M71534j272369Q9789L276565j577833K34265k118549Q69396O72516
3966F988659j552093O04086M86977l164563K555120R04987j208398j15856q69291
3957D629628J97445p55288J84823J83153J669138L22136j813419r93998J075324
3948D698942j850802K984095j340134K79926j079531K483690j073831N54133j403100
3939D253388Q14166j996784J015461J781924j28756m97786j753540K964388j647350
3930D805111O92148j575945r38150J134854J302683j111038J272496J033897j537359
3921E078697o4819l86439J297028k502653K031321r36655j511176K688302p42175
3912D951431P4463M96030l44269p66799J382627j254757J344548n80195q60248
$$ plain form
3903 4442831 3233714 3918832 6207992 3806807 4695567 4064866 5094067 5404342 4399915
3894 4399915 3172399 5224112 2908721 5196036 4292734 4259526 4577918 5956883 5119572
3885 5119572 6282694 5154312 4137744 3532706 3935167 4537695 4032924 2526398 5010481
3876 5010481 4710904 2811241 3330285 3386435 3570241 5398687 3646645 5395051 4993277
3867 4993277 5766955 5605921 5154767 3626852 3809304 5033807 4174259 5331496 4872166
3858 4872166 5299895 4904073 7545394 5354041 4658013 4943672 3675360 6023934 3358341
3849 3358341 6704475 3801590 6461788 5662761 4483211 2384362 2598513 4321038 3551092
3840 3551092 3091776 3552492 5854771 4368607 4278046 3680067 5445926 3744326 3060752
$$ packed form
3903D442831j209117O85118K289160k401185Q88760o30701J029201L10275j004427
3894D399915j227516K051713k315391K287315r03302l3208L18392J378965q37311
3885E119572J163122j128382j016568o05038M02461O02528n04771j506526K484083
3876E010481k99577j899663N19044N6150J83806J828446j752042J748406m01774
3867D993277P73678j61034m51154j527915J82452J224503q59548J157237m59330
3858D872166M27729l95822K641321k191353o96028K85659j268312K348574k665593
3849C358341L346134k902885K660198p99027j179550k098849K14151J722525p69946
3840C551092m59316M60716K302279j486164r0561n97979J765859j701600o83574
$$ plain form
3831 3060752 4387197 5584274 4824457 2882922 3479136 4073913 5358897 3356163 4467008
3822 4467008 3466967 5929710 2978762 5360158 2619653 5302339 5128129 4649738 3641989
3813 3641989 6914931 7197046 5562552 4769869 3809704 5185295 6598751 5505625 5702195
3804 5702195 5333550 6225272 4482280 4179052 4893426 3676509 6194477 3255734 4092389
3795 4092389 5071688 2813494 6489645 7387563 4612853 6853561 5466698 4118876 4036773
3786 4036773 6159205 4938843 7201967 6622612 5970359 5521171 5855571 5624115 5786326
3777 5786326 6069377 5451337 5699035 6769328 6650481 6239416 8531633 7947210 9103228
3768 9103228 6952739 6940697 5562477 7290862 5597859 5845167 7695211 7167341 6847731
$$ packed form
3831C060752J326445J197077p59817j941535N96214N94777J284984k002734J110845
3822D467008j000041K462743k950948K381396B619653K682686j74210m78391j007749
3813C641989L272942K82115j634494p92683r60165J375591J413456j093126J96570
3804E702195l68645Q91722j742992l03228P14374j216917K517968k938743Q36655
3795D092389R79299k258194L676151Q97918k774710K240708j386863j347822q2103
3786D036773K122432j220362K263124n79355o52253m49188L34400k31456J62211
3777E786326K83051o18040K47698J070293j18847m11065K292217n84423J156018
3768I103228k150489j2042j378220J728385j693003K47308J850044n27870l19610
$$ plain form
3759 6847731 8010682 8563682 7551990 7427469 7516682 8409172 7082235 6992976 6045811
3750 6045811 9061172 7725382 9941004 9851697 9445244 7773039 10887767 10521304 11084630
3741 11084630 10622343 10125444 10904879 11021078 13604550 12361956 13511077 15943793 15076415
3732 15076415 17015358 16970188 20050606 17195404 20423110 17923510 21548562 21999538 23182088
3723 23182088 24834760 25220068 28210448 25922026 29118648 26277751 30488470 30227636
3715 30227636 31563249 33994517 34139213 37277142 38705945 38502297 33549968 28598750
3707 28598750 25789433 18318684 17228596 15406358 12620399 10341572 12565256 12536773
3699 12536773 10731452 10976727 10454910 7405513 11866157 11694018 7551155 9171639 9758789
$$ packed form
3759F847731J162951N53000j011692j24521Q9213Q92490j326937q9259r47165
3750F045811L015361j335790K215622q9307m06453j672205L114728l66463N63326
3741A1084630m62287m96899P79435J16199K583472j242594J149121K432716q67378
3732A5076415J938943m5170L080418k855202L227706k499600L625052M50976J182550
3723B3182088J652672L85308K990380k288422L196622k840897M210719k60834
3715C0227636J335613K431268J44696L137929J428803k03648m952329m951218
3707B8598750k809317p470749j090088j822238k785959k278827K223684k8483
3699A2536773j805321K45275n21817l049397M460644j72139m142863J620484N87150
$$ plain form
3690 9758789 9829101 11155761 11541021 11485737 14402539 14634633 12912384 15229220 14351910
3681 14351910 14242892 13231315 14594201 9736617 10903735 12790478 11093980 12197137
3673 12197137 14574652 12468636 11069945 12695727 11328239 11533442 9878637 11409506
3665 11409506 13031444 12832636 13263760 12481963 12170735 11588951 13047421 13870844 15270684
3656 15270684 14644552 15810035 21993162 23316605 24220436 20836224 20085818 16771031 13783767
3647 13783767 12683783 11803113 11823834 8768968 11764411 11387444 10798570 11930422 12741002
3638 12741002 13957338 9756938 10490097 11606553 12262215 12049965 12337668 13771785 12324466
3629 12324466 12385928 10877761 12217604 12324724 12915175 10596415 12862927 12221197 13903984
$$ packed form
3690I758789P0312J326660L85260n5284K916802K32094j722249K316836q77310
3681A4351910j09018j011577J362886m857584J167118J886743j696498J103157
3673A2197137K377515k106016j398691J625782j367488K05203j654805J530869
3665A1409506J621938j98808M31124p81797l11228n81784J458470Q23423J399840
3656A5270684o26132J165483O183127J323443R03831l384212p50406l314787k987264
3647A3783767j099984q80670K0721l054866K995443l76967n88874J131852Q10580
3638A2741002J216336m200400P33159J116456O55662k12250K87703J434117j447319
3629A2324466O1462j508167J339843J07120N90451k318760K266512o41730J682787
$$ plain form
3620 13903984 13909843 13072395 11025904 12634583 9380713 9837600 9541037 8432453 9480238
3611 9480238 8997857 8661850 7274058 10404104 9380047 8777743 8533601 10331816 9768655
3602 9768655 7173958 9674345 10197981 8322422 10912717 9798827 10138639 7396612 8739853
3593 8739853 10060271 8699288 9163105 9361266 8558820 10143295 10004879 7689823 8718783
3584 8718783 9842502 10120470 8952933 8381861 10346595 8865965 8332051 9516115 8269148
3575 8269148 7868847 10464206 9222237 9676911 8796898 10558271 8781906 9711689 8425389
3566 8425389 10406951 8771464 11368564 8851848 10817612 8705368 8142780 8761530 9033955
3557 9033955 6861146 8623132 9894498 11053536 8155039 7125100 8271481 7305162
$$ packed form
3620A3903984N859q37448k046491J608679l253870M56887k96563j108584J047785
3611I480238m82381l36007j387792L130046j024057o02304k44142J798215n63161
3602I768655k594697K500387N23636j875559K590295j113890L39812k742027J343241
3593H739853J320418j360983M63817J98161q02446J584475j38416k315056J028960
3584H718783J123719K77968j167537n71072J964734j480630n33914J184064j246967
3575H269148m00301K595359j241969M54674q80013J761373j776365R29783j286300
3566H425389J981562j635487K597100k516716J965764k112244n62588O18750K72425
3557I033955k172809J761986J271366J159038k898497j029939J146381r66319
$$ plain form
3549 7305162 10834368 10081501 7846934 8646227 9142464 9411768 9899456 8730648 12107874
3540 12107874 10230615 8941679 9571959 9829126 12125417 10213005 9282791 10638496 10879816
3531 10879816 9737433 11272016 10527627 12386171 11941877 11338547 9869427 10499469 11078001
3522 11078001 12003388 12081075 11488823 12639343 12215206 11310501 12455723 11751964 11080954
3513 11080954 11814674 11810846 12002545 11246299 12183158 11952816 14151249 11193688 10988952
3504 10988952 12807677 12487995 12615650 12399416 13881759 12058977 12974473 13455088 14894424
3495 14894424 13749044 14212737 15500536 15017960 12474900 14571420 15222595 15546446 14667976
3486 14667976 16304828 15295286 15300958 13804036 16025901 14501246 16602413 16838664 19083868
$$ packed form
3549G305162L529206p52867k234567P99293M96237K69304M87688j168808L377226
3540A2107874j877259j288936O30280K57167K296291j912412r30214J355705K41320
3531A0879816j142383J534583p44389J858544m44294o03330j469120O30042N78532
3522A1078001R25387P7687n92252J150520m24137r04705J145222p03759o71010
3513A1080954P33720l828J91699p56246R36859k30342K198433k957561k04736
3504A0988952J818725l19682J27655k16234J482343j822782R15496M80615J439336
3495A4894424j145380M63693J287799m82576k543060K096520O51175L23851q78470
3486A4667976J636852j009542N672j496922K221865j524655K101167K36251K245204
$$ plain form
3477 19083868 18510551 18095212 18443172 18793230 18238972 17132203 16388805 14257171 15086488
3468 15086488 14768237 15282367 14277120 13622446 16413800 16507514 17439716 19317682 18119838
3459 18119838 18389912 20389156 22507802 24677220 23711564 25319000 24847180 26407461 28139062
3450 28139062 26931573 26728884 26870636 27881698 28612790 31210621 29172566 33666790 34316489
3441 34316489 33842050 34067382 35899526 36955113 38038497 40131081 41655273 41363465 43595657
3432 43595657 46863889 46817188 49654849 51073073 56133253 57283068 59409572 63047816
3424 63047816 67211987 73126660 80131443 86118499 97089914 104192226 116225114 127414305
3416 127414305 138888824 147239816 157005752 171790087 184579510 199821893 215958981
$$ packed form
3477A9083868n73317m15339L47960L50058n54258j106769p43398k131634Q29317
3468A5086488l18251N14130j005247o54674K791354R3714R32202J877966j197844
3459A8119838K70074J999244K118646K169418r65656J607436m71820J560281J731601
3450B8139062j207489k02689J41752J011062P31092K597831k038055M494224O49699
3441C4316489m74439K25332J832144J055587J083384K092584J524192k91808K232192
3432D3595657L268232m6701K837661J418224N060180J149815K126504L638244
3424F3047816M164171N914673P004783N987056J0971415P102312J2032888J1189191
3416A27414305J1474519Q350992R765936J4784335J2789423J5242383J6137088
$$ plain form
3409 215958981 235763044 258785043 287994193 317707792 356465358 401741196 460901225
3402 460901225 540004645 646648992 805969817 1042450125 1364889150 1708785454
3396 1708785454 1850272935 1628463538 1243103044 895389012 640678560 460187401
3390 460187401 336854703 254624707 200006805 163998600 137122728 120386857 103723090
3383 103723090 94970010 82146763 75742476 69765308 62415524 58067172 56292024 49660589
3375 49660589 49357421 44255557 44191345 40728165 41496893 38593873 35920097 36627241 32888668
3366 32888668 31687944 31203605 28632918 27321560 26607512 25209505 25564730 23801942 24440962
3357 24440962 23706860 23926870 23302200 22110620 19625394 19229872 20146920 18658691 17495352
$$ packed form
3409B15958981J9804063K3021999K9209150K9713599L8757566M5275838N9160029
3402D60901225P9103420J06644347J59320825K36480308L22439025L43896304
3396A708785454J41487481k21809397l85360494l47714032k54710452j80491159
3390D60187401j23332698q2229996n4617902l6008205k6875872j6735871j6663767
3383A03723090q753080j2823247o404287n977168p349784m348352j775148o631435
3375D9660589l03168n101864o4212l463180P68728k903020k673776P07144l738573
3366C2888668j200724m84339k570687j311358p14048j398007L55225j762788O39020
3357B4440962p34102K20010o24670j191580k485226l95522R17048j488229j163339
$$ plain form
3348 17495352 18689330 16757475 15007303 16375920 16003635 17306698 16290211 14827203
3340 14827203 13653882 14939257 12255200 12024211 13146859 15789594 12122577 14630237
3332 14630237 16449830 15332054 13530529 13965791 15088276 14615582 13888256 14759497 13416344
3323 13416344 12467466 12641616 11078063 10146727 11413618 7844018 7250274 7869280 8584291
3314 8584291 7109100 9459276 8506643 9415507 8588319 9053146 7042788 8093029 7738738
3305 7738738 7252750 7827466 11233264 9231757 7919953 7594949 9829874 10261003 9460253
3296 9460253 6060684 8782211 9308648 8657009 6559096 8837280 9134308 10218441 8579123
3287 8579123 8790832 6137187 5991885 7694408 7823000 7283087 8361083 7197456 7583222
$$ packed form
3348A7495352J193978j931855j750172J368617l72285J303063j016487j463008
3340A4827203j173321J285375k684057k30989J122648K642735l667017K507660
3332A4630237J819593j117776j801525M35262J122485m72694p27326Q71241j343153
3323A3416344r48878J74150j563553r31336J266891l569600n93744O19006P15011
3314H584291j475191K350176r52633R08864q27188M64827k010358J050241l54291
3305G738738m85988N74716L405798k001507j311804l25004K234925M31129q00750
3296I460253l399569K721527N26437o51639k097913K278184K97028J084133j639318
3287H579123K11709k653645j45302J702523J28592n39913J077996j163627L85766
$$ plain form
3278 7583222 7600513 6346416 4818104 6984893 6362034 6255216 5987634 7409901 6747423
3269 6747423 5859378 5558295 7227145 8040068 5361404 6218353 4704381 5827656 7599278
3260 7599278 4863758 4701399 5906500 3639695 5905568 7000791 5213959 5807988 5167844
3251 5167844 4720066 6235955 6741013 6164689 4325766 5860036 6396317 7877941 3498938
3241 6691722 5279464 6723813 5422984 6496460 6949140 8204039 9687272 9098022 8227067
3232 8227067 6764335 5400390 6317173 5503815 4892115 5131599 3844731 6460447 6961861
3223 6961861 4960291 6688952 4716353 6630292 5370007 4847282 4349066 6456697 4777248
3214 4777248 5611497 5885502 5820347 6545592 4778109 5645117 7984602 8149017 9397855
$$ packed form
3278G583222J7291j254097j528312K166789o22859j06818k67582J422267o62478
3269F747423q88045l01083J668850Q12923k678664Q56949j513972J123275J771622
3260G599278k735520j62359J205101k266805K265873J095223j786832N94029o40144
3251E167844m47778J515889N05058n76324j838923J534270N36281J481624C498938
3241F691722j412258J444349j300829J073476M52680J254899J483233n89250q70955
3232H227067j462732j363945R16783q13358o11700K39484j286868K615716N01414
3223F961861k001570J728661j972599J913939j260285n22725m98216K107631j679449
3214D777248Q34249K74005o5155P25245j767483Q67008K339485J64415J248838
$$ plain form
3205 9397855 9612395 11984587 14689558 13273529 13936987 12628023 13050232 10140679 7308784
3196 7308784 7926457 7604851 7256857 6814745 5559968 7641536 5858011 6803818 6250346
3187 6250346 6294551 4889751 6516643 3899495 3653298 4528250 6146096 4410448 4983699
3178 4983699 6169925 4407512 4276813 4633979 5195582 6038132 4584108 5673794 6501936
3169 6501936 4499408 6035073 4277510 5733927 6239438 7383366 7178567 6062985 5070376
3160 5070376 5629188 6865866 6539798 6724171 6607598 6064122 6511706 6267923 9984690
3151 9984690 5716489 8207081 7466466 6192262 7873382 9121581 7256456 8261242
3143 8261242 10012027 12062318 11757660 11267467 12847803 12419142 12500912 13638653 14511013
$$ packed form
3205I397855K14540K372192K704971j416029O63458j308964M22209k909553k831895
3196G308784O17673l21606l47994m42112j254777K081568j783525R45807n53472
3187F250346M4205j404800J626892k617148k46197Q74952J617846j735648N73251
3178D983699J186226j762413j30699L57166N61603Q42550j454024J089686Q28142
3169F501936k002528J535665j757563J456417N05511J143928k04799j115582r92609
3160E070376N58812J236678l26068J84373j16573n43476M47584k43783L716767
3151I984690m268201K490592p40615j274204J681120J248199j865125J004786
3143H261242J750785K050291l04658m90193J580336m28661Q1770J137741Q72360
$$ plain form
3134 14511013 15108549 15644530 17578472 16780608 18406714 18641581 19584650 21894938 22461080
3125 22461080 22135654 20214936 22908592 24595122 22127580 25302909 25539814 23801410
3117 23801410 25388120 22546198 22423664 24897044 22887116 22897240 24746258 22708546 21094932
3108 21094932 23184740 21279184 21687933 21504690 23353224 22452878 23374788 22221452 24584926
3099 24584926 24539418 23285600 24610036 26511672 27170066 26762529 27658166 27478821 30483405
3090 30483405 29692182 30599671 32423549 31427907 34391525 35632529 38718445 39523205 39419977
3081 39419977 38496485 30798321 28394653 26520730 21842370 18962680 17157123 15095905
3073 15095905 15027884 12483110 13134807 12364890 13003692 11893932 12232121 11396831 11663699
$$ packed form
3134A4511013N97536N35981J933942p97864J626106K34867R43069K310288N66142
3125B2461080l25426j920718K693656J686530k467542L175329K36905j738404
3117B3801410J586710k841922j22534K473380k009928J0124J849018k037712j613614
3108B1094932K089808j905556M08749j83243J848534r00346R21910j153336K363474
3099B4584926m5508j253818J324436J901636O58394m07537Q95637j79345L004584
3090C0483405p91223R07489J823878r95642K963618J241004L085916Q04760j03228
3081C9419977r23492p698164k403668j873923m678360k879690j805557k061218
3073A5095905o8021k544774O51697p69917O38802j109760L38189q35290K66868
$$ plain form
3064 11663699 14323150 11684375 10948348 10728135 11737148 10426884 10145821 10377421 10987232
3055 10987232 11579560 10251340 11044000 11381278 11788593 9980007 10942366 8138530 9781356
3046 9781356 8762184 10127939 6838629 9090243 9871732 8550636 8691359 7720122 8265073
3037 8265073 8237440 9779188 9095363 10451495 8246449 8190744 7711725 10979444 9654822
3028 9654822 10491501 7699139 8908147 11267017 9985156 7239908 10485527 9882507 6399214
3019 6399214 9673015 6974878 6979201 8349892 9573202 9080163 8063996 6756874 6060797
3010 6060797 10031521 9464983 10268635 6872246 9208068 7562117 7222929 8849085 9267873
3001 9267873 10069080 9042159 9694441 9186204 9591768 9365929 9367175 9075223 10047449 9306995
$$ packed form
3064A1663699K659451k638775p36027k20213J009013j310264k81063K31600O09811
3055A0987232N92328j328220P92660L37278M07315j808586R62359k803836J642826
3046I781356j019172J365755l289310K251614P81489j321096J40723r71237N44951
3037H265073k7633J541748o83825J356132k205046n5705m79019L267719j324622
3028I654822Q36679k792362J209008K358870j281861k745248L245619o03020l483293
3019F399214L273801k698137M323J370691J223310m93039j016167j307122o96077
3010F060797L970724n66538Q03652l396389K335822j645951l39188J626156M18788
3001I267873Q01207j026921O52282n08237M05564k25839J246k91952R72226p40454
$$ plain form
2991 9306995 10371054 11375774 10295603 12192716 10764521 11653669 12063100 13474221 15098850
2982 15098850 14657975 16360884 16538391 18151486 21583738 26179239 36394861 46763833
2974 46763833 41537013 40146761 44977660 41491909 26401396 19051304 15097063 12040995
2966 12040995 11046453 8936345 9092050 10586775 10267831 11240246 8769937 8611810 9345757
2957 9345757 7452546 6833862 8711956 8608314 9407889 7922550 7221642 8566030 8907732
2948 8907732 5731634 6769642 6464281 7089025 5602006 5902955 7762343 7300456 5498029
2939 5498029 7610997 6572325 9827067 8238087 7904997 6381353 8188548 8169284 7274649
2930 7274649 6477590 6431489 6902423 7518146 5740448 6019167 6984617 7102410 5463855
$$ packed form
2991I306995J064059J004720j080171J897113j428195Q89148M09431J411121J624629
2982A5098850m40875J702909J77507J613095L432252M595501J0215622J0368972
2974D6763833n226820j390252M830899l485751j5090513p350092l954241l056068
2966A2040995r94542k110108J55705J494725l18944R72415k470309j58127P33947
2957I345757j893211o18684J878094j03642P99575j485339p00908J344388L41702
2948H907732l176098J038008l05361O24744j487019L00949J859388m61887j802427
2939E498029K112968j038672L254742j588980l33090j523644J807195j9264q94635
2930G274649p97059m6101M70934O15723j777698K78719R65450J17793j638555
$$ plain form
2921 5463855 6539598 6297303 5614394 8443864 8257408 7631566 7318733 5353658 7191435
2912 7191435 7256537 6103335 5915205 7216568 5214134 9487867 5380383 8691534 7583333
2903 7583333 7465210 6894339 5624134 8250927 7934845 6203151 7640830 7293161 5577415
2894 5577415 7754934 6014807 5283608 6481553 5250778 7317530 6791203 7645688 6083522
2885 6083522 8727525 7104066 9609949 8870580 5122461 7495275 7321801 8186167 7370451
2876 7370451 5772837 9097936 5753895 6839406 5181504 8823579 8382170 7147772
2868 7147772 6602293 8674501 8101310 8017059 7171860 8362006 7694592 7497264 7015921
2859 7015921 7115708 6897017 7409144 7990221 6090718 6866694 5757925 6785019 7731738
$$ packed form
2921E463855J075743k42295o82909K829470j86456o25842l12833j965075J837777
2912G191435O5102j153202j88130J301363k002434M273733m107484L311151j108201
2903G583333j18123n70871j270205K626793l16082j731694J437679l47669j715746
2894E577415K177519j740127p31199J197945j230775K066752n26327Q54485j562166
2885F083522K644003j623459K505883p39369l748119K372814j73474Q64366q15716
2876G370451j597614L325099l344041J085511j657902L642075m41409j234398
2868G147772n45479K072208n73191q4251q45199J190146o67414j97328m81343
2859G015921R9787k18691N12127N81077j899503P75976j108769J027094R46719
$$ plain form
2850 7731738 6304440 7918225 6399963 7324038 6889908 7790764 10426044 7760323 10813976
2841 10813976 6765637 8653456 8077950 6639990 7722536 7330940 7499767 8466337 6993862
2832 6993862 7466756 6171640 7222397 6519726 6530873 6349081 8508085 7058377 7994426
2823 7994426 6679471 7924072 8133332 8669677 7272162 8776498 9043059 6360567 9181825
2814 9181825 7819871 9100522 8088647 8487649 9817838 6998774 9039593 9670659 9994537
2805 9994537 9650965 11290125 12360849 8622669 8283873 9196196 9283878 8624893 10070125
2796 10070125 11408833 11281787 12774635 12803152 14872783 14284189 15374215 17340584 17078762
2787 17078762 16558989 15583295 16737590 16834672 17808815 18645844 20614216 19733146 21109806
$$ packed form
2850G731738j427298J613785j518262R24075m34130R00856K635280k665721L053653
2841A0813976m048339J887819n75506j437960J082546l91596J68827R66570j472475
2832F993862M72894j295116J050757p02671J1147j81792K159004j449708R36049
2823G994426j314955J244601K09260N36345j397515J504336K66561k682492K821258
2814I181825j361954J280651j011875L99002J330189k819064K040819O31066L23878
2805I994537l43572J639160J070724l738180l38796R12323Q7682o58985J445232
2796A0070125J338708j27046J492848K8517K069631n88594J090026J966369k61822
2787A7078762n19773r75694J154295R7082R74143Q37029J968372q81070J376660
$$ plain form
2778 21109806 22434794 21519510 22319426 22409718 21818318 25279376 24251668 27021865 27406812
2769 27406812 29613385 31290493 31985515 31185552 28699952 26461510 24261784 23863276 21836538
2760 21836538 18870476 22928480 30450203 46513761 68902596 68064628 37339102 22705452
2752 22705452 18278944 14902193 10866344 11736387 10276930 11135139 8874582 7994468 9594956
2743 9594956 7518906 7140303 6724091 5166880 8385366 9883761 7318664 7916313 6856420
2734 6856420 7429464 8333178 7623465 8509203 5749008 8170777 7514835 7033464 7403952
2725 7403952 7620473 9459424 6092153 8184524 6981369 6507776 8806075 8014509 8423659
2716 8423659 7569434 7959565 6853245 6976565 6698651 8340697 4989500 6536061 6783349
$$ packed form
2778B1109806J324988r15284P99916R0292n91400L461058j027708K770197L84947
2769B7406812K206573J677108O95022p99963k485600k238442k199726l98508k026738
2760B1836538k966062M058004P521723J6063558K2388835q37968l0725526j4633650
2752B2705452m426508l376751m035849Q70043j459457Q58209k260557q80114J600488
2743I594956k076050l78603m16212j557211L218486J498395k565097N97649j059893
2734F856420N73044R03714p09713Q85738k760195K421769o55942m81371L70488
2725G403952K16521J838951l367271K092371j203155m73593K298299p91566M09150
2716H423659q54225L90131j106320J23320k77914J642046l351197J546561K47288
$$ plain form
2707 6783349 5724271 8196802 7860225 5022917 6012092 6589377 5751932 7787226 7997925
2698 7997925 6886543 6532777 6059656 5880783 7287289 7341031 7545006 7285592 7693134
2689 7693134 8146552 7769079 8200031 8463867 9584864 10369632 10550040 8860575 10882470
2680 10882470 13441623 11633762 14621793 12421355 13217995 16190635 15720397 16061339 18066024
2671 18066024 20715664 26394407 30436152 41756041 72859700 102001579 88739987 53421052
2663 53421052 36462894 28890844 26035800 26407906 29140158 40088441 64408372 78489683
2655 78489683 56499908 35474625 28874827 26155762 27871315 32622657 47138569 82635499
2647 82635499 104185170 72625428 42211793 31381157 27842121 24774404 28111519 35545698
$$ packed form
2707F783349j059078K472531l36577k837308R89175N77285q37445K035294K10699
2698G997925j111382l53766m73121j78873J406506N3742K03975k59414M07542
2689G693134M53418l77473M30952K63836J120997P84768J80408j689465K021895
2680A0882470K559153j807861K988031k200438P96640K972640m70238L40942K004685
2671A8066024K649640N678743M041745J1319889L1103659K9141879j3261592l5318935
2663E3421052j6958158p572050k855044L72106K732252J0948283K4319931J4081311
2655G8489683k1989775k1025283o599798k719065J715553M751342J4515912L5496930
2647H2635499K1549671l1559742l0413635j0830636l539036l067717L337115P434179
$$ plain form
2639 35545698 57831060 72290643 50091741 28384979 20883722 18914838 16765266 16911682
2631 16911682 20968862 30157832 36808469 27769954 16670879 13567969 8692386 10072000
2623 10072000 8372072 9996677 7864109 8377622 8283337 8352984 6741339 9367229 8226483
2614 8226483 9484146 9394038 6739633 11484149 11333584 11977298 14107386 15922420 14930435
2605 14930435 14963249 14463369 13096120 11303703 11198409 7823360 10112517 8418098 9441824
2596 9441824 8060114 8159117 7158962 7686654 3984071 4799153 5328855 5563314 5397339
2587 5397339 4286371 4712890 7340382 6942015 4621480 3367383 6155115 2869280 5560649
2578 5560649 3574057 3204667 3111025 4492475 2245047 4722958 3188814 5442299 4706652
$$ packed form
2639C5545698K2285362J4459583k2198902k1706762p501257j968884k149572J46416
2631A6911682M057180R188970O650637r038515j1099075l102910m875583J379614
2623A0072000j699928J624605k132568N13513r4285O9647j611645K625890j140746
2614H226483J257663r0108k654405M744516j50565O43714K130088J815034r91985
2605A4930435L2814m99880j367249j792417j05294l375049K289157j694419J023726
2596I441824j381710R9003j000155N27692l702583Q15082N29702K34459j65975
2587E397339j110968M26519K627492l98367k320535j254097K787732B869280K691369
2578E560649j986592l69390r3642J381450B245047K477911j534144K253485p35647
$$ plain form
2569 4706652 3309180 2305086 5540513 2835044 4793783 4572475 3415335 2778390 3866017
2560 3866017 1415631 3830492 3490833 4799726 3786487 3686127 3653222 1750632 1468067
2551 1468067 5094200 3870482 3522283 4578181 2552469 4710080 3329397 2621758 2311113
2542 2311113 2830085 2805980 3290714 2707122 3360036 4165640 2871851 5781744 3808315
2533 3808315 3299302 2158749 2950896 3806807 3071654 3239427 5259600 3774579 3327542
2524 3327542 2979164 4836610 2620839 3656989 3368664 4440542 3148076 3954777 5348925
2515 5348925 4729513 4870967 2118630 2559582 4480664 4854647 4305225 4710423 4926965
2506 4926965 2261450 4451933 5405170 3643623 3695173 5082118 4207027 2605711 4028652
$$ packed form
2569D706652j397472j004094L235427k705469J958739k21308j157140o36945J087627
2560C866017A415631K414861l39659J308893j013239j00360l2905A750632k82565
2551A468067L626133j223718l48199J055898k025712K157611j380683p07639l10645
2542B311113N18972k4105M84734n83592O52914Q05604j293789K909893j973429
2533C808315n09013j140553P92147Q55911p35153J67773K020173j485021m47037
2524C327542l48378J857446k215771J036150k88325J071878j292466Q06701J394148
2515E348925o19412J41454B118630M40952J921082L73983n49422M05198K16542
2506D926965B261450K190483R53237j761547N1550J386945q75091j601316J422941
$$ plain form
2497 4028652 5200168 4336392 4692996 6038657 3772644 4461416 5569546 3446148 3699486
2488 3699486 5221152 6003651 4078558 5802995 5289866 6022020 4940153 4839048 3642600
2479 3642600 6187008 5770461 5278384 5086353 7144935 5292863 5980808 5928842 6395753
2470 6395753 5796207 3229418 5484646 7084956 4487182 4943101 7392039 5357372 8465137
2461 8465137 7247028 5544532 6262702 7128078 5037855 5184288 5528880 5198856 5317806
2452 5317806 6435014 5566392 6228294 5991478 5076055 6070914 6371346 5063113 5543682
2443 5543682 3161062 4176585 4965096 4691035 3250947 3737524 3588327 6148609 2698129
2433 3684108 7051342 5009034 5102690 4924627 4604557 3416732 5938138 5197022 5826460
$$ packed form
2497D028652J171516q63776L56604J345661k266013O88772J108130k123398K53338
2488C699486J521666P82499j925093J724437n13129P32154j081867j01105j196448
2479C642600K544408m16547m92077j92031K058582j852072O87945n1966M66911
2470F395753n99546k566789K255228J600310k597774M55919K448938k034667L107765
2461H465137j218109j702496P18170Q65376k090223J46433L44592l30024J18950
2452E317806J117208q68622O61902k36816r15423R94859L00432j308233M80569
2443E543682k382620J015523P88511k74061j440088M86577j49197K560282B698129
2433C684108L367234k042308R3656j78063l20070j187825K521406p41116O29438
$$ plain form
2424 5826460 5767032 4904324 7256337 7784387 5369667 4079620 6507504 7487580 5312410
2415 5312410 7452405 6995889 4827415 5900699 6841886 7801199 4885968 6451303 6868868
2406 6868868 4109988 4056689 6006490 7443749 6625655 3966727 8015047 5167386 6725221
2397 6725221 8252994 7472799 5703744 6312863 8259731 7271788 8489103 5710500 8112823
2388 8112823 9250259 8598269 9876547 10013832 10708019 10073263 9607868 10359091 9120035
2379 9120035 9277713 7735725 7658726 7795168 8251417 6523667 5371182 6593062 8160402
2370 8160402 8213165 7819467 7090394 9007654 6963363 5266897 8231183 7984800 10413565
2361 10413565 8471475 8784626 7413573 9080994 8742686 7236079 9472539 9271871 9022955
$$ packed form
2424E826460n9428q62708K352013N28050k414720j290047K427884R80076k175170
2415E312410K139995m56516k168474J073284R41187R59313k915231J565335M17565
2406F868868k758880n3299J949801J437259q18094k658928M048320k847661J557835
2397F725221J527773p80195j769055O09119J946868r87943J217315k778603K402323
2388H112823J137436o51990J278278J37285O94187o34756m65395P51223j239056
2379I120035J57678j541988p6999J36442M56249j727750j152485J221880J567340
2370H160402N2763l93698p29073J917260k044291j696466K964286k46383K428765
2361A0413565j942090L13151j371053J667421l38308j506607K236460k00668k48916
$$ plain form
2352 9022955 8662492 9009008 9923826 9930266 6931939 8623535 8911596 7140684 8040128
2343 8040128 10051800 9277569 8584743 9032359 7622883 7241287 7365730 9014161 7183540
2334 7183540 7648645 8600519 9065837 9022723 8720592 8178570 9522390 7832330 6985084
2325 6985084 10056310 10026760 9994990 8965123 7857859 9906713 9905004 9025080 8568133 9550192
2315 9550192 8834018 9016687 10026686 9692329 8469695 6996797 9047488 9583738 8757889
2306 8757889 11090015 9704809 7838585 8368016 9277454 8559278 8598989 8535688 8851328
2297 8851328 9337521 9193385 10873905 8464988 9417804 7829819 9692631 8981694 8515702
2288 8515702 9712983 9756495 10628923 10205535 9576035 6323516 10491198 9198658 9349662
$$ packed form
2352I022955l60463L46516R14818O440k998327J691596K88061j770912Q99444
2343H040128K011672p74231o92826M47616j409476l81596J24443J648431j830621
2334G183540M65105R51874M65318m3114l02131n42022J343820j690060q47246
2325F985084L071226k9550l1770j029867j107264K048854j709q79924m56947R82059
2315I550192p16174J82669J009999l34357j222634j472898K050691N36250q25849
2306H757889K332126j385206j866224N29431R09438p18176L9711o3301L15640
2297H851328M86193j44136J680520k408917R52816j587985J862812p10937m65992
2288H515702J197281M3512Q72428m23388o29500l252519M167682j292540J51004
$$ plain form
2279 9349662 9611599 8517478 10969079 11110848 10085264 8954048 9928426 9005580 9778381
2270 9778381 8835508 8779144 6291580 8064526 7626517 7016488 7739169 10700055 9350155
2261 9350155 7867843 6205345 7801692 9302553 6214012 7554976 8498328 6586420
2253 6586420 7418887 5643881 6705792 7063965 7423176 6617773 6377829 7721995 9084604
2244 9084604 6037193 8492585 5316486 6111623 4801400 8156259 6636622 7718780
2236 7718780 6663452 8754751 6522929 8253661 6936524 9090328 9683518 5954052
2228 5954052 8211238 9056076 7433408 8432282 11251607 8488907 8763053 8585565 6350842
2219 6350842 6007402 8089465 8686176 6782502 8902689 9115851 7896175 9018053 9062730
$$ packed form
2279I349662K61937j094121K451601J41769j025584j131216R74378r22846P72801
2270I778381r42873n6364k487564J772946m38009o10029P22681K960886j349900
2261I350155j482312j662498J596347J500861l088541J340964R43352j911908
2253F586420Q32467j775006J061911L58173L59211q05403k39944J344166J362609
2244I084604l047411K455392l176099P95137j310223L354859j519637J082158
2236G718780j055328K091299k231822J730732j317137K153804N93190l729466
2228E954052K257186Q44838j622668R98874K819325k762700K74146j77488k234723
2219F350842l43440K082063N96711j903674K120187K13162j219676J121878M4677
$$ plain form
2210 9062730 10695799 11511223 11027496 9823162 11339065 12763877 10269685 9932433 10762703
2201 10762703 11980116 10200955 11320729 10201244 11829366 11329610 11658858 11208395 11018696
2192 11018696 13846065 13916358 14141336 14403756 14030621 13743298 14198991 12401295 14019683
2183 14019683 12997909 12053017 12038987 12379606 11990739 11073359 10645916 11007130 12400405
2174 12400405 13169103 11453375 13035335 11905652 13753829 14305079 13903193 14058405 13362449
2165 13362449 14670098 15133395 14800648 17164468 15026976 15380872 13412847 14013903 12464101
2156 12464101 13071266 15064499 11061345 13456834 13793207 12733756 12195747 12242769 11340359
2147 11340359 14688117 14658632 12096185 13847066 12105285 13060886 9853227 11492668 12040681
$$ packed form
2210I062730J633069Q15424m83727j204334J515903J424812k494192l37252Q30270
2201A0762703J217413j779161J119774j119485J628122m99756L29248m50463j89699
2192A1018696K827369P0293K24978K62420l73135k87323M55693j797696J618388
2183A4019683j021774r44892j4030L40619l88867r17380m27443L61214J393275
2174A2400405P68698j715728J581960j129683J848177N51250m01886J55212o95956
2165A3362449J307649M63297l32747K363820k137492L53896j968025O01056j549802
2156A2464101O07165J993233m003154K395489L36373j059451n38009M7022r02410
2147A1340359L347758k9485k562447J750881j741781R55601l207659J639441N48013
$$ plain form
2138 12040681 10795833 12934007 10879984 11640139 10432983 10205898 11960295 13255549
2130 13255549 13716626 12844368 14125760 11634468 14019638 12444882 12942338 12452613 13502208
2121 13502208 10551011 13391079 11091981 10837229 10192244 10755147 10796993 8008000 9373155
2112 9373155 9798920 9568957 9917457 6704710 9405286 11520279 9629240 10988741 10026455
2103 10026455 11987441 9567087 11776271 9526102 11063027 10549231 10875958 11163655 11929115
2094 11929115 11386524 10987042 10863719 11358216 11463001 11630272 12392687 11731855 14965806
2085 14965806 12128921 10782960 14909376 11874777 13123072 12364465 12242000 15808466
2077 15808466 12475864 11867926 12725394 13161979 12503937 13804203 12594423 13502621 15586274
$$ packed form
2138A2040681j244848K138174k054023P60155j207156k27085J754397J295254
2130A3255549M61077q72258J281392k491292K385170j574756M97456m89725J049595
2121A3502208k951197K840068k299098k54752o44985N62903M1846k788993J365155
2112I373155M25765k29963L48500l212747K700576K114993j891039J359501r62286
2103A0026455J960986k420354K209184k250169J536925n13796L26727K87697P65460
2094A1929115n42591l99482j23323M94497J04785J67271P62415o60832L233951
2085A4965806k836885j345961M126416l034599J248295p58607j22465L566466
2077A5808466l332602o07938Q57468M36585o58042J300266j209780R08198K083653
$$ plain form
2068 15586274 11935826 12880286 15252930 13461026 12933367 13357891 15577060 15377031 16140351
2059 16140351 14703596 18855922 16166697 16816836 17826950 19481818 18066412 20491660
2051 20491660 19783002 19194866 19467768 19467986 18071888 18214030 17555742 17652920 16927493 19199900
2041 19199900 16355958 21627554 18401790 19524609 17511352 17535296 15959181 19856558
2033 19856558 20080618 17326297 18074369 17041770 17663747 18834658 19031488 19873002 20512268
2024 20512268 19278968 17700326 19334070 19022778 22686074 18817634 19082969 20978420
2016 20978420 19810870 20465584 20736902 19651592 21075452 21345482 20341238 20415248 18906530
2007 18906530 18387324 19693798 18767120 21399404 19487428 20930752 18290166 16658304
$$ packed form
2068A5586274l650448R44460K372644j791904n27659M24524K219169k00029P63320
2059A6140351j436755M152326k689225O50139J010114J654868j415406K425248
2051B0491660p08658n88136K72902K18j396098J42142o58288R7178p25427K272407
2041A9199900k843942N271596l225764J122819k013257K3944j576115L897377
2033A9856558K24060k754321P48072j032599O21977J170911J96830Q41514O39266
2024B0512268j233300j578642J633744l11292L663296l868440K65335J895451
2016B0978420j167550O54714K71318j085310J423860K70030j004244P4010j508718
2007A8906530n19206J306474r26678K632284j911976J443324k640586j631862
$$ plain form
1999 16658304 19310984 20004802 19838020 21637245 22747028 23002382 32826193 48586708
1991 48586708 63066196 44641865 29497610 23972660 21278236 18592878 17093150 18194800
1983 18194800 18127268 17157938 15491996 14412662 17976456 15362331 17504022 14594083 17014136
1974 17014136 13991958 17629106 15921516 18120880 15595806 16226781 14089142 17939298
1966 17939298 15403134 15616867 15329287 13641845 14061997 16650015 14193247 13807182 14067898
1957 14067898 12200938 13489740 12896151 10959500 10877111 10766064 12024977 11804942 9475167
1948 9475167 8405886 10661105 9348930 12095182 10079459 9011811 8984444 9509646 9085142
1939 9085142 7687882 7566688 9731144 8776468 10040171 7962961 8706736 9849762 9140151
$$ packed form
1999A6658304K652680O93818j66782J799225J109783K55354R823811J5760515
1991D8586708J4479488j8424331j5144255n524950k694424k685358j499728J101650
1983A8194800o7532r69330j665942j079334L563794k614125K141691k909939K420053
1974A7014136l022178L637148j707590K199364k525074O30975k137639L850156
1966A7939298k536164K13733k87580j687442M20152K588018k456768l86065K60716
1957A4067898j866960J288802n93589j936651q2389j11047J258913k20035k329775
1948I475167j069281K255219j312175K746252k015723j067648k7367N25202m24504
1939I085142j397260j21194K164456r54676J263703k077210P43775J143026p09611
$$ plain form
1930 9140151 8687442 10956824 10250461 9951619 9461518 9246180 8844053 10488578 8313610
1921 8313610 7457641 8688174 8288223 10414004 9947252 8615540 8639630 10405081 10051176
1912 10051176 10853002 12064249 8660569 9197618 10659665 12603227 9787881 9804248 10543238
1903 10543238 10535943 11795862 10732219 9578727 11195680 9549139 9858895 9900037 10129898
1894 10129898 10358756 10501842 11240495 8964096 9155121 9555983 8649665 10341527 11534994
1885 11534994 10321385 11021875 12860108 11571841 11466921 13471217 13868294 13297319 14051361
1876 14051361 13917295 13984949 15397797 14434420 14130333 14852019 16086145 15647208 13683333
1867 13683333 14811116 14447246 13283572 13774867 15461671 15771760 16410214 16811978 18461220
$$ packed form
1930I140151m52709K269382p06363k98842m90101k15338m02127J644525k174968
1921H313610q55969J230533l99951K125781m66752j331712K4090J765451l53905
1912A0051176Q01826J211247l403680N37049J462047J943562k815346J6367P38990
1903A0543238p295J259919j063643j153492J616953j646541L09756M1142K29861
1894A0129898K28858J43086P38653k276399J91025M00862r06318J691862J193467
1885A1534994j213609P00490J838233j288267j04920K004296L97077n70975P54042
1876A4051361j34066O7654J412848r63377l04087P21686J234126m38937j963875
1867A3683333J127783l63870j163674M91295J686804L10089O38454M01764J649242
$$ plain form
1858 18461220 14737944 17100046 19238608 17456994 20553376 18205122 18487108 18089698
1850 18089698 18263732 20754326 18277148 19393218 19038370 20284738 18714066 20732490
1842 20732490 19710262 20230814 22022120 21836908 22743668 21820510 22690922 23454184 25247368
1833 25247368 23956303 22137906 23233774 22414652 23530462 22725398 21622674 21615448 21725350
1824 21725350 20717294 21339030 18657890 19669658 19472102 19762603 20041550 18385926 19107929
1815 19107929 19258272 18739894 19293458 19875040 19315662 18861818 18370544 19005036 20001298
1806 20001298 19750938 19004500 20750058 19997750 20120218 17845037 17940162 18965700 17590416
1797 17590416 18632672 19262448 19285562 18342374 18380446 17561976 18644316 18912746 18857872 17510214
$$ packed form
1858A8461220l723276K362102K138562j781614L096382k348254K81986l97410
1850A8089698J74034K490594k477178J116070l54848J246368j570672K018424
1842B0732490j022228N20552J791306j85212R06760r23158Q70412P63262J793184
1833B5247368j291065j818397J095868q19122J115810q05064j102724p226J09902
1824B1725350j008056O21736k681140J011768j97556K90501K78947j655624P22003
1815A9107929J50343n18378N53564N81582n59378m53844m91274O34492R96262
1806B0001298k50360p46438J745558p52308J22468k275181R5125J025538j375284
1797A7590416J042256O29776K3114r43188L8072q18470J082340K68430n4874j347658
$$ plain form
1787 17510214 16630070 15609154 18252598 15726876 15473163 16428332 12897751 15376657 15008751
1778 15008751 14478441 15187471 15222909 13221554 14510292 12412198 12645251 15288154 15017686
1769 15017686 14588133 13182096 12207341 13559261 15948650 13559190 13982833 11980390 13266522
1760 13266522 12391573 12676162 12107908 11748333 11754773 12812131 11501477 12211002 12873018
1751 12873018 10635375 12253030 13732770 13095018 12084826 13335327 11840841 13094771
1743 13094771 12488239 11649341 13292972 13376904 14512990 14338785 14699358 13874330 14210993
1734 14210993 13152207 14245560 16244808 14369364 13199210 15430865 15487976 15957854 15850103
1725 15850103 18583542 18958337 15252620 18509360 17399106 16740547 18072325 17562688 18108110
$$ packed form
1787A7510214q80144j020916K643444k525722k53713R55169l530581K478906l67906
1778A5008751n30310P09030L5438k001355J288738k098094K33053K642903k70468
1769A5017686m29553j406037r74755J351920K389389k389460M23643k002443J286132
1760A3266522q74949K84589n68254l59575O440J057358j310654P09525O62016
1751A2873018k237643J617655J479740o37752j010192J250501j494486J253930
1743A3094771o06532q38898J643631Q3932J136086j74205L60573q25028L36663
1734A4210993j058786J093353J999248j875444j170154K231655N7111M69878j07751
1725A5850103K733439L74795l705717L256740j110254o58559J331778n09637N45422
$$ plain form
1716 18108110 19110231 17384598 18258120 20129566 19772158 19538066 20477888 19874918 22050471
1707 22050471 21033824 22671942 23505174 23782706 25069748 25292416 27899072 26154074 26007196
1698 26007196 29026129 30649196 29747510 28317687 30972972 30659074 32930442 33944366
1690 33944366 34213609 38197762 37965329 41154125 42564429 44376276 45991248 48398873
1682 48398873 50431524 51582601 56605592 58047888 61946788 64079908 65970452 69391091
1674 69391091 69491260 70100668 70806651 73783155 73556515 75691228 77587011 79275131 82284259
1665 82284259 85700299 87402618 91559811 95578643 98281754 104288962 108305458 114758609
1657 114758609 120929017 130341793 138571353 151265880 163083992 178115559 194735062
$$ packed form
1716A8108110J002121j725633Q73522J871446l57408k34092R39822o02970K175553
1707B2050471j016647J638118Q33232K77532J287042K22668K606656j744998j46878
1698B6007196L018933J623067r01686j429823K655285l13898K271368J013924
1690C3944366K69243L984153k32433L188796J410304J811847J614972K407625
1682D8398873K032651J151077N022991J442296L898900K133120J890544L420639
1674F9391091J00169O09408P05983K976504k26640K134713J895783J688120L009128
1665H2284259L416040J702319M157193M018832K703111O007208M016496O453151
1657A14758609O170408R412776Q229560J2694527J1818112J5031567J6619503
$$ plain form
1650 194735062 204545013 214592548 214409525 206672581 197645910 186846582 167305143 146337896
1642 146337896 123555225 103308698 84110923 71022516 59081972 50014125 42037817
1635 42037817 40749153 38480149 33368590 32852654 30337126 28077452 26985518 26723892
1627 26723892 24902742 24333032 22330151 22952468 23168876 21140148 20649578 19543260 19882552
1618 19882552 18519368 18529456 19153124 18483574 18662596 18149748 17653710 17076190 16757828
1609 16757828 15414713 16778364 12205116 14300633 13315445 10404132 11750599 11573473
1601 11573473 12850930 11552726 12133621 13353315 12665217 11144442 10119008 11983569
1593 11983569 11885564 11982045 10838353 9209096 8926799 11126626 11230515 9054871 8407584
$$ packed form
1650A94735062R809951J0047535j83023p736944r026671j0799328j9541439k0967247
1642A46337896k2782671k0246527j9197775j3088407j1940544r067847p976308
1635D2037817j288664k269004n111559n15936k515528k259674j091934k61626
1627B6723892j821150n69710k002881O22317K16408k028728m90570j106318L39292
1618A9882552j363184J0088O23668o69550J79022n12848m96038n77520l18362
1609A6757828j343115J363651m573248K095517r85188k911313J346467j77126
1601A1573473J277457j298204N80895J219694o88098j520775j025434J864561
1593A1983569r8005R6481j143692j629257k82297K199827J03889k175644o47287
$$ plain form
1584 8407584 7676300 8691440 10902585 8639873 11894777 8274196 8495915 7820374 6316758
1575 6316758 8372349 8062105 7990005 7112727 6623542 7086986 6288551 8728345 6668553
1566 6668553 6233699 9427587 5442761 5539509 6124838 7341050 8171699 7763269 6763852
1557 6763852 7987865 7362209 5645719 5703001 5471575 6388581 5606342 7994735 5317980
1548 5317980 7592222 4723610 7783240 5494037 6559525 6058397 7543192 6635805 6195299
1539 6195299 7774528 6500399 6259227 9006442 8210199 8817050 8010099 7433532 7531279
1530 7531279 9633088 6162138 7282537 6335749 6613954 7145005 10203553 7402429 8817383
1521 8817383 9861938 9034981 9736577 8723487 9653909 10899049 9747586 10990142 11602313
$$ packed form
1584H407584p31284J015140K211145k262712L254904l620581K21719o75541j503616
1575F316758K055591l10244p2100q77278m89185M63444p98435K439794k059792
1566F668553m34854L193888l984826R6748N85329J216212Q30649m08430r99417
1557F763852J224013o25656j716490N7282k31426R17006p82239K388393k676755
1548E317980K274242k868612L059630k289203J065488n01128J484795r07387m40506
1539F195299J579229j274129k41172K747215p96243O06851q06951n76567R7747
1530G531279K101809l470950J120399r46788K78205N31051L058548k801124J414954
1521H817383J044555q26957P01596j013090R30422J245140j151463J242556O12171
$$ plain form
1512 11602313 9131339 10287824 10737823 10935322 12629115 10901343 12429292 13408698 14511799
1503 14511799 16462191 16749024 17237050 20286210 20744698 25717797 27812872 28130612 25375832
1494 25375832 22347744 20642238 19892366 16948514 17988490 17348370 16002451 16798886 14019371
1485 14019371 16743794 16223981 15321127 16717176 15603149 15644840 15718944 16672805 16604841
1476 16604841 16409329 15050361 15565450 14207627 14872626 13251262 14274373 16870076 16708454
1467 16708454 14688448 15959006 16799934 18638530 21600723 20780372 22662196 22510178 24813181
1458 24813181 26025156 24000880 26304245 26050452 24980718 21622922 19929024 16758900
1450 16758900 17294434 15331438 15213362 13686031 13145705 15511920 13408117 12983141 13207327
$$ packed form
1512A1602313k470974J156485M49999J97499J693793j727772J527949R79406J103101
1503A4511799J950392K86833M88026L049160M58488M973099K095075L17740k754780
1494B5375832l028088j705506p49872k943852J039976o40120j345919P96435k779515
1485A4019371K724423n19813r02854J396049j114027M1691P4104R53861o7964
1476A6604841j95512j358968N15089j357823O64999j621364J023111K595703j61622
1467A6708454k020006J270558Q40928J838596K962193q20351J881824j52018K303003
1458B4813181J211975k024276K303365k53793j069734l357796j693898l170124
1450A6758900N35534j962996j18076j527331n40326K366215k103803m24976K24186
$$ plain form
1441 13207327 9744361 12532472 11595781 11074277 12379948 14150514 13842304 15198386 14976651
1432 14976651 15810039 16925204 18703620 19657428 18145243 19103784 18426590 17323236 14405697
1423 14405697 14134746 14717687 12825109 12192006 10805471 9682579 10076237 9744416 9687851
1414 9687851 8843853 8845888 9299273 8662801 8540898 6618612 8459858 5328116 5703420
1405 5703420 5424547 8378932 5609827 7251856 5404892 5587404 6135934 4573928 5288817
1396 5288817 5230116 6448885 5639337 4992472 4641379 7504566 6101558 4926680 7702111
1387 7702111 6392280 5630628 5650401 7367882 4796248 6039743 5294324 4831801 5149376
1378 5149376 6011964 7685040 5914923 7295929 4890527 7318608 4834143 6884215
$$ packed form
1441A3207327l462966K788111r36691n21504J305671J770566l08210J356082k21735
1432A4976651Q33388J115165J778416R53808j512185R58541o77194j103354k917539
1423A4405697k70951N82941j892578o33103j386535j122892L93658l31821n6565
1414I687851q43998K035M53385o36472j21903j922286J841246l131742L75304
1405E703420k78873K954385k769105J642029j846964J82512N48530j562006P14889
1396E288817n8701J218769q09548o46865l51093K863187j403008j174878K775431
1387G702111j309831p61652J9773J717481k571634J243495p45419m62523L17575
1378E149376Q62588J673076j770117J381006k405402K428081k484465K050072
$$ plain form
1370 6884215 7749033 7063240 7416671 8996786 5649159 6581218 8055230 8921257 6894203
1361 6894203 6764402 6741170 7712875 8167153 6592844 7639933 7768047 5244669 6487623
1352 6487623 8602985 8651633 8280750 6464290 7842207 7857398 7189819 7960118 7393533
1343 7393533 9826837 9223417 8475140 7630695 8025223 9911387 9228454 9212175 11216737
1334 11216737 10092508 8997941 8554399 9921970 9228678 8516885 10557878 9475000 6069803
1325 6069803 7893183 3548433 5686232 5324581 3705905 3835108 3392173 1357817 4137773
1316 4137773 4286857 4038934 2129671 4233759 2421628 5000866 4831834 3480834 4994832
1307 4994832 3289625 3466032 3204725 484894 3050419 3763931 1231217 2049768 1764790
$$ packed form
1370F884215Q64818o85793L53431J580115l347627R32059J474012Q66027k027054
1361F894203j29801k3232R71705M54278j574309J047089J28114k523378J242954
1352F487623K115362M8648l70883j816460J377917J5191o67579P70299n66585
1343G393533K433304o03420p48277q44445L94528J886164o82933j6279K004562
1334A1216737j124229j094567m43542J367571o93292p11793K040993j082878l405197
1325F069803J823380C548433K137799l61651j618676J29203m42935A357817K779956
1316D137773J49084k47923j909263K104088j812131K579238j69032j351000J513998
1307D994832j705207J76407k61307D84894K565525P13512A231217Q18551k84978
$$ plain form
1298 1764790 2600976 2417620 3199572 2871297 2977680 2595330 3316890 2144830 3589754
1289 3589754 2741127 1611103 873147 2845425 3361476 741041 1782349 4094910 2418259
1280 2418259 2191125 2895386 3372619 2434132 2710421 2660323 1160403 2754385 1209146
1270 2234983 3183014 4063442 246522 3278991 1218093 2709871 1108996 2385833 3314966
1261 3314966 1131573 645429 4434944 625317 2901316 1940203 2096555 1128842 1038344
1252 1038344 1730686 1105628 3002508 1205548 3528020 2913914 1185204 -47358 2285626
1242 1760368 1025394 -45386 525910 -304398 222061 961857 97249 1791415 475359 2473591
1232 2473591 1160598 1760850 2200115 2403146 1432828 2237349 73853 1667265 198282
$$ packed form
1298A764790Q36186j83356P81952l28275J06383l82350P21560j172060J444924
1289C589754q48627j130024p37956J972278N16051G41041J041308K312561j676651
1280B418259k27134P04261M77233r38487K76289n0098A160403J593982A209146
1270B234983R48031Q80428B46522L032469A218093J491778A108996J276837R29133
1261C314966A131573m86144L789515F25317K275999r61113J56352r67713r0498
1252A038344O92342o25058J896880A205548K322472o14106A185204d7358B285626
1242A760368p34974d5386E25910c04398B22061P39796I7249J694166D75359J998232
1232B473591A160598O00252M39265K03031r70318Q04521G3853J593412A98282
$$ plain form
1222 2294634 3895600 1495314 1208504 2788377 2706779 1763059 2412490 2723990 2762509
1213 2762509 3092843 70473 1342428 2069712 713362 164032 1907881 872454 1743465
1204 1743465 2229474 406200 1695723 3342316 2105244 2650475 2263027 2126017 1542145
1195 1542145 2845894 -430814 2647786 3226855 2162794 2970199 1487824 -66874 1521018
1185 2464549 1708170 3718156 2560305 1677292 2229158 476043 3207177 3367695 1437442
1175 1517513 2653641 2373362 2096296 2435858 3179294 3749637 779739 1995689 1260603
1166 1260603 4915066 2284978 1367393 1444184 3056950 1540638 2682014 1956453 902896
1156 159481 3000567 3908249 4154992 1904504 1348333 646940 813796 1955886 2316652
$$ packed form
1222B294634J600966A495314k86810J579873q1598r43720O49431L11500L8519
1213B762509L30334G0473J271955P27284G13362A64032J743849H72454Q71011
1204A743465M86009D06200J289523J646593j237072N45231l87448j37010n83872
1195A542145J303749d30814B647786N79069j064061Q07405j482375f6874A521018
1185B464549p56379K009986j157851q83013N51866D76043K731134J60518A437442
1175A517513J136128k80279k77066L39562P43436N70343G79739J215950p35086
1166A260603L654463B284978r17585P6791J612766j516312J141376p25561I02896
1156A59481K841086R07682K46743A904504n56171F46940J66856J142090L60766
$$ plain form
1147 2316652 103665 3831473 1010780 2629373 -243840 3486797 1755806 -520099 2954424
1137 540856 2352634 3230893 2862168 1794695 1141312 1510563 1792061 1523660 3565876
1128 3565876 1149193 866893 717649 2231934 -221435 2694834 2019501 2720485 418952
1118 1426597 2214522 776473 2845422 2055304 2772091 2744036 431341 2973123 2069637
1109 2069637 3854291 1625741 1732136 2476960 -245587 4708895 1229697 533126 1715946
1100 1715946 986836 -645475 1186758 404277 2566711 2100263 726252 1986433 2030139
1091 2030139 1917123 2357686 1526737 631133 649158 1141677 1964983 704736 1132705 2034462
1081 2034462 967059 2574813 -313069 3038252 162374 1801004 1035325 3475690 2506399
$$ packed form
1147B316652A03665L727808A010780J618593b43840C486797j730991e20099B954424
1137E40856J811778Q78259l68725j067473o53383L69251K81498k68401K042216
1128C565876A149193k82300j49244J514285b21435B694834o75333P00984D18952
1118A426597P87925G76473K068949p90118P16787k8055D31341K541782r03486
1109B069637J784654A625741J06395P44824b45587D708895A229697E33126J182820
1100A715946p29110f45475A186758D04277K162434m66448G26252J260181M3706
1091B030139j13016M40563q30949F31133J8025M92519Q23306G04736M27969R01757
1081B034462I67059J607754c13069C038252A62374J638630p65679K440365r69291
$$ plain form
1072 2506399 1626457 2021861 5895740 2344742 108283 4282420 2923445 2994676 1789207
1063 1789207 3575505 2086427 4201004 3347286 836036 3468800 1146516 2972745 2868404
1054 2868404 3246050 3612125 5553708 4234591 4215726 4819696 3056141 3067488 4809206
1045 4809206 4923021 5899303 6159100 4963597 4234226 8259844 6437957 7497581 7473420
1036 7473420 7917564 9955787 13598053 13918374 19842936 19165546 15915374 15331482 16213552
1027 16213552 15125661 17568866 17658150 19791144 22775852 25677716 27146098 33167471
1019 33167471 35466449 39833737 44352249 66501272 119072449 266620450 345521935
1012 345521935 176564247 90251019 51277629 33778650 22787004 13725901 14036608
$$ packed form
1072B506399q79942L95404L873879B344742A08283M174137j358975P1231j205469
1063A789207J786298j489078K114577q53718H36036K632764A146516J826229j04341
1054B868404L77646L66075J941583j319117j8865O03970j763555J1347J741718
1045D809206J13815R76282K59797j195503p29371M025618j821887J059624k4161
1036G473420M44144K038223L642266L20321N924562o77390l250172n83892Q82070
1027A6213552j087891K443205Q9284K132994K984708K901864J468382O021373
1019C3167471K298978M367288M518512K2149023N2571177J47548001P8901485
1012C45521935j68957688q6313228l8973390j7498979j0991646r061103L10707
$$ plain form
1005 14036608 9634570 7935586 7921127 6867860 8224357 5927843 6539133 7298201 8966796
996 8966796 11344708 14616599 8946252 6958070 5022423 3277152 4909952 4412219 3551263
987 3551263 3491688 3109053 4627759 2401465 3214136 2721697 2392683 3319822 2169750
978 2169750 3533906 1112760 2742743 2948818 3648178 4544849 2401206 2597927 2285578
969 2285578 2697065 593161 472279 1204656 1711084 2243962 -883906 -69411 360036 2030801
959 2030801 3447145 3574750 263238 3905747 1190465 -121376 -79351 3793569 -15185
949 1291265 3031712 712203 2393082 2126198 3854855 3551603 1623673 1503645 3373686
940 3373686 1200195 2437786 2096282 1521473 801607 1444313 1484792 -384636 1326384
$$ packed form
1005A4036608m402038j698984j4459j053267J356497k296514O11290P59068J668595
996H966796K377912L271891n670347j988182j935647j745271J632800m97733q60956
987C551263n9575l82635J518706k226294Q12671m92439l29014R27139j150072
978B169750J364156A112760J629983K06075O99360Q96671k143643J96721l12349
969B285578M11487E93161j20882P32377N06428N32878h83906f9411C60036J670765
959B030801J416344J27605B63238L642509A190465a21376M2025C793569a5185
949A291265J740447G12203J680879k66884J728657l03252A623673j20028J870041
940C373686A200195J237591l41504n74809p19866O42706M0479c84636A326384
$$ plain form
930 2334803 2979 1220697 2889218 625372 1543612 2856041 220193 2722903 2003019
921 2003019 1432355 2246493 548977 2212825 2091653 1642668 4649902 2114004 381036
911 1282778 -185974 902614 -1300009 1355443 -235772 1954792 792050 415685 2548963
902 2548963 1217238 786808 1318078 1859393 -268603 244525 -206702 1279431 -24795 1477254
891 -144410 1459517 249024 1701050 3326467 856757 2468325 2954262 653965 1231365
882 1231365 1433711 997049 3921362 1153886 1386940 2667332 1289368 -446537 -1026345
873 -1026345 1452410 2249759 769895 1857507 910803 1276137 253363 -422189 -790040
864 -790040 1887235 2658636 -9689 1478234 1625845 4326282 248146 1057095 900193 2208965
$$ packed form
930B334803B979J217718J668521F25372R18240J312429B20193K502710p19884
921B003019n70664Q14138E48977J663848j21172m48985L007234B114004C81036
911A282778a85974I02614a300009A355443b35772A954792G92050l76365K133278
902B548963A217238m30430N31270N41315b68603B44525b06702A279431b4795A477254
891a44410A459517B49024J452026J625417H56757J611568M85937F53965N77400
882A231365K02346m36662K924313A153886K33054J280392A289368d46537n79808
873a026345A452410P97349G69895J087612I10803L65334B53363d22189l67851
864g90040A887235P71401i689A478234J47611K700437B48146Q08949j56902J308772
$$ plain form
854 2208965 805735 1877704 1633982 3214300 986188 1812904 708629 701530 1116271 1727210
844 1727210 -235918 513849 -521823 2133306 741679 1253201 391324 708054 690455 -973855
833 482785 2685463 -197630 708269 320950 -421636 826411 1363939 1955402 1056863 1410171
823 1410171 1370101 646615 -1803125 533217 68185 -1103225 1607265 1120652 1975131 -410749
812 -410924 -74324 719750 2812777 -829656 1046243 628265 614404 -693530 -1418616 1090529
801 -732112 650518 -223250 131568 -832600 2710629 737664 -77613 549379 1872581 429628
790 -1941979 -1310517 -322947 1669171 -914974 438346 1598279 -465312 -2600838 -647021
780 193328 -878232 -241629 -31060 796819 665658 1448307 -1457058 223568 456379 371868
$$ packed form
854B208965H05735J071969k43722J580318I86188Q26716G08629p099M14741O10939
844A727210b35918E13849e21823B133306G41679N11522C91324L16730j7599i73855
833D82785K202678a97630G08269C20950d21636H26411N37528N91463q98539L53308
823A410171m0070F46615a803125E33217F8185a103225A607265m86613Q54479d10749
812d10924g4324G19750K093027h29656A046243m17978j3861f93530p25086A090529
801g32112F50518b23250A31568h32600B710629G37664g7613E49379J323202D29628
790a941979O31462c22947A669171i14974D38346J159933d65312k135526f47021
780A93328h78232b41629c1060G96819j31161P82649a457058B23568K32811q4511
$$ plain form
770 371868 -398520 1313190 289346 862289 -1036743 257620 597862 864016 2989513
761 2989513 -521953 -1506790 1069756 772124 1136389 867144 1439023 -115631 767844 915515
751 915515 1647585 548631 3328532 3356463 1483363 965036 1095753 13165 -801380 2181211
740 203197 1556530 2277779 1983729 646774 2852804 603704 3762467 1895009 2353772
731 2353772 -1481827 -155955 2307373 647065 2170721 2992377 1844219 165260 1552579
722 1552579 2298254 161477 1379592 1035873 332089 3672903 4278016 909859 2669887
713 2669887 3229976 2116220 -919190 1863749 1326522 2573349 2730291 3046775 2469775
704 2469775 3559284 3297468 2869910 1830490 4253699 3938297 3473495 3498091 2079069
$$ packed form
770C71868c98520A313190B89346N72943a036743B57620L40242K66154K125497
761B989513e21953r84837A069756k97632L64265k69245N71879a15631G67844J47671
751I15515P32070E48631K779901K7931A483363n18327J30717A3165h01380B181211
740B03197J353333P21249k94050F46774K206030F03704L158763j867458M58763
731B353772a481827a55955B307373F47065J523656Q21656j148158A65260J387319
722A552579P45675A61477J218115l43719C32089L340814O05113I09859J760028
713B669887N60089j113756i19190A863749n37227J246827J56942L16484n77000
704B469775J089509k61816m27558j039420K423209l15402m64802K4596j419022
$$ plain form
695 2079069 2120936 1536939 -481254 27750 1987496 2488784 1479135 2368548 -186287 2571570
684 667394 -977140 923167 1420879 287165 1305714 -31522 546430 693046 441267 282329
674 282329 -1667624 423625 -1413046 -148675 1106424 1376492 265192 1909020 904579
664 -971350 1755846 2030054 1090650 1821289 1041203 -758602 146376 2762791 424698 -873650
653 368619 -888685 139040 188342 410390 2547632 159184 603741 2292744 377585 -1144845
642 1050605 424908 1549834 -1260791 881947 626846 1308513 1264136 207918 1046601 -428142
631 -940659 70498 799528 2592556 880037 -656824 307577 58124 -641144 -447167 -2669547
621 -2669547 30561 -1606566 -1267267 -1582718 -591517 100258 -1151419 350649 -588971 -805409
$$ packed form
695B079069M1867n83997d81254B7750J959746N01288j009649Q89413a86287B571570
684F67394i77140I23167M97712B87165J018549c1522E46430J46616k51779j58938
674B82329a667624D23625a413046a48675A106424K70068B65192J643828I04579
664i71350A755846K74208r39404P30639p80086g58602A46376K616415D24698h73650
653C68619h88685A39040M9302K22048K137242A59184M44557J689003C77585a144845
642A050605D24908J124926a260791H81947k55101O81667m4377B07918Q38683d28142
631i40659G0498P29030J793028H80037f56824C07577E8124f41144J93977k222380
621b669547C0561a606566L39299l15451e91517A00258a151419C50649e88971k16438
$$ plain form
611 -805409 -545183 -514883 927475 1904165 2373844 -379439 -222299 462489 255739 599956
601 599956 395028 -214354 588905 -1701092 797324 -688267 -310664 -1003972 -151206 425694
590 62319 -1650344 250339 222904 -355032 557795 1351711 -607484 123379 1467757 -1429102
579 -548461 1589409 -267370 -2044109 -2175216 2155032 -1838538 1496008 349456 -401477
569 2570536 -355731 809407 390879 -471042 -204985 1168982 1713048 -1039022 603157
559 -1165696 -14115 870154 67266 341923 388924 -1203667 1136444 303305 -479499 -154502
548 -2015393 -1395483 -864891 721378 -664384 -829656 728011 -408606 1330099 3016731
539 3016731 -872720 1340980 1655202 -169580 39553 464544 491443 274298 -836017 599319
$$ packed form
611h05409K60226L0300I27475R76690M69679c79439J57140D62489k06750L44217
601E99956k04928b14354E88905a701092G97324f88267c10664o93308a51206D25694
590F2319a650344B50339k7435c55032E57795P93916f07484A23379J344378a429102
579e48461A589409b67370j776739j31107B155032a838538A496008C49456d01477
569B570536c55731H09407C90879d71042b04985A168982N44066a039022F03157
559a165696a4115H70154F7266K74657M7001a203667A136444C03305d79499a54502
548b015393O19910N30592G21378f64384j65272G28011d08606A330099J686632
539C016731h72720A340980L14222a69580C9553M24991K6899k17145h36017E99319
$$ plain form
528 -484869 -1112222 -1069879 242277 1415649 -1334220 1463613 6354 422949 1063704 -1751065
517 1295230 -520182 953583 95963 2211778 1346909 -1550 1259256 -122395 -417787 563288
506 1077842 -520658 862413 -80951 2463557 -1607268 -321489 -465522 897412 247331 -165792
495 1923516 1120926 309621 934231 421308 -394067 -364339 -213764 379268 76525 1280923
485 1280923 243295 -2164934 -1169429 -825465 -335187 373368 373384 2309773 1319885 -931984
474 824944 603897 -1138148 669388 -619841 959084 2757507 145787 -755395 -140560 -969886
464 -969886 -1204864 208040 -1614806 681796 -505331 1768570 734547 -157012 -2467544
455 -2467544 179560 -1131068 726839 -480208 187027 2297806 -425401 -455256 372504 -892634
$$ packed form
528d84869o27353M2343B42277J173372a334220A463613F354M16595O40755a751065
517A295230e20182I53583I5963K115815q64869a550A259256a22395k95392E63288
506A077842e20658H62413h0951B463557a607268c21489j44033H97412B47331a65792
495A923516q02590C09621O24610D21308c94067K9728J50575C79268G6525J204398
485A280923B43295b164934R95505L43964c35187C73368J6J936389r89888i31984
474H24944k21047a138148F69388f19841I59084J798423A45787g55395a40560q29326
464i69886k34978B08040a614806F81796e05331A768570G34547a57012k310532
455b467544A79560a131068G26839d80208A87027K110779d25401k9855C72504h92634
$$ plain form
444 -11659 535556 -789686 3043217 -477942 719969 996580 99205 157795 984291 372249
433 683721 -472597 -220316 641797 -2320878 -621167 -189871 -626539 -1336377 883582 -840989
422 -6182 -147007 972573 751851 1177700 843202 1846858 -1026292 -788302 757029 -1256587
411 -159092 -2278658 863665 511139 1902361 1317676 481204 -244359 2746400 356664
401 -46249 134822 934017 2748710 1022765 2745125 437402 1781266 1122724 1698170
392 1698170 1229216 150717 -145983 346317 2434881 825359 1441733 2625874 2618569 1364524
382 1364524 2241241 1243364 538889 758907 1168684 88656 1582928 500006 1595945 582860
371 -287664 76546 -1287437 258461 -752220 1206529 77644 620533 610505 1302270 285076
$$ packed form
444a1659E35556g89686C043217d77942G19969K76611I9205N8590Q26496C72249
433F83721d72597b20316F41797b320878f21167a89871m36668p09838H83582h40989
422f182j40825I72573k20722M25849l34498J003656a026292K37990G57029a256587
411a59092k119566H63665l52526J391222n84685D81204b44359B746400C56664
401d6249A34822P99195J814693A022765J722360D37402J343864o58542N75446
392A698170m68954A50717a45983C46317K088564H25359O16374J184141p305j254045
382A364524Q76717r97877E38889K20018M09777H8656J494272E00006J095939E82860
371b87664G6546a287437B58461g52220A206529G7644N42889j0028O91765B85076
$$ plain form
360 790756 893692 -1077822 -1228166 -1342786 303377 -163219 851109 -91175 -1406434 -1330014
350 -1330014 -1183210 -726329 463120 -93613 -1821451 1557725 -1122568 -2216196 336251
340 1111775 1766341 523553 -1316460 468895 1015286 -836792 399680 -514221 -1334498 -1483777
330 -1483777 155908 -1116035 -868359 -558278 -1963413 -487331 608229 374034 1557000
321 1557000 327442 2605147 1382843 -2754226 -122545 -506780 -2105329 -2994571 -232104
311 -502763 912766 175956 -420739 820219 838244 -1129163 -832815 -929537 -1783532 -224522
300 -777054 -1292677 -729613 -647282 686132 -416563 2728032 -585387 299286 -945471 -1184983
290 -1184983 -105337 -846118 -990740 -1509524 386727 625148 1017276 -118113 297149 -404336
$$ packed form
360G90756J02936a077822j50344j14620C03377a63219H51109i1175j315259P6420
350a330014J46804M56881D63120i3613j727838A557725a122568j093628C36251
340A111775O54566E23553a316460D68895N46391h36792C99680e14221q20277j49279
330a483777A55908a116035K47676L10081j405135d87331F08229k34195J182966
321A557000C27442K277705j222304b754226a22545l84235j598549q89242b32104
311e02763I12766A75956d20739H20219J8025a129163K96348r6722q53995b24522
300g77054n15623N63064Q2331F86132d16563B728032e85387B99286i45471k39512
290a184983a05337p40781j44622n18784C86727K38421L92128a18113B97149d04336
$$ plain form
279 -2974521 -640909 -1398212 -633345 413421 -664566 728439 51712 -313707 -126241 518062
268 1132065 -1296050 -882754 1713252 964922 -773882 -1034820 -9732 685826 -45984 -454575
258 -454575 -1955801 -1632712 754381 -330330 -1093633 -228283 28166 -374885 1221505 -648755
247 1194300 -4115 73701 -1364600 -199192 -379040 623911 489170 -79011 647872 -136643
236 -2057198 120570 -967329 518104 -1459471 573956 -1808565 -519325 -545496 -57577 1959317
225 222266 -1585573 -564125 906598 -728450 -1659288 2043011 340608 -884497 -1604422 170370
214 284387 -1300300 1131680 -1545466 -2078294 533396 -1301721 -215145 799681 -792824
204 -1402278 -2361776 1381008 1797842 -560424 -298877 -898267 2119458 98178 -1819535
$$ packed form
279b974521f40909p57303f33345D13421f64566G28439E1712c13707a26241E18062
268A132065a296050M13296A713252p48330g73882k60938i732F85826d5984m08591
258d54575j501226L23089G54381c30330p63303b28283B8166c74885A221505f48755
247A194300d115G3701a364600a99192j79848F23911j34741g9011F47872a36643
236b057198A20570i67329E18104a459471E73956a808565e19325k6171e7577A959317
225B22266a585573e64125I06598g28450r30838B043011C40608h84497p19925A70370
214B84387a300300A131680a545466n32828E33396a301721b15145G99681g92824
204a402278r59498A381008M16834e60424K61547n99390B119458I8178a819535
$$ plain form
194 -469955 -871953 -848149 -621454 478053 -1538624 -207024 189840 950933 -1037450 -2182241
184 -2182241 59429 -1063228 -1729039 -461806 1472584 651008 -490110 -1456519 -887270 -521084
174 -521084 -653959 -1308467 -445279 1507648 -328946 -2273839 -1419922 245635 289772 -2193617
163 246575 -187347 -260083 -356597 -211463 461913 -527184 -239327 -929750 69853 -22416 131001
151 -629820 1705106 375755 240798 -1121304 -79401 450451 -126200 -746603 241540 1551485
141 1551485 -917529 942676 -913629 1045521 -720674 1067450 1107 -1065987 258462 1655377
131 1655377 303974 829566 724705 348914 -1173728 1393065 -182683 485286 -305723
121 1858025 -1796235 -720413 -525904 6356 189676 -1023075 -1175597 -675851 -1814974 -1168275
$$ packed form
194d69955m01998K3804K26695D78053a538624b07024A89840P61093a037450j144791
184b182241E9429a063228o65811d61806A472584F51008d90110r66409N69249L66186
174e21084j32875o54508d45279A507648c28946j944893Q53917B45635M4137b193617
163B46575a87347p2736r6514J45134D61913e27184b39327o90423F9853b2416A31001
151f29820A705106C75755j34957a121304g9401D50451a26200o20403B41540J309945
141A551485i17529I42676i13629A045521g20674A067450A107a065987B58462J396915
131A655377C03974N25592j04861C48914a173728A393065a82683D85286c05723
121A858025a796235g20413J94509F356J83320a023075j52522M99746j139123O46699
$$ plain form
111 -1168275 -1635769 -938183 -322777 1160814 272327 1174490 96472 801982 -2533858 -863411
100 -1019586 1297438 -536325 439565 -1335998 1050380 309475 -457210 -201917 477667
90 -40188 295569 492651 216084 16149 -94875 185660 1389214 -729121 -1250427 923724
79 1036838 -729096 788391 1316849 483880 808582 -1068153 -864199 -144376 -1370957 -503428
68 297701 -2016344 794396 -1152428 -52051 -618940 882367 -1295179 -444507 -82613 -1890500
58 -1890500 -795030 2213348 -1289289 -225969 115873 -1589166 -279947 235122 -578080
48 984252 1174207 -199728 857533 -245928 -610086 -1504007 -1426722 -2238927 -1606355 -1211109
38 -1211109 573824 -782000 -76 13670 -392059 441440 -231071 -1210704 1073219 149918 -280079
$$ packed form
111a168275m67494O97586c22777A160814B72327R02163I6472P05510b533858h63411
100a019586A297438e36325D39565a335998A050380C09475d57210b01917D77667
90d0188B95569J97082B16084A6149i4875A85660J203554g29121n21306I23724
79A036838g29096G88391N28458D83880L24702a068153K03954a44376j226581e03428
68B97701b016344G94396a152428e2051n66889H82367a295179d44507h2613j807887
58a890500g95030B213348a289289b25969A15873a589166b79947B35122e78080
48I84252J89955a99728H57533b45928l64158q93921P7285q12205O32572L95246
38a211109E73824g82000g6A3670c92059D41440b31071r79633A073219A49918b80079
$$ plain form
26 -42028 944046 -136436 1680005 -372603 -606069 723777 2118752 -1072116 -248659 -484860
16 -484860 1146505 1822107 1023442 -376841 -312708 -801046 -1198062 1951344 -483434 -511621
6 -511621 -357347 -1392555 1673928 -1436327 -200114 -568734
0 -568734
$$ packed form
26d2028I44046a36436A680005c72603k33466G23777J394975a072116b48659k36201
16d84860A146505O75602p98665c76841O4133m88338l97016A951344d83434k8187
6e11621J54274j035208A673928a436327b00114l68620
0e68734
##END=
