##TITLE=141758
##JCAMPDX= 6.0         $$ Bruker NMR JCAMP-DX V2.0
##DATA TYPE= NMR SPECTRUM
##DATA CLASS= XYDATA
##ORIGIN= NUTS EXPORT
##OWNER= Administrator
$$ 1.72 TOPSPIN		Version 2.1
$$ 2016-02-23 12:23:56.433 -0800  Administrator@X
$$ Compression mode = diff/dup
##.OBSERVE FREQUENCY= 90.275459
##.ACQUISITION MODE= SIMULTANEOUS (DQD)
##.ACQUISITION SCHEME= undefined
##.AVERAGES= 16
##.DIGITISER RES= 22
##SPECTROMETER/DATA SYSTEM= 
##.PULSE SEQUENCE= zg30
##.SOLVENT NAME= None
##.SHIFT REFERENCE= INTERNAL, None, 1, 14.59171
##AUDIT TRAIL= $$ (NUMBER, WHEN, WHO, WHERE, PROCESS, VERSION, WHAT)
$$ ##TITLE= Audit trail, TOPSPIN		Version 2.1
$$ ##JCAMPDX= 5.01
$$ ##ORIGIN= Bruker BioSpin GmbH
$$ ##OWNER= Administrator
$$ $$ E:/data/jwist/nmr/1758/1/pdata/1/auditp.txt
$$ ##AUDIT TRAIL=  $$ (NUMBER, WHEN, WHO, WHERE, PROCESS, VERSION, WHAT)
(   1,<2016-02-23 09:38:53.183 -0800>,<Administrator>,<X>,<jcamp>,<TOPSPIN 2.1>,
      <fromjdx created from
       E:\data\jwist\nmr\uniandes\1758
       data hash MD5: 8K
       87 AC 8C 29 CC 1F DD 62 9B 6C BC E3 5F 73 DA 78>)
$$ ##END=
$$ 
$$ $$ hash MD5
$$ $$ 78 32 75 95 41 50 E0 4F F8 D8 23 B7 BB 7D 9D 46
##$RELAX= 
$$ Bruker specific parameters
$$ --------------------------
##$DU= <E:>
##$EXPNO= 1
##$NAME= <141758>
##$PROCNO= 1
##$TYPE= <nmr>
##$USER= <jwist>
##$ACQT0= 0
##$AMP= (0..31)
100 100 100 100 100 100 100 100 100 100 100 100 100 100 100 100 100 100
100 100 100 100 100 100 100 100 100 100 100 100 100 100
##$ANAVPT= 1
##$AQSEQ= 0
##$AQ_mod= 3
##$AUNM= <au_zg>
##$AUTOPOS= <>
##$BF1= 90.275459
##$BF2= 400.02
##$BF3= 400.02
##$BF4= 400.02
##$BF5= 400.02
##$BF6= 400.02
##$BF7= 400.02
##$BF8= 400.02
##$BYTORDA= 0
##$CFDGTYP= 0
##$CFRGTYP= 0
##$CHEMSTR= <none>
##$CNST= (0..63)
1 1 145 1 1 1 1 1 1 1 1 1 1 1 1 1 1 1 1 1 1 1 1 1 1 1 1 1 1 1 1 1 1 1 1
1 1 1 1 1 1 1 1 1 1 1 1 1 1 1 1 1 1 1 1 1 1 1 1 1 1 1 1 1
##$CPDPRG= <>
##$CPDPRG1= <>
##$CPDPRG2= <>
##$CPDPRG3= <>
##$CPDPRG4= <mlev>
##$CPDPRG5= <mlev>
##$CPDPRG6= <mlev>
##$CPDPRG7= <mlev>
##$CPDPRG8= <mlev>
##$CPDPRGB= <>
##$CPDPRGT= <>
##$D= (0..63)
0 1 0 0 0 0 0 0 0 0 0 0 0 0 0 0 0 0 0 0 0 0 0 0 0 0 0 0 0 0 0 0 0 0 0 0
0 0 0 0 0 0 0 0 0 0 0 0 0 0 0 0 0 0 0 0 0 0 0 0 0 0 0 0
##$DATE= 0
##$DBL= (0..7)
120 120 120 120 120 120 120 120
##$DBP= (0..7)
150 150 150 150 150 150 150 150
##$DBP07= 0
##$DBPNAM0= <>
##$DBPNAM1= <>
##$DBPNAM2= <>
##$DBPNAM3= <>
##$DBPNAM4= <>
##$DBPNAM5= <>
##$DBPNAM6= <>
##$DBPNAM7= <>
##$DBPOAL= (0..7)
0.5 0.5 0.5 0.5 0.5 0.5 0.5 0.5
##$DBPOFFS= (0..7)
0 0 0 0 0 0 0 0
##$DE= 6.5
##$DECBNUC= <off>
##$DECIM= 2432
##$DECNUC= <off>
##$DECSTAT= 4
##$DIGMOD= 1
##$DIGTYP= 12
##$DL= (0..7)
0 120 120 120 120 120 120 120
##$DP= (0..7)
150 150 150 150 150 150 150 150
##$DP07= 0
##$DPNAME0= <>
##$DPNAME1= <>
##$DPNAME2= <>
##$DPNAME3= <>
##$DPNAME4= <>
##$DPNAME5= <>
##$DPNAME6= <>
##$DPNAME7= <>
##$DPOAL= (0..7)
0.5 0.5 0.5 0.5 0.5 0.5 0.5 0.5
##$DPOFFS= (0..7)
0 0 0 0 0 0 0 0
##$DQDMODE= 0
##$DR= 22
##$DS= 2
##$DSLIST= <SSSSSSSSSSSSSSS>
$$ [...]
##$SPOFFS= (0..31)
0 0 0 0 0 0 0 0 0 0 0 0 0 0 0 0 0 0 0 0 0 0 0 0 0 0 0 0 0 0 0 0
##$SUBNAM0= <"">
##$SUBNAM1= <"">
##$SUBNAM2= <"">
##$SUBNAM3= <"">
##$SUBNAM4= <"">
##$SUBNAM5= <"">
##$SUBNAM6= <"">
##$SUBNAM7= <"">
##$SUBNAM8= <"">
##$SUBNAM9= <"">
##$SW= 20.5580556627758
##$SWIBOX= (0..15)
0 0 3 4 0 0 0 0 0 0 0 0 0 0 0 0
##$SW_h= 8223.68421052631
##$SWfinal= 0
##$TD= 65536
##$TD0= 1
##$TE= 300
##$TE2= 300
##$TE3= 300
##$TEG= 300
##$TL= (0..7)
0 120 120 120 120 120 120 120
##$TP= (0..7)
150 150 150 150 150 150 150 150
##$TP07= 0
##$TPNAME0= <>
##$TPNAME1= <>
##$TPNAME2= <>
##$TPNAME3= <>
##$TPNAME4= <>
##$TPNAME5= <>
##$TPNAME6= <>
##$TPNAME7= <>
##$TPOAL= (0..7)
0.5 0.5 0.5 0.5 0.5 0.5 0.5 0.5
##$TPOFFS= (0..7)
0 0 0 0 0 0 0 0
##$TUNHIN= 0
##$TUNHOUT= 0
##$TUNXOUT= 0
##$USERA1= <user>
##$USERA2= <user>
##$USERA3= <user>
##$USERA4= <user>
##$USERA5= <user>
##$V9= 5
##$VALIST= <valist>
##$VCLIST= <CCCCCCCCCCCCCCC>
##$VD= 0
##$VDLIST= <DDDDDDDDDDDDDDD>
##$VPLIST= <PPPPPPPPPPPPPPP>
##$VTLIST= <TTTTTTTTTTTTTTT>
##$WBST= 1024
##$WBSW= 4
##$XGAIN= (0..3)
0 0 0 0
##$XL= 0
##$YL= 0
##$YMAX_a= 1075991552
##$YMIN_a= -1647263.744
##$ZGOPTNS= <>
##$ZL1= 120
##$ZL2= 120
##$ZL3= 120
##$ZL4= 120
##$ABSF1= 10
##$ABSF2= 0
##$ABSG= 5
##$ABSL= 3
##$ALPHA= 0
##$AQORDER= 0
##$ASSFAC= 0
##$ASSFACI= 0
##$ASSFACX= 0
##$ASSWID= 0
##$AUNMP= <proc_1d>
##$AXLEFT= 0
##$AXNAME= <>
##$AXNUC= <off>
##$AXRIGHT= 0
##$AXTYPE= 0
##$AXUNIT= <>
##$AZFE= 0.1
##$AZFW= 0.1
##$BCFW= 1
##$BC_mod= 2
##$BYTORDP= 0
##$COROFFS= 0
##$CY= 15
##$DATMOD= 1
##$DC= 2
##$DFILT= <>
##$DTYPP= 0
##$F1P= 0
##$F2P= 0
##$FCOR= 0.5
##$FTSIZE= 0
##$FT_mod= 4
##$GAMMA= 1
##$GB= 0
##$INTBC= 1
##$INTSCL= 1
##$ISEN= 128
##$LB= 0.3
##$LEV0= 0
##$LPBIN= 0
##$MAXI= 10000
##$MC2= 0
##$MEAN= 0
##$ME_mod= 0
##$MI= 0
##$NCOEF= 0
##$NC_proc= -9
##$NLEV= 6
##$NOISF1= 0
##$NOISF2= 0
##$NSP= 1
##$NTH_PI= 0
##$NZP= 0
##$OFFSET= 14.59171
##$PC= 1
##$PHC0= 0
##$PHC1= 0
##$PH_mod= 0
##$PKNL= yes
##$PPARMOD= 0
##$PPDIAG= 0
##$PPIPTYP= 0
##$PPMPNUM= 2147483647
##$PPRESOL= 1
##$PSCAL= 4
##$PSIGN= 0
##$PYNMP= <proc.py>
##$REVERSE= no
##$SF= 90.2741417458089
##$SI= 8192
##$SIGF1= 0
##$SIGF2= 0
##$SINO= 400
##$SIOLD= 32768
##$SPECTYP= <>
##$SREGLST= <1H.CDCl3>
##$SSB= 0
##$STSI= 0
##$STSR= 0
##$SW_p= 1497.18866228788
##$SYMM= 0
##$S_DEV= 0
##$TDeff= 0
##$TDoff= 0
##$TI= <>
##$TILT= no
##$TM1= 0
##$TM2= 0
##$TOPLEV= 0
##$USERP1= <user>
##$USERP2= <user>
##$USERP3= <user>
##$USERP4= <user>
##$USERP5= <user>
##$WDW= 1
##$XDIM= 8192
##$YMAX_p= 1075991500
##$YMIN_p= -1647263
##$CURPLOT= <PDFCreator>
##$CURPRIN= <$PDFCreator>
##$DFORMAT= <normdp>
##$LAYOUT= <+/1D_H.xwp>
##$LFORMAT= <normlp>
##$PFORMAT= <normpl>
##$SURQMSG= 1
$$ End of Bruker specific parameters
$$ ---------------------------------
##XUNITS= HZ
##YUNITS= ARBITRARY UNITS
##XFACTOR= 0.182762287876938
##YFACTOR= 1
##DELTAX= -0.182762287876938
##NPOINTS= 8192
##FIRSTX= 1497.0059
##FIRSTY= -1083652
##LASTX= 0
##MAXY= 1075991500
##MINY= -1647263
##XYDATA= (X++(Y..Y))
8191 -1083652 -160627 -180740 548332 55823 813278 -105823 -932537 -242412 -40811 -180485
8181 -180485 902201 51759 508319 238534 -182504 938027 854730 307392 1199945 -647196
8170 -414069 1121741 233102 -46661 -145362 499666 -105072 -264422 637461 396679 -179130
8159 -222860 -643273 458486 690685 442020 568863 -140106 435802 -870049 -318705 812251
8148 -333931 186702 216407 93180 -98678 44793 472550 319821 727856 -274618 998235
8137 944958 365115 745561 -341745 -119940 -275387 -105410 72537 435104 -953731 1041756
8126 569005 395563 123872 984295 -362134 338211 565160 1356147 -169655 626285 391749
8116 391749 -106225 729634 722683 -345381 86548 328694 424224 -1184422 -1060309 78152
8105 -38371 691398 -3670 525323 488688 -118694 -167174 1144394 -734586 399639 66215 -424307
8093 394473 353311 412423 1259256 587180 -366885 381727 -25279 949269 -142631 133246
8082 518595 -258463 -525188 202059 -148480 165766 1216451 -676499 -212981 -153883 27576
8071 -488157 627083 271714 304944 730042 -173553 211620 796847 331426 753367 -413590
8060 -129214 757553 131564 768831 -59019 2006989 676269 16902 -859992 -191109 561416
8049 -122213 1422301 141769 -49236 -707267 -179459 221103 441656 615150 465627 611753
8039 611753 786759 993587 354381 12666 691495 -158990 387891 -292551 -488484 -181728
8028 -233985 -73140 -216880 758108 -765360 909439 65158 -638876 -213320 -226248 -294471
8018 -294471 -606353 380932 222626 354296 629667 -329706 -495030 -353969 9075 416039
8008 416039 -99912 193027 -243964 -885186 751276 -409999 309502 -80691 -126599 612787
7997 912615 308093 651401 -539313 1616710 601422 140002 501226 854126 -414363 -305337
7987 -305337 -544317 1390125 225377 679079 857673 481450 -1285725 -77512 -532051 424164
7976 -824861 1144853 785211 894640 -555191 602109 290759 358984 745286 -92602 663870
7965 -210531 -377422 695001 549270 536079 -896821 -461076 97252 839535 -584452 1069248
7954 602663 838931 -275728 207187 125457 -299167 -354572 423027 596157 1024496 85510
7943 -582250 765213 397721 318793 -784 -486432 29430 -27380 183854 220302 -100447 -420728
7932 -420728 336523 -405359 43862 329328 304857 575979 906425 -52136 274176 429868
7922 429868 23354 -525053 197850 1114371 -333110 160249 295091 13901 519406 -637473
7911 692041 450944 26642 -592417 826800 -931058 -192932 786605 1181873 -25651 438600
7900 490074 133093 -455339 556527 -1073586 286080 956804 430674 1718620 173926
7890 -293248 412529 63750 688628 -7552 9460 413693 -71388 -122094 971465 565189 455780
7879 455780 -18627 -181114 1357896 495065 -153411 789712 224695 199754 317977 -25860
7868 413662 -233489 520428 1098627 572667 76368 350819 -576616 -28044 -613258 -163343
7857 -32227 7106 523173 325620 424431 -14011 -277703 386714 885269 272209 737619 -427243
7845 543988 124347 152966 -876126 1295428 142571 -362600 275526 -19323 97884 180172
7835 180172 421936 339566 497879 69880 695027 -101273 1125517 36849 -206901 339453
7824 548219 586926 1010029 -836264 355810 852100 318038 -467629 230358 1052474 851212
7814 851212 1176516 1213363 -95601 727143 1119687 -121620 445715 1437018 -6267 206816
7803 928257 183180 -309306 72209 185532 444229 -420744 716734 -296763 78193 1073669
7793 1073669 650789 369957 424951 479917 1370795 -729125 -103019 134392 -464278 -765163
7783 -765163 445699 705063 943917 -32313 948173 937238 814048 181415 -509097 -308503
7773 -308503 191779 -637190 814349 380172 165785 -908220 -573890 325870 -315736 -542442
7763 -542442 451460 329018 732321 -67244 662687 -120677 160074 536001 -110584 487458
7752 482957 773498 -531980 163104 64376 798923 -11216 -887016 86117 266551 1314887
7742 1314887 249853 288264 1147988 288857 345310 153267 -509527 67585 -494535 756379
7731 1481668 212065 -31243 448614 595557 1149846 38111 653536 514951 611383 712210
7721 712210 -347083 669722 -303035 -413252 -905794 -90722 -13093 132216 -571103 1274936
7710 5190 1108193 386005 811948 -456560 397772 414637 798534 -385159 -514702 -614873
7700 -614873 -251040 150053 -874404 791566 824361 294797 730072 540258 -228627 1095756
7689 429989 570493 1110121 -1271202 292983 -480730 424102 149362 -338924 1089606
7679 193006 207432 41988 590070 1048583 -39915 -94992 494171 320215 87864 695643 833424
7668 833424 639238 -22301 219255 1438703 855521 649367 147558 697818 -52104 191987
7657 -91043 -679718 -395800 631894 -474821 -961761 -137569 1060585 -353055 350641 517526
7647 517526 1403696 -333197 712011 397171 1245518 152652 -59750 117463 -299623 584068
7636 -207419 1025578 -337188 -457483 -118372 413909 809467 -39690 401666 178968 -4402
7625 431501 -108927 606901 -117613 -709227 -662876 886297 253647 -108098 195636 -110473
7614 190168 -255794 528448 1845 -279968 -937422 1027749 656225 619825 838689 125783
7603 247803 40970 -901628 159840 229851 917778 -128866 -187438 478589 -373969 130052
7592 974468 513787 674997 -886920 907123 502793 -848491 -325086 -128751 896270 228550
7581 -362578 803870 191031 388418 -799879 242568 432811 -542313 -877269 358738 25360
7570 1079672 911772 661535 1347501 1071875 281075 332477 47619 867597 376210 571856
7560 571856 589539 -304196 241273 542121 478880 -1019774 -54386 54345 491636 535841
7550 535841 -55442 665960 201221 231105 692762 -601462 68370 592737 -197053 827978
7539 114254 558365 964929 -737792 545469 239515 -66758 830519 940172 1060008 215577
7528 -473825 -347169 592383 1289565 -718820 442845 160049 -458270 445521 -101121 195884
7517 -590521 516043 -769481 355754 258424 315740 617249 786662 -8124 367065 454903 324912
7506 324912 202484 792728 754183 699845 -683131 -554598 638455 987634 -272075 858323
7495 -50951 -632735 765011 328005 741724 425071 108008 538750 -250471 61782 24494
7484 396024 -147871 -171886 54292 384113 535522 481921 973260 -57343 395263 324660 -67437
7472 -57401 587495 721326 1548656 984075 969649 510752 333497 -568993 1176835 -364635
7461 -1566 360015 -266045 516422 -5445 407036 174178 1052744 136167 -55405 561230 461639
7450 461639 -1090565 524958 -252672 -44054 263298 -27766 27522 1013187 726991 168253
7439 403387 -5820 725950 -783535 216788 -162204 368683 -102828 1072040 683198 559267
7429 559267 527518 -146450 267378 -27858 423085 -372368 213801 484709 1122605 694306
7419 694306 -67580 -315212 -313378 -440036 300370 -279783 948293 7733 -159396 -506461 -43968
7407 571167 -105019 702737 299795 362036 1082615 347670 -787492 617179 -650786 -219942
7396 -29941 -40236 -115378 -259169 629262 476406 1234510 -67413 164759 124340 291260 356959
7385 356959 147377 1301714 1218521 28817 522366 232044 339923 703239 -33045 784823
7374 27426 418913 447244 275186 260581 255278 45858 651179 -259551 389669 981279 222720
7362 1543343 -174664 126108 -297885 530805 -228123 879667 610586 772535 299445 1240942
7352 1240942 826113 709076 1118941 -96296 220192 124132 1471790 225964 1207977 810393
7342 810393 -59498 1093736 -324688 624878 -138260 -78391 -399173 1524132 606489 611770
7332 611770 235197 -825078 379650 824245 892865 576948 21914 -185413 160604 -138561
7321 324372 299906 -470587 -1170191 -40454 813942 761755 907725 -111754 -365980 102775
7310 348706 1053960 -458238 410700 198562 418899 -312462 88437 937222 354251 1012882
7300 1012882 659968 -335400 160211 868760 610267 1316882 785252 313138 744534 673679
7290 673679 1245103 1568482 -557462 -47605 1194087 513579 313338 -578885 1237643 731604
7280 731604 901375 1096834 1185112 624491 429163 554603 66484 -64833 -250920 -161627
7270 -161627 1022996 266039 804070 814765 746693 -119463 566525 -129698 -224667 173074
7259 -408302 677369 -124562 -263883 -651425 391431 1130607 127005 -217549 1496844 483218
7248 529360 146051 483802 716261 428033 624036 493824 368649 1759201 346446 -576989
7237 942746 248759 -336430 429815 468684 904198 771076 1380941 -492389 167590 380136
7227 380136 -175394 -129819 -525316 367845 -15623 630086 -207383 299961 -259737 143823
7216 -171394 -572509 469446 40116 616448 277204 -225374 655527 -254544 139380 -622880
7205 -870037 683461 320450 1176978 659016 122878 230144 357252 809464 287698 -305927
7194 1346591 253009 -782735 -149915 237772 905133 188176 -401249 155749 1117306 673623
7184 673623 -237404 -11140 -233059 1043569 247664 315051 340283 149869 999362 -367563
7173 361769 1168555 353935 520151 983624 516140 866350 94740 1320468 -161175 210017
7162 -153287 131860 -556116 -721928 -399634 -1140298 -104305 156389 944724 67648 1304559
7152 1304559 -409330 -442702 326685 1246072 184816 -159118 280895 853716 380476 -11913
7141 3695 -544202 -92806 1257866 220276 698409 -270255 274313 1026526 1272667 1311847
7131 1311847 264934 418777 -328337 -191511 -95351 848627 541916 303825 -396334 432204
7120 -421025 124154 886502 -206944 1250838 426065 -233956 552498 -404280 -283594 549691
7109 1335499 -267826 1242911 -286635 337088 405980 308598 -45090 49929 530785 -62707
7098 285729 150418 795508 -97847 -99254 430658 -967888 157505 279788 -43185 -290690
7088 -290690 1192810 -267228 184890 322860 -362585 256687 -246282 795043 584790 -108429
7077 -856045 -345007 1115867 -503013 -324343 189618 570359 828685 1084384 444934 -16002
7066 464068 875553 583990 476377 126225 289123 -674028 805492 633400 745150 350714
7055 250338 231728 -436433 1013014 219871 373309 445595 349405 -21495 5950 791012 317451
7043 -747926 615804 -193357 906234 473932 199435 1567998 570873 -525498 274328 -286312
7032 1000035 -69188 534944 986936 -135202 1258755 -35964 -86665 -3182 1125253 780705
7022 780705 -87380 389404 393883 910262 -708229 -258330 18356 -164952 -39840 759539 623443
7011 623443 780249 538334 -53680 -367769 439200 952631 -580195 1452067 249681 -628197
7000 1001 738917 525743 -131429 697069 4498 933186 710418 917970 180585 442587
6990 442587 1114738 -263058 182895 -133831 1157144 430337 330601 -147375 687736 863732
6980 863732 187133 -59219 397602 -370297 301024 738584 200483 -304160 556298 344629
6970 344629 262396 -718650 986323 410782 348635 -410246 1237407 -300510 598104 159313
6959 773107 309622 624993 644732 -350600 712741 543702 478672 569607 178452 -556740
6948 -180309 1340019 401131 869385 87896 907965 -804734 1149159 443720 -695701 589621
6937 520142 781301 1179549 773930 775772 210317 759548 882002 1184970 1087465 905965
6927 905965 867872 10463 1343216 413186 706888 1109706 -42920 84924 509676 260279
6917 260279 306044 319451 1692862 1137696 380950 -222135 708564 -92332 -45775 262425
6906 417456 -64463 -27329 -57598 765690 974769 817305 462453 557848 1209960 187446
6895 1080505 876574 -167944 173395 227503 195464 241232 863675 670799 635348 -587772
6884 1445571 -514038 214492 661231 895019 2479 736813 268075 323580 191190 732859
6874 732859 395179 -13728 259471 857084 10583 -920528 762392 146017 769203 812036
6864 812036 -8734 558633 658200 608958 387323 -456307 378073 495912 360311 217495
6854 217495 -576567 543525 863992 439735 -149284 592555 -130782 465982 -438795 103283
6843 956571 -375335 583652 1031494 579056 -254468 -84404 306393 1364955 662285 908986
6833 908986 -9102 432478 1004892 900398 785620 -85355 -529783 1483811 220527 531975
6823 531975 172191 -191438 385406 727943 -441010 169107 1046558 726891 -993015 1153872
6812 798346 -209623 1512956 872292 230224 422887 1676085 714245 728795 240243 881580
6802 881580 425277 217627 1594877 161314 91248 1538827 -359401 1034779 612392
6793 612392 -386366 520849 1233229 87719 -182889 617669 -60658 -489654 -222578 58932
6782 -33312 521551 419802 256944 458489 355542 -486316 438675 1415109 119022 220341
6772 220341 1111688 -135010 763320 450285 -180487 697628 -119374 1123909 1132029 279599
6761 426012 884807 608753 -535147 179635 -350275 340091 533464 -55973 493235 -194465
6750 1382153 743504 681597 455321 701070 815939 603968 381510 -141285 213870 753424
6740 753424 842877 1038648 -240748 1024888 759106 338161 1259322 1037159 -145363 678069
6729 552734 549847 630844 605192 543084 34936 730798 140157 -17629 1345357 -35621 307075
6717 1749722 205500 1306407 -259482 494920 -386522 174965 1499886 -47675 558916
6707 -461393 368954 703031 244502 229827 1327913 444353 -297522 -1284191 397801 492581
6697 492581 270594 23515 704596 1199272 -468599 750674 339520 -260953 553110 779678
6687 779678 21289 -16687 -380299 160663 517404 39336 374991 453452 164882 1760699
6677 1760699 152243 256551 -71754 550818 9354 49704 -271482 425569 -278488 -375761
6667 -375761 854006 906951 440119 333246 -451860 770910 919477 332872 1141845 -65416
6656 -183582 1426711 662045 159480 -111994 892658 293840 -450174 624679 836505 25799
6645 -501 602241 708399 31158 1018234 916055 266589 1751563 1222266 249796 1603394
6635 1603394 -144156 366619 363369 836855 558677 555738 -607371 508326 610456 358560
6625 358560 382685 302857 1336481 955228 408086 58136 379937 320945 -124263 1183423
6614 -229645 753918 408073 1275580 1006304 458061 1047084 407276 -309496 -141099 857042
6603 490798 162866 1169781 202213 -338018 558327 1049435 103698 375416 474983 277280
6593 277280 -179793 -264735 202212 134264 1336333 1295241 807230 224527 596819 -51360
6582 907326 1212081 391662 335123 1154409 125293 792011 1681925 896611 1209160 798851
6572 798851 347379 263335 969277 275189 527119 783689 532624 1257651 -111827 457800
6561 385631 889724 511503 -188794 228314 780289 237708 39363 966553 280922 437553
6551 437553 979147 -545916 223701 67658 412998 115929 -356386 337930 1826066 733768
6540 862025 431657 -103348 253821 615158 -36116 -69253 364866 -479472 628682 635168
6530 635168 554749 170738 1114617 1145955 780196 187060 480064 712898 926115 1419000
6520 1419000 853100 -358344 971562 215275 -132484 499127 931282 -77157 314391 -383749
6509 45355 1050957 612463 1063834 1166650 290030 558866 1446269 411308 1564103 -235716
6498 407084 756669 520055 1618157 1084228 612902 410685 179899 -343364 537664 1475185
6488 1475185 -582620 -238518 559796 1551651 935553 637059 863021 1197938 -50077 781554
6477 595135 1035828 515547 1068580 42352 -589573 421409 1287740 425248 1090628 -164766
6466 589049 1556015 745392 1005555 146455 -656382 -212500 531497 1420655 153671 1387060
6456 1387060 447336 934227 657921 1073427 -162100 1042010 -515231 1468879 -193742
6446 600844 741403 236277 1077854 -174461 392531 1759187 102955 1153160 610324
6437 610324 928991 1039834 319205 154415 710903 779667 1253144 1480052 606748 631684
6427 631684 71474 688998 -214281 734627 941530 567536 380667 314951 43302 -226277
6416 641547 324450 751619 122558 1213411 1136842 292966 895475 264920 757838 190744
6405 82364 9401 -31985 509239 781997 1058507 574933 571444 84894 -136668 744245 1108260
6394 1108260 -77095 563458 464753 594182 350897 860071 509572 -237459 958846 1031504
6384 1031504 1268750 411450 677256 860982 135049 865077 523847 709046 367587 689497
6374 689497 142007 170345 770132 701410 807622 845401 1117429 869581 767417 286644
6363 369240 -1060542 476041 296086 488336 -50418 -125483 -2041 825563 1702678 345911
6352 233791 566976 -243076 1589595 -163956 403570 -64640 -363396 342176 511664 -155245
6341 1007791 1059190 389690 -448993 185895 558494 -56221 125627 389822 907445 1387304
6331 1387304 1112629 629662 -180764 1398849 378641 44325 506298 888410 1311394 541172
6320 953441 1269561 881552 1652806 -613804 1113892 1126763 318979 724071 -538357 50762
6309 754349 704080 497064 140143 736882 1000537 1076486 592906 1196716 684789 1299417
6299 1299417 172702 279798 848837 1844832 315375 -71416 -216813 1359648 864791 -155672
6288 362154 919160 586042 31163 94877 533056 1054239 379847 717107 498293 1266374
6278 1266374 561576 849763 469761 979929 699880 852971 483211 1305081 1291160 692347
6268 692347 280103 1304276 450447 1030628 900823 1019799 -27569 -17807 764532 133955
6257 706249 591088 294918 1118381 -150294 716811 -690801 -443014 635380 764806 557338
6247 557338 -273725 296529 -526590 1345755 151314 1338890 812480 767101 606799 263288
6236 -398802 1544442 840057 87145 68317 414639 1117964 557609 231670 271377 292020
6226 292020 647729 -77318 1448933 904657 276912 314736 866926 776265 187827 1360357
6216 1360357 825848 964563 1194365 1481759 397510 733227 95997 1315496 425809 1018740
6206 1018740 828128 -149349 48358 517512 219402 1008368 -255925 346050 -12414 1010228
6195 743002 183247 -64984 754592 346932 1154035 -310370 631531 456604 2162269 -148733
6184 239942 37715 421297 231928 275393 832738 239993 1121293 369198 856065 347903
6173 655182 333128 -51297 137776 -64404 -352719 770674 914417 447361 725393 -118831
6162 646079 -302172 729641 764910 503951 1631883 723699 1493820 683440 203763 161747
6152 161747 398537 1597262 19670 401747 145887 83652 85495 1049517 706562 980193
6142 980193 621255 283445 867854 513501 -68465 248161 56117 167424 613662 1185197
6132 1185197 -92447 759080 849221 556884 66161 1252232 -39875 1030824 892370 812719
6122 812719 354250 57017 969163 727850 139812 426470 656042 89504 -329637 876277
6111 466213 -153080 1380219 729266 27534 646941 934096 -65785 -10365 505656 1031833
6101 1031833 928568 843465 964415 -74583 1343842 608843 -112293 383083 1186902 179240
6090 639237 242182 -441940 613002 489921 443663 282564 942289 632186 1628010 507721
6079 -339115 554830 1582602 80772 824466 999266 1247742 1590 606734 383846 1186614
6069 1186614 -169451 452428 648701 690041 163532 -217273 1627079 851661 1113288 214678
6058 929829 879026 788463 886330 21357 1204996 538576 940234 632294 511813 917645
6048 917645 -307020 1814012 1091169 1137360 -429433 1074606 833934 636672 -89170 248287
6037 716027 462343 891147 995426 44766 855824 598680 837837 825222 908087 947918
6027 947918 -54044 831803 1708560 1116835 661353 89247 95115 562051 514525 257693 796324
6016 796324 311299 449092 -249467 1152402 754286 190384 1372386 2006133 1469358
6007 1469358 499988 754291 10873 1349571 95423 282065 322345 -268489 566746 474670
5997 474670 761537 1458595 1864353 1973115 840435 953476 396078 -145043 318450 702205
5987 702205 1301673 598257 1011104 174519 875640 1008422 830615 1368125 589803 1541978
5977 1541978 1486141 574268 122835 292357 235122 1729032 -826 708750 1276614 88349
5966 757742 1513649 609259 -160328 707431 -327618 568445 937308 978600 -244560 2113908
5955 344308 -247957 351651 224441 270641 1268665 538795 1178359 -711894 -69103 804125
5944 591650 193010 237061 1343388 807003 1137059 230908 -186668 805988 663142 1068867
5934 1068867 130434 974770 1201080 1850526 1421317 -16652 746400 733862 -271398 311664
5923 1485423 887575 -36002 371429 740333 612896 1564571 949820 1532250 807381 -243559
5912 26236 505153 1170374 1476833 968371 868184 906802 1318603 -274518 727921 1458854
5902 1458854 1793458 -76521 518590 336769 150014 730070 1239964 994202 840471 1587106
5892 1587106 249628 651448 646600 391554 -547521 310067 1618370 978284 720272 -862749
5881 -222239 445938 1511101 220497 553304 401136 1121107 289629 532690 387314 1382191
5871 1382191 387948 1515919 1937339 -420169 1211065 1391547 1481843 -282695 823422
5861 340060 1452120 1195676 1040616 1499136 736664 638406 1331691 983985 133776 1251715
5851 1251715 940945 859104 783712 834398 726789 813784 -205201 1625836 1845497 1503399
5841 1503399 -1218661 1275945 582020 1285707 391936 1146159 651676 559076 173385
5831 -451893 1211151 1439478 1766777 164639 91731 711841 660481 1483298 707793 345238
5820 1254292 128565 172319 313842 61489 812109 219249 1451906 983763 1027813 1090729
5810 1090729 154952 -772718 732388 644895 1511699 1564140 1220259 249264 1486301 892485
5800 892485 372609 876662 727958 1137328 970830 1058058 501064 1492156 766906 791950
5790 791950 1073741 739760 138462 69926 108742 529709 293835 993547 1436067 738195
5780 738195 1308384 -497041 1294743 1049862 169474 -288252 1227241 191407 223345 499226
5770 499226 1227862 -272732 256564 417284 503010 222187 1757325 828070 1157885 927659
5760 927659 736964 876421 995722 1497591 570290 317518 236872 764378 417835 965409
5750 965409 180281 730994 880356 851001 658883 1455280 1414398 1415456 991757 509566
5740 509566 927554 279454 731794 518547 501161 1669068 1067926 -32370 1014597 1278961
5730 1278961 1017627 2038525 863032 390579 1676685 1643452 1827236 722529 938921
5721 938921 35867 1571982 583996 140657 1638541 236578 1368583 1123248 482750
5711 802945 682840 838354 1169572 617685 1764841 321592 1021122 1534985 730150 536759
5701 536759 578742 731574 1107330 1367653 -182240 2102348 1145649 1517566 626871 558666
5691 558666 232708 553772 1297190 78392 -314851 262302 600299 1354468 711619 1580477
5681 1580477 248851 1518285 315685 750790 48009 650941 976713 914038 720279 322853
5670 1051990 580444 526088 1069663 502788 1208943 1481160 1052721 925006 1152944 476132
5659 1359562 857541 212828 1734566 1378857 320365 110057 83165 815434 1075430 1005964
5649 1005964 1353031 625245 335562 147681 970234 1018475 1413438 865093 273013 911277
5639 911277 545831 499495 -357008 1025138 825235 1284616 315909 871533 110363 767430
5629 767430 359468 637949 1403199 810448 766221 616523 975022 459530 862556 86776
5618 662731 23388 851856 2022368 1161853 1223226 820576 1060465 344779 1811605 1657135
5608 1657135 1686675 1241275 600510 649838 1889287 800324 194662 480031 1953196 -142165
5597 918726 1314730 752252 1275581 1515570 1089639 1209406 263792 308924 369468 -235910
5586 357631 148959 1190578 -14063 1815324 580179 252182 -116525 1031533 570891
5577 570891 977465 895171 1596287 1298123 926202 119518 209638 1007183 1344206 551833
5566 1020032 1328122 772313 889310 1028350 1657114 954618 894951 1274261 374641 274646
5556 274646 1584294 1538026 929139 1732169 2339273 1079628 889985 772406 860248 1428731
5546 1428731 -19951 1398006 1389950 744268 1564495 -279262 1412848 1561822 411736 1280593
5536 1280593 2463492 786277 1241503 2476690 1919295 1964861 1855822 2430787 1371911
5527 1371911 2060155 1947615 579604 2937844 1706600 675725 878072 1696311 1613273
5518 1613273 1114356 377689 1378686 2054849 288545 1051710 957741 1295319 1666136 483254
5507 1094377 552491 942605 1993994 1302689 1335449 792034 1268990 1520568 780961 1888699
5497 1888699 1116399 758224 553463 1296766 723611 1374355 1076939 1256580 1479441 1403356
5487 1403356 1087828 869893 826103 252037 397561 1508811 853655 1241234 941586 995267
5477 995267 319504 247684 1534224 1209487 956984 673304 768763 1658532 341104 489507
5467 489507 416879 1894316 -157481 813470 1029441 892303 992221 866636 393180 719167
5457 719167 1153112 501040 -269886 29989 1224433 483723 1604733 620388 1320248 474025
5446 1524019 178851 646663 1529426 1274875 539004 1003648 541568 435777 1893701
5437 1893701 1081273 1660895 1458605 1277599 1154280 256164 813065 1036673 233752 530500
5427 530500 772639 1932524 1420532 1578811 1713049 458170 1888773 1571469 1530106 1250960
5417 1250960 1261136 183150 1068818 2134973 2150307 960946 846967 1152594 1440151 407269
5406 1460918 1854621 1494615 2254377 2298288 579911 1109346 779011 911202 744808 1832883
5396 1832883 1239011 -11057 1582829 1322919 1929724 1566725 1048025 1741144 1970502 901138
5385 1388281 1730045 1867822 1534374 1805094 1509446 2500847 1329150 2363016 2191728
5376 2191728 2569267 1466833 1874252 2031877 2452659 1809878 1700085 2815855 707788
5366 1759148 2654200 2013297 1713556 1938848 1562545 1058803 1490146 1961155 940774 840486
5356 840486 1415682 2770264 1955451 1581515 1787166 1744002 324661 2010306 1431818 806660
5346 806660 2597999 2013516 1742309 1828849 1462418 1566478 2059421 1344066 1880791 1476751
5336 1476751 172452 1751201 893112 1456215 530367 1151686 1121223 1826876 399834 971510
5326 971510 2220131 515787 945124 1036505 933959 660611 514553 1193060 1316834 740024
5316 740024 985717 980557 1112845 1139568 383756 1388893 1306883 778665 1397238 606014
5305 648188 1242500 234181 -62857 1313361 1196198 1038633 1155763 859463 1167808 711319
5295 711319 2121339 910516 1302733 321089 511845 1509449 220440 -395060 577655 442549
5285 442549 690381 -508404 1661575 -119618 952011 492995 1483665 1092170 1396470 1005490
5275 1005490 978163 1042101 192376 831618 155980 926949 393661 955693 656914 1680202
5265 1680202 1101347 1178224 958027 1258869 1332728 539115 611384 1048172 1234101 1585596
5255 1585596 1896125 1191766 27064 816840 268730 284314 41013 991272 1568364 737888
5244 1475460 641746 518422 698802 564203 738933 1921613 403495 837481 740813 481314
5234 481314 1432094 1037975 1561397 143247 1865374 1804579 799628 665461 1566355 -268413
5223 1809092 965380 1328043 1633812 1410998 837352 1150520 910631 1224635 1261913 565711
5212 1448513 1083615 1389296 557619 856833 230901 959648 34486 1201225 888279 990703
5202 990703 1375564 1224506 1379845 732308 868548 553859 621480 1255361 1450249 925460
5192 925460 1591261 1440524 619995 2136085 2040010 919149 842829 1768304 1016491 1617732
5182 1617732 1458003 1760904 359612 1396347 1377536 421392 484722 1034794 457264 909340
5172 909340 1971218 2014798 671102 1560871 1224282 1267001 1214795 1874139 1564293 952571
5162 952571 792649 945954 482519 1252989 1612807 1079498 954817 1466798 1025295 1512465
5152 1512465 1186104 1603430 632166 1117375 1844784 852730 1764465 1634158 1938226 1685187
5142 1685187 1652473 1668140 1571720 2192493 1821127 3114014 2319884 3352390 4159383 4282628
5132 4282628 3734085 3377149 3108435 2431994 1864338 1017805 1450836 1366888 1234719 1175648
5122 1175648 1112842 1808704 1885384 1277165 1068226 1984177 1549176 1158535 873071 1516914
5112 1516914 186328 492851 766874 1767561 1723893 1030432 1499368 2265068 1510022 1018354
5102 1018354 740698 2098327 1353370 875163 1192665 340054 964177 1807448 1565737
5093 1565737 1204738 1221879 1422521 1228337 846864 1058910 993164 2257179 2488346 925100
5082 576822 293311 894636 1767422 735173 416679 1599649 1732592 2062029 1985674 1345891
5072 1345891 2783468 801101 1613749 2029919 2075402 459686 1154422 2139257 1517958 453627
5061 1162499 1457461 1619226 105476 1596481 1848679 629453 2219029 2138096 1649751
5052 1649751 976610 1368763 430121 1021567 537456 1331498 1201113 1863110 1543955 637880
5041 1957704 1221999 2655292 229601 2031022 1530145 1047550 818490 2201757 1667910
5032 1667910 1968951 1107055 1800412 1475627 1123874 1725571 2338205 491260 1124666 1578487
5022 1578487 409957 564251 2037255 2354690 2547021 1743371 2850161 1866575 1797061
5013 1797061 1773899 1420800 840534 837577 2036708 1183563 1975531 1236210 1865270 2463937
5003 2463937 2415715 1737182 2746971 1930122 2032128 1464770 1345605 1648005 2494927 2940362
4993 2940362 2171444 1675078 2403772 1505436 2199597 1708956 1510849 1616004 1817345 1554596
4983 1554596 388462 2270334 1063445 2724624 1069671 2521287 1479768 1682011 1724955
4974 1724955 847946 1911485 1238900 940759 2637103 2455847 1632578 1526840 1303488
4965 1303488 2675941 1066282 1683090 2389431 1687098 1547115 1695017 970514 2287336
4956 2287336 1529640 1801323 1352365 2009525 786781 1765449 2046457 910978 1896153 1503198
4946 1503198 851461 1475143 1391561 1716877 2406967 1391385 1846842 2378240 2761914 2410906
4936 2410906 2059293 2038929 1956959 2640169 1274048 1229339 1689396 1123604 1478968 1421895
4926 1421895 1383085 1788113 2145416 709680 1366884 2000449 1935605 319065 1685765 1525074
4916 1525074 1718640 1915892 161725 1456282 1648290 1896695 1680084 1700197 2400781 1834799
4906 1834799 2059570 1587531 1760202 1926693 1037625 972102 1712344 1880598 1656684 2108843
4896 2108843 2034627 1155546 1778972 1972164 1725914 1444493 1329707 2142995 2009704 1408454
4886 1408454 2178275 1723450 1657407 1674717 1603698 1181888 1046509 923704 3129860 3493040
4876 3493040 2027336 2430964 1996104 2310496 4093624 2425067 3240124 3781848 4069039
4867 4069039 3675605 4779101 6042881 5209530 6036917 7184177 5994092 4694105 4579463
4858 4579463 3641031 3119029 3564547 1813200 2808593 1985132 1287854 1892273 1711104
4849 1711104 1375900 2460316 2570806 1641419 823832 1274526 887014 1984159 1547789
4840 1547789 915789 1410210 1770929 1952264 1017781 2452847 1581943 1522253 946978 1370041
4830 1370041 1164352 1979628 1489431 1141624 875892 797523 898206 1367139 1762396 1312349
4820 1312349 1682331 1941950 2121893 1252232 1223852 2243060 1804419 1115590 1433395 793915
4810 793915 2285698 2694491 2135749 875664 1708144 1374664 1430820 2904230 2017641 1808763
4800 1808763 2237311 646868 1154985 1899344 1509392 1533368 2186433 3190222 2412326 2361387
4790 2361387 608512 1744732 1699819 1925249 1616582 2174639 1274886 2258512 1335217 1493721
4780 1493721 1021503 2271730 2084996 1602212 2364029 2760700 2051685 2351216 2881308
4771 2881308 681411 2165116 1005836 1103700 1864768 2156599 1863398 2841018 3382802
4762 3382802 2362683 1850368 2344482 1988707 2007719 2217362 1402272 2049437 1162468 774003
4752 774003 2062448 1643031 1466740 2787930 1105464 2521014 1362831 1704972 1590133
4743 1590133 2153535 1630740 1028189 1810857 1606577 1750455 1979719 2385984 2756473 2609773
4733 2609773 2045132 1943882 1852907 2925080 1203812 2102190 2063809 2524185 2031886 1789848
4723 1789848 1800125 2479792 2625850 1503370 2154668 2327936 2730169 2773655 2147262 2374429
4713 2374429 1568731 1429242 2265200 2326336 1870984 1343649 2970913 1954305 2562036
4704 2562036 1886427 1864196 1389385 2226028 1279346 2325563 2044357 2477762 2472933 1572285
4694 1572285 3136765 2144736 2133434 2618558 2220322 2081836 2530747 3086769 2994930 2219023
4684 2219023 2692801 3640067 2631859 2306064 2772002 2774742 1947145 1989572 2300608 2515290
4674 2515290 2138842 2514765 2553572 2771565 1844723 2146353 2113299 2421325 1890058 2820707
4664 2820707 2311793 1967771 3354086 1990062 2963612 1836630 3110606 3683568 2905582
4655 2905582 2274280 2392268 3056048 3001067 1566964 2513946 1638913 2361568 932436 3081556
4645 3081556 1636955 2923083 2478333 1877574 865653 2058825 2814952 3185055 1931695
4636 1931695 2738247 2499632 1904129 3500482 1983605 2054094 2175931 2115056 1491234 2310615
4626 2310615 1845287 1232570 2301395 1762755 2793387 2854020 2678998 2010420 2416699
4617 2416699 1254621 2624501 1408549 1821987 1926134 2668314 2547821 1867788 1885690
4608 1885690 3298075 2757513 3314998 3317543 3525760 3281747 2959089 2392912 3172067 3655633
4598 3655633 3389328 3642632 3095256 3839226 3243378 2096468 3902646 1987751 2473774
4589 2473774 3413704 3052781 2235906 1965453 2676162 3227601 2582028 3563040 1766616
4579 2828840 3243944 3028670 2678737 2037985 3484744 2812103 2718744 3334610 3308268 3149554
4569 3149554 2977293 4180587 4201720 3937821 4342152 4460191 3083978 3632736 4962408
4560 4962408 3515119 4157217 2974282 3241281 4213503 4174020 2936546 3477724 4259305
4551 4259305 2819912 2728245 3028623 2137426 2742794 2442709 1911471 2230243 2842987 3369009
4541 3369009 3019711 2683231 1957662 3015038 2166143 2556847 3054972 2139685 2591744
4532 2591744 2707159 2142685 2095968 1839730 2592841 3089311 2750376 2820951 3003327 3428085
4522 3428085 1671555 1090450 2916816 2638228 2527696 2638964 2372942 1863898 3038183
4513 3038183 1986393 2099812 3028978 2366869 1713290 1137250 2298723 2212714 1729588
4504 1729588 1370611 2446375 3336195 1609487 1858334 3136317 2503697 2942299 2781204
4495 2781204 2192050 1989472 3355883 3405537 3525869 2566835 2248672 2916033 3196127 2326898
4485 2326898 1193551 3508015 1705200 2543500 2653565 2574140 2709416 2655481 3814001
4476 3814001 3534093 3914888 2260280 4280660 3942509 3525664 4995301 4473171 3749876
4467 3749876 3797335 3122503 3009160 3323752 2787686 3864900 2838467 3554111 3229587
4458 3229587 3304922 3278417 3404467 3743685 2499611 2991822 3130800 1853928 2736726 2484929
4448 2484929 2928889 3465849 2706358 2539045 2991170 3475517 3432845 3060498 1887112 2393440
4438 2393440 2904452 3418371 2685133 2088542 3187311 2377118 3190893 2326329 2651269
4429 2651269 2505162 2376020 2379443 2555301 2172631 2844099 2116352 2901201 2662541 2399215
4419 2399215 1978888 1998629 3004193 3004119 2374477 2673893 2967223 3097430 3291103 2474083
4409 2474083 2741899 3286265 2371297 2703041 2978966 3963736 3633313 3246892 2109703
4400 2109703 3093669 3877728 3655860 1830612 3069472 3671494 2725716 3752859 1814128
4390 2627160 2728150 2516122 2419594 1777332 2454156 2744591 3013777 2042319 2810552 1789913
4380 1789913 3462970 2796659 1979021 3202811 3293283 2911579 3142709 2772853 3072806
4371 3072806 3026702 3493416 2873840 2882361 2710544 3867399 3520617 3327304 3081943 3187099
4361 3187099 3753174 3408461 3324471 3065282 2674479 4121840 3977172 3701875 4131328 4055622
4351 4055622 3890418 5405902 4749296 4159511 4335695 5451315 4156771 3766457 4487256
4342 4487256 3811966 3724767 4013424 3451273 2540664 3657103 3791181 3025369 2839088 4248801
4332 4248801 3663987 3878329 3908955 4236053 3994700 3272723 3369926 2711565 3368044 4791072
4322 4791072 3984308 3611488 4047336 3234867 3433420 3263193 2608523 3824226 2882711
4313 2882711 3674390 2341201 3995042 3990014 3643819 2792676 4260708 2678647 3111507
4304 3111507 4508296 4458078 4411741 3351470 3952859 3924106 3134098 4556843 2981575
4295 2981575 3161987 3095372 2851811 3323262 3884303 3356179 3041465 3408376 2660197 2684041
4285 2684041 3340118 3619201 4146271 3658268 4039945 3356045 3617207 3856487 2864928 2548973
4275 2548973 3074211 3433816 2909830 3644752 3190240 3401580 3804322 3412921 3896594 3560151
4265 3560151 3525079 3306109 1950264 2464755 2749067 2990487 3267717 2391131 3423788
4256 3423788 3342105 3032255 2091960 2968619 3045264 4350347 4045304 1959703 3750096
4247 3750096 3560848 3396262 3713208 3071466 2782447 3691656 2803187 1714289 3090526
4238 3090526 3894914 3282535 3654878 3530625 3136240 3036953 2200888 3340960 2316801
4229 2316801 2394006 3469065 3840844 2921367 2865390 3412130 3186048 3206661 3151612 3296159
4219 3296159 3269004 2904635 2711588 2050868 2508376 2499856 2262670 2358715 2183823 2873626
4209 2873626 2171776 2803881 2725612 2401720 2263082 1859866 2972563 2746484 3691874 2538811
4199 2538811 3557302 3598230 2362632 2263931 2451272 2300112 3201356 2956386 3253569 2498831
4189 2498831 2839996 2414643 2594098 2516175 2236520 2839646 2072302 2989401 2967703 2160065
4179 2160065 2970777 1490398 2526576 2514564 3709988 3755273 2994656 3010771 2542428 2985307
4169 2985307 2763663 4131185 3162195 3179247 3603745 2149792 3501339 2921304 2664867
4160 2664867 3240890 3125147 2660523 3847177 4305107 3024631 2847499 2788838 3474344
4151 3474344 2231461 2764977 2669583 2889293 3435722 3004517 3836540 3969970 2773568
4142 2773568 3184234 2687706 3789939 2751146 4169980 4198122 4779963 3065567 4104482
4133 4104482 3892108 3373217 2511617 3848658 3505875 4648422 4356137 3875006 5318904
4124 5318904 4048779 5268792 3926734 3862456 3795616 3953057 4811829 4626566 5545895
4115 5545895 2906073 4534789 3599156 5089354 3884640 3289572 4326633 4287013 3552415
4106 3552415 3763160 3163299 2514991 2739425 3356737 2918468 3096493 3889030 2504791
4097 2504791 3574242 11683941 3269079 3488030 4386401 4652853 3372306 2568031 3317195
4088 3317195 3326786 4103879 3967020 3124959 3532931 2649536 3392656 3579001 4133057 4207407
4078 4207407 3892352 3946642 3695135 3509469 4640910 4645561 3614899 4167014 3902300 4056351
4068 4056351 4596257 5294234 4016380 4390178 4585690 5671282 5484149 6250487 4559220
4059 4559220 5344959 6160667 5662800 5893096 6453950 6095241 5760108 5847970 6063662 5630637
4049 5630637 6608851 6898557 6255537 6237435 6852779 6838849 6630875 7308613 6788078 7085446
4039 7085446 7361089 5841112 6302759 6144221 7727556 7531815 8266325 6972744 7063131
4030 7063131 7552084 7203159 7471928 7574509 7321265 7763739 8154630 8484484 8470808 8511015
4020 8511015 8127002 8208454 8807817 8959653 9015312 9932601 9284658 10583434 10638802 10116751
4010 10116751 11495417 12043282 11422411 11813769 9947708 10059026 10529888 8968936 8440208
4001 8440208 8738425 9593999 9580051 8456203 7928869 9147550 8673869 8536282 7985454
3992 7985454 6580850 7883390 6794694 6843075 6014112 5672152 5198610 4854236 5868457
3983 5868457 5530265 4417551 6582513 5470726 6154493 5248100 5775900 4525115 4811550
3974 4811550 4960355 5587379 6181373 5768872 5404176 6006263 5215244 6450279 5974923
3965 5974923 6587852 6721422 7064895 6881048 6957450 6335505 6370180 5580665 5248751 5087017
3955 5087017 5113522 5845312 5758587 5488238 5664265 5797919 5939757 6371094 6579540 6337788
3945 6337788 6954027 7297998 7284601 7247060 6639068 5901840 6564704 6900123 6587333 5757782
3935 5757782 5983007 6268969 6756189 6047184 5708552 6445697 5753577 5318728 4509156 4620751
3925 4620751 4080589 4419572 3357876 4043410 3959597 2208445 4374828 4074500 3789823
3916 3789823 4697365 2464408 3744164 3651715 3380420 3573079 2823413 3816287 3103326
3907 3103326 4129273 2600876 4047481 3246327 3642127 3243067 4417546 3813637 2666445
3898 2666445 3603495 4215116 3371305 3747423 4740488 3129696 4389386 3772240 4438577
3889 4438577 4997492 4091113 3261627 3051320 2572429 4555332 3036600 3387093 3296893
3880 3296893 3031394 4563606 3560004 2466957 3773546 3706191 4277796 3251481 3578615
3871 3578615 5032778 3327906 3416324 3771373 3719746 2967626 3484056 3484780 3608241 3120132
3861 3120132 3411964 3253819 3163305 3380963 4134372 3367902 4246366 3635488 3772431 2381467
3851 2381467 4570504 4007040 3265926 2937601 3946802 4167070 4240257 2805252 4783021
3842 4783021 3168923 3481492 2357143 3612040 3802467 3428218 4722113 4394192 3545160
3833 3545160 3786070 3354603 2483898 3179884 4235229 2878622 3642968 4116937 3682803
3824 3682803 2818990 2239579 3798817 4273756 3000868 3115557 3903353 3175285 3917297
3815 3917297 4757960 2862923 3604935 2576806 3626285 3030146 3860050 3475124 3337016
3806 3337016 4205580 2596322 3606799 3837129 2974706 2646822 3501396 3847792 4285433
3797 4285433 4232816 3791489 3226553 3230585 3763045 3777576 3395521 4057253 3885855 4279114
3787 4279114 4205148 3486358 4348925 4378995 4312463 4139107 2726530 3739643 4381263 3455995
3777 3455995 3620850 4595157 3887009 4117399 3273462 5333950 4347113 3984484 4127280
3768 4127280 3240415 3333575 4279356 4152596 3999136 3779606 4644452 3121696 4224265
3759 4224265 4330648 5642831 4541693 5068540 2913274 4292918 4255982 3696015 4161957
3750 4161957 4987088 5442805 3931756 4893230 5197875 4149743 4716976 4297974 4953137
3741 4953137 3945368 4503917 4797420 4868623 5119015 6222435 6264893 4117436 4823395
3732 4823395 5269663 4774216 6147149 5745944 5498117 5964611 5890777 5328473 7081957
3723 7081957 6349848 7070129 6705806 6859186 7908166 7702899 7773260 8030537 7388840 7396466
3713 7396466 7635356 8817845 9363185 9693069 10311525 9810172 10170810 11420425 11088112
3704 11088112 11975398 12552335 12580600 12620089 12789168 13704142 14150243 14108728 13866177 14880508
3694 14880508 15053385 16150913 15198716 15899814 18925550 17317995 17614474 18227888 18822361
3685 18822361 17679754 17148099 17923740 17028168 16481069 15498728 14819132 14045171 14004491
3676 14004491 13445720 12440870 11454387 10389309 11062733 11407211 11298054 11558566 11340179
3667 11340179 11119584 11806761 10659581 11693710 10665405 11054382 11751366 12480302 11111077
3658 11111077 11828132 12686503 11501390 13199581 12926810 11267334 12491003 12421388 10755401
3649 10755401 12204933 10550594 10210447 10746283 10887774 9911671 8488952 8855523 8610756
3640 8610756 8075888 9469093 8318260 8594797 8416368 8213867 9148617 8620078 8192525
3631 8192525 8102203 9331951 8560107 10556163 11768139 11936050 12649467 12539218 11993912
3622 11993912 11517622 10070651 9439809 9006203 7474246 7205192 6438819 8017326 7118819
3613 7118819 7538067 7425907 7205658 6901473 7582676 7211473 7999066 8445548 7863228 8674568
3603 8674568 8167005 6855122 7195343 8232648 7354614 7767973 8333230 8763861 7500151
3594 7500151 8819576 8219074 8881389 7942373 7697496 7584298 7703455 6496873 7339394
3585 7339394 6168481 5906235 6296690 6357516 6028334 5761411 5822964 7069136 6023475
3576 6023475 5253921 5311526 5499184 6323408 6055786 5666797 4950312 6215121 6765221 5593839
3566 5593839 6338212 5616598 5667112 6304624 6048696 5039644 6022870 5686009 5980524 5904474
3556 5904474 5528393 6542273 6570921 6307281 5781746 5822220 6470261 6702534 5995161 7034492
3546 7034492 6590107 8142104 6159919 6402176 7930560 6735588 6712806 6993724 8204193
3537 8204193 7659542 7105711 6876664 6756132 8452080 8416700 7503335 7305768 7508708 7674948
3527 7674948 8396394 6859095 6709853 7420372 7544209 7440428 7157047 7654864 7360657
3518 7360657 7744036 7818997 7986000 7122305 6748686 7913187 8360845 7158811 7633243
3509 7633243 6822543 6620216 7829497 7878629 7813888 8271848 7216717 8482027 7847526
3500 7847526 7795762 8834051 7949053 9161528 8607720 8738533 8380988 9278637 7449513
3491 7449513 7909603 8382339 8160008 9040558 8502813 9371764 8714098 9010194 9504770 9185518
3481 9185518 8015205 8684912 9372037 8352966 9786101 10015397 9472831 8612303 10364095
3472 10364095 9112963 9502440 9387945 9407992 9968767 9403391 10012014 10466510 9394094
3463 9394094 10211811 10906728 10019066 10695748 11796934 11019816 10374944 11092934 11330786
3454 11330786 11857095 11593210 11417248 11583485 11659982 11350144 10285525 11872311 11439517
3445 11439517 11817754 11305548 12989637 13864885 13834683 15541066 15630473 16446309 15860811
3436 15860811 16779949 16163057 15821313 15817571 16960733 16894098 17465596 17863226 17763289 19502524
3426 19502524 18833940 18797840 18947630 18753965 19230721 19308644 21087044 21982340 21566478 22885054
3416 22885054 23792738 25683020 24098078 25766582 25620840 27817576 28260930 28962696 30082840
3407 30082840 31888634 32025356 33289789 34621698 38334889 38949537 39667297 40755849 43634981
3398 43634981 46299085 48939957 52393313 57681709 60595044 66714852 70173812 75188300
3390 75188300 79528355 84728547 90345283 97110491 101606546 108427466 116502666 125962377
3382 125962377 132848905 143905144 154194120 166816920 181366886 198664198 217025701
3375 217025701 241477092 270400082 310321360 360688302 431958315 529000934 660154720
3368 660154720 820665752 976169617 1075991500 1071260172 947998546 758427739 566956900
3361 566956900 410055404 298889105 223190868 169949815 134768905 109380890 92317755
3354 92317755 78601908 68467076 58796785 53189649 48639297 42950169 39775557 36519357
3346 36519357 34744297 31309572 30265132 27512800 26544390 22774856 22890412 19826686
3338 19826686 18766551 19171938 16064969 16117081 16260357 16240906 15076601 14884011 15367371
3329 15367371 14361710 12615233 13216502 12190343 10436060 10372300 11917549 10550098 11784101
3320 11784101 10921582 10130148 9566121 9257910 9651736 9442433 10175834 8976249 9491635
3311 9491635 8825833 8218039 8170023 7554143 7445708 7092673 6334857 6674713 5749594 6077206
3301 6077206 6769038 6282003 6046409 5938610 7062561 5493249 6570149 4139211 5752398
3292 5752398 5344778 4827855 5816324 6193492 5804438 5939145 5864469 6272573 5109553 6812183
3282 6812183 5625204 5604457 6270041 5475147 5257326 4502295 3846112 5096704 5043132 4761756
3272 4761756 5321552 6069783 4372238 5715272 4751452 4092682 5410412 6103941 4979289
3263 4979289 4148396 4553121 6009503 4568505 3428054 3969669 5072506 3828855 4561708
3254 4561708 3710947 4732338 4168087 3175709 3320664 3790251 4297340 3548485 3629758 4286532
3244 4286532 4472971 5038239 3737948 2940385 3382194 3309031 4009301 2225997 4108689
3235 4108689 3487488 3451422 3463934 3236518 3933459 3446949 3101187 3923452 2904796 3354630
3225 3354630 3325728 3312797 4062765 3937524 3247681 3195460 3495618 3795055 3473477 3982316
3215 3982316 3234225 2720566 3671767 4418485 3831230 4062744 4193495 4970751 5449580 4636092
3205 4636092 4786604 3201481 2595916 2987082 3841427 3210698 2288544 3494496 2447612
3196 2447612 2730859 4058106 3718223 2936672 3456947 3013099 4275779 3506058 3979002
3187 3979002 3638337 2752090 3385266 3867682 3946792 4281441 4417114 5146617 5983347 6463337
3177 6463337 7688214 8676872 9010935 8531496 9513597 9230055 8119990 7207417 6005913
3168 6005913 5217490 5323917 4482462 3378174 4272782 3136094 3069834 4926517 3902056
3159 3902056 3678124 2785529 3926803 3899228 3993731 3229283 3551883 3085568 2307481 3064587
3149 3064587 3850478 3705511 3789083 4232006 4796346 4153977 3243115 4127885 4629780 3686299
3139 3686299 4137050 4711618 4654486 6477765 4476507 5165431 5059319 5488157 6309022
3130 6309022 6640108 6939005 6417333 6250975 5607540 8139005 6038607 7004919 7187547
3121 7187547 7145693 7169343 7817138 7361014 7582269 8098312 9120333 9726189 9253754 9799891
3111 9799891 9819359 10070613 10243184 10779171 11187909 11735224 11567123 12684862 12866184 12693603
3101 12693603 14203682 14744985 14805647 14446438 14944958 16737358 15815303 16740658 16859130
3092 16859130 18282437 17704749 16715345 18101496 17583220 18771870 16498582 17621681 17936240
3083 17936240 17170066 17338110 17250920 16354761 16335394 15507219 15713513 14907699 13982781 14117367
3073 14117367 15110571 15000011 14990460 14873107 14340073 14504680 14246327 14257580 14778061 14437779
3063 14437779 14788210 14739289 15096918 15513306 15719090 16727358 17445684 15883155 16762801
3054 16762801 17621088 17250396 17299848 17265442 17212606 17258962 17589169 17115510 16141457 16363668
3044 16363668 14662623 12974929 11443401 12395429 10799204 9794332 8652529 7950547
3036 7950547 6990335 6235434 7024699 6912733 6567847 6187631 6824262 7228533 6054792
3027 6054792 6345537 5871876 6920407 6681201 7354447 5421805 5473896 5974397 5963823 5884460
3017 5884460 6506183 5784662 5627200 6070269 5839934 4830000 5269538 6616743 7316415
3008 7316415 5979860 5770815 5875591 5797303 6442350 5844636 6046584 6538738 5339751
2999 5339751 5866412 4648329 5182130 5270881 5427081 5074378 4642094 5064889 4238162 5241664
2989 5241664 5110487 5551046 6211568 5254045 5281776 4409081 5620745 5600459 4871941 5642369
2979 5642369 4637153 5396877 5285069 6070028 4941604 5503487 4802964 5150810 5394140
2970 5394140 5674566 6130639 6331030 5814479 6784613 6212985 6267024 6328660 5798504 7148634
2960 7148634 6383328 6194040 8543145 7438362 8058938 7832845 8938494 9864055 10078105
2951 10078105 11448783 12055207 16922914 20969648 24743756 25425252 24617818 24501100 23560712
2942 23560712 17800515 12816208 9727927 6840949 6022285 6357582 5622487 6484248 5345964
2933 5345964 6569924 5339697 5542254 5312757 5141490 4676066 4762962 5221719 4337177
2924 4337177 4719091 5383027 4564044 3992014 4396954 4289526 5317004 4892887 4100007
2915 4100007 3738049 5498647 4942382 4727419 5035537 4457056 5862439 6109618 5091218
2906 5091218 3882233 5170592 5235454 4808764 4906069 4427792 4584735 5008016 5768416 4287331
2896 4287331 5097050 4802054 3942795 4486845 4763760 4646385 5247730 4792622 4513861 3492151
2886 3492151 3555522 4105491 4575265 4337210 3662893 4552015 3896056 4830356 5364723 4327231
2876 4327231 4679681 4053576 5463269 5006028 4575328 4905950 4652163 3428647 4805337
2867 4805337 4195990 4106246 5634105 4885978 5023393 4093358 4639336 4367569 4444811 4189975
2857 4189975 4891812 4971755 5931040 5827028 4840744 4704228 5604128 3979357 5578732
2848 5578732 5168454 4553222 5522037 4444717 4465211 5113000 5097174 6007550 5457872 4260812
2838 4260812 6031145 5822792 6226894 4919893 5280041 4898281 5172183 6006763 5152104
2829 5152104 5004805 5528264 6375666 5751167 4748901 6884889 5299168 5961149 6255386
2820 6255386 7569811 5528575 5697654 7062505 6845247 6634274 6563660 7293304 6426453
2811 6426453 6446389 6362523 6568971 7374837 7923142 6194336 6837885 7574102 7740861 7586973
2801 7586973 7760046 7154309 7694799 8168584 7123908 6520145 6388481 7007072 6837651
2792 6837651 7043130 6264248 6954283 8408022 6994412 7209864 8090421 7120318 7119358 7405156
2782 7405156 7999904 7000621 7861979 7257996 6705613 6540935 7541978 7125011 7040286 7113883
2772 7113883 8016444 7633471 8247179 8189690 7549594 8076371 7499806 7439110 8037998 8135528
2762 8135528 8090039 7624489 9001089 8237756 7388397 8430541 8713051 8679251 9882873
2753 9882873 9792453 9874338 10494080 11157152 10761996 9978475 9928732 11347291 12098885 13106333
2743 13106333 11698429 12751630 12800317 13410483 13664875 14238105 14730138 15826284 15042928
2734 15042928 14960843 16385553 17336570 19487425 24986602 32136022 38640849 40874165 33000160
2725 33000160 22623480 17261320 12294406 11618063 10011728 9933359 9247686 7986996 7617720
2716 7617720 6601819 6097494 5785764 5532128 5160992 4745108 4859290 5449117 5023650
2707 5023650 4320434 5299502 5493495 5694404 4829420 4286884 6102925 5170365 5314639
2698 5314639 4852890 4643123 5055621 5217243 5541626 4741243 4885169 4417958 5232951 5565361
2688 5565361 5827765 5650587 4543991 5022519 4274561 3734905 5501548 4379330 4081574
2679 4081574 4469292 3795698 5373268 5220180 5677613 4759923 4080210 5370432 4632445
2670 4632445 5685831 4746287 4354764 4788514 5521526 5400297 5882955 4866174 4934769
2661 4934769 5901149 5285328 6224146 6211904 5766063 6296280 6422823 6685920 6973499 6445558
2651 6445558 7512660 7494643 8011189 9011577 9214686 10299261 11845040 11659840 12755627
2642 12755627 15675517 20229106 30350042 40779337 46707813 46676773 32592694 24489396
2634 24489396 16841480 15045163 17339686 19287762 26356882 31517754 33621742 26345652
2626 26345652 19804974 17138020 15419069 17454361 23674824 32568518 39299525 42838541
2618 42838541 32186234 22311646 15780743 12800660 13817689 17237606 23526226 27085208
2610 27085208 29496156 23066696 15410187 10856690 8822928 9552784 10625754 13522036
2602 13522036 16182529 16012507 12591215 8505579 6915514 5875750 4844350 4705869
2594 4705869 4026583 4328497 4213390 3049991 3580258 4158995 4079045 4366206 4532675 4541616
2584 4541616 4030332 4820311 4182961 6349865 6554271 5592823 5748043 5428680 4914853
2575 4914853 5480357 5315524 5491335 6860052 5192289 4955601 4794995 4942246 4585311
2566 4585311 4040603 2494350 3872856 3243129 2408862 2700225 3747124 3084341 2976469
2557 2976469 1672212 2241569 2368530 2809015 3325882 2764899 2762246 4368173 1916538
2547 1850711 3204931 3227299 2307623 3302942 2200714 2343617 1777532 2951018 2342088
2538 2342088 2599898 2448766 2610798 2326006 2916004 1391974 2998494 2649104 3284237
2529 3284237 2956883 1926418 3222530 2449174 3710286 2538960 2603218 2436559 2090068
2520 2090068 2389048 2806405 1984026 2263550 2620145 3218117 2496834 2695260 1744425 2077740
2510 2077740 3221878 2094307 2853901 3745946 2137410 2633159 1967748 2919234 2166374
2501 2166374 2104553 3492497 1277458 2555031 2376365 3597293 3271896 2786341 2476665
2492 2476665 3508190 2993004 1996977 2146699 2552111 2375454 2385520 2576413 2914689 2693749
2482 2693749 2956388 2124694 1913056 2416387 3059887 3056114 2121064 2978793 2458013 2976889
2472 2976889 2624748 3831039 3622969 2702969 3569398 2719927 2273089 1950684 2081985
2463 2081985 2753999 3163824 3541941 781173 3604294 2058585 3067156 3550424 3293587
2454 3293587 2859734 2259794 3066148 3018948 2214312 2853427 3707742 3287948 3633168 1850606
2444 1850606 2598199 3607911 2817278 2928726 3809126 2839943 3719624 3541454 4149989
2435 4149989 2841540 4213002 4355255 3431552 3340947 3199064 1621290 3320677 3940158
2426 3940158 2873787 3290172 4005904 4009423 3352537 3984017 3274639 3517677 3015451 2418832
2416 2418832 3414014 3290199 3894021 4700984 2487208 3708779 3461648 2643988 2876963
2407 2876963 2890846 3675453 4510596 3858944 3227545 3893504 3954640 4212011 4036328 3440032
2397 3440032 3977782 3725625 3174411 3503504 3595677 2917436 4696425 3867907 3411469 4125165
2387 4125165 3744443 4903916 3412873 4065447 4715565 4157018 3668483 4785699 4049889
2378 4049889 4381350 4360886 4282474 3183548 3184729 4113008 3825709 3058803 3541962 4192294
2368 4192294 4096112 4292358 5023349 4530444 4783265 5727328 5641081 5155673 5581499 5863060
2358 5863060 5180847 5825574 5533571 5788968 5613198 5691970 6540608 6505321 6614303 4931367
2348 4931367 5562198 5526566 4749077 5309475 4982670 4465381 4803099 5151284 4829054 5466233
2338 5466233 4891395 4779788 5279177 4570395 4920276 5709861 5259447 5001448 4894185 5340912
2328 5340912 5559556 5398601 4833293 4746328 5724435 5234170 5465594 5736641 5398825 4019826
2318 4019826 5324937 5114810 4750208 5238888 4909201 4504095 4358499 4754764 5647426
2309 5647426 5216556 3474483 5109233 4519453 5478519 5646942 5359974 4801106 6048446
2300 6048446 5520667 5684497 6048403 5112296 5573101 5717180 5066617 7086398 5996266
2291 5996266 4858460 5030864 6401908 5943504 4731357 4790858 5951408 5796832 5163553
2282 5163553 5122346 5607863 5040117 5734246 5832919 5371661 4879091 5424711 6232305 5400231
2272 5400231 6728466 5219599 5763239 5181147 5471797 5796263 5598983 6079104 4670518
2263 4670518 5426698 5352283 5993802 6239052 6645180 5897426 5813879 4976087 6629982 5112017
2253 5112017 6156126 5667711 6034103 5429228 5770949 5854590 6012952 5798072 5710780 6897211
2243 6897211 5867908 5276347 6045536 5789600 3912574 4277662 5617420 4562645 5797050
2234 5797050 6675273 6094653 6121494 5641316 4806379 5791121 6171094 4983911 5905709 6227307
2224 6227307 6447036 5597725 4682400 4950618 6297691 5727011 5366538 5137829 4920765
2215 4920765 6050430 4748499 5768259 5365826 4903680 4601103 5216396 4516647 4909096
2206 4909096 4868548 5145363 6383775 5394318 5299982 4691147 6101120 5411089 6775230
2197 6775230 4724675 6174549 5421385 5359110 6183815 5257269 5115971 5623325 5202743
2188 5202743 6032014 6090626 6044096 5086459 6127668 7732503 6431015 7320071 5990763
2179 5990763 5948970 6757032 6434178 6487756 6579139 7021289 7406946 8473892 7751001 6983926
2169 6983926 7989865 7481249 6793976 7474171 8599988 7815950 8327165 8500940 9668134
2160 9668134 8748772 8450250 9192107 8539667 7822000 7725522 7326132 8076194 6963022 7403870
2150 7403870 7247921 6360670 7857158 7086051 7825690 7001824 8243311 6969631 7319989
2141 7319989 7381705 7975429 7694676 8291412 8993464 9326168 8197608 8163736 8222567 7910762
2131 7910762 8428158 8636679 7818951 8938770 7589515 8102575 7777078 7460016 7698960
2122 7698960 8092151 8065960 8599582 7616116 8259917 8006568 7008938 7391734 8167578 7596045
2112 7596045 7241314 8166515 6396877 7649121 7355990 6812014 7230936 7572620 7995783
2103 7995783 8072499 7843957 7726849 7798790 7728153 8231501 8307702 9087356 7801695 6314655
2093 6314655 7376721 6340575 6483651 6422083 6828935 6832417 7157281 6646686 7427591 6391472
2083 6391472 7048752 7530007 6813802 7028184 6805918 7082695 6033330 7009000 7333951
2074 7333951 6609934 6862873 6877811 7219556 7024165 7305461 7352076 7651580 7764144 7199624
2064 7199624 7883382 8350038 8338850 7672687 7909691 8910796 7815761 8695454 8765934 8504296
2054 8504296 8126881 8798744 8011496 8187828 8093252 7871059 7748680 7917914 8837342 9258326
2044 9258326 9009666 9360918 7809364 9174767 10619417 9203460 9635537 10206685 10956554
2035 10956554 9880225 10084637 10127539 10511032 10869824 10107493 10035823 11515942 12128436
2026 12128436 10978835 12729086 12345199 12729414 11484831 11120489 11871640 11532209 11403340
2017 11403340 11416652 10926377 10369721 11003911 10624898 11241618 12118978 10954982 10313259
2008 10313259 11226462 11346573 12117657 12291043 11426822 11085932 10952464 11248586 12107192
1999 12107192 10830117 10777657 10863790 11252521 10716174 11578061 11114043 12073417 12532734 12963301
1989 12963301 12300255 13048499 12411018 12439644 11829230 12493552 11658631 13029741 12399456
1980 12399456 12400249 12169438 12284163 12178864 11997228 12020763 11788461 12024534 12027111 12478540
1970 12478540 12888697 13077617 13729307 16064924 18528510 24225458 31685258 36276162 33499002
1961 33499002 23713686 17382996 13585551 11507849 11425028 10433132 10797481 9972676 9817346
1952 9817346 10262515 10021493 9717582 8608303 9463417 9221187 8883138 8901631 8607490 8357901
1942 8357901 8594486 9796712 9330469 8847449 9132087 8464324 7960346 7307313 7394549 7713332
1932 7713332 8052022 8283289 7661697 7508008 6436143 8193095 8180631 6451477 6783983
1923 6783983 6810141 6576421 7275611 6394643 6669602 7468653 7517918 7085257 6173122 5659021
1913 5659021 6454431 6819639 6289060 6088308 6504088 5333914 7201677 5841586 7277054
1904 7277054 6136940 6874710 6847211 6577670 7257879 6719302 5958278 5670896 6505184 6515389
1894 6515389 6271000 6307688 6310872 6195602 5584396 7150578 5383940 6090210 6308502 6925126
1884 6925126 6758832 5784720 6131265 6853024 6009754 6803599 6648605 7228250 6919399 5846720
1874 5846720 6248927 6304983 5964446 6425413 6858553 5740242 6370643 6522737 7062902 6980887
1864 6980887 6985054 7037510 6541088 6987280 6124788 8272381 6596788 7547762 7503659 7097643
1854 7097643 8299704 8155422 8618795 7892543 8252168 8504637 8393330 9026793 8379743
1845 8379743 9496351 9495491 8094749 9596056 8827135 9386838 9876294 9734228 11335809
1836 11335809 10032484 9824930 9469425 9645843 10281934 9686359 9899892 10314977 11233675
1827 11233675 9743407 11553672 10975527 10259401 11466056 11711007 11636948 12384312 12990433
1818 12990433 10931416 12377696 12237927 13204719 13281071 13142864 13917565 14085070 14088069 14800689
1808 14800689 14488500 14946998 15070870 14872367 13664869 14801411 14034734 14249190 14555166
1799 14555166 13606582 14014021 13809274 13879886 12024120 13386027 12500547 12934535 12113269
1790 12113269 12565804 12101863 13478831 12644569 12400775 11447677 12109457 12316849 12246612
1781 12246612 12267247 13409133 12737375 12701190 11967959 12025323 12616844 11894372 11360885 12823099
1771 12823099 11895484 13249671 11482219 12295780 10311987 12958332 12269360 11339023 10938843
1762 10938843 11524873 11404165 10706995 10043678 10160658 9979873 10404104 10266164 9178554
1753 9178554 8927307 9464355 9718586 7910489 9091372 8752483 9243158 7912510 8122178
1744 8122178 8619295 9145170 7517971 8707542 8024983 8443428 7507921 8983622 7118202
1735 7118202 9469698 7967775 8602718 7504568 8320865 7381250 7862092 8076185 8475492
1726 8475492 7612293 8062510 8478099 8176042 6753614 7030840 8156134 8312303 9378923
1717 9378923 7919650 7624108 8269220 8330211 8737456 8248190 8455167 8994211 8772406 9384606
1707 9384606 9220028 8327239 9058860 8776394 9093646 9965475 9711836 9333242 8291258
1698 8291258 10331037 10483982 10199416 10068426 10279591 10826612 11257854 11647827 11319913
1689 11319913 11610365 12143062 11955705 10950330 12557481 13011005 13419120 13448558 13267047
1680 13267047 13218204 14452410 13237754 13337107 15229476 15887361 16035453 16352700 14202572
1671 14202572 15776825 15861961 16274508 16753095 17767198 18013401 19405004 19773190 20172556
1662 20172556 20496922 21376212 22667556 23831898 25095708 26086138 26761188 28555472 29455490
1653 29455490 30549080 33175256 34893446 34445437 37144750 37535433 38762589 40729149
1645 40729149 40845317 42813109 41395725 42759873 43620189 45614881 45660045 47452885 49171389
1636 49171389 50994185 51949621 53483869 57012668 60244024 61723188 65503096 69991868
1628 69991868 73906348 79502931 85702619 93597363 101151339 109448514 117339921 121270274
1620 121270274 122288282 117834866 111539898 102738115 92097715 79512883 66370744 54637089
1612 54637089 45431973 37360737 32158054 27826974 24478836 22836292 20871564 18753714
1604 18753714 17494725 17247218 16078085 15676590 13468150 13869436 13581747 12540801 12708349
1595 12708349 12412345 11172112 10944558 11330583 10166087 10458297 9926334 9867406 9609861
1586 9609861 9661281 9060385 9251908 8718890 8837108 8849060 7917523 7986764 8210591 8531342
1576 8531342 7931508 7865751 7041174 6873503 6511342 7671264 6711942 7237504 6591204 6577392
1566 6577392 5924937 7409554 6716019 6613903 6869953 5301228 5371422 6637734 5509010
1557 5509010 6328007 5363568 5387298 6642448 5646006 5629277 5032442 5518592 5523481 4625145
1547 4625145 4057007 4805019 4828772 5015977 5274115 4637873 4060993 3985344 3856719 4280975
1537 4280975 5459540 3179974 3882787 5127369 4255667 4284872 4467458 3780470 4145017
1528 4145017 4079438 4172699 3691699 3438514 4269480 3590425 4332497 3002961 4443044 3431565
1518 3431565 3063605 5131977 4885146 3850142 4487205 4571372 4200222 5573099 4080565
1509 4080565 4580736 2703418 4813571 4213937 5812989 4683075 5000566 5080700 3843973
1500 3843973 4761060 5834286 5105090 4897642 4794764 5121507 5957939 5189438 6224482
1491 6224482 6428205 7110534 6328287 7056553 6374913 7400502 6989610 6609157 7041156
1482 7041156 7071454 7732634 7204816 7432841 7874171 7478494 8127642 9577943 9634933 9774426
1472 9774426 10827531 12005496 12047891 12491348 13528958 11512770 12178343 10862718 10656439
1463 10656439 10897466 9454767 9265022 9815677 8774304 8445429 9881693 9384778 9549615
1454 9549615 10093663 9745677 9484332 8910253 9006450 9148131 9392383 8462991 8497676 9533094
1444 9533094 9467659 9361710 8187096 9249252 8649228 9689374 9978583 10287873 9958350
1435 9958350 11459795 13565620 12905049 13338425 13762371 13124026 14253699 15108214 14299010
1426 14299010 13240189 12090711 13260884 10575414 10016126 9655628 7903306 7538964 9017418
1417 9017418 7380251 6975482 8571945 8984292 8130296 8105548 9208259 8059447 8362428
1408 8362428 8846141 8576586 9450534 9556937 10529050 11110536 12409935 11814164 10815269
1399 10815269 12899432 12160279 11331037 11166882 9908751 8737818 7551938 7788999 6788089
1390 6788089 6506089 6086775 5347931 5104530 6051944 4855240 5819733 5282772 5106204
1381 5106204 5263448 4637504 4751513 4040556 4919648 4417202 4335867 4575064 3998438 3001689
1371 3001689 4967130 3954318 3713949 3262117 4195368 3811116 3567565 4019656 3177611
1362 3177611 3190295 3728503 3385475 3629272 3873380 3035661 3002278 3434190 3404495 3172401
1352 3172401 4059714 5252592 3572983 3891955 3367548 5255473 3734434 3699123 4816645
1343 4816645 3870370 4323854 4861552 5160117 4801233 3805771 4592035 4033443 4695933 4430660
1333 4430660 3426593 4996550 5136728 3859169 3432048 4245276 4454873 3794242 4040989
1324 4040989 4666762 4005825 4051957 4588932 4087562 3682116 3847119 4221668 4036455 3877819
1314 3877819 3629571 3709097 4465963 4525439 4915746 4210013 4873218 4908435 5218568 4090366
1304 4090366 4568482 3514523 3505827 3911328 3018078 3407934 4139702 3123947 2701242 2414673
1294 2414673 2623443 2599060 2482019 2323924 1279491 2132890 1504598 2147653 1992332 2097139
1284 2097139 1721226 1759242 1763372 1697008 2067461 1591230 1740951 1841464 1633938 2012272
1274 2012272 1771150 1922676 250834 1439382 2850212 1720349 1289510 290679 1129093
1265 1129093 493891 2045248 999914 1623391 737857 822534 1002298 820320 1603398 1425392
1255 1425392 989025 2165982 1061849 1037771 1138966 429265 1649798 1879498 1282223
1246 1282223 824671 1248627 607313 1414349 1280123 1533867 1583012 2381908 863569 848761
1236 848761 553232 248310 812489 1231947 149716 1086559 694828 818595 369465 826704
1226 826704 440390 1643486 2422877 -341731 1464991 1408471 1155701 256278 253308 1090351
1216 1090351 757791 1144085 1043381 672539 1427427 1534799 2151080 358845 1503954
1207 1503954 1603238 859283 207403 1560748 1372716 643593 282637 1108289 934845 1574959
1197 1574959 314752 1660140 1677285 252327 298491 864324 604878 996783 1564099 1354446
1187 1354446 1242448 1496173 1403087 104502 123213 1581081 901986 1526305 1326352 1116840
1177 1116840 1146027 927708 1616172 2013754 1755100 610158 1593829 2048070 1790000 1716854
1167 1716854 1595518 1577970 1136287 1888332 990194 508899 460618 2079821 251142 776452
1157 776452 2127883 1835687 820412 1072141 2880904 791342 791641 1587891 1858600 1823736
1147 1823736 798546 1352098 418808 1142065 1737733 824028 1175017 1278710 1329677 1342021
1137 1342021 2289353 966427 1899310 792302 1775724 1685297 1278249 680960 108212 1438198
1127 1438198 1876618 1548982 955009 1079045 703662 2024229 1308182 1158925 1074786 543173
1117 543173 1010877 1360107 1559586 474722 1837361 747461 571478 1609156 1624164 896472
1107 896472 900628 1409360 1427003 1069040 1302630 1080129 1960600 1772375 1054951 1169917
1097 1169917 566038 1137635 2279901 1068429 861818 1206044 900105 769442 1164973
1088 1164973 1150367 1959794 449364 1822654 234850 1270295 829768 1694180 1834064
1079 1834064 1632517 1505327 1585137 1614910 965564 1472940 1602354 1518130 1374501 674814
1068 1493148 735723 946624 1723085 2022020 1819167 1625280 2507495 870608 1838135 1689539
1058 1689539 942367 973483 1268504 852784 1939107 1536698 2474223 2219239 2182165 901705
1047 1918385 2408773 1282498 1979212 1534189 2397122 1388031 1018315 955250 2271493
1038 2271493 2256263 2236148 1073118 1991835 1896262 1598108 1494020 1766238 1964061 2024653
1028 2024653 2415588 1350304 1662507 2277273 2424704 2843384 2272153 2547747 2104263
1019 2104263 2060989 2996795 2972568 2982499 3312910 3534400 3061722 3974923 3681295 4597925
1009 4597925 4709156 5255159 5103267 5888266 7165292 8319553 9687702 8451381 8838226
1000 8838226 8725753 8237597 8875812 9971500 9725691 11013041 12910392 13423121 15414340
991 15414340 19136188 22168296 30276946 49769277 78696476 108576074 127246185 88588515
983 88588515 49933481 27608152 12973918 10255403 7952856 6966330 3841182 4235520
975 4235520 4953230 3703037 3536391 2653428 3324544 2969905 4665490 4905445 5058414
966 5058414 4623001 2476090 2514942 3213544 1658537 1349279 1219928 1489874 1820300 1170268
956 1170268 2644195 328566 294274 1398082 1260377 638294 1239609 1531911 717488 1206822
946 1206822 371241 654489 764357 835533 278066 886105 1375823 765622 1495593 1020925
936 1020925 1439642 461735 907478 961609 977853 2181330 575675 1559672 591188 -334584
925 -78711 -135028 -74915 36287 -148246 -507717 804651 873376 904020 823064 -44776 1596627
913 166885 664386 903715 321366 704876 691478 38607 399676 1031943 929863 864526
903 864526 46389 836825 366129 806682 468855 331831 92957 621032 539169 884604
893 884604 58948 1059876 396849 58444 1321792 -9272 586689 947663 391352 872196
883 872196 497487 1066237 997172 -59370 1195945 8717 207533 534081 161051 -133330
872 809322 118715 61657 -114747 405675 715046 -884991 677295 -22504 1341601 -247848
861 88629 474641 1544795 970512 819354 -34204 -59812 931581 1561563 684213 91471
850 794954 305389 -345036 992563 77300 791659 494919 624102 63731 280081 -327630
839 367909 665610 -107472 276667 94479 -142265 -532860 -5650 1085271 379705 -680698
828 630141 451585 -94303 1058039 365956 449650 -214498 454756 400472 376737 45133 126597
817 126597 259302 1815833 15098 -180700 9118 766030 580009 -779878 1356892 459470
806 48596 521286 107633 579381 257330 -423488 -556571 -293525 953451 162773 -76833
795 -11067 867375 962723 -92210 554825 1063810 1015217 -257327 -659233 63955 1004010 51046
783 133875 1157188 712783 -1057631 13142 -451760 42121 248407 -147514 303397 -197693
772 987719 -394744 382894 113508 320754 -308510 870708 -290737 10101 -221835 1009239
761 209013 893457 426201 40187 653514 750491 -263931 -236294 828150 1119287 -33313 -62000
750 -62000 675294 35435 1022422 -496688 981411 457102 504534 -171055 119311 -567646
739 329030 808907 -101230 208474 219003 122877 1242531 160820 1042334 594949 -251510
728 -135146 -11948 -23486 363588 251859 840337 414644 813537 556504 -61873 -175082
718 -175082 13930 1108928 642074 47538 291878 1019753 -680569 1086440 547823 461935
708 461935 -256467 455987 619210 461545 850729 780328 91449 996934 375447 -460796
697 505046 260533 821282 574413 -206102 480107 190736 1673468 1035973 253902 2122072
687 2122072 1381386 1606793 842528 1501908 231643 854276 46775 72650 -288344 291384
676 488057 1006202 363582 1356707 816955 877053 1035374 327540 469503 773023 788225
666 788225 1041244 1020736 1042296 1170961 939109 335592 834824 819306 -142454 1033982
655 591558 742008 362820 1166139 -463846 39417 77721 -6239 304282 -668841 608027 -207200
643 -46477 339280 221367 749684 1050738 308931 483942 -955247 -511606 -238256 920424
632 -334909 -378486 17917 547923 109898 95254 -271605 526109 593309 603252 -379840 -761854
621 -761854 -134308 -225443 -58785 356369 1061656 197082 234650 -871187 -267359 233328
610 748198 -134652 222009 -64678 -407352 313054 183276 -275015 218671 -947377 435596
599 35198 37597 -31193 739835 928064 320165 -112560 57204 277542 283260 -341363 177063
587 -720089 -505047 -528026 -284114 -1483340 27875 474535 777876 335622 -1060276 917652
576 362616 690234 -264896 -321644 -408671 -954392 961783 1216708 -547394 283385 130851
565 -838769 370671 359570 231659 -851888 617595 363557 -40803 -439696 428187 199191
554 -663337 -516884 -191231 -425077 789216 503097 134743 -158582 -135802 344368 -254000
543 985014 -336843 641761 961041 -284148 186773 378376 447334 -489328 954228 -743290
532 213657 403008 -949409 143506 -1008844 -31820 253971 13635 -124601 -266326 263037
521 -228948 61934 -790555 974202 -731363 251963 -393681 230925 745529 25260 256049
511 256049 699287 197594 774095 -96967 314365 364608 -137296 580678 556068 -563806
500 53858 -612924 -1185471 63183 -376792 -134733 -206818 145237 -362238 -246197 371201
489 -598025 917040 1163280 37177 -620133 -15735 36592 774358 236313 217680 -206112 86223
477 89280 63454 -1053166 225906 -127282 290735 -779965 -401814 929976 303151 1392879
467 1392879 -215501 545181 -152510 -49093 512243 -264997 -676554 -198781 154264 338188
457 338188 931888 -153125 -329678 590418 -449298 149965 428414 -1013768 -1000208 257612
446 482403 -181529 52841 782300 -523125 514913 480226 575140 -84721 -501049 137378 302296
435 302296 -958910 456105 219337 -190186 -126833 692924 529259 80700 -206394 -27068
424 179059 386452 -354839 75188 178695 -147255 250793 394258 164475 -403926 259084
413 136525 -765943 447560 110854 956379 -241375 -346758 -279592 22510 -740658 322449
402 -58346 55759 -635344 -262805 191079 -115325 -303707 -668220 -236710 514398 698842
392 698842 598757 911843 -488708 121252 -247473 1213321 -739772 -179830 -61762 -510899
382 -510899 -613842 -857197 605642 -604485 665659 353588 -274502 516419 -513942 -480087
372 -480087 365348 962715 -243681 -338040 389041 471479 221265 395432 780361 -215799
361 1570340 1132029 717179 1065878 1232420 729854 573713 -548552 305917 567906 1557588
351 1557588 -241725 776158 886200 -33188 -235055 205750 -952583 349803 -680947 969957
340 299952 153188 1099504 -663872 -668951 30529 110595 15988 -350075 625284 687373 -336389
328 -579976 -813796 215132 -915208 -475279 638280 301758 13838 1475690 43715 -157234
317 551617 79811 675844 -449836 -1647263 -79421 -1106322 -1285237 83864 928174 -615756
306 -779124 439198 -106281 240475 -1037287 -256692 -527943 -588152 264764 -80761 -41072
296 -41072 60576 -518040 -172250 684409 468175 -362415 -727799 -125478 273941 -369467
285 80248 -253450 179209 177469 -853093 221800 -48781 -278844 -639388 -623227 -585822 -1008892
274 -1008892 -576760 -752278 -146183 -648807 -227534 -1424262 204778 -964310 -250073 -778619
264 -778619 -1195699 -370408 -526080 54376 -52704 -290209 788592 189886 -421320 -1189082
254 -1189082 -956743 -1120591 -412421 81478 -202780 -147224 319033 -270727 -264294 -903725
244 -903725 349264 339977 -1281696 -765752 70092 -451347 125188 -221550 28082 63788 -269723
232 -1045104 -1104241 -492377 441420 -469625 268649 -829878 -380554 378438 -606198 424241
221 285675 42388 -502878 -467213 -132868 -398078 393489 -295782 -1429915 388608 3900
210 -473529 824103 250200 -374513 491854 713417 245191 -170900 -157166 -448696 -310848
200 -310848 -304837 -200534 895708 -863257 -1684 -210820 -477124 556830 -275156 -383907 -300107
189 -300107 807211 528389 63261 -1349636 -377185 -183061 -503480 239049 -261646 -108401
178 16460 -50827 -621714 100241 754951 -356497 -609597 695095 -91904 -600264 759403
167 -327618 -732576 74588 284881 -179401 -723399 753207 -232218 -171831 28456 576124
157 576124 -1234206 430871 51760 328099 225176 24018 -221273 -471507 97716 -265420
146 -605594 -634734 893317 74500 438931 -796193 323382 -497725 -57107 -628655 53151 569810
135 569810 1074505 689627 -459937 -377328 -615186 -243331 321477 -602482 -841435 18041
124 104306 -707871 286617 -421038 -45846 -122591 -192852 -376254 542570 -24582 493608 -728259
112 1334191 -312255 -145018 754737 -949608 190858 -281818 -36526 -728901 440453 -560569
101 327468 -418092 -992183 427632 -93573 142418 176081 44955 -713837 -664224 248013 244947
90 244947 541352 312331 -107779 434377 -451289 -36893 -554128 -760457 790325 -61207
79 210427 202109 138923 5248 181551 -274410 -895303 224039 -23889 -825580 606834 -367197
67 -453619 762676 390636 -843338 -72665 656397 -132158 -20418 558854 477387 31832 -1383994
55 280519 384234 -776699 354773 50840 -474898 -839114 394 -153774 88583 -69851 19964
43 714105 -385043 -456156 -137334 325953 123222 820132 -231341 -655859 -83006 -1076299
33 -1076299 -568437 -823047 -766870 62667 -87979 28235 -948180 281964 127401 457160 -475691
21 -637735 -854760 246120 -1071103 277924 539313 39469 -145573 535443 -395128 -160444
10 -568284 276219 458270 -523040 -385511 701294 244487 -162382 183386 -175991 67969
##END=
