##TITLE=141760
##JCAMPDX= 6.0         $$ Bruker NMR JCAMP-DX V2.0
##DATA TYPE= NMR SPECTRUM
##DATA CLASS= XYDATA
##ORIGIN= NUTS EXPORT
##OWNER= Administrator
$$ 1.72 TOPSPIN		Version 2.1
$$ 2016-02-23 12:24:06.355 -0800  Administrator@X
$$ Compression mode = diff/dup
##.OBSERVE FREQUENCY= 90.275459
##.ACQUISITION MODE= SIMULTANEOUS (DQD)
##.ACQUISITION SCHEME= undefined
##.AVERAGES= 16
##.DIGITISER RES= 22
##SPECTROMETER/DATA SYSTEM= 
##.PULSE SEQUENCE= zg30
##.SOLVENT NAME= None
##.SHIFT REFERENCE= INTERNAL, None, 1, 14.27961
##AUDIT TRAIL= $$ (NUMBER, WHEN, WHO, WHERE, PROCESS, VERSION, WHAT)
$$ ##TITLE= Audit trail, TOPSPIN		Version 2.1
$$ ##JCAMPDX= 5.01
$$ ##ORIGIN= Bruker BioSpin GmbH
$$ ##OWNER= Administrator
$$ $$ E:/data/jwist/nmr/1760/1/pdata/1/auditp.txt
$$ ##AUDIT TRAIL=  $$ (NUMBER, WHEN, WHO, WHERE, PROCESS, VERSION, WHAT)
(   1,<2016-02-23 09:39:33.246 -0800>,<Administrator>,<X>,<jcamp>,<TOPSPIN 2.1>,
      <fromjdx created from
       E:\data\jwist\nmr\uniandes\1760
       data hash MD5: 8K
       F3 D0 12 42 0B 5C 3A 72 0B 4A E7 29 10 1A 45 B1>)
$$ ##END=
$$ 
$$ $$ hash MD5
$$ $$ 2C CA F5 C2 FD 4A 72 5B D9 40 6C E6 92 59 F9 C6
##$RELAX= 
$$ Bruker specific parameters
$$ --------------------------
##$DU= <E:>
##$EXPNO= 1
##$NAME= <141760>
##$PROCNO= 1
##$TYPE= <nmr>
##$USER= <jwist>
##$ACQT0= 0
##$AMP= (0..31)
100 100 100 100 100 100 100 100 100 100 100 100 100 100 100 100 100 100
100 100 100 100 100 100 100 100 100 100 100 100 100 100
##$ANAVPT= 1
##$AQSEQ= 0
##$AQ_mod= 3
##$AUNM= <au_zg>
##$AUTOPOS= <>
##$BF1= 90.275459
##$BF2= 400.02
##$BF3= 400.02
##$BF4= 400.02
##$BF5= 400.02
##$BF6= 400.02
##$BF7= 400.02
##$BF8= 400.02
##$BYTORDA= 0
##$CFDGTYP= 0
##$CFRGTYP= 0
##$CHEMSTR= <none>
##$CNST= (0..63)
1 1 145 1 1 1 1 1 1 1 1 1 1 1 1 1 1 1 1 1 1 1 1 1 1 1 1 1 1 1 1 1 1 1 1
1 1 1 1 1 1 1 1 1 1 1 1 1 1 1 1 1 1 1 1 1 1 1 1 1 1 1 1 1
##$CPDPRG= <>
##$CPDPRG1= <>
##$CPDPRG2= <>
##$CPDPRG3= <>
##$CPDPRG4= <mlev>
##$CPDPRG5= <mlev>
##$CPDPRG6= <mlev>
##$CPDPRG7= <mlev>
##$CPDPRG8= <mlev>
##$CPDPRGB= <>
##$CPDPRGT= <>
##$D= (0..63)
0 1 0 0 0 0 0 0 0 0 0 0 0 0 0 0 0 0 0 0 0 0 0 0 0 0 0 0 0 0 0 0 0 0 0 0
0 0 0 0 0 0 0 0 0 0 0 0 0 0 0 0 0 0 0 0 0 0 0 0 0 0 0 0
##$DATE= 0
##$DBL= (0..7)
120 120 120 120 120 120 120 120
##$DBP= (0..7)
150 150 150 150 150 150 150 150
##$DBP07= 0
##$DBPNAM0= <>
##$DBPNAM1= <>
##$DBPNAM2= <>
##$DBPNAM3= <>
##$DBPNAM4= <>
##$DBPNAM5= <>
##$DBPNAM6= <>
##$DBPNAM7= <>
##$DBPOAL= (0..7)
0.5 0.5 0.5 0.5 0.5 0.5 0.5 0.5
##$DBPOFFS= (0..7)
0 0 0 0 0 0 0 0
##$DE= 6.5
##$DECBNUC= <off>
##$DECIM= 2432
##$DECNUC= <off>
##$DECSTAT= 4
##$DIGMOD= 1
##$DIGTYP= 12
##$DL= (0..7)
0 120 120 120 120 120 120 120
##$DP= (0..7)
150 150 150 150 150 150 150 150
##$DP07= 0
##$DPNAME0= <>
##$DPNAME1= <>
##$DPNAME2= <>
##$DPNAME3= <>
##$DPNAME4= <>
##$DPNAME5= <>
##$DPNAME6= <>
##$DPNAME7= <>
##$DPOAL= (0..7)
0.5 0.5 0.5 0.5 0.5 0.5 0.5 0.5
##$DPOFFS= (0..7)
0 0 0 0 0 0 0 0
##$DQDMODE= 0
##$DR= 22
##$DS= 2
##$DSLIST= <SSSSSSSSSSSSSSS>
$$ [...]
##$SPOFFS= (0..31)
0 0 0 0 0 0 0 0 0 0 0 0 0 0 0 0 0 0 0 0 0 0 0 0 0 0 0 0 0 0 0 0
##$SUBNAM0= <"">
##$SUBNAM1= <"">
##$SUBNAM2= <"">
##$SUBNAM3= <"">
##$SUBNAM4= <"">
##$SUBNAM5= <"">
##$SUBNAM6= <"">
##$SUBNAM7= <"">
##$SUBNAM8= <"">
##$SUBNAM9= <"">
##$SW= 20.5580556627758
##$SWIBOX= (0..15)
0 0 3 4 0 0 0 0 0 0 0 0 0 0 0 0
##$SW_h= 8223.68421052631
##$SWfinal= 0
##$TD= 65536
##$TD0= 1
##$TE= 300
##$TE2= 300
##$TE3= 300
##$TEG= 300
##$TL= (0..7)
0 120 120 120 120 120 120 120
##$TP= (0..7)
150 150 150 150 150 150 150 150
##$TP07= 0
##$TPNAME0= <>
##$TPNAME1= <>
##$TPNAME2= <>
##$TPNAME3= <>
##$TPNAME4= <>
##$TPNAME5= <>
##$TPNAME6= <>
##$TPNAME7= <>
##$TPOAL= (0..7)
0.5 0.5 0.5 0.5 0.5 0.5 0.5 0.5
##$TPOFFS= (0..7)
0 0 0 0 0 0 0 0
##$TUNHIN= 0
##$TUNHOUT= 0
##$TUNXOUT= 0
##$USERA1= <user>
##$USERA2= <user>
##$USERA3= <user>
##$USERA4= <user>
##$USERA5= <user>
##$V9= 5
##$VALIST= <valist>
##$VCLIST= <CCCCCCCCCCCCCCC>
##$VD= 0
##$VDLIST= <DDDDDDDDDDDDDDD>
##$VPLIST= <PPPPPPPPPPPPPPP>
##$VTLIST= <TTTTTTTTTTTTTTT>
##$WBST= 1024
##$WBSW= 4
##$XGAIN= (0..3)
0 0 0 0
##$XL= 0
##$YL= 0
##$YMAX_a= 1881000576
##$YMIN_a= -3293250.56
##$ZGOPTNS= <>
##$ZL1= 120
##$ZL2= 120
##$ZL3= 120
##$ZL4= 120
##$ABSF1= 10
##$ABSF2= 0
##$ABSG= 5
##$ABSL= 3
##$ALPHA= 0
##$AQORDER= 0
##$ASSFAC= 0
##$ASSFACI= 0
##$ASSFACX= 0
##$ASSWID= 0
##$AUNMP= <proc_1d>
##$AXLEFT= 0
##$AXNAME= <>
##$AXNUC= <off>
##$AXRIGHT= 0
##$AXTYPE= 0
##$AXUNIT= <>
##$AZFE= 0.1
##$AZFW= 0.1
##$BCFW= 1
##$BC_mod= 2
##$BYTORDP= 0
##$COROFFS= 0
##$CY= 15
##$DATMOD= 1
##$DC= 2
##$DFILT= <>
##$DTYPP= 0
##$F1P= 0
##$F2P= 0
##$FCOR= 0.5
##$FTSIZE= 0
##$FT_mod= 4
##$GAMMA= 1
##$GB= 0
##$INTBC= 1
##$INTSCL= 1
##$ISEN= 128
##$LB= 0.3
##$LEV0= 0
##$LPBIN= 0
##$MAXI= 10000
##$MC2= 0
##$MEAN= 0
##$ME_mod= 0
##$MI= 0
##$NCOEF= 0
##$NC_proc= -10
##$NLEV= 6
##$NOISF1= 0
##$NOISF2= 0
##$NSP= 1
##$NTH_PI= 0
##$NZP= 0
##$OFFSET= 14.27961
##$PC= 1
##$PHC0= 0
##$PHC1= 0
##$PH_mod= 0
##$PKNL= yes
##$PPARMOD= 0
##$PPDIAG= 0
##$PPIPTYP= 0
##$PPMPNUM= 2147483647
##$PPRESOL= 1
##$PSCAL= 4
##$PSIGN= 0
##$PYNMP= <proc.py>
##$REVERSE= no
##$SF= 90.2741699200893
##$SI= 8192
##$SIGF1= 0
##$SIGF2= 0
##$SINO= 400
##$SIOLD= 32768
##$SPECTYP= <>
##$SREGLST= <1H.CDCl3>
##$SSB= 0
##$STSI= 0
##$STSR= 0
##$SW_p= 1497.18866228788
##$SYMM= 0
##$S_DEV= 0
##$TDeff= 0
##$TDoff= 0
##$TI= <>
##$TILT= no
##$TM1= 0
##$TM2= 0
##$TOPLEV= 0
##$USERP1= <user>
##$USERP2= <user>
##$USERP3= <user>
##$USERP4= <user>
##$USERP5= <user>
##$WDW= 1
##$XDIM= 8192
##$YMAX_p= 1881000485
##$YMIN_p= -3293250
##$CURPLOT= <PDFCreator>
##$CURPRIN= <$PDFCreator>
##$DFORMAT= <normdp>
##$LAYOUT= <+/1D_H.xwp>
##$LFORMAT= <normlp>
##$PFORMAT= <normpl>
##$SURQMSG= 1
$$ End of Bruker specific parameters
$$ ---------------------------------
##XUNITS= HZ
##YUNITS= ARBITRARY UNITS
##XFACTOR= 0.182762287876938
##YFACTOR= 1
##DELTAX= -0.182762287876938
##NPOINTS= 8192
##FIRSTX= 1497.0059
##FIRSTY= -2283942
##LASTX= 0
##MAXY= 1881000485
##MINY= -3293250
##XYDATA= (X++(Y..Y))
8191b283942C05487f12330C101885C25109a17633q54795F27712g39655A373801
$$ -2283942 305487 -612330 3101885 325109 -117633 -972428 627712 -739655 1373801
8181B7130a640845C07516K97556a222045I35859O59388k37507A42833K402162
$$ 27130 -1640845 307516 605072 -1222045 935859 1595247 1357740 142833 2544995
8172B544995H66742N10847c91034G01497H5382b67735C3580g60262A788967k50852
$$ 2544995 866742 1377589 -391034 701497 85382 -267735 33580 -760262 1788967 1538115
8162A538115m916E5068a071551n2720L21001p77302b5456A021800i70173k97022
$$ 1538115 1533199 55068 -1071551 -1124271 -803270 -1580572 -25456 1021800 -970173 -1267195
8152a267195C51299c95685j29411E81665A97649a678175E27411B5516a233967
$$ -1267195 351299 -395685 -525096 581665 197649 -1678175 527411 25516 -1233967
8142a2483l51340B00591J380233n31542l20577b51405l00760A45689a102894I2203
$$ -12483 -363823 200591 1580824 1049282 728705 -251405 -552165 145689 -1102894 92203
8131a158939B4579N14031e07174o5720K1372m09607a33832q97570L21806D34330
$$ -1158939 24579 538610 -507174 -572894 -551522 -961129 -133832 -1031402 -709596 434330
8120A74218b51193j800392E80807k06318J98035L55432A26694O20456A63487a597127
$$ 174218 -251193 -2051585 580807 374489 572524 927956 126694 747150 163487 -1597127
8109E89860j06576J845738o59725E48342R22019E09768j29140Q49353P2143a136277
$$ 589860 483284 2329022 1669297 548342 1470361 509768 380628 1229981 1302124 -1136277
8098a126054B133538d78219j6203n86889O5856B883359C40196a263973j55113
$$ -1126054 2133538 -478219 -494422 -1081311 -1015455 2883359 340196 -1263973 -1419086
8089a419086b77659E1318c87893j124699F60974a242942a8259j957437Q44154
$$ -1419086 -277659 51318 -387893 -1512592 660974 -1242942 -18259 -1975696 -1131542
8080a131542F65697l24208D3547J128446k91730b185581D74609c41643I95488
$$ -1131542 665697 341489 43547 1171993 880263 -2185581 474609 -341643 995488
8070a325771j707207a121087N33347I98840Q10042f84663a87453j436915A88444
$$ -1325771 -3032978 -1121087 -587740 998840 1808882 -684663 -187453 -1624368 188444
8060A363887B02809J745980H38227l38190g86022Q9354L01689A392878J05197
$$ 1363887 202809 1948789 838227 500037 -786022 -696668 -394979 1392878 1498075
8051A498075e57277E06365c80122A184401K1470k23624m68514c12596A794831
$$ 1498075 -557277 506365 -380122 1184401 1205871 982247 513733 -312596 1794831
8041d07667q1817D99949A49525l8506a645135G70717K397302i34415B00894b115605
$$ -407667 -489484 499949 149525 111019 -1645135 770717 3168019 -934415 200894 -2115605
8030F81624k29541b42003l95699j454962P72239F73556N89660a145613k50785
$$ 681624 452083 -242003 -637702 -2092664 -1320425 673556 1263216 -1145613 -1396398
8021a396398A475270a614801C45374f02446A661546k80803c74070k43969k02666
$$ -1396398 1475270 -1614801 345374 -602446 1661546 1380743 -374070 -618039 -820705
8012h20705M03151I05651c89144E50374j65770a502915J96789C67769J312070
$$ -820705 -417554 905651 -389144 550374 384604 -1502915 -1306126 367769 1679839
8003A679839o89409f95993F80722a076561d24724q11894B78481R83213P0069f10967
$$ 1679839 990430 -695993 680722 -1076561 -424724 -1236618 278481 1261694 1331763 -610967
7992c05198G56384f09147i9511A692110P63562c96858j84757k039940A278340
$$ -305198 756384 -609147 -99511 1692110 2455672 -396858 -581615 -2621555 1278340
7982a218339K95896c14124D20548A34148d66811m83646B016706R89863G93554
$$ -1218339 -922443 -314124 420548 134148 -466811 -950457 2016706 3006569 793554
7972b116674A331402R9390E45353O66415f77922j197392A716574a309416A062813
$$ -2116674 1331402 1430792 545353 1211768 -677922 -1875314 1716574 -1309416 1062813
7962f66189k85707A052020c56432l76715A430897F37073K64894m16678e34198
$$ -666189 -951896 1052020 -356432 -733147 1430897 637073 901967 485289 -534198
7952b552223A427030O81832A54295R92169b352497H75397h43654B432455F41875
$$ -2552223 1427030 2108862 154295 1146464 -2352497 875397 -843654 2432455 641875
7942F27040a898984F71940k12282P39806g38487j838264I24941j90713A24775
$$ 627040 -1898984 671940 459658 1199464 -738487 -2576751 924941 734228 124775
7932h39092J83252E44448a31090b8792j134284r2749E29506A95082c27268A06266
$$ -839092 -655840 544448 -131090 -28792 -1163076 -1255825 529506 195082 -327268 106266
7921c37847J63527q38791m34327f2917j17901G7390e68859b28157A76987i76886
$$ -337847 -174320 -1013111 -1447438 -62917 -180818 77390 -568859 -228157 176987 -976886
7910g7148F22732a68609B035139a003180D1217L34288b57565A76451a451258d27230
$$ -77148 622732 -168609 2035139 -1003180 41217 375505 -257565 176451 -1451258 -427230
7899g44656A198950I0883J808138q38319d15124A080898l55430R65162m27801
$$ -744656 1198950 90883 1899021 1060702 -415124 1080898 725468 1690630 1262829
7890A262829g85445j26130b9559I62387c31538F90733a263275O10299f4373A955269
$$ 1262829 -785445 -911575 -29559 962387 -331538 690733 -1263275 -652976 -64373 1955269
7879a329378A599607D54067J453213a753014A412443a59865n9069j505542f64108
$$ -1329378 1599607 454067 1907280 -1753014 1412443 -159865 -218934 -1724476 -664108
7869A836581a7915j411347c38184B62476J199205D30338j78663J468325e68884
$$ 1836581 -17915 -1429262 -338184 262476 1461681 430338 251675 1720000 -568884
7859A199021a040088B79530R92555l18146b136283A99168P97536J577476j240694
$$ 1199021 -1040088 279530 1272085 953939 -2136283 199168 996704 2574180 1333486
7850A333486N67600a283062G52464i14268j247173b02781k89686q10665k1892
$$ 1333486 1901086 -1283062 752464 -914268 -2161441 -202781 -492467 -1303132 -1325024
7841a325024D57985j71759a269555f14018A182411A37127Q87825b09110r41246
$$ -1325024 457985 286226 -1269555 -614018 1182411 137127 1024952 -209110 -1150356
7832a150356A042407l55042B83395E1876J495297D32322a752384D76807J57967
$$ -1150356 1042407 687365 283395 51876 1547173 432322 -1752384 476807 634774
7823F34774a60524A782275a536491A320263g2631m01165o9208H51934i25715A906640
$$ 634774 -160524 1782275 -1536491 1320263 -72631 -473796 -543004 851934 -925715 1906640
7812d97694c1880j215072B799540I82764e56873q53869I82930b336871A204829
$$ -497694 -31880 -1246952 2799540 982764 -556873 -1410742 982930 -2336871 1204829
7802g98553A103984C13066b51512A211774F0635K817246c43543A19110J490237
$$ -798553 1103984 313066 -251512 1211774 60635 2877881 -343543 119110 1609347
7793A609347A24259d24649D44249a738343B283148a95720A457489b131562B125956
$$ 1609347 124259 -424649 444249 -1738343 2283148 -195720 1457489 -2131562 2125956
7783G94571C58317h0258A913270C25157E000e28387B99208a138797c60091m53290
$$ 794571 358317 -80258 1913270 325157 5000 -528387 299208 -1138797 -360091 -813381
7773h13381K04035F73200K27256A53696a50234A249695C92339O2446h79098c87620
$$ -813381 -609346 673200 900456 153696 -150234 1249695 392339 454785 -879098 -387620
7762E95581f52014j226105A778412G46225A48408J312813a834153p43292C31978
$$ 595581 -652014 -1878119 1778412 746225 148408 1461221 -1834153 -2577445 331978
7752B74677a138418a49965o00222l11677d2048o04490K53925j31254B598137G43228
$$ 274677 -1138418 -149965 -750187 -1061864 -42048 -646538 -392613 -523867 2598137 743228
7741H61457a96461n92550H49689J31962c27672j366158A331445J213540A47303
$$ 861457 -196461 -789011 849689 981651 -327672 -1693830 1331445 2544985 147303
7731A349476a5421j443462A95787J935720a857274A031501P14435p51190D05009
$$ 1349476 -15421 -1458883 195787 2131507 -1857274 1031501 1745936 994746 405009
7721g94122b19854B317332I31802a458912I83170b02213C55677j28400d7911D76479
$$ -794122 -219854 2317332 931802 -1458912 983170 -202213 355677 227277 -47911 476479
7710A111988m73435H6538e29757A460069F43875N58163K25790e46884A82890c26201
$$ 1111988 638553 86538 -529757 1460069 643875 1202038 1427828 -546884 182890 -326201
7699C20843J094211g74486l71343E06637a41901E87101M7378A8248K85094a066262
$$ 320843 1415054 -774486 -1145829 506637 -141901 587101 634479 18248 303342 -1066262
7688a652270F36440N30251a83875A68928f17395k60073D14362N15260c29016a05675
$$ -1652270 636440 1166691 -183875 168928 -617395 -877468 414362 929622 -329016 -105675
7677I49529C85355a725275f47033B14562O41100I7021f72375o22492A045778A80268
$$ 949529 385355 -1725275 -647033 214562 855662 97021 -672375 -1294867 1045778 180268
7666A90484b41658A10230K40169J744594B82246i78057A555480B85710a84740
$$ 190484 -241658 110230 350399 2094993 282246 -978057 1555480 285710 -184740
7656B51089N5296a334322M94854A662607B23473K95818J29820O04310A70279J86645
$$ 251089 306385 -1334322 -839468 1662607 223473 519291 649111 1253421 170279 356924
7646C56924d17134r53274b8593H70032D08791O44654f68398E02013N0976H0692
$$ 356924 -417134 -1370408 -28593 870032 408791 1053445 -668398 502013 552989 80692
7635e892o43609b72419B340088b97431A262887m01469Q06105c48601I50432J08718
$$ -5892 -649501 -272419 2340088 -297431 1262887 861418 1667523 -348601 950432 1059150
7625A059150b203069A126098f89764e0913j419411m3596K35176A435993E10894
$$ 1059150 -2203069 1126098 -689764 -50913 -1470324 -1513920 -1278744 1435993 510894
7615d01467a39661j323111N94920j459498a085837A610365l27374J204999a252840
$$ -401467 -139661 -1462772 -867852 -2327350 -1085837 1610365 1282991 2487990 -1252840
7605B84589M81185J12910C80585i80214D01610Q1016J16515j45112J203763h30723
$$ 284589 765774 878684 380585 -980214 401610 482626 599141 454029 1657792 -830723
7594H70809a122668a51480d8275F78282d81483E64382j85365J778832a396898
$$ 870809 -1122668 -151480 -48275 678282 -481483 564382 379017 2157849 -1396898
7584C64191A40490a8174B26080J289577a366821A289170a75444A612922a222133
$$ 364191 140490 -18174 226080 1515657 -1366821 1289170 -175444 1612922 -1222133
7574c4150H13453M92636B93321j35323J392525B01449J350978A11930M91900K46138
$$ -34150 813453 1306089 293321 157998 1550523 201449 1552427 111930 603830 849968
7564H49968a665164G55320k0720J277j25651O89g01156p68144A169307c15390
$$ 849968 -1665164 755320 734600 735877 610226 610915 -701156 -1469300 1169307 -315390
7553G42472M64297a490208B322897o30872B75601Q56246C78730j75666R8320e84279
$$ 742472 1206769 -1490208 2322897 1692025 275601 1131847 378730 203064 301384 -584279
7542I23016k18546f9780A126452e16773F01451a256101a61954A391815O42325
$$ 923016 704470 -69780 1126452 -516773 601451 -1256101 -161954 1391815 2034140
7533B034140E19008P37934a690642C004242b2892p92753J69547E6738P95957b56584
$$ 2034140 519008 1256942 -1690642 3004242 -22892 -815645 -646098 56738 852695 -256584
7522a287914A29669a397330N68937D09300H2406b218987h21666B57234J222277
$$ -1287914 129669 -1397330 -828393 409300 82406 -2218987 -821666 257234 1479511
7513A479511h73262b62640C44996N36654N85705L50972a249419B037430a034052
$$ 1479511 -873262 -262640 344996 881650 1467355 1818327 -1249419 2037430 -1034052
7503E19046A58454b640756C04905a874740d49763j647506A043504m32388M16471
$$ 519046 158454 -2640756 304905 -1874740 -449763 -2097269 1043504 611116 1027587
7494A027587N40581c70222C96553f28484J83553G77182a74342j657787A182337
$$ 1027587 1568168 -370222 396553 -628484 -444931 777182 -174342 -1832129 1182337
7484A007155Q22734a142223j13186d91158A171160D38789a328933F60808A47417
$$ 1007155 1829889 -1142223 -1255409 -491158 1171160 438789 -1328933 660808 147417
7474D95663g45780C45563J133103k32025g28011L41830A450840g69514I79381
$$ 495663 -745780 345563 1478666 1246641 -728011 -386181 1450840 -769514 979381
7464h26852B16858N57201B34213J838400I8016O22397O2269b0043A53376l7243
$$ -826852 216858 774059 234213 2072613 98016 720413 782682 -20043 153376 116133
7454A16133c68158m30516A599029Q90574E36327k25343R92N28336h58399E13284
$$ 116133 -368158 -798674 1599029 2489603 536327 310984 311976 840312 -858399 513284
7443B63332P82245d53023j04766C91724J655471a117693a58057I44038n7703d98613
$$ 263332 1045577 -453023 -557789 391724 2047195 -1117693 -158057 944038 886335 -498613
7432A793238d95301A214714I7306c25483m56962G97066P763M64775b26703G85998
$$ 1793238 -495301 1214714 97306 -325483 -782445 797066 804829 1269604 -226703 785998
7421H30871K63478L9516M3529C04233a593947O36688I4615g37202K39904o61830
$$ 830871 1094349 1133865 1177394 304233 -1593947 -957259 94615 -737202 -497298 -1159128
7411a159128A118190a639730c16796B346439e1402o18415j174424a48336r72727
$$ -1159128 1118190 -1639730 -316796 2346439 -51402 -669817 -1844241 -148336 -1121063
7402a121063A348717j6977d73230a91312G22207k58917a176888J55137A262375
$$ -1121063 1348717 1331740 -473230 -191312 722207 463290 -1176888 -1021751 1262375
7392A517386d66761A940637a179564m25476I37115C459J369140C11758c40247
$$ 1517386 -466761 1940637 -1179564 -1605040 937115 3459 1372599 311758 -340247
7382H66197h90542H72495a36427F42149j71362j75035P934J51793Q19762E36031
$$ 866197 -890542 872495 -136427 642149 470787 295752 303686 455479 1275241 536031
7371A026397b45904A019402J260141c7912o82244n14743A531307f35743b24486
$$ 1026397 -245904 1019402 2279543 -37912 -720156 -1234899 1531307 -635743 -224486
7361A079032O90579G93404M24612Q20690K32871G97778O68411A06668J266250
$$ 1079032 1769611 793404 1218016 2038706 2271577 797778 1466189 106668 1372918
7352A372918e70100I40386J237680B73342a004820j14731K63004B63659Q43904
$$ 1372918 -570100 940386 2178066 273342 -1004820 -1119551 -856547 263659 1107563
7343A107563K14137h84913i4966D30213e18841J89478m58705M5526A321638f5459
$$ 1107563 1321700 -884913 -94966 430213 -518841 -329363 -788068 -742542 1321638 -65459
7332d03637m0694B55758e12607H63093J58666a083462A80575J068744l84644N63505
$$ -403637 -444331 255758 -512607 863093 1021759 -1083462 180575 1249319 864675 1428180
7322A428180q9871i66356A487016D27848R4933J545463B54176J805088f21693
$$ 1428180 1338309 -966356 1487016 427848 522781 2068244 254176 2059264 -621693
7312h81452A248267a48545C06862J567558B59490j8968e53697m1100A464639D78529
$$ -881452 1248267 -148545 306862 1874420 259490 240522 -553697 -594797 1464639 478529
7301G73829J227388o56604a78264q53163L80863A182637i28613F61023B52562
$$ 773829 2001217 1344613 -178264 -1031427 -650564 1182637 -928613 661023 252562
7291b044942B31009a191271c7061E7543Q84073c00756E08029K44670h31222l80130
$$ -2044942 231009 -1191271 -37061 57543 941616 -300756 508029 752699 -831222 -1211352
7281a211352A705725D36964K064876a841516H13526l0388j09862P59986h29294
$$ -1211352 1705725 436964 2501840 -1841516 813526 783138 673276 1433262 -829294
7271a13460p7263E71015q404j00244L76450K53644n20517c14573H82419J53959
$$ -113460 -190723 571015 562611 462367 838817 1092461 571944 -314573 882419 1036378
7261A036378a129693G83724l81556Q5003c74074A072534A13665a72682g488E53256
$$ 1036378 -1129693 783724 402168 487171 -374074 1072534 113665 -172682 -7488 553256
7250A07892f78037n40612A166758C16850f2031k9606A414923a64183B20387J174370
$$ 107892 -678037 -1218649 1166758 316850 -62031 -91637 1414923 -164183 220387 1394757
7240A394757q9745o45681G6214a155765A03678K220196q3478H89277K06641l05376
$$ 1394757 1305012 659331 76214 -1155765 103678 2323874 2240396 889277 1095918 790542
7230G90542a970226G94713a939418f35392H46820A95796d65957B54745J251475
$$ 790542 -1970226 794713 -1939418 -635392 846820 195796 -465957 254745 1506220
7221A506220a700861O39098p73659A344254F59163c37887q05019a90154j271637
$$ 1506220 -1700861 -1061763 -1835422 1344254 659163 -337887 -1142906 -190154 -1461791
7212a461791G02234P39836C53972J933329F57653a833470G99294A93651o5745
$$ -1461791 702234 1442070 353972 2287301 657653 -1833470 799294 193651 127906
7203A27906d53223F92141k20340K780699b15533D90231c11748A006864N1635d97164
$$ 127906 -453223 692141 471801 3252500 -215533 490231 -311748 1006864 1058499 -497164
7192E57427J373392m78908H3061Q91665a416104H71227h49343B574005c36822
$$ 557427 1930819 1451911 83061 974726 -1416104 871227 -849343 2574005 -336822
7182A587574a528504D24820b91488L2916D87892R69763F55134d68981A49076P59134
$$ 1587574 -1528504 424820 -291488 -258572 487892 1457655 655134 -468981 149076 908210
7172I08210A33415P44321A96009a38622n02863C390551r36507h69348A659980
$$ 908210 133415 877736 196009 -138622 -641485 3390551 2454044 -869348 1659980
7162b34152A031103a643808G03686B95821R63470a32983A403816i67252b56874
$$ -234152 1031103 -1643808 703686 295821 1259291 -132983 1403816 -967252 -256874
7152B08032J5851a2890A582738a55143A718566a792467D58073h66412A29890K012927
$$ 208032 223883 -12890 1582738 -155143 1718566 -1792467 458073 -866412 129890 2142817
7142B142817P6936a469088e00486r84688b31153E69644M20679g81552j876977
$$ 2142817 2219753 -1469088 -500486 -1485174 -231153 569644 990323 -781552 -2658529
7133b658529A334711d02134A162418J7804l57461J089742a928905B60896N50599
$$ -2658529 1334711 -402134 1162418 1180222 822761 1912503 -1928905 260896 811495
7124H11495N76662O16261C43181J226822a462984A048827a502910G15397g57989
$$ 811495 1388157 2004418 343181 1570003 -1462984 1048827 -1502910 715397 -757989
7114E27164J579124k46249a62657A752891A90892L48296K11291C63214N36377
$$ 527164 2106288 1860039 -162657 1752891 190892 539188 750479 363214 899591
7105H99591b264532d70988A317851l17711c36231l1972F96301K193656j123513
$$ 899591 -2264532 -470988 1317851 1000140 -336231 -368203 696301 2889957 1766444
7096A766444k11055k04047l43962l99452g50774A614049i5654C39649J169277
$$ 1766444 1555389 1351342 1007380 607928 -750774 1614049 -95654 339649 1508926
7087A508926g36838K98165q8359A379519A0916J238776d35675o06954B299289
$$ 1508926 -736838 -438673 -527032 1379519 10916 1249692 -435675 -1042629 2299289
7077d22728H17676i9660C58142L39197M96842o3938Q33217b54606I42062a299468
$$ -422728 817676 -99660 358142 697339 1194181 1130243 1963460 -254606 942062 -1299468
7066I71504R16022K33909b90477B23964J396628G62781a561660P56422c19322
$$ 971504 1887526 2121435 -290477 223964 1620592 762781 -1561660 -805238 -319322
7056B316677B7359O09907J13958K47845l83797Q26424R2073p36092j98102N86233
$$ 2316677 27359 637266 751224 999069 615272 1441696 1533769 797677 599575 1185808
7046A185808A13225J354973e7360j159418d98852F94934e58098J91093A523284
$$ 1185808 113225 1468198 -57360 -1216778 -498852 694934 -558098 -367005 1523284
7036F42776c26249J9055A068095M8132n07471j41678N9488B06141g6823k12127
$$ 642776 -326249 -307194 1068095 1116227 608756 467078 526566 206141 -76823 -288950
7026b88950A080797N35365c6971m96354B255476C63421f45945K45445F10599J846098
$$ -288950 1080797 1616162 -36971 -533325 2255476 363421 -645945 -400500 610599 2456697
7016B456697H97240O58979B14998a88104A720883g49828I95336I5135J050847
$$ 2456697 897240 1556219 214998 -188104 1720883 -749828 995336 95135 1145982
7007A145982g60011c37137A161278a71880A42276Q30283g9293B361816B45554
$$ 1145982 -760011 -337137 1161278 -171880 142276 972559 -79293 2361816 245554
6997f11525Q7385A971917b3700H73933k4821J15839c61445l11948A380267J28853
$$ -611525 -524140 1971917 -23700 873933 849112 964951 -361445 -673393 1380267 1509120
6987A509120B317i82002a56863A242439l07677b122907C55110K959395j211489
$$ 1509120 2317 -982002 -156863 1242439 934762 -2122907 355110 3314505 2103016
6978B103016I05589J133811J70233b384245C22776i13530D97652c27103A980949
$$ 2103016 905589 2039400 2209633 -2384245 322776 -913530 497652 -327103 1980949
6968c52144A909394a34274A153550R42725h49683o64129I92147g29968A799706
$$ -352144 1909394 -134274 1153550 2096275 -849683 -1513812 992147 -729968 1799706
6958a79169B537216I54926m72984a263963E49084O14184m66461g34026A157851
$$ -179169 2537216 954926 481942 -1263963 549084 1163268 696807 -734026 1157851
6948B673768A027818m29619a041415a47366K2843k83840D28355J174526G07557
$$ 2673768 1027818 598199 -1041415 -147366 -124523 -408363 428355 1602881 707557
6938C52679M85186l23261L83341K503613A158306k63063d05851A307346j49518
$$ 352679 837865 514604 897945 3401558 1158306 895243 -405851 1307346 1157828
6929A157828I4383b51136B43818J075461a41716A59407M06295J176711q37341
$$ 1157828 94383 -251136 243818 1319279 -141716 159407 565702 1742413 905072
6920I05072g39024n38025d58205A880791F2949J715303D7311b08463L1988B027027
$$ 905072 -739024 -1277049 -458205 1880791 62949 1778252 47311 -208463 -176475 2027027
6909c54575A9357a117103A978976b24113G6207b92782Q2070D18312b44139C445600
$$ -354575 19357 -1117103 1978976 -224113 76207 -292782 -210712 418312 -244139 3445600
6898A394136J95798L13367m74786f48925B199816I67674j60148M97243J82908
$$ 1394136 1589934 1903301 1428515 -648925 2199816 967674 807526 1304769 1487677
6889A487677B98327J684306m92373A76178K14545b130576A991634k68700a218356
$$ 1487677 298327 1982633 1490260 176178 390723 -2130576 1991634 1722934 -1218356
6879B387978f80203K44711c5043H37650f6052B82063e8160q93058F33381K73124
$$ 2387978 -680203 -435492 -35043 837650 -66052 282063 -58160 -951218 633381 906505
6869I06505N47631c92778B42026J475390e05895b8160A593247N60998a371179
$$ 906505 1454136 -392778 242026 1717416 -505895 -28160 1593247 2154245 -1371179
6859A219422E94755a531890B267068G22311i59621E80017J332176b22727m60572
$$ 1219422 594755 -1531890 2267068 722311 -959621 580017 1912193 -222727 -683299
6850f83299A041884L28196L86061c72714r16583C15526Q54994J15328e48972D46083
$$ -683299 1041884 1370080 1756141 -372714 -1289297 315526 1170520 1285848 -548972 446083
6839D79536f01102G92744J254420K68501f37145F38168r3826R7274L23189D42039
$$ 479536 -601102 792744 2047164 2315665 -637145 638168 544342 641616 964805 442039
6828G72562J74616j87941a55046A018144B76682J91017a37858j55817j970122
$$ 772562 947178 759237 -155046 1018144 276682 467699 -137858 -293675 -2263797
6819b263797I13423c49190F64888J943004i35581a4382A020560e75232n0132C83077
$$ -2263797 913423 -349190 664888 2607892 -935581 -14382 1020560 -575232 -625364 383077
6808B10391L26116e73926B01039J177354b50656E47962a069993B7041L085080
$$ 210391 536507 -573926 201039 1378393 -250656 547962 -1069993 27041 3112121
6799C112121g52333C28745e2793k56870p44273G73020a375191H52192N24937o63094
$$ 3112121 -752333 328745 -52793 -309663 -1053936 773020 -1375191 852192 1377129 714035
6789G14035J555039E28133C926J227970d58036I52181M05489a346826b36152A472231
$$ 714035 2269074 528133 3926 1231896 -458036 952181 1357670 -1346826 -236152 1472231
6778A219891a260464A240054c8408B207720l52443o19427l03505A61047c10599
$$ 1219891 -1260464 1240054 -38408 2207720 1855277 1235850 932345 161047 -310599
6768f34705B60077J925148G89878a533589A602194b99902F17152M66706j4698
$$ -634705 260077 2185225 789878 -1533589 1602194 -299902 617152 1083858 1069160
6759A069160L10558E50819J153853a012486A02297R24558b57909A722585A80765
$$ 1069160 1379718 550819 1704672 -1012486 102297 1026855 -257909 1722585 180765
6749h22021o38351F62935Q97162E79820O56152D78162R47213A54858N09526a049431
$$ -822021 -1460372 662935 1560097 579820 1235972 478162 1425375 154858 664384 -1049431
6738G26457k28932J316089o15651D09414a685946A946839I55812D48575J062363
$$ 726457 497525 1813614 1197963 409414 -1685946 1946839 955812 448575 1510938
6729A510938r6507h1698A375241A72899e93414A85591J588479C67404Q52339k81499
$$ 1510938 1414431 -81698 1375241 172899 -593414 185591 1774070 367404 1219743 938244
6719I38244J804376H39709M26365C66582K40016a96429q1214P0086j154870L16982
$$ 938244 2742620 839709 1266074 366582 606598 -196429 -277643 -207557 -1362427 -1045445
6709a045445h8978A299914c61791J73313A445570m40250A87590J322732A35728
$$ -1045445 -88978 1299914 -361791 -188478 1445570 1005320 187590 1510322 135728
6699F61986P19390a71372A676449E55839a025368C29944h47780a50651A90857
$$ 661986 1381376 -171372 1676449 555839 -1025368 329944 -847780 -150651 190857
6689H57082o0287K14517J27811g27769I53629A53375e54298C61477b68846A884435
$$ 857082 796795 1011312 1139123 -727769 953629 153375 -554298 361477 -268846 1884435
6678G27832J03394l09801a3011A073236c65345E11997f2156m4892B129631p65217
$$ 727832 831226 521425 -13011 1073236 -365345 511997 -62156 -107048 2129631 1364414
6668A364414B27658A04138i9591A109502A68137L50429a89872A843433B76226
$$ 1364414 227658 104138 -99591 1109502 168137 518566 -189872 1843433 276226
6658A458834D13135J527544a27319p66647A168225D38631L83872a16998p94567
$$ 1458834 413135 1940679 -127319 -893966 1168225 438631 822503 -116998 -911565
6649i11565E25991g3016A18286J494116E11584h60331c53501F2169J422371a270854
$$ -911565 525991 -73016 118286 1612402 511584 -860331 -353501 62169 1484540 -1270854
6638c48598B51634J95447J217896e30352B274951a733387A929234a754872g02969
$$ -348598 251634 447081 1664977 -530352 2274951 -1733387 1929234 -1754872 -702969
6628D64649d08640C71371h99533A862758a263087B74200g3779A689168b15885
$$ 464649 -408640 371371 -899533 1862758 -1263087 274200 -73779 1689168 -215885
6618a711208H52771c48080F09555A54843N95717J473196a620122A209407a170421
$$ -1711208 852771 -348080 609555 154843 750560 2223756 -1620122 1209407 -1170421
6608A30340b15864A144753J298658o59452G69868a83366A099021j75359M82607
$$ 130340 -215864 1144753 2443411 1783959 769868 -183366 1099021 923662 1406269
6599A406269J142367m62437b078172I99909J164699h80596C14139L07287K027435
$$ 1406269 2548636 2086199 -2078172 999909 2164608 -880596 314139 621426 2648861
6590B648861j299229n52501J059970q98846B51590b80934M7467A145014m43373
$$ 2648861 1349632 797131 1857101 958255 251590 -280934 -233467 1145014 701641
6581G01641J518896r7831B71774J762872c30852E39969b13549A61783Q7131f4412
$$ 701641 2220537 2122706 271774 2034646 -330852 539969 -213549 161783 248914 -64412
6570F68572J794424G13548O01825K22640A60531J597839a202373E38243N80482
$$ 668572 2462996 713548 1315373 1538013 160531 1758370 -1202373 538243 1118725
6561A118725L53526o27355K424963B31215J056694L2758C34643n3102J178828
$$ 1118725 1472251 844896 3269859 231215 1287909 1320667 334643 281541 1460369
6552A460369n21739i29254H59501a3472B676122q55764a673868B51054J775449
$$ 1460369 938630 -929254 859501 -13472 2676122 1820358 -1673868 251054 2026503
6543B026503H48524l14454c88060H17743C13539j46554J189461A9065h44179H34448
$$ 2026503 848524 534070 -388060 817743 313539 166985 1356446 19065 -844179 834448
6532D1583c31684m86412A214957j31845a079228B86823e16891N3852G57762O93704
$$ 41583 -331684 -818096 1214957 1083112 -1079228 286823 -516891 -463039 757762 1451466
6522A451466N98531c05459E6880J491506j62500F29588A73557J649423H43580
$$ 1451466 2049997 -305459 56880 1548386 1385886 629588 173557 1822980 843580
6512b118220A532139L3942l93451A73073J344264C54535R14016J8987J697853
$$ -2118220 1532139 1566081 1172630 173073 1517337 354535 1268551 1287538 2985391
6503B985391j481025b255381B268520e12207D36590A4966f21083A315942m00490
$$ 2985391 1504366 -2255381 2268520 -512207 436590 14966 -621083 1315942 915452
6494I15452J546809A99439J740663j43288E26400b58745A89740f03496A504352
$$ 915452 2462261 199439 1940102 1796814 526400 -258745 189740 -603496 1504352
6484B556099I95115P85633P35792a681816B019411c52397c069A910454D42190
$$ 2556099 995115 1780748 2516540 -1681816 2019411 -352397 -3069 1910454 442190
6474H63434J204776B95256d51405B08061N79278a478621D45829K314167j218767
$$ 863434 2068210 295256 -451405 208061 787339 -1478621 445829 2759996 1541229
6465A541229C54365Q44346D33667J131540A44307O9550L45255J253589F10560
$$ 1541229 354365 1198711 433667 1565207 144307 213857 559112 1812701 610560
6455G61974P93210i4999L6754B576512Q29542E75244d34392I8830L08865J4607
$$ 761974 1555184 -94999 -58245 2576512 3406054 575244 -434392 98830 407695 422302
6445D22302b10596A959306a213660N03468I42919l67827B65582J232472D41199
$$ 422302 -210596 1959306 -1213660 -710192 942919 575092 265582 1498054 441199
6435a023307G89686k37723R50259N93920G67911a84985j88413A181697l80197
$$ -1023307 789686 551963 1502222 2096142 767911 -184985 -373398 1181697 801500
6426H01500O37462J190953e00867j158478g75875A187529f7124l68464f4516B20742
$$ 801500 1438962 2629915 -500867 -1659345 -775875 1187529 -67124 -435588 -64516 220742
6415c36181B94331J035838c61816o30794A271133c28753A910713K14986m13525
$$ -336181 294331 1330169 -361816 -992610 1271133 -328753 1910713 2125699 1712174
6406A712174E66346L83652A17498a165255A050578A16860N73170R47414J17024
$$ 1712174 566346 949998 117498 -1165255 1050578 116860 690030 1637444 1754468
6397A754468o42619N9237n09352J10265J671055C30584K84949J146630A04005
$$ 1754468 1111849 1171086 661734 771999 2443054 330584 615533 1762163 104005
6387e117A126145N89812F69636j30213A32413M11489J266151N02084a19021j957640
$$ -5117 1126145 1715957 669636 539423 132413 543902 1810053 2312137 -119021 -2076661
6377b076661Q55795A586452d48740B21666L98048b17790l76760L4070D84225e94310
$$ -2076661 -1220866 1586452 -448740 221666 619714 -217790 -594550 -560480 484225 -594310
6366g10794l72605B089283j16869C43884N53664R1506C58328K764157d05878B752784
$$ -710794 -1083399 2089283 1972414 343884 897548 989054 358328 3122485 -405878 2752784
6355A676283p04000K99391F33682g36548C01562a19743G97434d50273j478098
$$ 1676283 972283 1271674 633682 -736548 301562 -119743 797434 -450273 -1928371
6346a928371B914142A077250J520429j171557E0638J747116D5242J711953f706
$$ -1928371 2914142 1077250 2597679 1426122 50638 1797754 45242 1757195 -6706
6336F63454j70565b508253I02093f89238A842031O92538I36619a652057B890955
$$ 663454 492889 -2508253 902093 -689238 1842031 2534569 936619 -1652057 2890955
6326F84427a30754I51523j14956K44935J5078j78612J947914A8650J269245L57600
$$ 684427 -130754 951523 836567 1081502 1096580 917968 2865882 18650 1287895 1645495
6316A645495B78322A07529J45046J308156B40590J504098C96964J257559J97606
$$ 1645495 278322 107529 252575 1560731 240590 1744688 396964 1654523 1852129
6307A852129n09789i62137B002462o40569F37179J515473C90795J416327A15615
$$ 1852129 1342340 -962137 2002462 1361893 637179 2152652 390795 1807122 115615
6297A910790F09711J478289A67247o390J33272h60359A229314D40944P56005J30494
$$ 1910790 609711 2088000 167247 160857 294129 -860359 1229314 440944 1196949 1327443
6287A327443M44664n76808N02276f82280R9099A733507a035918B086029a059064
$$ 1327443 1772107 1195299 1697575 -682280 -583181 1733507 -1035918 2086029 -1059064
6277C21197K233590d44167j537946B719176C462K844790A06011K295234m72443
$$ 321197 2554787 -444167 -1982113 2719176 3462 2848252 106011 2401245 1928802
6268A928802a4867A80842g45679n73003G71126b69472F28666j65598a875991A774902
$$ 1928802 -14867 180842 -745679 -1318682 771126 -269472 628666 463068 -1875991 1774902
6257F25310R84321n30183J931004d25243A575191j80539J98999d61262A467622
$$ 625310 1609631 1079448 3010452 -425243 1575191 1394652 1593651 -461262 1467622
6247B37189L355929c90735A223337J589683H02638J817646B37112m3511P46922
$$ 237189 3593118 -390735 1223337 2813020 802638 2620284 237112 193601 940523
6238I40523a064857N13091B333096F84481J025373G95950k43320b9921H54110
$$ 940523 -1064857 -551766 2333096 684481 1709854 795950 552630 -29921 854110
6228a060614G59087N87004J799822H57353b31422B42006a434744E32803Q79606
$$ -1060614 759087 1346091 3145913 857353 -231422 242006 -1434744 532803 1412409
6219A412409o88841B97703J277016h1855H64714I5370P86681J626933E95597J286199
$$ 1412409 723568 297703 1574719 -81855 864714 95370 882051 2508984 595597 1881796
6209A881796l50833M04310F66058l00055J757770f86985j65603H04212a92786
$$ 1881796 1530963 1935273 666058 366003 2123773 -686985 -852588 804212 -192786
6199h74528A873562J08633A86855J363781G08637Q15376L43546H92818a434870
$$ -874528 1873562 1982195 186855 1550636 708637 1524013 1867559 892818 -1434870
6189C179878i2511A631158q8700D50759J067784F26356K264497a129893B426756
$$ 3179878 -92511 1631158 1542458 450759 1518543 626356 2890853 -1129893 2426756
6179d6111E40128J075428J21922p38120l98011M05611f60387A753779H2931K290069
$$ -46111 540128 1615556 1737478 999358 601347 1006958 -660387 1753779 82931 2373000
6169B373000A82828J664855F16075P33420O9837c04512F72795K216384b3727A037091
$$ 2373000 182828 1847683 616075 1349495 1419332 -304512 672795 2889179 -23727 1037091
6158B242496j005913K072178A626598N4556o70184j54128A92038J46316E3273
$$ 2242496 1236583 3308761 1626598 1681154 1010970 856842 192038 338354 53273
6148A148595J363700h68176I15804D38955J826731q91300a05896r30013A440719
$$ 1148595 2512295 -868176 915804 438955 2265686 1374386 -105896 -1035909 1440719
6138A300576k57376k08413k60910J697934f4488A360314J016142D89565K254133
$$ 1300576 1043200 834787 573877 2271811 -64488 1360314 2376456 489565 2743698
6129B743698e88308B515888A119628P16968J501461a080088A838865G79857J082591
$$ 2743698 -588308 2515888 1119628 1836596 3338057 -1080088 1838865 779857 1862448
6120A862448a632009A2180d9248j628428B479926I52148b17342C201773j457588
$$ 1862448 -1632009 12180 -49248 -1677676 2479926 952148 -217342 3201773 1744185
6111A744185O3630J077689A188160j45451L031863D21654R8059e6570A543954
$$ 1744185 1807815 2885504 1188160 1042709 4074572 421654 519713 -56570 1543954
6101D15356J271048m58938m49122L53438M30462l08292M35814C67601J978836
$$ 415356 1686404 1227466 778344 1131782 1562244 1253952 1689766 367601 2346437
6092B346437j038900J200969j015518g47288A767327i51630d2099B97070M41612
$$ 2346437 1307537 2508506 1492988 -747288 1767327 -951630 -42099 297070 738682
6083G38682J050812H79114R24028J25356l95684l22461l33128J148583F75108
$$ 738682 1789494 879114 1803142 1928498 1532814 1210353 877225 2025808 675108
6073E75827j47989O60510J231877E96410e8885E59676M34803Q54762m45778b3311
$$ 575827 427838 1088348 2320225 596410 -58885 559676 994479 1849241 1403463 -23311
6062D121J082074k49957m04807B00683K850541I09014J45127K90985k39712C46186
$$ 4121 1086195 836238 431431 200683 3051224 909014 1054141 1345126 1105414 346186
6051H18672J115798o19908k09707m34623O44073l05733L09426A7174K522048l69189
$$ 818672 1934470 1314562 1104855 670232 1314305 1008572 1317998 17174 2539222 2170033
6041B170033H6763J370520l64865a8680j076245E51038f3959A756223c29556D80962
$$ 2170033 86763 1457283 1092418 -18680 -1094925 551038 -63959 1756223 -329556 480962
6030B134262e47447B076488R50381E24745K434512q81715E24215J603743H92424
$$ 2134262 -547447 2076488 3026869 524745 2959257 2077542 524215 2127958 892424
6020B801024k59829o62627B8167H825R4452P83575f94999F13720l02318J88773
$$ 2801024 2541195 1878568 28167 8825 103277 886852 -694999 613720 311402 500175
6010E00175N91937E39269J32639K033437j292469A28727J044997N5736J7795n29192
$$ 500175 1092112 539269 671908 2705345 1412876 128727 1173724 1229460 1247255 718063
6000G18063b081569A652570J58713Q2943m98417A34157K125610m64292b487552
$$ 718063 -2081569 1652570 1811283 1894226 1395809 134157 2259767 1795475 -2487552
5990B458755M9100r59532L8132J129802j336830B13751R57145J763011I95290
$$ 2458755 2507855 1548323 1586455 2716257 1379427 213751 1170896 2933907 995290
5980A723826n45848j41163N01227I2391J864725q80674c31977D99908K602567
$$ 1723826 1177978 1036815 1538042 92391 1957116 1076442 -331977 499908 3102475
5971C102475j306488a04589A126726R78737R42618H13094J420705j090637B68084
$$ 3102475 1795987 -104589 1126726 2105463 3048081 813094 2233799 1143162 268084
5961H07326F7170O14872J032351K37002p83826K036164A38130J047921J3637L98422
$$ 807326 67170 682042 1714393 1951395 1167569 3203733 138130 1186051 1199688 1598110
5951A598110E64446R64928l72329a42091B84167R89038K47875a781771E52321
$$ 1598110 564446 1529374 1157045 -142091 284167 1273205 1521080 -1781771 552321
5941A842680r08574J395689I6804J865193I60444P39020k15071a035727B548028
$$ 1842680 934106 2329795 96804 1961997 960444 1699464 1484393 -1035727 2548028
5931A000798J071810n32123E08950K72653J733940n9029E82288O7101J898575
$$ 1000798 2072608 1540485 508950 781603 2515543 2456514 582288 649389 2547964
5922B547964I38297K77941J403323j281593a2798C14132J36514g49279I13251
$$ 2547964 938297 1216238 2619561 1337968 -12798 314132 450646 -749279 913251
5912A500260J37877E38108L82586m3552J797387j035424J039787k76966f89582
$$ 1500260 1638137 538108 920694 877142 2674529 1639105 2678892 2401926 -689582
5902c48791B289557c48352A187207M33697A68554J906956k55725L4894p34972
$$ -348791 2289557 -348352 1187207 1620904 168554 2075510 1819785 1854679 1119707
5893A119707B06449L040113j002598K43681R59384o49752J60964j100116o95718
$$ 1119707 206449 3246562 2243964 2487645 3447029 2797277 2958241 1858125 1162407
5884A162407K226223i497B375961j179637l66452N33863P26790H06244j98702
$$ 1162407 3388630 -9497 2375961 1196324 829872 1363735 2090525 806244 607542
5875F07542K66838J30915g38232B53451J559206q94866d12539B306463C45634
$$ 607542 874380 1005295 -738232 253451 1812657 917791 -412539 2306463 345634
5865c84594A697446a360369C29988K705301b98606A89015J588626H73062Q13746
$$ -384594 1697446 -1360369 329988 3035289 -298606 189015 1777641 873062 1686808
5856A686808p60330K156646A266361C96741Q77721F14856J186296O14355q00440
$$ 1686808 926478 3083124 1266361 396741 1274462 614856 1801152 2415507 1615067
5847A615067n74704P20707Q0097L00163p75392J2845J197033j061128D59185J063743
$$ 1615067 1040363 1761070 1841167 2141330 1365938 1378783 2575816 1514688 459185 1522928
5837A522928D73549J365759L40812p64572E86765j80691J038585p60c5036I54974
$$ 1522928 473549 1839308 2180120 1415548 586765 406074 1444659 1443899 -35036 954974
5826A455849n38591G6892Q05734P52141l9780D66465d52406A550712A75550L68975
$$ 1455849 917258 76892 882626 1634767 1594987 466465 -452406 1550712 175550 544525
5816E44525J418353I01579P19598J14702A36539K216577E36343L0632J377237
$$ 544525 1962878 901579 1621177 1735879 136539 2353116 536343 566975 1944212
5807A944212K1648O43287A038106M02489J006938A213694N69251d72061F97853
$$ 1944212 1965860 2609147 1038106 1440595 2447533 1213694 1782945 -472061 697853
5797H12845K79409J314320B96250L07665O50782E35821J407362P39876A264253
$$ 812845 1092254 2406574 296250 603915 1254697 535821 1943183 2683059 1264253
5787E46966k40889Q81430L03944J039548J25348p58262C03128K93133i32318A451377
$$ 546966 306077 1187507 1491451 2530999 2656347 1898085 303128 596261 -932318 1451377
5776B201302L721I95527C76525N6041J205206R70026G03308J285554B41134K85737
$$ 2201302 2205023 995527 376525 432566 1637772 2607798 703308 1988862 241134 526871
5766E26871K362664j136916G75347k85829J007463C5641J063571L69038k6909
$$ 526871 2889535 1752619 775347 489518 1496981 35641 1099212 1468250 1441341
5757A441341k52278B71567J243959A82961J777394C65008K103403A023623g8589
$$ 1441341 1189063 271567 1515526 182961 1960355 365008 2468411 1023623 -78589
5747A361291K95632N26740p63499A74033R39959b14837l10172B118916k36249
$$ 1361291 1656923 2183663 1420164 174033 1113992 -214837 -525009 2118916 1882667
5738A882667m00305J336611o11810H37075k91158K865414E51184B36274P68670
$$ 1882667 1482362 2818973 2207163 837075 545917 3411331 551184 236274 1004944
5729A004944J305723m08405p08257A76219L15880K260920j66509p32825H07672
$$ 1004944 2310667 1902262 1194005 176219 492099 2753019 2586510 1853685 807672
5719E40295J599083d14067A233850R62907n16798K46292J239831A220484P13242
$$ 540295 2139378 -414067 1233850 2196757 1679959 1926251 3166082 1220484 1933726
5710A933726q35527J719943Q37048b33645B628658m73330J027485E01584L17121
$$ 1933726 1098199 2818142 3655190 -233645 2628658 2155328 3182813 501584 818705
5701H18705N95459L12674A06053K421868a23019A992851J279011A416931M50081
$$ 818705 1414164 1726838 106053 2527921 -123019 1992851 3271862 1416931 1867012
5692A867012K495876r48795A522948K264882j84926p48202J106227l92755j623664
$$ 1867012 4362888 3414093 1522948 3787830 3602904 2854702 3960929 3568174 1944510
5683A944510J896420A698923P05049p35589J188385e87216A913129l13382j66079
$$ 1944510 3840930 1698923 2403972 1668383 2856768 -587216 1913129 1599747 1433668
5674A433668J16626R61406j63714l99157N34618i9011A874052P16847j057185
$$ 1433668 1550294 2511700 2347986 1948829 2483447 -99011 1874052 2590899 1533714
5665A533714J601552G51987M47208K94465M10754a37628A782169o77355P55238
$$ 1533714 3135266 751987 1199195 1493660 1904414 -137628 1782169 1104814 1860052
5656A860052B94068L266018H69710C77302e70455F24031K386859A479237k38801
$$ 1860052 294068 3560086 869710 377302 -570455 624031 3010890 1479237 1240436
5647A240436M3307J676426q38465M10976N15784j189399O03767L84700a74002
$$ 1240436 1283743 2960169 2121704 2532680 3048464 1859065 2462832 2847532 -174002
5637A025216R07922E43190J038842O92682A103181e98111C341538A658636a30192
$$ 1025216 1933138 543190 1582032 2274714 1103181 -598111 3341538 1658636 -130192
5627g8416A185714B57156J856827J22007q41909j69112J649432B12000l8276K537569
$$ -78416 1185714 257156 2113983 2235990 1394081 1224969 2874401 212000 173724 2711293
5617B711293p50508l72206d57432A620281k60796P23097K69012F58742A1048J130190
$$ 2711293 1960785 1588579 -457432 1620281 1359485 2082582 2351594 658742 11048 1141238
5607A141238j55237J695831I50225J607303d60915I88905J743586C37540a103374
$$ 1141238 986001 2681832 950225 2557528 -460915 988905 2732491 337540 -1103374
5597D16048J246951F35965J710883A012207J641813n32744q5334k77587M62367
$$ 416048 1662999 635965 2346848 1012207 2654020 2121276 2035942 1758355 2220722
5588B220722J97309G25593R22432J152032q44183j75756P48490j219092K770058
$$ 2220722 2418031 725593 1648025 2800057 1955874 1780118 2528608 1309516 4079574
5579D079574A451592K23935K692655r66294d4607A691435F65755J415774p31209
$$ 4079574 1451592 1675527 4368182 3401888 -44607 1691435 665755 2081529 1350320
5570A350320J605004J515279A107732j27895A00127K102099J164911l72317R6206
$$ 1350320 2955324 4470603 1107732 979837 100127 2202226 3367137 2994820 3091026
5561C091026J004598r53859o46060C20491J756512L36027A023102J271103J849734
$$ 3091026 4095624 3141765 2495705 320491 2077003 2413030 1023102 2294205 4143939
5552D143939j1902p61721m29130d56082B175125J391321A288485P14913o84979
$$ 4143939 4132037 3370316 2941186 -456082 2175125 3566446 1288485 2003398 1318419
5543A318419B73121J841234N0346I66918K640325m96489j509340O90752J21041
$$ 1318419 273121 2114355 2164701 966918 3607243 3110754 1601414 2292166 2413207
5534B413207K93250I96420J485615P28030m46985J244591j158162j9770o9722
$$ 2413207 2706457 996420 2482035 3210065 2763080 4007671 2849509 2829739 2760017
5525B760017G89385L742916A962616Q44925j215458L073521k112295J051428n49997
$$ 2760017 789385 4532301 1962616 2807541 1592083 4665604 2553309 3604737 3054740
5516C054740R41763j588206J035161j695730K057965j99206A707582n35634L091726
$$ 3054740 3996503 2408297 3443458 1747728 3805693 3606487 1707582 1171948 4263674
5507D263674r13095A590380j01099J731415k24395J075319A770051Q04287j211492
$$ 4263674 3350579 1590380 1489281 3220696 2996301 4071620 1770051 2574338 1362846
5498A362846q2569O28407M96932J300442A092443Q84731b53033A485666L495015
$$ 1362846 1280277 1908684 2405616 3706058 1092443 1977174 -253033 1485666 4980681
5489D980681j774019j560844R383l87340B93342K471546b57977B305566B03377
$$ 4980681 3206662 1645818 1655201 1267861 293342 2764888 -257977 2305566 203377
5479B624623r34654J072155N58821j258083G75552P59051J066144J71115n18713
$$ 2624623 1689969 2762124 3320945 2062862 775552 1534603 2600747 2771862 2253149
5470B253149p24511B90347K977135A522658a89568C159798j253251L12226j100187
$$ 2253149 1528638 290347 3267482 1522658 -189568 3159798 1906547 2218773 1118586
5461A118586J118465q07909R59853p83282k43771k61421J625914m06638D44352
$$ 1118586 2237051 1429142 2388995 1605713 1361942 1100521 2726435 2319797 444352
5451A704488M10652J402799l53446A096067B61643K422999C22663J245535j64727
$$ 1704488 2115140 3517939 3164493 1096067 261643 2684642 322663 1568198 1403471
5442A403471K094377G33420M75689j65660Q62426L97751l16196A61584E1795O25132
$$ 1403471 3497848 733420 1209109 1043449 1905875 2303626 1987430 161584 51795 676927
5432F76927B6589O79361J964792j198458B08453K079785i26811B024297J270534
$$ 676927 26589 705950 2670742 1472284 208453 2288238 -926811 2024297 3294831
5423C294831l79212j55856o80876N57024C59956K621764m66622d6749C58637K738938
$$ 3294831 2915619 2759763 2078887 2635911 359956 2981720 2515098 -46749 358637 3097575
5413C097575A032189J198674J464480j651830E36522G3721J692246n19099K036261
$$ 3097575 1032189 2230863 3695343 2043513 536522 73721 1765967 1246868 3283129
5404C283129A018231J313805q73209o29993R98426B72623J750412r47654J420793
$$ 3283129 1018231 2332036 1458827 828834 1827260 272623 2023035 1075381 2496174
5395B496174J355646D17818A32718J005265k53492D41404j18396Q11676J655640
$$ 2496174 3851820 417818 132718 1137983 884491 441404 323008 1134684 2790324
5386B790324j231705O24095d67501A657661K84577J25528o60997L69748R75814
$$ 2790324 1558619 2182714 -467501 1657661 1942238 2067766 1406769 1776517 2752331
5377B752331e63267I16283O58264J535757l33236C51092K080041O5345j7072M03538
$$ 2752331 -563267 916283 1574547 3110304 2777068 351092 2431133 2496478 2479406 2882944
5367B882944j7699A189080J98579J61565J545629j023197l01211l82356R09665
$$ 2882944 2865245 1189080 1387659 1549224 3094853 2071656 1770445 1388089 2297754
5358B297754o50482J520907K78526K43557O26544j544238k0300k03403k51092
$$ 2297754 1647272 3168179 3446705 3690262 4316806 2772568 2752268 2548865 2297773
5349B297773L11473H63534J577171G75877J205830h0837A690102l2154R48467
$$ 2297773 2609246 863534 2440705 775877 1981707 -80837 1690102 1657948 2606415
5340B606415j102292e90273A011257Q36383L85133l97612l00298K614770H79673
$$ 2606415 1504123 -590273 1011257 1847640 2232773 1835161 1534863 4149633 879673
5330C554503q68683k54028J652950G64133J627611k82362K37740A02984J107483
$$ 3554503 2685820 2431792 4084742 764133 2391744 2109382 2347122 102984 1210467
5321A210467J244015j72711o51090E33224J187093J263893D49400J454008n00890
$$ 1210467 2454482 2281771 1630681 533224 1720317 2984210 449400 1903408 1402518
5312A402518o0795N359J441447E16706O27079J660033j003318Q24171m2897O07793
$$ 1402518 1341723 1347082 2788529 516706 1143785 2803818 1800500 2624671 2581774 3189567
5302C189567A477280P74022J643809A537560o28354b21229A383120J807045j367825
$$ 3189567 1477280 2251302 3895111 1537560 909206 -221229 1383120 3190165 1822340
5293A822340j32191L46429J336682K293761A607301J216982q10248o43287J802842
$$ 1822340 1690149 2036578 3373260 5667021 1607301 2824283 2014035 1370748 3173590
5284C173590N10363n70966j05037o6994I93899K303545n9918p54566K684713R41807
$$ 3173590 3683953 3112987 3007950 2940956 993899 3297444 3237526 2482960 5167673 6109480
5274F109480k328465J472985K243460J450024C728250J928380k77224j833733
$$ 6109480 3781015 5254000 7497460 8947484 3728250 5656630 5379406 3545673
5266C545673j148045n23220M13410k0304o18110E57540L26833K437456j256238
$$ 3545673 2397628 1874408 2287818 2267514 1649404 557540 884373 3321829 2065591
5257B065591O31081A202180J15910k51399J949417m33586m84917P72972j282138
$$ 2065591 2696672 1202180 1318090 1066691 3016108 2582522 2097605 2870577 1588439
5248A588439e84371B682146l08335K820099A890056H14474K986633A871416J492864
$$ 1588439 -584371 2682146 2373811 5193910 1890056 814474 3801107 1871416 3364280
5239C364280r528a00490C968346A250333B47418K183512k15924q65476N01299
$$ 3364280 3354752 -100490 3968346 1250333 247418 2430930 2215006 1349530 1850829
5230A850829J308440j578184J088541q15548N71482P85101H18761J328233J031539
$$ 1850829 3159269 1581085 2669626 1854078 2425560 3210661 818761 2146994 3178533
5221C178533j265005M00691p77249Q80888l9792J015717B79042P91461K089233
$$ 3178533 1913528 2314219 1536970 2417858 2378066 3393783 279042 1070503 3159736
5212C159736j286908M9721K32327J176671j116739n88794F55221K010468A204132
$$ 3159736 1872828 1922549 2154876 3331547 2214808 1626014 655221 2665689 1204132
5202A997431M99424A199873j1621P21135j54703H30280k28811K040999r68001
$$ 1997431 2496855 1199873 1188252 1909387 1754684 830280 601469 2642468 1674467
5193A674467J075819j092655F08940L988424G19024N75923K453932K67810j083313
$$ 1674467 2750286 1657631 608940 4597364 719024 1294947 3748879 4016689 2933376
5184B933376F76398p5527J046954R3690J445430j253898O02594A76924K420061
$$ 2933376 676398 600871 1647825 1741515 3186945 1933047 2535641 176924 2596985
5175B596985J42642J4358Q40564j514842r00323J913913C87787K103591m29394
$$ 2596985 2739627 2753985 3594549 2079707 1179384 3093297 387787 2491378 2061984
5166B061984J180159N34876j070324N75402j8123q12154j138180R07999M57936
$$ 2061984 3242143 3777019 2706695 3282097 3263974 2451820 1313640 2221639 2679575
5157B679575j46994L08041J927047j879554m22n42116P66677j136341J423157
$$ 2679575 2532581 2840622 4767669 2888115 2887693 2345577 3112254 1975913 3399070
5148C399070j580496M93161A121480K054665n19241N93441r32311L83706l08152
$$ 3399070 1818574 2311735 1121480 3176145 2656904 3250345 2318034 2701740 2393588
5139B393588n01230K498476j264146M02667k24970r35336J093796m17161Q3515
$$ 2393588 1892358 4390834 3126688 3529355 3304385 2369049 3462845 3045684 3129199
5130C129199R36686j315361J702535l64111j376521r40878k14196J344127q47579
$$ 3129199 4065885 2750524 4453059 4088948 2712427 1771549 1557353 2901480 2053901
5121B053901K665539j024964J505776k021100k20184n82722N08463l55882L11895
$$ 2053901 4719440 3694476 5200252 3179152 2958968 2376246 2884709 2528827 2840722
5112B840722Q70506j122976r72543Q25788J153690r35565o86343m24072M25890
$$ 2840722 3711228 2588252 1615709 2441497 3595187 2659622 1973279 1549207 1975097
5103A975097L23190n20323J114754A432018P70056P21715j054417L09357J074747
$$ 1975097 2298287 1777964 2892718 1432018 2202074 2923789 1869372 2178729 3253476
5094C253476M97564j368497P31932p47266J992065j566716k44413J781429j524549
$$ 3253476 3751040 2382543 3114475 2367209 4359274 2792558 2548145 4329574 2805025
5085B805025K29035n42337j090128J131287A162754L432961B225821A007380L194007
$$ 2805025 3034060 2491723 1401595 2532882 1162754 4595715 2225821 1007380 4201387
5076D201387A652884K032351A636524K613573j468261n23235J004870j380323
$$ 4201387 1652884 3685235 1636524 4250097 2781836 2258601 3263471 1883148
5068A883148J212410J74309j374671J223573m14129p75116K4221J390707J36376
$$ 1883148 3095558 3269867 1895196 3118769 2704640 1929524 1953745 3344452 3480828
5059C480828j438258n76254J719684j471101Q15176J513011K78169j758088j187963
$$ 3480828 2042570 1466316 3186000 1714899 2530075 4043086 4321255 2563167 1375204
5050A375204K896647j686072J047187j040389R889Q58019J94106A815084J817258
$$ 1375204 4271851 2585779 3632966 2592577 2602466 3460485 3654591 1815084 3632342
5041C632342M91683n41533r13725F90753L040122m77487L79573j382648l22551
$$ 3632342 4124025 3582492 2668767 690753 3730875 3253388 3632961 2250313 1927762
5032A927762R35368Q67647J51964Q9605J768461j198638o44869J396433J056156
$$ 1927762 2863130 3730777 3882741 3972346 5740807 4542169 3897300 5293733 6349889
5023F349889P31649j759696M001504j466381J000955J002404j328765K281836
$$ 6349889 7081538 5321842 9323346 7856965 8857920 9860324 8531559 10813395
5015A0813395j887338R90643l502258k150340J735027j669947m39871m80437l16534
$$ 10813395 8926057 9916700 6414442 4264102 5999129 4329182 3889311 3408874 3092340
5006C092340A304048L784322k060378A410530K60792J622992K70577j210945R48814
$$ 3092340 1304048 5088370 3027992 1410530 1671322 3294314 3564891 2353946 3302760
4997C302760K47756n46062j059724l25044O24129J337922o86794N91664A511053
$$ 3302760 3550516 3004454 1944730 1619686 2243815 3581737 2894943 3486607 1511053
4987A810970n79650K00839L86045J137467J044737j82458k25552n75420J250121
$$ 1810970 1231320 1432159 1818204 2955671 4000408 3817950 3592398 3016978 4267099
4978D267099j495559O12092k65460p14776L88807N07298o58296H34875L252006
$$ 4267099 2771540 3383632 3118172 2403396 2792203 3299501 2641205 834875 4086881
4969D086881A417479J373582J562559I82427L497946j388978Q17889K33540A427092
$$ 4086881 1417479 2791061 4353620 982427 4480373 3091395 3909284 4142824 1427092
4959B961665J889692j925339q14389J358465N999J12399Q66314A997883O77134
$$ 2961665 4851357 2926018 2111629 3470094 3476093 3588492 4454806 1997883 2675017
4950B675017R19291N67121j645954J101178j278464r61042L955225k244541K101169
$$ 2675017 3594308 4161429 2515475 3616653 2338189 1377147 5332372 3087831 5189000
4941E189000F24439L381855A406277J974977N03174k40010j081771j46929R52149
$$ 5189000 624439 4006294 1406277 3381254 3884428 3644418 2562647 2415718 3367867
4932C367867j032552L08618Q78164J41842j502312K83420K699129j302874M31214
$$ 3367867 2335315 2643933 3522097 3663939 2161627 2445047 5144176 3841302 4272516
4923D272516M15808k201304J818726l04496j120559l12818P38471K4853P49921
$$ 4272516 4688324 2487020 4305746 4001250 2880691 2567873 3306344 3331197 4081118
4914D081118J7203j12251A991668J408870o31346Q6966k42657R85588A759212
$$ 4081118 4098321 3986070 1991668 3400538 2769192 2856158 2613501 3599089 1759212
4904C884296o3629j033740o6858r05229K186109A85119L771869A952844J265175
$$ 3884296 3820667 2786927 2720069 1814840 4000949 185119 3956988 1952844 3218019
4895C218019j080416K128562p62490p53309J309234A451342K295696A855813K446936
$$ 3218019 2137603 4266165 3503675 2750366 4059600 1451342 3747038 1855813 4302749
4886D302749H07827J872266p28095J928891j392406J399482j781771k49348K401601
$$ 4302749 807827 2680093 1951998 3880889 2488483 3887965 2106194 1856846 4258447
4877D258447n10458j98704j032230O47817J29236K51959O56116j065059j230879
$$ 4258447 3747989 3549285 2517055 3164872 3294108 3546067 4202183 3137124 1906245
4868A906245M40117o05789L104641k072206J177407k44448m60033m47115m51907
$$ 1906245 2346362 1740573 4845214 2773008 3950415 3705967 3245934 2798819 2346912
4859B346912O81491J248769l51510M50986B162664J683932j271072o37368K992819
$$ 2346912 3028403 4277172 3925662 4376648 2162664 3846596 2575524 1938156 4930975
4850D930975l75771B078323J686461O33759j786776K763995k143312J29988P8177
$$ 4930975 4555204 2078323 3764784 4398543 2611767 5375762 3232450 3362438 3440615
4841C440615Q63167L08231K97220j147309J45020Q59088n45248k24134M2157K5039
$$ 3440615 4303782 4612013 4909233 3761924 3906944 4766032 4220784 3996650 4038807 4063846
4831D063846M65575A409044K635599J026101m32720K045260k185903K537643j898142
$$ 4063846 4529421 1409044 4044643 5070744 4638024 6683284 4497381 7035024 5136882
4822E136882j520034N39000j032727j367280J587124J861525K08709B230080L68812
$$ 5136882 3616848 4155848 3123121 1755841 3342965 5204490 5413199 2230080 2598892
4813B598892K373897n75113M62104j334261j374460M88884J155330J052515j492212
$$ 2598892 4972789 4397676 4859780 3525519 2151059 2639943 3795273 4847788 3355576
4804C355576O97631O43245k17173r16999L94827q1560M75123L62301R26680o37978
$$ 3355576 4053207 4696452 4479279 3562280 3957107 3875547 4350670 4712971 5639651 5001673
4794E001673j19758k18806j24467n5801j401845L74996K248317B595923J136792
$$ 5001673 4881915 4663109 4538642 4482841 3080996 3455992 5704309 2595923 3732715
4785C732715n47369l11730J287884N20450O25828B609244K113852l47295P71516
$$ 3732715 3185346 2873616 4161500 4681950 5307778 2609244 4723096 4375801 5147317
4776E147317j53302k185157O58809P76043J129696j225591J062035j218009q48632
$$ 5147317 4994015 2808858 3467667 4243710 5373406 4147815 5209850 3991841 3143209
4767C143209O72614J617271L01745j673193J781355j547144j067349K905206k684320
$$ 3143209 3815823 5433094 5734839 4061646 5843001 4295857 3228508 6133714 3449394
4758C449394K295774j376833Q3220O97291n30938J118131Q59782p07205j270320
$$ 3449394 5745168 4368335 4451555 5148846 4617908 5736039 6595821 5888616 4618296
4749D618296j846536L422981j092526k296447K306849p52583j305881M05411L59731
$$ 4618296 2771760 6194741 5102215 2805768 5112617 4360034 3054153 3459564 3819295
4740C819295m67258o07884J116594N70833B202162K292098j368459J759555n75967
$$ 3819295 3352037 2744153 3860747 4431580 2202162 4494260 3125801 4885356 4309389
4731D309389j35685j579607K767726j896773K081547p30327n46305o0999r19941
$$ 4309389 4173704 2594097 5361823 3465050 5546597 4816270 4269965 4208966 3289025
4722C289025J899010N32130J697763r8621j886605J305435j249857k324098J264073
$$ 3289025 5188035 5720165 7417928 7319307 5432702 6738137 5488280 3164182 4428255
4713D428255J688921k284526o07681J974448J04023o80139j872020J381151j367161
$$ 4428255 6117176 3832650 3224969 5199417 5303440 4623301 2751281 4132432 2765271
4704B765271N17560R63438N72303B226343J986229k60971p38003J389011j94259
$$ 2765271 3282831 4246269 4818572 2226343 4212572 3951601 3213598 4602609 4408350
4695D408350j492528J307082q71864J391611P18692o33260k322276K9530J040405
$$ 4408350 2915822 4222904 3351040 4742651 5461343 4828083 2505807 2535337 3575742
4686C575742j676215K057121j422531P43082m17579N96476j128710J738280L9224
$$ 3575742 1899527 3956648 2534117 3277199 2859620 3456096 2327386 4065666 4104890
4677D104890r3046l8734q65493J627608j934526l3009N39240m23041R01697O25126
$$ 4104890 4011844 3973110 3107617 4735225 2800699 2767690 3306930 2883889 3785586 4410712
4667D410712j908704K623145j220307N53190N82171r95455m6563R33758k26912
$$ 4410712 2502008 5125153 3904846 4458036 5040207 4044752 3998189 4931947 4705035
4658D705035l84387K1799j157232J826489j088487J842626k126979J75127R75730
$$ 4705035 4320648 4342447 3185215 5011704 3923217 5765843 3638864 3813991 4789721
4649D789721j335582J854962o91355k003237L353531p93238j480938J974503P11267
$$ 4789721 3454139 5309101 4617746 2614509 5968040 5174802 3693864 5668367 6379634
4640F379634j389745Q17226j565303J031579J83880j49061j44535o09550J509377
$$ 6379634 4989889 5807115 4241812 5273391 5457271 5308210 5163675 4554125 6063502
4631F063502k20065j771072L056583j776741Q92996j32104p2161L93091L66457
$$ 6063502 5843437 4072365 7128948 5352207 6245203 6113099 6040938 6434029 6800486
4622F800486N8388j648217J174111k765113M034840k649521J160818J83409N55985
$$ 6800486 6858874 5210657 6384768 3619655 7654495 5004974 6165792 6349201 6905186
4613F905186q14764Q71108j805908l31643L10170N65959L44148j419252J628312
$$ 6905186 6090422 6961530 5155622 4823979 5134149 5700108 6044256 4625004 6253316
4604F253316N1969j389197J332634l82148j274510L289253B877395N239605j679253
$$ 6253316 6305285 4916088 6248722 5866574 4592064 7881317 2877395 8117000 6437747
4595F437747j168644M71602j77422l83391O67647k243355J298096R98161j489421
$$ 6437747 5269103 5740705 5563283 5179892 5847539 3604184 4902280 5900441 4411020
4586D411020Q05497l84479l92935p06213J630548K99700k599250Q97220Q00177
$$ 4411020 5216517 4832038 4439103 3732890 5363438 5663138 3063888 3961108 4761285
4577D761285J419065J12926l89543r06916Q10964r80297p25590q0191J217645
$$ 4761285 6180350 6293276 5903733 4996817 5807781 4827484 4101894 4021703 5239348
4568E239348l90973J823061j176470J432975j418650m73297K90582M09293k325005
$$ 5239348 4848375 6671436 5494966 6927941 5509291 5035994 5326576 5735869 3410864
4559C410864L403740j158591k62707J809377P85291k02251k844329K408689k341182
$$ 3410864 6814604 5656013 5393306 7202683 7987974 7785723 4941394 7350083 5008901
4550E008901L35599P87508j144734m0005k33257J822123j601828J176051j669657
$$ 5008901 5344500 6132008 4987274 4947269 4714012 6536135 4934307 6110358 4440701
4541D440701p59006R61849O4426M35534j22236J441765j891402r62175K497110
$$ 4440701 3681695 4643544 4707970 5143504 5021268 6463033 4571631 3609456 6106566
4532F106566m42219j531017K89038K68999k01628K766225q60759m70653Q20370
$$ 6106566 5664347 4133330 4422368 4691367 4489739 7255964 6395205 5924552 6744922
4523F744922j213200N24564m52039O21112O39458L82987k611617l39632J808008
$$ 6744922 5531722 6056286 5604247 6225359 6864817 7247804 4636187 4296555 6104563
4514F104563J550209j970001l58247M77555K363153j813539J870276j400778K587271
$$ 6104563 7654772 5684771 5326524 5804079 8167232 6353693 8223969 6823191 9410462
4505I410462k834725M51566L490293k848638R17122n38572q42425j264147M33987
$$ 9410462 6575737 7027303 10517596 7668958 8586080 8047508 7205083 5940936 6374923
4496F374923k276941J372015J379935m92638j521935m70022k12094L230600k458189
$$ 6374923 4097982 5469997 6849932 6357294 4835359 4365337 4153243 7383843 4925654
4487D925654R46243J576105j474444L1902l73771j053103J808137J414570m24414
$$ 4925654 5871897 7448002 5973558 6005460 5631689 4578586 6386723 7801293 7376879
4478G376879q60598L73679j145942L418323j252671j254324J299129p19525J033586
$$ 7376879 6516281 6889960 5744018 9162341 7909670 6655346 7954475 7234950 8268536
4469H268536j113831K93093J107865l507604L535229j706243O84910n688J1802
$$ 8268536 7154705 7447798 8555663 5048059 8583288 6877045 7561955 7556267 7568069
4460G568069l28309M58783J189031o64155C927534J506711m37421k62954O0632
$$ 7568069 7239760 7698543 8887574 8223419 3927534 5434245 4996824 4733870 4794502
4451D794502J086764l77466J752086J32600n90812j212347m68458J021404q9443
$$ 4794502 5881266 5503800 7255886 7388486 6797674 5585327 5116869 6138273 6048830
4442F048830j416875J172983j722966J829760J267374k032928k07036N03714o86745
$$ 6048830 4631955 5804938 4081972 5911732 7179106 5146178 4939142 5442856 4756111
4433D756111l81446P9859N66719J40769O17590M85778j371156J066943J035767
$$ 4756111 4374665 4454524 5021243 5162012 5779602 6265380 4894224 5961167 6996934
4424F996934B706014J444992n07741j00109L11452K602460j504704m47558Q61238
$$ 6996934 2706014 4151006 3643265 3543156 3854608 6457068 4952364 4504806 5366044
4415E366044j365830J795450J460819j849193q71502n54783O13233J754661k391295
$$ 5366044 4000214 5795664 7256483 5407290 4535788 3981005 4594238 6348899 3957604
4406C957604O25107j205921K898831p98091q47388P11434j265614P24598J343445
$$ 3957604 4582711 3376790 6275621 5477530 4630142 5341576 4075962 4800560 6144005
4397F144005B931484J757723j748750L085688J31416j136311p19119n37056M84960
$$ 6144005 2931484 4689207 2940457 6026145 6157561 5021250 4302131 3765075 4250035
4388D250035J47878K586228j723498Q7338p82809J417315k491410K512094j935229
$$ 4250035 4397913 6984141 5260643 5347981 4565172 5982487 3491077 6003171 4067942
4379D067942p33649L35852n69453K243816j15364k465310K094003m66929M57758
$$ 4067942 3334293 3670145 3100692 5344508 5229144 2763834 4857837 4390908 4848666
4370D848666B285706K016722O50595k48473J505128k753687j523970M415139k709183
$$ 4848666 2285706 4302428 4953023 4704550 6209678 3455991 1932021 6347160 3637977
4361C637977L03411R08462L41515j355720n04433J323434J053249k102674L266145
$$ 3637977 3941388 4849850 5191365 3835645 3331212 4654646 5707895 3605221 6871366
4352F871366k869400n69646K068612k567926O16932P10128K011596C036259K268888
$$ 6871366 4001966 3432320 5500932 2933006 3549938 4260066 6271662 3036259 5305147
4343E305147j716965J969811k513220K099297J227740k763726L542161k199983
$$ 5305147 3588182 5557993 3044773 5144070 6371810 3608084 7150245 4950262
4335D950262j503353J876764K15107l77242j491891K288594n65690Q07778j27301
$$ 4950262 3446909 5323673 5538780 5161538 3669647 5958241 5392551 6200329 6073028
4326F073028k28526k485004J883386j097129J622894j346563K75774k85071K610568
$$ 6073028 5844502 3359498 5242884 4145755 5768649 4422086 4697860 4412789 7023357
4317G023357k241110m15126J431333o02088m86200L58047J087825j011776J555978
$$ 7023357 4782247 4367121 5798454 5196366 4710166 5068213 6156038 5144262 6700240
4308F700240j498495j738827N03159J584748K92533j262951q04480J213938R76791
$$ 6700240 5201745 3462918 3966077 5550825 5843358 4580407 3775927 4989865 5966656
4299E966656Q0273k419640J707305Q71814j963344K138659O99029Q50437k595127
$$ 5966656 6046929 3627289 5334594 6206408 4243064 6381723 7080752 7931189 5336062
4290E336062J080227L24477q92524P33562O35335k064851K319188k207475L67894
$$ 5336062 6416289 6740766 5848242 6581804 7217139 5152288 7471476 5264001 5631895
4281E631895K704596j916015K149489Q36833q15291j421476P56166j663765J070809
$$ 5631895 8336491 6420476 8569965 9406798 8591507 7170031 7926197 6262432 7333241
4272G333241q63606m25168J452155j985516K023364P32705j918826K106784j000960
$$ 7333241 6469635 6044467 7496622 5511106 7534470 8267175 6348349 8455133 7454173
4263G454173J957699l366614J073985j597044J119185N9203C340931J626427O90358
$$ 7454173 9411872 6045258 7119243 5522199 6641384 6700587 3340931 4967358 5657716
4254E657716L28962k30501q28892l24520K364413J312358n93709q33069O05758
$$ 5657716 5986678 5756177 4927285 4602765 6967178 8279536 7685827 6852758 7458516
4245G458516J296340l195303J540405j093587j30656P956N38428k24367O3787
$$ 7458516 8754856 5559553 7099958 6006371 5875715 5883671 6422099 6197732 6261519
4236F261519o14312K424787j442373K26709M50127k87711o46818l83134J127657
$$ 6261519 5647207 8071994 6629621 6856330 7306457 7018746 6371928 5988794 7116451
4227G116451M67841k542234p1003M53267K445834p09823k110012L159065j387892
$$ 7116451 7584292 5042058 4971055 5424322 7870156 7160333 5050321 8209386 6821494
4218F821494K289568j070138n76037k283942K855038K966778l19286K44378P70655
$$ 6821494 9111062 8040924 7464887 5180945 8035983 11002761 10683475 10927853 11698508
4209A1698508l145954P18689R47922j66200O37367J719154j772164J663346k666479
$$ 11698508 8552554 9271243 10219165 10052965 10690332 12409486 10637322 12300668 9634189
4200I634189K862571k878690J197487J53720K340063k060373r41800J307375J69437
$$ 9634189 12496760 9618070 10815557 10969277 13309340 11248967 10307167 11614542 11783979
4191A1783979K178704p33608k470581J559497K75769r91007O27217m68702K17063
$$ 11783979 13962683 13229075 10758494 12317991 12593760 11602753 12229970 11761268 11978331
4182A1978331j323545K96631l96053K983540l332632L056740r23047k93627M07029
$$ 11978331 10654786 10951417 10555364 13538904 10206272 13263012 12339965 12046338 12453367
4173A2453367j559639L417177q22204j431883L369935r89346J655201r75451j51542
$$ 12453367 10893728 14310905 13488701 12056818 15426753 14437407 16092608 15117157 14965615
4164A4965615n3517j02879J012443R13284O51438q6084q32583N501449j938084
$$ 14965615 14912098 14809219 15821662 16734946 17386384 17300300 16467717 21969166 20031082
4155B0031082l02860n98606K482706k214404M235590r69888K234402J687112K053319
$$ 20031082 19728222 19129616 21612322 19397918 23633508 22663620 24898022 26585134 28638453
4146B8638453j346847l043082j011372m141774k610126o40761l327053l219712
$$ 28638453 27291606 24248524 23237152 19095378 16485252 15844491 12517438 9297726
4138I297726j876351L88944L46846j778486K41291j574524L166965q38157N28531
$$ 9297726 7421375 7810319 8157165 6378679 6619970 5045446 8212411 7374254 7902785
4129G902785r29729m98977Q78340p41855J024613o37773q8601J869487j555168
$$ 7902785 6973056 6474079 7352419 6610564 7635177 6997404 6908803 8778290 7223122
4120G223122P24289j222391j296855J50037K032498k684799O21612K376416l745129
$$ 7223122 7947411 6725020 5428165 5578202 7610700 4925901 5547513 7923929 4178800
4111D178800K711639j061379m48074O39332N52221M79175p92028K214361l462096
$$ 4178800 6890439 5829060 5380986 6020318 6572539 7051714 6259686 8474047 5011951
4102E011951L446729q17233J320941j416194l45576J147746J2588122F944592
$$ 5011951 8458680 7641447 8962388 7546194 7200618 8348364 20936486 6944592
4093H181261j831150K383447k200881K760365k374679J455725k245189n78110
$$ 8181261 6350111 8733558 6532677 9293042 6918363 8374088 6128899 5550789
4085E550789J316917Q22558P9478j082812K47743k246997P18263J407328k01213
$$ 5550789 6867706 7690264 7769742 6686930 6934673 4687676 5405939 6813267 6612054
4076F612054K10137l74728r940j571332J721045r73600J281378k8896j110000
$$ 6612054 6822191 6447463 6437523 4866191 6587236 5613636 6895014 6866118 5756118
4067E756118o45709J528170p76260q85668L10605J326131L32077j061948J420389
$$ 5756118 5110409 6638579 5862319 4976651 5287256 6613387 6945464 5883516 7303905
4058G303905m72351K466652j195865l624670K139191q25538J091858m60201K14814
$$ 7303905 6831554 9298206 8102341 4477671 6616862 5791324 6883182 6422981 6637795
4049F637795M69349k74391Q966q86685K244964l094358J619801M29766l99813
$$ 6637795 7107144 6832753 6841719 5955034 8199998 5105640 6725441 7155207 6755394
4040F755394M66569L10577j744706J699583q28380n50386n3462R56544j246891
$$ 6755394 7221963 7532540 5787834 7487417 6659037 6108651 6055189 7011733 5764842
4031E764842L02683q06438J515842j748430M90846m94819m01974K214422j258556
$$ 5764842 6067525 5261087 6776929 5028499 5519345 5024526 4622552 6836974 5578418
4022E578418J851261j236361o62376J631890M51107o58306J4728k073715P42253
$$ 5578418 7429679 6193318 5530942 7162832 7613939 6955633 6970361 4896646 5638899
4013E638899R14299J17588j129086K452717k645970J034032l18723R7980J376288
$$ 5638899 6553198 6670786 5541700 7994417 5348447 6382479 6063756 6161736 7538024
4004G538024M3242r80961m11678l82612J281987M10656N39015j092840J71788
$$ 7538024 7581266 6600305 6188627 5806015 7088002 7498658 8037673 6944833 7116621
3995G116621J120555j742221P50177M71208n23014j553955K830390k911677M34028
$$ 7116621 8237176 6494955 7245132 7716340 7193326 5639371 8469761 5558084 5992112
3986E992112K57331O07636j133139K027699o99094K33818j215204k80560j069311
$$ 5992112 6249443 6857079 5723940 7751639 7052545 7286363 6071159 5790599 4721288
3977D721288L140479j862158l77079J168534M49982n32604J301472p88437j02072
$$ 4721288 7861767 5999609 5622530 6791064 7241046 6708442 8009914 7221477 7119405
3968G119405m09401k63751j846635J253454J809869m63875J097159j770148O68715
$$ 7119405 6710004 6446253 4599618 5853072 7662941 7199066 8296225 6526077 7194792
3959G194792j513275q38030N19384J314190k259694M421533j648104P118J061820
$$ 7194792 5681517 4843487 5362871 6677061 4417367 8838900 7190796 7197914 8259734
3950H259734q2037l92556j545078p85067K018124j429418m3965N21362J521767
$$ 8259734 8177697 7785141 6240063 5454996 7473120 6043702 5999737 6521099 8042866
3941H042866k407571K335074P12525l07521j452564K092468j402119j933256P53799
$$ 8042866 5635295 7970369 8682894 8375373 6922809 9015277 7613158 5679902 6433701
3932F433701O0769R44721P38518j881203p62125K643689j340392L67416J028744
$$ 6433701 6494470 7439191 8177709 6296506 5534381 8178070 6837678 7205094 8233838
3923H233838j924418M14915j577369K166297k82262J24478J672286m72338K73341
$$ 8233838 6309420 6724335 5146966 7313263 7031001 7155479 8827765 8355427 8628768
3914H628768n22975j736070J452022k25210O43529j069553j31954R47128J3754
$$ 8628768 8105793 6369723 7821745 7596535 8240064 7170511 7038557 7985685 7999439
3905G999439j610883J553265O50590j23586p49726K175176j118597j45249K086013
$$ 7999439 6388556 7941821 8592411 8468825 7719099 9894275 8775678 8630429 10716442
3896A0716442j452291o87026K61028J71003j401284J748364K15037P64778o55219
$$ 10716442 9264151 8577125 8838153 9009156 7607872 9356236 9571273 10336051 9680832
3887I680832K68250m60523K324712j043392K590887j062207q72746J609279k10590
$$ 9680832 9949082 9488559 11813271 10769879 13360766 12298559 11425813 13035092 12824502
3878A2824502q71176R8786n64291J779216j765959M9050j80803K398014j305069
$$ 12824502 11953326 12052112 11487821 13267037 11501078 11550128 11369325 13767339 12462270
3869A2462270J717971k71145O85523n5414N98980R25854N70179j444768R83314
$$ 12462270 14180241 13909096 14594619 14539205 15138185 16064039 16634218 15189450 16172764
3860A6172764J987584j025921k19881J318931Q92503J574994o510L333270Q52916
$$ 16172764 18160348 17134427 16914546 18233477 19125980 20700974 20694464 24027734 24880650
3851B4880650J766404o29139L370297j405086K268293J06395J968044P45789J299590
$$ 24880650 26647054 26017915 29388212 27983126 30251419 30357814 32325858 33071647 34371237
3842C4371237o1876K352128K288800J537989J449127K531224L510879k57184j417919
$$ 34371237 34309361 36661489 38950289 40488278 41937405 44468629 47979508 47722324 46304405
3833D6304405l924968p739140o174644k616861j968784m070308j181094p91730
$$ 46304405 42379437 34640297 28465653 25848792 23880008 19809700 18628606 17836876
3825A7836876k270146k551706K439710j176554j391264j84823j001383R33406
$$ 17836876 15566730 13015024 15454734 14278180 12886916 12702093 11700710 12634116
3817A2634116O31840M57164j291478K320653j44282r89357K336431k118247K631276
$$ 12634116 13265956 13723120 12431642 14752295 14608013 13618656 15955087 13836840 16468116
3808A6468116q93197n44309J310519j8175l422850J760477M92657m15060K35202
$$ 16468116 15574919 15030610 16341129 16322954 12900104 14660581 15153238 14738178 14973380
3799A4973380j865823K221976o26577j302373L85056L51121k27331j464767N62584
$$ 14973380 13107557 15329533 14702956 13400583 13785639 14136760 13909429 12444662 13007246
3790A3007246J870009n71541K060412l625691K956680L2662m25830K9939O71286
$$ 13007246 14877255 14305714 16366126 12740435 15697115 15729777 15303947 15333886 16005172
3781A6005172M032648l82104J687756R32682m78706j760118l419077j840181Q62220
$$ 16005172 20037820 19655716 21343472 22276154 21797448 20037330 16618253 14778072 15640292
3772A5640292j424877l02133j179538Q93983q49432N00821J320880q43634k62870
$$ 15640292 14215415 13913282 12733744 13627727 12778295 13279116 14599996 13756362 13493492
3763A3493492j019195k98043J618099J540087o95050j644572j34582K269387k38256
$$ 13493492 12474297 12176254 13794353 15334440 14639390 12994818 12860236 15129623 14891367
3754A4891367j274035j772561J596855K05599m85039J085644J551657n35604l66344
$$ 14891367 13617332 11844771 13441626 13647225 13162186 14247830 15799487 15263883 14897539
3745A4897539J005616j453303j318000L39693j756018Q62625j78949l44323k829437
$$ 14897539 15903155 14449852 13131852 13471545 11715527 12578152 12399203 12054880 9225443
3736I225443J811350P51723j502549o04344K564758j433412K67671j605100K366322
$$ 9225443 11036793 11788516 10285967 9681623 12246381 10812969 11080640 9475540 11841862
3727A1841862j41795j259747K71808M70500K59394P55315K201311j239400R8514
$$ 11841862 11700067 10440320 10712128 11182628 11442022 12197337 14398648 13159248 13257762
3718A3257762J24760j841501K862402k994973m07968M02710J94110J82412J254113
$$ 13257762 13382522 11541021 14403423 11408450 11000482 11403192 11597302 11779714 13033827
3709A3033827m07314P200p20604o66126k190643K484647j93140J319610j440488
$$ 13033827 12626513 12633713 11913109 11246983 9056340 11540987 11347847 12667457 11226969
3700A1226969J933317M75564k79032l33571l040564L466940k217344J338369j755355
$$ 11226969 13160286 13635850 13356818 13023247 9982683 13449623 11232279 12570648 10815293
3691A0815293K184922J470205k453498K381010P8640l165922J173365N02384J853025
$$ 10815293 13000215 14470420 12016922 14397932 14476572 11310650 12484015 12986399 14839424
3682A4839424k556197J76018m88425J205787j201207J337804k04154j429416M98069
$$ 14839424 12283227 12459245 11970820 13176607 11975400 13313204 13109050 11679634 12177703
3673A2177703P14962j296485N67604r31080J519586P27621j786237K518274p35434
$$ 12177703 12892665 11596180 12163784 11232704 12752290 13479911 11693674 14211948 13476514
3664A3476514k176305K549192l475301K220428K699303k69118k947211L317794
$$ 13476514 11300209 13849401 10374100 12594528 15293831 15024713 12077502 15395296
3656A5395296j739001P29248j291123L999446l110291L14059L224316l193461
$$ 15395296 13656295 14385543 13094420 17093866 13983575 14297634 17521950 14328489
3648A4328489Q61546Q83251k16711Q69990k49175j509887p98779L378450l5694
$$ 14328489 15190035 16073286 15856575 16726565 16477390 14967503 14168724 17547174 17511480
3639A7511480j648311j31981k57304R07602J298180j699876O2953J765165k104861
$$ 17511480 15863169 15731188 15473884 16381486 17679666 15979790 16042743 17807908 15703047
3630A5703047K653787j26500o70040j902792J873964J213126K068p63036k96069
$$ 15703047 18356834 18230334 17560294 15657502 17531466 18744592 18746660 17983624 17687555
3621A7687555k49470K06883J58068N50792m3838J65802P73132M3852K50053J643265
$$ 17687555 17438085 17644968 17803036 18353828 18309990 18475792 19248924 19292776 19542829 21186094
3611B1186094L23948p62320o82408J942346n24872j05844n00626k675550J486370
$$ 21186094 21510042 20747722 20065314 22007660 21482788 21376944 20876318 18200768 19687138
3602A9687138J870756j000708R62202Q21517J807219m284836l24176J759222J232630
$$ 19687138 21557894 20557186 21519388 22340905 24148124 19863288 19539112 21298334 22530964
3593B2530964k27250J876364L521128k490190n05364L203642J103234l46948J258578
$$ 22530964 22303714 24180078 27701206 25211016 24705652 27909294 29012528 28665580 29924158
3584B9924158K256330j561168j67369L194991K004031j913428R10021L171031
$$ 29924158 32180488 30619320 30451951 33646942 35650973 33737545 34647566 37818597
3576C7818597J09700J009056J661224J3733K289703L59076k57492M306940r61476
$$ 37818597 37928297 38937353 40598577 40612310 42902013 43261089 43003597 47310537 46349061
3567D6349061L168180p72868L757199K761700P13993K640636K420992K284375
$$ 46349061 49517241 48744373 52501572 55263272 55977265 58617901 61038893 63323268
3559F3323268L8964L015348L372232Q25344K936016K289143N124960L686152N116576
$$ 63323268 63362232 66377580 69749812 70575156 73511172 75800315 80925275 84611427 89728003
3550H9728003O016103M165728N862184O908712O328600Q786831O239440J1628471
$$ 89728003 95744106 99909834 105772018 112680730 119009330 127796161 134035601 145664072
3542A45664072J4282128J4117343J5598719J9020031J8433343J9006943K3995935
$$ 145664072 159946200 174063543 189662262 208682293 227115636 246122579 270118514
3535B70118514K6123647K9369822L3813919L7162622M9108413N8545342P2581629
$$ 270118514 296242161 325611983 359425902 396588524 445696937 504242279 576823908
3528E76823908J01752571J37284474J86134134K47808245K97575538K56295667
$$ 576823908 678576479 815860953 1001995087 1249803332 1547378870 1803674537
3522A803674537P7325948j80601590l50516080l42979120k62401843j87431864
$$ 1803674537 1881000485 1700398895 1349882815 1006903695 744501852 557069988
3516E57069988j33971545r7487356p0983196m9941421l6076207k6350286k1085168
$$ 557069988 423098443 325611087 254627891 204686470 168610263 142259977 121174809
3509A21174809j3718256j2701919q987991p694776m871479o388109m565807m423644
$$ 121174809 107456553 94754634 85766643 78071867 73200388 66812279 62246472 57822828
3501E7822828n223028n068475k922932k943696j022388r43244j632316q04663
$$ 57822828 52599800 47531325 44608393 41664697 40642309 39699065 38066749 37262086
3493C7262086l62509l938392J961057j487331j914074r00432l694835N16714n42546
$$ 37262086 36899577 32961185 34922242 33434911 31520837 30620405 26925570 27442284 26899738
3484B6899738j498878j006686j435394l55628j433934j758472K512086j510778
$$ 26899738 25400860 24394174 22958780 22603152 21169218 19410746 21922832 20412054
3476B0412054k214150L647772j981460N24490k253866j19494j634718K489550
$$ 20412054 18197904 21845676 19864216 20388706 18134840 18015346 16380628 18870178
3468A8870178k097785k545793J319836Q5604J349610k095239K799089l556484
$$ 18870178 16772393 14226600 15546436 15632040 16981650 14886411 17685500 14129016
3460A4129016R24549K08361L48936k182523J57911l69527K5677j84745O62472
$$ 14129016 15053565 15261926 15610862 13428339 13586250 13216723 13242400 13057655 13720127
3451A3720127O44144n30730R0826m46097l4625J174630k188876j11816K67423
$$ 13720127 14364271 13833541 13924367 13478270 13443645 14618275 12429399 12317583 12585006
3442A2585006j062200m38136J021626j534280K38066R53802j692079R51119j178515
$$ 12585006 11522806 11084670 12106296 10572016 10810082 11763884 10071805 11022924 9844409
3433I844409j741633K106374k075330R54806l87777p00827J293244K065k55075
$$ 9844409 8102776 10209150 8133820 9088626 8700849 8000022 9293266 9295331 9040256
3424I040256P81587m10298N54281j839889J33205J492961j385584r79627L45876
$$ 9040256 9821843 9411545 9965826 8125937 8259142 9752103 8366519 7386892 7732768
3415G732768J15913K147178j279027r19671J763243k126721K391092k768543J19266
$$ 7732768 7848681 9995859 8716832 7797161 9560404 7433683 9824775 7056232 7175498
3406G175498J499607q91430J471701p74648k518032K427919j886994q562O76016
$$ 7175498 8675105 7783675 9255376 8480728 5962696 8390615 6503621 6495059 7171075
3397G171075l25394P85133j501079Q81541j176920n33642Q88266L93400Q95779
$$ 7171075 6845681 7630814 6129735 7011276 5834356 5300714 6188980 6582380 7478159
3388G478159J409411j268667l36796k731527M280592j481390l12730J06301k142923
$$ 7478159 8887570 7618903 7282107 4550580 8831172 7349782 7037052 7143353 5000430
3379E000430K433799l92594R944r18299J606153j585454J048090m3875j8837j564080
$$ 5000430 7434229 7041635 7051579 6133280 7739433 6153979 7202069 7158194 7139357 5575277
3369E575277o93265o08244P37356P69977J058708K90716K75521J003356j683777
$$ 5575277 4882012 4273768 5011124 5781101 6839809 7130525 7406046 8409402 6725625
3360F725625k909P12290k875776N87903N77276J059765k063787N25957M53946
$$ 6725625 6722716 7435006 4559230 5147133 5724409 6784174 4720387 5246344 5700290
3351E700290o00253J79416j136643K218941j060865o14638J933089K65732L00148
$$ 5700290 5100037 5279453 4142810 6361751 5300886 4686248 6619337 6885069 7185217
3342G185217j284878m84625J846167j278316o63396P89429L571449k921023J569518
$$ 7185217 5900339 5415714 7261881 5983565 5320169 6109598 9681047 6760024 8329542
3333H329542J268094n47888J834420J961619O18099N82562j143433J194502r38142
$$ 8329542 9597636 9049748 10884168 12845787 13463886 14046448 12903015 14097517 13159375
3324A3159375p00764m103548j235632J459856k379117j149210J845189r69102
$$ 13159375 12458611 8355063 7119431 8579287 6200170 5050960 6896149 5927047
3316E927047m68615j880909L287422k287115K37233R19541m70189J769380j293875
$$ 5927047 5458432 3577523 6864945 4577830 4815063 5734604 5264415 7033795 5739920
3307E739920M49258J25970k33118k881807J999566Q01901N96883k196674J233713
$$ 5739920 6189178 6315148 6082030 3200223 5199789 6001690 6598573 4401899 5635612
3298E635612J20724J269384k556822J138347o05666Q08265J257289o73732J123720
$$ 5635612 5756336 7025720 4468898 5607245 5001579 5809844 7067133 6393401 7517121
3289G517121O79096j528478J092748k687034K240634J707482j108195J699545
$$ 7517121 8196217 6667739 7760487 5073453 7314087 9021569 7913374 9612919
3281I612919K347546j995342J457763k516823L288578j723507K193022k28817
$$ 9612919 11960465 9965123 11422886 8906063 12194641 10471134 12664156 12435339
3273A2435339K88644M91960J204923L8073j82231K091820k68862p70442K087926
$$ 12435339 12723983 13215943 14420866 14458939 14276708 16368528 16099666 15329224 17417150
3264A7417150K32322R16690j365517K861481J756578q09788J193274q55614M35120
$$ 17417150 17649472 18566162 17200645 20062126 21818704 21008916 22202190 21346576 21781696
3255B1781696O02568J780809M81125l06692m62790K462414m73537Q23859K477125
$$ 21781696 22384264 24165073 24646198 24339506 23876716 26339130 25865593 26689452 29166577
3246B9166577j285842K9610P21553k063080J115611j955059J902892N26659j182716
$$ 29166577 27880735 27910345 28631898 26568818 27684429 25729370 27632262 28158921 26976205
3237B6976205Q33761p81128K49968j851957J11190Q2394J855803O8404p48580
$$ 26976205 27809966 27028838 27278806 25426849 25538039 25620433 27476236 27544640 26796060
3228B6796060q38345L142102j357563Q76344K024794n70474J015260K96125J012436
$$ 26796060 25957715 29099817 27742254 28618598 30643392 30072918 31088178 31384303 32396739
3219C2396739j689053J792985K157123q04249Q24357L040431J860868j405924
$$ 32396739 30707686 32500671 34657794 33853545 34677902 37718333 39579201 38173277
3211C8173277L313100p26752j875636k958576l719243o902014l195306j609216
$$ 38173277 41486377 40759625 38883989 35925413 32206170 25304156 22108850 20499634
3203B0499634k918870O40368l281790j219014k221390Q81889m2498J02370r99117
$$ 20499634 17580764 18221132 14939342 13720328 11498938 12380827 12338329 12440699 11441582
3194A1441582j2131j951881K363722q53333k130714J061819L38542L64150j443952
$$ 11441582 11429451 9477570 11841292 10987959 8857245 9919064 10257606 10621756 9177804
3185I177804q8198K336280k410536J067524j117143J456413K00994j167667L67537
$$ 9177804 9089606 11425886 9015350 10082874 8965731 10422144 10623138 9455471 9823008
3176I823008k36129K76665q20171N8544j39753l96480k37092j77801Q83942P1349
$$ 9823008 9586879 9863544 9043373 9101917 8962164 8565684 8328592 8150791 9034733 9106082
3166I106082l6117N05274N39315J483145k187335P06554K47918l27377j903485
$$ 9106082 9069965 9575239 10114554 11597699 9410364 10116918 10364836 10037459 8133974
3157H133974N53067J092126k318040j105262L241195m00991R89073j601959l15419
$$ 8133974 8687041 9779167 7461127 6355865 9597060 9196069 10185142 8583183 8267764
3148H267764o82699K53533R73831R79952l005975K021002j873556J479413J44200
$$ 8267764 7585065 7838598 8812429 9792381 6786406 8807408 6933852 8413265 8557465
3139H557465r78112o0354N3726K776144k895232R9794J500043j342128J24155
$$ 8557465 7579353 7518999 7572725 10348869 7453637 7553431 9053474 7711346 7835501
3130G835501J851762j757056K31560j284515M311743k700051K18118l76593J794319
$$ 7835501 9687263 7930207 8161767 6877252 11188995 8488944 8707062 8330469 10124788
3121A0124788q91291j113140P5335L901013k122622L517383j918843N77135k265
$$ 10124788 9233497 8120357 8195692 12096705 9974083 13491466 11572623 12149758 12147493
3112A2147493L276500k480234O88423K198830n05463q62768K983659J930090N320884
$$ 12147493 15423993 12943759 13632182 15831012 15325549 14462781 17446440 19376530 24697414
3103B4697414M555800Q398167O271360l784812m52516J479544k210832j3066130
$$ 24697414 29253214 37651381 43922741 40137929 39685413 41164957 38954125 25887995
3095B5887995r482545r85398n254367o7457M94240j296925j525653N9560L77694
$$ 25887995 16405450 15420052 10165685 10098228 10592468 9295543 7769890 7829450 8207144
3086H207144Q34167N63313j82285j09042k514795R38746J731713J209855m18420
$$ 8207144 9041311 9604624 9422339 9313297 6798502 7737248 9468961 10678816 10260396
3077A0260396j872335J504552l259158J080048m78402o93345K060633j852349
$$ 10260396 8388061 9892613 6633455 7713503 7235101 6541756 8602389 6750040
3069F750040K123077J52363q25700J232886r35764O6072J308033j653175P26823
$$ 6750040 8873117 9025480 8199780 9432666 8496902 8562974 9871007 8217832 8944655
3060H944655n9940L70220n68549j836736J538430j057654m790j379015r75455
$$ 8944655 8884715 9254935 8686386 6849650 8388080 7330426 7325636 5946621 4971166
3051D971166J900366R33372j226863k28721L581977l696684K28941l46688L21907
$$ 4971166 6871532 7804904 6578041 6349320 9931297 6234613 6463554 6116866 6438773
3042F438773O46566J564885k361594J570082M67091N03149P28748k596785K111335
$$ 6438773 7085339 8650224 6288630 7858712 8325803 8828952 9557700 6960915 9072250
3033I072250r35170j188385K090489p35883j963357J546731M22560j59002o29157
$$ 9072250 8137080 6948695 9039184 8303301 6339944 7886675 8309235 8150233 7521076
3024G521076M87699m60973j234884J818622o75471j255784m99108K253550p76572
$$ 7521076 8008775 7547802 6312918 8131540 7456069 6200285 5701177 7954727 7178155
3015G178155Q54990p23982M49082k02838q13183L87413p7900j259452K131080
$$ 7178155 8033145 7309163 7758245 7555407 6742224 7129637 7051737 5792285 7923365
3006G923365J885407k642052J050018J71652J053621k90759p7897j973065M11089
$$ 7923365 9808772 7166720 8216738 8388390 9442011 9151252 9073355 7100290 7511379
2997G511379J130527k566079K527346m99496j392084p5699P25364q18498J688348
$$ 7511379 8641906 6075827 8603173 8103677 6711593 6635894 7361258 6542760 8231108
2988H231108N45699J09518p14823J717671p05016j932807K24704M12574J184876
$$ 8231108 8776807 8886325 8171502 9889173 9184157 7251350 7476054 7888628 9073504
2979I073504j954477J568420k044082L19865K365456p221r8899n17187j049462
$$ 9073504 7119027 8687447 6643365 6963230 9328686 9321465 9222566 8705379 7655917
2970G655917O93578j266912n789J538333j403661J323684o39459l18642K035605
$$ 7655917 8349495 7082583 7076794 8615127 7211466 8535150 7895691 7577049 9612654
2961I612654j076867Q47024j291913J63468j808145K006218j97188k802005L756705
$$ 9612654 8535787 9382811 8090898 8254366 6446221 8452439 8255251 5453246 9209951
2952I209951Q54114k016480n95407K397620Q2624j280497o6505j914289R93017
$$ 9209951 10064065 8047585 7452178 9849798 9932422 8651925 8585420 6671131 7664148
2943G664148l23100n90131L402633k149109P15688K236586k215737J556092J210301
$$ 7664148 7341048 6750917 10153550 8004441 8720129 10956715 8740978 10297070 11507371
2934A1507371O08927j125776M86451m66094J580023j273936k76082J808803j234418
$$ 11507371 12116298 10990522 11476973 11010879 12590902 11316966 11040884 12849687 11615269
2925A1615269J79438M36086l88463j214211J676097J258983J491704j049687O68244
$$ 11615269 11794707 12230793 11842330 10628119 12304216 13563199 15054903 14005216 14673460
2916A4673460K108334N85748J025337M05131J666366M95896J293116K434530q55690
$$ 14673460 16781794 17367542 18392879 18798010 20464376 20960272 22253388 24687918 23832228
2907B3832228L040458k540432N81491L113829k078534L185770K379385J000872
$$ 23832228 26872686 24332254 24913745 28027574 25949040 29134810 31514195 32515067
2899C2515067K933718J489316k58132k776007j947625m363781j480958k504007
$$ 32515067 35448785 36938101 36679969 33903962 31956337 27592556 26111598 23607591
2891B3607591k401065N35960j269054l3706o37788J788876K234459R327327J6198048
$$ 23607591 21206526 21742486 20473432 20439726 19801938 21590814 23825273 33152600 49350648
2882D9350648J4612456J253068k5405207j5776375l894246n503493P86008l219560
$$ 49350648 63963104 65216172 39810965 24034590 20140344 14636851 15422859 12203299
2874A2203299J53105j147508o85411j124729J171308L45523j732016O48700j187807
$$ 12203299 12356404 11208896 10523485 9398756 10570064 10915587 9183571 9832271 8644464
2865H644464N41367k07259K84299l583568M65964M07416J752538Q52108j454048
$$ 8644464 9185831 8978572 9262871 5679303 6145267 6552683 8305221 9157329 7703281
2856G703281j211663J732157j72055J4081m09147m70641R82024L43538o03800
$$ 7703281 6491618 8223775 8051720 8065801 7656654 7186013 8168037 8511575 7907775
2847G907775j363654j655347L745327j8977p512p67980L206015k800655q60712
$$ 7907775 6544121 4888774 8634101 8615124 8607612 7839632 11045647 8244992 7384280
2838G384280K67630O40831j905451P19024k08254m89505j452555K544608n59647
$$ 7384280 7651910 8292741 6387290 7106314 6898060 6408555 4956000 7500608 6940961
2829F940961R65902M66319j653774J854301r81395R50133J673534k207368J149451
$$ 6940961 7906863 8373182 6719408 8573709 7592314 8542447 10215981 8008613 9158064
2820I158064j316232J054465l97788P54234Q97347j566257K54781M62819M68027
$$ 9158064 7841832 8896297 8498509 9252743 10150090 8583833 8838614 9301433 9769460
2811I769460l59577J096778M01846j609012K849024j78031R45325J272924j390295
$$ 9769460 9409883 10506661 10908507 9299495 12148519 11970488 12915813 14188737 12798442
2802A2798442J834234J007491P74226j14065L441798K192284L461708O503295
$$ 12798442 14632676 15640167 16414393 16300328 19742126 21934410 25396118 31899413
2794C1899413J4917395K1409428J9096743j0868655l0775771j3157008o668031
$$ 31899413 46816808 68226236 87322979 76454324 45678553 32521545 25853514
2787B5853514n83110N07555L977823P938092R876619O929776j6381271j0110996
$$ 25853514 25270404 25777959 29755782 37693874 47570493 54500269 38118998 28008002
2779B8008002m457434R43249K929861O728999J5279631J2409920R544167k1808434
$$ 28008002 23550568 24493817 27423678 34152677 49432308 61842228 71386395 49577961
2771D9577961k0536092o566473k273110K455166J582224R338906J0157291N789656
$$ 49577961 29041869 22475396 20202286 22657452 24239676 33578582 43735873 49525529
2763D9525529j6677426j2467833n134432N75728L26957J582711J812282N175260
$$ 49525529 32848103 20380270 15245838 15821566 16148523 17731234 19543516 24718776
2755B4718776J387896o222466p089050k069863j136390J87447j145755k44897
$$ 24718776 26106672 19884206 12795156 10725293 9588903 9776350 8630595 8385698
2747H385698j058921L98020K6601k40101o4128j89244P51985J173613J24678Q10107
$$ 8385698 7326777 7724797 7751398 7511297 7447169 7257925 8009910 9183523 9308201 10118308
2737A0118308J61966m34910L800424m42641j86281Q90q83702l3316k330618J120606
$$ 10118308 10280274 9845364 13645788 13203147 13016866 13017756 12134054 12100738 9770120 10890726
2727A0890726P67845k191528o47896q27369o75889J776923l301293J078697o54428
$$ 10890726 11658571 9467043 8819147 7991778 7315889 9092812 5791519 6870216 6215788
2718F215788N56573j263031j452473J017775q18809m34964Q74384j61591L82272
$$ 6215788 6772361 5509330 4056857 5074632 4255823 3820859 4695243 4533652 4915924
2709D915924j614021J762352J97197j459602N45350R41623j995144q4268K048217
$$ 4915924 3301903 5064255 5261452 3801850 4347200 5288823 3293679 3209411 5257628
2700E257628j171477k85209K075275k028548R47098q71801r20083O15734A354379
$$ 5257628 4086151 3800942 5876217 3847669 4794767 3922966 3002883 3618617 1354379
2690C411742A562284K770295A886961L019038j350541J503258q21201j001333
$$ 3411742 1562284 4332579 1886961 4905999 3555458 5058716 4237515 3236182
2682C236182K677551B742686J42594P74277q0561K15202O6246m65470J95620j63386
$$ 3236182 5913733 2742686 2885280 3659557 3578996 3794198 3860444 3394974 3590594 3427208
2672C427208J020372k096192K161076Q36881j322104j263742O77975r0269J330941
$$ 3427208 4447580 2351388 4512464 5349345 4027241 2763499 3441474 3351205 4682146
2663D682146k113792p58686K703983p05895M47508m77831r55773r48513L036925
$$ 4682146 2568354 1809668 4513651 3807756 4255264 3777433 2821660 1873147 4910072
2654D910072j450971P22041j333520j20320J798791J007819j335354j1245K262231
$$ 4910072 3459101 4181142 2847622 2727302 4526093 5533912 4198558 4187313 6449544
2645F449544r94027j240956J166957q81369l56716J845520j41971k27070n54620
$$ 6449544 5455517 4214561 5381518 4500149 4143433 5988953 5846982 5619912 5065292
2636E065292r75902n24056k41864K025319j647509J793755o54416J5257j72379
$$ 5065292 4089390 3565334 3323470 5348789 3701280 5495035 4840619 4855876 4683497
2627D683497J05797j834289J664934J745914B645907J917765j49552K904017k592051
$$ 4683497 4789294 2955005 4619939 6365853 2645907 4563672 4414120 7318137 4726086
2618D726086l69895l23441J025659Q2410j005164K379881C230080P98984K303357
$$ 4726086 4356191 4032750 5058409 5140819 4135655 6515536 3230080 4029064 6332421
2609F332421j938510J58742R71878Q64243j561631R08332j225143R82859o79090
$$ 6332421 4393911 4552653 5524531 6388774 4827143 5735475 4510332 5493191 4814101
2600D814101j904968L502267k406099P23248J154921m59608o05270R61535N05481
$$ 4814101 2909133 6411400 4005301 4728549 5883470 5423862 4818592 5780127 6285608
2591F285608j877297M06248J116836k36326L8090k50343J509060r69752J331583
$$ 6285608 4408311 4814559 5931395 5695069 5733159 5482816 6991876 6022124 7353707
2582G353707k751509J920832l79610j086463N44185j193799K334235o16898k376407
$$ 7353707 4602198 6523030 6143420 5056957 5601142 4407343 6741578 6124680 3748273
2573C748273K362457j978514j95000J417053n09838M63820j860111J75510J550929
$$ 3748273 6110730 4132216 3937216 5354269 4844431 5308251 3448140 3623650 5174579
2564E174579k177744K168638k338302J259263K38084O99665j375982n91785L50149
$$ 5174579 2996835 5165473 2827171 4086434 4324518 5024183 3648201 3056416 3406565
2555C406565L723115k130919K32695j925210J843824j187071Q50337l91731O44986
$$ 3406565 7129680 4998761 5231456 3306246 5150070 3962999 4813336 4421605 5066591
2546E066591J538568Q1340j577440K30463J513413n96556M16406N75621j1988
$$ 5066591 6605159 6686499 5109059 5339522 6852935 6256379 6672785 7248406 7236418
2537G236418j619753L99917K73123r28014J567896k597794J357514J57487K41442
$$ 7236418 5616665 6016582 6289705 5361691 6929587 4331793 5689307 5846794 6088236
2528F088236l50335O16157R70083q63860j30096m59507O13117j069517K13591
$$ 6088236 5737901 6354058 7324141 6460281 6330185 5870678 6483795 5414278 5627869
2519E627869K035706J523023j862027P18573J525560k570702J107785L61593N65371
$$ 5627869 7663575 9186598 7324571 8043144 9568704 6998002 8105787 8467380 9032751
2510I032751l32195J585974j179255N95040q74145J5509r16447R72802r40582
$$ 9032751 8700556 10286530 9107275 9702315 8828170 8843679 7927232 8900034 7959452
2501G959452j73614o59866M30444l16074J445511j488533K73598j896048J975334
$$ 7959452 7785838 7125972 7556416 7240342 8685853 7197320 7470918 5574870 7550204
2492G550204J454352M43213j20688k42701N34699J78535l068531J793895p289
$$ 7550204 9004556 9447769 9327081 9084380 9619079 9797614 6729083 8522978 8515689
2483H515689l57563K366159m421020M675775j040396K03984k18575L16440j424648
$$ 8515689 8158126 10524285 6103265 10779040 9738644 9942628 9724053 10040493 8615845
2474H615845K95585j486302P90324j452594P87050j908285K487379J266648j948238
$$ 8615845 8911430 7425128 8215452 6762858 7549908 5641623 8129002 9395650 7447412
2465G447412M99367P95114k043741J270769q78493L05636P57702K41958j115220
$$ 7447412 7946779 8741893 6698152 7968921 7090428 7396064 8153766 8395724 7280504
2456G280504L96492o58284O31313q01912J824558N33286o70163l67073j550746
$$ 7280504 7676996 7018712 7650025 6848113 8672671 9205957 8535794 8168721 6617975
2447F617975J190676L65579k237421L277625j379493P14646p46461Q62199J040306
$$ 6617975 7808651 8174230 5936809 9214434 7834941 8549587 7803126 8665325 9705631
2438I705631l03091k2290n93185q55738K08242R0265n35687M98989j66179K693191
$$ 9705631 9402540 9380250 8787065 7931327 8139569 8229834 7694147 8193136 8026957 10720148
2428A0720148j782361o24019L7706O89337n75445J644711r00345j357846L647946
$$ 10720148 8937787 8313768 8351474 9040811 8465366 10110077 9209732 7851886 11499832
2419A1499832p60139k962135l0288L26510K73554n2564l15931J66412K21145P07425
$$ 11499832 10739693 7777558 7747270 8073780 8347334 8294770 7978839 8145251 8366396 9073821
2409I073821q91868J440084M37174j121630J535620K235896l856270K784617j041060
$$ 9073821 8181953 9622037 10059211 8937581 10473201 12709097 8852827 11637444 10596384
2400A0596384O47743n23820k74204P97253k148156J181822L38813j804243j93660
$$ 10596384 11244127 10720307 10446103 11243356 9095200 10277022 10615835 8811592 8617932
2391H617932K97462j075603J052861q69221L5199j126845j75292P82506Q95382
$$ 8617932 8915394 7839791 8892652 8023431 8058630 6931785 6756493 7538999 8434381
2382H434381J11676k053781P54129K079980m39740J26250j835157J314394j319309
$$ 8434381 8546057 6492276 7246405 9326385 8886645 9012895 7177738 8492132 7172823
2373G172823Q87427q61686N96275j311857L517132m464542L162000j129552q01926
$$ 7172823 8060250 7198564 7794839 6482982 10000114 5535572 8697572 7568020 6766094
2364F766094J867983k957272L228735j022049j27465L79641j203129K17169N30243
$$ 6766094 8634077 5676805 8905540 7883491 7756026 8135667 6932538 7149707 7679950
2355G679950J39072J357123j266432K689012k483353M87395J569642k185060o67898
$$ 7679950 7819022 9176145 7909713 10598725 8115372 8602767 10172409 7987349 7319451
2346G319451N70354J155772p0536J540956j572302K154556j364714j50576j163550
$$ 7319451 7889805 9045577 8975041 10515997 8943695 11098251 9733537 9582961 8419411
2337H419411J877472M99714o36172J258963j121439J142366m68841J812279q02353
$$ 8419411 10296883 10796597 10160425 11419388 10297949 11440315 10971474 12783753 11981400
2328A1981400j075160o77692J331411m81479Q1056L50872L75492J138315j180297
$$ 11981400 10906240 10228548 11559959 11078480 11159536 11510408 11885900 13024215 11843918
2319A1843918J849769O7854j949456R90748J602335M90178L58917r08935L79388
$$ 11843918 13693687 13761541 11812085 12802833 14405168 14895346 15254263 14345328 14724716
2310A4724716j927537q29925n91541j85309J58158J096466j536727p45999L798225
$$ 14724716 12797179 11967254 11375713 11190404 11348562 12445028 10908301 10162302 13960527
2301A3960527N00772m00016j329040J766755l100239L332286J423980m090982
$$ 13960527 14461299 14061283 12732243 14498998 11398759 14731045 16155025 12064043
2293A2064043J716900K9307q61612Q40217J981118k347507K35288N14255j393054
$$ 12064043 13780943 13810250 12948638 13788855 15769973 13422466 13657754 14172009 12778955
2284A2778955Q40683j192514J788198j547893p54379J936645k08503j80644J536722
$$ 12778955 13619638 12427124 14215322 12667429 11913050 13849695 13641192 13460548 14997270
2275A4997270j879604Q6155p19947l40647l05613L67403J95648p61229J04071
$$ 14997270 13117666 13203821 12483874 12143227 11837614 12205017 12400665 11639436 11743507
2266A1743507j221417k10855J033255K061344m06876j822357J221445o12261J43299
$$ 11743507 10522090 10311235 11344490 13405834 12998958 11176601 12398046 11785785 11929084
2257A1929084Q64507O07172q66844J046554l30254j758950M382323j846781q45869
$$ 11929084 12793591 13400763 12533919 13580473 13250219 11491269 15873592 14026811 13180942
2248A3180942l648739K243168n08075m96434Q2902r81510k261816M448516k063617
$$ 13180942 9532203 11775371 11267296 10770862 10853764 9872254 7610438 12058954 9995337
2239I995337J73263k72037K379043j838604Q49733r52825O29139l70384k89540
$$ 9995337 10168600 9896563 12275606 10437002 11286735 10333910 10963049 10592665 10303125
2230A0303125J918452j3964j373712j800927L885660j057962p98635J65864Q16417
$$ 10303125 12221577 12207613 10833901 9032974 12918634 11860672 11062037 11227901 12044318
2221A2044318j291265K471270j67994o4390N36199l673144J389910J526317L5570
$$ 12044318 10753053 13224323 13056329 12991939 13528138 9854994 11244904 12771221 12806791
2212A2806791j381159K150319j009534J312679k042212K898917Q3102k514121
$$ 12806791 11425632 13575951 12566417 13879096 11836884 14735801 14818903 12304782
2204A2304782J966163k60352k74067j81564J388180M81696j924314m48739J405584
$$ 12304782 14270945 14010593 13736526 13554962 14943142 15424838 13500524 13051785 14457369
2195A4457369M87244p11971J673373j004757n95840K236072p77155q31293K019682
$$ 14457369 14944613 14232642 15906015 14901258 14305418 16541490 15764335 14933042 16952724
2186A6952724k033579K130227J093404j928165J121412J749579l14699K290573
$$ 16952724 14919145 17049372 18142776 16214611 17336023 19085602 18770903 21061476
2178B1061476j012748N86354j608554n25724m64959M24981r83558l35348J198053
$$ 21061476 20048728 20635082 19026528 18500804 18035845 18460826 17477268 17141920 18339973
2169A8339973l11069O70959p29379J490990N25416l66516N50354j509034O86424
$$ 18339973 18028904 18699863 17970484 19461474 19986890 19620374 20170728 18661694 19348118
2160A9348118K7478L68990j497938J246946q22189k014805K134324q31841J271468
$$ 19348118 19375596 19744586 18246648 19493594 18671405 16656600 18790924 17959083 19230551
2151A9230551O01259j945450J006834K71614k74276n41559M19355N92094j50392
$$ 19230551 19831810 17886360 18893194 19164808 18890532 18348973 18768328 19360422 19210030
2142A9210030J278470r84820Q60802k184432L035388k308156k360405K59461J997338
$$ 19210030 20488500 19503680 20364482 18180050 21215438 18907282 16546877 16806338 18803676
2133A8803676J0042R22616L02700j514038P47512q41908M87984j3462J218697
$$ 18803676 18813718 19736334 20039034 18524996 19272508 18430600 18918584 18905122 20123819
2124B0123819j240841M146388K379066J050489O456820J4972591R043425j3033040
$$ 20123819 18882978 23029366 25408432 26458921 32915741 47888332 56931757 43898717
2116D3898717j4978887o906214k846114j267282j051403J175135j237592M6134
$$ 43898717 28919830 22013616 19167502 17900220 16848817 18023952 16786360 16832494
2108A6832494k002290n7755o43222K505896k630341J88251N35141J601185l086726
$$ 16832494 14830204 14772449 14129227 16635123 14004782 14193033 14728174 16329359 13242633
2099A3242633M051423q75099k655887J712919q26338q86179J755173j19223K19864
$$ 13242633 17294056 16418957 13763070 15475989 14649651 13763472 15518645 15399422 15619286
2090A5619286Q90380L61312l218296R2628O77544l17886j049042J837810k167874
$$ 15619286 16509666 16870978 13652682 13745310 14422854 14104968 13055926 14893736 12725862
2081A2725862k053481Q44318o58291J419768j327322N55450r79001j082071J586433
$$ 12725862 10672381 11516699 10858408 12278176 10950854 11506304 10527303 9445232 11031665
2072A1031665r80696J118905r92267j34876q42756J368818j183984j828420J633701
$$ 11031665 10050969 11169874 10177607 10042731 9199975 10568793 9384809 7556389 9190090
2063I190090k02583Q97648k253934K840411k751126J94219J919242R59899j881046
$$ 9190090 8987507 9885155 7631221 10471632 7720506 7914725 9833967 10793866 8912820
2054H912820J057209q02316J973604r31180K54259l00279j791145M02376M62740
$$ 8912820 9970029 9167713 11141317 10210137 10464396 10164117 8372972 8775348 9238088
2045I238088r78403J185151n44451J073548N07564r08113R65913k964165K945352
$$ 9238088 8259685 9444836 8900385 9973933 10481497 9573384 10539297 7575132 10520484
2036A0520484K1156K30957j412108K745520m076372K777907o89779J377141m71335
$$ 10520484 10541640 10772597 9360489 12106009 8029637 10807544 10117765 11494906 11023571
2027A1023571R00938j169235j072820P60914j277702m8409J01640Q99681J94498
$$ 11023571 11924509 10755274 9682454 10443368 9165666 9117257 9218897 10118578 10313076
2018A0313076O25726o22505J951442L08173k262940L04349J02861J257747j0171
$$ 10313076 10938802 10316297 12267739 12575912 10312972 10617321 10720182 11977929 11967758
2009A1967758J565755j205801l29837m65671J064589J027979j071431Q33654l44307
$$ 11967758 13533513 12327712 11997875 11532204 12596793 13624772 12553341 13386995 13042688
2000A3042688M83229M28929O31601j095576K547314k386402J690672Q00698k710254
$$ 13042688 13525917 13954846 14586447 13490871 16038185 13651783 15342455 16143153 13432899
1991A3432899L3865P51677n59388J499334o4488J358127j487989K304995k06066
$$ 13432899 13466764 14218441 13659053 15158387 15093899 16452026 14964037 17269032 17062966
1982A7062966J87427j24955j142087J990855J873136j233006j103474j597474
$$ 17062966 17250393 17125438 15983351 17974206 19847342 18614336 17510862 15913388
1974A5913388K236616N55535J635221l044108J901268M52482j006158J382774
$$ 15913388 18150004 18705539 20340760 17296652 19197920 19650402 18644244 20027018
1966B0027018J345528P42178j026594J074366J192844j395346K31572J153618
$$ 20027018 21372546 22114724 21088130 22162496 23355340 21959994 22191566 23345184
1958B3345184j651664K54732J785280l001428J64364j481856J588108K005854
$$ 23345184 21693520 21948252 23733532 20732104 20896468 19414612 21002720 23008574
1950B3008574l407308J033666o01702n33950q06159K164733m94476q26567j640477
$$ 23008574 19601266 20634932 20033230 19499280 18693121 20857854 20363378 19536811 17896334
1941A7896334P36644P91162j336404K013130N95456q18254j673716L269736m291780
$$ 17896334 18632978 19424140 18087736 20100866 20696322 19878068 18204352 21474088 17182308
1932A7182308L621104j290284j788686J959042q71230J252636p8376j03618k078380
$$ 17182308 20803412 19513128 17724442 19683484 18812254 20064890 19986514 19882896 17804516
1923A7804516L067492l129029J746537j947592M49090j200678L17708p20235K72376
$$ 17804516 20872008 17742979 19489516 17541924 17991014 16790336 17108044 16387809 16660185
1914A6660185L20042k33876k46227K25088j780850Q63769r84146J038087k690453
$$ 16660185 16980227 16746351 16500124 16725212 14944362 15808131 14823985 15862072 13171619
1905A3171619J045567N64064k542289M146147l819912Q39034q98202N24492J598719
$$ 13171619 14217186 14781250 12238961 16385108 12565196 13404230 12506028 13030520 14629239
1896A4629239p18301J716843l284007J639849j020568j260493L267588k692366
$$ 14629239 13910938 15627781 12343774 13983623 12963055 11702562 14970150 12277784
1888A2277784R24526q2478J52489j525751n81717Q65138J832367K38679m14361
$$ 12277784 13202310 13119832 13272321 11746570 11164853 12029991 13862358 14101037 13686676
1879A3686676k972052J638795o90554r16639K268428P8345n59735L82322q70331
$$ 13686676 10714624 12353419 11662865 10746226 13014654 13092999 12533264 12915586 12045255
1870A2045255K9332o72649K016210L90421j467609P34523m99509J693658p2315
$$ 12045255 12074587 11401938 13418148 13808569 12340960 13075483 12575974 14269632 14197317
1861A4197317P82511p84153j31772K580205l241370J995763K36368r33903Q87085
$$ 14197317 14979828 14195675 14063903 16644108 13402738 15398501 15634869 14700966 15588051
1852A5588051J390909N98683j527137J740994J0703j002068K256907k901579J456541
$$ 15588051 16978960 17577643 16050506 17791500 17802203 16800135 19057042 16155463 17612004
1843A7612004L30916K00944L401254j843468l23974K577196k340302J746418j144320
$$ 17612004 17942920 18143864 21545118 19701650 19377676 21954872 19614570 21360988 20216668
1834B0216668J624970K743997j489406J440273k156534L180420n56346L25147
$$ 20216668 21841638 24585635 23096229 24536502 22379968 25560388 25004042 25329189
1826B5329189k310645L114154P37926n04255J663043K209908J114208j976996
$$ 25329189 23018544 26132698 26870624 26366369 28029412 30239320 31353528 29376532
1818B9376532L256702J321296k35209K051672L76488L614288J859200J534420
$$ 29376532 32633234 33954530 33719321 35770993 36147481 39761769 41620969 43155389
1810D3155389K656636J497575L487945r57604N038899j517123M288995R25456
$$ 43155389 45812025 47309600 50797545 49839941 54878840 53361717 57650712 58576168
1802E8576168K019948J407500K302792O29404K018812j21024J215108J176936
$$ 58576168 60596116 62003616 64306408 64935812 66954624 66833600 68048708 69225644
1794F9225644K528551L544232P18393K024408K973671M508304J877480M461016
$$ 69225644 71754195 75298427 76016820 78041228 81014899 85523203 87400683 91861699
1786I1861699M999400N472183M085088N670336P878071P509504J1333487J2420640
$$ 91861699 96861099 102333282 106418370 112088706 119966777 127476281 138809768 151230408
1778A51230408J1086656J3039455J3714367M327935j726703o867631r326017j1489663
$$ 151230408 162317064 175356519 189070886 193398821 191672118 184804487 175478470 163988807
1770A63988807j5721615k1371823k0078591j6135016j7067959p184003j0090200
$$ 163988807 148267192 126895369 106816778 90681762 73613803 66429800 56339600
1763E6339600q111640n051539o630115n544665o67188q58368l070325j501678
$$ 56339600 48227960 43176421 36546306 31001641 30334453 29476085 26405760 24904082
1755B4904082k157322K491446l31212k505077j717611j348492o63208k13240L03294
$$ 24904082 22746760 25238206 24906994 22401917 20684306 19335814 18672606 18459366 18762660
1746A8762660j217394j765860p30783J564979j013725N71524M04476k359721L13440
$$ 18762660 17545266 15779406 15048623 16613602 15599877 16171401 16575877 14216156 14529596
1737A4529596O5079r05701K367592j539194k622229m13884J407495r30022M26725
$$ 14529596 14594675 13688974 16056566 14517372 11895143 11481259 12888754 11958732 12385457
1728A2385457k216647Q70345K00971r91319J063509p13844l665j45434r41283
$$ 12385457 10168810 11039155 11240126 10248807 11312316 10598472 10594807 10449373 9508090
1719I508090K1945j114233p44152K152152M81070m31937r9895k062261J402309
$$ 9508090 9530035 8415802 7671650 9823802 10304872 9872935 9773040 7710779 9113088
1710I113088Q94686l40342O82206k305313O0313j26794p42671M69702K9619j008435
$$ 9113088 10007774 9667432 10349638 8044325 8104638 7977844 7235173 7704875 7734494 6726059
1700F726059O83473o7351J386542j685446q95873Q33001q40684J805627j211774
$$ 6726059 7409532 7342181 8728723 7043277 6147404 6980405 6139721 7945348 6733574
1691F733574k56464J374639j245056o48619K330146k079102k034266Q29729L514755
$$ 6733574 6477110 7851749 6606693 5958074 8288220 6209118 4174852 5004581 8519336
1682H519336m188003K245516r4089K79291O46528k698247K423106j68170l97794
$$ 8519336 4331333 6576849 6482760 6762051 7408579 4710332 7133438 6965268 6567474
1673F567474O57623l458343L544155j384056J543605j299496j403765L814524
$$ 6567474 7225097 3766754 7310909 5926853 7470458 6170962 4767197 8581721
1665H581721l775215j116381L403590O72070j077589J349256l146513L298206
$$ 8581721 4806506 3690125 7093715 7765785 6688196 8037452 4890939 8189145
1657H189145k304285O97127K337921l123046J768942o90522J284227o74931J787039
$$ 8189145 5884860 6581987 8919908 5796862 7565804 6875282 8159509 7484578 9271617
1648I271617L99657p28641k69887M07042R61304J161440m85905k43563N67798
$$ 9271617 9671274 8942633 8672746 9079788 10041092 11202532 10716627 10473064 11040862
1639A1040862R77535j236579J740836j259627P78474J514178j789933J681286
$$ 11040862 12018397 10781818 12522654 11263027 12041501 13555679 11765746 13447032
1631A3447032m86689O39465j259790J373035R31728M755527n83504K880550O80442
$$ 13447032 12960343 13599808 12340018 13713053 14644781 19400308 18816804 21697354 22377796
1622B2377796q44913r09815r26280j41622j888962P01794k02688k861195j765324
$$ 22377796 21532883 20623068 19696788 19555166 17666204 18367998 18165310 15304115 13538791
1613A3538791K623079J14208j687378q44529K441034k23108o55891j181421l84144
$$ 13538791 16161870 16276078 14588700 13744171 16185205 15962097 15306206 14124785 13740641
1604A3740641K51277M54876o28928n56672K568059j985810Q55050l78730P06017
$$ 13740641 13991918 14446794 13817866 13261194 15829253 13843443 14698493 14319763 15025780
1595A5025780p56201J587885j922593j928825P85342K615397K100669J634416
$$ 15025780 14269579 15857464 13934871 12006046 12791388 15406785 17507454 19141870
1587A9141870K91854K099114O38884J5076J88490j571166J700296o96502r80386
$$ 19141870 19433724 21532838 22171722 22186798 22375288 20804122 22504418 21807916 20827530
1578B0827530k482152l558818K10628k552897J841268M49373j921276J330611
$$ 20827530 18345378 14786560 14997188 12444291 14285559 14734932 12813656 14144267
1570A4144267j517558o53242j123392n58651K033990j911279K010500r97129n02439
$$ 14144267 12626709 11973467 10850075 10291424 12325414 10414135 12424635 11427506 10925067
1561A0925067J376987M47267J874836n77687J302256K20762Q09205J079444R78341
$$ 10925067 12302054 12749321 14624157 14046470 15348726 15569488 16378693 17458137 18436478
1552A8436478k080574l396902j225043J173421M78539j892704Q58105k650880
$$ 18436478 16355904 12959002 11733959 12907380 13385919 11493215 12351320 9700440
1544I700440n30857J049266j119843j884047O15207l168091K773377p58568j536192
$$ 9700440 9169583 10218849 9099006 7214959 7830166 4662075 7435452 6676884 5140692
1535E140692J357235O35727M84927j418921o90398K252620j749385K32630J303767
$$ 5140692 6497927 7133654 7618581 6199660 5509262 7761882 6012497 6245127 7548894
1526G548894L22100k422345J15370m28315l27285n47334K062928j344091J359665
$$ 7548894 7870994 5448649 5564019 5135704 4808419 4261085 6324013 4979922 6339587
1517F339587j4620N20835B854475L011432J680662k772065m7799O92938j226770
$$ 6339587 6324967 6845802 2854475 5865907 7546569 4774504 4726705 5419643 4192873
1508D192873K469655j719251J391658n16812P86462j160777j43829L581820k249866
$$ 4192873 6662528 4943277 6334935 5818123 6604585 5443808 5299979 8881799 6631933
1499F631933j918791K252627n03407K18977j518111L950331l934639L472656l73754
$$ 6631933 4713142 6965769 6462362 6681339 5163228 9113559 5178920 8651576 8277822
1490H277822k674521K257540k683349J893247j231014J207643k86764j585440
$$ 8277822 5603301 7860841 5177492 7070739 5839725 7047368 6760604 5175164
1482E175164L325850k449292j837757K270053r91430K188633N79529k742822K572802
$$ 5175164 8501014 6051722 4213965 6484018 5492588 7681221 8260750 5517928 8090730
1473H090730q17750q34800R25849M46230j411997J83396L43822J239368N04815
$$ 8090730 7272980 6438180 7364029 7810259 6398262 6581658 6925480 8164848 8669663
1464H669663j052552l34838K818561k199802r13016J085043k48840q30493n39587
$$ 8669663 7617111 7282273 10100834 7901032 6988016 8073059 7824219 6993726 6454139
1455F454139n91254l15782J649126j393875J96574B900081O25552o65171M88832
$$ 6454139 5862885 5547103 7196229 5802354 5998928 2900081 3525633 2860462 3349294
1446C349294j342720O87636M21356J54947A462385Q22365K09589r31535o50683
$$ 3349294 2006574 2694210 3115566 3270513 1462385 2284750 2494339 1562804 912121
1437I12121L45075j31156O99230Q33623L96454j126136m22964J29431B65491J881424
$$ 912121 1257196 1126040 1825270 2658893 3055347 1929211 1506247 1635678 265491 2146915
1427B146915m70918P10018p1474r46444J172217K65557A097197R45872o19037
$$ 2146915 1675997 2386015 2314541 1368097 2540314 2805871 1097197 2043069 1424032
1418A424032N55676L089904B197742L0333J54466G81339Q1856K254431J97249
$$ 1424032 1979708 5069612 2197742 2228075 2382541 781339 863195 3117626 3314875
1409C314875A326837A10472a84886B038250p17018k15714M76700R37410A39887
$$ 3314875 1326837 110472 -184886 2038250 1321232 1105518 1582218 2519628 139887
1399a399010A635125E42800M46101M62665J121579C98136J458758E21041M82106
$$ -1399010 1635125 542800 988901 1451566 2573145 398136 1856894 521041 1003147
1390A003147d64762B248580o11523o82059d56110A549986L76288m4253f0353b3890
$$ 1003147 -464762 2248580 1637057 954998 -456110 1549986 1926274 1882021 -60353 -23890
1379B171265h7979A749342a107267E00816J947960o84833k5580N43228G06201
$$ 2171265 -87979 1749342 -1107267 500816 2448776 1763943 1738363 2281591 706201
1369E65635B28975E5533a559761B175128k90238k13025J56312P0766A18080J085448
$$ 565635 228975 55533 -1559761 2175128 1884890 1671865 1828177 1898943 118080 1203528
1359A203528k70936J21298J253825k81358J586182F7531a425675A575336K28316
$$ 1203528 932592 1053890 2307715 2026357 3612539 67531 -1425675 1575336 1803652
1350A803652m38151N86935j96439o29051M5408J051662l73171K36987Q70970j312363
$$ 1803652 1365501 1952436 1755997 1126946 1172354 2224016 1850845 2087832 2958802 1646439
1340A646439J88859P94138b63028C847733K52750A153556J249887j142322K95498
$$ 1646439 1835298 2629436 -263028 3847733 4100483 1153556 2403443 1261121 1556619
1331A556619m68358N46046J655990A145067J509412K46176F48910K029470I62395
$$ 1556619 1088261 1634307 3290297 1145067 2654479 2900655 648910 2678380 962395
1321A249724L778789A269468J36084a123772B050670O99748A252376j02489J105134
$$ 1249724 5028513 1269468 1405552 -1123772 2050670 2750418 1252376 1149887 2255021
1312B255021C26881K098935m88572p71987f3702B687410R93596j808526K86445
$$ 2255021 326881 2425816 1937244 1165257 -63702 2687410 3681006 1872480 2158925
1303B158925J42851A134110Q19898a013682A591190K037136A609189A62437i45453
$$ 2158925 2301776 1134110 1954008 -1013682 1591190 3628326 1609189 162437 -945453
1293B600568E00550P91498J791583j513035p33254K268049r8122D99770J826856
$$ 2600568 500550 1292048 3083631 1570596 837342 3105391 3007269 499770 2326626
1284B326626A124870J499596p36155H55483J289563A98368K691778C73913O30453
$$ 2326626 1124870 2624466 1888311 855483 2145046 198368 2890146 373913 1004366
1275A004366B01482J266477L79366E27003J195111L49261k57305b338B088616
$$ 1004366 201482 1467959 1847325 527003 1722114 2071375 1814070 -2338 2088616
1265B575865H12677l3258b94475B554198A26568J523728O49521J206795F70282
$$ 2575865 812677 779419 -294475 2554198 126568 1650296 2299817 3506612 670282
1255C426313A161808B2977K268526J53233N38384j345321O09361j83939e02137
$$ 3426313 1161808 22977 2291503 2444736 2983120 1637799 2247160 2063221 -502137
1245b20769A330948J278511J42520m28417m14820p99658J723118E63831J279499
$$ -220769 1330948 2609459 2751979 2323562 1908742 1109084 2832202 563831 1843330
1236A843330a091223I52756R19983c0986G61033a7862D83748K22986K83770N28506
$$ 1843330 -1091223 952756 1872739 -30986 761033 -17862 483748 706734 990504 1519010
1226A519010F05472M50593b130504A375216D95149N76619N51647E01591P71231
$$ 1519010 605472 1056065 -2130504 1375216 495149 1071768 1623415 501591 1272822
1217A272822J45854J42325R2672A87234J997087I07659P46664n2115N75044m00044
$$ 1272822 1418676 1561001 1653673 187234 2184321 907659 1654323 1602208 2177252 1777208
1207A777208m61982c82055e0691A76303P21687c00967F31659J294736L14109j65589
$$ 1777208 1315226 -382055 -50691 176303 897990 -300967 631659 1926395 2240504 2074915
1197B074915M98087H80044M50263O1193K82573K06623M71004M58694A285985k76326
$$ 2074915 2573002 880044 1330307 1391500 1674073 1880696 2351700 2810394 1285985 1009659
1187A009659K349496j103060M82656J361863q64966O43325H41803L691002j776771
$$ 1009659 3359155 2256095 2738751 4100614 3235648 3878973 841803 4532805 2756034
1178B756034O31213k80401J206957j327709Q65861M18434L14765K64159m85702
$$ 2756034 3387247 3106846 4313803 2986094 3851955 4270389 4585154 4849313 4363611
1169D363611K437677p41688j195640J57088K307084j11887p48883L055226j080039
$$ 4363611 6801288 6059600 4863960 5021048 7328132 7216245 6467362 9522588 8442549
1160H442549R75826Q47294J894988M239933j693591k57372Q83498m85684L139067
$$ 8442549 9418375 10265669 12160657 16400590 14706999 14449627 15333125 14847441 17986508
1151A7986508j906703L499077J605094k15224M478208O70959O622408L614434
$$ 17986508 16079805 19578882 21183976 20968752 25446960 26117919 32740327 36354761
1143C6354761Q852615K2056732N8586045O3166253N2615854j16017851F0313504
$$ 36354761 45207376 67264108 125850153 189016406 241632260 125614409 60313504
1135D0125977r960939r020102n545804l208698l702684k826110K188820j791025
$$ 40125977 30165038 21144936 15599132 12390434 8687750 5861640 8050460 6259435
1127F259435J954606k377147m87465j15473J308787K108692P75190j375739l878524
$$ 6259435 8214041 5836894 5349429 5233956 6542743 8651435 9426625 8050886 4172362
1118D172362J165128j301327j818949O74366K086318q16646m26748r49446M87613
$$ 4172362 5337490 4036163 2217214 2891580 4977898 4161252 3734504 2785058 3272671
1109C272671m6297j119919O61141d6065C465098L18684A549799J763944A55095
$$ 3272671 3226374 2106455 2767596 -46065 3465098 3783782 1549799 3313743 155095
1099A453367R9185J818527G09399j16441J840250j149436k89960L42809J517751
$$ 1453367 1552552 3371079 709399 592958 2433208 1283772 993812 1336621 2854372
1090B854372r98317G21115J425158F52383R37786J354588j046053H87663P94303
$$ 2854372 1856055 721115 2146273 652383 1590169 2944757 1898704 887663 1681966
1081A681966o02189n15193J904571j108280A39750f99298A594119n06528b10768
$$ 1681966 1079777 564584 2469155 1360875 139750 -699298 1594119 1087591 -210768
1071B095325F52080J300954J80563B75841J178278m35579b50132A707547f60242
$$ 2095325 652080 1953034 2133597 275841 1454119 1018540 -250132 1707547 -660242
1061A705794p79328N27291p9668m33431a57172E39194N60995J404787q76070M60313
$$ 1705794 926466 1453757 1374089 940658 -157172 539194 1100189 2504976 1628906 2089219
1051B089219c91756I56649d2054m92553a27700I55563e27201b29757C1521N1679
$$ 2089219 -391756 956649 -42054 -534607 -127700 955563 -527201 -229757 31521 83200
1041H3200K304657j009312M53192a573321B444489j072551a185004d42395j47482
$$ 83200 2387857 1378545 1831737 -1573321 2444489 1371938 -1185004 -442395 -589877
1032e89877A029904e37289F73198Q02587E76451R66840D25539j11251J591410
$$ -589877 1029904 -537289 673198 1475785 576451 1543291 425539 314288 1905698
1023A905698F43558L74898m8629P57100b80121B026089a52550C021592b116512
$$ 1905698 643558 1018456 969827 1726927 -280121 2026089 -152550 3021592 -2116512
1013A614235a008016a88424B133752G16605J617491d87120a40466C26785J73423
$$ 1614235 -1008016 -188424 2133752 716605 2334096 -487120 -140466 326785 500208
1004E00208O26066R63830F46048f20951i8137j071000n81466G81742J73642K122550
$$ 500208 1126274 2090104 646048 -620951 -98137 -1169137 -1750603 781742 955384 3077934
994C077934b75733A568906G40038Q09257g10855A155478l89747b92060n22026
$$ 3077934 -275733 1568906 740038 1549295 -710855 1155478 765731 -292060 -814086
985h14086B002221q36345A80978L123961g2723j266970C326426A74905K050202
$$ -814086 2002221 1165876 180978 3304939 -72723 -1339693 3326426 174905 2225107
976B225107p49101J278424H59426O79021j54699D29851c07778F12239j86304J289810
$$ 2225107 1476006 2754430 859426 1538447 1383748 429851 -307778 612239 425935 1715745
966A715745C30557K076137i186C278341F63370P47658R0636a822299i02922I41532
$$ 1715745 330557 2406694 -9186 3278341 663370 1411028 1501664 -1822299 -902922 941532
955B191639m07289f27288l45404a85107p98443A463709e68195k66786B698481
$$ 2191639 1784350 -627288 -972692 -185107 -983550 1463709 -568195 -834981 2698481
945A487776F15261a413870A060627M83401H2665J19371N29152o9725K5421R74872
$$ 1487776 615261 -1413870 1060627 1544028 82665 202036 731188 661463 686884 1661756
935A661756K19081O36599a401776F54501B6970a08139k156677c17244A062010
$$ 1661756 1880837 2517436 -1401776 654501 26970 -108139 -2264816 -317244 1062010
925B463775a005565A766694F35990N6013J71620J442387F63563k67928a279764
$$ 2463775 -1005565 1766694 635990 692003 863623 2306010 663563 395635 -1279764
915h56118l66800f9548B713975e29956D90396K26722M40085f03742j083925D04605
$$ -856118 -1222918 -69548 2713975 -529956 490396 717118 1157203 -603742 -1687667 404605
904d43054m0646r24231G20142a207874A434486C36070K4605l2139L9311J398036
$$ -443054 -483700 -1407931 720142 -1207874 1434486 336070 360675 328536 367847 1765883
894A765883h25902K59484H90686M42372F0006a81282n60255D66052J26996b86685
$$ 1765883 -825902 -566418 890686 1333058 60006 -181282 -741537 466052 593048 -286685
883B476855I54335d80915k9201A436659o12253Q76854F06208B45533A8155R89202
$$ 2476855 954335 -480915 -510116 1436659 824406 1701260 606208 245533 18155 1007357
873A007357J752981H46838A47796J143196Q8086A61506b86749A503836R11213
$$ 1007357 2760338 846838 147796 1290992 1379078 161506 -286749 1503836 2415049
864B415049j150145J25524m45847M41072K064503H11344M91990P04497G69709
$$ 2415049 1264904 1390428 944581 1385653 3450156 811344 1303334 2007831 769709
854E89808a73095F82675J274508d16695A553467R32279j050419e48817A603914
$$ 589808 -173095 682675 1957183 -416695 1553467 2485746 1435327 -548817 1603914
844e25151B139668D66707q4609K181611F09213R62047R54768p18532p02672M64791
$$ -525151 2139668 466707 382098 2563709 609213 1571260 2526028 1807496 1104824 1569615
834A569615Q8871K523268j918141q32262L127377j548412G36923J368439K614297
$$ 1569615 1658486 4181754 2263613 1431351 4558728 3010316 736923 2105362 4719659
825D719659j910757a21935A105743C81579a288519A68209J257360a192527A899019
$$ 4719659 2808902 -121935 1105743 381579 -1288519 168209 1425569 -1192527 1899019
815F3916b46290A416357n24286N74834I0049d45454B248083b82072F29354c19820
$$ 63916 -246290 1416357 892071 1466905 90049 -445454 2248083 -282072 629354 -319820
804a597668A175451p5667a178144E13756J047490g8199m57727A29113K40936L26645
$$ -1597668 1175451 1099784 -1178144 513756 1561246 -78199 -535926 129113 370049 696694
794F96694M10912n37105c41834o82059D23102g03554h9537E91616k32931j41230
$$ 696694 1107606 570501 -341834 -1023893 423102 -703554 -89537 591616 358685 217455
784B17455J598386I07635b92273A465491a284758N60096A544942n61034a653088
$$ 217455 1815841 907635 -292273 1465491 -1284758 -724662 1544942 983908 -1653088
774A854222a010144F00732a460109O09846l85603d05629m42720B01433K212660
$$ 1854222 -1010144 600732 -1460109 -850263 -1235866 -405629 -848349 201433 2414093
765B414093a80162p9981A648450q22441d42366G70563d23741B208218b63342p8626
$$ 2414093 -180162 -260143 1648450 826009 -442366 770563 -423741 2208218 -263342 -341968
755c41968j086894G52381i2477l07366E35388a554833B253483h71554J89124j175935
$$ -341968 -1428862 752381 -92477 -399843 535388 -1554833 2253483 -871554 -682430 -1858365
745a858365e7260j120460E17971B7678g66757c11443D03399a68645j6118N390
$$ -1858365 -57260 -1177720 517971 27678 -766757 -311443 403399 -168645 -184763 -179373
735a79373A500935i54558B44026c73394r30726D40520N60716h41603b09875B36590
$$ -179373 1500935 -954558 244026 -373394 -1304120 440520 1001236 -841603 -209875 236590
724h27481C19401a053896K55315C38733d29069k50105a81860C05996a471984a21807
$$ -827481 319401 -1053896 -798581 338733 -429069 -679174 -181860 305996 -1471984 -121807
713I96473Q22767a683122b06424j381672A431486e34461l6110A273731a378024
$$ 996473 1819240 -1683122 -206424 -1588096 1431486 -534461 -570571 1273731 -1378024
703E3196L77726a201513B11916c56604a57152m91389A199593E14352f84106e0610
$$ 53196 430922 -1201513 211916 -356604 -157152 -648541 1199593 514352 -684106 -50610
692B93822h63660K71708A978278k28463i01878j95580d56582p22046C34616M88068
$$ 293822 -863660 -591952 1978278 1749815 -901878 -1097458 -456582 -1178628 334616 822684
682H22684a258557A77286b09976e7772H87556h20385e0382B73038O12909H3665
$$ 822684 -1258557 177286 -209976 -57772 887556 -820385 -50382 273038 885947 83665
671C3022K05571c52030P9436A153294D38752f81602o74565N67019A28433R98311
$$ 33022 238593 -352030 -272594 1153294 438752 -681602 -1356167 -789148 128433 1126744
661A126744D28703Q403a118585a84011B161345e26390J29023p07285B605047F50948
$$ 1126744 428703 437106 -1118585 -184011 2161345 -526390 -397367 -1104652 2605047 650948
650a581275g09183a29600A525704l40868B71261Q26332B70446a09246o81896m34136
$$ -1581275 -709183 -129600 1525704 1184836 271261 1097593 270446 -109246 -791142 -1225278
640a225278d24145k395013a265092F1159g48949j74023l6540A391892h66931K64321
$$ -1225278 -424145 -2819158 -1265092 61159 -748949 -922972 -959512 1391892 -866931 -602610
630f02610k94578A019736k26490h75374B651819I71960m29608a33605E95564C1692
$$ -602610 -897188 1019736 793246 -875374 2651819 971960 542352 -133605 595564 31692
619I97218b136000b40600p4553j110111A176950h78923b10589D40216m5529a84322
$$ 997218 -2136000 -240600 -315153 -1425264 1176950 -878923 -210589 440216 394687 -184322
608e9049m18598A49465L71436f74519j62976a9401A90977g4829I56377a553542
$$ -59049 -477647 149465 520901 -674519 -837495 -19401 190977 -74829 956377 -1553542
597I02695e71776F32418a140766a95676A227423M6645k43209e33601r87453D36621
$$ 902695 -571776 632418 -1140766 -195676 1227423 1274068 1030859 -533601 -1521054 436621
586A877037l57033J15303a240374D82240J192197c07950B512265F95064a26579
$$ 1877037 1520004 1635307 -1240374 482240 1674437 -307950 2512265 695064 -126579
576B724106g74973A026225a819226h52175C74850O30594f00285A492193d14391
$$ 2724106 -774973 1026225 -1819226 -852175 374850 1005444 -600285 1492193 -414391
566c94941q4094E16125h4585C80859L08590M77195A06306K84943j0640c37945
$$ -394941 -479035 516125 -84585 380859 689449 1166644 106306 391249 380609 -337945
555I92951K76920J267345F98658d42747G10993A40368a540280P51404B0864a008604
$$ 992951 1269871 2537216 698658 -442747 710993 140368 -1540280 -788876 20864 -1008604
544a193558A323450a4745G89665d46441o61708B56281a47718A130348j38376D76429
$$ -1193558 1323450 -14745 789665 -446441 -1108149 256281 -147718 1130348 991972 476429
533G94785h43404c85825J91407B296203d10340B743745G88011Q05632J750552
$$ 794785 -843404 -385825 -194418 2296203 -410340 2743745 788011 1593643 3344195
524C344195d4782D48995J259901B31974J576464F24787Q838K260947R07129p89053
$$ 3344195 -44782 448995 1708896 231974 1808438 624787 633625 2894572 3801701 3012648
514C012648J916976G45156d86124A81608Q08938j06399m37962A94038a33510j294466
$$ 3012648 4929624 745156 -486124 181608 990546 884147 446185 194038 -133510 -1427976
504a427976A169070A85527a83689r14239A04514P33096P1447c96392p15312a21369
$$ -1427976 1169070 185527 -183689 -1097928 104514 837610 909057 -396392 -1111704 -121369
493a199243G33131M22598n59557K90864J13588C87556L92495b36469A587822N46505
$$ -1199243 733131 1155729 596172 887036 1000624 387556 780051 -236469 1587822 2134327
483B134327h03276E50483M05802k25203I0898L18293R22550l26239d40265k494943
$$ 2134327 -803276 550483 956285 731082 90898 409191 1331741 1005502 -440265 -2935208
473b935208A463386N42037a603429P49088g4880j68802k398527C24043N24823
$$ -2935208 1463386 2005423 -1603429 -854341 -74880 -243682 -2642209 324043 848866
464H48866b36628F01233f02557j34031g9542k871077F00869i5940A00880N79445
$$ 848866 -236628 601233 -602557 -736588 -79542 -2950619 600869 -95940 100880 680325
454F80325f09141j529788A85166a566279B312718A028943l80748b7649I98766
$$ 680325 -609141 -2138929 185166 -1566279 2312718 1028943 648195 -27649 998766
444a262473j6241d97310C48132b74764E67541J833751D25227K90859a002892F92246
$$ -1262473 -1278714 -497310 348132 -274764 567541 2401292 425227 716086 -1002892 692246
433e42019G3067d61474a59688q78509G49853J008103b25465j57744G68599c60612
$$ -542019 73067 -461474 -159688 -1038197 749853 1757956 -225465 -383209 768599 -360612
422e60787q44430A252780a473601K60730e28813A50147a069232A345854r5240
$$ -560787 -1405217 1252780 -1473601 -1212871 -528813 150147 -1069232 1345854 1250614
413A250614m46520b34757r9172k056631J143080J30651n56156b41323H66124P80722
$$ 1250614 804094 -234757 -333929 -2390560 -1247480 -1116829 -1672985 -241323 866124 1646846
403A646846b442906O78912N2511e25277C80399a65441k124391L93161A162358
$$ 1646846 -2442906 -1763994 -1711483 -525277 380399 -165441 -2289832 -1896671 1162358
393f42388C13576a4281j084071A21118f87572A982354h50066L70230A91542c07369
$$ -642388 313576 -14281 -1098352 121118 -687572 1982354 -850066 -479836 191542 -307369
382C98312c03978n29754B018343A17070g05366o42874b66857o7987H8672J05754
$$ 398312 -303978 -833732 2018343 117070 -705366 -1348240 -266857 -334844 88672 194426
372A94426O1908a024764H34480a77031A421885e50881H77759l95603b299725a2110
$$ 194426 256334 -1024764 834480 -177031 1421885 -550881 877759 482156 -2299725 -12110
361a318733A712985a111064J26257c64584A069590a186099A496774A42878g07896
$$ -1318733 1712985 -1111064 -984807 -364584 1069590 -1186099 1496774 142878 -707896
351B55719i39552a40561F44096K01101a357143N28390B087324c97376o68210b18457
$$ 255719 -939552 -140561 644096 845197 -1357143 -828753 2087324 -397376 -1065586 -218457
340A575964c4064o09667k167430f2357l46214a77305C34323E7247L06546K04120
$$ 1575964 -34064 -643731 -2811161 -62357 -408571 -177305 334323 57247 363793 567913
330E67913J73271i97370A796007a962326g33238B330299a500450G24246c67580
$$ 567913 741184 -997370 1796007 -1962326 -733238 2330299 -1500450 724246 -367580
320D75908O54872c29575D20714J264011a048158a69667k13589B163707a692966
$$ 475908 1130780 -329575 420714 1684725 -1048158 -169667 -383256 2163707 -1692966
310a394434p36669c23047E24378a053165d32203m62541B71264c45011H3508P4440
$$ -1394434 -2131103 -323047 524378 -1053165 -432203 -894744 271264 -345011 83508 157948
300A57948d44900F56326a465773A349447i23352a63773r88152n09666P17651A07544
$$ 157948 -444900 656326 -1465773 1349447 -923352 -163773 -1151925 -1661591 -943940 107544
289H51335h8793k337842c53370j755233e44910A181425d90744C40624a199545
$$ 851335 -88793 -2426635 -353370 -2108603 -544910 1181425 -490744 340624 -1199545
279g88379F7708g68702G69818a552223g71885r73351E79872r3517J565m3856J29012
$$ -788379 67708 -768702 769818 -1552223 -771885 -1745236 579872 486355 487920 444064 573076
268E73076c27985q33226j931739a133514G7910a150607G88993B69407k421i1824
$$ 573076 -327985 -1161211 -3092950 -1133514 77910 -1150607 788993 269407 266986 -91824
257a443308e84374B11104P55144a120275F72182g1745H52285a029613K94850F12518
$$ -1443308 -584374 211104 966248 -1120275 672182 -71745 852285 -1029613 -734763 612518
246a473445l65124g2634H75192K85004d44821f8278j308713a71919j675528a59650
$$ -1473445 -1838569 -72634 875192 1160196 -444821 -68278 -1376991 -171919 -1847447 -159650
235F06626e48159J10786p61392B8826a156731D84993K17448g93737B51415O05117
$$ 606626 -548159 -437373 -1198765 28826 -1156731 484993 702441 -793737 251415 856532
225H56532a48714G05840M16648n25268c80960A666892a154686o67070R03919j215654
$$ 856532 -148714 705840 1122488 597220 -380960 1666892 -1154686 -1821756 -917837 -2133491
215b133491M7950A833034G15686a500846C87288c62667k073937A322472e87161
$$ -2133491 -2085541 1833034 715686 -1500846 387288 -362667 -2436604 1322472 -587161
205B23626j07819a4633r80234k71262c25398k49317j84084D67446a266648c74965
$$ 223626 115807 -14633 -994867 -1266129 -325398 -574715 -758799 467446 -1266648 -374965
194i88340l36974b28867q57069d68136F23727J510834F47457J014313d65829I46643
$$ -988340 -1325314 -228867 -1085936 -468136 623727 2134561 647457 1661770 -465829 946643
183B0365c66321k253109m81802a32551C25613c7867m19121A421603N7352K01512
$$ 20365 -366321 -2619430 -3101232 -132551 325613 -37867 -456988 1421603 1478955 1680467
173A680467a743686f30831m52611o12051C46004A47915a83398j023418j1124L35545
$$ 1680467 -1743686 -630831 -1083442 -1695493 346004 147915 -183398 -1206816 -1217940 -882395
163h82395F49802m5596O3701A32794a333863q56976A418897b360721C27251d01586
$$ -882395 649802 604206 667907 132794 -1333863 -2190839 1418897 -2360721 327251 -401586
152F11569B29068a051944a373o80873A473574m85792R06399A76659F9852J640240
$$ 611569 229068 -1051944 -1373 -682246 1473574 987782 1894181 176659 69852 1710092
142A710092A66023K83112F1455N29685N87043a780487K7771A503551a66930k77547
$$ 1710092 166023 449135 61455 591140 1178183 -1780487 -1752716 1503551 -166930 -444477
132d44477A341374l87438F4669b948983F19252d31294j42664B42095L42452e50944
$$ -444477 1341374 953936 64669 -2948983 619252 -431294 -573958 242095 584547 -550944
121F23702d63133J51369a48301A340156J699392C72056a168175b08293L8929j753082
$$ 623702 -463133 -311764 -148301 1340156 3039548 372056 -1168175 -208293 -169364 -1922446
111a922446C430R65596c92692C88116O86403M82336h08562b15656A15936f02620
$$ -1922446 3430 969026 -392692 388116 1074519 1556855 -808562 -215656 115936 -602620
100a534365A58938O23946a266793H91029e32326J79789G90494B34731b063978
$$ -1534365 158938 782884 -1266793 891029 -532326 -352537 790494 234731 -2063978
90c293250b99848F86339f62646A66070M52074d0491H16792K49638l66507o0575
$$ -3293250 -299848 686339 -662646 166070 618144 -40491 816792 1066430 699923 639348
80F39348a46554E31861J11714L71692B12154f68012a65165O6188B98357M16532
$$ 639348 -146554 531861 643575 1015267 212154 -668012 -165165 -98977 298357 714889
70G14889i62285G45899a126891C74870f56232P1836j349514B77156g30385G22129
$$ 714889 -962285 745899 -1126891 374870 -656232 -584396 -1933910 277156 -730385 722129
59f31924j143301a88674j920205R40458b97533a16118H51198R1947d27071B634508
$$ -631924 -1775225 -188674 -2108879 -1168421 -297533 -116118 851198 943145 -427071 2634508
48a148775A532210a711154A26592K29046a264683c54502A660907B23244J967665
$$ -1148775 1532210 -1711154 126592 355638 -1264683 -354502 1660907 223244 2190909
39B190909E4900a364440A24769a26897j726558D47634c43123H17011J8105b76008
$$ 2190909 54900 -1364440 124769 -126897 -1853455 447634 -343123 817011 835116 -276008
28g49225m03651H48372f55002j502460h66592k09967b48049n12358F76538N6002
$$ -749225 -1152876 848372 -655002 -2157462 -866592 -1076559 -248049 -760407 676538 732540
18G32540c404D08236i76201q39342g90771p54645A92378a868257A347771j89642
$$ 732540 -3404 408236 -976201 -1815543 -790771 -1545416 192378 -1868257 1347771 1158129
8A158129C60809J30265L92788B55812P41789k35783f62956A186421
$$ 1158129 360809 491074 883862 255812 997601 761818 -662956 1186421
##END=
