
##TITLE=AC1000_Robusta_6278510_QFwXLwHOOp
##JCAMPDX= 6.0         $$ Bruker NMR JCAMP-DX V2.0
##DATA TYPE= NMR SPECTRUM
##DATA CLASS= NTUPLES
##ORIGIN= BRUKER
##OWNER= Administrator
$$ 1.72 TOPSPIN		Version 2.1
$$ 2012-06-03 14:09:20.890 -0500  Administrator@TOPSPIN
$$ Compression mode = diff/dup
##.OBSERVE FREQUENCY= 400.13188235
##.OBSERVE NUCLEUS= ^1H
##.ACQUISITION MODE= SIMULTANEOUS (DQD)
##.ACQUISITION SCHEME= undefined
##.AVERAGES= 8
##.DIGITISER RES= 22
##SPECTROMETER/DATA SYSTEM= spect
##.PULSE SEQUENCE= zg30
##.SOLVENT NAME= COFFEE_meoh
##.SHIFT REFERENCE= INTERNAL, COFFEE_meoh, 1, 14.98061
##AUDIT TRAIL= $$ (NUMBER, WHEN, WHO, WHERE, PROCESS, VERSION, WHAT)
$$ ##TITLE= Audit trail, TOPSPIN		Version 2.1
$$ ##JCAMPDX= 5.01
$$ ##ORIGIN= Bruker BioSpin GmbH
$$ ##OWNER= Administrator
$$ $$ C:\Bruker\TOPSPIN/data/COFFEE/nmr/AC1000_Robusta_6278510_QFwXLwHOOp/10/pdata/1/auditp.txt
$$ ##AUDIT TRAIL=  $$ (NUMBER, WHEN, WHO, WHERE, PROCESS, VERSION, WHAT)
(   1,<2012-06-03 14:09:13.578 -0500>,<Administrator>,<TOPSPIN>,<go>,<TOPSPIN 2.1>,
      <created by zg
	started at 2012-06-03 14:08:07.156 -0500,
	POWCHK enabled, PULCHK disabled,
       configuration hash MD5:
       D5 CA 7A 23 FE 6B EE E2 50 67 74 61 24 F7 5E 3B
       data hash MD5: 64K
       4A 21 40 40 F1 34 F5 7C A1 D3 A8 95 A1 10 A0 42>)
(   2,<2012-06-03 14:09:16.625 -0500>,<Administrator>,<TOPSPIN>,<proc1d>,<TOPSPIN 2.1>,
      <Start of raw data processing
       efp LB = 0 FT_mod = 6 PKNL = 1 PHC0 = 0 PHC1 = 0 SI = 32K 
       data hash MD5: 32K
       B3 F6 91 9A A3 B1 86 B5 FC B2 CA 3F 76 81 81 F0>)
(   3,<2012-06-03 14:09:16.968 -0500>,<Administrator>,<TOPSPIN>,<proc1d>,<TOPSPIN 2.1>,
      <pk PHC0 = 210.7672 PHC1 = 0 
       data hash MD5: 32K
       4D 5B 53 FC 64 70 8B 6E 63 7C 19 CC 9B 22 B2 11>)
(   4,<2012-06-03 14:09:17.031 -0500>,<Administrator>,<TOPSPIN>,<proc1d>,<TOPSPIN 2.1>,
      <abs ABSG = 1 
       data hash MD5: 32K
       FD 2A F3 ED FC F4 5A 4A 97 96 49 78 0D CF F8 99>)
(   5,<2012-06-03 14:09:17.062 -0500>,<Administrator>,<TOPSPIN>,<proc1d>,<TOPSPIN 2.1>,
      <abs ABSG = 2 
       data hash MD5: 32K
       FC C8 FC B9 7F 26 47 17 E9 CB 2D A7 4B B4 64 84>)
(   6,<2012-06-03 14:09:17.093 -0500>,<Administrator>,<TOPSPIN>,<proc1d>,<TOPSPIN 2.1>,
      <abs ABSG = 3 
       data hash MD5: 32K
       2E 14 98 73 62 AD B3 90 64 CD A3 A3 1B E8 76 1A>)
(   7,<2012-06-03 14:09:17.125 -0500>,<Administrator>,<TOPSPIN>,<proc1d>,<TOPSPIN 2.1>,
      <abs ABSG = 4 
       data hash MD5: 32K
       D1 EA DB E2 74 A6 D2 88 B5 CA 9F 38 2F C2 CB F8>)
(   8,<2012-06-03 14:09:17.140 -0500>,<Administrator>,<TOPSPIN>,<proc1d>,<TOPSPIN 2.1>,
      <abs ABSG = 5 
       data hash MD5: 32K
       AC 4B 81 E7 1B 6A 88 4E 17 B7 92 2C 69 72 A8 FC>)
$$ ##END=
$$ 
$$ $$ hash MD5
$$ $$ 96 8C 6A 86 32 48 89 9D 61 D5 F5 51 6B 9D F0 AA
##$RELAX= 
##$RELAX= 
##$RELAX= 
##$RELAX= 
##$RELAX= 
##$RELAX= 
##$RELAX= 
$$ Bruker specific parameters
$$ --------------------------
$$ [...]
##$TP= (0..7)
150 150 150 150 150 150 150 150
##$TP07= 0
##$TPNAME0= <>
##$TPNAME1= <>
##$TPNAME2= <>
##$TPNAME3= <>
##$TPNAME4= <>
##$TPNAME5= <>
##$TPNAME6= <>
##$TPNAME7= <>
##$TPOAL= (0..7)
0.5 0.5 0.5 0.5 0.5 0.5 0.5 0.5
##$TPOFFS= (0..7)
0 0 0 0 0 0 0 0
##$TUNHIN= 0
##$TUNHOUT= 0
##$TUNXOUT= 0
##$USERA1= <user>
##$USERA2= <user>
##$USERA3= <user>
##$USERA4= <user>
##$USERA5= <user>
##$V9= 5
##$VALIST= <valist>
##$VCLIST= <CCCCCCCCCCCCCCC>
##$VD= 0
##$VDLIST= <DDDDDDDDDDDDDDD>
##$VPLIST= <PPPPPPPPPPPPPPP>
##$VTLIST= <TTTTTTTTTTTTTTT>
##$WBST= 2048
##$WBSW= 25
##$XGAIN= (0..3)
0 0 0 0
##$XL= 0
##$YL= 0
##$YMAX_a= 538585
##$YMIN_a= -652769
##$ZGOPTNS= <>
##$ZL1= 120
##$ZL2= 120
##$ZL3= 120
##$ZL4= 120
##$ABSF1= 14.98061
##$ABSF2= -5.57192
##$ABSG= 5
##$ABSL= 3
##$ALPHA= 0
##$AQORDER= 0
##$ASSFAC= 0
##$ASSFACI= 0
##$ASSFACX= 0
##$ASSWID= 0
##$AUNMP= <proc_prof1d_extract_pilot.lims>
##$AXLEFT= 0
##$AXNAME= <>
##$AXNUC= <1H>
##$AXRIGHT= 0
##$AXTYPE= 0
##$AXUNIT= <>
##$AZFE= 0.1
##$AZFW= 0.1
##$BCFW= 0
##$BC_mod= 0
##$BYTORDP= 0
##$COROFFS= 0
##$CY= 15
##$DATMOD= 1
##$DC= 0
##$DFILT= <>
##$DTYPP= 0
##$F1P= 0
##$F2P= 0
##$FCOR= 0.5
##$FTSIZE= 32768
##$FT_mod= 6
##$GAMMA= 0
##$GB= 0
##$INTBC= 1
##$INTSCL= 1
##$ISEN= 128
##$LB= 0
##$LEV0= 0
##$LPBIN= 0
##$MAXI= 10000
##$MC2= 0
##$MEAN= 0
##$ME_mod= 0
##$MI= 0
##$NCOEF= 0
##$NC_proc= -8
##$NLEV= 6
##$NOISF1= 0
##$NOISF2= 0
##$NSP= 0
##$NTH_PI= 0
##$NZP= 0
##$OFFSET= 14.98061
##$PC= 1
##$PHC0= 210.7672
##$PHC1= 0
##$PH_mod= 1
##$PKNL= yes
##$PPARMOD= 0
##$PPDIAG= 0
##$PPIPTYP= 0
##$PPMPNUM= 2147483647
##$PPRESOL= 1
##$PSCAL= 4
##$PSIGN= 0
##$PYNMP= <proc.py>
##$REVERSE= no
##$SF= 400.13
##$SI= 32768
##$SIGF1= 0
##$SIGF2= 0
##$SINO= 400
##$SIOLD= 32768
##$SPECTYP= <>
##$SREGLST= <1H.CDCl3>
##$SSB= 0
##$STSI= 32768
##$STSR= 0
##$SW_p= 8223.68421052632
##$SYMM= 0
##$S_DEV= 0
##$TDeff= 65536
##$TDoff= 0
##$TI= <>
##$TILT= no
##$TM1= 0
##$TM2= 0
##$TOPLEV= 0
##$USERP1= <user>
##$USERP2= <user>
##$USERP3= <user>
##$USERP4= <user>
##$USERP5= <user>
##$WDW= 1
##$XDIM= 32768
##$YMAX_p= 460710270
##$YMIN_p= -875744
##$CURPLOT= <Network HP LaserJet P1505>
##$CURPRIN= <$Network HP LaserJet P1505>
##$DFORMAT= <normdp>
##$LAYOUT= <+/1D_H.xwp>
##$LFORMAT= <normlp>
##$PFORMAT= <normpl>
##$SURQMSG= 1
$$ End of Bruker specific parameters
$$ ---------------------------------
##NTUPLES= NMR SPECTRUM
##VAR_NAME=  FREQUENCY,     SPECTRUM/REAL,   SPECTRUM/IMAG
##SYMBOL=    X,             R,               I
##VAR_TYPE=  INDEPENDENT,   DEPENDENT,       DEPENDENT
##VAR_FORM=  AFFN,          ASDF,            ASDF
##VAR_DIM=   32768,         32768,           32768
##UNITS=     HZ,            ARBITRARY UNITS, ARBITRARY UNITS
##FACTOR=    0.250966925370066, 1,           1
##FIRST=     8223.43324360095, 141990,       -198157
##LAST=      0,             -136453,         53449
##MIN=       0,             -875744,         0
##MAX=       8223.43324360095, 460710270,    0
$$ Real data points
##PAGE= N=1
##DATA TABLE= (X++(R..R)), XYDATA
$$ [...]
$$ plain form
19540 -329530 5081 61894 -37364 -418718 205383 -60360 -30670 -44857 112304 -11037 -119986
19529 -119986 -298251 -118341 -114544 198862 10758 208694 -106108 233619 -223227 -167240
19519 -167240 -97222 329751 80878 64173 213511 -72031 -280659 -164964 23364 79112 -11221
19507 -154289 -264058 28918 12821 -21044 -38762 238025 -35763 264812 -56611 65270 -2354
19495 -89424 -23529 38450 -128850 71126 -129158 -132170 236547 199629 -48359 98438 -71068
19483 -111114 38167 82010 -238866 -59128 -8221 -185987 -158915 -144906 -245219 46227 -55817
19471 45785 -261227 392588 -222508 84511 -177237 90606 -379340 -304430 -313613 -31357 -104809
19460 -104809 274094 86346 -239650 -8408 39956 38366 -257658 116694 -86765 89807 -251590
$$ packed form
19540c29530E081N6813c7364l81354B05383f0360K9690j4187A12304a1037j08949
19529a19986j78265a18341L797A98862A0758J97936a06108B33619b23227N5987
19519a67240P0018C29751H0878j6705J49338g2031k08628J15695B3364N5748a1221
19507a54289j09769B8918A2821b1044j7718B38025c5763B64812e6611F5270b354
19495h9424b3529C8450a28850G1126a29158l012B36547l6918d8359I8438g1068
19483a11114C8167M3843b38866e9128h221j77766K7072J4009j00313D6227e5817
19471D5785b61227C92588b22508H4511a77237I0606c79340P4910r183c1357p3452
19460a04809B74094H6346b39650h408C9956j590b57658A16694h6765H9807b51590
$$ plain form
19448 144481 -59675 71944 12190 -146214 -55369 89318 152850 52448 -66281 -16722 119479
19436 101836 -277366 -49949 183374 -215809 -144802 -306636 180100 61491 -239953 -204178
19426 -204178 -279096 -170897 -466817 -35127 72865 -11022 -95987 -435574 -81998 -204203 -241536
19415 -241536 -194802 -366379 -212771 -193472 -26595 81021 -193805 142353 -38452 38720 -242457
19403 -35671 -95803 -364168 -43104 75236 254930 37688 10645 73648 -80297 93367 70306
19392 70306 208713 -91677 105105 -180279 183601 244284 -90886 -83108 -164785 -27847 -19990
19381 -19990 -149174 -320228 -476320 65286 -8895 -296093 4849 131859 183797 20925 -36850
19369 -49796 -96643 -241532 119059 -12947 -229752 28772 99563 -97653 -155541 -383688 -63563
$$ packed form
19448A44481e9675G1944A2190a46214e5369H9318O3532E2448f6281a6722A19479
19436A01836b77366d9949A83374b15809P1007j61834A80100F1491b39953L5775
19426b04178p4918J08199k95920c5127G2865a1022q4965l39587h1998j22205l7333
19415b41536M6734j71577J53608J9299b6595H1021a93805A42353c8452C8720b42457
19403c5671o0132k68365d3104G5236J79694C7688A0645O3003h0297I3367k3061
19392G0306J38407i1677A05105a80279A83601O0683i0886P778q1677b7847P857
19381a9990j29184j71054j56092F5286h895k87198D849J27010N1938B0925c6850
19369d9796m6847j44889A19059a2947k16805B8772P0791i7653n7888k28147f3563
$$ plain form
19357 2886 220059 116281 -6202 233872 -154104 1944 -228946 -348501 224889 40773 -52019
19345 4183 -350832 -375801 -138125 125114 -292374 -29197 82492 -490975 82234 122676 -208814
19333 -286982 -64998 -299807 -380739 -50559 -11360 247334 168349 -209324 21449 -297017 -77568
19321 165425 -89303 -6808 133359 -98581 -116457 194284 -19638 -37532 182827 -68844 -451409
19310 -451409 157642 -311356 93203 159049 -239497 119353 -217810 124181 -291054 149177
19299 -358846 -282837 79759 -231518 -201827 148531 -268908 -62548 -241606 -248119 159987 -185392
19287 201933 67794 -385906 80410 -323581 -18183 98528 144509 -273993 -82241 -124763 111237
19275 -73899 78237 130211 -209481 -283418 305023 -4600 122252 156146 -620 103020 1462 -231219
$$ packed form
19357B886K17173j03778f202B33872a54104A944b28946j19555B24889D0773e2019
19345D183c50832k4969a38125A25114b92374b9197H2492d90975H2234M0442b08814
19333b86982f4998k34809q0932e0559a1360B47334p8985b09324B1449b97017g7568
19321A65425h9303f808A33359i8581j7876A94284a9638j7894A82827f8844l82565
19310d51409A57642c11356I3203O5846b39497A19353b17810A24181b91054A49177
19299c58846P6009G9759b31518K9691A48531b68908f2548j79058o513A59987a85392
19287B01933F7794c85906H0410c23581a8183I8528M5981b73993h2241m2522A11237
19275g3899G8237N1974b09481p3937C05023d600A22252L3894f20A03020A462b31219
$$ plain form
19262 -575731 -311830 88240 -374869 22130 165884 -115407 -281109 -96993 -192484 -281930
19252 -281930 -11768 -39873 -41292 -62523 159838 32866 138742 146761 -126217 -46020 30470
19240 -183406 -485142 115431 187270 -245605 182394 100274 252090 59591 -78108 -237951
19230 -237951 95 -172984 -19355 44809 -231835 -179651 -255717 -982 -203606 161807 -16138 25730
19217 -173618 -40372 -214319 70836 -314344 -209705 93165 -19885 -108364 -131117 -90407 -286968
19206 -286968 50359 -203531 94830 -70422 120841 294441 -153409 135787 122514 136558
19196 136558 164353 -153445 43998 -217098 -174725 130905 162331 14751 56538 -54252 79042
19184 299522 -152196 19635 -13421 -289134 -4555 -452053 -95821 -151121 207964 21471 192864
$$ packed form
19262e75731K63901H8240c74869B2130J43754a15407j65702i6993r5491q9446
19252b81930a1768k8105j419k1231A59838C2866J05876Q019a26217d6020C0470
19240a83406l01736A15431P1839b45605A82394q2120J51816E9591g8108j59843
19230b37951I5a72984a9355D4809b31835N2184p6066i82k02624A61807a6138B5730
19217a73618d0372j73947G0836c14344J04639I3165a9885q8479k2753M0710j96561
19206b86968E0359b03531I4830g0422A20841J73600a53409A35787j3273J4044
19196A36558K7795a53445D3998b17098M2373A30905L1426A4751M1787e4252G9042
19184B99522a52196A9635a3421k75713d555m47498i5821n5300B07964B1471J71393
$$ plain form
19173 192864 -310937 143194 380577 62676 -453215 338227 -114321 14805 -79406 -10757
19162 27255 11970 -385927 44086 -185150 -171611 -59582 84101 -59310 -427246 -123584 -118325
19151 -118325 257595 -236913 -49303 -141805 -47891 -129101 -137458 -76193 102659 242683 20450
19139 -158002 28232 212667 179543 -14997 49 -160343 -275233 133321 -309975 -70504 -49044
19128 -49044 -126083 -79715 -88443 -70366 181511 -34462 187699 -70611 -84766 -9347 -26895 86010
19115 139008 -134168 -131668 3155 -83482 14686 -104452 97876 174300 -144596 -315027 79564
19103 -444130 -286297 -182377 -545803 98973 300407 -3711 -334841 66634 370410 10279
19092 1353 115287 -8256 112510 -258335 -316610 89850 -166 -244234 89251 -531224 -215480
$$ packed form
19173A92864c10937A43194K37383F2676d53215C38227a14321A4805g9406a0757
19162B7255A1970c85927D4086a85150J3539e9582H4101e9310l67936a23584N259
19151a18325B57595b36913d9303r2502d7891q1210q357O1265A02659J40024B0450
19139a58002B8232J84435l3124a4997D9a60343j14890A33321c09975g0504K1460
19128d9044p7039M6368q728J8077A81511c4462A87699g0611j4155i347j7548H6010
19115A39008a34168K500C155h3482A4686a04452I7876P6424a44596j70431G9564
19103d44130J57833J03920l63426I8973K01434c711l31130F6634L03776A0279
19092A353J13934h256A12510b58335n8275H9850a66k44068H9251e31224b15480
$$ plain form
19080 19088 -10303 13840 24780 202383 42938 6022 15153 -111292 -125674 148731 -3819 -51072
19068 -51072 -221483 -40979 -188453 -136063 -170623 -180554 -418238 -87109 -12923 -179486 -49712
19056 -175325 2924 -161925 -78912 -386393 13505 -174280 17578 16069 254947 -213741 97738
19044 96749 435698 23115 389023 -15118 12713 -154849 -423185 -105026 -200574 81900 -100123
19032 -102003 -82866 -406031 72961 -310977 -81479 -134220 -49616 -212129 -177838 -267626 10518
19020 -109902 148766 -287103 -279217 -74522 -98828 -197750 -231042 -151398 71346 215418 44949
19008 -68049 119170 214176 -232066 166337 10271 360051 124039 161822 -100772 -214749
18998 -214749 -114205 139453 -59930 103529 -95511 96985 -67609 19789 -63911 395133 171688
$$ packed form
19080A9088a0303A3840J0940J77603D2938F022R131a11292j4382A48731c819m7253
19068e1072j70411d0979j47474N2390l4560r931k37684h7109a2923j66563d9712
19056a75325B924a61925g8912l07481A3505a74280A7578j509K38878b13741I7738
19044I6749L38949B3115L65908a5118A2713a54849k68336a05026r5548H1900a00123
19032a02003J9137l23165G2961c10977h1479n2741d9616j62513L4291q9788A0518
19020a09902A48766b87103P886g4522k4306r8922l3292P9644G1346J44072D4949
19008f8049A19170R5006b32066A66337A0271L49780A24039L7783a00772j13977
18998b14749J00544A39453e9930A03529i5511I6985f7609A9789f3911C95133A71688
$$ plain form
18986 -431002 -210222 -71497 -161625 -135403 123223 -53300 -43494 -86888 -176137 8424 145764
18975 145764 313389 -59469 183134 144690 74511 19525 63838 33424 -31207 -212950 502583
18963 -17786 -185743 -169877 31803 58759 -75993 -46700 -369276 -153102 131310 -240054 -121532
18952 -121532 -170875 64542 -20671 -34096 258655 -153016 -50741 -107791 -56946 -77352 -29970
18940 138691 -9473 -87768 -100600 135941 -117168 336555 58086 -94949 -264817 412691 123495
18928 24609 -324444 -45962 248452 65036 1818 -273992 250381 163482 -161505 -8535 -176698
18917 -176698 122375 28617 -113622 9495 259233 -45457 -128029 -287302 -329464 -381163 -35993
18905 -2805 178826 14346 -110670 -157301 185049 -179047 -207575 -291871 -177936 -133913 289559
$$ packed form
18986d31002b10222g1497r0128K6222A23223e3300R806m3394q9249H424J37340
18975A45764J67625e9469A83134l8444p0179A9525M4313l0414c1207j81743E02583
18963a7786j67957J5866C1803K6956g5993K9293l22576a53102A31310b40054J18522
18952a21532m9343F4542b0671j3425B58655a53016e0741n7050N0845k0406b9970
18940A38691i473p8295j2832A35941a17168C36555E8086i4949j69868D12691A23495
18928B4609c24444d5962B48452F5036A818b73992B50381q6899a61505h535j68163
18917a76698A22375B8617a13622I495K49738d5457q2572j59273m2162n1699c5993
18905b805A78826A4346a10670m6631A85049a79047k8528q4296J13935M4023B89559
$$ plain form
18893 161592 -148570 37397 -81929 106436 208961 -184683 -208105 61915 -408217 189562
18882 28984 105821 -224957 -114124 -303554 37909 102788 -121682 93204 -159816 -111250 -89123
18871 -89123 -185210 -115275 177177 -106290 12164 -160440 126945 -52938 -285467 -50558 -116998
18860 -116998 -37559 -353228 -312178 -55645 20554 -29113 29228 -291533 -23930 -43597 -116854
18849 -116854 -215769 -177206 -335733 -160253 256499 -245555 -61607 -18000 172554 -255095
18838 7748 18756 157774 -308586 -34090 -145850 -154812 -196555 -66995 42235 138065 158736
18827 158736 -442389 -188318 216635 -346860 9080 -211446 60282 15000 146668 -74538
18816 90101 -216121 -81987 59140 -109656 -277071 -325806 -130521 112813 -33364 102243
$$ packed form
18893A61592a48570C7397h1929A06436J02525a84683k3422F1915d08217A89562
18882B8984P6837b24957J10833j89430C7909O4879a21682I3204a59816M8566K2127
18871h9123r6087O9935A77177a06290A2164a60440A26945e2938k32529e0558o6440
18860a16998c7559l15669M1050e5645B0554b9113B9228b91533b3930j9667p3257
18849a16854r8915L8563j58527a60253B56499b45555f1607a8000A72554b55095
18838G748J1008J39018c08586c4090j11760q962m1743f6995D2235R5830K0671
18827A58736d42389a88318B16635c46860I080b11446F0282A5000J31668g4538
18816I0101b16121h1987E9140a09656j67415m8735a30521A12813c3364A02243
$$ plain form
18805 96088 49973 165037 236711 -217055 11599 -166417 62383 -248040 65219 90165 -86306
18793 -76523 166330 80052 71602 99321 -21594 -50066 -130870 251653 -51083 -135423 -351944
18782 -351944 54783 -47866 206313 57116 39552 -89313 -171969 -3248 37247 -10411 397527
18770 -164324 112266 190982 -231121 -233594 -308101 56097 -132682 -111158 -444528 125816 208422
18759 208422 96172 -180647 99176 -368402 -23342 -69579 -210449 -142950 -61545 -79849 134601
18747 -153114 -54383 139858 -26072 -251766 -53993 205965 -29979 -142518 -87490 155793
18736 -43497 -85410 -141332 -68045 -198642 -333431 -91821 44937 -232087 46160 -187599 -93414
18724 1306 -246877 -210528 214596 -149516 39089 -2164 -216639 -73045 -224103 87513 -91112
$$ packed form
18805I6088m6115J15064P1674b17055A1599a66417F2383b48040F5219K4946h6306
18793g6523A66330H0052q450K7719b1594k8472q0804B51653e1083q4340k16521
18782c51944E4783d7866B06313E7116j7564h9313q2656c248C7247a0411C97527
18770a64324A12266P8716b31121k473p4507E6097a32682K1524l33370A25816Q2606
18759B08422I6172a80647I9176c68402b3342m6237j40870O7499f1545j8304A34601
18747a53114e4383A39858b6072k25694e3993B05965b9979j12539N5028A55793
18736d3497m1913n5922f8045j30597j34789i1821D4937b32087D6160a87599i3414
18724A306b46877L6349B14596a49516C9089b164k14475g3045j51058H7513i1112
$$ plain form
18712 -83936 -186168 -329786 272826 -97769 -72203 -92730 10969 -164779 -230826 101187 -167444
18700 34808 -62113 -201509 -52349 -60660 -27916 -285756 225479 74803 -180564 93034 -86877
18688 -42908 -344753 -101175 -188253 -138887 68190 -202546 -176708 -193663 188602 170936 -115129
18676 -271653 -150190 -337492 -24918 -316952 182168 -159384 522263 22329 -195910 -21915
18665 223159 -145277 3968 111717 9235 -72284 98208 -296902 137021 27280 -7165 -308365
18654 -308365 -469957 -130288 -173732 -129940 -73982 -33894 -84648 -394600 -165339 162913
18643 229073 -276474 -33850 135491 12512 -50520 297249 -139975 61295 -298130 228359
18632 -266106 -249031 -293051 24336 193345 -19150 172451 -25936 147133 58961 71860 -76919
$$ packed form
18712h3936j02232j43618B72826i7769K5566k0527A0969a64779o6047A01187a67444
18700C4808f2113j39396e2349q311b7916k57840B25479G4803a80564I3034h6877
18688d2908l01845a01175q7078M9366F8190b02546K5838j6955A88602j7666a15129
18676b71653J21463j87302b4918k92034A82168a59384E22263B2329a95910b1915
18665B23159a45277C968J07749I235g2284I8208b96902A37021B7280g165l01200
18654c08365j61592a30288m3444M3792N5958c3894n0754l09952a65339A62913
18643B29073b76474c3850A35491A2512e0520B97249a39975F1295b98130B28359
18632b66106J7075m4020B4336J69009a9150A72451b5936A47133E8961J2899g6919
$$ plain form
18620 58662 -203560 -112568 -99313 -3284 -54436 489280 -127008 -135447 6663 -81640 -69442 -3625
18607 -46696 -114071 30783 48888 -95743 -180808 -113456 -34313 117576 -176260 -354164 12798
18595 -79584 -174413 -244383 73978 -11323 -301769 -181528 -82749 -122686 194372 119366 -85436
18583 57612 190105 145238 -77151 148978 -204599 69266 -186833 -326237 -181387 -107323
18573 -107323 -112081 38312 -75901 -181011 166983 91953 196417 -56353 -146115 15726 -262045
18561 -199630 -23082 -254156 -29526 80953 99297 -226313 -7637 -355635 138657 31211 63508
18550 63508 -203958 -203144 -80393 -56024 -108494 142035 -221896 -15346 -277120 -52429 172306
18538 -117156 43991 4409 -181829 7590 352648 -177403 78384 7145 148160 -7608 -89768
$$ packed form
18620E8662b03560R0992J3255c284n1152D89280a27008q439F663h1640J2198c625
18607d6696o7375C0783J8105i5743q5065O7352c4313A17576a76260j77904A2798
18595g9584r4829o9970G3978a1323k90446J20241h2749l9937A94372p5006h5436
18583E7612J32493m4867g7151A48978b04599F9266a86833j39404J44850P4064
18573a07323m758C8312g5901j05110A66983p5030J04464e6353q9762A5726b62045
18561a99630b3082k31074b9526H0953J8344b26313g637l47998A38657C1211L2297
18550F3508b03958Q14h0393K4369n2470A42035b21896a5346k61774e2429A72306
18538a17156D3991D409a81829G590L45058a77403G8384G145J41015g608q2160
$$ plain form
18527 -89768 -258984 183602 -123735 121233 135785 -34542 124487 -205262 -493117 -18860
18516 91247 -45944 -237445 -735 171937 197389 -116936 -232999 200764 -166605 72194 -177780
18504 84595 208025 -223864 104840 -61995 231711 -176259 25744 -177541 -279761 -450161
18494 -450161 38032 -26070 176577 -249701 -76672 108994 -121710 163425 -131394 30719
18483 5268 -127310 -81853 134833 -4578 -240282 -491234 22918 227902 -192038 54062 -138137
18471 -154063 146127 135962 -381204 -244551 157980 28935 -22046 83157 -401428 -272417
18461 -272417 6061 148709 -371690 -347881 -267128 165125 -138455 -223477 63152 -187130 -220404
18450 -220404 -413886 -25207 -171265 -30207 101499 40496 -136636 7606 -244461 -198487 271709
$$ packed form
18527h9768j69216A83602a23735A21233J4552c4542A24487b05262k87855a8860
18516I1247d5944j91501g35A71937K5452a16936j16063B00764a66605G2194a77780
18504H4595J23430b23864A04840f1995B31711a76259B5744a77541j02220j70400
18494d50161C8032b6070A76577b49701g6672A08994a21710A63425a31394C0719
18483E268a27310M5457A34833d578k35704k50952B2918K04984a92038E4062a38137
18471a54063A46127j0165c81204J36653A57980B8935b2046H3157d01428J29011
18461b72417F061J42648c71690K3809Q0753A65125a38455q5022F3152a87130l3274
18450b20404j93482b5207j46058c0207A01499D0496a36636G606b44461M5974B71709
$$ plain form
18438 -42547 3634 -51657 -170051 349700 -102161 -208557 -189677 -77154 -103804 268007 112603
18426 -262456 140659 -325401 -91242 -199025 -140157 48061 -422103 -103815 98618 -138346
18415 -183305 -21868 -60457 129714 -19257 -237137 -61061 28330 -142098 -2198 -299952 -2463
18403 -26501 -144052 75342 243852 72410 -51659 97588 -60152 -87587 42071 -207621 -361573
18392 -361573 20752 -287876 87662 -2660 -18091 121342 -100739 243233 71868 322090 137071
18380 174787 124424 51519 -68263 -162139 -29028 -118909 173610 -368155 -80244 23937 -235230
18368 -19129 -242595 68034 -206055 14015 95504 -368619 -104662 -369160 335726 28097
18357 -197470 -83351 20310 -134087 185298 -62790 91251 45244 93911 84954 -88454 -217541
$$ packed form
18438d2547C634e1657j18394C49700a02161j06396J8880g7154k6650B68007A12603
18426b62456A40659c25401i1242j07783N8868D8061d22103a03815I8618a38346
18415a83305b1868l8589A29714a9257k17880f1061B8330a42098b198k97754b463
18403b6501j17551G5342J68510G2410e1659I7588f0152k7435D2071b07621j53952
18392c61573B0752b87876H7662b660j5431A21342a00739B43233G1868K50222A37071
18380A74787n0363E1519f8263r3876b9028q9881A73610c68155h0244B3937b35230
18368a9129k23466F8034b06055A4015Q1489c68619a04662k64498C35726B8097
18357a97470h3351B0310a34087A85298f2790I1251D5244M8667q957h8454j29087
$$ plain form
18346 -217541 -18312 -157131 -51498 252222 -102683 -143659 -69213 -75060 -129493 -204220 -165877
18335 -165877 -122500 -190114 153054 81555 -134697 62017 -102323 91180 276626 -117134
18324 -19286 -252660 -61556 -55375 -262444 -183122 -367190 52852 -89512 208497 -248423 -102866
18312 -369953 -78420 105680 -166146 66130 -2997 -351675 93628 233165 -204423 15892 157121
18301 157121 -320325 -3306 -108638 -14859 125020 5496 166539 -35246 -68381 -14020 -3725
18289 -88492 50590 358636 54088 94052 -10141 158976 -171238 202810 171006 -250361 135828
18277 -236141 -171095 23878 -81101 -96772 -211930 336258 -50529 -163960 -112323 -43460 -122537
18266 -122537 -321205 -211979 -340491 -104380 -116291 -98084 31240 -130663 -144302 371131
$$ packed form
18346b17541a8312j38819e1498B52222a02683m0976f9213n847n4433p4727L8343
18335a65877M3377o7614A53054p1499a34697F2017a02323I1180J85446a17134
18324a9286k33374f1556O181k07069P9322j84068E2852h9512B08497b48423a02866
18312c69953g8420A05680a66146F6130b997l48678I3628J39537b04423A5892J41229
18301A57121c20325c306j05332a4859A25020E496J61043c5246l3135a4020c725
18289h8492E0590L08046E4088L9964a0141A58976a71238B02810l1804b50361A35828
18277b36141O5046B3878h1101j5671j15158C36258e0529j13431N1637d3460p9077
18266a22537j98668J09226j28512a04380j1911J8207C1240a30663j3639C71131
$$ plain form
18255 -96445 291376 67507 301399 161328 -20773 -444240 50874 220575 -167098 -117460
18245 -117460 -140465 1773 386332 -140163 161636 18327 -169641 -89452 215311 226730 -71231
18233 -159696 -90781 -279075 88026 -227818 -59192 163238 -140446 -119778 -348205 102923
18222 39595 16864 -109119 187524 -120501 -54822 118568 60600 445177 -99494 -348217
18212 -348217 -70498 -88134 -65873 -108037 -342178 -66934 -291243 -208233 -155326 198187 -80039
18200 195314 106369 168514 -279747 81874 -55150 -45159 -310033 -84518 180352 182627 247392
18189 247392 43147 -43686 162044 -25036 -240145 -59653 133548 -248691 -113988 42051
18178 92747 386782 237603 10236 61131 117072 16647 77929 -205295 -104541 141383 -170756
$$ packed form
18255i6445B91376F7507K33892j40071b0773m23467E0874J69701a67098M9638
18245a17460k3005A773L84559a40163A61636A8327a69641Q0189B15311J1419g1231
18233a59696O8915j88294H8026b27818e9192A63238a40446K0668k28427A02923
18222C9595A6864a09119A87524a20501e4822A18568n7968L84577i9494k48723
18212c48217g0498j7636K2261m2164k34141f6934k24309Q3010N2907A98187h0039
18200A95314q8945O2145b79747H1874e5150R991k64874h4518A80352K275O4765
18189B47392D3147d3686A62044b5036k15109e9653A33548b48691a13988D2051
18178I2747K94035j49179A0236N0895N5941A6647O1282b05295J00754A41383a70756
$$ plain form
18166 -136714 -150674 -126331 -228450 76343 303813 -213294 -56560 -246405 -142600 -163311
18156 -163311 -108884 33742 -77057 -34810 -91920 139634 -266216 208165 -179629 -63056 85177
18144 118363 223056 -60582 -294776 10859 -73353 -25327 27117 -242458 -102705 159260
18133 123082 240642 -154918 -321915 -80462 178983 48690 -113685 -105319 42753 26789 -49761
18121 -83707 -14795 183921 -256028 -217842 146356 3059 -779 40930 -13605 -16965 156136 -220627
18108 442 103441 -80035 242613 -53699 23198 42041 114760 72595 203853 11488 -6653 81870
18095 1456 -428112 27337 157135 49436 -187655 -132238 -183305 -174882 -209223 -55343 32212
18083 -99525 135218 -345929 130299 182108 264711 -211884 130192 -185867 147197 -67099
$$ packed form
18166a36714j3960K4343j02119G6343K27470b13294e6560j89845J03805k0711
18156a63311N4427C3742g7057c4810n7110A39634b66216B08165a79629f3056H5177
18144A18363J04693f0582k34194A0859g3353b5327B7117b42458a02705A59260
18133A23082J17560a54918j66997h0462A78983D8690a13685Q366D2753j5964d9761
18121h3707a4795A83921b56028L8186A46356C059g79D0930a3605l360A56136b20627
18108D42J02999h0035B42613e3699B3198J8843P2719m2165J31258A1488f653H1870
18095A456d28112B7337J29798D9436a87655N5417n1067Q423l4341e5343C2212
18083i9525A35218c45929A30299N1809Q2603b11884A30192a85867A47197f7099
$$ plain form
18072 71750 164578 -84559 273842 -159063 -190458 122416 -1999 142838 -226049 -164773 -64856
18060 38442 -4064 -182471 -24594 -57145 38047 23231 -193336 183444 -228280 -481575 136449
18048 -205285 -99760 -112096 -28406 -382239 -249771 84320 401685 -355222 -248892 -58088
18037 -155005 -155562 -252476 -207745 -171076 7743 -131543 -222668 -40352 -26994 -63951 -91674 -73127
18025 -73127 165015 207857 104212 -268434 102155 -52068 -157990 179848 -38707 -50409
18015 -50409 45455 -133235 56485 -186964 127164 73100 -113677 -201591 242025 -57806 57711
18003 -273167 -243627 -291919 142105 -411251 -68683 -145611 -279752 171770 -153152 -194579
17993 -194579 -117818 -264200 34775 233755 24757 60121 88240 -138284 207074 283647 -44662
$$ packed form
18072G1750R2828h4559B73842a59063l1395A22416a999A42838b26049O1276f4856
18060C8442d064j78407b4594l2551C8047j4816a93336A83444b28280k53295A36449
18048b05285i9760j2336b8406l53833J32468H4320L17365c55222J06330e8088
18037a55005n57r6914M4731L6669G743a31543r1125d0352J3358l6957k7723J8547
18025g3127A65015M2842j03645b68434A02155e2068j05922A79848c8707j1702
18015e0409D5455a33235E6485a86964A27164n4064a13677q7914B42025e7806E7711
18003b73167K9540m8292A42105d11251f8683p6928j34141A71770a53152m1427
17993a94579P6761j46382C4775J98980B4757L5364K8119a38284B07074P6573d4662
$$ plain form
17981 -153669 91203 -33008 -219871 346475 -533120 52978 -1738 167886 153215 104019 75240
17970 75240 80085 -1912 12708 199327 -391617 -229796 187653 -87573 -46398 -151733 -299370
17959 -299370 117157 -76588 -202818 28613 271307 -119409 183849 -157103 -172345 71386
17948 -90928 -11321 -93980 -193823 -172782 191745 56420 -93072 184258 -132039 -78859 -123277
17937 -123277 -255359 36886 172883 188649 -200124 95492 -125411 -42298 312604 -111228
17926 163488 -40852 -2770 -108610 1023 -352373 -193700 202281 -243630 -5989 -199101 57426
17914 63209 132481 -29456 99235 -338075 -54179 9834 35889 400040 -134745 90638 53088
17903 53088 -84431 160279 229687 -114076 -164201 104264 12348 -111359 -289411 -186664
$$ packed form
17981a53669I1203c3008j86863C46475e33120E2978a738A67886j4671m9196k8779
17970G5240M845a912A2708J86619c91617J61821A87653h7573M1175j05335j47637
17959b99370A17157g6588j26230B8613K42694a19409A83849a57103j5242G1386
17948i0928a1321q2659r9843K1041A91745E6420i3072A84258a32039N3180m4418
17937a23277j32082C6886J35997J5766b00124I5492a25411d2298C12604a11228
17926A63488d0852b770j05840A023c52373J58673B02281b43630e989j93112E7426
17914F3209O9272b9456I9235c38075e4179I834K6055L64151a34745I0638l7550
17903E3088h4431A60279O9408a14076n0125A04264A2348a11359j78052J02747
$$ plain form
17893 -186664 145155 -125971 8543 13778 -8773 63799 150240 -116549 -46109 -36132 95030 -36317
17880 20567 -13326 59693 -20386 115388 -227048 -106522 -87441 -261640 146763 -3081 121360
17868 -98453 64338 -206867 -45434 25068 95222 -62689 285984 257903 -100060 155449 29905
17856 -84187 9575 19971 -1058 146453 129552 -154786 238503 235220 43760 12655 74233 -102374
17843 143303 -323688 157769 -41237 -99722 49089 -214481 -100992 -137758 -17392 -43088 -251251
17832 -251251 96323 112636 -115867 3590 -16829 2611 -374310 -33999 130702 -480128 95334
17820 -272072 230336 -262 -90122 243128 -190093 -105689 -46600 4153 -29630 -169577 -202022
17809 -202022 92019 -112235 -159562 209831 76371 -148625 178147 121250 -254816 37928
$$ packed form
17893a86664A45155a25971H543N235h773F3799Q6441a16549d6109R977I5030c6317
17880B0567a3326E9693b0386A15388b27048a06522J9081j74199A46763c081A21360
17868i8453F4338b06867d5434B5068P0154f2689B85984k8081a00060A55449B9905
17856h4187I575J0396a058A46453j6901a54786B38503l283D3760A2655O1578a02374
17843A43303c23688A57769d1237n8485D9089b14481a00992l6766a7392k5696k08163
17832b51251I6323J6313a15867C590a6829B611c74310c3999A30702d80128I5334
17820b72072B30336b62q9860B43128a90093Q4404d6600D153b9630j39947l2445
17809b02022I2019a12235m7327B09831G6371a48625A78147n6897b54816C7928
$$ plain form
17798 335831 1322 -108671 -45016 -47735 249977 -411557 -118946 -77175 -196289 400081 -350644
17786 -379099 -148680 -223397 -43200 -277272 311725 -51794 37576 284658 -359299 -88194
17775 138535 24332 -82722 -168319 47292 81070 24042 29717 -78626 9183 -456354 -1768 -219164
17763 -219164 -115352 20952 -85490 -24281 -2122 84654 256874 -62870 11418 85631 29933
17751 -119348 -237844 -151711 -83302 -17315 -149057 150863 -88222 25328 397542 57961 106296
17740 106296 339262 30557 -418330 80462 295173 -17798 65642 94994 181864 206627 8943
17728 2308 74873 181961 -73520 -161247 -275298 125723 121019 -219341 63601 -9867 407344
17716 78894 203116 -7547 -432752 -12483 122757 70048 230555 19168 -456001 -40879 82564
$$ packed form
17798C35831A322a08671d5016k719B49977d11557a18946M1771j19114D00081c50644
17786c79099a48680p4717d3200k34072C11725e1794C7576K47082c59299h8194
17775A38535B4332h2722q5597D7292L3778B4042N675g8626I183d56354a768k17396
17763b19164J03812B0952h5490b4281b122H4654J72220f2870A1418P4213B9933
17751a19348j18496Q6133O8409a7315j31742A50863h8222B5328L72214E7961M8335
17740A06296K32966C0557d18330H0462K14711a7798F5642K9352Q6870K4763H943
17728B308P2565J07088g3520q7727j14051A25723m704b19341F3601i867D07344
17716G8894J24222g547m25205a2483A22757n2709J60507A9168d56001d0879H2564
$$ plain form
17704 280589 162672 -231382 141335 80415 90421 175602 -3368 70519 -139072 -166821 117808
17692 -78505 -165849 341069 6046 -114439 -388585 283637 -294034 -45556 -17173 -207230 -123032
17681 -123032 168230 38213 34288 -150818 -60292 334352 221727 -125383 97637 -103330
17670 -295179 -249432 275589 7928 -133144 263886 -39577 208809 132524 -86304 -691542 -81311
17658 18644 -301366 31496 82635 59562 53777 -107777 69244 -56095 120904 -49148 -140378
17647 -140378 -84924 -88390 -245541 349913 -95486 150494 9671 167295 -94367 197781 157440
17636 157440 -276093 -293753 214936 -86619 10007 124699 176761 -91297 178147 -48260 20773
17624 28145 136099 97255 -208843 18607 242458 -191655 113663 132800 184342 180159 15180
$$ packed form
17704B80589j17917b31382A41335o0920J0006Q5181c368G0519a39072k7749A17808
17692g8505q7344C41069F046a14439k74146B83637b94034d5556a7173j90057Q4198
17681a23032A68230C8213l925a50818f0292C34352j12625a25383I7637a03330
17670b95179M5747B75589G928a33144B63886c9577B08809p6285h6304o05238h1311
17658A8644c01366C1496N1139k3073n785a07777F9244e6095A20904d9148r1230
17647a40378N5454l466j57151C49913i5486A50494I671J57624i4367A97781m0341
17636A57440b76093j7660B14936h6619A0007J14692N2062i1297A78147d8260B0773
17624B8145J07954l8844b08843A8607K23851a91655A13663J9137N1542m183A5180
$$ plain form
17612 150895 -273708 -44296 223300 -207627 -19782 -29255 35513 -5350 179077 -250338 -104525
17600 291513 233332 -135443 -287499 257042 -196203 99422 336015 -30156 -244853 98464
17589 16604 56963 227221 -99588 129838 65569 92501 -5997 -112089 -104799 48777 187787
17578 187787 180458 -13326 -132764 -14518 49949 251417 -33824 107936 140493 67248 -71045
17566 326684 7392 247897 -220072 179922 74589 170652 -100220 243884 137679 52840
17555 -50074 199984 255002 -16315 -11481 75455 -213685 -199755 89528 -131592 121936 139214
17544 139214 -65875 -117452 301027 -308762 35108 -50790 -85311 354089 -234 -344182 200076
17532 100880 77151 29720 94925 -101806 168773 -167475 44270 -144262 265629 275916
$$ packed form
17612A50895b73708d4296B23300b07627a9782r473C5513e350A79077b50338a04525
17600B91513n8181a35443j52056B57042a96203I9422K36593c0156k14697I8464
17589A6604M0359J70258i9588A29838o4269K6932e997j06092P290D8777J39010
17578A87787p329a3326j19438a4518D9949K01468c3824A07936L2557F7248g1045
17566C26684G392K40505b20072A79922G4589R6063a00220B43884j06205E2840
17555e0074A99984N5018a6315M834G5455b13685J3930H9528a31592A21936J7278
17544A39214f5875n1577C01027c08762C5108e0790l4521C54089b34l43948B00076
17532A00880k3729B9720O5205a01806A68773a67475D4270a44262B65629J0287
$$ plain form
17522 275916 145343 158469 169033 52702 8290 156018 166339 56082 13176 98786 254019
17511 254019 -56408 173478 11922 26927 212263 207950 -173090 -282338 -63928 224762 -54702
17499 129821 41181 -103426 8945 -7249 212425 107978 -136050 233688 109581 -9609 165457
17487 270663 86488 118439 229173 239577 -21457 196225 -108228 56292 -34135 59411 349144
17476 349144 51526 153530 224494 52192 -54635 -35514 66748 -166607 -133468 366873 142016
17464 473120 56864 169208 364681 453423 504175 451468 286408 -218557 55739 340411
17454 340411 -27334 -134847 -64625 208249 132386 306698 130318 209289 -55101 358594
17443 -29017 300564 -28155 297661 325795 126065 277381 365480 378934 663673 360212
$$ packed form
17522B75916j30573J3126J0564E2702H290J47728J0321E6082A3176Q5610J55233
17511B54019e6408A73478A1922J5005J85336m313a73090j09248f3928B24762e4702
17499A29821D1181a03426H945g249B12425j04447a36050B33688A09581i609A65457
17487B70663H6488L1951J10734J0404b1457A96225a08228E6292c4135E9411K89733
17476C49144E1526J02004P0964E2192e4635J9121F6748a66607L3139C66873A42016
17464D73120E6864J12344J95473Q8742N0752n2707j65060b18557E5739K84672
17454C40411b7334j07513f4625B08249p5863J74312A30318P8971e5101C58594
17443b9017C00564b8155B97661K8134A26065J51316Q8099J3454K84739l03461
$$ plain form
17433 360212 669141 414292 305082 153001 304521 307731 256667 488032 513743 135303
17422 60678 185783 90787 66784 120010 93479 507519 -70794 196766 138894 228227 213678
17411 213678 348503 335790 508303 321917 200653 418757 203230 263777 79836 631169
17401 631169 581462 121256 604589 270627 -3707 163168 250289 -243625 212988 167838
17391 167838 -61161 -100276 114288 114763 -279056 182452 57528 24840 455218 -72159 50480
17379 58395 263735 95810 -352895 64186 51670 188223 309045 73066 240274 213005 107016
17368 107016 5404 241454 154485 132998 135848 360124 -213737 -15052 248650 78048 65235
17357 65235 231831 1616 207217 -55606 -2036 177731 166045 470609 -46031 105116 76424
$$ packed form
17433C60212L08929k54849j09210j52081J51520L210n1064K31365K5711A35303
17422F0678J25105I0787k4003N3226k6531M14040g0794A96766n7872Q9333j4549
17411B13678J34825j2713J72513j86386j21264K18104B03230O0547G9836N51333
17401F31169m9707A21256M83333B70627c707A63168Q7121b43625B12988m5150
17391A67838f1161l9115A14288M75b79056A82452E7528B4840M30378g2159E0480
17379E8395K05340I5810c52895F4186j2516J36553J20822G3066J67208k7269j05989
17368A07016E404K36050q6969k1487K850K24276b13737a5052B48650G8048j2813
17357F5235J66596A616K05601e5606b036A77731j1686L04564d6031A05116k8692
$$ plain form
17346 76424 158746 -57805 145475 224465 -33510 135532 451775 -137853 98361 257442 -248435
17334 104779 89755 171621 -147133 -42705 70332 401513 179434 317043 -70957 -14976 -134549
17323 -134549 -21465 86749 108875 2001 427497 321491 67137 -66828 241522 182292 139788
17312 139788 257011 306860 17803 91628 453448 -150872 345405 314381 -116471 299524
17301 184616 104994 -56200 282798 318660 159099 -122331 -25258 503249 10666 128212
17291 128212 148166 139757 191438 320171 301354 102516 265605 187629 -198095 195284 42019
17279 9318 -4478 504445 300867 -49203 525881 246328 210543 -101279 257123 -125782 -93671
17268 -93671 221194 50116 324590 -75830 31773 569512 102170 47159 -24480 362189 248697
$$ packed form
17346G6424Q2322e7805A45475P8990c3510A35532L16243a37853I8361J59081b48435
17334A04779j5024Q1866a47133d2705G0332L31181A79434J37609g0957a4976j19573
17323a34549b1465H6749K2126B001M25496j06006F7137f6828B41522n9230m2504
17312A39788J17223M9849A7803P3825L61820a50872C45405l1024a16471B99524
17301A84616p9622e6200B82798L5862A59099a22331b5258E03249A0666J17546
17291A28212J9954q409N1681J28733j8817A02516J63089p7976a98095A95284D2019
17279I318d478E04445k03578d9203E25881B46328l5785a01279B57123a25782L2111
17268i3671B21194E0116K74474g5830C1773N37739A02170D7159b4480C62189j13492
$$ plain form
17257 248697 232825 417786 208766 -36604 412911 277925 69891 91242 300061 -40680
17246 181310 56560 104621 -177002 428631 294872 261048 293984 344571 379653 -10217 235131
17234 181377 119089 244159 142051 136608 -21322 185118 98297 171875 352034 491139 78743
17222 243703 311116 269384 136544 229591 93652 240308 248877 118082 299091 24678 229206
17211 229206 384777 73942 106809 3528 335230 10901 322910 193006 34015 491482 430147
17200 430147 111293 54397 232822 -74245 244181 181258 51792 234110 138745 156367 306532
17189 306532 296197 -14929 307945 295483 383518 412822 685835 254158 135595 -192960
17178 438650 171374 174335 65240 -61000 140852 382415 100396 45764 257507 51145 153249
$$ packed form
17257B48697j5872J84961B08766c6604D12911j34986F9891K1351K08819d0680
17246A81310E6560M8061a77002D28631j33759l3824L2936N0587L5082a0217B35131
17234A81377o2288J25070j02108n443b1322A85118q6821P3578J80159J39105G8743
17222B43703O7413m1732j32840R3047I3652J46656Q569A18082J81009B4678K04528
17211B29206J55571G3942L2867C528L31702A0901L12009j29904C4015M57467o1335
17200D30147A11293E4397J78425g4245B44181o2923E1792J82318r5365J7622J50165
17189C06532j0335a4929C07945j2462Q8035K9304K73013B54158j18563a92960
17178D38650A71374K961F5240f1000A40852K41563A00396D5764K11743E1145J02104
$$ plain form
17167 153249 16387 355942 380332 236809 250634 207278 171438 -67665 336886 246633 248584
17156 248584 380226 189591 333064 174764 163159 483620 488927 415116 317720 272267 274178
17145 274178 287046 57284 497786 242497 250794 409739 283797 380583 197013 109042 35815
17133 61453 195353 398259 178909 237427 253633 439457 250450 331878 153699 315648
17123 315648 212867 485271 430578 341678 104488 343095 221525 585593 376594 258417
17113 258417 295227 35938 523726 708590 309242 470801 412783 244300 201998 87348
17102 333032 323282 357508 487257 593234 511640 356800 479458 299128 -86593 373723
17091 450487 418950 -85070 414419 664060 377074 509498 327545 161407 270138 92799
$$ packed form
17167A53249A6387L39555K4390j43523J3825m3356l5840f7665C36886r0253J951
17156B48584J31642A89591J43473j58300j1605L20461N307p3811r7396m5453J911
17145B74178J2868E7284M40502B42497Q297J58945j25942R6786j83570q7971C5815
17133F1453J33900K02906A78909N8518J6206J85824j89007Q1428A53699J61949
17123C15648j02781K72404n4693q8900A04488K38607j21570L64068k08999j18177
17113B58417L6810C5938M87788J84864C09242J61559n8018j68483m2302H7348
17102C33032r750L4226J29749J05977q1594j54840J22658j80330h6593C73723
17091D50487l1537h5070D14419K49641k86986J32424j81953A61407J08731I2799
$$ plain form
17080 533997 451674 507389 574133 707697 521472 638678 472701 274404 652334 531037
17070 531037 598891 592771 419948 242453 266104 619987 546173 443803 661328 279023
17059 541735 187566 418831 296779 602170 331173 397372 405260 339567 318416 552602
17049 552602 427425 452949 788465 812081 129701 430218 330979 293222 968130 484296
17039 484296 307540 221485 183989 392974 583840 438610 621071 506497 806956 792864
17029 792864 602045 191812 267266 337846 526837 692786 828782 429059 617944 375720
17019 375720 551920 600792 577328 499325 589094 792088 820178 423743 452429 701069 544897
17008 544897 617340 569493 340159 414950 607067 772962 735971 657333 560984 593967 384915
$$ packed form
17080E33997q2323N5715O6744J33564j86225J17206j65977j98297L77930j21297
17070E31037O7854o120j72823j77495K3651L53883p3814j02370K17525B79023
17059E41735A87566K31265j22052L05391k70997O6199P888o5693k1151K34186
17049E52602j25177K5524L35516K3616A29701L00517r9239l7757O74908m83834
17039D84296j76756q6055l7496K08985J90866j45230J82461j14574L00459j4092
17029G92864j90819A91812P5454P0580J88991J65949J35996l99723J88885k42224
17019C75720J76200M8872k3464p8003Q9769K02994K8090l96435K8686K48640j56172
17008E44897P2443m7847k29334P4791J92117J65895l6991p8638r6349L2983k09052
$$ plain form
16997 384915 510765 537297 1010181 872935 563245 608889 277528 759796 827399 946604
16987 946604 581687 911917 997997 873660 761142 968050 652837 913372 1076132 928569
16977 928569 832206 902900 766599 542593 876660 930303 705139 872591 960782 726771
16967 726771 678137 1284128 756083 929505 986909 1054525 728724 995291 1064602 1337294
16957 1337294 967218 902584 1105418 1155884 1311596 1139818 908868 1048314 977973 1059610
16947 1059610 904924 959106 1023592 1052311 966936 1015486 643082 1066210 1062914 1085317 1129066
16936 1129066 876508 1198658 1039354 1030691 1072650 1027184 1258066 1358403 1588195 1404209
16926 1404209 1274107 1063072 1030853 1448124 847493 1397514 1191011 1276842 1123763 1103406
$$ packed form
16997C84915J25850K6532M72884j37246l09690M5644B77528M82268O7603J19205
16987I46604l64917L30230Q6080j24337j12518K06908l15213K60535J62760j47563
16977I28569r6363P0694j36301k24006L34067N3643k25164J67452Q8191k34011
16967G26771m8634O05991n28045J73422N7404O7616l25801K66567O9311K72692
16957A337294l70076o4634K02834N0466J55712j71778k30950J39446p0341Q1637
16947A059610j54686N4182O4486K8719q5375M8550l72404M23128l296K2403M3749
16936A129066k52558L22150j59304q663M1959m5466K30882J00337K29792j83986
16926A404209j30102k11035l2219M17271o00631N50021k06503Q5831j53079k0357
$$ plain form
16916 1103406 1539117 1156413 905878 1606868 1255587 1589972 1429560 1546515 1235763
16907 1235763 1691774 1427240 1476520 1509326 1749633 1665849 1627339 1347377 1565949 1778523
16897 1778523 1485196 1811077 1718829 1707366 1378538 1761643 1445411 1681578 1629648 1814243
16887 1814243 1863160 1527512 1952156 2003737 1654894 2049394 1993512 1976951 1941444 1789822
16877 1789822 1917642 2147035 2008527 2030345 2011432 1902064 1839101 2068222 2502668 2459799
16867 2459799 2323465 2361770 2204518 2280139 2246814 2464375 2498418 2242921 2404619 2568451
16857 2568451 2318575 2692081 2420814 2635440 2854842 2734356 2697576 2869398 3006910 3217452
16847 3217452 3083031 3071027 3146964 2806871 2944537 3247450 3212085 3547283 3272064 3390594
$$ packed form
16916A103406M35711l82704k50535P00990l51281L34385j60412J16955l10752
16907A235763M56011k64534M9280L2806K40307q3784l8510k79962K18572K12574
16897A778523k93327L25881r2248j1463l28828L83105l16232K36167n1930J84595
16887A814243M8917l35648M24644N1581l48843L94500n5882j6561l5507j51622
16877A789822J27820K29393j38508K1818j8913j09368o2963K29121M34446m2869
16867B459799j36334L8305j57252P5621l3325K17561L4043k55497J61698J63832
16857B568451k49876L73506k71267K14626K19402j20486l6780J71822J37512K10542
16847C217452j34421j2004P5937l40093J37666L02913l5365L35198k75219J18530
$$ plain form
16837 3390594 3451559 3900142 3351633 3783777 3506469 3730331 3881941 3860942 4050198 4128581
16827 4128581 4179959 4386777 4159877 4153280 4107978 4385023 4723127 4686718 4685055 4704722 4862240
16816 4862240 5124917 4892864 4967631 5070743 5355145 5652290 5875910 5682828 5957236 6135171
16806 6135171 6018153 6038752 6205071 6324453 6401020 6323314 6754207 7261956 7174760 7447446
16796 7447446 7326795 7807245 7855121 7563550 7836598 8429957 8504832 8601331 8774453 9200465
16786 9200465 9575355 9888852 9612099 10183782 10351194 10517803 10761140 11122872 11576019
16777 11576019 11783910 12134540 12453077 13103901 13093850 13503181 14394737 14376471 14815494 15122612
16767 15122612 15683725 16195252 16705065 17403934 17973422 18637734 19398557 19987585 20480278
$$ packed form
16837C390594O0965M48583n48509M32144k77308K23862J51610k0999J89256P8383
16827D128581N1378K06818k26900o597m5302K77045L38104l6409j663J9667J57518
16816D862240K62677k32053P4767J03112K84402K97145K23620j93082K74408J77935
16806F135171j17018K0599J66319J19382P6567p7706M30893N07749q7196K72686
16796G447446j20651M80450M7876k91571K73048N93359P4875R6499J73122M26012
16786I200465L74890L13497k76753N71683J67412J66609K43337L61732M53147
16777A1576019K07891L50630L18537O50824j0051M09331Q91556j8266M39023L07118
16767A5122612N61113N11527N09813O98869N69488O64312P60823N89028M92693
$$ plain form
16758 20480278 21532778 22079196 22752948 23862012 24623590 25835449 26645860 27778889 29255204
16749 29255204 30096753 31714515 32991459 34461046 35904019 37472244 39386211 41162739
16741 41162739 43083019 45279770 47376887 49478448 52169833 54745107 57780319 61176710
16733 61176710 64675026 67853887 71684589 75890112 79713940 84428284 88731095 93897708
16725 93897708 99343140 105086559 111092005 117301499 123421837 129710057 136666448 142728765
16717 142728765 149669611 155688651 161682532 167395585 172762978 177299166 181191032 184571603
16709 184571603 186285084 187394123 187369881 186406923 184041917 180751665 176906736 172293656
16701 172293656 166866313 161222157 155068506 148098747 141952965 135091481 128875482 122142806
$$ packed form
16758B0480278J052500N46418O73752J109064P61578J211859Q10411J133029J476315
16749B9255204Q41549J617762J276944J469587J442973J568225J913967J776528
16741D1162739J920280K196751K097117K101561K691385K575274L035212L396391
16733F1176710L498316L178861L830702M205523L823828M714344M302811N166613
16725I3897708N445432N743419O005446O209494O120338O288220O956391O062317
16717A42728765O940846O019040N993881N713053N367393M536188L891866L380571
16709A84571603J713481J109039k4242r62958k365006l290252l844929m613080
16701A72293656n427343n644156o153651o969759o145782o861484o215999o732676
$$ plain form
16693 122142806 115638452 109961305 104012504 98228993 92954956 87831179 83204758 79035712
16685 79035712 74545749 70674460 66623004 63379992 59871033 56815192 54211043 51175646
16677 51175646 48859568 46419124 44069038 41777153 39965382 38458767 36658340 34924235
16669 34924235 33386394 31887580 30173251 29231571 27867642 26606890 25769957 25002244
16661 25002244 23923216 23175326 21849184 21334032 20384956 19887702 19227677 18480273 17654187
16652 17654187 17146356 16473505 16077629 15823039 14920676 14791536 14446382 13751189 13353309
16643 13353309 12741470 13121898 12134286 11572075 11185546 11248004 10979394 10432775 10242154
16634 10242154 10304389 9874468 9530148 9293572 9374120 8790057 8330202 8284758 8133757 8204121
$$ packed form
16693A22142806o504354n677147n948801n783511n274037n123777m626421m169046
16685G9035712m489963l871289m051456l243012l508959l055841k604149l035397
16677E1175646k316078k440444k350086k291885j811771j506615j800427j734105
16669C4924235j537841j498814j714329r41680j363929j260752q36933p67713
16661B5002244j079028p47890j326142n15152r49076m97254o60025p47404q26086
16652A7654187n07831o72851l95876k54590r02363j29140l45154o95193l97880
16643A3353309o11839L80428r87612n62211l86529O2458k68610n46619j90621
16634A0242154O2235m29921l44320k36576Q0548n84063m59855m5444j51001P0364
$$ plain form
16624 8204121 7846369 7450743 7212713 7178747 7260671 6982526 6750845 6865462 6388372 6521622
16614 6521622 6330438 6226711 5676564 5962193 5429051 5538438 5590131 5408200 4870717 5260195
16604 5260195 5057210 4805003 5012392 4728780 4604613 4632174 4511314 4289844 4736284 4403503
16594 4403503 4254048 4192883 4123057 3923947 4039594 3731651 3870276 3233452 3762908 3456618
16584 3456618 3768186 3732197 3258333 3659517 3328826 3201046 3337448 3466556 3191371 3137767
16574 3137767 3331465 3004071 2955446 2886119 2686227 2772393 2715585 3016501 2705961 2878073
16564 2878073 2588211 2686968 2591019 2578581 2496677 2389238 2619376 2377628 2188314 2098793
16554 2098793 2372996 2178074 2222252 2075403 2016931 2149199 2075442 2292986 1859197 1755570
$$ packed form
16624H204121l57752l95626k38030l3966Q1924k78145k31681J14617m77090J33250
16614F521622j91184j03727n50147K85629n33142J09387N1693j81931n37483L89478
16604E260195k02985k52207K07389k83612j24167K7561j20860k21470M46440l32781
16594D403503j49455o1165o9826j99110J15647l07943J38625o36824N29456l06290
16584C456618L11568l5989m73864M01184l30691j27780J36402J29108k75185n3604
16574C137767J93698l27394m8625o9327j99892Q6166n6808L00916l10540J72112
16564B878073k89862R8757r5949j2438q1904j07439K30138k41748j89314q9521
16554B098793K74203j94922M4178j46849n8472J32268p3757K17544m33789j03627
$$ plain form
16544 1755570 2136318 1905344 2090110 1796397 1720030 1560224 1909363 2132256 1727651 1723671
16534 1723671 1806402 1940326 1647211 1881276 1867808 1827241 1340346 1894251 1541495 1410897
16524 1410897 1829123 1757880 1458862 1483602 1701681 1477777 1448139 1653898 1624623 1420829
16514 1420829 1222787 1202238 1501693 1285606 1362879 1395108 1333693 1458212 1430929 1019569
16504 1019569 1142179 1239079 1031067 1524790 944805 1312556 974543 1510523 1021402 1118749
16494 1118749 973728 1359167 845310 897294 1032121 964550 1177119 1263286 1014228 1471935
16484 1471935 967662 1068935 1230793 1241403 1008226 813372 795333 1245291 1098147 1016840
16474 1016840 869855 1305328 952470 780721 777065 1087503 1030305 692885 828619 1052027
$$ packed form
16544A755570L80748k30974J84766k93713p6367j59806L49139K22893m04605l980
16534A723671Q2731J33924k93115K34065j3468m0567m86895N53905l52756j30598
16524A410897M18226p1243k99018K4740K18079k23904k9638K05759k9275k03794
16514A420829j98042k0549K99455k16087P7273L2229o1415J24519k7283m11360
16504A019569J22610R6900k08012M93723n79985L67751l38013N35980m89121R7347
16494A118749j45021L85439n13857N1984J34827o7571K12569Q6167k49058M57707
16484A471935n04273J01273J61858J0610k33177j94854j8039M49958j47144q1307
16474A016840j46985M35473l52858j71749l656L10438n7198l37420J35734K23408
$$ plain form
16464 1052027 881033 914603 782041 939503 765287 749545 822724 777047 826675 908957
16454 908957 804360 625533 721692 610393 679428 676492 828993 773394 685481 740512 497013
16443 497013 898118 652204 698228 833691 776322 574687 820038 555817 884726 527086
16433 527086 594101 615883 870142 880853 517485 763863 607757 730898 752859 755805 731534
16422 731534 726661 549630 507683 488606 539920 687853 725834 286798 689501 668514 674995
16411 674995 448149 522789 764751 970669 563612 625744 408832 759727 323266 877410
16401 877410 570496 760273 584751 568268 643171 458763 685727 648499 487289 375480
16391 375480 738490 430129 561955 629760 514252 479839 661052 481092 627344 209798
$$ packed form
16464A052027j70994L3570j32562J57462j74216j5742P3179m5677M9628Q2282
16454I08957j04597j78827R6159j11299O9035k936J52501n5599q7913N5031k43499
16443D97013M01105k45914M6024J35463n7369k01635K45351k64221L28909l57640
16433E27086O7015K1782K54259J0711l63368K46378j56106J23141K1961K946k4271
16422G31534m873j77031m1947j9077N1314J47933L7981B86798M02703k0987O481
16411F74995k26846P4640K41962K05918m07057O2132k16912L50895C23266N54144
16401H77410l06914J89777j75522j6483P4903j84408K26964l7228j61210j11809
16391C75480L63010l08361J31826O7805j15508l4413J81213j79960J46252B09798
$$ plain form
16380 608865 563523 598573 526022 169113 392232 502338 428042 619055 512205 221343
16369 178635 756438 263453 803529 46744 428917 348623 489197 636295 566885 261219
16358 140295 504727 387538 297626 516629 251297 540714 295153 592158 106261 288166
16348 288166 471714 505909 164244 171189 102919 282363 571574 175930 475603 278602
16338 278602 349716 40973 184465 437229 204844 423841 313894 466378 224911 225866
16328 225866 140079 356491 568724 267358 576472 130358 296107 708767 -34130 427704
16317 170692 377648 421332 464843 465145 46270 245950 510730 379231 233538 352086 425515
16306 425515 413503 488199 429764 377714 267693 172629 486627 373293 221236 294544 280584
$$ packed form
16380F08865m5342L5050p2551A69113K23119J10106p4296J91013j06850B21343
16369A78635N77803B63453N40076D6744L82173q0294J40574J47098o9410B61219
16358A40295L64432j17189q9912K19003B51297K89417k45561K97005A06261J81905
16348B88166J83548L4195A64244O945o8270J79444K89211A75930K99673j97001
16338B78602P1114D0973J43492K52764B04844K18997j09947J52484B24911R55
16328B25866q5787K16412K12233B67358L09114A30358J65749M12660c4130D27704
16317A70692K06956M3684M3511L02D6270J99680K64780j31499j45693J18548P3429
16306D25515j2012P4696n8435n2050j10021r5064L13998j13334j52057P3308j3960
$$ plain form
16295 280584 488614 644674 -1238 131004 93732 645202 336452 246007 195577 99726 133022
16284 133022 255201 279518 111786 364798 293252 218012 82486 402137 14546 276117
16274 276117 19967 98632 162472 250716 38548 161894 499694 186319 185413 118666 226839
16263 226839 311261 186555 198495 325817 -189747 305984 -351900 74047 160444 257983
16253 257983 237915 39473 297634 95522 316410 372882 133886 -7309 185896 272636 75132
16241 64099 109721 390741 338060 345685 509252 284270 -125978 293316 213537 65028 170394
16230 170394 157119 314458 -37065 -202113 486499 271196 116415 250767 379215 -30792
16219 -166514 246292 -4622 148799 301088 229309 166266 195210 139385 -160837 188280 267885
$$ packed form
16295B80584K08030J56060a238A31004l7272N51470l08750r0445n0430r5851L3296
16284A33022J22179K4317A11786K53012p1546p5240H2486L19651A4546K61571
16274B76117A9967P8665O3840Q8244C8548J23346L37800A86319r06o6747J08173
16263B26839Q4422j24706J1940J27322a89747C05984c51900G4047Q6397R7539
16253B57983k0068C9473K58161I5522K20888N6472A33886g309A85896Q6740G5132
16241F4099M5622K81020n2681P625J63567k24982a25978B93316p9779F5028J05366
16230A70394j3275J57339c7065j65048D86499k15303A16415J34352J28448c0792
16219a66514B46292d622A48799J52289p1779o3043K8944n5825a60837A88280P9605
$$ plain form
16208 267885 264173 296251 -116089 92591 163805 292094 318163 -48788 150540 -21413 55621
16196 -1626 365477 454495 171805 328792 432573 -130471 248761 -40681 -75512 86719 68514
16185 68514 44153 -73692 317987 354799 121128 27225 -79723 102282 333012 51202 146110
16174 146110 80191 147064 26520 -337355 174278 88209 213465 -466 47176 28915 119982
16163 119982 368607 582770 558180 168848 528532 -4754 340539 -73757 198849 159787
16153 159787 422706 198663 158022 47749 22382 -159938 -224664 187156 -117101 76871
16142 352057 83333 -276534 70760 -202692 186961 215519 348321 230354 259188 -7191 289627
16130 234377 166050 203439 -49840 243967 -225175 -125325 106665 -167965 126223 161371
$$ packed form
16208B67885l712L2078a16089I2591P1214J28289K6069d8788A50540b1413E5621
16196a626C65477Q9018A71805J56987J03781a30471B48761d0681l4831H6719j8205
16185F8514k4361g3692C17987L6812A21128B7225g9723A02282K30730E1202R4908
16174A46110o5919O6873B6520c37355A74278q6069J25256d66D7176j8261R1067
16163A19982K48625K14163k4590A68848L59684d754C40539g3757A98849l9062
16153A59787K62919A98663m0641D7749B2382a59938o4726A87156a17101G6871
16142C52057H3333b76534G0760b02692A86961K8558J32802j17967K8834g191B89627
16130B34377o8327L7389d9840B43967b25175R9850A06665a67965A26223L5148
$$ plain form
16120 161371 14122 35449 153185 290694 58405 132754 1145 5366 -16168 65223 -69179
16108 157285 392662 118707 62506 303833 194830 -89904 77040 159224 124575 143781 41054
16096 13435 52600 183553 25900 140413 138182 -84556 -109698 44877 -235783 -37646 53448
16084 73383 -55266 82328 99082 49517 149646 -127237 -292954 124136 60875 -270825 4235
16072 -88881 72635 -140324 -2170 23274 -53117 9076 52200 -2241 40898 47966 107975 -79688
16059 228416 -216521 233098 91738 120794 -8732 85963 -227226 -172719 -95977 -99269 -103013
16048 -103013 129432 24300 -38378 84260 102154 273786 -20865 -156155 -125626 20965 218914
16037 218914 -229887 -66933 66495 -135912 -17024 -2594 194305 35932 -84107 -372905 -183739
$$ packed form
16120A61371A4122K1327J17736J37509E8405P4349A145M221a6168F5223f9179
16108A57285K35377A18707n6201K41327j09003h9904G7040Q2184l4649J9206D1054
16096A3435L9165J30953B5900J14513k231h4556k5142D4877b35783c7646E3448
16084G3383e5266H2328J6754D9517J00129a27237j65717A24136F0875b70825D235
16072h8881G2635a40324b170B3274e3117I076M3124b241D0898P068O0009g9688
16059B28416b16521B33098I1738K9056h732H5963b27226N4507P6742l292l744
16048a03013A29432B4300c8378H4260J7894J71632b0865j35290L0529B0965J97949
16037B18914b29887f6933F6495a35912a7024b594A94305C5932h4107k88798a83739
$$ plain form
16025 -140729 -16892 -7747 -45613 1888 -70125 381989 121063 -107605 444 215305 323355
16014 323355 179578 -194115 -158518 -198892 204179 -27438 108306 -24764 38437 -31731 171614
16002 114463 89863 -118432 -33355 102697 26609 87699 387763 -74981 281471 -144944
15991 147534 51282 109286 188411 59905 -55915 -254131 -174308 23204 148324 -157032 57739
15979 -81536 -52928 303034 -450529 -271168 176942 -56555 377378 42341 -145858 77886
15968 308322 57806 260741 485818 201498 104822 485946 244023 22931 -11424 -31983
15958 -31983 127542 240333 85847 -228246 -23690 12375 -99822 -291980 55097 -134231 7306
15946 -165295 80713 -297127 -125240 -111993 -184349 34869 307755 99425 12828 -138240 214558
$$ packed form
16025a40729a6892g747l7866A888g0125C81989A21063a07605D44K14861J08050
16014C23355j43777a94115L5597m0374B04179b7438A08306b4764C8437c1731A71614
16002A14463k4600a18432c3355A02697B6609O1090L00064g4981B81471a44944
15991A47534E1282N8004P9125E9905e5915j98216P9823B3204J25120a57032E7739
15979h1536K8608C03034d50529J79361A76942e6555C77378D2341a45858G7886
15968C08322E7806K02935K25077B01498r6676L81124k41923B2931a1424k0559
15958c1983A27542J12791H5847b28246b3690A2375i9822j92158E5097a34231G306
15946a65295H0713b97127a25240J3247p2356C4869K72886I9425A2828a38240B14558
$$ plain form
15934 -250411 110976 -316096 -342510 78221 320929 119103 -289036 86397 -113856 -85708
15924 -85708 -272334 -243658 -87063 -217260 -79504 -113023 -94552 120542 -75853 -199445 6206
15912 -307362 -72124 266327 -161882 -64027 -41752 -58432 -66761 134048 5595 77446 81701
15901 81701 18531 -70137 -224780 -186651 -123803 295766 -139689 105394 -49175 -78071 -403418
15890 -403418 269131 -255149 -18338 -226401 165062 27029 120230 -4611 -67731 46578 -14596
15878 38358 -226600 -92765 200444 -131231 -46861 -25597 -109226 -208782 51601 22018 8743
15866 199020 -101893 -178337 -132295 -229388 381003 176850 243820 -40083 -57587 -269875 17689
15854 -11545 135985 -70779 -89119 287687 52831 95062 -276103 59333 -129274 -99123 -57543
$$ packed form
15934b50411A10976c16096k6414G8221K42708A19103b89036H6397a13856K8148
15924h5708j86626K8676h7063j30197g9504l3519J8471A20542g5853j23592F206
15912c07362g2124B66327a61882f4027K2275j6680q329A34048E595P1851M255
15901H1701A8531g0137j54643L8129O2848B95766a39689A05394d9175k8896l25347
15890d03418B69131b55149a8338k08063A65062B7029R3201d611o3120D6578a4596
15878C8358b26600i2765B00444a31231d6861K1264q3629r9556E1601B2018H743
15866A99020a01893p6444M6042r7093C81003A76850O6970d0083j7504k12288A7689
15854a1545A35985g0779j8340B87687E2831M2231b76103E9333a29274L0151M1580
$$ plain form
15843 -57543 -230660 -306708 189625 28103 -136919 -223032 338443 -38704 259480 -136411
15832 43223 -421931 -188297 74512 -22987 -138611 -105537 126409 -98358 200835 226771 21357
15820 -2722 -79963 10931 -241950 -40294 -93425 26107 5060 75137 84590 -363878 382048 10949
15807 30915 -130610 103722 3625 -164938 -17661 18497 8954 124379 -167497 -353339 -167326
15795 35484 -397222 126231 -135189 72819 164256 264929 62797 -138432 16348 -269757
15784 -237487 -65101 167604 -270415 327874 360922 -356370 -191858 -15273 24208 139026
15774 139026 -417746 -169322 74048 -161783 229846 -395319 -76936 45944 74484 -163023
15763 -245744 39648 61978 36151 22292 -45491 186776 497 197084 300138 93336 -113029
$$ packed form
15843e7543j73117p6048A89625B8103a36919q6113C38443c8704B59480a36411
15832D3223d21931a88297G4512b2987j15624L3074A26409i8358B00835K5936B1357
15820b722p7241A0931b41950d0294n3131B6107E060P0077R453c63878C82048A0949
15807C0915a30610A03722C625a64938a7661A8497H954J15425a67497j85842a67326
15795C5484c97222A26231a35189G2819R1437J00673F2797a38432A6348b69757
15784b37487f5101A67604b70415C27874L3048c56370J64512a5273B4208J14818
15774A39026d17746a69322G4048a61783B29846c95319g6936D5944K8540a63023
15763b45744C9648K2330k5827j3859d5491A86776D97J96587J03054I3336a13029
$$ plain form
15751 -254992 -212164 -190369 -117368 143495 -198473 -118030 -76934 55000 24646 -103206 19496
15739 -269880 24874 37381 36002 -221540 -204896 -386560 129360 91862 253727 85509 -376779
15727 95297 160132 -95802 268211 175197 302351 -93109 -224454 -95205 -20091 -7635 133231
15715 42767 130079 -68441 12640 -72831 74304 -238435 9831 -110360 59454 -284155 439668
15703 89353 136929 -131805 -146257 -236936 286215 75412 -63262 -9738 -208935 148483 269050
15692 269050 377411 -221157 37752 -323628 137328 -179018 45216 -426904 -105880 -72469
15682 -72469 -205970 166779 -278579 -110618 -243141 -300341 -107220 184027 -170816 -287418
15672 -287418 -115701 -62576 -232980 -137240 66509 -52936 -164692 -139544 117295 -179345
$$ packed form
15751b54992M2828K1795P3001A43495a98473Q0443M1096E5000B4646a03206A9496
15739b69880B4874J2507j379b21540J6644j81664A29360l7498J61865H5509c76779
15727I5297O4835i5802B68211r3014J27154i3109j31345i5205b0091g635A33231
15715D2767Q7312f8441A2640g2831G4304b38435I831a10360E9454b84155D39668
15703H9353M7576a31805j4452r0679B86215G5412f3262i738j99197A48483J20567
15692B69050J08361b21157C7752c23628A37328a79018D5216d26904a05880L3411
15682g2469j33501A66779b78579a10618j32523n7200a07220A84027a70816j16602
15672b87418a15701N3125j70404R5740F6509e2936j11756K5148A17295a79345
$$ plain form
15661 -156173 -266064 60172 40320 201229 -49080 -129422 -407048 249031 44171 -330086
15650 -30087 387590 2873 -217029 -159033 -148138 323371 -121751 35286 -78188 41095 -43505
15638 -366472 -80231 -480807 70319 -183927 76283 262497 -21858 -174031 -238933 175750
15627 136297 165457 308998 31162 -25360 65651 -142030 -79319 124601 -330511 268189
15616 110848 221266 -152845 -158420 375144 -213179 -88030 245092 -34660 145551 59037
15605 118993 21443 -954 125411 84112 59784 -263312 -169658 -255262 -236705 -74467 -35373
15593 112102 196887 -480312 149484 6540 -30342 178756 -93524 -83325 -239971 28363 -173183
15581 90726 -297244 -98904 -71459 -370737 -247441 165130 -168950 292243 -250788 74958
$$ packed form
15661a56173j09891F0172j9852J60909d9080q0342k77626B49031D4171c30086
15650c0087C87590B873b17029N7996J0895C23371a21751C5286g8188D1095d3505
15638c66472h0231m00576G0319a83927G6283J86214b1858j52173o4902A75750
15627A36297K9160J43541C1162b5360F5651a42030O2711A24601c30511B68189
15616A10848J10418a52845n575C75144b13179h8030B45092c4660A45551E9037
15605A18993B1443i54A25411m1299k4328b63312R3654q5604J8557g4467c5373
15593A12102Q4785d80312A49484F540c0342A78756i3524J0199j56646B8363a73183
15581I0726b97244i8904K7445k99278J23296A65130a68950B92243b50788G4958
$$ plain form
15570 -72837 -38036 -71818 -148554 -112772 -112478 83364 -164946 66752 157645 -165332 -14606 -335440
15558 -335440 -156557 176294 58837 -108668 121451 -194920 -431479 -112429 -420290 15070
15547 196872 11964 63716 -75334 170360 -107743 -241135 15237 135042 300998 214212
15537 214212 -103447 59656 -128976 -7348 243747 61008 248676 314181 -8279 44542 90567
15526 90567 -256851 -368659 257591 -267710 -74258 -6801 -97091 145659 382822 24015 7258
15514 -213192 -173494 120989 -105952 -81113 -96076 -260105 402035 71063 19885 -134350
15503 22355 -246677 -20271 169227 149261 -186043 -183449 -233062 3505 23302 14113 23893 201163
15491 201163 112125 -189044 -74080 -270377 177997 -380743 -279556 -161924 228286 -149464
$$ packed form
15570g2837L4801l3782p6736L5782K94H3364a64946F6752R0893a65332a4606l20834
15558c35440a56557A76294E8837a08668A21451a94920k36559a12429l07861A5070
15547A96872A1964N1752g5334A70360a07743j33392A5237J19805J65956q6786
15537B14212a03447E9656a28976g348B43747F1008J87668O5505h279D4542M6025
15526I0567b56851j11808B57591b67710g4258f801r0290A45659K37163B4015G258
15514b13192L9698A20989a05952K4839j4963j64029D02035G1063A9885a34350
15503B2355b46677b0271A69227j9966a86043K594m9613C505J9797r189R780J77270
15491B01163q9038a89044g4080j96297A77997c80743J01187J17632B28286a49464
$$ plain form
15480 460641 -34103 -22186 -81897 13178 78953 231173 -94974 -117356 -161298 -99374 77645
15468 -201070 -159366 179347 324545 172667 97398 108489 39690 -223067 -267790 -21655 -8179
15456 220590 -68576 -91771 -14383 -170642 188781 188709 -231040 390781 -119301 143328 -49354
15444 130359 -113910 -43793 8165 -38393 67023 -195506 -263186 -183493 33013 -246777 85302
15432 -379123 -36694 -41346 231503 -110856 -163848 60311 -165956 -167179 15910 -49415 -82935
15421 -82935 206398 -95029 209829 -258541 69148 -169961 37509 -24003 82839 -108173 27399
15409 241252 31688 138999 -120033 -148642 106819 256526 44553 -15285 220727 -199307
15398 -188465 25841 -176679 54811 70680 81606 142579 148891 -221189 -9688 173463 -59800
$$ packed form
15480D60641c4103J1917n9711A3178O5775J52220i4974k2382m3942O1924G7645
15468b01070M1704A79347J45198j51878p5269J1091C9690b23067m4723b1655h179
15456B20590f8576k3195a4383j56259A88781p2b31040C90781a19301A43328d9354
15444A30359a13910d3793H165c8393F7023a95506o7680P9693C3013b46777H5302
15432c79123c6694m652B31503a10856n2992F0311a65956j223A5910d9415l3520
15421h2935B06398i5029B09829b58541F9148a69961C7509b4003H2839a08173B7399
15409B41252C1688J07311a20033k8609A06819J49707D4553a5285B20727a99307
15398a88465B5841a76679E4811J5869J0926O0973O312b21189i688A73463e9800
$$ plain form
15386 148372 76358 122006 234758 -60072 -142629 -41483 -147638 130643 -111231 8464 43797
15375 43797 -74397 223128 58978 -291241 -152052 -26903 344751 71541 3584 122080 -142064
15363 -167762 -331310 146429 63192 377127 185916 89362 -304161 -161474 -85902 102930
15352 228038 -114743 -129538 37302 -77839 -179945 235701 -199309 -208928 -165141 67269 -5154
15340 -115441 -136613 9789 180795 -1040 53796 277976 -83525 110858 -240214 11059 267173
15329 267173 -41389 -18832 208876 -314605 43816 258091 339355 -116701 277323 108590
15318 -53659 -45994 169262 -70417 -98905 -157414 218334 115074 63091 -68620 -390596 27991
15306 -65266 -108579 86618 27204 -91503 163272 207017 -191534 362847 -152195 442412 -2099
$$ packed form
15386A48372p2014M5648J12752f0072q2557d1483j06155A30643a11231H464L5333
15375D3797g4397B23128E8978b91241J39189b6903C44751G1541C584J18496a42064
15363a67762j63548A46429F3192L13935A85916H9362c04161J42687P5572A02930
15352B28038a14743j4795C7302g7839j02106B35701a99309r619M3787F7269e154
15340a15441k1172I789J71006a040E3796K24180h3525A10858b40214A1059K56114
15329B67173d1389a8832B08876c14605D3816K14275Q1264a16701B77323A08590
15318e3659P665A69262g0417k8488n8509B18334j03260n1983f8620l21976B7991
15306f5266m3313H6618B7204i1503A63272M3745a91534C62847a52195D42412b099
$$ plain form
15294 178159 -158365 32385 55462 137224 7070 231161 210265 103528 76379 78677 -355035
15282 54027 -20964 -70093 -11964 197758 160592 -30343 133171 266566 -148958 9177 3544
15270 127077 -192739 -207586 47930 -133714 152348 20075 -218247 143985 145982 206967 43989
15258 438177 129488 59446 126209 -247463 11436 -10605 76860 -115128 312526 -43839 225805
15246 89421 -123031 271892 83425 233143 165052 187861 -14034 24458 29236 147743 94230
15235 94230 223070 746839 835180 1069698 1936478 1942885 1809483 1708637 1025312 436859
15224 188469 463234 43692 169162 84748 29310 154704 -41870 -217085 134667 -95592
15213 174825 -194507 -140187 229733 254258 -139896 -43783 316630 372542 247076 150506
$$ packed form
15294A78159a58365C2385K3077Q1762G070K24091k0896A03528k7149K298c55035
15282E4027b0964m9129a1964A97758l7166c0343A33171J33395a48958I177C544
15270A27077a92739j4847D7930a33714A52348B0075b18247A43985J997O0985D3989
15258D38177A29488E9446O6763b47463A1436a0605G6860a15128C12526d3839B25805
15246H9421a23031B71892H3425J49718o8091K2809a4034B4458M778J18507n3513
15235I4230J28840N23769Q8341K34518Q66780O407j33402j00846o83325D36859
15224A88469K74765D3692J25470q4414B9310J25394d1870j75215A34667i5592
15213A74825a94507N4320B29733K4525a39896d3783C16630N5912j25466r6570
$$ plain form
15203 150506 388201 241413 79142 -74327 109755 -106580 40524 126280 39117 -37979 187934
15191 94143 183423 -47604 -176897 -56386 2062 -72714 79005 -109447 -85834 -56141 58060
15179 246840 -638081 -248338 219967 290166 153150 294000 326848 134473 -7118 222672
15168 -59567 128906 82396 21292 284013 147897 557502 -88657 83845 110958 168705 -16139
15156 -294289 248768 4064 270267 -89023 224646 113805 112716 205515 -26806 216732 90381
15144 -25904 373084 226323 311511 -121681 -11312 257768 273888 -8246 255031 333465 209174
15133 209174 -268124 67713 48949 -102231 62920 249219 272164 -9774 325208 79634 344790
15122 344790 -274892 -85037 -67905 -88642 44282 -33150 65191 390044 121194 8577 -133839
$$ packed form
15203A50506K37695j46788G9142g4327A09755a06580D0524Q5756C9117c7979A87934
15191I4143Q9280d7604j29293e6386B062g2714G9005a09447K3613K9693E8060
15179B46840f38081b48338B19967P0199j37016J40850L2848A34473g118B22672
15168e9567A28906m6510B1292K62721j36116M09605h8657H3845K7113N7747a6139
15156b94289B48768D064K66203h9023B24646j10841j089R2799b6806B16732I0381
15144b5904C73084j46761Q5188a21681a1312B57768J6120h246B55031P8434j24291
15133B09174b68124F7713j8764a02231F2920J86299K2945i774C25208G9634K65156
15122C44790b74892h5037J7132k0737D4282c3150F5191L24853A21194H577a33839
$$ plain form
15110 97539 234717 192063 -6503 326776 199042 104159 124166 286045 170165 338319 199964
15099 199964 -76783 71100 215699 -54567 -6238 333382 90828 211327 58783 309358 39231
15087 141905 211414 -134690 31600 -68652 201018 367589 43868 124407 -124552 312358
15076 215346 -7368 47333 263801 275425 137248 -64734 -71357 95729 525944 292254 257174
15065 257174 -65973 343485 -202677 497112 159875 114878 516236 202205 -55547 -185431
15055 -185431 276770 -9477 284075 52478 353237 71453 177767 31874 201818 181946 12915
15043 278371 22604 226174 344615 182060 -116211 280360 273294 161875 77253 353666
15033 353666 108038 119797 231895 243226 254568 -30439 19532 -93130 92408 220562 -5420
$$ packed form
15110I7539J37178m2654f503C26776j27734r4883K0007J61879j15880J68154j38355
15099A99964g6783G1100J44599e4567f238C33382I0828J20499E8783K50575C9231
15087A41905O9509a34690C1600f8652B01018J66571D3868Q0539a24552C12358
15076B15346g368D7333K16468J1624A37248f4734o623I5729M30215k33690l5080
15065B57174f5973C43485b02677D97112A59875m4997M01358B02205e5547j29884
15055a85431B76770i477B84075E2478L00759G1453J06314C1874J69944j9872A2915
15043B78371B2604K03570J18441j62555a16211B80360p066j11419G7253K76413
15033C53666A08038J1759J12098J1331J1342c0439A9532i3130I2408J28154e420
$$ plain form
15021 492714 185133 170699 160022 441939 378085 -144062 71130 453681 223742 57661
15010 574869 18176 75179 17619 -2043 519686 274494 -94168 249039 -148575 249730 16771
14998 199768 87641 80586 110466 425965 193922 163692 144355 63159 462007 95699 96964
14987 96964 236349 299830 41609 -121577 365845 372844 426682 266632 165537 -67081 287288
14975 425028 92287 133404 60692 325359 287082 76756 73404 341863 225424 76017 85368
14964 85368 21603 257145 191538 318960 299916 -92171 297453 79804 -132552 254344 472559
14953 472559 281047 425572 261650 455032 67391 256692 240458 -7599 335908 166650
14942 392142 170331 293606 371680 616243 94726 303710 18841 96257 322389 237776
$$ packed form
15021D92714A85133j4434j0677K81917o3854a44062G1130L82551B23742E7661
15010E74869A8176N7003A7619b043E19686k45192i4168B49039a48575B49730A6771
14998A99768H7641p055K9880L15499A93922l0230j9337F3159L98848I5699J265
14987I6964J39385O3481D1609a21577C65845O999N3838j60050j01095f7081B87288
14975D25028I2287M1117F0692K64667l8277G6756l352K68459j16439G6017R351
14964H5368B1603K35542o5607J27422j9044i2171B97453G9804a32552B54344K18215
14953D72559j91512J44525j63922J93382F7391J89301j6234g599C35908A66650
14942C92142A70331J23275P8074K44563I4726K08984A8841P7416K26132q4613
$$ plain form
14932 237776 421108 -49215 96782 563422 207608 639326 116093 306142 385779 143340
14921 155959 337948 322612 306341 486772 424292 365268 72067 137462 132701 180804 326498
14910 326498 247000 113370 354676 213711 76202 260067 -29185 424229 -53149 132353
14899 309330 235422 127174 433444 275678 88720 386627 -27726 56001 -186359 305595
14888 269505 444041 540287 -69419 271892 442742 429088 324314 369467 214307 343934
14878 343934 358823 299517 300912 671480 137989 671903 97441 208903 258600 379322 469506
14867 469506 243185 486190 315869 367403 126672 466840 576110 523994 565724 420000
14857 420000 635177 628352 253360 578125 469943 437484 564083 13214 375813 279062
$$ packed form
14932B37776J83332d9215I6782M66640B07608M31718A16093J90049P9637A43340
14921A55959J81989j5336j6271J80431o2480n9024G2067O5395m761M8103J45694
14910C26498p9498A13370K41306j40965G6202J83865b9185D24229e3149A32353
14899C09330p3908j08248L06270j57766H8720K97907b7726E6001a86359C05595
14888B69505J74536R6246f9419B71892J70850j3654j04774M5153j55160J29627
14878C43934J4889n9306J395L70568A37989N33914I7441J11462M9697J20722R0184
14867D69506k26321K43005j70321N1534A26672L40168J09270n2116M1730j45724
14857D20000K15177o825B53360L24765j08182l2459J26599A3214L62599r6751
$$ plain form
14847 279062 362683 203462 585672 175752 548039 395120 255685 299323 407754 303809
14837 303809 42931 350208 71661 437170 393306 459812 354864 584950 350934 366332
14827 366332 396043 171163 544949 449316 316094 356500 171819 496724 635963 430334
14817 430334 569862 623008 301334 367331 414607 433494 515857 278675 809397 316362
14806 543891 588775 472592 491480 342609 605832 41278 455358 487298 634701 350233
14796 350233 575409 540701 277332 815637 380541 323236 368022 480895 445876 257837
14786 257837 596620 434271 431627 496770 397818 466420 428464 533285 517140 528301 519274
14775 519274 820125 551076 584559 723021 384284 404598 557104 581942 490977 782944
$$ packed form
14847B79062Q3621j59221L82210A75752L72287j52919j39435M3638J08431j03945
14837C03809D2931L07277G1661L65509m3864O6506j04948K30086k34016J5398
14827C66332K9711A71163L73786r5633j33222M0406A71819L24905J39239k05629
14817D30334J39528N3146C01334O5997M7276J8887Q2363k37182N30722C16362
14806E43891M4884j16183J8888j48871K63223D1278M14080L1940J47403k84468
14796C50233K25176l4708k63369N38305C80541n7305M4786J12873l5019j88039
14786B57837L38783j62349k644O5143r8952O8602l7956J04821j6145J1161r027
14775E19274L00851k69049L3483J38462l38737K0314J52506K4838r0965K91967
$$ plain form
14765 782944 327701 556926 615199 432175 386218 859969 540072 513210 549092 626227
14755 626227 573978 628569 280244 546817 460021 651864 593247 672132 473175 598399
14745 598399 606345 444891 717962 781318 439494 778083 275991 786308 677068 892860
14735 892860 581246 613965 625175 672830 856154 725765 596105 874518 740991 734374
14725 734374 1041732 518258 891888 872736 666288 688564 773403 531497 843218 548760
14715 548760 665221 678098 602691 794720 683649 931151 868822 401932 822879 1121397
14705 1121397 1040102 791239 494058 837744 998455 914808 1219666 742545 868247 1079049
14695 1079049 1184191 1037293 758876 590748 679882 850418 750449 481194 1045349 844481
$$ packed form
14765G82944C27701K29225N8273j83024m5957M73751l19897k6862L5882P7135
14755F26227n2249N4591B80244K66573q6796J91843n8617P8885j98957J25224
14745E98399P946j61454K73071O3356l41824L38589B75991N10317j09240K15792
14735H92860l11614L2719J1210M7655J83324j30389j29660K78413j33527o617
14725G34374L07358E18258L73630j9152k06448K2276Q4839k41906L11721k94458
14715E48760J16461J2877p5407J92029j11071K47502o2329D01932M20947K98518
14705A121397q1295k48863k97181L43686J60711q3647L04858m77121J25702K10802
14695A079049J05142j46898k78417j68128Q9134J70536r9969k69255N64155k00868
$$ plain form
14685 844481 1023465 675248 896272 731699 1166369 855016 937513 760356 890424 877977
14675 877977 796799 891588 989714 846672 1139920 926738 1005223 873483 1007173 1183669
14665 1183669 1397331 1246974 1167923 990202 861022 1291507 856825 1150895 1157005 789525
14655 789525 891967 848988 895809 1154128 718396 1298616 769307 1217023 1134510 1249302
14645 1249302 881393 984585 889744 1231970 1084563 1269121 1370726 1342629 1124516 1307969
14635 1307969 1014946 1371591 744380 1301585 1254954 1137209 932138 1115050 1488220 1174464
14625 1174464 1475683 1392253 1409481 1204106 1278429 1106274 1263987 1286836 1406975 1561886
14615 1561886 1147722 1153928 844439 1349564 1440844 1218019 1264539 1440125 1345301 1197128
$$ packed form
14685H44481J78984l48217K21024j64573M34670l11353Q2497j77157J30068j2447
14675H77977q1178R4789R8126j43042K93248k13182P8485j31740J33690J76496
14665A183669K13662j50357p9051j77721j29180M30485m34682K94070O110l67480
14655G89525J02442m2979M6821K58319m35732N80220n29309M47716q2513J14792
14645A249302l67909J03192r4841L42226j47407J84558J01605k8097k18113J83453
14635A307969k93023L56645o27211N57205m6631j17745k05071J82912L73170l13756
14625A174464L01219q3430J7228k05375P4323j72155J57713K2849J20139J54911
14615A561886m14164O206l09489N05125R1280k22825M6520J75586r4824j48173
$$ plain form
14605 1197128 1316185 1253464 1356086 1301192 1503959 1578195 1459506 1507772 1489141 1625018
14595 1625018 1366210 1493445 1585101 2048187 1483471 1485584 1387383 1983635 1527261 1801267
14585 1801267 1836435 1721654 1948068 1738014 1966220 1502678 2053002 2105546 1854884 1710953
14575 1710953 1687189 1718882 2170103 2015115 1890859 2028538 2302358 1771086 1858865 1944724
14565 1944724 2049209 1737998 2040070 1866126 2288558 2198066 2213156 2114686 2162697 2477236
14555 2477236 2367719 2425700 2938129 2599939 2600658 2710833 2443724 2622750 2686440 2746391
14545 2746391 3028356 3254141 3480771 3623630 3794683 4109045 4589028 4822716 5840564
14536 5840564 6949502 8335085 11433556 15353927 21770091 30845289 30191979 17923362
$$ packed form
14605A197128J19057o2721J02622n4894K02767P4236j18689M8266j8631J35877
14595A625018k58808J27235R1656M63086n64716K113r8201N96252m56374K74006
14585A801267L5168j14781K26414k10054K28206m63542N50324N2544k50662j43931
14575A710953k3764L1693M51221j54988j24256J37679K73820n31272Q7779Q5859
14565A944724J04485l11211L02072j73944M22432r0492J5090r8470M8011L14539
14555B477236j09517N7981N12429l38190P19J10175k67109J79026O3690N9951
14545B746391K81965K25785K26630J42859J71053L14362M79983K33688J017848
14536E840564J108938J385583L098471L920371O416164R075198o53310j2268617
$$ plain form
14528 17923362 11015332 8810476 8210416 5366446 3946764 3480579 3084477 3068368 2740619
14519 2740619 2629489 2437048 2413646 2428463 2554201 2408520 2477813 2515650 2106844 2347920
14509 2347920 2705931 2591885 2488567 2482104 2486152 2533378 2659315 2760680 2814265 2830886 2458449
14498 2458449 2834491 2904717 2758642 3057646 3031750 3137059 2988566 2733371 2967134 3160093
14488 3160093 3228083 3058492 3274871 3188283 3330607 3202950 3424281 3522113 3311680 3606159
14478 3606159 3354671 3572858 3410683 3674454 3519937 3731749 3907802 3896990 3467637 3908125
14468 3908125 3970960 3961459 4176647 4131385 4190639 4126128 3869027 4215445 4120354 4226966 4440592
14457 4440592 4077915 4254607 4562926 4367748 4427549 4521743 4634408 4641359 4905621 4734975
$$ packed form
14528A7923362o908030k204856o00060k843970j419682m66185l96102j6109l27749
14519B740619j11130j92441k3402J4817J25738j45681O9293L7837m08806K41076
14509B347920L58011j14046j03318o463M048M7226J25937J01365N3585J6621l72437
14498B458449L76042P0226j46075K99004k5896J05309j48493k55195K33763J92959
14488C160093O7990j69591K16379q6588J42324j27657K21331R7832k10433K94479
14478C606159k51488K18187j62175K63771j54517K11812J76053j0812m29353M40488
14468C908125O2835r501K15188m5262N9254o4511k57101L46418r5091J06612K13626
14457D440592l62677J76692L08319j95178N9801R4194J12665O951K64262j70646
$$ plain form
14447 4734975 5184835 4783955 5207306 5078125 5294252 5135827 5019697 5775673 5422772
14438 5422772 5528681 5469231 5647565 5511064 5547396 5738332 5560855 5929494 5929269 6495461
14428 6495461 6318226 6325345 6517251 6245201 6314616 6505568 6491035 6444317 6903073 7226179
14418 7226179 7222119 7321682 7284329 7328630 7268380 7415264 7756191 7784061 7627659 8057672 7918233
14407 7918233 8178981 8222248 8395150 8713803 8517335 8654906 8887782 9021827 9398351 9020752
14397 9020752 9426393 9362800 9416181 9676190 9957488 10011476 10151542 10311870 10539687 10540990
14387 10540990 10581176 11011638 11101503 11400908 11412058 11771728 12105315 12089765 11599987 12642935
14377 12642935 12638790 12977591 13091489 13253724 13761839 13636578 14044788 14265385 14596348 15035214
$$ packed form
14447D734975M49860m00880M23351j29181K16127j58425j16130P55976l52901
14438E422772J05909n9450J78334j36501L6332J90936j77477L68639k25N66192
14428F495461j77235P119J91906k72050O9415J90952j4533m6718M58756L23106
14418G226179m060R9563l7353M4301o0250J46884L40927K7870j56402M30013j39439
14407G918233K60748M3267J72902L18653j96468J37571K32876J34045L76524l77599
14397I020752M05641o3593N3381K60009K81298N3988J40066J60328K27817J303
14387A0540990M0186M30462Q9865K99405J1150L59670L33587j5550m89778J042948
14377A2642935m145L38801J13898J62235N08115j25261M08210K20597L30963M38866
$$ plain form
14367 15035214 14639140 15250991 15588852 15940607 16265280 16636330 16963246 17187891 17499540
14358 17499540 17536123 18284296 18479298 18828445 19179875 19861054 20098431 20911990 21030038
14349 21030038 21758388 21593316 22592196 23139138 23511231 23997651 24713748 25066207 25371395
14340 25371395 26051665 26694566 27508948 28143545 28710457 29672649 30212258 30977071 31945518
14331 31945518 32684460 33694937 33985147 35141590 36176753 37382478 38290543 39209384 40373540
14322 40373540 41490687 42548886 44113940 45256927 46520697 48383538 49749448 51207914
14314 51207914 52683682 54488705 56600563 58309319 60189275 62557969 64354561 66679912
14306 66679912 69129026 71445705 74330624 77141917 80206812 83164460 86018295 89851476
$$ packed form
14367A5035214l96074O11851L37861L51755L24673L71050L26916K24645L11649
14358A7499540L6583P48173J95002L49147L51430O81179K37377Q13559J18048
14349B1030038P28350j65072R98880N46942L72093M86420P16097L52459L05188
14340B5371395O80270O42901Q14382O34597N66912R62192N39609P64813R68447
14331C1945518P38942J010477K90210J156443J035163J205725R08065R18841J164156
14322D0373540J117147J058199J565054J142987J263770J862841J365910J458466
14314E1207914J475768J805023K111858J708756J879956K368694J796592K325351
14306F6679912K449114K316679K884919K811293L064895K957648K853835L833181
$$ plain form
14298 89851476 93182262 97049069 101082260 105365044 109912879 114773663 119439334 125140064
14290 125140064 130475469 136486514 143143350 149940244 156654174 164457621 172294417 180693803
14282 180693803 189714961 199438967 209472438 220056690 231253551 243038892 255231250
14275 255231250 268500605 281638883 295797990 310352080 324621470 339180592 353176590
14268 353176590 366408824 379713685 392005183 403269747 414365943 424323333 433597433
14261 433597433 441590664 448934695 453771734 455761259 457258575 458845244 460710270 458865761
14253 458865761 453805220 447344830 438763060 428533497 416480625 403033040 389485986
14246 389485986 376378266 362295096 348270509 334164057 320199635 306826922 293402335
$$ packed form
14298H9851476L330786L866807M033191M282784M547835M860784M665671N700730
14290A25140064N335405O011045O656836O796894O713930P803447P836796Q399386
14282A80693803R021158R724006J0033471J0584252J1196861J1785341J2192358
14275B55231250J3269355J3138278J4159107J4554090J4269390J4559122J3995998
14268C53176590J3232234J3304861J2291498J1264564J1096196R957390R274100
14261D33597433P993231P344031M837039J989525J497316J586669J865026j844509
14253D58865761n060541o460390q581770j0229563j2052872j3447585j3547054
14246C89485986j3107720j4083170j4024587j4106452j3964422j3372713j3424587
$$ plain form
14239 293402335 280397636 268090569 256551505 245435592 234054376 223236880 212536617
14232 212536617 202569756 193240374 184123098 175203856 166718623 158760314 151086987 144026641
14224 144026641 137313735 131307614 125562378 120101547 114681116 109807771 105026841 100716006
14216 100716006 97473632 93088239 89690358 86172079 83005335 79422073 76389542 73847499
14208 73847499 71158182 69091504 66586012 64471076 62232426 60048720 58247687 55928012
14200 55928012 54198200 52770100 51271004 49915880 48343041 46755098 45110277 44183672
14192 44183672 43523403 42041633 40478988 39885293 38593704 37312379 36753698 35482386
14184 35482386 34459651 33948155 32263089 32118316 31222968 30346787 29721042 28981564 28264035
$$ packed form
14239B93402335j3004699j2307067j1539064j1115913j1381216j0817496j0700263
14232B12536617r966861r329382r117276q919242q485233p958309p673327p060346
14224A44026641o712906o006121n745236n460831n420431m873345m780930m310835
14216A00716006l242374m385393l397881l518279l166744l583262l032531k542043
14208G3847499k689317k066678k505492k114936k238650k183706j801033k319675
14200E5928012j729812j428100j499096j355124j572839j587943j644821r26605
14192D4183672o60269j481770j562645n93695j291589j281325n58681j271312
14184C5482386j022735n11496j685066j44773q95348q76181o25745p39478p17529
$$ plain form
14175 28264035 28070161 27234903 26716030 26032384 25147647 24692503 24016155 23485157 23189427
14166 23189427 22527652 22169452 21723553 21147982 20663578 20363691 20020666 19582240 19127307
14157 19127307 18751245 18487056 18490616 17112393 17557021 17023769 16883451 16381387 16063463
14148 16063463 15747870 15710284 14933326 15149014 14618149 14539702 13923643 14045792 13867766 13831839
14138 13831839 13269754 12907604 12864712 12697918 12486030 12200304 12219708 11788603 11541474 11090640
14128 11090640 11364727 11195902 11265434 10895641 10872683 10468964 10618128 10120711 9935039 9849716
14118 9849716 9915935 9987870 9861426 9535029 9370952 9160812 9018681 8980124 8881450 8655072
14108 8655072 8534502 8373017 8397385 8131509 7962784 8003676 7730658 7607113 7638346 7267206
$$ packed form
14175B8264035j93874q35258n18873o83646q84737m55144o76348n30998k95730
14166B3189427o61775l58200m45899n75571m84404k99887l43025m38426m54933
14157A9127307l76062k64189L560j378223M44628n33252j40318n02064l17924
14148A6063463l15593l7586p76958K15688n30865p8447o16059J22149j78026l5927
14138A3831839n62085l62150m2892j66794k11888k85726J9404m31105k47129m50834
14128A1090640K74087j68825O9532l69793k2958m03719J49164m97417j85672q5323
14118I849716O6219P1935j26444l26397j64077k10140j42131l8557r8674k26378
14108H655072j20570j61485K4368k65876j68725M0892k73018j23545L1233l71140
$$ plain form
14098 7267206 7651310 7696880 7443276 7325794 6892895 6831730 7183961 6870023 6837561 6867503
14088 6867503 6613994 6460497 6540105 6175131 6317007 6201072 6037431 5907671 6142157 5951323
14078 5951323 5580226 5974292 5407907 5750607 5532336 5522814 5653954 5538004 5329307 5588814
14068 5588814 5449504 5165926 5096319 5076973 4970343 4995155 4780699 4728510 4815520 4731458
14058 4731458 4893450 4901729 4705708 4628897 4777861 4601377 4330866 4683865 4211126 4157286
14048 4157286 3874184 4534894 4299589 4207090 4180849 4051202 3895941 4127385 4067361 4232903
14038 4232903 3944578 3742475 3636665 3789993 3851999 3791372 3733504 3790006 3581085 3276586
14028 3276586 3576098 3466839 3573012 3464700 3602789 3681669 3385828 3276661 3287178 3265807
$$ packed form
14098G267206L84104M5570k53604j17482m32899o1165L52231l13938l2462K9942
14088F867503k53509j53497P9608l64974J41876j15935j63641j29760K34486j90834
14078E951323l71097L94066n66385L42700k18271r522J31140j15950k08697K59507
14068E588814j39310k83578o9607j9346j06630K4812k14456n2189Q7010q4062
14058D731458J61992Q279j96021p6811J48964j76484k70511L52999m72739n3840
14048D157286k83102O60710k35305r2499k6241j29647j55261K31444o0024J65542
14038D232903k88325k02103j05810J53328O2006o0627n7868N6502k08921l04499
14028C276586K99512j09259J06173j08312J38089P8880k95841j09167J0517k1371
$$ plain form
14018 3265807 3279150 3253458 3364566 3393052 2977060 3274367 2865734 2969422 3063186 3183453
14008 3183453 3097450 3078344 2818384 2619332 3046693 3180618 2768563 2617322 2793713 2731343
13998 2731343 2667979 2301215 2879604 2457931 2473981 2394087 2639317 2507023 2240923 2183331
13988 2183331 2327526 2017532 2790734 2124039 2476197 2463230 2348282 2656911 3069010 3094467
13978 3094467 3236825 3732211 4262465 5428696 7392620 11258769 17109199 27064746 31564437
13969 31564437 21042865 13369050 9296687 7007155 5527183 5221525 4396391 4094353
13961 4094353 3906387 3321246 3192540 3385786 2892596 2981450 3221024 3034749 2757800 2730800
13951 2730800 2795254 2806752 2379925 2427493 2388193 2256767 2143537 2356962 2339621 2290993
$$ packed form
14018C265807J3343k5692J11108K8486m15992K97307m08633J03688R3764J20267
14008C183453q6003j9106k59960j99052M27361J33925m12055j51241J76391o2370
13998B731343o3364l66764N78389m21673J6050p9894K45230j32294k66100n7592
13988B183331J44195l09994P73202o66695L52158j2967j14948L08629M12099K5457
13978C094467J42358M95386N30254J166231J963924L866149N850430R955547M499691
13969C1564437j0521572p673815m072363k289532j479972l05658q25134l02038
13961D094353j87966n85141j28706J93246m93190Q8854K39574j86275k76949k7000
13951B730800O4454J1498m26827M7568l9300j31426j13230K13425j7341m8628
$$ plain form
13941 2290993 1806914 2083800 2046291 2174361 1810384 2195005 1663207 1838284 2119158 2053223
13931 2053223 1978868 1936016 1955917 1869822 1931025 1850601 2035504 1983642 1830019 1520554 1919494
13920 1919494 1609226 1874319 1725027 1923818 1722906 1771165 1734162 1716154 1815697 1680146
13910 1680146 1524109 1894095 1620468 1746377 1785785 1698693 1727069 1671995 1309607 1792328
13900 1792328 1667500 1483426 1363420 1528923 1475200 1149473 1304342 1789764 1464580 1827906
13890 1827906 1343366 1542142 1319316 1516862 1380196 1369106 1288096 1554506 1684938 1605938
13880 1605938 1299946 1344912 1209321 1566914 1286883 1527345 1165976 1378800 1383133 1340718
13870 1340718 1363366 1086642 1304744 1082025 1498499 1295880 1704521 1080579 1258858 1060643
$$ packed form
13941B290993m84079K76886l7509J28070l63977L84621n31798J75077K80874o5935
13931B053223p4355m2852J9901q6095O1203q0424J84903n1862j53623l09465L98940
13920A919494l10268K65093j49292J98791k00912M8259l7003j8008R9543j35551
13910A680146j56037L69986k73627J25909L9408q7092K8376n5074l62388M82721
13900A792328j24828j84074j20006J65503n3723l25727J54869M85422l25184L63326
13890A827906m84540J98776k22826J97546j36666j1090q1010K66410J30432p9000
13880A605938l05992M4966j35591L57593k80031K40462l61369K12824M333m2415
13870A340718K2648k76724K18102k22719M16474k02619M08641o23942J78279j98215
$$ plain form
13860 1060643 1381110 1181098 1312430 1261314 1226635 1126392 1010097 1420760 1001755 1158109
13850 1158109 1452130 1239810 1311747 1278365 1125528 954381 1344116 1227519 1076868 1010650
13840 1010650 1045069 1157072 966952 765095 1101462 1360346 1146070 1133351 1245903 902731
13830 902731 1014577 1012710 1027282 1290150 1258497 1386145 1715234 907649 974385 991474 1228349
13819 1228349 883960 935393 1173531 972878 1229132 1242041 911274 1142620 1162920 1090562
13809 1090562 1029598 1147208 1041727 626877 1159245 877892 678450 899038 955346 822325
13799 822325 896272 839419 824807 1149750 761165 1134610 869469 1297834 1083717 811228
13789 811228 1088549 675925 837307 729165 822643 866911 1214944 853642 909634 920150
$$ packed form
13860A060643L20467k00012J31332n1116l4679j00243j16295M10663m19005J56354
13850A158109K94021k12320P1937l3382j52837j71147L89735j16597j50651o6218
13840A010650L4419J12003j90120k01857L36367K58884k14276j2719J12552l43172
13830I02731J11846j867J4572K62868l1653J27648L29089q07585O6736J7089K36875
13819A228349l44389N1433K38138k00653K56254J2909l30767K31346K0300p2358
13809A090562o0964J17610j05481m14850N32368k81353j99442K20588N6308j33021
13799H22325P3947n6853j4612L24943l88585L73445k65141M28365k14117k72489
13789H11228K77321m12624J61382j08142R3478M4268L48033l61302N5992J0516
$$ plain form
13779 920150 686586 952844 1011660 971662 767488 505411 833347 643918 1176307 476190
13768 914781 686312 982984 753673 812241 726224 825373 692124 771116 967253 551447
13758 551447 1048391 1021136 476188 578571 686517 939347 695497 403691 574067 711590
13748 711590 676512 933737 612245 728222 501741 590509 516063 611282 975941 821265
13738 821265 910213 812764 701469 742426 778627 646846 973156 503392 585635 563100 636781
13727 636781 461335 939689 617377 755792 573206 458576 375215 725192 493410 893465
13717 893465 575157 753770 525584 102161 482829 524159 541792 533110 808162 476480
13707 476480 895146 694210 566586 803998 695059 540875 752043 791356 561339 563005
$$ packed form
13779I20150k33564K66258N8816l9998k04174k62077L27936j89429N32389D76190
13768I14781k28469K96672k29311N8568q6017R9149j33249P8992J96137m15806
13758E51447M96944k7255D76188J02383J07946K52830k43850k91806J70376J37523
13748G11590l5078K57225l21492J15977k26481Q8768p4446R5219L64659j54676
13738H21265Q8948r7449j11295M0957L6201j31781L26310m69764Q2243k2535P3681
13727F36781j75446M78354l22312J38415j82586j14630q3361L49977k31782M00055
13717H93465l18308J78613k28186A02161L80668M1330J7633q682K75052l31682
13707D76480M18666k00936j27624K37412j08939j54184K11168L9313k30017J666
$$ plain form
13697 563005 388115 646398 645942 851350 730187 508511 1043464 72076 554501 536732
13687 536732 286451 363179 519105 346984 388627 725230 625729 513002 357574 562008
13677 562008 636324 659257 366144 507321 418526 647602 439931 491368 543324 445296 833597
13666 833597 617971 431379 591031 363532 411234 387481 472119 506394 672702 434006
13656 434006 359070 671692 490182 538345 426588 609785 572455 552920 387913 472715
13646 472715 882708 407954 839783 415644 736600 48307 599722 467907 171222 573879
13636 573879 565622 293429 414309 243930 325121 278487 568960 403792 157403 735047
13626 735047 642143 583917 19213 497273 550044 359890 353561 68279 342506 669604 478112
$$ packed form
13697E63005j74890K58283m56K05408j21163k21676N34953G2076M82425j7769
13687E36732k50281P6728J55926j72121M1643L36603r9501j12727j55428K04434
13677E62008P4316K2933k93113J41177q8795K29076k07671N1437N1956r8028L88301
13666H33597k15626j86592J59652k27499M7702k3753Q4638L4275J66308k38696
13656D34006p4936L12622j81510M8163j11757J83197l7330j9535j65007Q4802
13646D72715M09993D07954M31829D15644L20956D8307N51415j31815A71222M02657
13636E73879q257k72193J20880j70379Q1191m6634K90473j65168A57403N77644
13626G35047r2904n8226A9213M78060N2771j90154o329F8279K74227L27098j91492
$$ plain form
13615 478112 546209 140796 467713 383638 264447 160593 497460 649697 593174 755470
13605 755470 364622 396087 575031 356517 168609 544848 511687 275705 544529 580686
13595 580686 639048 581789 493506 139727 439916 357448 675492 279521 693379 506740
13585 506740 -47999 344355 641098 255117 373971 164116 562817 272456 160271 445967
13575 445967 523715 349883 543478 333227 708114 265075 427369 292338 560470 451110
13565 451110 273946 602471 711922 121012 83128 312420 382325 -37501 448896 275837
13555 275837 386376 414989 521699 168870 223676 880189 305530 311458 262835 339829 314539
13544 314539 346128 49386 298910 430928 77328 447977 409666 209645 188565 424094
$$ packed form
13615D78112O8097A40796L26917q4075j19191j03854L36867J52237n6523J62296
13605G55470C64622L1465J78944k18514A68609L76239l3161k35982K68824L6157
13595E80686N8362n7259q8283A39727L00189q2468L18044B79521M13858j86639
13585E06740d7999C44355K96743B55117J18854A64116L98701B72456j12185K85696
13575D45967P7748j73832J93595k10251L74887B65075J62294j35031K68132j09360
13565D51110j77164L28525J09451A21012l7884K29292O9905c7501D48896j73059
13555B75837J10539K8613J06710A68870N4806O56513C05530N928m8623P6994k5290
13544C14539L1589D9386K49524J32018G7328L70649l8311k00021k1080K35529
$$ plain form
13534 424094 378593 250273 319547 28621 370834 546056 483889 569708 322561 307813 169279
13523 169279 96422 438112 370394 659392 404318 644834 147606 132727 277206 43896
13512 552731 336753 219478 320599 336841 43799 468872 402491 31185 532202 355444
13502 355444 544911 291681 456395 298416 295148 763499 311161 313514 340180 423403 369589
13491 369589 127700 175798 359183 35060 278054 529018 224567 334207 267784 184653
13481 184653 175764 214331 371122 278635 438038 339426 46289 256813 373076 95467 267245
13470 267245 281014 528059 182865 267368 309759 183935 290070 16233 468831 734245
13460 734245 688366 159529 47981 318310 130303 186981 203917 183170 360004 199682
$$ packed form
13534D24094m5501j28320O9274B8621L42213J75222o2167Q5819k47147j4748j38534
13523A69279p2857L41690o7718K88998k55074K40516A47606j4879J44479D3896
13512E52731k15978j17275J01121J6242D3799M25073o6381C1185N01017j76758
13502C55444J89467k53230J64714j57979l268M68351C11161K353K6666Q3223n3814
13491C69589A27700M8098J83385C5060K42994K50964B24567J09640o6423q3131
13481A84653q889L8567J56791r2487J59403r8612D6289K10524J16263I5467J71778
13470B67245J3769K47045A82865Q4503M2391j25824J06135A6233M52598K65414
13460G34245m5879A59529D7981K70329A30303N6678J6936k0747J76834j60322
$$ plain form
13450 199682 61638 287020 662970 407187 457386 -144869 425135 73811 380397 134580
13439 420819 255547 417178 180604 288465 27490 619589 211738 267629 328552 222300
13429 222300 216028 259183 190531 436709 512456 -1164 397194 373496 140659 87370 91103
13418 91103 132007 -60407 205239 142298 524014 294079 286253 508388 564149 367281 73405
13406 415569 253792 236166 56274 -6564 165128 122537 172466 519371 153311 429116 -72581
13394 427421 146729 -32256 322920 224610 165733 275938 29307 2276 293801 278793 242247
13383 242247 68914 401769 90907 167533 411563 314273 273815 121647 -42333 181533 161496
13372 161496 426448 367338 261635 144684 100177 80478 177577 346927 365642 24047 -39390
$$ packed form
13450A99682F1638K25382L75950k55783N0199a44869D25135G3811L06586A34580
13439D20819j65272J61631A80604J07861B7490N92099B11738N5891O0923j06252
13429B22300o272M3155o8652K46178P5747a164C97194k3698A40659n3289L733
13418I1103M0904f0407B05239o2941L81716k29935p826K22135N5761j96868G3405
13406D15569j61777j7626E6274f564A65128m2591M9929L46905A53311K75805g2581
13394D27421A46729c2256C22920r8310n8877J10205B9307B276K91525j5008l6546
13383B42247F8914L32855I0907P6626K44030r7290m0458A21647d2333A81533k0037
13372A61496K64952n9110j05703j16951m4507j9699R7099J69350J8715B4047c9390
$$ plain form
13360 517807 501916 41211 163076 751195 102767 144944 188547 237163 364134 166385
13349 160451 273122 25101 363332 163551 32283 195431 132823 401906 143871 282393
13339 282393 47167 297103 387238 573977 2232 -126502 131992 -15529 318004 338937 231283
13328 231283 422149 151624 376747 380602 366173 481222 80794 472622 393727 251519
13318 251519 38610 332155 165021 116520 318691 55068 163775 380908 325725 218990
13308 218990 199637 291583 288979 222734 166550 415217 218939 385965 164885 -47000 -33461
13297 -33461 310331 87699 129933 342851 200628 417144 288203 489780 84060 165747
13287 165747 271461 427180 181969 306037 -9262 147287 483675 424496 302263 -14768
$$ packed form
13360E17807j5891D1211J21865N88119A02767M2177M3603M8616J26971A66385
13349A60451J12671B5101L38231A63551C2283J63148o2608K69083A43871J38522
13339B82393D7167K49936R0135J86739B232a26502A31992a5529C18004K0933j07654
13328B31283J90866A51624K25123L855j4429J15049H0794L91828p8895j42208
13318B51519C8610K93545A65021m8501K02171E5068J08707K17133n5183j06735
13308B18990j9353R1946k604o6245n6184K48667j96278J67026A64885d7000J3539
13297c3461C10331H7699M2234K12918j42223K16516j28941K01577H4060Q1687
13287A65747J05714J55719A81969J24068i262A47287L36388n9179j22233a4768
$$ plain form
13276 307939 174112 212918 390969 211758 204336 420116 -86149 305026 166057 75304
13265 372932 246505 330165 371097 -125818 -27479 427668 178630 -156581 218293 149890
13255 149890 51913 176469 76409 191953 -19177 437767 159964 166704 386506 -76413 223353
13243 65252 132705 91023 -17501 202858 -101436 -105888 24031 231048 -8840 153993 87822
13232 87822 206068 64688 41601 139036 18351 406668 314806 494688 26730 71230 -72315
13220 17794 -97334 307050 292498 73196 113955 -1896 325342 61080 179469 94154 204374
13209 204374 213046 221461 256268 230225 46911 247952 161050 95668 307276 -17813 215236
13197 -187903 210830 34199 133551 -72353 177821 203115 389003 147607 66111 -122600
$$ packed form
13276C07939j33827L8806J78051j79211p422K15780h6149C05026j38969G5304
13265C72932j26427Q3660M0932a25818b7479D27668A78630a56581B18293o8403
13255A49890E1913J24556G6409J15544a9177D37767A59964O740K19802g6413B23353
13243F5252O7453m1682a7501B02858a01436m452B4031K07017h840A53993o6171
13232H7822J18246F4688k3087R7435A8351L88317r1862J79882B6730M4500g2315
13220A7794i7334C07050j4552G3196M0759a896C25342F1080J18389q5315J10220
13209B04374Q672Q415L4807k6043D6911K01041q6902o5382K11608a7813B15236
13197a87903B10830C4199R9352g2353A77821K5294J85888A47607F6111a22600
$$ plain form
13186 -245551 49480 -145021 -60878 187942 136232 -53446 227237 45897 -81902 128276 -148772
13174 37300 -382492 -431366 139227 9686 96557 -76962 11650 -88366 364826 -97394 350036
13162 74619 311360 17478 141757 31779 -70033 22530 75065 170899 183320 53087 281452
13151 281452 -92160 74708 105872 -74622 121452 -24692 -53415 182048 19083 -49399 -91881
13140 -91881 -60426 95847 384421 168690 34754 23449 173400 53217 83699 147672 -22767
13128 107209 51125 30848 -169308 25127 -50700 47508 182786 94201 85846 -5938 -163287
13117 -163287 29756 170993 119904 413892 146787 128195 220874 315229 -214022 -140780 123656
13105 -23864 12251 251925 138457 97174 -75436 172618 407085 165060 -190182 144043
$$ packed form
13186b45551D9480a45021f0878A87942n1710e3446B27237D5897h1902A28276a48772
13174C7300c82492m8874A39227I686Q6871g6962A1650h8366C64826i7394C50036
13162G4619K36741A7478J24279C1779g0033B2530N2535R5834J2421E3087K28365
13151B81452i2160G4708L1164g4622A21452b4692k8723A82048A9083d9399m2482
13140i1881L1455I5847K88574A68690C4754j1305J49951E3217L0482O3973b2767
13128A07209E1125k0277a69308B5127e0700D7508J35278q8585q355e938j57349
13117a63287B9756J41237n1089K93988A46787j8592R2679R4355b14022P3242A23656
13105b3864A2251K39674j13468m1283g5436A72618K34467A65060a90182A44043
$$ plain form
13094 -59780 403297 5335 -185941 161827 230737 109736 202439 5012 -172839 8481 -135484
13082 -17381 305381 62545 20297 68303 -209437 -99916 368757 17776 213298 -164789 115574
13070 -9273 124759 242121 -140551 311298 -86664 73392 -148434 129530 150586 -256064
13059 192757 77121 271926 91033 53628 183869 105792 69457 339375 -77320 -138597 -13020
13047 -60947 -169657 -92079 144406 -23205 -19881 211509 133456 57260 -85749 235547 237965
13036 237965 263922 459167 -267387 -20937 105610 339494 -311303 317850 266191 -20178
13025 12783 329641 213048 160117 192242 -50609 -173407 -25891 207563 -153776 3033 46241
13014 46241 606108 226261 69297 119225 367221 15883 159754 -112807 55973 132139 90111
$$ packed form
13094e9780D03297E335a85941A61827O8910A09736R2703E012a72839H481a35484
13082a7381C05381F2545B0297M8006b09437i9916C68757A7776J95522a64789A15574
13070i273A24759J17362a40551C11298h6664G3392a48434A29530K1056b56064
13059A92757G7121J94805I1033l7405J30241p8077l6335K69918g7320o1277a3020
13047f0947j08710P7578A44406b3205L324B11509p8053E7260h5749B35547K418
13036B37965K5957J95245b67387b0937A05610K33884c11303C17850n1659b0178
13025A2783L16858j16593n2931L2125e0609j22798b5891B07563a53776C033M3208
13014D6241N59867B26261F9297M9928K47996A5883J43871a12807E5973P6166m2028
$$ plain form
13003 90111 419485 181319 102086 6281 508138 -109772 301191 290767 -43700 140354 223146
12992 223146 -81611 82375 223529 532012 -174431 -142859 303225 -22483 -139909 102056
12981 34350 286384 252334 -87430 -75522 -40678 211241 53556 104661 165356 -76850 -184307
12970 -184307 121426 -19438 -10014 -55883 163450 196749 70874 -34138 325585 246188 25120
12958 179861 -198584 73390 -129778 136924 10428 252320 -61280 113508 49456 132146
12948 132146 103982 130080 28229 43959 -134632 243911 185367 -200928 -80205 39495 37190
12937 37190 205998 90997 293364 96672 104840 -57749 -37476 35928 -156771 223903 -69136
12925 228623 60209 199454 155059 277247 86201 10908 -108360 34027 58621 157259 29557
$$ packed form
13003I0111L29374A81319p9233F281N01857a09772C01191j0424d3700A40354Q2792
12992B23146h1611H2375J41154L08483a74431L1572C03225b2483j17426A02056
12981C4350K52034l4050h7430J1908L4844B11241E3556N1105O0695g6850j07457
12970a84307A21426a9438R424m5869A63450L3299G0874c4138C25585p9397B5120
12958A79861a98584G3390a29778A36924A0428K41892f1280A13508D9456Q2690
12948A32146k8164K6098B8229J5730a34632B43911n8544b00928h0205C9495k305
12937C7190J68808I0997K02367I6672Q168e7749K0273C5928a56771B23903f9136
12925B28623F0209J39245m4395J22188H6201A0908a08360C4027K4594R8638B9557
$$ plain form
12913 -161282 -143642 107417 127692 301494 -387857 -22136 -159252 115248 -39080 81489
12902 268263 217308 26819 169082 105032 -188412 -5484 1726 93874 -52917 -70623 5867 255093
12890 255093 -24851 -16985 355416 -51768 24095 196096 -77269 -129504 -172019 166681 169855
12879 169855 153747 185604 26082 42001 -119261 -32610 62063 24330 143107 385495 270224
12868 270224 -42329 54488 61568 -10428 152122 22165 -146456 350642 -172850 -131437 -194446
12857 -194446 193657 134927 118827 70664 138015 76771 -190261 343019 -118420 -125810 -5951
12845 -79393 35511 249890 -290483 -256384 -46292 -44066 -186010 -111547 -22072 212622 54899
12833 4995 134496 228803 87420 445686 218937 -30521 -98444 -166962 -46662 464199 -27818
$$ packed form
12913a61282J7640A07417K0275J73802c87857b2136j37116A15248c9080H1489
12902B68263n0955B6819J42263o4050a88412e484A726R2148e2917j7706E867K49226
12890B55093b4851P866C55416e1768B4095J72001g7269n2235m2515A66681L174
12879A69855j6108L1857B6082J5919a19261c2610F2063B4330J18777K42388j15271
12868B70224d2329E4488P080a0428A52122B2165a46456C50642a72850M1413o3009
12857a94446A93657n8730j6100m8163O7351o1244a90261C43019a18420p390e951
12845g9393C5511K14379b90483L4099d6292K226j41944P4463b2072B12622E4899
12833D995J29501R4307H7420L58266B18937c0521o7923o8518d6662D64199b7818
$$ plain form
12821 -216927 424108 -171918 -161332 -78338 75719 -68036 274045 -112534 -337811 -315648
12811 -315648 183461 -132193 -21991 -127510 161292 -50492 -43293 -47853 347044 12314 451079
12800 451079 -103059 -236642 190654 192362 198042 66005 -243415 -26243 74546 -97995 -5870
12788 316815 -204350 -164588 -142463 -102649 103307 366706 185105 -82266 39742 -96398 -55749
12777 -55749 -2395 126574 -132744 -223273 -260981 80339 -139678 -183601 -2751 -10802 2458 -201058
12764 -28183 -111367 -247272 -136162 -183736 186333 241996 301264 -198847 -176519 361699 229143
12753 229143 13274 79280 474201 134146 214733 280670 399188 -147455 -163496 -32353 150916
12741 -311237 71441 57900 264660 232884 142785 79466 104404 213441 124891 -208900 364921
$$ packed form
12821b16927D24108a71918J0586g8338G5719f8036B74045a12534k25277K2163
12811c15648A83461a32193b1991j05519A61292e0492P199m560C47044A2314M38765
12800D51079a03059j33583A90654J708N680F6005b43415b6243G4546i7995e870
12788C16815b04350L9762K2125L9814A03307K63399j81601h2266C9742i6398M0649
12777e5749b395A26574a32744r0529l7708H0339a39678m3923b751q051B458b01058
12764b8183q3184j35905J11110m7574A86333N5663N9268a98847K2328C61699j32556
12753B29143A3274O6006L94921A34146Q0587O5937J18518a47455j6041c2353A50916
12741c11237G1441j3541K06760l1776r0099o3319K4938J09037q8550b08900C64921
$$ plain form
12729 -207680 -14549 110640 -40767 -141293 -368203 11062 -51698 -3672 -184588 144991 -229628
12717 -172406 212404 125819 -204653 190422 -69283 72536 47899 -26334 -41150 -130270 -268365
12706 -268365 -57802 180986 -152736 79933 -396029 -102889 -275892 118116 209437 -154939
12695 -67704 187315 118346 247336 338959 197390 117803 307339 46667 69012 -280583 206776
12683 528225 59395 -67974 202640 111877 147308 256216 329810 -97524 354721 -114351 96599
12671 -40146 -40538 135184 -236234 -72843 -3548 20461 -122131 56765 100700 98874 155755 249291
12659 249291 94662 419988 -7047 300384 -9146 111553 206166 279723 69150 28560 229131
12648 229131 259824 489464 180446 535996 369067 -128302 151277 -83036 1475 534916
$$ packed form
12729b07680a4549A10640d0767j00526k26910A1062e1698c672j80916A44991b29628
12717a72406B12404q6585b04653A90422f9283G2536k4637b6334j4816q9120j38095
12706b68365e7802A80986a52736G9933c96029a02889j73003A18116R1321a54939
12695f7704A87315o8969J28990R1623j41569p9587J89536D6667K2345b80583B06776
12683E28225E9395f7974B02640r0763L5431J08908P3594i7524C54721a14351I6599
12671d0146l92A35184b36234g2843c548B0461a22131E6765M3935j826N6881R3536
12659B49291I4662L25326g047C00384i146A11553R4613P3557F9150B8560K00571
12648B29131L0693K29640A80446L55550j66929a28302A51277h3036A475N33441
$$ plain form
12638 534916 115288 393614 299335 406325 86033 169382 40410 229682 -51790 378508
12627 244949 -74521 82329 10417 141978 49294 199822 6988 -49583 264882 114729 220788
12616 220788 447895 227318 309831 185215 514900 190378 26660 186086 -95537 -125215
12606 -125215 207140 50795 47106 447899 -6036 58594 332454 30669 -122927 -106308 277676
12594 -37445 -220741 -159604 8306 125399 133285 107965 -89246 -132756 -52414 331196 171436
12583 171436 -36687 174172 41725 -44436 221372 171409 89326 -42574 59185 208753 -3348
12571 71876 340650 150581 -74154 32535 71601 210786 -340407 103667 -104924 184890
12560 6369 -139298 73655 4324 -24472 298408 113074 387841 -93260 190982 -215637 27547
$$ packed form
12638E34916A15288K78326r4279J06990H6033Q3349D0410J89272e1790C78508
12627B44949g4521H2329A0417J31561D9294J50528F988d9583B64882A14729J06059
12616B20788K27107k20577Q2513j24616L29685A90378B6660J59426i5537k9678
12606a25215B07140E0795l689M00793f036E8594K73860C0669a22927J6619B77676
12594c7445j83296O1137H306J17093P886k5320h9246m3510e2414C31196j59760
12583A71436c6687A74172D1725d4436B21372m9963q2083d2574E9185J49568c348
12571G1876K68774A50581g4154C2535L9066J39185c40407A03667a04924A84890
12560F369a39298G3655D324b4472B98408A13074K74767i3260A90982b15637B7547
$$ plain form
12548 -105189 -112878 -89474 358308 -91971 128168 -18533 -235016 -118416 138946 24846 -141165
12536 166731 239836 44341 225731 -214657 -33558 267198 56517 -207771 -241475 94434 81264
12525 81264 -147603 -3250 164845 -69954 -174413 125896 -114107 -137185 115457 183717 -269277
12513 -48671 -274713 44559 122050 -114527 248383 -16382 238953 191261 118631 230624 243036
12502 243036 459799 -113972 69318 192135 44464 -13660 152641 130604 -52101 -188247
12492 -188247 73905 37988 219897 63110 -199216 15087 10814 472406 -36541 50294 229069
12481 229069 15522 46295 -77496 31785 -350678 221404 -287493 412173 134973 97525
12471 97525 -22917 -36043 -73366 -115566 -195211 -22980 -112758 247693 260130 248386 -146491
$$ packed form
12548a05189p689K3404C58308i1971A28168a8533k16483J16600A38946B4846a41165
12536A66731P3105D4341J81390b14657c3558B67198E6517b07771l3704I4434j3170
12525H1264a47603c250A64845f9954j04459A25896a14107k3078A15457O8260b69277
12513d8671k26042D4559P7491a14527B48383a6382B38953m7692p2630J11993J2412
12502B43036K16763a13972F9318J22817D4464a3660A52641k2037e2101j36146
12492a88247G3905l5917J81909F3110a99216A5087m273M61592c6541E0294J78775
12481B29069A5522L0773g7496C1785c50678B21404b87493D12173A34973l7448
12471I7525b2917j3126l7323m2200p9645b2980q9778B47693J2437j1744a46491
$$ plain form
12459 154102 19860 267296 60481 -27504 -125627 10309 -263206 -97168 -1427 -125182 -318409
12448 -318409 136063 -153311 170400 -121452 -82605 180638 362798 66295 56022 185518
12438 185518 92127 -416091 406232 -90903 94388 54510 285426 15149 116974 -66345 -311699
12427 -311699 47510 -276635 -155283 67395 -74957 161825 331267 -12091 -209473 -188573
12417 -188573 187527 21172 -215153 -111441 164187 -2806 -276179 381847 83655 -3122 96598
12405 325039 -170649 -28984 -126671 -66775 -40910 -103806 -126299 119209 -67940 -246765 33165
12393 63871 -48548 -113368 -52208 128441 68688 -234663 119188 -6125 -374943 -319954 -371393
12382 -371393 165205 -21916 118141 646439 401125 -209192 -13881 205679 164528 92824
$$ packed form
12459A54102A9860K47436F0481b7504r8123A0309b63206i7168a427j23755j93227
12448c18409A36063a53311A70400a21452L8847A80638J82160F6295j0273J29496
12438A85518I2127d16091D06232i0903I4388l9878K30916A5149J01825f6345k45354
12427c11699D7510b76635J21352F7395g4957A61825J69442a2091j97382K0900
12417a88573A87527B1172b15153J03712A64187b806k73373C81847H3655c122I6598
12405C25039a70649b8984r7687N9896K5865o2896k2493A19209f7940j78825C3165
12393F3871d8548o4820e2208A28441n9753b34663A19188f125l68818N4989n1439
12382c71393A65205b1916A18141N28298k45314b09192a3881B05679m1151p1704
$$ plain form
12372 92824 135812 301203 -107768 -2204 -131631 -137028 167193 165628 -340013 -143508 89009
12360 14292 11331 -111211 326343 59314 156368 -298597 20191 -58358 18646 -85805 -11249
12348 25723 142680 29053 287208 -37147 268152 19320 26801 66763 -112755 12950 53649
12337 53649 242445 -379251 60536 -50499 391806 -125175 316921 127113 103169 182527
12327 182527 -118205 322992 -57174 135450 66994 -146670 30612 -119686 145370 -73754
12316 26762 -256145 -43581 186205 192165 -50896 -163397 -403396 -250743 -150149 45723 175140
12305 175140 -31204 -62603 -40693 -123893 193512 -115098 425246 428886 120991 20658 591464
12294 591464 -24517 196315 90120 -44222 -73406 -93778 206605 -81930 309216 21782 94376
$$ packed form
12372I2824M2988J65391a07768b204j29427n397A67193j565c40013a43508H9009
12360A4292k961a11211C26343E9314R7054b98597B0191e8358A8646h5805a1249
12348B5723J16957B9053K58155c7147B68152A9320P481L9962a12755A2950M0699
12337E3649J88796c79251F0536e0499C91806a25175C16921A27113k3944P9358
12327A82527a18205C22992e7174A35450F6994a46670C0612a19686A45370g3754
12316B6762b56145d3581A86205N960e0896j12501k39999J52653J00594D5723J29417
12305A75140c1204l1399K1910q3200A93512a15098D25246L640A20991B0658N70806
12294E91464b4517A96315I0120d4222k9184k0372B06605h1930C09216B1782P2594
$$ plain form
12283 94376 79593 -71403 -199004 188173 5199 27466 -190084 -40326 227994 294875 160127
12272 160127 239812 112199 -197720 184913 190220 -59006 -99545 -153365 183856 80668 -219546
12260 155434 -158550 67285 -295523 -85146 89513 4433 213951 74803 101479 -76088 82409
12248 493085 -9414 254375 360707 -212231 232350 117595 266469 275715 -1088 -340227 145849
12236 -51952 236968 342316 -2439 -74046 27028 -11739 148178 295633 174113 -937 7539
12224 -193876 437084 -18587 355983 -172608 -101672 400389 75435 186925 487873 54193
12213 179695 242280 93379 129564 568555 211374 340252 197144 -19569 108427 653483
12203 653483 84752 109486 11328 112947 369463 314605 233029 -293303 39560 347561 690270
$$ packed form
12283I4376j4783g1403j27601A88173E199K2267a90084d0326B27994O6881j34748
12272A60127P9685A12199a97720A84913N307e9006m0539n3820A83856H0668b19546
12260A55434a58550F7285b95523h5146H9513D433K09518G4803K6676g6088H2409
12248D93085i414B54375J06332b12231B32350j14755J48874R246a088l39139A45849
12236e1952B36968J05348b439p1607B7028a1739A48178J47455j21520i37G539
12224a93876D37084a8587C55983a72608P0936D00389G5435J11490L00948E4193
12213A79695O2585I3379L6185M38991B11374J28878j43108a9569A08427N45056
12203F53483H4752K4734A1328J01619K56516n4858q1576b93303C9560L08001L42709
$$ plain form
12192 690270 330032 202117 133054 237565 146245 383147 460324 358674 -199691 216950
12181 250498 488945 83614 328930 47676 393291 279870 237826 49770 12838 -111121
12170 102805 229385 369784 185453 191495 46998 30690 273873 39224 312990 370025 67274
12158 177392 -173291 204805 394141 67393 -133392 116136 361336 238700 -329488 306373
12147 319838 197134 313922 168657 263144 42814 -39452 63665 31957 -59432 203628 72946
12135 213373 121101 15370 -219615 240681 -69937 96166 -53324 -60800 249973 194403 -251834
12123 166866 -189413 19787 -151761 56054 179412 -154637 -500246 121862 332235 303403
12113 303403 36518 126270 93788 116292 383703 -64624 -208621 94274 -152849 70191 -63797
$$ packed form
12192F90270C30032j27915o9063J04511r1320K36902P7177j01650a99691B16950
12181B50498K38447H3614K45316D7676L45615j13421m2044D9770A2838a11121
12170A02805J26580J40399j84331O042D6998j6308K43183C9224K73766N7035F7274
12158A77392a73291B04805J89336F7393a33392A16136K45200j22636c29488C06373
12147C19838j22704J16788j45265R4487D2814c9452F3665l1708e9432B03628G2946
12135B13373r2272A5370b19615B40681f9937I6166e3324p476B49973n5570b51834
12123A66866a89413A9787a51761E6054J23358a54637l45609A21862K10373k8832
12113C03403C6518Q9752l2482K2504K67411f4624j43997I4274a52849G0191f3797
$$ plain form
12101 -148737 -70922 239216 -90614 -305638 -37584 -151476 249280 94814 259337 40123
12090 -45712 -126774 306812 52062 231572 -192378 -4943 -220152 100760 92641 -287651 -81411
12078 -287784 -152859 -121750 -247667 194108 245046 168204 -53001 -180681 -40319 48904 109968
12067 109968 9249 133932 -277819 -121644 64134 -166988 -60226 -151569 151864 289273
12057 289273 -60262 182954 263663 43461 29070 17803 110786 288141 113159 96881 510658
12046 510658 466365 340144 -68137 126935 -122130 92718 398 58028 252544 97983 -171871
12034 -202295 52106 177059 57790 -34393 26028 97493 71103 -231394 -283958 206635 -297250
12022 438151 48511 237196 44470 -357955 -17974 5643 -42780 147040 -13259 259927 -268037
$$ packed form
12101a48737g0922B39216i0614k15024c7584j13892B49280I4814J64523D0123
12090d5712q1062C06812E2062J79510a92378d943k15209A00760q119b87651h1411
12078b87784J34925L1109j25917A94108N0938p6842e3001j27680d0319D8904O1064
12067A09968I249J24683b77819a21644F4134a66988f0226r1343A51864J37409
12057B89273f0262A82954Q0709D3461j4391j1267R2983J77355A13159j6278M13777
12046E10658m4293j26221f8137A26935a22130I2718C98N7630J94516I7983a71871
12034b02295E2106J24953E7790c4393B6028P1465k6390b31394n2564B06635b97250
12022D38151D8511J88685D4470c57955a7974E643d2780A47040a3259B59927b68037
$$ plain form
12010 -88765 -303092 51249 124915 79659 -100027 -11051 34506 23859 -96849 -11687 98009
11998 145802 -8216 33369 91347 -213221 120834 -17697 -182650 238267 -14450 -249053 -100223
11986 -46650 -82111 139727 131077 -7891 40103 -170117 -123423 -169435 73941 121865 -137467
11974 -141858 96183 -1936 313544 -700532 11561 349886 -34830 129155 172935 -167880 129273
11962 -279865 -205212 84511 -140260 48612 23935 -17625 -10920 -227216 -17400 59846 11890
11950 305909 -21227 -145669 37294 77807 -81312 71634 -92048 46787 -258981 335626 186039
11939 186039 350328 83178 -191214 -55785 -72217 63735 -271509 214723 -68880 -126790 86209
11927 -252808 -134016 7875 234238 94453 168703 -395561 335360 264474 -140205 -2297 -345353
$$ packed form
12010h8765k14327E1249P3666m5256a00027a1051C4506j0647i6849a1687I8009
11998A45802h216C3369N7978b13221A20834a7697j64953B38267a4450k34603a00223
11986d6650l5461A39727q650g891D0103a70117M6694m6012G3941M7924a37467
11974a41858I6183a936C13544g00532A1561L38325c4830A29155M3780a67880A29273
11962b79865P4653H4511a40260D8612B3935a7625O705k16296a7400E9846A1890
11950C05909b1227j24442C7294M0513h1312G1634i2048D6787b58981C35626j49587
11939A86039J64289H3178a91214e5785j6432F3735b71509B14723f8880n7910H6209
11927b52808J18792G875K26363I4453P4250c95561C35360p0886a40205b297l43056
$$ plain form
11916 -345353 -212924 -266134 -931 -6281 78997 98981 -43804 207165 -202297 84595 -33016
11904 157551 -50702 116351 81858 -101655 63577 -115985 -174793 72659 -548527 84761 129
11892 -26022 -23374 105660 -153372 -242236 48092 -81509 -218686 140095 104513 167706 2949
11880 -60034 -6863 140463 180465 -244703 40742 -111924 -55653 265356 208512 -314314 209171
11868 -74262 -76612 -38721 246679 105897 34264 -92170 -96164 -1672 139233 -543062 -108943
11856 163807 101833 32416 -125532 -155527 -501905 90438 280221 -43139 -155714 155184
11845 -119823 -146125 -118157 124590 -356290 55900 43552 -4073 -65704 -130228 135612 160014
11834 160014 -252024 -463698 -6318 121837 47483 9520 170017 86654 6778 124847 -354891
$$ packed form
11916c45353J32429n3210i31n350G8997J9984d3804B07165b02297H4595c3016
11904A57551e0702A16351l4493a01655F3577a15985n8808G2659e48527H4761A29
11892b6022K648A05660a53372q8864D8092h1509j37177A40095l5582O3193B949
11880f0034f863A40463M0002b44703D0742a11924e5653B65356n6844c14314B09171
11868g4262k350L7891B46679A05897C4264i2170l994a672A39233e43062a08943
11856A63807o1974C2416a25532k9995l46378I0438J89783d3139j12575A55184
11845a19823k6302K7968A24590c56290E5900j2348d073o1631o4524A35612K4402
11834A60014b52024k11674f318A21837D7483I520J60497q3363F778J18069c54891
$$ plain form
11822 -218234 367086 106264 -51215 -45491 -49946 83686 -57845 36351 -189132 122859 45121
11810 283856 72294 44555 -83329 -64580 -45077 23586 36575 9427 -12455 -196176 49968
11798 -48875 123331 -121742 156621 -172593 -82167 -192031 -364926 -85594 -155884 -123721
11788 -123721 -523323 -19031 20431 -211391 94603 -218953 64612 22083 -46830 -404239 -193207
11776 -298437 513474 -199609 42814 -228452 -79319 -268830 103149 -24531 15282 -70353
11765 -49312 378136 66769 146909 -27138 -100548 124588 -155790 253426 108892 -78030 -137735
11754 -137735 -142541 14186 -217875 -188162 -18030 -74646 139885 -290653 39296 216322 -381071
11742 9763 -125113 -127336 84727 -168507 -108194 -29939 301565 -141767 -98267 175632 239798
$$ packed form
11822b18234C67086A06264e1215N724m455H3686e7845C6351a89132A22859D5121
11810B83856G2294k7739h3329J8749J9503B3586J2989I427a2455j83721D9968
11798d8875A23331a21742A56621a72593h2167j09864j72895h5594p0290L2163
11788a23721l99602a9031B0431b11391I4603b18953F4612B2083d6830l57409a93207
11776b98437E13474a99609D2814b28452g9319j89511A03149b4531A5282g0353
11765d9312C78136F6769Q0140b7138p3410A24588a55790B53426A08892g8030n9705
11754a37735m806A4186b17875K9713a8030n6616A39885b90653C9296J77026c81071
11742I763a25113k223H4727a68507O0313b9939C01565a41767M3500A75632O4166
$$ plain form
11731 239798 -219403 -11309 -21680 15995 384867 330618 208459 -203174 302253 182426
11721 182426 9974 -120849 -155424 -311567 90070 -234532 55063 9503 235365 -231745 -178419
11710 -178419 149159 -148258 -166079 34809 -259998 73419 -48330 -135085 81723 141590 391092
11699 391092 -218278 145679 99324 189897 -192391 -232687 166949 -41558 -91614 -23981 191925
11687 -86050 158588 105649 -401678 -206739 -5157 -217553 391062 -127557 -160193 116504
11676 -204618 304737 -64093 31951 185571 -26537 30306 446167 -5438 -167052 -128116 41079
11664 45355 -194811 -78927 3003 127643 -60054 251569 -45544 -203134 85517 -12251 127118
11652 -460300 -55033 -88855 -376157 -95360 138401 4101 67106 -239144 62310 -194783 217782
$$ packed form
11731B39798b19403a1309j0371A5995L68872n4249j22159b03174C02253j19827
11721A82426I974a20849l4575j56143I0070b34532E5063I503K25862b31745N3326
11710a78419A49159a48258j7821C4809b59998G3419d8330q6755H1723N9867K49502
11699C91092b18278A45679m6355R0573a92391m0296A66949d1558n0056b3981A91925
11687h6050A58588n2939d01678J94939e157k12396C91062a27557l2636A16504
11676b04618C04737f4093C1951J53620b6537C0306M15861e438j61614L8936D1079
11664D5355a94811g8927C003J24640f0054B51569d5544j57590H5517a2251A27118
11652d60300e5033l3822k87302i5360A38401D101O3005b39144F2310a94783B17782
$$ plain form
11640 54678 -290291 -39744 -157290 -29235 228653 -320427 -70399 95253 225154 420646
11630 420646 -115738 -36307 45624 9238 -292761 -65408 -36001 97976 -135737 259815 26782
11618 -385711 -146524 -54914 -117455 362756 -391349 124839 99555 6826 -33001 -91987 -229145
11607 -229145 18511 64317 316919 -67075 135780 148627 227087 -50969 -54779 14533 81532
11596 81532 51108 -70113 127812 144823 -183766 52670 91559 135980 26066 611370 -50916
11584 -138179 71554 -224834 175629 -279238 39747 -13855 -90986 -4081 -155563 296571 72314
11572 33288 -50278 110648 -260787 166342 42106 95337 91226 -164238 17925 75264 155980
11561 155980 49909 265443 -191963 -185100 -25485 -53945 -40351 -63535 -20342 21598 -184935
$$ packed form
11640E4678b90291c9744j17546b9235B28653c20427g0399I5253J29901J95492
11630D20646a15738c6307D5624I238b92761f5408K9407I7976a35737B59815B6782
11618c85711a46524e4914o2541C62756c91349A24839k5284F826c3001n8986j37158
11607b29145A8511M5806K52602f7075A35780J2847P8460e0969l810A4533O6999
11596H1532l0424g0113A27812J7011a83766E2670L8889M4421B6066N85304e0916
11584a38179G1554b24834A75629b79238C9747a3855p7131d081j51482B96571G2314
11572C3288e0278A10648b60787A66342D2106N3231m111a64238A7925N7339Q0716
11561A55980D9909K15534a91963O863b5485k8460J3594k3184b0342B1598a84935
$$ plain form
11549 15563 307558 147369 -74709 -55247 -364569 -26660 -75074 -72770 169803 -33199 -334316
11538 -334316 138592 -135918 -150541 84507 61177 -23514 -56964 -133667 741 -38050 132272
11526 -427635 57233 279518 -266029 308612 66857 -162664 -67083 147570 -250862 219813
11515 494192 350999 -185023 139433 6636 -192634 366136 -209013 276041 106439 128116
11505 128116 224200 74943 -123730 285227 157205 143566 127028 347002 326625 -8969 142425
11493 108671 348914 -59690 -41293 73388 293314 224682 66579 488991 82056 40849 324645
11482 324645 161949 193300 -8055 -23420 216399 338486 280606 175130 140083 277223 145175
11471 145175 235345 120608 20864 204128 168730 171194 113613 337722 701 -23017 156806
$$ packed form
11549A5563K91995A47369g4709J9462l09322b6660m8414K304A69803c3199l01117
11538c34316A38592a35918j4623H4507k3330b3514l3450p6703G41c8050A32272
11526d27635E7233K22285b66029C08612F6857a62664f7083A47570b50862B19813
11515D94192j43193a85023A39433F636a92634C66136b09013B76041A06439K1677
11505A28116R6084G4943a23730B85227j28022j3639j6538K19974k0377h969A42425
11493A08671K40243e9690J8397G3388K19926o8632F6579M22412H2056D0849K83796
11482C24645A61949L1351h055j5365B16399J22087n7880j05476l5047J37140j32048
11471A45175R0170j14737B0864J83264l5398K464n7581K24109G01b3017A56806
$$ plain form
11459 293076 87183 301984 226418 316727 227533 177566 32958 144138 346537 314293 213040
11448 213040 96162 557004 -80393 198049 318465 68577 161036 -37284 -21650 89120 104730
11437 104730 139649 311662 64597 -107879 216419 -49868 156632 -115974 -116826 -95253 -157542
11426 -157542 245562 62198 -21803 173303 87027 -183652 -78650 295667 352531 27688 504940
11415 504940 -46690 98829 -180826 17600 57983 270653 -170942 -151187 -82612 15784 446925
11404 446925 79211 -156374 -256733 -18655 125599 270479 -119185 13398 1921 62300 -22727
11392 74214 42476 134738 232495 -257777 45373 -235218 81487 -252912 -197882 142674 142403
11381 142403 219886 34525 217735 -109873 -136487 -40728 -59996 138360 -306415 -354288 160620
$$ packed form
11459B93076H7183K14801p5566R0309q9194m9967C2958J11180K02399l2244j01253
11448B13040I6162M60842h0393A98049J20416F8577R2459c7284J5634H9120J5610
11437A04730L4919J72013F4597a07879B16419d9868A56632a15974q52K1573o2289
11426a57542B45562F2198b1803A73303q6276a83652g8650B95667N6864B7688M77252
11415E04940d6690I8829a80826A7600M0383K12670a70942J9755O8575A5784M31141
11404D46925G9211a56374j00359a8655A25599J44880a19185A3398A921O0379b2727
11392G4214l1738R2262R7757b57777D5373b35218H1487b52912N5030A42674k71
11381A42403P7483C4525J83210a09873k6614d0728j9268A38360c06415m7873A60620
$$ plain form
11369 -56443 53202 12205 -354336 -257519 -49254 -169439 -238096 -50605 -180185 -44968 30306
11357 -12049 118625 164104 100501 67219 -87752 43380 -78331 55396 10484 5575 89191 109573
11345 109573 -56696 -246459 452442 -133286 5913 -129625 -413238 48498 -204423 16904
11334 -39055 -326832 49437 -351292 -118981 159050 -216285 240351 -216343 -270204 232373
11323 37030 121636 87594 -107505 -58837 -87654 -31581 -128117 -8582 -272016 -213248 -273333
11312 -273333 176373 72807 -116055 59574 -186390 34637 -310250 -68014 100134 -86830
11301 -20051 -194734 -55559 -62018 88065 140736 -176965 191780 125068 -242019 186726 265101
11290 265101 145884 -207391 15449 -112229 195272 -79469 27606 -6552 -252074 287795
$$ packed form
11369e6443E3202A2205c54336R6817d9254j20185o8657e0605j29580d4968C0306
11357a2049A18625M5479o3603l3282h7752D3380g8331E5396A0484m909Q3616K0382
11345A09573e6696j89763D52442a33286E913a29625k83613D8498b04423A6904
11334c9055k87777D9437c51292a18981A59050b16285B40351b16343n3861B32373
11323C7030Q4606l4042a07505M8668k8817c1581r6536h582k63434N8768o0085
11312b73333A76373G2807a16055E9574a86390C4637c10250f8014A00134h6830
11301b0051j74683e5559o459H8065N2671a76965A91780o6712b42019A86726P8375
11290B65101j19217b07391A5449a12229A95272g9469B7606f552k45522B87795
$$ plain form
11279 -132595 169336 -68724 -51708 -220465 21042 56830 -256462 272729 -45442 -144249 139131
11267 -184533 97506 262697 -129729 73818 -224327 118913 -44185 55864 -201934 -236503
11257 -236503 272534 -223635 94965 -155645 -72424 280568 3823 -213195 -135417 23659 70044
11246 70044 166783 90621 33361 135693 7187 102230 49131 -301474 -179557 -68521 -206839
11235 -206839 213025 -28949 -322918 36308 265967 62815 -82710 -235005 -86014 -62163 181086
11223 -241295 20815 -183326 -239781 -167263 70955 -184659 1315 -65329 311007 -111350 408134
11211 122887 -46288 215283 58253 -23712 -128022 -12302 177093 118717 -383301 -114654
11200 9464 32046 -88580 -130740 -159252 -37625 299138 7679 -87212 -19045 -208919 -96314 107722
$$ packed form
11279a32595A69336f8724J7016j68757B1042L5788b56462B72729d5442r8807A39131
11267a84533I7506J65191a29729G3818b24327A18913d4185E5864b01934l4569
11257b36503B72534b23635I4965a55645g2424B80568C823b13195P7778B3659M6385
11246G0044R6739p6162C3361J02332G187R5043D9131c01474J21917f8521j38318
11235b06839B13025b8949k93969C6308K29659F2815h2710j52295h6014K3851A81086
11223b41295B0815a83326n6455P2518G0955a84659A315f5329C11007a11350D08134
11211A22887d6288B15283E8253b3712j04310a2302A77093n8376c83301a14654
11200I464K2582h8580m2160k8512c7625B99138G679h7212a9045j89874i6314A07722
$$ plain form
11187 172134 -241070 -271355 -329430 -18525 47996 -251618 168313 -256877 -151159 422560
11176 36201 -212609 -24005 -93628 -42065 -160505 50782 -292781 -274644 -296122 103015 -511785
11164 -120923 180965 115573 -148872 164944 -225114 -56848 -227199 -23531 -121504 -163406
11154 -163406 -429171 -34343 -182061 218433 9593 -265393 200201 187498 282006 115896
11143 -22695 -36752 49225 205607 244319 229863 44395 -153033 91373 2151 -138705 399434
11131 -35534 -194507 125535 -222670 -146423 3582 195511 5367 60923 47522 260718 176706
11120 176706 320268 288582 -18440 293299 146241 -151018 103306 109084 139484 410726
11110 410726 3312 106099 339437 35278 177599 132348 -123569 -147440 321160 62891 -39907
$$ packed form
11187A72134b41070l0285n8075a8525D7996b51618A68313b56877J05718D22560
11176C6201b12609b4005o9623d2065j18440E0782b92781J8137k1478A03015e11785
11164a20923A80965o5392a48872A64944b25114e6848j70351b3531r7973m1902
11154a63406k65765c4343j47718B18433I593b65393B00201j2703R4508A15896
11143b2695j4057D9225J56382L8712j4456D4395a53033I1373B151a38705C99434
11131c5534j58973A25535b22670P6247C582J91929E367N5556j3401K13196q4012
11120A76706J43562l1686a8440B93299A46241a51018A03306N778L0400K71242
11110D10726C312J02787K33338C5278J42321m5251a23569k3871C21160F2891c9907
$$ plain form
11098 -82829 91282 369677 64487 2196 278450 -25370 257668 227628 30313 -56868 -66467
11087 -66467 377616 329955 409676 303341 57450 265693 160024 415032 128926 303644
11077 303644 103583 334272 79987 346305 99575 206312 500485 -390770 359119 448655
11067 448655 344797 262887 289258 34089 445184 255656 362654 323798 352195 413276 381965
11056 381965 522730 239148 464035 386066 406929 391695 374431 483019 435102 569183
11046 569183 350250 727399 799406 931507 826111 729890 605197 475278 961763 717684
11036 717684 1138930 928666 769266 824586 695567 1211811 592869 765474 818658 735250
11026 735250 953043 1056679 845417 690985 1047007 1259472 969741 688987 1057347 952171
$$ packed form
11098h2829I1282K78395F4487B196K76254b5370B57668l0040C0313e6868r599
11087f6467C77616m7661P9721j06335E7450K08243j05669K55008A28926J74718
11077C03644A03583K30689G9987K66318I9575J06737K94173c90770C59119Q9536
11067D48655j03858q1910K6371C4089M11095j89528J06998l8856K8397O1081l1311
11056C81965J40765B39148K24887p7969K0863j5234j7264J08588m7917J34081
11046E69183k18933L77149P2007J32101j05396r6221j24693j29919M86485k44079
11036G17684M21246k10264j59400N5320j29019N16244E92869J72605N3184q3408
11026G35250K17793J03636k11262j54432L56022K12465k89731k80754L68360j05176
$$ plain form
11016 952171 1060496 796594 824059 1137149 730274 1337280 1008545 719906 842234 914373
11006 914373 612571 816963 1098597 686556 858888 628268 829761 911600 790456 832007
10996 832007 558426 413317 929659 563533 858904 879775 922231 892861 930534 716472
10986 716472 958473 714563 914273 765823 595274 759008 1032946 528864 985417 867392
10976 867392 817141 705153 708943 955133 797017 1041322 1160565 660626 1319137 1375488
10966 1375488 1396828 1481078 1710595 1943777 1752376 2112831 2504963 2774487 3099412 3361841
10956 3361841 3650305 3852621 3619807 3867047 3919159 3355915 2321205 2492875 1764008
10947 1764008 1648108 1452262 1447883 1372742 1204149 1190179 798427 1070213 1326968 604510
$$ packed form
11016I52171J08325k63902K7465L13090m06875O07006l28735k88639J22328P2139
11006I14373l01802K04392K81634m12041J72332k30620K01493Q1839j21144M1551
10996H32007k73581j45109N16342l66126K95371K0871M2456k9370L7673k14062
10986G16472K42001k43910J99710j48450j70549J63734K73938n04082M56553j18025
10976H67392n0251j11988L790K46190j58116K44305J19243m99939O58511N6351
10966A375488K1340Q4250K29517K33182j91401L60455L92132K69524L24925K62429
10956C361841K88464K02316k32814K47240N2112n63244j034710J71670p28867
10947A764008j15900j95846m379p5141j68593j3970l91752K71786K56755F04510
$$ plain form
10936 934259 737938 903247 320749 247142 462032 132455 183007 490867 94013 204232
10926 204232 43602 138985 238105 405580 327225 410666 -29747 161486 230706 94175 -81120
10914 93055 104523 -85700 90380 29911 -62072 -310603 305251 179671 61387 120643 91294
10903 91294 108755 273300 496410 32713 208449 -190605 -5591 69749 302682 496 62948
10892 62948 -173756 277370 22178 182421 35228 -152994 89943 48109 -265422 19038 274227
10881 274227 -195399 186406 -123580 -218239 156475 -84116 -40258 -157081 -15766 60501
10870 -120742 -52933 80245 -179217 -78067 71503 -180069 13065 240611 -82496 -357968 238566
10858 -304883 -47177 -33206 379049 -201539 105976 -135224 77485 -34124 -73760 128516
$$ packed form
10936I34259j96321J65309C20749p3607K14890A32455N0552L07860I4013J10219
10926B04232D3602R5383R9120J67475p8355Q3441b9747A61486O9220I4175h1120
10914I3055J1468h5700I0380B9911f2072k48531C05251j25580F1387N9256k9349
10903I1294J7461J64545K23110C2713J75736a90605e591F9749K32933D96O2452
10892F2948a73756B77370B2178J60243C5228a52994H9943m1834b65422A9038K55189
10881B74227a95399A86406a23580r4659A56475h4116d0258j16823a5766F0501
10870a20742e2933H0245a79217g8067G1503a80069A3065K27546h2496k75472B38566
10858c04883d7177J3971C79049b01539A05976a35224G7485c4124l9636A28516
$$ plain form
10847 -217510 179881 465608 28916 -145197 -142865 -281086 -109516 191818 -13105 36553
10836 -3540 -67547 25882 84173 -48542 -50131 231771 -409606 -158658 60771 -38287 -28074
10825 -28074 150877 15823 272432 66367 102816 116768 192783 -69361 -42477 370477 -21031
10813 -27942 96615 -84813 121879 -103094 -60993 -95745 12351 -356373 -23481 -62398 -339615
10802 -339615 92893 -17817 -49544 136694 1264 12480 -74949 -212578 -313006 -187839 255489
10790 36486 12312 180314 -139755 23853 217827 150083 -72018 -47900 -166237 -83025 31341
10778 -249956 108172 -11936 -43138 335704 234713 -41508 -108999 -168294 -218080 -146419 -42142
10766 -86424 67030 -61848 103648 -23441 -115321 -344264 18228 -91136 282008 -77985 -428431
$$ packed form
10847b17510A79881K85727B8916a45197K332j38221a09516A91818a3105C6553
10836c540o4007B5882N8291d8542j589B31771d09606a58658F0771c8287J0213
10825b8074A50877A5823K56609F6367L6449J3952P6015f9361K6884C70477b1031
10813b7942I6615h4813A21879a03094M2101l4752A2351c56373b3481l8917k77217
10802c39615I2893a7817l1727A36694A264J1216g4949j37629j00428J25167B55489
10790C6486A2312J68002a39755B3853J93974o7744g2018K4118j18337h3025C1341
10778b49956A08172a1936l1202C35704j00991d1508o7491n9295m9786P1661d2142
10766h6424F7030f1848A03648b3441r1880k28943A8228i1136B82008g7985l50446
$$ plain form
10755 -428431 -229436 -19068 -122178 -167917 141476 342853 41978 -301636 260445 151838
10745 151838 101294 -22470 -147483 7320 -290482 -203099 186002 -347204 -53038 -427491 -320369
10734 -320369 -205034 241616 -169922 72207 -31364 -36639 2448 117356 84555 -38840 114987
10722 -172452 -192201 -70135 -263031 -12875 100408 -389907 -233829 71917 -92981 60703 -122754
10710 -13208 251101 -143273 11474 -46532 -154638 78642 -5375 -374618 7532 -121289 -20030
10698 103193 -194231 -135877 -61814 -101378 -154248 -63664 372116 -44912 123750 6096 -80635
10686 74756 -235229 -177883 -373295 -205078 -236142 381160 105095 -29422 -184144 21393
10675 -191543 -146917 131118 -55388 7086 -552 132683 34537 -133538 -206039 109811 -11414
$$ packed form
10755d28431J98995a9068j03110m5739A41476K01377D1978c01636B60445j08607
10745A51838n0544b2470j25013G320b90482Q7383A86002c47204e3038l74453J07122
10734c20369J15335B41616a69922G2207c1364n275B448J14908l2801c8840A14987
10722a72452j9749g0135j92896a2875A00408c89907J56078G1917i2981F0703a22754
10710a3208B51101a43273A1474d6532j08106G8642e375l69243G532a21289b0030
10698A03193a94231N8354f1814l9564n2870f3664C72116d4912A23750F096h0635
10686G4756b35229N7346j95412J68217l1064C81160A05095b9422j54722B1393
10675a91543M4626A31118e5388G086e52A32683C4537a33538p2501A09811a1414
$$ plain form
10663 341271 5032 -60293 -98904 -194174 23509 -78469 57846 -42927 -118985 92496 -133363
10651 88243 -282253 516672 187826 133760 -196873 157930 -76259 94362 -52902 -74314 18928
10639 -165820 27048 155800 -2284 112634 128031 -270026 135304 -37692 -207258 90219 -403529
10627 215301 309854 45485 -30899 -212981 -47330 172890 -237604 -260307 178449 74266 228228
10616 228228 100952 -306450 -169075 213136 -237259 29105 6146 -188917 36536 -374463
10605 -102555 96844 -60007 -84899 248354 -21615 -177424 -65405 90718 -24990 -258355 -426354
10594 -426354 -72473 -92371 -107408 -153854 -51065 -28533 -69593 195845 -6293 122461 -12783
10582 -79774 -179209 59760 -138681 49723 -26882 -95872 4880 -239965 323852 41314 77914
$$ packed form
10663C41271E032f0293l8611r5270B3509g8469E7846d2927p6058I2496a33363
10651H8243b82253E16672A87826n4066a96873A57930g6259I4362e2902k1412A8928
10639a65820B7048J28752b284A12634J5397b70026A35304c7692j69566I0219d03529
10627B15301R4553D5485c0899j82082d7330A72890b37604k2703A78449G4266J53962
10616B28228A00952c06450J37375B13136b37259B9105F146a88917C6536c74463
10605a02555I6844f0007k4892B48354b1615j55809f5405I0718b4990k33365j67999
10594d26354g2473j9898j5037m6446e1065K2532m1060A95845f293A22461a2783
10582g9774r9435E9760a38681D9723b6882o8990D880b39965C23852D1314L6600
$$ plain form
10571 77914 154885 207041 -195552 11023 -89658 98433 299451 15922 287727 134404 -62520
10559 -278032 -19884 132787 -50440 -9302 304068 -126217 247438 -190477 -315300 -90240
10548 -182626 139190 -616236 -93858 -21417 -31501 44641 -16087 -107486 -96790 -227476 -26201
10536 154860 -211170 33979 -202292 -259687 -164449 -293726 62100 202082 22111 -207802
10525 -187870 89083 62193 -87256 164376 -81561 -36524 -140523 -14059 85103 39957 -215791
10513 -382514 -193215 31166 -95259 -90401 -54864 107403 -89752 -35342 86434 -102167 -16141
10501 8349 -141178 -408231 24133 -291499 -232757 -35873 -176804 -298746 -311120 -220143 167054
10489 -416338 -319655 -63503 14062 -178904 -246659 142155 4405 -249957 -111225 -321242 142463
$$ packed form
10571G7914P6971N2156a95552A1023h9658I8433K01018A5922K71805A34404f2520
10559b78032a9884A32787e0440i302C04068a26217B47438a90477j24823i0240
10548a82626A39190f16236i3858b1417j0084D4641a6087r1399J0696j30686b6201
10536A54860b11170C3979b02292n7395R5238j29277F2100J39982B2111b07802
10525a87870H9083k6890h7256A64376h1561c6524j03999a4059H5103C9957b15791
10513c82514J89299C1166i5259M858L5537A07403h9752c5342H6434a02167a6141
10501H349a41178k67053B4133b91499N8742c5873j40931j21942j2374R0977A67054
10489d16338R6683f3503A4062a78904o7755A42155D405b49957a11225k10017A42463
$$ plain form
10477 38347 66987 -143144 -481493 159169 164941 194167 241004 330615 -134710 73347 134077
10466 134077 -30200 -91280 -50908 31510 66094 -36613 -244089 -353659 -21535 -159964 133062
10454 -153701 -117525 87455 -234821 21003 -17195 -293016 29790 -175555 -212355 56759 -151612
10442 137496 158708 -244874 -180312 -157499 140988 -87040 -177720 -268147 97573 -105060 69443
10430 233070 -2136 260896 -449316 207352 -87246 -242167 -138638 -27725 -165956 -63497
10419 241121 -89167 -45298 -342785 -53355 -461365 -58988 41623 151177 -125129 -5683 221657
10407 131668 -61079 -158043 124197 -53834 185849 -142037 41791 -117566 -31673 -185479
10397 -185479 80320 204009 42868 116907 -30665 19932 273568 71337 57490 5297 102737
$$ packed form
10477C8347K8640a43144l38349A59169N772K9226M6837Q9611a34710G3347O0730
10466A34077c0200o1080M0372C1510L4584c6613k07476j09570b1535j38429A33062
10454a53701L6176H7455b34821B1003a7195k75821B9790a75555l6800E6759a51612
10442A37496K1212b44874O4562K2813A40988h7040r0680r0427I7573a05060F9443
10430B33070b136B60896d49316B07352h7246j54921J03529b7725j38231f3497
10419B41121h9167M3869k97487e3355m08010e8988D1623J09554a25129e683B21657
10407A31668f1079r6964A24197e3834A85849a42037D1791a17566c1673j53806
10397a85479H0320J23689D2868P4039c0665A9932K53636G1337j3847E297R7440
$$ plain form
10386 102737 106171 214698 4596 -134147 -66365 107752 -96680 -201549 278200 -128262 65794
10374 116757 -55975 -119318 -44671 -196467 141439 362303 193411 323292 94901 140885
10364 140885 595722 385861 181414 287061 235713 -1715 409660 456265 342098 244699
10354 244699 578346 433953 257726 519386 714500 413756 400700 588067 244949 102665
10343 337231 357641 46066 135317 220876 352885 292431 614032 528112 879216 543116 383749
10332 383749 276426 342117 672966 -141168 -76822 493955 4956 231999 -8179 125807 388779
10321 388779 398759 453443 367476 372766 154599 -53263 -160696 -181128 267785 25074 154573
10310 154573 4429 -47025 11507 38093 237525 229716 -64431 -54002 49781 558319 48709
$$ packed form
10386A02737L434J08527D596a34147f6365A07752i6680j04869B78200a28262F5794
10374A16757e5975o3343d4671j51796A41439K20864j68892J29881I4901M5984
10364A40885M54837k09861A81414J05647n1348a715D09660M6605j14167r7399
10354B44699L33647j44393j76227K61660J95114l00744j3056J87367B44949A02665
10343C37231K0410D6066Q9251Q5559J32009o0454L21601q5920L51104l36100j59367
10332C83749j07323O5691L30849a41168O4346D93955D956K27043h179A25807K62972
10321C88779R980N4684q5967N290A54599e3263j07433k0432B67785B5074J29499
10310A54573D429d7025A1507K6586J99432p809f4431J0429D9781N08538D8709
$$ plain form
10298 -151344 146840 4247 271934 -131159 -81683 64205 133196 156293 135118 -82469 -33349
10286 172802 136836 464197 -114887 190653 393090 286705 8725 191207 27213 282281
10276 282281 73587 28421 182501 -38768 40370 -264606 85465 109950 143050 -197880 -21801
10264 -37130 -45877 -294583 -189870 3775 -80020 91957 -104851 27830 45146 214162 -334880
10252 -212034 161753 -110286 -112494 -446097 -18737 78680 73687 59345 -208407 207839 138817
10241 138817 -62269 11207 89290 -233970 251726 16845 -139605 34602 -112121 -180448 184891
10229 -216782 429354 3796 -84184 136004 44773 -357256 -134281 -129135 -190146 -64805 -25403
10217 -166481 -183754 36749 -178356 -93072 187541 -38884 -248036 -223355 195577 212647 -206355
$$ packed form
10298a51344A46840D247K67687a31159M9476F4205O8991K3097k1175h2469c3349
10286A72802l5966L27361a14887A90653K02437j06385H725J82482B7213K55068
10276B82281G3587B8421J54080c8768D0370b64606H5465K4485L3100a97880b1801
10264c7130q747k48706J04713C775h0020I1957a04851B7830J7316J69016c34880
10252b12034A61753a10286k208l33603a8737G8680m993j4342b08407B07839o9022
10241A38817f2269A1207P8083b33970B51726A6845a39605C4602a12121o8327A84891
10229b16782D29354C796h4184A36004D4773c57256a34281N146o1011f4805b5403
10217a66481j7273C6749a78356Q5284A87541c8884k09152K4681A95577J7070b06355
$$ plain form
10205 -340227 286000 196083 -131949 -126974 138737 -294603 -323618 64956 -100754 -298259
10195 -298259 85713 -313911 -303700 147324 14669 393761 103719 -149609 14678 -975 -59874
10184 -59874 -126671 82864 -152979 -129967 68534 105529 -93337 -41969 -64419 -391109 -124925
10172 79751 -69061 -362457 -118098 334855 13341 135602 56768 -340664 -67088 -395721
10162 -395721 38477 75038 70421 -109924 -51087 -194507 166918 -195430 -98541 109980 -53755
10150 -35879 -354110 -27577 -337093 -83769 -489604 -195274 -177319 -167659 172572 18970 7971
10138 -38270 -153675 -117786 84255 -252031 329996 -130541 144733 -63226 -396360 -25818
10127 -104685 -245020 -183685 -86547 -484080 -220481 13169 86092 -44230 -90 45780 55055 110554
$$ packed form
10205c40227B86000q9917a31949M975A38737b94603k9015F4956a00754j97505
10195b98259H5713c13911J0211A47324A4669L79092A03719a49609A4678i75n8899
10184e9874o6797H2864a52979K3012F8534L6995i3337d1969k2450l26690a24925
10172G9751f9061k93396a18098C34855A3341J22261E6768c40664f7088l28633
10162c95721C8477L6561m617a09924e1087j43420A66918a95430R6889A09980e3755
10150c5879l18231b7577l09516h3769m05835a95274J7955R660A72572A8970G971
10138c8270j15405L5889H4255b52031C29996a30541A44733f3226l33134b5818
10127a04685j40335O1335h6547l97533b20481A3169P2923d4230i0D5780R275N5499
$$ plain form
10115 110554 -374800 -202466 -330204 -35419 -99819 -192575 79783 220920 129369 -263982
10104 -306031 -125695 263708 -95278 -110969 -150792 -5215 -63536 4406 -68689 -279077 -20900
10092 30197 -422340 227359 -63963 -126557 -115633 -93499 -76778 299575 77107 89197 164001
10081 164001 -225479 128615 -215702 -365561 109641 80807 173487 306682 268697 1503
10070 26034 -254128 424323 -118228 -216624 18833 257476 24621 61700 -70990 -277958 -65974
10058 -67196 -132392 -126086 -232488 98061 -70262 16430 435496 -96901 203484 42447 -83165
10046 -181331 -237087 -26504 -3612 -86657 -75978 -232479 67905 -14353 -73246 -38161 254008
10034 117004 18774 31965 -71986 128536 153929 423098 -237055 16829 271202 -81152 -92731
$$ packed form
10115A10554c74800J72334j27738c5419o4400r2756G9783J41137r1551b63982
10104c06031a25695B63708i5278j5691l9823e215n8321D406f8689k10388b0900
10092C0197d22340B27359f3963o2594J0924K2134J6721B99575G7107J2090P4804
10081A64001b25479A28615b15702j49859A09641k8834R2680J33195l7985A503
10070B6034b54128D24323a18228r8396A8833K38643B4621L7079g0990k06968f5974
10058f7196o5196O306j06402I8061g0262A6430M19066i6901B03484D2447h3165
10046a81331n5756b6504c612q3045J0679j56501F7905a4353n8893L5085B54008
10034A17004A8774J3191g1986A28536K5393K69169b37055A6829K54373h1152j1579
$$ plain form
10023 -92731 -229920 -59899 5724 216196 -197307 -125152 -225119 -102946 78727 -52219 -104019
10012 -104019 -237962 29223 -105398 -322734 -175194 -235582 -43628 159014 -61269 -78398
10002 -78398 49715 -247478 80445 -63261 -20831 -629281 -82117 74271 -230599 27636 -166885
9990 -475450 -251633 -275000 3750 -45498 -252072 37656 -268472 100015 -30366 63444 93710
9979 93710 104476 -15836 -261475 -53739 157707 47606 -209380 85108 103819 -196705 -188496
9968 -188496 -9800 -190062 -308826 -232584 -101245 -151514 132750 33202 -230758 177248 -165793
9956 121357 -84042 -90207 27864 -197406 -118386 76574 -130556 -25257 -34368 46093 244950
9945 244950 114528 68625 -77395 -276213 11414 -100752 158740 -221651 -407145 -32295
$$ packed form
10023i2731j37189e9899E724K10472a97307P2155r9967a02946G8727e2219n1800
10012a04019j33943B9223a05398k17336J47540o0388d3628A59014f1269j7129
10002g8398D9715b47478H0445f3261b0831o08450h2117G4271b30599B7636a66885
9990d75450K23817k3367C750d5498k06574C7656b68472A00015c0366F3444L0266
9979I3710J0766a5836k45639e3739A57707D7606b09380H5108J8711a96705Q209
9968a88496i800j80262j18764P6242a01245n0269A32750C3202b30758A77248a65793
9956A21357h4042o165B7864a97406P9020G6574a30556b5257r111D6093J98857
9945B44950A14528m5903g7395j98818A1414a00752A58740b21651j85494c2295
$$ plain form
9934 153084 14733 -426919 -155185 177261 -51532 -153830 -78646 6893 -84908 -57951 -111389
9923 -111389 -196 54657 -361037 37119 -63892 -159581 -31006 71749 125474 -7280 -77288 -70232
9911 -70232 17297 -48346 52132 25605 -89492 -62838 -336150 131514 129182 -70953 -30805 -224248
9899 -224248 -104606 -203236 -190879 24742 11690 82164 -76120 117641 -178685 -3403 -16550
9888 -16550 -108772 -3218 394559 -111729 -340372 81379 448755 -246857 -18863 -213601 -70806
9876 212343 20885 105562 92793 -210625 -75397 192140 -282102 128965 -325737 -152641
9865 227468 -156226 103261 342243 -231250 49998 -118732 7869 -181284 -86266 77470 -362838
9853 75465 -108786 -330106 -136461 -19160 13868 -60083 -417374 -125585 217728 -185337
$$ packed form
9934A53084A4733d26919a55185A77261e1532j02298P5184F893h4908K6957n3438
9923a11389a96E4657c61037C7119f3892r5689c1006G1749N3725g280p0008P056
9911g0232A7297d8346E2132B5605h9492K6654k73312A31514k332g0953c0805j93443
9899b24248a04606r8630J2357B4742A1690P0474g6120A17641a78685c403j3147
9888a6550r2222c218C94559a11729k28643H1379L67376b46857a8863j94738g0806
9876B12343B0885Q4677j2769b10625g5397A92140b82102A28965c25737a52641
9865B27468a56226A03261K38982b31250D9998a18732G869a81284h6266G7470c62838
9853G5465a08786k21320a36461a9160A3868f0083l57291a25585B17728a85337
$$ plain form
9842 31947 -143976 161830 -197348 -106939 30319 -10106 -220593 16691 -94431 181970 -195135
9830 186997 -168555 163643 -80722 128871 294095 85481 -431 376031 131239 36033 5248
9818 -211705 -94395 -396873 -102999 -189455 -173677 -201597 26733 -177996 -152826 -162190 -147780
9807 -147780 147346 -378081 17391 -243093 33417 -362930 148186 200661 -101066 -185963
9797 -185963 -154998 -38041 45935 262320 -217506 -81240 327604 137560 -20267 -121144 170219
9785 -30550 -217860 120345 -172950 89894 11727 -35629 -391878 -102530 -152736 -442214 -153744
9773 -57813 -107191 281903 200387 -10833 -348152 -52415 -242838 -38360 -85906 -205957 190311
9761 36287 -255394 -91905 -340733 41859 -425644 168178 -165158 -89594 61216 152116 -34129
$$ packed form
9842C1947a43976A61830a97348R0409C0319a0106k10487A6691i4431A81970a95135
9830A86997a68555A63643h0722A28871J65224H5481d31C76031A31239C6033E248
9818b11705i4395l02478a02999q6456J5778k7920B6733a77996K5170r364J4410
9807a47780A47346c78081A7391b43093C3417c62930A48186N2475a01066q4897
9797a85963L0965c8041D5935K16385b17506h1240C27604A37560b0267j00877A70219
9785c0550j87310A20345a72950H9894A1727c5629l56249a02530n0206k89478a53744
9773e7813m9378B81903q1516a0833l37319e2415j90423c8360m7546j20051A90311
9761C6287b55394i1905k48828D1859d25644A68178a65158P5564F1216R0900c4129
$$ plain form
9749 -39786 -11814 150115 -188481 -117574 -40859 -67761 -249892 -81944 -258342 -186143 71651
9737 25755 113913 -335991 -109133 -109232 -103781 82803 -116674 -132496 -218177 -328735 -55765 176845
9724 143424 131770 274815 -338679 -196196 -361806 -177195 -194537 -237508 -318007 81128 -58316
9712 -19527 -93071 -141578 -402348 -299990 -67871 1990 235734 99085 -321477 213349 -61991
9700 -192169 -103005 335272 160612 -122449 -194577 -21218 -243634 -63455 207110 -813 -372337
9689 -372337 168042 92659 103048 -27196 266897 197289 101924 -355673 20915 143236 -190920
9677 -227726 18679 65661 28978 -333140 -207978 -326729 -210287 -6498 -55744 -138975 -44425
9665 -92582 -83075 -239644 170415 143331 -186478 -123298 -10794 134267 79861 65264 -58222
$$ packed form
9749c9786a1814A50115a88481P0907d0859k6902j82131h1944j76398P2199G1651
9737B5755Q8158c35991a09133r9N451H2803a16674j5822q5681j10558e5765A76845
9724A43424j1654J43045c38679J42483j65610a77195j7342m2971q0499H1128e8316
9712a9527p3544m8507k60770J02358f7871A990K33744I9085c21477B13349f1991
9700a92169Q9164C35272A60612a22449p2128b1218k22416f3455B07110h13l71524
9689c72337A68042p5383J0389b7196B66897o9608r5365c55673B0915J22321a90920
9677b27726A8679M6982B8978c33140J25162j18751J16442f498m9246q3231d4425
9665i2582R507j56569A70415k7084a86478O3180a0794A34267n4406j4597e8222
$$ plain form
9653 -139563 -446329 51877 -217190 -41421 -173493 85396 -423885 -217846 -104192 62187
9642 57077 -98912 -89283 -65254 32919 -150684 -331671 190420 -115943 -115486 -309929 -307366 -42159
9629 -149750 79298 155140 -96888 -108983 52066 -161025 -66411 -147780 -35364 -407966 -51980
9617 -21244 -115820 -84674 112522 -39542 -200131 -205330 -304289 -18764 79640 -258808 -168401
9606 -168401 -208470 -238244 -152563 -176581 -89414 59736 103718 -239237 227189 -243561 3303
9594 -282569 119427 -146459 194478 234783 -97923 -9670 -4165 -87132 136231 -107561 -143150
9583 -143150 243720 -26410 -192756 31443 4436 -59553 -119465 -324529 -270955 -4069 -109378
9572 -109378 -121611 51754 -122651 -270099 -187978 177108 -89332 218544 -125524 5552 -141951
$$ packed form
9653a39563l06766E1877b17190d1421j32072H5396d23885K06039a04192F2187
9642E7077i8912R629K4029C2919a50684j80987A90420a15943M57j94443K563d2159
9629a49750G9298P5842i6888j2095E2066a61025f6411q1369c5364l72602e1980
9617b1244r4576L1146A12522c9542j60589n199r8959a8764G9640b58808R0407
9606a68401m0069k9774Q5681k4018Q7167E9736M3982b39237B27189b43561C303
9594b82569A19427a46459A94478M0305i7923i670d165q2967A36231a07561l5589
9583a43150B43720b6410j66346C1443D436e9553n9912k05064N3574d069j05309
9572a09378j2233E1754a22651j47448Q2121A77108h9332B18544a25524E552a41951
$$ plain form
9560 -86430 -206829 -327189 -185756 17415 -164784 298007 -323236 34686 -208739 -7612 -130807
9549 -130807 15542 217091 -172263 -28528 162222 110817 -39333 197632 90895 -10541 95951
9537 -120250 -65926 -5944 -109543 -346285 56784 -180536 368910 -71514 -297775 -17511 -64337
9526 -64337 -60628 -221509 -55660 -116084 20304 -2636 94455 198389 263527 102943 71095 -60807
9513 26497 -91999 44433 -231879 87176 -333886 -293555 15166 7011 89362 -159961 225292
9501 19111 -8982 201189 -25073 -178144 -316377 -56795 75300 55131 -156704 -308174 -178907
9490 -178907 -195814 -286620 144831 -6551 -42856 -22419 139986 -34609 -201814 -186872 -76117
9478 -136228 162382 -27780 -300353 -517190 -28836 -1831 51999 -28581 169438 -126089 -66032
$$ packed form
9560h6430j20399j20360J41433A7415a64784B98007c23236C4686b08739g612j23195
9549a30807A5542K01549a72263b8528A62222n1405c9333A97632I0895a0541I5951
9537a20250N4324e944j03599k36742E6784a80536C68910g1514k26261a7511m6826
9526f4337L709j60881e5660o0424B0304b636I4455J03934O5138A02943l1848f0807
9513B6497i1999D4433b31879H7176c33886M0331A5166G011Q2351a59961B25292
9501A9111h982B01189b5073j53071j38233e6795G5300k0169a56704j51470J29267
9490a78907j6907r0806A44831f551l6305K0437A39986c4609j67205J4942g6117
9478a36228A62382b7780k72573k16837b8836a831E1999b8581A69438a26089O0057
$$ plain form
9467 -66032 -144236 160290 -76540 -79380 -405424 -539143 -22391 -163084 -71285 -11875 191127
9455 -35806 15192 154794 -25445 -161894 -44112 212955 12252 -82392 -94789 341 167598
9444 167598 112511 115523 150648 -299521 -124695 7727 -100870 -120231 -115434 -131478 252742
9432 -219607 35617 51920 -262849 110120 -35897 -377321 -39235 9953 -63567 -89573 -326216
9421 -326216 -332291 -143070 -162342 -56482 85728 221196 -300687 -17661 -152846 174796 267351
9410 267351 -262778 -51925 76732 -304555 -332107 113069 162662 27378 353170 -48522 4729
9398 348793 -215841 -52084 43344 -259047 -47996 -200661 -124081 28084 -72770 101082 -77845
9386 23572 22015 39740 -246112 -388159 -384025 -91055 -140364 -30357 -145553 -1741 -239601 -46559
$$ packed form
9467f6032p8204A60290g6540k840l26044j33719b2391j40693g1285a1875A91127
9455c5806A5192J39602b5445j36449d4112B12955A2252h2392j2397C41J67257
9444A67598n5087L012L5125b99521a24695G727a00870j9361M797j6044B52742
9432b19607C5617J6303b62849A10120c5897l41424c9235I953f3567k6006k36643
9421c26216o075a43070j9272e6482H5728J35468c00687a7661j35185A74796R2555
9410B67351b62778e1925G6732c04555k7552A13069M9593B7378L25792d8522D729
9398C48793b15841e2084D3344b59047d7996j52665P6580B8084g2770A01082g7845
9386B3572j557J7725b46112j42047M134i1055m9309c0357j15196a741k37860d6559
$$ plain form
9373 -177583 -266821 -82607 -151884 10195 30405 -49366 -102392 -297115 47680 -84467 5017 -317167
9360 65276 398092 -303491 -114102 -386421 -90263 -15467 -195332 -2023 -80977 58673 -149248
9348 -220876 -170780 4448 -110116 -82434 19053 -333647 -220097 334341 82869 36011 -145775
9336 -6802 -109564 24994 222395 -112161 -95913 61636 -51247 -326390 75208 -356983 -118714
9324 -223452 340669 21299 101387 -44050 -147985 -7630 130283 -146520 -53961 29022 -213897
9312 239 -268561 -300392 79555 -274426 -133245 166071 -149030 -6364 -49090 -111034 68954
9300 -112306 58532 -189261 240249 23731 -165905 339401 241792 238308 -350776 4427 45575
9289 45575 -118169 113753 5 -93486 175578 -90941 -3281 -330734 -209781 126871 167116 -180490
$$ packed form
9373a77583q9238h2607o9277A0195K0210d9366n3026j94723D7680h4467E017c17167
9360F5276L32816c03491a14102k72319i0263a5467j79865b023p8954E8673a49248
9348b20876N0096D448a10116K7682A9053c33647J13550C34341H2869C6011a45775
9336f802j02762B4994J97401a12161J6248F1636e1247k75143G5208c56983a18714
9324b23452C40669B1299Q0088d4050j03935g630A30283a46520e3961B9022b13897
9312B39b68561l1831G9555b74426a33245A66071a49030f364m2726o1944F8954
9300a12306E8532a89261B40249B3731a65905C39401r7609l484c50776D427M1148
9289D5575a18169A13753Ei3486A75578i0941c281l27453J20953A26871M0245a80490
$$ plain form
9276 -179397 17167 -85369 -211700 77416 -353430 -157289 -190596 241627 82041 54607 -319731
9264 19618 41137 -79332 190083 31204 -22674 413380 -234807 124447 56016 -76385 -152554
9253 -152554 -71497 -368306 -209039 39492 -505107 -194106 197163 -54714 -89851 -243574
9243 -243574 21125 120200 43274 -163336 24833 -147653 1459 83720 -11204 -355593 232408
9231 14112 -225264 41425 109498 -123844 -136952 -138032 -82428 -64779 4578 -408895 24563 20085
9219 20085 168755 -62792 -75596 -62717 -156059 15751 -193459 59874 -46081 36953 -79279
9207 -44688 -224098 122655 154329 -110896 8330 -143152 -174549 -95998 133994 -485050 -110253
9195 -114037 -56781 -14071 -40985 -151857 236354 -348777 -23217 -106677 33232 122398 -35677
$$ packed form
9276a79397A7167h5369j26331G7416c53430a57289l3307B41627H2041k7434c19731
9264A9618K1519g9332A90083C1204b2674D13380b34807A24447E6016g6385p6169
9253a52554g1497k96809J59267C9492e05107a94106A97163e4714l5137j53723
9243b43574B1125R9075D3274a63336B4833a47653A459Q2261a1204l44389B32408
9231A4112b25264D1425O8073a23844j3108j080N5604J7649D578d08895B4563m478
9219B0085J48670f2792j2804J2879r3342A5751a93459E9874d6081C6953g9279
9207d4688j79410A22655L1674a10896H330a43152l1397P8551A33994d85050a10253
9195a14037e6781a4071k6914j10872B36354c48777b3217q3460C3232Q9166c5677
$$ plain form
9183 -110622 -215533 205797 -189383 -14155 -197024 -139567 -44936 -18982 178836 115196 92157
9172 92157 11031 23615 -252312 268486 130816 -104995 33256 -183029 257770 246326 166281
9161 166281 -103332 -367909 28141 -64947 -38340 -77306 -31427 -46882 14305 184359 -74508
9149 -148276 55405 68553 -222409 -97265 -361275 -211151 -138471 -222711 278318 -11693 316377
9137 100092 -289404 301980 176361 -191053 234443 -300165 -134858 11164 -346281 122261
9126 106332 63770 -169662 -13420 -200086 -386602 -396484 45225 -32312 40695 -21550 444859
9114 47861 40266 193911 29395 132215 -142073 10778 -180584 -248765 232636 -87439 232431
9102 -55289 -226285 14545 -9708 -218966 -260283 -139734 -449928 770 -84566 -179465 -95431 -65651
$$ packed form
9183a10622j04911B05797a89383a4155j82869N7457d4936a8982A78836o3640k3039
9172I2157A1031J2584b52312B68486A30816a04995C3256a83029B57770j1444q0045
9161A66281a03332k64577B8141f4947K6607l8966c1427j5455A4305J70054g4508
9149a48276E5405J3148b22409i7265k64010J50124P2680q4240B78318a1693C16377
9137A00092b89404C01980j25619a91053B34443c00165a34858A1164c46281A22261
9126A06332m2562a69662a3420j86666j86516r882D5225c2312D0695b1550D44859
9114D7861p595J53645B9395J02820a42073A0778a80584o8181B32636h7439B32431
9102e5289j70996A4545i708k09258m1317J20549l10194G70h4566r4899Q4034K9780
$$ plain form
9090 -65651 103453 154806 -123294 -22845 203713 -35039 126576 -134730 167867 -234760
9079 -173648 -35450 110965 198740 287649 71899 -97077 -134704 -163288 -30487 -16801 -129172
9068 -129172 56938 -327968 -49153 -192255 -14334 -26260 -171765 -18584 -24719 -77286 -397237
9057 -397237 346520 93704 63482 -37082 -130700 13886 365341 2886 -57454 -38988 -111564
9046 -111564 32486 -183307 -145983 -159889 -170076 224380 -326444 126718 162460 -240047 -75714
9034 -168152 276598 -185946 72517 11745 -354812 -271885 -232294 -256204 -215870 8722 -90307
9022 167614 191914 36218 161718 -290807 -9780 4198 141690 -433834 -375799 -318751 -156570
9010 224509 -81453 -11201 84185 149898 -182013 -393848 -355871 -216238 -151720 -175544 -34920
$$ packed form
9090f5651A03453N1353a23294b2845B03713c5039A26576a34730A67867b34760
9079a73648c5450A10965Q7775Q8909G1899i7077l7627k8584c0487J3686j12371
9068a29172E6938c27968d9153j43102a4334j1926j45505a8584o135n2567l19951
9057c97237C46520I3704l0222c7082r3618A3886L51455B886e7454J8466p2576
9046a11564C2486a83307L7324j3906j0187B24380c26444A26718L5742b40047g5714
9034a68152B76598a85946G2517A1745c54812Q2927L9591k3910M0334H722i0307
9022A67614K4300C6218J25500b90807i780D198J37492d33834N8035N7048a56570
9010B24509h1453a1201H4185O5713a82013k11835L7977J39633O4518k3824c4920
$$ plain form
8998 -333686 -97423 66621 -202211 -197329 -233619 24463 -48031 -197826 15307 127380 -120104
8986 -224412 99087 -108266 -202251 -25783 -79847 -177094 -160550 -310110 28982 135762 -20685
8974 -95859 189948 -30892 2287 -45996 49828 -235822 -236403 -56859 24971 403809 76237 159436
8962 159436 122022 -203407 -37455 -48885 -107199 -146055 -7445 100023 -352450 -180894 61092
8950 201211 -85437 -116376 -133568 20517 -87546 -280586 159107 -228432 -306422 -5625 -93721
8939 -93721 -233146 -119095 -258709 209350 -149440 10553 161854 -240074 -162202 188904
8928 -84902 25431 210257 -109208 72830 -118453 406818 50350 55803 264165 155973 317261
8917 317261 124596 391471 294740 215412 97316 264829 386323 545195 1134648 1782973
$$ packed form
8998c33686i7423F6621b02211M882l6290B4463d8031j49795A5307J12073a20104
8986b24412I9087a08266r3985b5783n4064r7247J6544j49560B8982J06780b0685
8974i5859A89948c0892B287d5996D9828b35822n81e6859B4971L78838G6237Q3199
8962A59436l7414b03407c7455j1430n8314l8856g445A00023c52450J71556F1092
8950B01211h5437l0939j7192B0517h7546j93040A59107b28432p7990e625q8096
8939i3721j39425J14051j39614B09350a49440A0553J51301b40074P7872A88904
8928h4902B5431J84826a09208G2830a18453D06818E0350N453K08362j08192J61288
8917C17261A24596K66875r6731p9328I7316J67513J21494J58872N89453O48325
$$ plain form
8907 1782973 2858978 5651590 10924035 5498062 2371129 959829 886990 652047 351475
8898 351475 303383 320895 -56355 253587 -100761 225026 254379 602435 136606 209827 85635
8886 -105167 209071 -390056 30147 -328419 69344 107823 93013 -195785 90026 -268142 172740
8874 -33640 -319223 -20256 23407 -163241 -215217 -129458 -135010 99415 96572 -311769 112177
8862 110348 -27403 -170195 -264932 180730 -105764 -5155 186654 -107533 41837 308263 -7075
$$ packed form
8907A782973J076005K792612N272445n425973B371129I59829p2839k34943l00572
8898C51475m8092J7512e6355B53587a00761B25026K9353L48056A36606P3221H5635
8886a05167B09071c90056C0147c28419F9344L8479j4810a95785I0026b68142A72740
8874c3640k85583b0256B3407a63241n1976Q5759n552I9415k843c11769A12177
8862A10348b7403j42792r4737A80730a05764e155A86654a07533D1837K66426g075
$$ [...]
##END NTUPLES=NMR SPECTRUM
##END=
