
##TITLE=AC1000_Robusta_6278510_QFwXLwHOOp
##JCAMPDX= 6.0         $$ Bruker NMR JCAMP-DX V2.0
##DATA TYPE= NMR SPECTRUM
##DATA CLASS= NTUPLES
##ORIGIN= BRUKER
##OWNER= Administrator
$$ 1.72 TOPSPIN		Version 2.1
$$ 2012-06-03 14:22:26.093 -0500  Administrator@TOPSPIN
$$ Compression mode = diff/dup
##.OBSERVE FREQUENCY= 400.13188235
##.OBSERVE NUCLEUS= ^1H
##.ACQUISITION MODE= SIMULTANEOUS (DQD)
##.ACQUISITION SCHEME= undefined
##.AVERAGES= 64
##.DIGITISER RES= 22
##SPECTROMETER/DATA SYSTEM= spect
##.PULSE SEQUENCE= noesygpps1d.comp
##.SOLVENT NAME= COFFEE_meoh
##.SHIFT REFERENCE= INTERNAL, COFFEE_meoh, 1, 14.96709
##AUDIT TRAIL= $$ (NUMBER, WHEN, WHO, WHERE, PROCESS, VERSION, WHAT)
$$ ##TITLE= Audit trail, TOPSPIN		Version 2.1
$$ ##JCAMPDX= 5.01
$$ ##ORIGIN= Bruker BioSpin GmbH
$$ ##OWNER= Administrator
$$ $$ C:\Bruker\TOPSPIN/data/COFFEE/nmr/AC1000_Robusta_6278510_QFwXLwHOOp/12/pdata/1/auditp.txt
$$ ##AUDIT TRAIL=  $$ (NUMBER, WHEN, WHO, WHERE, PROCESS, VERSION, WHAT)
(   1,<2012-06-03 14:22:21.312 -0500>,<Administrator>,<TOPSPIN>,<go>,<TOPSPIN 2.1>,
      <created by zg
	started at 2012-06-03 14:10:48.859 -0500,
	POWCHK enabled, PULCHK disabled,
       configuration hash MD5:
       D5 CA 7A 23 FE 6B EE E2 50 67 74 61 24 F7 5E 3B
       data hash MD5: 64K
       5E CA E4 59 75 42 D2 D1 CE 7A FC 63 4C DD 12 4D>)
(   2,<2012-06-03 14:22:24.140 -0500>,<Administrator>,<TOPSPIN>,<proc1d>,<TOPSPIN 2.1>,
      <Start of raw data processing
       efp LB = 0.3 FT_mod = 6 PKNL = 1 PHC0 = 0 PHC1 = 0 SI = 128K 
       data hash MD5: 128K
       95 AE C6 B1 52 79 36 09 2C 5F 83 39 FF 2E 7C 15>)
(   3,<2012-06-03 14:22:25.343 -0500>,<Administrator>,<TOPSPIN>,<proc1d>,<TOPSPIN 2.1>,
      <pk PHC0 = 32.82715 PHC1 = 0 
       data hash MD5: 128K
       C3 AA 9E 9E BD EB E7 EB 70 61 0C 55 E9 A3 0C D4>)
(   4,<2012-06-03 14:22:25.765 -0500>,<Administrator>,<TOPSPIN>,<proc1d>,<TOPSPIN 2.1>,
      <abs ABSG = 1 
       data hash MD5: 128K
       88 42 EF C5 91 42 C3 95 7E 5E 52 34 97 40 85 D6>)
(   5,<2012-06-03 14:22:25.843 -0500>,<Administrator>,<TOPSPIN>,<proc1d>,<TOPSPIN 2.1>,
      <abs ABSG = 2 
       data hash MD5: 128K
       49 AF CC 07 36 8D 0A F9 2D 04 82 E2 92 F1 96 22>)
(   6,<2012-06-03 14:22:25.890 -0500>,<Administrator>,<TOPSPIN>,<proc1d>,<TOPSPIN 2.1>,
      <abs ABSG = 3 
       data hash MD5: 128K
       14 8F EE A3 43 57 7E 8D 4F 44 75 D2 2E 35 33 FB>)
(   7,<2012-06-03 14:22:25.968 -0500>,<Administrator>,<TOPSPIN>,<proc1d>,<TOPSPIN 2.1>,
      <abs ABSG = 4 
       data hash MD5: 128K
       BF A0 A8 9E 12 5B 4C 0F 28 6D 05 5A 0E BA 65 4A>)
(   8,<2012-06-03 14:22:26.015 -0500>,<Administrator>,<TOPSPIN>,<proc1d>,<TOPSPIN 2.1>,
      <abs ABSG = 5 
       data hash MD5: 128K
       C3 70 B1 93 3B AE D9 CE 00 3F 1B 2A B1 58 B6 07>)
$$ ##END=
$$ 
$$ $$ hash MD5
$$ $$ 9B 4D 8C E0 A3 1E B0 E2 DF D1 86 C1 83 C6 D6 72
##$RELAX= 
##$RELAX= 
##$RELAX= 
##$RELAX= 
##$RELAX= 
##$RELAX= 
##$RELAX= 
##$RELAX= 
$$ Bruker specific parameters
$$ [...]
##$TP07= 0
##$TPNAME0= <>
##$TPNAME1= <>
##$TPNAME2= <>
##$TPNAME3= <>
##$TPNAME4= <>
##$TPNAME5= <>
##$TPNAME6= <>
##$TPNAME7= <>
##$TPOAL= (0..7)
0.5 0.5 0.5 0.5 0.5 0.5 0.5 0.5
##$TPOFFS= (0..7)
0 0 0 0 0 0 0 0
##$TUNHIN= 0
##$TUNHOUT= 0
##$TUNXOUT= 0
##$USERA1= <user>
##$USERA2= <user>
##$USERA3= <user>
##$USERA4= <user>
##$USERA5= <user>
##$V9= 5
##$VALIST= <valist>
##$VCLIST= <CCCCCCCCCCCCCCC>
##$VD= 0
##$VDLIST= <DDDDDDDDDDDDDDD>
##$VPLIST= <PPPPPPPPPPPPPPP>
##$VTLIST= <TTTTTTTTTTTTTTT>
##$WBST= 2048
##$WBSW= 25
##$XGAIN= (0..3)
0 0 0 0
##$XL= 0
##$YL= 0
##$YMAX_a= 11190521
##$YMIN_a= -7071599
##$ZGOPTNS= <>
##$ZL1= 120
##$ZL2= 120
##$ZL3= 120
##$ZL4= 120
##$ABSF1= 14.96709
##$ABSF2= -5.585441
##$ABSG= 5
##$ABSL= 3
##$ALPHA= 0
##$AQORDER= 0
##$ASSFAC= 0
##$ASSFACI= 0
##$ASSFACX= 0
##$ASSWID= 0
##$AUNMP= <proc_prof1d_extract.lims>
##$AXLEFT= 0
##$AXNAME= <>
##$AXNUC= <1H>
##$AXRIGHT= 0
##$AXTYPE= 0
##$AXUNIT= <>
##$AZFE= 0.1
##$AZFW= 0.1
##$BCFW= 0
##$BC_mod= 0
##$BYTORDP= 0
##$COROFFS= 0
##$CY= 15
##$DATMOD= 1
##$DC= 0
##$DFILT= <>
##$DTYPP= 0
##$F1P= 0
##$F2P= 0
##$FCOR= 0.5
##$FTSIZE= 131072
##$FT_mod= 6
##$GAMMA= 0
##$GB= 0
##$INTBC= 1
##$INTSCL= 1
##$ISEN= 128
##$LB= 0.3
##$LEV0= 0
##$LPBIN= 0
##$MAXI= 10000
##$MC2= 0
##$MEAN= 0
##$ME_mod= 0
##$MI= 0
##$NCOEF= 0
##$NC_proc= -3
##$NLEV= 6
##$NOISF1= 0
##$NOISF2= 0
##$NSP= 0
##$NTH_PI= 0
##$NZP= 0
##$OFFSET= 14.96709
##$PC= 1
##$PHC0= 32.82715
##$PHC1= 0
##$PH_mod= 1
##$PKNL= yes
##$PPARMOD= 0
##$PPDIAG= 0
##$PPIPTYP= 0
##$PPMPNUM= 2147483647
##$PPRESOL= 1
##$PSCAL= 4
##$PSIGN= 0
##$PYNMP= <proc.py>
##$REVERSE= no
##$SF= 400.130005410615
##$SI= 131072
##$SIGF1= 0
##$SIGF2= 0
##$SINO= 400
##$SIOLD= 131072
##$SPECTYP= <>
##$SREGLST= <1H.CDCl3>
##$SSB= 0
##$STSI= 131072
##$STSR= 0
##$SW_p= 8223.68421052632
##$SYMM= 0
##$S_DEV= 0
##$TDeff= 65536
##$TDoff= 0
##$TI= <>
##$TILT= no
##$TM1= 0
##$TM2= 0
##$TOPLEV= 0
##$USERP1= <user>
##$USERP2= <user>
##$USERP3= <user>
##$USERP4= <user>
##$USERP5= <user>
##$WDW= 1
##$XDIM= 131072
##$YMAX_p= 450640502
##$YMIN_p= -350688569
##$CURPLOT= <Network HP LaserJet P1505>
##$CURPRIN= <$Network HP LaserJet P1505>
##$DFORMAT= <normdp>
##$LAYOUT= <+/1D_H.xwp>
##$LFORMAT= <normlp>
##$PFORMAT= <normpl>
##$SURQMSG= 1
$$ End of Bruker specific parameters
$$ ---------------------------------
##NTUPLES= NMR SPECTRUM
##VAR_NAME=  FREQUENCY,     SPECTRUM/REAL,   SPECTRUM/IMAG
##SYMBOL=    X,             R,               I
##VAR_TYPE=  INDEPENDENT,   DEPENDENT,       DEPENDENT
##VAR_FORM=  AFFN,          ASDF,            ASDF
##VAR_DIM=   131072,        131072,          131072
##UNITS=     HZ,            ARBITRARY UNITS, ARBITRARY UNITS
##FACTOR=    0.0627417313425165, 1,          1
##FIRST=     8223.62146879498, 4950,         -114379
##LAST=      0,             6673,            -115651
##MIN=       0,             -350688569,      0
##MAX=       8223.62146879498, 450640502,    0
$$ Real data points
##PAGE= N=1
##DATA TABLE= (X++(R..R)), XYDATA
$$ [...]
61267A367730j4155j7364j9080j9192j8655j7935j6588j4553j2678j1662j1393
61256A194475j1557j1923j1870j0596q256o038m779m166l613l024k275q52J330
61243A116856L372M476N154O473Q264Q905P192L837P27j082k211l775n769p006
61229A145413o571m988l603k982k333o76J638L084K805J971K694N596R114J1518
61215A162680J2866J4292J5986J7061J7297J7761J9302K1418K3143K4278K5164
61204A371248K5838K6178K6561K7704K9786L2063L3439L3592L3690L5482L8924
61193A714505M1157L9061L2850K5702J9668J3541N432m252j3719k2124k9224l3875
61181A788722l5032l3954l3301l3962l4383l3276l1225k9210k7186k5018k3454
$$ y = [1367730, 1353575, 1336211, 1317131, 1297939, 1279284, 1261349, 1244761, 1230208, 1217530, 1205868, 1194475, 1182918, 1170995, 1159125, 1148529, 1140273, 1134235, 1129456, 1125290, 1121677, 1118653, 1116378, 1115526, 1116856, 1120228, 1124704, 1129858, 1136331, 1144595, 1153500, 1160692, 1164529, 1165256, 1164174, 1161963, 1158188, 1152419, 1145413, 1138842, 1133854, 1130251, 1127269, 1124936, 1124260, 1125898, 1128982, 1131787, 1133758, 1136452, 1142048, 1151162, 1162680, 1175546, 1189838, 1205824, 1222885, 1240182, 1257943, 1277245, 1298663, 1321806, 1346084, 1371248, 1397086, 1423264, 1449825, 1477529, 1507315, 1539378, 1572817, 1606409, 1640099, 1675581, 1714505, 1755662, 1794723, 1827573, 1853275, 1872943, 1886484, 1891916, 1887664, 1873945, 1851821, 1822597, 1788722, 1753690, 1719736, 1686435, 1652473, 1618090, 1584814, 1553589, 1524379, 1497193, 1472175, 1448721]
61170A448721k3012k2774k1387j8800j6053j3758j1696r744q280p440o735n750
61158A283292m948n243o788q450q762p359n257l792l489l989m584m549l433j507
61144A211142K85J292J935L092M915O745Q143R346J0704J2266J4149J6850K0640
61131A321504K4838K8150K9876L0488L0859L1055L0319K8277K5607K3131K0716
61120A624820J7873J5089J3554J3391J3166J1603Q920N962K918k42k823l977m059
61107A716195m500o268r039j1842j4050j5768j7568j9736k1575k1854k0315j8314
61095A535366j7460j7953j8697j8654j7504j5429j2914j0641q963p666o500n614
61083A377371n076m633m446n451q214j1860j4921j6773j7562j7293j5980j4205
$$ y = [1448721, 1425709, 1402935, 1381548, 1362748, 1346695, 1332937, 1321241, 1311497, 1303217, 1295777, 1289042, 1283292, 1278344, 1273101, 1266313, 1257863, 1249101, 1241742, 1236485, 1232693, 1229204, 1225215, 1220631, 1216082, 1212649, 1211142, 1211427, 1212719, 1214654, 1217746, 1222661, 1229406, 1237549, 1246895, 1257599, 1269865, 1284014, 1300864, 1321504, 1346342, 1374492, 1404368, 1434856, 1465715, 1496770, 1527089, 1555366, 1580973, 1604104, 1624820, 1642693, 1657782, 1671336, 1684727, 1697893, 1709496, 1718416, 1724378, 1727296, 1727054, 1724231, 1720254, 1716195, 1711695, 1705427, 1696388, 1684546, 1670496, 1654728, 1637160, 1617424, 1595849, 1573995, 1553680, 1535366, 1517906, 1499953, 1481256, 1462602, 1445098, 1429669, 1416755, 1406114, 1397151, 1389485, 1382985, 1377371, 1372295, 1367662, 1363216, 1357765, 1349551, 1337691, 1322770, 1305997, 1288435, 1271142, 1255162, 1240957]
61071A240957j2478j0354p266l936j748q20J26J924M228O672R503J2547J4714
61058A254069J5356J5496J6819J9645K2417K3457K3002K3081K5071K7647K8065
61047A494125K5626K2691K1648K2008K1644J9831J7617J5770J3999J1969R589
61036A696517O362J917k934p066j0816j5202j9430k1230k0176j8690j8761j9417
61024A551074j8817j7317j6687j7190j7250j5856j3747j2033j0759r337p603n981
61012A388497m895m376m192m074l734k814j152Q98K766M421O494R335J2372J4699
60998A414245J6006J6633J7236J8690K1641K5620K9288L2160L5231L9170M2881
60987A708801M5059M6327M8564N2649N8223O4864P1945P7849Q1183Q2824Q5191
$$ y = [1240957, 1228479, 1218125, 1210859, 1206923, 1205175, 1204355, 1204481, 1206405, 1210633, 1217305, 1226808, 1239355, 1254069, 1269425, 1284921, 1301740, 1321385, 1343802, 1367259, 1390261, 1413342, 1438413, 1466060, 1494125, 1519751, 1542442, 1564090, 1586098, 1607742, 1627573, 1645190, 1660960, 1674959, 1686928, 1696517, 1702879, 1704796, 1701862, 1694796, 1683980, 1668778, 1649348, 1628118, 1607942, 1589252, 1570491, 1551074, 1532257, 1514940, 1498253, 1481063, 1463813, 1447957, 1434210, 1422177, 1411418, 1402081, 1394478, 1388497, 1383602, 1379226, 1375034, 1370960, 1367226, 1364412, 1363260, 1364158, 1366924, 1371345, 1377839, 1387174, 1399546, 1414245, 1430251, 1446884, 1464120, 1482810, 1504451, 1530071, 1559359, 1591519, 1626750, 1665920, 1708801, 1753860, 1800187, 1848751, 1901400, 1959623, 2024487, 2096432, 2174281, 2255464, 2338288, 2423479]
60976B423479Q9474R4886J00375J05673J10813J16103J22342J29640J36440J41411
60966C570636J45832J52203J60913J70372J80166J91655K05340K19982K34473
60957E231572K48543K61759K74276K88441L06960L29617L54814L84013M20823
60948H100818M65366N13857N64753O20997O84939P56053Q35769R29476J040650
60939A4512678J167960J311458J476121J665029J875718K109992K380849K700393
60931B9200198L066454L470341L902555M315581M570488M461407L853365K823408
60923E9663797J651521O51291L56k84718k64548l0310K56013L44211M239q07953
60913F1183899j899332k966034l774924m245039m406887m330680m091446l760045
$$ y = [2423479, 2512953, 2607839, 2708214, 2813887, 2924700, 3040803, 3163145, 3292785, 3429225, 3570636, 3716468, 3868671, 4029584, 4199956, 4380122, 4571777, 4777117, 4997099, 5231572, 5480115, 5741874, 6016150, 6304591, 6611551, 6941168, 7295982, 7679995, 8100818, 8566184, 9080041, 9644794, 10265791, 10950730, 11706783, 12542552, 13472028, 14512678, 15680638, 16992096, 18468217, 20133246, 22008964, 24118956, 26499805, 29200198, 32266652, 35736993, 39639548, 43955129, 48525617, 52987024, 56840389, 59663797, 61315318, 61966609, 61966965, 61682247, 61417699, 61387389, 61643402, 61987613, 61991852, 61183899, 59284567, 56318533, 52543609, 48298570, 43891683, 39561003, 35469557, 31709512]
60905C1709512l392115l020133k661044k327722k029189j766287j535393j334964
60897A3642665j164514j020128q96053p89198o98411o21085n54276m97482m50491
60888F951027m09829l71172l34485l02909k77063k54119k32686k14909k02680
60879D351175j94487j87338j79827j72087j64199j55823j46758j37109j27263
60870B886284j17817j09119j00983r3324q6624q1165p6279p1130o5666o0246n4994
60859A968937n0260m6804m4559m2164l8783l5450l3414l2158l0562k9043k8668
60848A557072k8892k8179k6545k5355k4739k3349k0933j9142j9145k0196k1243
60837A299354k2297k3282k3031k0785j7749j5955j5979j6681j6763j5860j4437
$$ y = [31709512, 28317397, 25297264, 22636220, 20308498, 18279309, 16513022, 14977629, 13642665, 12478151, 11458023, 10561970, 9772772, 9074361, 8453276, 7899000, 7401518, 6951027, 6541198, 6170026, 5835541, 5532632, 5255569, 5001450, 4768764, 4553855, 4351175, 4156688, 3969350, 3789523, 3617436, 3453237, 3297414, 3150656, 3013547, 2886284, 2768467, 2659348, 2558365, 2465041, 2378417, 2297252, 2220973, 2149843, 2084177, 2023931, 1968937, 1918677, 1871873, 1827314, 1785150, 1746367, 1710917, 1677503, 1645345, 1614783, 1585740, 1557072, 1528180, 1500001, 1473456, 1448101, 1423362, 1400013, 1379080, 1359938, 1340793, 1320597, 1299354, 1277057, 1253775, 1230744, 1209959, 1192210, 1176255, 1160276, 1143595, 1126832, 1110972, 1096535]
60826A096535j3299j2978j3187j3037j2062j0679r389q150o918o265o616p252
60814I76703o902n392l902l240k581o43K167L829L241J748J429K495L487L723
60800I76162M082N142O008N822N224N219N476N017L989L379L203K365M75j373
60786A030190k023j660j353j772k699l521m070n159p940j2238j5975j7022j5513
60773I39245j3510j2478j2027j1170r789q406p269o237n133l917k716j807j271
60760H43515o71M91K124L762N292O745P679P574O878O696P377Q378R579J1482
60746I26901J3762J4990J4661J4338J5658J7947J9207J9068J9320K1379K4361
60735A121592K6221K6145K5217K4982K5745K6339K5437K2961J9991J7437J5140
$$ y = [1096535, 1083236, 1070258, 1057071, 1044034, 1031972, 1021293, 1011904, 1003754, 996836, 990571, 983955, 976703, 969801, 964409, 960507, 957267, 954686, 954043, 956210, 960039, 963280, 965028, 966457, 968952, 972439, 976162, 980244, 985386, 991394, 997216, 1002440, 1007659, 1013135, 1018152, 1022141, 1025520, 1028723, 1031088, 1031563, 1030190, 1028167, 1026507, 1025154, 1023382, 1020683, 1017162, 1013092, 1007933, 999993, 987755, 971780, 954758, 939245, 925735, 913257, 901230, 890060, 880271, 871865, 864596, 858359, 853226, 849309, 846593, 844786, 843515, 842844, 843335, 845459, 849221, 854513, 861258, 868937, 876511, 883389, 890085, 897462, 905840, 915419, 926901, 940663, 955653, 970314, 984652, 1000310, 1018257, 1037464, 1056532, 1075852, 1097231, 1121592, 1147813, 1173958, 1199175, 1224157, 1249902, 1276241, 1301678, 1324639, 1344630, 1362067, 1377207]
60724A377207J2473R296N991K885L2k617n230q065j1145j4207j7163k0208k3147
60711A306102k5127k5616k5231k4902k4563k3432k1412j9372j8112j7820j8435
60700A062080j9685k0668k0407j9063j7739j6783j5291j2818j0551r858j0347
60689H88870j0437r389p888o804o332o280o319n999n247m863n653p078p633o722
60675G92226n318m456m022l494l025k958k814j695L90K258K701J557k77j598j806
60660G67669j451j807l609o210q089q140o419l997k292k268l766n652o701o455
60646G00813n368m427m465n395o194o154n895o277o617n357k665o92m98m40J045
60631F41414K728K570J158P77J583J409m86k035j464L84J851K721L444L640K957
$$ y = [1377207, 1389680, 1398976, 1404967, 1407852, 1407884, 1405267, 1400037, 1391972, 1380827, 1366620, 1349457, 1329249, 1306102, 1280975, 1255359, 1230128, 1205226, 1180663, 1157231, 1135819, 1116447, 1098335, 1080515, 1062080, 1042395, 1021727, 1001320, 982257, 964518, 947735, 932444, 919626, 909075, 899217, 888870, 878433, 869044, 861156, 854352, 848020, 841740, 835421, 829422, 824175, 819312, 813659, 806581, 798948, 792226, 786908, 782452, 778430, 774936, 771911, 768953, 766139, 764444, 764834, 767092, 769793, 771350, 771073, 769475, 767669, 766218, 764411, 760802, 754592, 746503, 738363, 731944, 727947, 725655, 723387, 719621, 713969, 707268, 700813, 695445, 691018, 686553, 681158, 674964, 668810, 662915, 656638, 650021, 644664, 641999, 641307, 640809, 640369, 641414, 644142, 646712, 647870, 648647, 650230, 651639, 651153, 649118, 647654, 648038, 649889, 652610, 656054, 659694, 662651]
60616F62651K241K408L102L664M486O020P361P409O766O740O941N728L060J003
60602G29580J012K203L028L335L874M685N081M802M353M253M565N086N644O103
60588G87604O284O005N276M383L602K709J141j156l387m904o113p676r118r125
60574G75525p418n513n049n837o136m767k470j075j502k777l107j821K7J015R35
60559G30030P26J076J555J197k35j679j627K07K202K421J019K99J946M928O773
60544G50838O381M724L208K444K455L028L646L810L672L649L415K178J82j002
60530G92628k38J740L264L620L411L379L525L504L435L958N455P341Q541Q791
60516H52354R069J0307J2021J3000J3131J3785J6170K0005K4041K7244K9219L0064
$$ y = [662651, 664892, 667300, 670402, 674066, 678552, 684572, 691933, 699342, 706108, 712848, 719789, 725517, 728577, 729580, 730592, 732795, 735823, 739158, 743032, 747717, 752798, 757600, 761953, 766206, 770771, 775857, 781501, 787604, 793888, 799893, 805169, 809552, 813154, 815863, 817004, 815848, 812461, 807557, 801444, 793768, 784650, 775525, 768107, 762594, 757545, 751708, 745572, 740805, 738335, 737260, 735758, 732981, 729874, 728053, 728080, 729095, 730030, 730756, 731832, 733387, 734584, 734349, 732670, 731043, 731250, 733452, 735873, 736892, 737191, 739137, 744065, 750838, 757219, 761943, 765151, 767595, 770050, 773078, 776724, 780534, 784206, 787855, 791270, 793448, 793630, 792628, 792390, 794130, 797394, 801014, 804425, 807804, 811329, 814833, 818268, 822226, 827681, 835022, 843563, 852354, 861423, 871730, 883751, 896751, 909882, 923667, 939837, 959842, 983883, 1011127, 1040346, 1070410]
60504A070410L0353L0874L2008L3445L4568L4709L3084K9188K3512J7283J1082
60493A380516M398k927r363j2678j2172r336o297m040k149K85L803Q403J3772
60480A352215J9495K5146L0548L6034M2040M8316N4106N9457O5516P2533P8149
60469A883555P9121P4707O6990N7747M6706L3473J9421O332n517j6465k5652l1869
60457B188549l5501l7869l8876l7194l2856k7866k3658j9478j4046p592j314M267
60445A916566R497J4773K0343K6480L3279M0655M8875N8409O8770P8356Q6207
60434B402210R3341J01329J09967J17129J20618J19371J13290J02899Q9188P2975
60424C442317N4576L4885J6563L040m002n313k450L418J0747J7023J9904J8302
$$ y = [1070410, 1100763, 1131637, 1163645, 1197090, 1231658, 1266367, 1299451, 1328639, 1352151, 1369434, 1380516, 1384914, 1381987, 1372624, 1359946, 1347774, 1338438, 1332141, 1328101, 1325952, 1326237, 1330040, 1338443, 1352215, 1371710, 1396856, 1427404, 1463438, 1505478, 1553794, 1607900, 1667357, 1732873, 1805406, 1883555, 1962676, 2037383, 2104373, 2162120, 2208826, 2242299, 2261720, 2268052, 2262535, 2246070, 2220418, 2188549, 2153048, 2115179, 2076303, 2039109, 2006253, 1978387, 1954729, 1935251, 1921205, 1913613, 1912299, 1916566, 1926063, 1940836, 1961179, 1987659, 2020938, 2061593, 2110468, 2168877, 2237647, 2316003, 2402210, 2495551, 2596880, 2706847, 2823976, 2944594, 3063965, 3177255, 3280154, 3369342, 3442317, 3496893, 3531778, 3548341, 3551381, 3547379, 3542066, 3539616, 3543034, 3553781, 3570804, 3590708, 3609010]
60412C609010J1629j137k0493m4837p0962r5977j18060j35604j47026j51862j51240
60401B683441j46774j39476j30110j19823j09655r9839r0241q1269p3674o7486
60391A625094o1824n6031n0428m5698m1923l8574l5220l1879k8808k6262k4375
60380A184072k2895k1044j8083j4233j0716q599p800p454p047o790o968p426p881
60367A037136q412r318j0493j1287j1161j0457j0185j0758j1112r715o598l758
60355I23882k957l639l852k859j763j523j696j604j583k128k632k072o08O09J011
60340H96586J135J494J847J690R00k10r67n86J056K929L755L371K625K123J927
60325I19675K314L663N300N648M130K190J714K956M521M974L993K389J401J658
$$ y = [3609010, 3620639, 3619502, 3599009, 3554172, 3483210, 3387233, 3269173, 3133569, 2986543, 2834681, 2683441, 2536667, 2397191, 2267081, 2147258, 2037603, 1937764, 1847523, 1766254, 1692580, 1625094, 1563270, 1507239, 1456811, 1411113, 1369190, 1330616, 1295396, 1263517, 1234709, 1208447, 1184072, 1161177, 1140133, 1122050, 1107817, 1097101, 1088502, 1080702, 1073248, 1066201, 1059411, 1052443, 1045017, 1037136, 1028724, 1019406, 1008913, 997626, 986465, 976008, 965823, 955065, 943953, 934238, 927640, 923882, 920925, 917286, 913434, 910575, 908812, 907289, 905593, 903989, 902406, 900278, 897646, 895574, 894966, 895575, 896586, 897721, 899215, 901062, 902752, 903652, 903442, 902475, 901889, 902945, 905874, 909629, 913000, 915625, 917748, 919675, 921989, 925652, 930952, 936600, 940730, 942920, 944634, 947590, 952111, 957085, 961078, 963467, 964868, 966526]
60311I66526K557L037L046L588N132O872P991Q829J0101J1644J2646J2597J1409
60298A065975R219O711M969M258L650K699K673M919Q667J1826J3622J4907J6108
60285A170203J6650J6737J7880K0706K3421K3600K0761J6178J0814M693j865p551
60273A332227j1180j2883j3774j4616j5180j4862j3593j1990j0792j0295j0116
60262A192946r246o781l217p06j013l070l841j970O98K078K845M918Q007R841
60248A191489R612R185J0490J3468J7139K1212K5864L0972L6334M1506M4980M4748
60236A496999M0503L4124K6953J7942N859p622j8904k6174l0552l3689l5964l7411
60224A432064l8756m0417m1354m0140l6924l3447l1068k9469k7506k4765k1799
$$ y = [966526, 969083, 972120, 975166, 978754, 983886, 990758, 998749, 1007578, 1017679, 1029323, 1041969, 1054566, 1065975, 1075194, 1081905, 1086874, 1091132, 1094782, 1097481, 1100154, 1105073, 1113740, 1125566, 1139188, 1154095, 1170203, 1186853, 1203590, 1221470, 1242176, 1265597, 1289197, 1309958, 1326136, 1336950, 1341643, 1339778, 1332227, 1321047, 1308164, 1294390, 1279774, 1264594, 1249732, 1236139, 1224149, 1213357, 1203062, 1192946, 1183700, 1176919, 1173702, 1172996, 1171983, 1168913, 1165072, 1163102, 1163800, 1165878, 1168723, 1173641, 1181648, 1191489, 1201101, 1210286, 1220776, 1234244, 1251383, 1272595, 1298459, 1329431, 1365765, 1407271, 1452251, 1496999, 1537502, 1571626, 1598579, 1616521, 1622380, 1614758, 1595854, 1569680, 1539128, 1505439, 1469475, 1432064, 1393308, 1352891, 1311537, 1271397, 1234473, 1201026, 1169958, 1140489, 1112983, 1088218, 1066419]
60213A066419j9137j6706j4341j2302j0932j0101r352q383p212o061n297n045
60201I41550m666l301j344m96j478k591j859J18J005O1j293k099k876l697l522
60186I13512k320j745k392k392m24J741J779M11J59J547L026M000N285O833P543
60171I36563P498P989Q959Q796P264O318P034P951P657O958O894O403L968L34
60157A030586k288k975k382j046P91K172K089J037M53O40O97L82N27J420K226
60142A034329K374K307K373K221J741J491J607J337L73l55j30K09n77k140k881
60127A044279k048m91N63O41n8r59j136L5J908K890K180P73K64J169K894M815
60111A057719O602P726P701O973O740P375P806P104O078O296P817Q968Q557P198
$$ y = [1066419, 1047282, 1030576, 1016235, 1003933, 993001, 982900, 973548, 965165, 957953, 951892, 946595, 941550, 936884, 933583, 932239, 931743, 930265, 927674, 925815, 925933, 926938, 926999, 925706, 923607, 920731, 917034, 913512, 911192, 909447, 907055, 904663, 904239, 905980, 907759, 908170, 908329, 909876, 912902, 916902, 922187, 929020, 936563, 944061, 952050, 961009, 969805, 977069, 983387, 990421, 998372, 1006029, 1012987, 1019881, 1026284, 1030252, 1030586, 1028298, 1025323, 1022941, 1021895, 1022686, 1024858, 1026947, 1027984, 1028437, 1029077, 1029774, 1030156, 1030683, 1032103, 1034329, 1036703, 1039010, 1041383, 1043604, 1045345, 1046836, 1048443, 1049780, 1050153, 1049798, 1049668, 1049877, 1049300, 1047160, 1044279, 1042231, 1041740, 1042303, 1042944, 1042886, 1041927, 1040791, 1040826, 1042734, 1045624, 1047804, 1048577, 1048841, 1050010, 1052904, 1057719, 1064321, 1072047, 1079748, 1086721, 1093461, 1100836, 1108642, 1115746, 1121824, 1128120, 1135937, 1144905, 1153462, 1160660]
60097A160660O054N199M033K610J560J055P91Q89J860L692N861Q314J1532J5225
60083A229335J7847J8039J6063J3372J1265J0290J0329J0497R480O705L042j97
60071A356067k697m952p087q635r415r809j0138j0380j0591j0818j0663r624q037
60058A243221o891o476n994m871l661l045k625j471M81K358L529M273N189O503
60044A230520P934R005R476R650J0149J1225J2565J3885J5296J6754J7555J6981
60032A380995J5278J3440J1998J0453P969M388N33k394l932m946o741r401j1526
60019A406114j1985j1365j0966j0940j0381r051p985q177r544j1347j2931j3751
60007A277691j3487j2506j1756j1801j2351j2926j3427j3839j3973j3883j3960
$$ y = [1160660, 1166714, 1171913, 1175946, 1178556, 1180116, 1181171, 1181962, 1182851, 1184711, 1188403, 1194264, 1202578, 1214110, 1229335, 1247182, 1265221, 1281284, 1294656, 1305921, 1316211, 1326540, 1337037, 1346517, 1353222, 1356264, 1356067, 1353370, 1348418, 1341331, 1332696, 1323281, 1313472, 1303334, 1292954, 1282363, 1271545, 1260882, 1251258, 1243221, 1236330, 1229854, 1223860, 1218989, 1215328, 1212283, 1209658, 1208187, 1208668, 1211026, 1214555, 1218828, 1224017, 1230520, 1238454, 1247459, 1256935, 1266585, 1276734, 1287959, 1300524, 1314409, 1329705, 1346459, 1364014, 1380995, 1396273, 1409713, 1421711, 1432164, 1440133, 1444521, 1445054, 1442660, 1438728, 1433782, 1427041, 1417640, 1406114, 1394129, 1382764, 1371798, 1360858, 1350477, 1341426, 1333441, 1325264, 1315720, 1304373, 1291442, 1277691, 1264204, 1251698, 1239942, 1228141, 1215790, 1202864, 1189437, 1175598, 1161625, 1147742, 1133782]
59996A133782j4146j3702j2271j0747j0319j0916j1248j0292q178n751l933l432
59984A018847m309n533n578l912j623k75m02j350k259k666k406j561p12o75j668
59969I83918l112m476n905p431q166p217n312m328m826n077l422p84K93j155l470
59954I19530m575m196l481l226l164k661j461K51K205M223O070P356P893Q174
59940I32938Q935J0104J0679J0207R820J1053J3830J6355J6942J5385J2658R998
59928A078904Q122O795N078K614L34p14q23r67j172q07k19m39j250j280m62n35
59912A093179k164l469k866j805k680m989n839m100j878j439k359k673j591jJ155
59897A056481J873K452K657K009Q10K72J314L352M868N104M563L703J984j163
$$ y = [1133782, 1119636, 1105934, 1093663, 1082916, 1072597, 1061681, 1050433, 1040141, 1031963, 1026212, 1022279, 1018847, 1014538, 1009005, 1003427, 999515, 997892, 997617, 997215, 995865, 993606, 990940, 988534, 986973, 986261, 985586, 983918, 980806, 976330, 970425, 962994, 954828, 947611, 942299, 937971, 933145, 928068, 924646, 923862, 924155, 923000, 919530, 914955, 910759, 907278, 904052, 900888, 898227, 896766, 897017, 899222, 903445, 909515, 916871, 924764, 932938, 941873, 951977, 962656, 972863, 982683, 993736, 1007566, 1023921, 1040863, 1056248, 1068906, 1078904, 1087026, 1093821, 1098899, 1101513, 1101847, 1101133, 1100310, 1099343, 1098171, 1097364, 1097145, 1096706, 1095456, 1094176, 1093714, 1093179, 1091015, 1087546, 1084680, 1082875, 1080195, 1075206, 1069367, 1065267, 1063389, 1061950, 1059591, 1056918, 1055327, 1055326, 1056481, 1058354, 1060806, 1063463, 1065472, 1066282, 1066554, 1067868, 1071220, 1076088, 1081192, 1085755, 1089458, 1091442, 1090279]
59883A090279m981p695q093o483m348l248l578m196l700k160q82m00R1R45J077
59868A042628k44j902k479k267k253k062q45M70P8j597j965JK150K281J083N72
59852A033649R97J075N39N82J717K744K460J382J024J936L224L939M170M434M624
59837A068496M235L437K979L004K842K302K217L072M100M509M742N396N763M872
59823A121966L442L082L828M151L518L120L626L878K696O38r98j838k189k026
59809A146894j269m70l43j064k517m532o413p108o553n926n786n016k771m92k77
59794A096357j859k893k208j043p00n85N29K616M760O658Q597J0424J1738J3077
59780A145468J5677J9587K2746K2760J9346J4447J0195P422N945N300M757L480
$$ y = [1090279, 1085298, 1077603, 1069510, 1063027, 1058679, 1055431, 1051853, 1047657, 1043957, 1041797, 1040915, 1040515, 1040606, 1041551, 1042628, 1042384, 1040482, 1038003, 1035736, 1033483, 1031421, 1030576, 1031046, 1031124, 1029527, 1027562, 1027563, 1029713, 1031994, 1033077, 1033649, 1034646, 1035721, 1036260, 1036842, 1038559, 1041303, 1043763, 1045145, 1046169, 1048105, 1051329, 1055268, 1059438, 1063872, 1068496, 1072731, 1076168, 1079147, 1082151, 1084993, 1087295, 1089512, 1092584, 1096684, 1101193, 1105935, 1111331, 1117094, 1121966, 1125408, 1128490, 1132318, 1136469, 1139987, 1143107, 1146733, 1150611, 1153307, 1153945, 1152947, 1151109, 1148920, 1146894, 1145625, 1145155, 1144812, 1143748, 1141231, 1136699, 1130286, 1123178, 1116625, 1110699, 1104913, 1099897, 1097126, 1096634, 1096357, 1094498, 1091605, 1089397, 1088354, 1087654, 1087069, 1087598, 1090214, 1094974, 1101632, 1110229, 1120653, 1132391, 1145468, 1161145, 1180732, 1203478, 1226238, 1245584, 1260031, 1270226, 1277648, 1283593, 1288893, 1293650, 1297130]
59768A297130J380p25k491m993r338j4774j9400k2592k5400k8273k9884k8924
59756A111716k6055k3091k0875j8805j6161j3144j0785j0092j0941j1677j0600
59745I39490q291p364r113j1421j1218q356n467m324m086l420k640k802l787m451
59731H52750m252l749l671m138m800n152m779l701k551k037k225k695l331m410
59717H01259n644n760l785n76J693J810P07N0L17Q52J266J760K240K216J773J754
59701H01932K512L221K975J994J209J164J784K825L918M543M610M724N331N889
59687H48631N623M774M321M464M246K896R43l65m56L8j9j074k381k805k275k012
59671H64549k852l793l041m47K047K659J692P17N56Q54J235J915K865L265K291
$$ y = [1297130, 1298510, 1297785, 1295294, 1290301, 1280963, 1266189, 1246789, 1224197, 1198797, 1170524, 1140640, 1111716, 1085661, 1062570, 1041695, 1022890, 1006729, 993585, 982800, 972708, 961767, 950090, 939490, 931199, 923835, 914722, 903301, 892083, 883727, 878260, 873936, 869850, 866430, 863790, 860988, 857201, 852750, 848498, 844749, 841078, 836940, 832140, 826988, 822209, 818508, 815957, 813920, 811695, 809000, 805669, 801259, 795615, 789855, 786070, 785494, 787187, 788997, 789704, 789754, 790071, 790923, 792189, 793949, 796189, 798405, 800178, 801932, 804444, 807665, 810640, 812634, 813843, 815007, 816791, 819616, 823534, 828077, 832687, 837411, 842742, 848631, 854254, 859028, 863349, 867813, 872059, 874955, 875898, 875533, 875077, 875115, 875096, 874022, 871641, 868836, 866561, 864549, 861697, 857904, 854863, 854416, 856463, 859122, 860814, 861531, 862087, 862941, 864176, 866091, 868956, 872221, 874512]
59656H74512L47j069q14Q60K876M583O139P667Q593Q219O854N908O527Q280R562
59641I49044R377Q379P899Q269Q721Q734Q681Q869Q815Q018O831N706M285K232
59627A053860M54J12N48k52k818n294o033n645n545n666n073l919l251l208k923
59612A005347k177j778k069k252j752j331k127l948n133m149j263J470K188J265
59598I82291Q57K172L935M340L631L475M258M576L595K285J743J611J029J06o27
59583A019277j493l226n554p269p793p851q378r232r325p899n575l967m088n190
59569I32437n616m791l723l333l120k192r61p81k039l614m409m614n049n910o747
59554H75538p258p450p153o066m488l401l345l603l106k091k057l749n859o446
$$ y = [874512, 874859, 873790, 872976, 873836, 876712, 881295, 887434, 895101, 903694, 911913, 918767, 924675, 931202, 939482, 949044, 958421, 966800, 974699, 982968, 991689, 1000423, 1009104, 1017973, 1026788, 1034806, 1041637, 1047343, 1051628, 1053860, 1054314, 1054426, 1054974, 1054722, 1051904, 1046610, 1040577, 1034932, 1029387, 1023721, 1018648, 1014729, 1011478, 1008270, 1005347, 1003170, 1001392, 999323, 997071, 995319, 993988, 991861, 987913, 982780, 978631, 977368, 978838, 981026, 982291, 983148, 985320, 989255, 993595, 997226, 1000701, 1004959, 1009535, 1013130, 1015415, 1017158, 1018769, 1019798, 1019904, 1019277, 1017784, 1014558, 1009004, 1001735, 993942, 986091, 977713, 968481, 959156, 951257, 945682, 941715, 937627, 932437, 926821, 922030, 918307, 914974, 911854, 909662, 908701, 907920, 905881, 902267, 897858, 893244, 888195, 882285, 875538, 868280, 860830, 853677, 847611, 843123, 839722, 836377, 832774, 829668, 827577, 825520, 821771, 815912, 809466]
59540H09466n212l512k280j049O56K067K154J283Q18J225J493P21n55j173j001
59525H05101j062k072l503m328m256l719k991j958p74o4j09m55p99j627l221m477
59509G69686l868j553O02J292R99N92n0j140j867j259L82K130L881N869P194O458
59493G89348L995J955J779K822L869M703N491N937O031O686Q514J0713J2244J3427
59479H77514J5214J7509J9472K1086K2824K3888K2426J7857J1852O487K432n90
59467A057971k639l469k991j283J255L624M855N169N551N897M723J372k686n618
59453A071731p276q494r370r650r976j1196j2736j3220j2596j2191j2587j2883
59441I39556j2316j1327j0457r394p856o450n914n980n766m835l424j903n60L92
$$ y = [809466, 804254, 800742, 798462, 797413, 798069, 800136, 802290, 803573, 804391, 805616, 807109, 807830, 807275, 806102, 805101, 804039, 801967, 798464, 794136, 789880, 786161, 783170, 781212, 780438, 780374, 780265, 779810, 779011, 777384, 774163, 769686, 765818, 764265, 764867, 766159, 767158, 767750, 767700, 766560, 764693, 763434, 763816, 765946, 769827, 775696, 782890, 789348, 793343, 795298, 797077, 799899, 803768, 808471, 813962, 819899, 825930, 832616, 841130, 851843, 864087, 877514, 892728, 910237, 929709, 950795, 973619, 997507, 1019933, 1037790, 1049642, 1056129, 1058561, 1057971, 1055332, 1051863, 1048872, 1047589, 1048844, 1052468, 1057323, 1062492, 1068043, 1073940, 1078663, 1080035, 1077349, 1071731, 1064455, 1055961, 1046591, 1036941, 1026965, 1015769, 1003033, 989813, 977217, 965026, 952439, 939556, 927240, 915913, 905456, 896062, 888206, 881756, 875842, 869862, 864096, 859261, 855837, 853934, 853374, 853766]
59427H53766R12J130J101Q28M79K97K85M07R70K242L742M599M683M642M799M716
59411H89598M033K956J797Q01N01J296K447K588J678J322K530M249M967M827N044
59396I30634N977P030P967R089J0258J0934J1186J1688J2580J3089J2453J0589
59384A053474P748M280Q76j644l220m705o711q601r141q098o644n992o020n755
59370I99847m948m337m195l630j981n4J079J902L741O691R602J1936J4079J5979
59356A045711J7235J8586K1258K4617K6775K8090L0991L4828L4030K4350R059
59345A315530m373j2334j6631j9149j9078j5836j0916n573L90N953P633L037n833
59332A222820j4659k0977k4949k7157k7506k5801k2132j6990j1730q216p060o804
$$ y = [853766, 854678, 855808, 856909, 857737, 858216, 858513, 858798, 859205, 860175, 862417, 866159, 870758, 875441, 880083, 884882, 889598, 893631, 896587, 898384, 899185, 899686, 900982, 903429, 906017, 907695, 909017, 911547, 915796, 920763, 925590, 930634, 936611, 943641, 951608, 960697, 970955, 981889, 993075, 1004763, 1017343, 1030432, 1042885, 1053474, 1061222, 1065502, 1066378, 1064734, 1061514, 1056809, 1050098, 1041497, 1032356, 1024258, 1017614, 1011622, 1005602, 999847, 994899, 990562, 986367, 982737, 980756, 980702, 981781, 983683, 987424, 994115, 1003717, 1015653, 1029732, 1045711, 1062946, 1081532, 1102790, 1127407, 1154182, 1182272, 1213263, 1248091, 1282121, 1306471, 1315530, 1311157, 1298823, 1282192, 1263043, 1243965, 1228129, 1217213, 1211640, 1212030, 1217983, 1225616, 1228653, 1222820, 1208161, 1187184, 1162235, 1135078, 1107572, 1081771, 1059639, 1042649, 1030919, 1022703, 1015643, 1008839]
59320A008839n656l407r98J004K481L238L495M305O309Q537R555R402R258R578
59306A065940R757R547R523R963J0366J0368J0329J0608J0990J1175J1341J1793
59294A191700J2464J3057J3486J3916J4582J5647J7055J8456J9466K0057K0460
59283A370346K0688K0374J9257J7608J6027J4813J3607J1693Q635M740R93j500
59271A517281k320k305l241o412j1175j5318j7201j7247j6995j7099j7038j6476
59259A374454j5886j5634j5213j3858j1465q571n852l903l092l343m215n245n894
59246A262283n352l167j95J913K561K883M151O157P830Q877R988J1629J3412J4631
59232A337601J4912J4338J3485J3341J4767J7748K1244K3708K3582J9625J1463
$$ y = [1008839, 1003183, 999776, 998778, 999782, 1002263, 1005501, 1008996, 1013301, 1019610, 1028147, 1037702, 1047104, 1056362, 1065940, 1075697, 1085244, 1094767, 1104730, 1115096, 1125464, 1135793, 1146401, 1157391, 1168566, 1179907, 1191700, 1204164, 1217221, 1230707, 1244623, 1259205, 1274852, 1291907, 1310363, 1329829, 1349886, 1370346, 1391034, 1411408, 1430665, 1448273, 1464300, 1479113, 1492720, 1504413, 1513048, 1517788, 1518781, 1517281, 1514961, 1512656, 1509415, 1503003, 1491828, 1476510, 1459309, 1442062, 1425067, 1407968, 1390930, 1374454, 1358568, 1342934, 1327721, 1313863, 1302398, 1293827, 1287975, 1284072, 1280980, 1277637, 1273422, 1268177, 1262283, 1256931, 1253764, 1253569, 1255482, 1258043, 1260926, 1265077, 1271234, 1279064, 1287941, 1297929, 1309558, 1322970, 1337601, 1352513, 1366851, 1380336, 1393677, 1408444, 1426192, 1447436, 1471144, 1494726, 1514351, 1525814]
59221A525814K17j1583k1185k7131k9780l0328k9342k6549k1986j6796j2319q782
59209A290250n607k780j013m50j93M67J027N26j167l373n470p192q384r135j0036
59194A237470j1747j4088j5924j6197j5029j3609j2845j2264j0651p845n304m372
59182A097595m537m221k991j846j368o64J270L992O054O504N565M162L111K495
59168A115121J787Q48N14J414K554K303P95r4M51R41j01j977l138l366l282k645
59152A112125q42J459K773K689K089J595J187J140J971L270L878L493L073L463
59138A143363M633O365Q527J0283J0370Q794P249P020P363O870N772N655P054
59125A239318Q516Q367O637M649L173J740q0j474j310n9K91j199k749j895J235
$$ y = [1525814, 1526031, 1514448, 1493263, 1466132, 1436352, 1406024, 1376682, 1350133, 1328147, 1311351, 1299032, 1290250, 1284643, 1281863, 1280850, 1280400, 1280207, 1280674, 1281701, 1282227, 1281060, 1277687, 1272217, 1265025, 1256641, 1247506, 1237470, 1225723, 1211635, 1195711, 1179514, 1164485, 1150876, 1138031, 1125767, 1115116, 1107271, 1101967, 1097595, 1093058, 1088837, 1085846, 1084000, 1082632, 1081968, 1083238, 1087230, 1093284, 1099788, 1105353, 1109515, 1112626, 1115121, 1116908, 1117756, 1118270, 1119684, 1122238, 1124541, 1125336, 1125242, 1125693, 1126634, 1126533, 1124556, 1121418, 1118052, 1114770, 1112125, 1111283, 1112742, 1115515, 1118204, 1120293, 1121888, 1123075, 1124215, 1126186, 1129456, 1133334, 1136827, 1139900, 1143363, 1147996, 1154361, 1162888, 1173171, 1183541, 1192335, 1199584, 1206604, 1213967, 1220837, 1226609, 1232264, 1239318, 1247834, 1256201, 1262838, 1267487, 1270660, 1272400, 1272320, 1270846, 1269536, 1269477, 1269768, 1268569, 1265820, 1263925, 1265160]
59110A265160L858L926K424J817L052M862N610M983L975L671M253N017N246M931
59096A322785M334L205J106j388k722k250j458k511n651q860j0102r308p940p204
59082A272036p052o693n658m410l924m565n422n175l681k227j849j935j187M51
59068A218709J844K620L921O599R573J1059J0959J0964J2309J4440J6182J7307
59056A336486J8414J9744K0868K1404K1591K2023K2972K4005K4380K3819K2809
59045A578515K1885K0921J9480J7654J5925J4150J1463P619L769J331K39r92l474
59032A708485o681r214j0451j0912j1081j0630r426q762j0356j4053j7730k0037
59020A569152k1943k4627k7135k7810k7212k7486k9007k9728k8288k5806k3843
$$ y = [1265160, 1269018, 1272944, 1275368, 1277185, 1280237, 1285099, 1290709, 1295692, 1299667, 1303338, 1307591, 1312608, 1317854, 1322785, 1327119, 1330324, 1331430, 1330042, 1327320, 1325070, 1323612, 1321101, 1315450, 1306590, 1296488, 1287180, 1279240, 1272036, 1264984, 1258291, 1252633, 1248223, 1244299, 1239734, 1234312, 1229137, 1225456, 1223229, 1221380, 1219445, 1218258, 1218709, 1220553, 1223173, 1227094, 1233693, 1243266, 1254325, 1265284, 1276248, 1288557, 1302997, 1319179, 1336486, 1354900, 1374644, 1395512, 1416916, 1438507, 1460530, 1483502, 1507507, 1531887, 1555706, 1578515, 1600400, 1621321, 1640801, 1658455, 1674380, 1688530, 1699993, 1707612, 1711381, 1712712, 1712951, 1711959, 1708485, 1701804, 1692590, 1682139, 1671227, 1660146, 1649516, 1640090, 1631328, 1620972, 1606919, 1589189, 1569152, 1547209, 1522582, 1495447, 1467637, 1440425, 1412939, 1383932, 1354204, 1325916, 1300110, 1276267]
59009A276267k2247k0166j7803j5925j4580j3385j2251j0914q621n465l127l113
58997A128670m766o213o631o484o012m861l069j255J62J129J544J458J440K009
58983A097121K968L957N096O330O868O469O437Q006J0188J0982J0400J0491J2188
58970A197501J4041J4627J4587J5309J6970J8955K1215K3963K6627K8241K8723
58959A420759K8900K9308K9506K8536K5694K1066J5636J0681O775L558O38j663
58947A619394k831l123l396m003m284l402j443N13J431J217M89l64j665l941p163
58932A587429j0546j3119j4590j5760j7768k0665k3141k4099k4049k4204k4639
58921A374849k4520k3852k3391k2680k0084j5472j1124q770p328n177l118k904
$$ y = [1276267, 1254020, 1233854, 1216051, 1200126, 1185546, 1172161, 1159910, 1148996, 1140375, 1134910, 1131783, 1128670, 1123904, 1117691, 1111060, 1104576, 1098564, 1093703, 1090634, 1089379, 1089541, 1090670, 1092214, 1093672, 1095112, 1097121, 1100089, 1104046, 1109142, 1115472, 1122340, 1128809, 1135246, 1143252, 1153440, 1164422, 1174822, 1185313, 1197501, 1211542, 1226169, 1240756, 1256065, 1273035, 1291990, 1313205, 1337168, 1363795, 1392036, 1420759, 1449659, 1478967, 1508473, 1537009, 1562703, 1583769, 1599405, 1610086, 1616861, 1620419, 1621057, 1619394, 1616563, 1613440, 1610044, 1606041, 1601757, 1598355, 1596912, 1597425, 1598856, 1600073, 1600562, 1600198, 1598533, 1594592, 1587429, 1576883, 1563764, 1549174, 1533414, 1515646, 1494981, 1471840, 1447741, 1423692, 1399488, 1374849, 1350329, 1326477, 1303086, 1280406, 1260322, 1244850, 1233726, 1224956, 1217628, 1212451, 1209333, 1206429]
58909A206429l818l168p3L425N331N814N834N403M213K840K346L112M505N199
58895A247392L884M02l812p087r179j0718j1541j0936r395q380q167p503n900
58882A159060m495l872k643M20M008N518M056J037j768l697n038o452q478j0830
58868A126826j2356j2224j0969r810r225q844q505q460q467p537n173k448j074
58855A021734j343j645o03Q47N88j450k473j50M316P650Q458Q224Q603R467J0062
58840A072285J0563J1527J2709J3411J3536J3550J3659J3619J3273J2973J3369
58829A214474J4739J6436J7268J6842J6170J6366J7071J6930J5396J3184J1000
58818A385876Q832O479L950J162j899m802p134r203j1332j2732j2409j1070j0617
$$ y = [1206429, 1202611, 1199443, 1199370, 1202795, 1208126, 1213940, 1219774, 1225177, 1229390, 1232230, 1234576, 1237688, 1242193, 1247392, 1251276, 1251678, 1247866, 1240779, 1231600, 1220882, 1209341, 1198405, 1189010, 1180630, 1172463, 1164960, 1159060, 1154565, 1150693, 1148050, 1148470, 1152478, 1157996, 1162052, 1163089, 1161321, 1157624, 1152586, 1146134, 1137656, 1126826, 1114470, 1102246, 1091277, 1081467, 1072242, 1063398, 1054893, 1046433, 1037966, 1030429, 1025256, 1022808, 1021734, 1020391, 1018746, 1018143, 1018990, 1019578, 1018128, 1015655, 1015505, 1019821, 1027471, 1035929, 1044153, 1052756, 1062223, 1072285, 1082848, 1094375, 1107084, 1120495, 1134031, 1147581, 1161240, 1174859, 1188132, 1201105, 1214474, 1229213, 1245649, 1262917, 1279759, 1295929, 1312295, 1329366, 1346296, 1361692, 1374876, 1385876, 1394708, 1401187, 1405137, 1406299, 1404400, 1399598, 1392464, 1383261, 1371929, 1359197, 1346788, 1335718, 1325101]
58805A325101j1551j2407j2154j1630j1976j3091j4436j5964j7315j7457j6280
58794A170840j5448j6247j7498j6997j4523j2043j1157j1443j1354r944p730o278
58782A020178o642p938p996o044l915l824n597p054o790n453m338l751l104k033
58768I45699r87p03j318k199k776l148l462l222k102j067j369k461k324k78J920
58753I20203K360J146l53j171r30M12J937K008J89j897k648k370k181k088j488
58738I13129n74J77J062K226K474Q11j404j767r1J466J676J710K902M709N823
58723I34329O081O277O809P383P724P900Q067Q267Q279P615N927L489J099m74
58709A018772r00m16M2p10k933n378o468n968m916m058l143j859p38o79j800l128
$$ y = [1325101, 1313550, 1301143, 1288989, 1277359, 1265383, 1252292, 1237856, 1221892, 1204577, 1187120, 1170840, 1155392, 1139145, 1121647, 1104650, 1090127, 1078084, 1066927, 1055484, 1044130, 1034186, 1026456, 1020178, 1013536, 1005598, 997602, 991558, 987643, 983819, 978222, 971168, 964378, 958925, 954587, 950836, 947732, 945699, 944712, 944009, 942691, 940492, 937716, 934568, 931106, 927884, 925782, 924715, 923346, 920885, 918561, 918283, 920203, 922563, 923709, 923356, 922185, 921255, 921667, 923604, 925612, 925801, 923904, 921256, 918886, 916705, 914617, 913129, 912555, 912732, 913794, 916020, 918494, 919305, 917901, 916134, 916043, 917509, 919185, 920895, 923797, 928506, 934329, 940410, 946687, 953496, 960879, 968603, 976503, 984570, 992837, 1001116, 1008731, 1014658, 1018147, 1019246, 1018772, 1017872, 1017456, 1017498, 1016788, 1013855, 1008477, 1002009, 996041, 991125, 987067, 983924, 982065, 981327, 980648, 978848, 975720]
58693I75720l439k361o07Q53J769K569L601M794N973P034P879Q742J0372J3021
58679A035920J5370J5637J4003J2759J3495J5369J6783J7534J8210J8575J7961
58668A211616J6635J5417J4216J2222R331O384M010K094M55p06j005j47J870M395
58654A296787O269O655N532L292M79k011l595n061p761j1266j3560j4320j6085
58641A245355k0577k5636k8016k7890k7916k8696k8190k5584k2760k1191j9862
58630I69037j7514j4898j3327j2465j1091r113p525o837o617o268n510m457l618
58617H49797l509l894l748k264L95L455O064P428P201O076N433O074P637R312
58603H95457J0628J1400J1495J0888R587P521M842K185O0j859m039n947o531n896
$$ y = [975720, 972281, 969920, 969313, 970166, 971935, 974504, 978105, 982899, 988872, 995906, 1003785, 1012527, 1022899, 1035920, 1051290, 1066927, 1080930, 1093689, 1107184, 1122553, 1139336, 1156870, 1175080, 1193655, 1211616, 1228251, 1243668, 1257884, 1270106, 1279437, 1285821, 1289831, 1291925, 1292380, 1291674, 1290669, 1290522, 1292392, 1296787, 1303056, 1309711, 1315243, 1318535, 1319014, 1317003, 1313408, 1308347, 1300586, 1289320, 1275760, 1261440, 1245355, 1224778, 1199142, 1171126, 1143236, 1115320, 1086624, 1058434, 1032850, 1010090, 988899, 969037, 951523, 936625, 923298, 910833, 899742, 890629, 883104, 876267, 869650, 863382, 857872, 853415, 849797, 846288, 842394, 838646, 836382, 836777, 840232, 846296, 853724, 860925, 867001, 872434, 878508, 886145, 895457, 906085, 917485, 928980, 939868, 949455, 956976, 961818, 964003, 964063, 962204, 958165, 952218, 945687, 939791]
58589I39791n387n755o239n901m970m249l958l896m249n388p028q163p965o466
58575H60177m434k802k092k155k294j690L6K367L983L801K114L65n01q64j312
58560H54699j413l50J702L730N170O231P047P335O997O379N804N358N169N317
58546I19175N376M531K370n47k898l348j552J274L183L330K653K480L003L640
58532I42670M242N105O241P347Q363R316R913R894R580R554J0109J1329J3180
58519A056843J5006J5677J4852J3461J2363J1325J0097R474J0125J1249J1764
58508A192236J2142J3633J6290J9207K2327K6264L0508L3317L3608L1807K8849
58497A460188K5553K2809K1083J9630J7317J4156J0949P654L469j613o743j1661
$$ y = [939791, 934404, 928649, 922410, 916509, 911539, 907290, 903332, 899436, 895187, 889799, 882771, 874608, 866643, 860177, 855743, 852941, 850849, 848694, 846400, 844710, 844746, 847113, 851096, 854897, 857011, 857376, 856875, 856011, 854699, 853286, 852936, 854638, 858368, 863538, 869769, 876816, 884151, 891148, 897527, 903331, 908689, 913858, 919175, 924551, 929082, 931452, 930905, 928007, 924659, 923107, 924381, 927564, 930894, 933547, 936027, 939030, 942670, 946912, 952017, 958258, 965605, 973968, 983284, 993197, 1003091, 1012671, 1022225, 1032334, 1043663, 1056843, 1071849, 1087526, 1102378, 1115839, 1128202, 1139527, 1149624, 1159098, 1169223, 1180472, 1192236, 1204378, 1218011, 1234301, 1253508, 1275835, 1302099, 1332607, 1365924, 1399532, 1431339, 1460188, 1485741, 1508550, 1529633, 1549263, 1566580, 1580736, 1591685, 1599339, 1602808, 1601195, 1594452, 1582791]
58485A582791j6718k1351k4207k5191k5909k7394k8745k8659k7329k5931k4916
58474A306441k3728k1835j9521j7612j6552j5829j4685j3337j2699j2513j1119
58463A127011p965n085m505n238m726k636j109j356k076j570K53K348L626L324
58449A100296J525m62j326j334j549j868j315n8M88m07k121l822m925m744l363
58434A075015k355k777k981o47L312N609N352N110O665Q611R304R521J0595J2108
58420A142442J3115J3965J5302J6563J6904J6407J5278J3157J0245P786O320M773
58408A292257K230p29l402o142q986j0666j0363r220q683q432p403n873m898m343
58394A205347k924j08L089N089N081L668K497K698L538L349J809K92k04j76m88
$$ y = [1582791, 1566073, 1544722, 1520515, 1495324, 1469415, 1442021, 1413276, 1384617, 1357288, 1331357, 1306441, 1282713, 1260878, 1241357, 1223745, 1207193, 1191364, 1176679, 1163342, 1150643, 1138130, 1127011, 1119046, 1113961, 1109456, 1104218, 1099492, 1096856, 1095747, 1094391, 1092315, 1090745, 1090998, 1093346, 1096972, 1100296, 1101821, 1101359, 1100033, 1098699, 1097150, 1095282, 1093967, 1093909, 1094397, 1093990, 1091869, 1088047, 1083122, 1078378, 1075015, 1072660, 1069883, 1066902, 1066255, 1069567, 1075176, 1080528, 1085638, 1092303, 1100914, 1110218, 1119739, 1130334, 1142442, 1155557, 1169522, 1184824, 1201387, 1218291, 1234698, 1249976, 1263133, 1273378, 1281164, 1287484, 1292257, 1294487, 1293758, 1290356, 1284214, 1275228, 1264562, 1254199, 1244979, 1236296, 1227864, 1220461, 1214588, 1209690, 1205347, 1202423, 1202315, 1205404, 1210493, 1215574, 1219242, 1221739, 1224437, 1227975, 1231324, 1233133, 1233425, 1233221, 1233045, 1232557]
58379A232557j227j989k169r23J877M662N671N330N449O268O481O262P487J0332
58365A286068J2363J2271J1928J3260J5256J5891J5076J3824J2176R881P722O393
58353A432109N143L102P83j132l190n899q222q975q710q722r061q898q071o919
58339A363338n253k617Q13M254O679P062N415L663L869N403N768M444L473L671
58325A409982L128O83j805k409j857j475p50R94K652L326M289O674Q957R301Q764
58310A450454R579J1559J2735J2541J2026J1673J1268J1215J2047J3295J4439
58299A582831J5992J8154J9572J9187J8062J7674J7653J7015J6285J6394J6702
58288A775521J6163J5284J5066J5135J4859J5012J6338J7700J7778J7418J8211
$$ y = [1232557, 1231330, 1229341, 1227172, 1226249, 1228126, 1232788, 1238459, 1243789, 1249238, 1255506, 1261987, 1268249, 1275736, 1286068, 1298431, 1310702, 1322630, 1335890, 1351146, 1367037, 1382113, 1395937, 1408113, 1417994, 1425716, 1432109, 1437252, 1440354, 1441137, 1440005, 1436815, 1430916, 1422694, 1413719, 1405009, 1396287, 1387226, 1378328, 1370257, 1363338, 1358085, 1355468, 1356281, 1360535, 1367214, 1374276, 1379691, 1383354, 1387223, 1392626, 1398394, 1402838, 1406311, 1409982, 1413110, 1413793, 1411988, 1409579, 1407722, 1406247, 1405497, 1406491, 1409143, 1412469, 1416758, 1423432, 1432389, 1441690, 1450454, 1460033, 1471592, 1484327, 1496868, 1508894, 1520567, 1531835, 1543050, 1555097, 1568392, 1582831, 1598823, 1616977, 1636549, 1655736, 1673798, 1691472, 1709125, 1726140, 1742425, 1758819, 1775521, 1791684, 1806968, 1822034, 1837169, 1852028, 1867040, 1883378, 1901078, 1918856, 1936274, 1954485]
58277A954485J9831K0850K1124K1327K1207K0281J9288J8915J8210J6190J3871
58266B165579J2735J2400J1842J1609J2611J3934J4152J3831J4538J6258J7794
58255B317283J8767J9347J9250J8829J9932K3546K7785L0123L0533L0670L1441
58244B587506L3102L5977L9224M0717M0022L9502M0494M0909L8934L6484L6066
58233C008937L6801L6763L6861L8843M1617M3354M5308M9581N4700N7499N8210
58222C508474N9804O3289O7391P1848P7211Q2097Q4439Q5028Q6592Q9930R3815
58211D369918R7817J02187J06034J08678J11899J17873J25932J34017J41941J50412
58201E566708J58578J65486J72342J80312J88173J95111K03515K15534K29203
$$ y = [1954485, 1974316, 1995166, 2016290, 2037617, 2058824, 2079105, 2098393, 2117308, 2135518, 2151708, 2165579, 2178314, 2190714, 2202556, 2214165, 2226776, 2240710, 2254862, 2268693, 2283231, 2299489, 2317283, 2336050, 2355397, 2374647, 2393476, 2413408, 2436954, 2464739, 2494862, 2525395, 2556065, 2587506, 2620608, 2656585, 2695809, 2736526, 2776548, 2816050, 2856544, 2897453, 2936387, 2972871, 3008937, 3045738, 3082501, 3119362, 3158205, 3199822, 3243176, 3288484, 3338065, 3392765, 3450264, 3508474, 3568278, 3631567, 3698958, 3770806, 3848017, 3930114, 4014553, 4099581, 4186173, 4276103, 4369918, 4467735, 4569922, 4675956, 4784634, 4896533, 5014406, 5140338, 5274355, 5416296, 5566708, 5725286, 5890772, 6063114, 6243426, 6431599, 6626710, 6830225, 7045759, 7274962]
58192G274962K41625K53703K67874K83497K98492L13557L30947L51052L73435
58183I989144L98711M26191M52901M78218N05710N36892N67786N96027O26273
58174A4577853O63391P05417P48867P95499Q47171Q99591R48734R98429J053844
58165B2238796J112476J169971J229805J298102J373564J452063J537047J635813
58157C3047637J749532J876085K017990K177631K349657K528574K719339K930899
58149E1397344L165708L426501L726292M079486M490079M960285N501646O124069
58141H6871410O824084P599206Q464060R438809J0536323J1775523J3185058J4769296
58133A69463769J6490681J8311699K0236785K2301284K4556689K7039454K9551093
$$ y = [7274962, 7516587, 7770290, 8038164, 8321661, 8620153, 8933710, 9264657, 9615709, 9989144, 10387855, 10814046, 11266947, 11745165, 12250875, 12787767, 13355553, 13951580, 14577853, 15241244, 15946661, 16695528, 17491027, 18338198, 19237789, 20186523, 21184952, 22238796, 23351272, 24521243, 25751048, 27049150, 28422714, 29874777, 31411824, 33047637, 34797169, 36673254, 38691244, 40868875, 43218532, 45747106, 48466445, 51397344, 54563052, 57989553, 61715845, 65795331, 70285410, 75245695, 80747341, 86871410, 93695494, 101294700, 109758760, 119197569, 129733892, 141509415, 154694473, 169463769, 185954450, 204266149, 224502934, 246804218, 271360907, 298400361, 327951454]
58126C27951454L1261401L0631508K6143897J7473609O014846n818867j5872827
58119D17785021k3024292k7128917k8618308k8174951k6497608k4123505k1400460
58112B38816980j8564073j5736105j2889274j0024905p488317n952805n900321
58105A62261180p121290q819883j0197223j0882507j0901493j0433081r665719
58098I4239984q765562p850513o975518o164836n443366m824072m293608l833540
58090D6088969l439236l104510k808127k532057k278379k055170j859207j683779
58082B6328504j530343j400925j289232j188794j100876j026853r61520r00354
58074A6929607q44637p93978p42699o88893o38316n94289n52389n10062m72820
$$ y = [327951454, 359212855, 389844363, 415988260, 433461869, 439476715, 433657848, 417785021, 394760729, 367631812, 339013504, 310838553, 284340945, 260217440, 238816980, 220252907, 204516802, 191627528, 181602623, 174114306, 168161501, 162261180, 155139890, 146320007, 136122784, 125240277, 114338784, 103905703, 94239984, 85474422, 77623909, 70648391, 64483555, 59040189, 54216117, 49922509, 46088969, 42649733, 39545223, 36737096, 34205039, 31926660, 29871490, 28012283, 26328504, 24798161, 23397236, 22108004, 20919210, 19818334, 18791481, 17829961, 16929607, 16084970, 15290992, 14548293, 13859400, 13221084, 12626795, 12074406, 11564344, 11091524]
58065A1091524m45422m24621m05830l89613l76659l63427l47913l33331l21456
58056G683252l08459k91882k75642k63415k52669k39997k27224k17541k10012
58047E396411k02249j94501j87346j79142j69323j60544j54455j48940j42386
58038C857525j36808j33765j30819j25102j17231j09068j00808r2690q6418q2578
58028B742238p9539p6679p5334p5005p2552o7317o3043o2310o2688o1145n8591
58017A988035n7153n6153n4038n1652n0538n0081m8955m7453m6216m4574m2190
58006A439032m0284l9362l7902l5003l2206l0776k9428k6702k3445k1078j9382
57995A103464j7903j7540j8658j9452j8249j6002j4749j4835j5239j5324j4991
$$ y = [11091524, 10646102, 10221481, 9815651, 9426038, 9049379, 8685952, 8338039, 8004708, 7683252, 7374793, 7082911, 6807269, 6543854, 6291185, 6051188, 5823964, 5606423, 5396411, 5194162, 4999661, 4812315, 4633173, 4463850, 4303306, 4148851, 3999911, 3857525, 3720717, 3586952, 3456133, 3331031, 3213800, 3104732, 3003924, 2911234, 2824816, 2742238, 2662699, 2586020, 2510686, 2435681, 2363129, 2295812, 2232769, 2170459, 2107771, 2046626, 1988035, 1930882, 1874729, 1820691, 1769039, 1718501, 1668420, 1619465, 1572012, 1525796, 1481222, 1439032, 1398748, 1359386, 1321484, 1286481, 1254275, 1223499, 1194071, 1167369, 1143924, 1122846, 1103464, 1085561, 1068021, 1049363, 1029911, 1011662, 995660, 980911, 966076, 950837, 935513, 920522]
57984I20522j4201j3445j3437j3675j2898j1489j1548j3713j6044j6869j6732
57973G66471j6506j5774j4338j3311j3338j3586j3604j4349j6051j6972j5711
57962F02931j3065j0503q405o917o635p169o785m867l106l036l865m098l681l327
57948E17472l061k757k776l052k721j540l54M77J544K677K722J804J816L581N466
57933E21298O027O060O700P365P206O889P241P497O513M610K774J182k56r97q22
57918E89287p15j653l436n382p206q395q101o396m455k888j429n17j246k973l285
57903E31210j437L12J77n76j90O50N09j4L95R83Jk284l840l757k967k389j922
57886E14861j250n11k44j159l307n135m581j762P68J337J240K363M357N618N751
$$ y = [920522, 906321, 892876, 879439, 865764, 852866, 841377, 829829, 816116, 800072, 783203, 766471, 749965, 734191, 719853, 706542, 693204, 679618, 666014, 651665, 635614, 618642, 602931, 589866, 579363, 570958, 564041, 557406, 550237, 543452, 538585, 535479, 532443, 528578, 524480, 520799, 517472, 514411, 511654, 508878, 505826, 503105, 501565, 501211, 501688, 503232, 505909, 508631, 510435, 512251, 515832, 521298, 527325, 533385, 540085, 547450, 554656, 561545, 568786, 576283, 582796, 587406, 590180, 591362, 591106, 590109, 589287, 588572, 586919, 583483, 578101, 570895, 562500, 554399, 548003, 543548, 540660, 539231, 538714, 537468, 534495, 531210, 529773, 530085, 530262, 529686, 529496, 530146, 530655, 530641, 531036, 532019, 532020, 529736, 525896, 522139, 519172, 516783, 514861, 513611, 513100, 512856, 511697, 508390, 503255, 498674, 496912, 497680, 499017, 500257, 502620, 506977, 512595, 518346]
57871E18346N374M611L412K616L075M280N099N217M829L707J729l58j725k338
57857E57874k418k027j809k803m783o176o368o537p256p303o069n088n553o223
57843D87461n658m713m771n240n040m930n981p212p293p233q609j0316r959p647
57829C92859n488m107k615j450k023l656l973k484r62j49R50K170J733n13k266
57814C68026k255j906k497l105k820k598l293l814l033j854j679k220k498k793
57800C31661l773m632l870j533P97K022K513L224M682O592P976Q084P451P343
57786C68537P908P900O786N820O149O986O849N735M694L953K839J290lq62j756
57771D32825k574k470j294k44n00j826k977l167k655k087j624r21J19P62P5j701
$$ y = [518346, 523720, 528331, 531743, 534359, 537434, 541714, 546813, 552030, 556859, 560566, 562295, 561937, 560212, 557874, 555456, 553429, 551620, 548817, 544034, 537858, 531490, 524953, 517697, 510394, 504325, 499237, 493684, 487461, 481803, 477090, 472319, 467079, 462039, 457109, 451128, 443916, 436623, 429390, 420781, 410465, 400506, 392859, 387371, 383264, 380649, 379199, 377176, 373520, 369547, 367063, 366101, 365952, 366902, 369072, 370805, 370292, 368026, 365771, 363865, 361368, 358263, 355443, 352845, 349552, 345738, 342705, 340851, 339172, 336952, 334454, 331661, 327888, 323256, 319386, 317853, 318650, 320672, 323185, 326409, 331091, 337683, 345659, 353743, 361194, 368537, 376445, 384345, 391131, 396951, 403100, 410086, 416935, 422670, 427364, 431317, 434156, 435446, 435443, 434581, 432825, 430251, 427781, 426487, 426243, 425743, 423917, 420940, 417773, 415118, 413031, 411407, 410486, 410605, 411367, 411442, 409741]
57755D09741k916k195j39J247P68q41k012j986j208o71j166k718m379n004m602
57740C81919m479n548o958p239o453o141p082q159p899o156l748j396K82O43l8
57725C11548j89J272L261L815K671J218L21k52l67O14K163K531J260J03N58J770
57709C32297K119J622J374J426Q26n91j864k331k281k217k279k543l187m274n626
57694C12471o890p557p242o205n153m327l301j901o29R6M00L67j76r47j322j520
57678B66164k501m075m536l136j508j312j842j515o00m53q53k39J653L363L917
57663B52527L664K847J114j239k924l075j936j66J370J361p71l352l852k145p12
57648B42711j165k362k644k192j937j719r96k28M9P24L049O396Q647Q819P981
$$ y = [409741, 406825, 404630, 404491, 405738, 406506, 405665, 403653, 401667, 400459, 399788, 398622, 395904, 391525, 386521, 381919, 377440, 371892, 364934, 357695, 351242, 345101, 338019, 329860, 321961, 315805, 312057, 310661, 310943, 311586, 311548, 311359, 312631, 315892, 319707, 322378, 323596, 323917, 323665, 323298, 323912, 326075, 328606, 329866, 329969, 330527, 332297, 334416, 336038, 337412, 338838, 339664, 339073, 337209, 334878, 332597, 330380, 328101, 325558, 322371, 318097, 312471, 305581, 298024, 290782, 284577, 279424, 275097, 271796, 269895, 269266, 269362, 269762, 270129, 269953, 269006, 267684, 266164, 263663, 259588, 255052, 251916, 250408, 249096, 247254, 245739, 245139, 244686, 243833, 243594, 245247, 248610, 252527, 256191, 259038, 260152, 258913, 255989, 252914, 250978, 250812, 252182, 253543, 252772, 249420, 245568, 243423, 242711, 241546, 239184, 236540, 234348, 232411, 230692, 229696, 229468, 229517, 230241, 233290, 239686, 248333, 257152, 265133]
57633B65133P324O521M660K044J77M6R77J418N96q50j779j638m85J520M099O653
57617B96416Q762J0844J3630J7028K0223K2984K6097L0243L5208M0568M6373N2336
57605F20712N6737N7009N1499M0198K4102M689j5606l3358m5711n2220n4564n4310
57593E99177n1612m6593m0947l6827l4298l1343k6758k1726j7900j5218j2662
57582B63293j0089p989o109l916k120k094l679m927m458k951j865j642j774j848
57568B07832j735j218r5J269J874P91j866m577n474m127k038j079j751l297m773
57553A79736n370m434k214k45K01k34O0J228J751P58p75j518j375j125j310j985
57537A63149k898l486l327k798k789l456l956l620k809k319k474l027l474l313
$$ y = [265133, 272457, 278978, 283638, 285682, 285859, 285905, 286882, 288300, 288896, 288046, 286267, 284629, 284144, 285664, 289763, 296416, 305178, 316022, 329652, 346680, 366903, 389887, 415984, 446227, 481435, 522003, 568376, 620712, 677449, 734458, 785957, 826155, 850257, 854946, 839340, 805982, 760271, 708051, 653487, 599177, 547565, 500972, 460025, 423198, 388900, 357557, 330799, 309073, 291173, 275955, 263293, 253204, 245215, 239106, 235190, 233070, 230976, 227297, 222370, 217912, 214961, 213096, 211454, 209680, 207832, 206097, 204879, 204784, 206053, 207927, 208718, 206852, 202275, 196801, 192674, 190636, 189557, 187806, 184509, 179736, 174366, 169932, 167718, 167473, 167674, 167440, 167500, 168728, 170479, 171237, 170462, 168944, 167569, 166444, 165134, 163149, 160251, 156765, 153438, 150640, 147851, 144395, 140439, 136819, 134010, 131691, 129217, 126190, 122716, 119403]
57523A19403k513j759j759k415l236m223n514o342n533l216j007k73j012k480
57509G8121l918m496l774k514k007k275k074j087o93j857l415l549k065k64P83
57494D4916R09M24q5N1P79J163O60j2oJ81n74k216l424l300k300j323o50j41L7
57475C5089m64j337j448q1J761K155P09o68k50J214J854J491J285J105l50k577
57459C9488k980o77J693J621K90L61J708J933M24p92k88Q43J005J85p93j740k821
57442C9460l684l720k815j324L40J740K430K264J492M83m11r09j043j266j757
57427C1280j839p36J126K297J968P86j79o05p63p90o91o70q98j116r43n86p24
57410B6917j548k271j954o87M18M69l74j336j916j933j214J77J508J822Q70p19
$$ y = [119403, 116890, 115131, 113372, 110957, 107721, 103498, 97984, 91642, 86109, 82893, 81886, 81613, 80601, 78121, 74203, 69707, 65933, 63419, 61412, 59137, 57063, 55976, 55283, 53426, 50011, 46462, 44397, 44133, 44916, 45825, 46249, 46164, 46215, 46994, 48157, 48817, 48805, 48799, 48980, 48406, 46190, 42766, 39466, 37166, 35843, 35193, 35052, 35089, 34625, 33288, 31840, 31759, 33520, 35675, 36384, 35716, 35466, 36680, 38534, 40025, 41310, 42415, 42065, 39488, 36508, 35831, 37524, 39145, 39435, 39796, 41504, 43437, 43861, 43069, 42781, 43624, 44629, 44814, 44021, 42281, 39460, 35776, 32056, 29241, 27917, 28257, 29997, 32427, 34691, 36183, 36666, 36255, 35346, 34303, 33037, 31280, 29441, 28705, 29831, 32128, 34096, 34882, 34703, 34098, 33335, 32545, 31854, 31184, 30286, 29170, 28227, 27641, 26917, 25369, 23098, 21144, 20457, 20875, 21344, 20970, 19634, 17718, 15785, 14571, 14748, 16256, 18078, 18948, 18229]
57394A8229k064k472j637j03O53m10k459l603B976G96h13j248q68r57j476j199
57378f561N28K296a470O59q06j370j704k029j445L27J853J531m12k196k499j570
57362a1131m19M81J326K075K104J127o5n01m55r57k008k442j871j434j989k720
57346a8879k573j970j785j644p45K06k39j674j884Q3K387K800J464L43O33J735
57330b1742K500K619K555K537K164J215M88J106K788a57B065l05B05c09A361L308
57314D669L597K646J134J42M60J691K617K577J938J344J188J791L180M567M913
57299C8454M251L668L829M395N010N784O348N593L163M04j010q14K55J829L751
57284H4910N099M734K882J150O63J030J359J423J480J656K053K788L380K756O45
$$ y = [18229, 16165, 13693, 12056, 11953, 12606, 12196, 9737, 6134, 2976, 796, -813, -2061, -2929, -3886, -5362, -6561, -6033, -3737, -1470, -811, -1617, -2987, -4691, -6720, -8165, -7838, -5985, -4454, -4866, -7062, -9561, -11131, -11550, -11069, -9743, -7668, -5564, -4437, -4502, -5003, -5458, -6415, -8423, -10865, -12736, -14170, -16159, -18879, -21452, -23422, -25207, -26851, -27596, -27390, -27629, -29303, -31187, -31104, -28717, -25917, -24453, -24110, -23477, -21742, -19242, -16623, -14068, -11531, -9367, -8152, -7664, -6558, -3770, -157, 2065, 1760, 205, -309, 1361, 4669, 8266, 10912, 12046, 12188, 12648, 14339, 16956, 19533, 21471, 22815, 24003, 25794, 28974, 33541, 38454, 42705, 46373, 50202, 54597, 59607, 65391, 71739, 77332, 80495, 80899, 79889, 79075, 79330, 81159, 84910, 90009, 94743, 97625, 98775, 99438, 100468, 101827, 103250, 104730, 106386, 108439, 111227, 114607, 117363, 118008]
57269A18008j461j733k38J241J568J405J706K253K409K433L126M700O797R135
57255A51349J1224J2123J1474J0371J0059J0231J0026J0172J2226J5688J8010
57244B82953J8080J7762J8916K0658K0996J9768J8412J7777J7733J8170J8972
57233D90197J9537J9527J9499J9711J9204J7368J5454J4928J5200J4817J4113
57222F79555J4522J5725J5924J4953J4650J5608J5864J3828J0659Q484P771P670
57210H35213P725Q024Q525R240J0373J1514J1664J0854J0754J2577J5207J6535
57198I68205J6050J4995J4473J4558J5051J5946J7015J7803J8212J8556J8853
57187A149717J8559J7241J5308J3808J3434J3820J4020J3666J3299J3307J3065
$$ y = [118008, 116547, 114814, 114576, 115817, 117385, 118790, 120496, 122749, 125158, 127591, 130717, 135417, 142214, 151349, 162573, 174696, 186170, 196541, 206600, 216831, 226857, 237029, 249255, 264943, 282953, 301033, 318795, 337711, 358369, 379365, 399133, 417545, 435322, 453055, 471225, 490197, 509734, 529261, 548760, 568471, 587675, 605043, 620497, 635425, 650625, 665442, 679555, 694077, 709802, 725726, 740679, 755329, 770937, 786801, 800629, 811288, 819772, 827543, 835213, 842938, 850962, 859487, 868727, 879100, 890614, 902278, 913132, 923886, 936463, 951670, 968205, 984255, 999250, 1013723, 1028281, 1043332, 1059278, 1076293, 1094096, 1112308, 1130864, 1149717, 1168276, 1185517, 1200825, 1214633, 1228067, 1241887, 1255907, 1269573, 1282872, 1296179, 1309244]
57176A309244J1804R912Q609Q465R044R814J0631J1512J2769J5139J8710K1955
57164A457608K3086K2371K1715K2034K2594K2972K3628K3992K2169J7871J3802
57153A693842J2370J2400J0991P636M517L288L592M624O285Q443J0642J3036J6493
57140A808159K1314K6686L1796L6644M1395M5661M8927N1103N2175N1772M9645
57129B265277M6437M3398M1289L9743L7882L5249L1932K7978K3318J8348J3886
57118B624737J0091O130J701j936l500l770m699o735q644r984j1910j5004j8119
57105B558358k0176k1537k2502k1986j9079j4791j0886p878n388l647l265m221
57093B403002o184r204j2989j6350j8577k0729k4480l0357l8175m8200o0536p4131
$$ y = [1309244, 1321048, 1330960, 1339569, 1348034, 1357078, 1366892, 1377523, 1389035, 1401804, 1416943, 1435653, 1457608, 1480694, 1503065, 1524780, 1546814, 1569408, 1592380, 1616008, 1640000, 1662169, 1680040, 1693842, 1706212, 1718612, 1729603, 1737239, 1741756, 1745044, 1748636, 1753260, 1759545, 1767988, 1778630, 1791666, 1808159, 1829473, 1856159, 1887955, 1924599, 1965994, 2011655, 2060582, 2111685, 2163860, 2215632, 2265277, 2311714, 2355112, 2396401, 2436144, 2474026, 2509275, 2541207, 2569185, 2592503, 2610851, 2624737, 2634828, 2640958, 2642659, 2640723, 2637223, 2633453, 2628754, 2622019, 2613375, 2603391, 2591481, 2576477, 2558358, 2538182, 2516645, 2494143, 2472157, 2453078, 2438287, 2427401, 2419523, 2414135, 2410488, 2407223, 2403002, 2396818, 2387614, 2374625, 2358275, 2339698, 2318969, 2294489, 2264132, 2225957, 2177757, 2117221, 2043090]
57081B043090q7824j01738j16569j32287j48767j66537j85483k03963k20809k37058
57071D42055A88139h2401k86341l03951l26931l54876l84131m13170m44267m79665
57061c075733n19320n62998o11620o65543p24113p87997q59578r40142j028992
57052i776036j126330j234640j356167j491464j641659j810049k000326k215660
57044b2652331k460932k743994l073488l457444l904794m425921n030719n728433
57036e3478056o529631p444318q475080r612445j0835575j2113814j3408370j4677067
57028a36574356j5876282j6955777j7866397j8599620j9216949j9786336k0228678
57021b65104395k0224115j9326463j7228925j3946538r762615n034001o1517M898487
$$ y = [2043090, 1955266, 1853528, 1736959, 1604672, 1455905, 1289368, 1103885, 899922, 679113, 442055, 188139, -82401, -368742, -672693, -999624, -1354500, -1738631, -2151801, -2596068, -3075733, -3595053, -4158051, -4769671, -5435214, -6159327, -6947324, -7806902, -8747044, -9776036, -10902366, -12137006, -13493173, -14984637, -16626296, -18436345, -20436671, -22652331, -25113263, -27857257, -30930745, -34388189, -38292983, -42718904, -47749623, -53478056, -60007687, -67452005, -75927085, -85539530, -96375105, -108488919, -121897289, -136574356, -152450638, -169406415, -187272812, -205872432, -225089381, -244875717, -265104395, -285328510, -304654973, -321883898, -335830436, -345593051, -350627052, -350688569, -345790082]
57013c45790082R577654J3699291J7037888J9469451K0981394K1654454K1631188
57006b21738762K1076771K0144852J8962518J7631902J6234004J4828359J3453314
56999i9407042J2130393J0870710R681011Q568324P541138O606601N767393N021626
56991c3219846M364632L790299L292217K864686K501599K193885J930005J700557
56983a0581966J501122J329491J181925J053960R43144Q48418P67435O96713O34047
56974a625711N78747e17129c1232D15198M11454L79882L50306L23138L00033K81128
56964B461139K64959K51127K40705K33524K27561K21768K16978K13078K08819
56955D539658K06579K13221K30557K45577K35985J88688J11404K5402n0557j08219
$$ y = [-345790082, -336212428, -322513137, -305475249, -286005798, -265024404, -243369950, -221738762, -200661991, -180517139, -161554621, -143922719, -127688715, -112860356, -99407042, -87276649, -76405939, -66724928, -58156604, -50615466, -44008865, -38241472, -33219846, -28855214, -25064915, -21772698, -18908012, -16406413, -14212528, -12282523, -10581966, -9080844, -7751353, -6569428, -5515468, -4572324, -3723906, -2956471, -2259758, -1625711, -1046964, -517129, -31232, 415198, 826652, 1206534, 1556840, 1879978, 2180011, 2461139, 2726098, 2977225, 3217930, 3451454, 3679015, 3900783, 4117761, 4330839, 4539658, 4746237, 4959458, 5190015, 5435592, 5671577, 5860265, 5971669, 5997071, 5946514, 5838295]
56945E838295j46647j67090j72010j65719j53322j38967j25352j13935j04994
56936D550259r8127r3214r0551q9905r0288r1069r2603r5244r8382j01131j03416
56925C506329j05661j08002j10684j14689j20721j27605j32926j35426j35918
56916B414697j35568j34423j31894j27836j22566j16589j10744j05793j01340
56907A327944r6100q9732q3466p8135p2702o5873n8279n1651m6391m1465l6393
56896F07757l1921k8785k7147k7315k9531l2714l4680l4177l1832k8833k5638
56885B75184k2335j9265j6615j4085j1331q204m562o36K563M404O168R831J5032
56872B16149J9086K0583K0985K1457K0172J4893O774p78o356j1257j6265k0044
$$ y = [5838295, 5691648, 5524558, 5352548, 5186829, 5033507, 4894540, 4769188, 4655253, 4550259, 4452132, 4358918, 4268367, 4178462, 4088174, 3997105, 3904502, 3809258, 3710876, 3609745, 3506329, 3400668, 3292666, 3181982, 3067293, 2946572, 2818967, 2686041, 2550615, 2414697, 2279129, 2144706, 2012812, 1884976, 1762410, 1645821, 1535077, 1429284, 1327944, 1231844, 1142112, 1058646, 980511, 907809, 841936, 783657, 732006, 685615, 644150, 607757, 575836, 547051, 519904, 492589, 463058, 430344, 395664, 361487, 329655, 300822, 275184, 252849, 233584, 216969, 202884, 191553, 183349, 178787, 178151, 180714, 185118, 191286, 201117, 216149, 235235, 255818, 276803, 298260, 318432, 333325, 340099, 339321, 332965, 321708, 305443, 285399]
56860B85399k1181j9915j7346j4439j2286j1682j1792j0565p354m005k468k457
56848A49909k409j863j682k338l136l054j717L64K087K534J860J142J167J882
56834A44746L201N485Q533J0916J1397J0714J0820J2449J4426J5444J5475J5026
56822B78632J3902J1520P956L905j47l948o626o750l901K70L338M531N285P198
56808C15165J0229J3292J5893J8306K0590K2612K4948K8585L3200L6701L7019
56797E76540L3723K7447J8735Q346k113j0941j7486k1642k2827k0636j6235j1612
56785E41299p363k623K600O677Q940J1461J6765K4426L1630L6801M1015M5560
56773G57188M9446N0087M5607L5850K1920N675j0475k4088l3486l8154l8721l6628
$$ y = [285399, 264218, 244303, 226957, 212518, 200232, 188550, 176758, 166193, 158839, 154834, 152366, 149909, 147500, 145637, 143955, 141617, 138481, 135427, 133710, 134074, 136161, 138695, 140555, 141697, 142864, 144746, 147947, 153432, 161965, 172881, 184278, 194992, 205812, 218261, 232687, 248131, 263606, 278632, 292534, 304054, 312010, 315915, 315768, 311820, 305194, 298444, 294543, 294813, 298151, 302682, 307967, 315165, 325394, 338686, 354579, 372885, 393475, 416087, 441035, 469620, 502820, 539521, 576540, 610263, 637710, 656445, 664791, 662678, 651737, 634251, 612609, 589782, 569146, 552911, 541299, 533936, 531313, 533913, 540590, 549530, 560991, 577756, 602182, 633812, 670613, 711628, 757188, 806634, 856721, 902328, 938178, 960098, 965773, 955298, 931210, 897724, 859570, 820849, 784221]
56761G84221l3382k9697k5454k0538j5285j0041m718P84O090J0657J4337J7360
56749F94334K0144K3230K6777K9584K9290K4397J5710N113o390j8289k8771l5162
56737G79967l6595l4949l2524k9928k6844k3643k0929j8265j4736j0574p069m817
56725E19094k971m22L035O842J0283J2548J2714J0201N241j174p767j3504j7944
56712E36176k1205k3434k4362k3588k1269j8319j5844j4453j4037j4078j4064
56701C31523j3763j3125j2039j0422q476o690n465m835m563m307l831l258l017
56688B37732l169l044k132j171j426k770l450k320m32L17n27j860k562k311j228
56673B09647K71J363J308K18j216k397k856k109l86Q67L19j396k234j237M57J343
$$ y = [784221, 750839, 721142, 695688, 675150, 659865, 649824, 645106, 645890, 651980, 662637, 676974, 694334, 714478, 737708, 764485, 794069, 823359, 847756, 863466, 868579, 862189, 843900, 815129, 779967, 743372, 708423, 675899, 645971, 619127, 595484, 574555, 556290, 541554, 530980, 523911, 519094, 516123, 515701, 518736, 525578, 535861, 548409, 561123, 571324, 576565, 575391, 567624, 554120, 536176, 514971, 491537, 467175, 443587, 422318, 403999, 388155, 373702, 359665, 345587, 331523, 317760, 304635, 292596, 282174, 273698, 267008, 261543, 256708, 252145, 247838, 244007, 240749, 237732, 234563, 231519, 229387, 228216, 226790, 224020, 220570, 218250, 217818, 218135, 217608, 215748, 213186, 210875, 209647, 209918, 211281, 212589, 212807, 211591, 209194, 206338, 204229, 203843, 204710, 205029, 203633, 201399, 200162, 200619, 201962]
56657B01962J219O93K2p48j050k24J417K634K532J436L45j84m48r95j894k750
56641B03967l186l082k417j313k51K81M86J022J904K284J754J029Q16O36k23j269
56625B02438j328k70Q50J228R95N67K79N63J555K497K537K022K075K722K733J540
56609B23003J73k89j32j89m23k54L11O92O12L46J93J78J45j12o84j311j619j617
56591B19023j635j696j304o7J746L430M323M175L278K289J603J116Q20J193K421
56576B40715L670L957L486L263L587L890L812L495K949K195J756J960J982R47
56562B81664l51l87N51P65J26L42J751K301Q35q59q51J22N25P96J953K976K195
56545B94454L99k05L25k48k506m243l674j623K23J320J683J055k25q36m5J344
$$ y = [201962, 203181, 203874, 203896, 203148, 202098, 201874, 203291, 205925, 208457, 209893, 210238, 210054, 209606, 208611, 206717, 203967, 200781, 197699, 195282, 193969, 193718, 193999, 194485, 195507, 197411, 199695, 201449, 202478, 203294, 203930, 203707, 202438, 201110, 200840, 201690, 202918, 203913, 204480, 204759, 205322, 206877, 209374, 211911, 213933, 216008, 218730, 221463, 223003, 223176, 222887, 222755, 222566, 222143, 221889, 222200, 222892, 223504, 223850, 224043, 224221, 224366, 224254, 223570, 222259, 220640, 219023, 217388, 215692, 214388, 214321, 216067, 219497, 223820, 227995, 231273, 233562, 235165, 236281, 237101, 238294, 240715, 244385, 248342, 251828, 255091, 258678, 262568, 266380, 269875, 272824, 275019, 276775, 278735, 280717, 281664, 281313, 280926, 281477, 282242, 282368, 282710, 284461, 286762, 287597, 286738, 285887, 286009, 286534, 287330, 289283, 292259, 294454, 294853, 294648, 294973, 294725, 292219, 287976, 284302, 282679, 282902, 284222, 285905, 286960, 286735, 285899, 285854, 287198]
56529B87198K369L103L571K840N54j571j460N30K086K079J629J816J960J083q5
56514C07702L4J589L310M610O162Q003Q620P029M677L847M750N708N931O397P832
56499C86201R472J0451J0981J1360J1056R792Q493P946P463O048M163L061K857
56486D89344K598K006J804K294K779K548J645M94o03j459k078k737l607m478n169
56471D85381n937p006q072q721q910q612p650o437o004o528o660n437l953l831
56457C91623m733m972m210l706m015m237l815l385l302k797j406q3J0j054k406
56442C47512l534m318m550m125l289k302j246m64n95j663k603k247n79J289K197
56427C19483J896J109P62J061J425J346Q40r0j678l413l696j659J212K674K663
$$ y = [287198, 289567, 292670, 296241, 299081, 299635, 298064, 296604, 297134, 299220, 301299, 302928, 304744, 306704, 307787, 307702, 307736, 309325, 312635, 317245, 323407, 331410, 340030, 347059, 351736, 355583, 360333, 366041, 371972, 378369, 386201, 395673, 406124, 417105, 428465, 439521, 449313, 457806, 465752, 473215, 479263, 483426, 486487, 489344, 491942, 493948, 495752, 498046, 500825, 503373, 505018, 505512, 504909, 503450, 501372, 498635, 495028, 490550, 485381, 479444, 472438, 464366, 455645, 446735, 438123, 430473, 424036, 418032, 411504, 404844, 399407, 395454, 391623, 386890, 381918, 377708, 374002, 369987, 365750, 361935, 358550, 355248, 352451, 351045, 350962, 350972, 349918, 347512, 343978, 339660, 335110, 330985, 327696, 325394, 324148, 323684, 323089, 321426, 318823, 316576, 315997, 317286, 319483, 321379, 322488, 323250, 324311, 325736, 327082, 327922, 327832, 326154, 322741, 319045, 317386, 318598, 321272, 323935]
56412C23935L095M687N730M601J990l01j671k579k928j895O34L392M742M077K209
56397C49718O12K22R24K109L425M636N253N024M538M506M564L770K285J560K390
56382C95536L777M142L074J366M1k23P68K469L694L494K007K85o27m42L07R02
56366D20570J093R84L58j188l165m122l370j977j185o33N86J752J170j196l325
56351D06352l711k887j999j230k87N95Q71L51p30j814k199j776j426j860k351
56336C85899j738m03J89j97l70R5K55j44J64J811L368L167J544K69N69K380M556
56319D01414N416M097J974J472L043M665M840M384M310L873K162K04l98O8O5p17
56303D40872j275j200j171j617k142k219j673o51K39K78k41p0J031J412j70k261
$$ y = [323935, 327030, 331717, 337447, 342048, 344038, 343737, 342066, 339487, 336559, 334664, 335298, 338690, 343432, 347509, 349718, 350330, 350552, 351476, 353585, 357010, 361646, 366899, 371923, 376461, 380967, 385531, 389301, 391586, 393146, 395536, 399313, 403455, 406529, 407895, 407936, 407713, 408481, 410950, 414644, 418138, 420145, 420430, 419803, 419361, 419668, 420570, 421663, 422647, 423005, 421817, 418652, 414530, 411160, 409183, 407998, 407365, 407951, 409703, 410873, 409677, 406352, 402641, 399754, 397755, 396525, 396238, 396833, 397704, 398055, 397325, 395511, 393312, 391536, 390110, 388250, 385899, 384161, 383758, 383947, 383750, 383380, 383475, 383730, 383586, 383750, 385561, 388929, 392096, 393640, 393909, 394478, 396858, 401414, 406830, 410927, 412901, 414373, 417416, 422081, 426921, 431305, 435615, 439488, 441650, 441854, 441456, 441524, 441589, 440872, 439597, 438397, 437226, 435609, 433467, 431248, 429575, 428924, 429163, 429441, 429200, 429130, 430161, 431573, 431403, 429142]
56287D29142k291m8K083K276J173M62P62J487J930J930J663J201M38l91l86J131
56271D42562L417M851M775L941L026K048J472K309M256N253M090K166J433J846
56257D87445K188K185K096J381k96j465l63K409M534M960M431L464J967P93J430
56242E17159L515M573L107N55o16K74J952K828K239P16m31l69L16N40M86J295
56226E38139K856L319J563q81j440M11K573K836J295K6N87K250L082K523K123
56211E61262L309N304O128N216L956L692M182M344L825L369L781M759M930L332
56197F21389Q38l71R53L954O829Q470Q791Q308Q065R063J1059J2603J2923J2946
56183G25820J3634J4324J3720J1860R891Q514P837Q082R205J0192J0038Q989P726
$$ y = [429142, 426851, 426803, 428886, 431162, 432335, 432797, 433559, 435046, 436976, 438906, 440569, 441770, 442208, 441817, 441431, 442562, 445979, 450830, 455605, 459546, 462572, 464620, 466092, 468401, 472657, 477910, 482000, 484166, 485599, 487445, 489633, 491818, 493914, 495295, 494999, 493534, 493171, 495580, 500114, 505074, 509505, 512969, 514936, 515729, 517159, 520674, 525247, 528354, 528909, 528293, 528567, 530519, 533347, 535586, 536302, 535871, 535502, 535818, 536358, 536844, 538139, 540995, 544314, 545877, 544996, 543556, 543967, 546540, 549376, 550671, 550697, 551284, 553534, 556616, 559139, 561262, 564571, 569875, 576003, 581219, 585175, 588867, 593049, 597393, 601218, 604587, 608368, 613127, 618057, 621389, 622227, 621856, 622809, 626763, 633592, 642062, 650853, 659161, 667226, 676289, 687348, 699951, 712874, 725820, 739454, 753778, 767498, 779358, 789249, 797763, 805600, 813682, 822887, 833079, 843117, 852106, 859832]
56170H59832N936L103K84p35J4N50k89j456j584j008j140k551m394n386n015l852
56154H42309k802k068j229m37p47k652m968n943n034k991q00P85J318J107J032
56139H16880J319J296R59J502L311M746M369L192K979L427L196K865M272P058
56125H61371Q419O814L964K413K721L794M591M695M229L879M394N679O925P660
56111I31548Q012Q003P496O843O702P232Q059Q989J0072J1207J2261J3265J3998
56098A053687J3998J3558J3860J5356J7041J8274K0118K3553K7515L0310L2085
56087A279355L4144L6687L8974M1228M4417M8601N3116N7968O3534O9509P5706
56076A843239Q3122R2493J02585J11736J20335J29745J39511J47526J52165J52267
$$ y = [859832, 865768, 868871, 869155, 868420, 868434, 868984, 868695, 867239, 865655, 864647, 863507, 860956, 856562, 851176, 846161, 842309, 839507, 837439, 836210, 835773, 835026, 832374, 827406, 821463, 816429, 813438, 812638, 813423, 814741, 815848, 816880, 818199, 819495, 820454, 821956, 825267, 830013, 834382, 837574, 840553, 843980, 847176, 850041, 854313, 861371, 869790, 876604, 880568, 882981, 885702, 889496, 894087, 898782, 903011, 906890, 911284, 916963, 923888, 931548, 939560, 947563, 955059, 961902, 968604, 975836, 983895, 992884, 1002956, 1014163, 1026424, 1039689, 1053687, 1067685, 1081243, 1095103, 1110459, 1127500, 1145774, 1165892, 1189445, 1216960, 1247270, 1279355, 1313499, 1350186, 1389160, 1430388, 1474805, 1523406, 1576522, 1634490, 1698024, 1767533, 1843239, 1926361, 2018854, 2121439, 2233175, 2353510, 2483255, 2622766, 2770292, 2922457, 3074724]
56066C074724J46254J34109J19502J07112R8009R0009Q1784P3534O4129N1084
56056D040250L3999J5219l147k0306l4864m5036n1515n7501o5204p4569q5545
56045C651781r8670j12582j23784j30002j31762j30100j24943j16481j05991r4617
56035B482849q3101p2736o4462n7019m8422l9248l1953k7044k2771j8483j5186
56024B002424j2592q918m111q9K680N669Q881J0409J0048J0052J1484J3079J4384
56011B063400J6502J9059K0081J9814K0823K3378K4778K4484K5563K9286L2579
56000B319747L3081L2774L4125L6246L7372L7801L7999L7100L5561L6016L9057
55989B716879M1608M1883M2407M5446M8951N0238N0541N2615N6382O0133O3734
$$ y = [3074724, 3220978, 3355087, 3474589, 3581701, 3679710, 3769719, 3851503, 3925037, 3989166, 4040250, 4074249, 4089468, 4086321, 4066015, 4031151, 3986115, 3934600, 3877099, 3811895, 3737326, 3651781, 3553111, 3440529, 3316745, 3186743, 3054981, 2924881, 2799938, 2683457, 2577466, 2482849, 2399748, 2327012, 2262550, 2205531, 2157109, 2117861, 2085908, 2058864, 2036093, 2017610, 2002424, 1989832, 1980914, 1976803, 1976714, 1979394, 1985063, 1993944, 2004353, 2014401, 2024453, 2035937, 2049016, 2063400, 2079902, 2098961, 2119042, 2138856, 2159679, 2183057, 2207835, 2232319, 2257882, 2287168, 2319747, 2352828, 2385602, 2419727, 2455973, 2493345, 2531146, 2569145, 2606245, 2641806, 2677822, 2716879, 2758487, 2800370, 2842777, 2888223, 2937174, 2987412, 3037953, 3090568, 3146950, 3207083, 3270817]
55978C270817O7781P1591P4587P7656Q1134Q3577Q4407Q5303Q7349Q9560R1779
55967D165541R5894J02342J08739J13797J19353J26660J34180J40891J48264J57214
55957E412875J66770J77249J90569K06020K20392K33771K49890K68974K86291
55948G412801L00220L15483L35278L56623L77040L99228M24843M50174M72764
55939A0844454M96165N23210N50875N76965O05506O39911O76950P13468P52733
55930A6380237P97986Q45829Q92491R40503R92621J045454J096074J148814J208584
55921B5348593J273829J343081J421795J515611J623701J745518J885765K044922
55913C8202815K213958K387372K572902K779810L008357L261051L553033L899315
$$ y = [3270817, 3338598, 3410189, 3484776, 3562432, 3643566, 3727143, 3811550, 3896853, 3984202, 4073762, 4165541, 4261435, 4363777, 4472516, 4586313, 4705666, 4832326, 4966506, 5107397, 5255661, 5412875, 5579645, 5756894, 5947463, 6153483, 6373875, 6607646, 6857536, 7126510, 7412801, 7713021, 8028504, 8363782, 8720405, 9097445, 9496673, 9921516, 10371690, 10844454, 11340619, 11863829, 12414704, 12991669, 13597175, 14237086, 14914036, 15627504, 16380237, 17178223, 18024052, 18916543, 19857046, 20849667, 21895121, 22991195, 24140009, 25348593, 26622422, 27965503, 29387298, 30902909, 32526610, 34272128, 36157893, 38202815, 40416773, 42804145, 45377047, 48156857, 51165214, 54426265, 57979298, 61878613]
55905F1878613M302636M765888N304039N930195O643168P443502Q347284R369038
55897A13984363J0509887J1782115J3225242J4875363J6741396J8834679K1186127
55890B21139172K3791813K6562519K9328635L1756157L3088772L2045724K7331541
55883D25044333J8597377O998792n270332j6086398k4211923k9366045l1861374
55876C43844430l2267018l1211881k9247673k6776119k4075863k1360847j8788786
55869A60116243j6446730j4370362j2573487j1044734r738527q600352p598711
55862G9743340o721011n952742n278467m692490m190706l758237l378211l045325
55854D2726151k759011k511260k292777k103126j942855j802383j670021j544846
$$ y = [61878613, 66181249, 70947137, 76251176, 82181371, 88824539, 96268041, 104615325, 113984363, 124494250, 136276365, 149501607, 164376970, 181118366, 199953045, 221139172, 244930985, 271493504, 300822139, 332578296, 365667068, 397712792, 425044333, 443641710, 450640502, 445370170, 429283772, 405071849, 375705804, 343844430, 311577412, 280365531, 251117858, 224341739, 200265876, 178905029, 160116243, 143669513, 129299151, 116725664, 105680930, 95942403, 87342051, 79743340, 73022329, 67069587, 61791120, 57098630, 52907924, 49149687, 45771476, 42726151, 39967140, 37455880, 35163103, 33059977, 31117122, 29314739, 27644718, 26099872]
55846B6099872j431232j326901j226743j132783j049863r75977r06348q42525
55838A7207500p88356p41139o95546o52351o14836n80366n44031n07188m74252
55829A1609435m44032m12262l80078l52046l27883l03456k78281k55070k33413
55820H622914k10482j86871j65785j47412j29617j13186j01585r6539r7980j06713
55810G266744j22878j43505j65426j88561k12675k33702k47396k54009k55379
55801E443213k50760k40020k27496k17263k07427j94416j80057j68535j58885
55792C598354j46943j33113j21858j14352j07652j00747r5784r3087r0093q5580
55782B509145q0681p5594o9379o2974n8520n5713n2378m8451m5758m4253m2171
$$ y = [26099872, 24668640, 23341739, 22114996, 20982213, 19932350, 18956373, 18050025, 17207500, 16419144, 15678005, 14982459, 14330108, 13715272, 13134906, 12590875, 12083687, 11609435, 11165403, 10753141, 10373063, 10021017, 9693134, 9389678, 9111397, 8856327, 8622914, 8412432, 8225561, 8059776, 7912364, 7782747, 7669561, 7567976, 7471437, 7373457, 7266744, 7143866, 7000361, 6834935, 6646374, 6433699, 6199997, 5952601, 5698592, 5443213, 5192453, 4952433, 4724937, 4507674, 4300247, 4105831, 3925774, 3757239, 3598354, 3451411, 3318298, 3196440, 3082088, 2974436, 2873689, 2777905, 2684818, 2594725, 2509145, 2428464, 2352870, 2283491, 2220517, 2161997, 2106284, 2053906, 2005455, 1959697, 1915444, 1873273]
55771A873273l9634l8542l8970l8997l8002l7033l6199l4686l2952l2075l1518
55760A474665l0314k9526l0524l1757l0585k7458k4999k3677k1794j8978j6416
55749A188637j4129j1315q723p488o407l712o28L08l32j4J029L15k011l213k884
55734A129433l574n999p831q139r104j1963j4790j5777j5770j6060j6239j5592
55722I88595j4452j3201j2002j2136j5066j9455k1548j9624j5967j3477j2412
55711H19255j1496j0176q514o328l681j389l58r76l080n712p402p862q648j0789
55697G32844j2728j2445j0622r447r239q823q499r685j1878j2831j1815j0106
55685F04726q296n866l578l344n178o707o362m835l200j928j875l753o164o712
$$ y = [1873273, 1833639, 1795097, 1756127, 1717130, 1679128, 1642095, 1605896, 1571210, 1538258, 1506183, 1474665, 1444351, 1414825, 1384301, 1352544, 1321959, 1294501, 1269502, 1245825, 1224031, 1205053, 1188637, 1174508, 1163193, 1154470, 1146982, 1140575, 1136863, 1136235, 1136543, 1136211, 1136197, 1137226, 1137541, 1135530, 1132317, 1129433, 1125859, 1119860, 1112029, 1103890, 1094786, 1082823, 1068033, 1052256, 1036486, 1020426, 1004187, 988595, 974143, 960942, 948940, 936804, 921738, 902283, 880735, 861111, 845144, 831667, 819255, 807759, 797583, 789069, 782741, 779060, 777671, 777313, 776337, 773257, 767545, 760143, 752281, 743633, 732844, 720116, 707671, 697049, 687602, 678363, 669540, 661041, 651356, 639478, 626647, 614832, 604726, 596430, 590564, 586986, 583642, 578464, 571757, 565395, 560560, 557360, 555432, 553557, 549804, 543640, 536928]
55671E36928n482m936n937o528n424m152m610o586q644r666q937o621m653n183
55657D49569p567q768p105l731l09K398L532K328M9p19N04J628J366O92L78k95
55641D33950j622k790l873n875q038q029n885m673n809o711n118k816k696m461
55627C65554n839o199o328o101m836l020j613m65Q22J503R15R3L93J282J119m56
55611C36824k332l503l631k769j626j376k217k797j913J4J818K901L011K005O33
55596C25042K85J091J586J069P45J543K481K476K140K390K699K325J823J783J383
55581C50861j50j908k903m007o339q798r332q000o775o716p120p144o549n091
55567B70029k785o45J38l60j198j967k782l396l522l431l169j981J55J418J80
$$ y = [536928, 531446, 526510, 520573, 514045, 508621, 504469, 499859, 493273, 484629, 474963, 466026, 459405, 454752, 449569, 442002, 433234, 426129, 422398, 422089, 424487, 428019, 430347, 430396, 429677, 430181, 431809, 433175, 433867, 434245, 433950, 432328, 429538, 425665, 419790, 411752, 403723, 397838, 393165, 387356, 380645, 375527, 372711, 370015, 365554, 359715, 353516, 347188, 341087, 336251, 333231, 331618, 331153, 331975, 333478, 334393, 334486, 334879, 336161, 337280, 336824, 334492, 330989, 327358, 324589, 322963, 321587, 319370, 316573, 314660, 314674, 316492, 319393, 322404, 324409, 325042, 325327, 326418, 328004, 329073, 329818, 331361, 333842, 336318, 338458, 340848, 343547, 345872, 347695, 349478, 350861, 350711, 348803, 345900, 341893, 335554, 326756, 317424, 309424, 302649, 295933, 288813, 281669, 275120, 270029, 267244, 266599, 266737, 266377, 265179, 263212, 260430, 257034, 253512, 250081, 246912, 244931, 245086, 246504, 246684]
55552B46684k396l633k772j472j119j437j694j674j272n13k9l65q56n32J02k53
55536B26769j346j436jJ352J315O54O25Q67J69j445k534j994j81J675K702K973
55520B30164L222M008N176O164O728P058P300P307O982O654O921Q087R678J0608
55506C26057J0129Q647P270O484N614L724O03l232o937r573j0494r995r262r427
55492C09608j0726j2520j3737j3380j1381q947p422o680n466l408j729j640k914
55479B09658m442n337n187m091k815k109j655o78L79J82j203j944j095m2k74j233
55463A78114j584j225p36r1N91L15j182k198j291L42O24j18P6J356J780N22r54
55446A74341j294q82n75n13p75j625k526k278p99M87O10J53j78o91j578j904q97
$$ y = [246684, 244288, 240655, 237883, 236411, 235292, 233855, 232161, 230487, 229215, 228702, 228673, 228308, 227452, 226920, 227022, 226769, 225423, 223987, 223986, 225338, 226653, 227307, 227932, 228799, 228968, 227523, 224989, 222995, 222814, 224489, 227191, 230164, 233386, 237394, 242570, 248734, 255462, 262520, 269820, 277127, 284109, 290763, 297684, 305771, 315449, 326057, 336186, 344833, 352103, 358587, 364201, 367925, 368528, 365296, 358359, 348786, 338292, 328297, 319035, 309608, 298882, 286362, 272625, 259245, 247864, 238917, 231495, 224815, 219349, 215941, 214212, 212572, 209658, 205216, 199879, 194692, 190601, 187786, 185677, 184022, 183344, 183723, 183905, 182702, 180758, 179663, 179621, 179347, 178114, 176530, 175305, 174569, 174478, 175069, 175384, 174202, 172004, 170713, 171055, 171679, 171561, 171637, 172993, 174773, 175295, 174341, 173047, 172165, 171590, 171077, 170302, 168677, 166151, 163873, 163074, 163561, 164171, 164324, 164146, 163455, 161877, 159973, 159076]
55429A59076N63Q69l49k066l219l406k634j274j36J14l28o69m60P1N17P30Q31
55412A48230J099J725K502K802K119O40q64j612j279j13J104J369J83j799l137
55397A52969k854j293M83J876K894L288K468O86o03l97L75Q8j211j843q99O39
55381A56666J508J706J838J937J649R70J14q20j619j905j682j375j070m43K73
55366A57747K87l57m49O61K021K647K987L734M142L048J091L51J787M109N460
55351A89266N391M912N089N727N436L224M5j996k142j717k082l040l920m926o252
55336A93015o967o195m589l342k472j469q55j445k600k935k363j865j459l11J304
55321A55452J960J217J72m44j034j653j410l5J310J680J538J602J542P68l88j200
$$ y = [159076, 159639, 160508, 160159, 158093, 154874, 151468, 148834, 147560, 147424, 147538, 147210, 146541, 146081, 146152, 146669, 147399, 148230, 149329, 151054, 153556, 156358, 158477, 159117, 158253, 156641, 155362, 155249, 156353, 157722, 157905, 156106, 152969, 150115, 148822, 149305, 151181, 154075, 157363, 159831, 160517, 159914, 159517, 159892, 159980, 158769, 156926, 156027, 156666, 158174, 159880, 161718, 163655, 165304, 166274, 166388, 165568, 163949, 162044, 160362, 158987, 157917, 157474, 157747, 158034, 157677, 157228, 157889, 159910, 162557, 165544, 169278, 173420, 176468, 177559, 177910, 179697, 183806, 189266, 194657, 199569, 204658, 210385, 215821, 219045, 219090, 217094, 214952, 213235, 211153, 208113, 204193, 199267, 193015, 186048, 179853, 175264, 171922, 169450, 167981, 167126, 165681, 163081, 160146, 157783, 155918, 154459, 154148, 155452, 157412, 158629, 158801, 158357, 157323, 155670, 154260, 154225, 155535, 157215, 158753, 160355, 161897, 162665, 162277, 161077]
55305A61077j614j974k133j629m90P18J462J532J022K40m67r23j006m99M88J207
55289A57011R15k11j341j948j993j388j80Q99R48N9q16j112j034q53o83q68j542
55272A45863j816o19J517K712K223J431J618J914N81k225m120l075L20L394L986
55257A53704K303K47p74q17m04M49J595K130J423J75n79r09j331j414n62K73m62
55240A55047k308l031j726J04R71J087R54J65j238j873q95M45N90k0M2O82M93
55223A49489p99j671o89J898M513N525M204J276j502k764k592j826q34M38J589
55208A56255J886J271O28Q08J746K628K724K031J135M15l96j578k628k795k317
55193A61813k082k061j250M00J313M91p71o49N85J169O92N12J296J811Q79o84
$$ y = [161077, 159463, 157489, 155356, 153727, 153237, 153955, 155417, 156949, 157971, 158211, 157744, 156821, 155815, 155316, 155804, 157011, 157926, 157715, 156374, 154426, 152433, 151045, 150865, 151764, 152712, 152771, 151955, 150843, 149809, 148956, 148273, 147405, 145863, 144047, 143428, 144945, 147657, 149880, 151311, 152929, 154843, 155424, 153199, 149079, 146004, 146324, 149718, 153704, 156007, 156254, 155480, 154663, 154259, 154708, 156303, 158433, 159856, 160031, 159452, 158543, 157212, 155798, 155236, 155509, 155047, 152739, 149708, 147982, 148086, 149057, 150144, 151098, 151263, 150025, 148152, 147257, 147702, 148292, 148272, 148314, 148996, 149489, 148690, 147019, 146330, 148228, 152741, 158266, 162470, 163746, 162244, 159480, 156888, 155062, 154228, 154666, 156255, 158141, 159412, 160040, 160848, 162594, 165222, 167946, 169977, 171112, 171527, 171131, 169553, 166925, 164130, 161813, 159731, 157670, 156420, 156820, 158133, 158624, 157853, 157204, 157789, 158958, 159650, 160162, 161458, 163269, 164148, 163464]
55177A63464j147j76R85J389J394J664J984J629N40m70p23m44k87n03p88q27o62
55160A67022o53j096j685j427L49K638L321J682m25r39l46o80k138k586p69J777
55144A64045K892K453J731J177K66j069k215k921l375l329k196k46J270J474P59
55129A60716Nn17j029j405j063K90K089L326L442K623J321j99j597k187j511q8
55113A64216R41R68L56l10q31j174j146n53O13K308M339N935O014M348K128Q68
55097A89020P33M65q80k550k930j753p01j250k487k296n65M32o16j984j471L37
55081A71504J212P63N81J180J194n9j288j354r87j302j963j905r23L41J269J413
55065A69676O12m52o39J77Q55O56J19j59m06o47j84J085J997J779J171R71P75
$$ y = [163464, 162317, 162141, 163126, 164515, 165909, 167573, 169557, 171186, 171726, 171256, 170533, 170089, 169802, 169299, 168511, 167684, 167022, 166369, 165273, 163588, 162161, 162510, 165148, 168469, 170151, 169726, 168787, 168441, 167761, 165623, 163037, 162268, 164045, 166937, 169390, 171121, 172298, 172564, 171495, 169280, 166359, 162984, 159655, 157459, 157213, 158483, 159957, 160716, 160721, 160204, 159175, 157770, 156707, 156997, 159086, 162412, 165854, 168477, 169798, 169599, 168002, 165815, 164304, 164216, 165157, 166125, 166481, 166171, 165340, 164166, 163020, 162467, 163080, 165388, 169727, 175662, 181676, 186024, 188152, 189020, 189753, 190218, 189338, 186788, 183858, 182105, 181404, 180154, 177667, 175371, 174806, 175238, 174622, 172638, 171167, 171504, 172716, 173479, 174060, 175240, 176434, 176375, 175087, 173733, 172746, 171444, 169481, 167576, 166653, 166994, 168263, 169676, 170288, 169836, 169197, 169374, 170229, 170885, 171004, 170845, 170439, 169792, 169608, 170693, 172690, 174469, 175640, 176611, 177386]
55048A77386K56K41J023J011r48l024k422N78K930K949J931J413J031n6j395k011
55032A80893j830j385q83k90K73P43J265J634J153n09k641m030l901k321j22J535
55016A69584J902J181J10p74j171p05P03K281K956K433J193l82k058l080k499
55001A71674n10J297J516L02j043j470j002m60n68j081r40L66J850K079J026J26
54985A73162L44J088J346J120J084J279R88m3r05m44J280K930L387K818J978R30
54969A92342o40k132k307j178l82r13j601r21O55J454J069M92J15o66j772j977
54953A81638o74J209K535L111K957J690m24j908j681o07l04r38j370j210j292
54938A82732j959k119q02J300K590K511J817J250Q51N92P37J191J285P57L36O97
$$ y = [177386, 177642, 177883, 178906, 179917, 178969, 175945, 173523, 174101, 177031, 179980, 181911, 183324, 184355, 184299, 182904, 180893, 179063, 177678, 176795, 176505, 176778, 177521, 178786, 180420, 181573, 181064, 178423, 174393, 170492, 168171, 168049, 169584, 171486, 172667, 172777, 172003, 170832, 170127, 170830, 173111, 176067, 178500, 179693, 179311, 177253, 174173, 171674, 171164, 172461, 173977, 174279, 173236, 171766, 170764, 170304, 169736, 168655, 167715, 168081, 169931, 172010, 173036, 173162, 173506, 174594, 175940, 177060, 178144, 179423, 180411, 180368, 179463, 179019, 180299, 183229, 186616, 189434, 191412, 192342, 191702, 189570, 187263, 186085, 185703, 184790, 183189, 182268, 182923, 184377, 185446, 185938, 186053, 185387, 183615, 181638, 180964, 182173, 184708, 187819, 190776, 192466, 192042, 190134, 188453, 187846, 187542, 186604, 185234, 184024, 182732, 180773, 178654, 177852, 179152, 181742, 184253, 186070, 187320, 188171, 188763, 189500, 190691, 191976, 192733, 193069, 193766]
54922A93766J377J495R99M03k44r97j101J21J691J870P65K60J062J651R60J12
54906B04190K21K87r32k405k217n20R33J560K150K793K736K165K049K169J319
54891B16498k54p11N89J969J935J118Q40J118J152O74r5r76j618j510p45J03J095
54874B21182K734M333M179K104L66Q00K458L377L491M071N190N667N253N063N707
54859B75975O440O556O515P182Q608R929J0041Q360N367K318m7k308n261q273
54845C31402r641q711o782n586n568n944n915n290m321l464l144l337l387k621
54831B57691j286m76q67j788j914q75L43P47N51P70J968L864N747O808O505N322
54815B83110M809O052Q159R174Q346O546M591K432J79j459k355l449n172o453
$$ y = [193766, 195143, 196638, 197637, 198040, 197796, 196799, 195698, 195819, 197510, 199380, 200145, 200405, 201467, 203118, 204078, 204190, 204411, 204698, 203766, 201361, 199144, 198624, 199557, 201117, 203267, 206060, 208796, 210961, 213010, 215179, 216498, 216244, 215533, 216122, 218091, 220026, 221144, 221984, 223102, 224254, 224928, 224833, 223857, 222239, 220729, 219984, 220087, 221182, 223916, 228249, 232428, 234532, 234898, 235698, 238156, 241533, 245024, 249095, 254285, 259952, 265205, 270268, 275975, 282415, 288971, 295486, 302668, 311276, 321205, 331246, 339606, 344973, 347291, 347244, 344936, 339675, 331402, 321761, 313050, 306268, 300682, 295114, 289170, 283255, 277965, 273644, 270180, 267036, 263699, 260312, 257691, 256405, 255929, 255062, 253274, 251360, 250485, 250828, 251575, 252126, 252896, 254864, 258728, 264475, 271283, 277788, 283110, 287919, 293971, 302130, 311304, 319650, 326196, 330787, 333219, 333398, 331939, 329584, 326135, 320963, 314510]
54801C14510o302n508n570o520p022o360n147m220l828m004m714n462n501m742
54787B39610l895l622l973m617n076m722l179r61P89J306O15q53k393k930j810
54772B04289M1O81n16j968j988r91n23p81n74L36O50j85p67K8Q83m9j900j875
54754A94791O18K924K925J847J882K784K862K137K011K301J254j093k180p09J008
54739B15362J57k562m040l013j272p02j028r24l0R06J243J053P63O39O52P94J335
54722B09333K486L770M255L706K944K692K646K337K231K996M121M468M175M749
54708B56909O877R271J0261R744Q882Q436Q247Q004P691P315O694N608L886J520
54694C59345j008k849l704m374n746p437q266q047p880q329q284o482l487j190
$$ y = [314510, 308208, 302700, 297130, 290610, 283588, 277228, 272081, 267861, 264033, 260029, 255315, 249853, 244352, 239610, 235715, 232093, 228120, 223503, 218427, 213705, 210526, 209565, 210354, 211660, 212275, 211422, 209029, 206099, 204289, 204330, 205011, 204495, 202527, 200539, 199548, 199025, 198244, 197670, 198006, 198656, 198471, 197704, 197732, 198615, 198566, 196666, 194791, 195409, 198333, 201258, 203105, 204987, 207771, 210633, 212770, 214781, 217082, 218336, 217243, 215063, 214354, 215362, 215519, 212957, 208917, 205904, 204632, 203930, 202902, 201978, 201948, 202854, 204097, 205150, 205913, 206552, 207204, 207998, 209333, 211819, 215589, 219844, 223550, 226494, 229186, 231832, 234169, 236400, 239396, 243517, 247985, 252160, 256909, 263786, 273057, 283318, 293062, 301944, 310380, 318627, 326631, 334322, 341637, 348331, 353939, 357825, 359345, 358337, 355488, 351784, 347410, 341664, 334227, 325961, 317914, 310034, 301705, 293421, 286939, 283452, 282262]
54680B82262o46j325k265k907k810j637J70J511J738J055k34j753k243k14L725
54665B74427O534O141M181L833N631P255P122O173N761N682N143M243L365K018
54651C47509m70l635o145p233p242o951o806o724o387n812n565o047o674o444
54637B65374n253l923k930k099j581j941k787k698j193L26N35J0j04j41j143k640
54621B37812l022k016j147j390j814j160K63J069N54p06j572j241K27J757K018
54606B29632P62p30r62J68J290J050n53k278k818j868k17J105J729K040K402K479
54590B33231J592j95j706j729l48J200K105K744L587M046L211J437J97K47P07
54575B50326K96j104k439k639j534N8R77P51O2j33K00L63J08j47l48j034k165
$$ y = [282262, 281616, 280291, 278026, 275119, 272309, 270672, 270842, 272353, 274091, 275146, 274912, 273159, 270916, 270702, 274427, 280961, 287102, 291283, 295116, 300747, 308002, 315124, 321297, 327058, 332740, 337883, 342126, 345491, 347509, 347039, 343404, 337259, 330026, 322784, 315833, 309027, 302303, 295916, 290104, 284539, 278492, 271818, 265374, 260121, 256198, 253268, 251169, 249588, 247647, 244860, 242162, 240969, 241295, 241830, 241840, 241736, 241595, 240452, 237812, 234790, 232774, 231627, 230237, 228423, 227263, 227526, 228595, 229149, 228443, 226871, 225630, 225857, 227614, 229632, 230394, 229664, 228702, 228870, 230160, 231210, 230657, 228379, 225561, 223693, 223476, 224581, 226310, 228350, 230752, 233231, 234823, 234628, 232922, 231193, 230845, 232045, 234150, 236894, 240481, 244527, 247738, 249175, 249372, 249619, 250326, 250622, 249518, 247079, 244440, 242906, 242964, 243941, 244692, 244754, 244621, 244821, 245184, 245292, 245145, 244797, 243763, 241598]
54558B41598k621j552L50J668J928J817J892J809R64n33j792k090j645j175p56
54543B39862K21J759K848K998L221M327N088L783J087o50q12j060k150k634j579
54528B56309k17M16J300L174M390L293J180N10J229J318L40k26J29K95k4M02J978
54511B75796L185K768J493Q55J161J646J623R77J07k36L10J099J219O99J59l16
54495B92545q55p63O86K529K831J296l81j013j115j124k84J783L758M143L124
54480C07160K022J689K189L248M164L987K602J101N36R40J922L316M640M834L313
54465C47663P30j799l471l569j782O18J271n07k514k437q07J18m09j185j230p44
54449C29946o5P05J081N15m86q63o89r78j655j253P50K616K496R29O7R14K369
$$ y = [241598, 238977, 237425, 237775, 239443, 241371, 243188, 245080, 246889, 247853, 247320, 245528, 243438, 241793, 240618, 239862, 240083, 241842, 244690, 247688, 250909, 255236, 260324, 264107, 265194, 264544, 263732, 262672, 260522, 257888, 256309, 256092, 256508, 257808, 260982, 265372, 268665, 269845, 270355, 271584, 272902, 273242, 273016, 273145, 273440, 273416, 273818, 275796, 278981, 281749, 283242, 284097, 285258, 286904, 288527, 289504, 289611, 289375, 289685, 290784, 292003, 292702, 292861, 292545, 291690, 290927, 291613, 294142, 296973, 298269, 297888, 296875, 295760, 294636, 294352, 296135, 299893, 304036, 307160, 309182, 310871, 313060, 316308, 320472, 324459, 327061, 328162, 328698, 329638, 331560, 334876, 339516, 344350, 347663, 348393, 346594, 343123, 339554, 337772, 338390, 339661, 339154, 336640, 334203, 333396, 333514, 333105, 331920, 330690, 329946, 329881, 330586, 331667, 332182, 331696, 330833, 330144, 329166, 327511, 326258, 327008, 329624, 332120, 333049, 333116, 334030, 336399]
54432C36399K826J785l5j406j263N53K948M396M356L572K921K577K485K889L651
54417C68654L724K346O24N88K533M421M526L549L234L877M455M447M096L255J582
54402D15911j32m75N13J226R32P42J485K130J509L33K9L91R3r31j303m66L20k29
54384D22078j781l111l648l641l321k679j979j813k396l129l200k553j972k036
54370C84819k347k190j578j025m61O92K181K653J311q74k275k443k148k129k506
54355C71680l035l154k136n2J690J741O14M0N42R04L27k44J61O94k5j304q49J861
54337C69455M218L609R15n03Q78K950K942R19p09m87O34J072O36K49M31P93P22
54320C88724J15n96q83o65m50p93j593k164k000j222k61N50J060J298J409J398
$$ y = [336399, 339225, 341010, 340975, 339569, 338306, 338859, 341807, 346203, 350559, 354131, 357052, 359629, 362114, 365003, 368654, 372378, 374724, 375348, 375936, 378469, 382890, 387416, 390965, 394199, 398076, 402531, 406978, 411074, 414329, 415911, 415779, 415304, 415817, 417043, 417975, 418717, 420202, 422332, 423841, 424174, 424203, 424594, 424687, 423756, 422453, 421987, 422307, 422078, 420297, 417186, 413538, 409897, 406576, 403897, 401918, 400105, 397709, 394580, 391380, 388827, 386855, 384819, 382472, 380282, 378704, 377679, 377218, 377910, 380091, 382744, 384055, 383181, 380906, 378463, 376315, 374186, 371680, 368645, 365491, 363355, 363303, 364993, 366734, 367348, 367388, 367930, 368834, 369161, 368917, 369078, 369772, 369747, 368443, 367594, 369455, 373673, 377282, 378197, 377694, 378572, 381522, 384464, 385383, 384674, 384187, 384821, 385893, 386529, 386778, 387209, 388002, 388724, 388839, 388243, 387360, 386695, 386245, 385452, 383859, 381695, 379695, 378473, 378212, 378762, 379822, 381120, 382529, 383927]
54304C83927J003J81n24o51n97j040j648j374j57N69m16k678m803n809n504m231
54288C56248k855k374k921l570l528k903j995p59L92L63r84k016j454n29j319
54273C29796l398m083k233J25O64k86q19l38N0m32j156j195n96j76n39j537k459
54256C11388k587j693k60Q40R80L20k85m8R48J793J739R80L11P3j81r05j715j666
54238C10032n02O84M88j129k649k821k120j761j782j258k69k96k044m008m181
54223B86384k494n52M79P35P20O05M44K97N4k45j28N82J019J95j363j926p40R83
54205B85049J518L81j660l433l885k611m66R18Q69M40Q85J913K240J530P35N46
54189B84969M79o4o53m38M46R03L66m15l82M83J278J299N16q95k770m567n346
$$ y = [383927, 384930, 385111, 384587, 383936, 383339, 382299, 380651, 379277, 379120, 379689, 379273, 376595, 371792, 365983, 360479, 356248, 353393, 351019, 348098, 344528, 341000, 338097, 336102, 335343, 335735, 336098, 335114, 333098, 331644, 331115, 329796, 326398, 322315, 320082, 320207, 320871, 320585, 319766, 319428, 319478, 319046, 317890, 316695, 316099, 315923, 315384, 313847, 311388, 308801, 307108, 306848, 307688, 308668, 308988, 308703, 308655, 309603, 311396, 313135, 314115, 314426, 314499, 314318, 313413, 311698, 310032, 309530, 310214, 310702, 309573, 306924, 304103, 301983, 300222, 298440, 297182, 296913, 296617, 294573, 290565, 286384, 283890, 283338, 283817, 284552, 285272, 285877, 286321, 286618, 286672, 286427, 286299, 286881, 287900, 288095, 286732, 284806, 284066, 285049, 286567, 286948, 285288, 281855, 277970, 275359, 274893, 275811, 276680, 277120, 278005, 279918, 282158, 283688, 284423, 284969, 285448, 285384, 284731, 284293, 284739, 285642, 286008, 285593, 285211, 285694, 286972, 288271, 288787, 287892, 285122, 280555, 275209]
54172B75209m659l066j482l37K50l8j316k684k594n75J774K202L87j337m62K598
54156B63870M720L739J000n98l23Q6n19j177q72l72q89k047k461j631k17Q78Q46
54139B64033p53k931l402j218J520K078N86o48p37r33j835k316j752j181j230
54124B49281q19P94K284K113R17M64J149J989K503K932L022K058J87j540k484
54109B64850k799k611j867j059r30j284j081o6O66J92r05j381q76qO17P78L66
54092B52602n02j139q41Q3M96k6n01J71J557K216J607O73M14O81P90O27N25N65
54074B59998O28Q25J204J343Q56O1m33n97o61l56N92J424R86m26j004K82K205
54057B66927K650R28j668l091k130N93K871K837R55m76J4J569K379J603l94k655
$$ y = [275209, 270550, 267484, 266002, 265665, 265915, 265877, 264561, 261877, 259283, 258708, 260482, 262684, 263071, 261734, 261272, 263870, 268590, 272329, 273329, 272731, 272408, 272494, 271975, 270798, 269926, 269554, 268665, 266618, 264157, 262526, 262309, 263187, 264033, 263280, 260349, 256947, 255729, 257249, 259327, 259913, 259265, 258528, 257595, 255760, 253444, 251692, 250511, 249281, 248462, 249256, 251540, 253653, 254570, 255034, 256183, 258172, 260675, 263607, 266629, 268687, 268874, 267334, 264850, 262051, 259440, 257573, 256514, 255584, 254300, 253219, 253153, 253819, 254011, 253106, 251725, 250849, 250841, 251458, 252236, 252602, 252100, 250961, 250120, 250203, 250699, 250673, 250172, 250343, 251900, 254116, 255723, 256396, 256810, 257491, 258281, 258908, 259433, 259998, 260626, 261451, 262655, 263998, 264854, 264915, 264482, 263885, 263224, 262868, 263460, 264884, 265870, 265444, 264440, 264722, 266927, 269577, 270505, 268837, 265746, 263616, 264209, 267080, 269917, 270872, 270396, 270410, 271979, 274358, 275961, 275567, 272912]
54041B72912l801k712m6J727R47j161k032r33O00J124Q08M73L17K4n37j135j296
54024B65279m80J447L744N176M997L448J492J43r8L88O81L11k82m53j45K89O29
54007B86566Q07Q35J067J926K950K812J089o77o67R52K409K597J900J025L47L32
53991C06270J348K705L040K008Q47Q24J865L078L912M419M892N642O669P307O748
53976C61574N173L927M239O038Q107R118Q584P215O378O784P806Q436Q523Q531
53962D60433Q516Q226P896P917P923P303O396N886N316L726J868J845M086O370
53948E43707O709N611M548L730K584J011j191m849r769j3633j4363j2865j1767
53935D99463j1994j2358j2030j1435j0804r643q009o793o367o120n648n318n383
$$ y = [272912, 269111, 266399, 266353, 268080, 269027, 267866, 265834, 264901, 265501, 266625, 267433, 267906, 268223, 268247, 267710, 266575, 265279, 264799, 266246, 269990, 275166, 280163, 283611, 285103, 285246, 285148, 285536, 286217, 286528, 286246, 285793, 285648, 285937, 286566, 287373, 288208, 289275, 291201, 294151, 296963, 298052, 297375, 296708, 297660, 300069, 302666, 304566, 305591, 305938, 306270, 307618, 310323, 313363, 315371, 316218, 317042, 318907, 321985, 325897, 330316, 335208, 340850, 347519, 354826, 361574, 366747, 370674, 374913, 380951, 389058, 398176, 406760, 413975, 420353, 427137, 434943, 443379, 451902, 460433, 468949, 477175, 485071, 492988, 500911, 508214, 514610, 520496, 525812, 529538, 531406, 533251, 537337, 543707, 550416, 556027, 560575, 564305, 566889, 567900, 566709, 561860, 552091, 538458, 524095, 511230, 499463, 487469, 475111, 463081, 451646, 440842, 431199, 423190, 416397, 410030, 403910, 398262, 392944, 387561]
53922C87561n447n034l940k159l14K03j223l143l648k956k644k656j354J215K627
53907C57088J720N82J300K745K613J176N88J324J711P98l95p78m88J57J492L594
53891C75227N601O593O488N656M396L209K861L516M321M387L969M175N546P361
53877D43306Q468Q579Q376Q294P768O290M772M818O482P828P304N565M211L645
53863E35706L201K740K791L414M079M556M964N182N062N054N589O153O167O427
53849F01085Q189J0897J2408J1813J0468R771R349Q224O435M580K851J470R37
53836F98477R80K53j704l311l157k488l705o798r084q635o506n163n907q221j0608
53821F24423j1535j0376q073o346n909n972n742n556n964o469o068m864m223n167
$$ y = [387561, 382114, 377080, 373140, 370981, 370667, 370870, 369647, 366504, 362856, 359900, 357256, 354600, 353246, 354461, 357088, 358808, 359390, 360690, 363435, 366048, 367224, 367812, 369136, 370847, 371645, 371250, 370472, 369984, 370141, 371633, 375227, 380828, 387421, 393909, 399565, 403961, 407170, 410031, 413547, 417868, 422255, 426224, 430399, 435945, 443306, 451774, 460353, 468729, 477023, 484791, 491081, 495853, 500671, 507153, 514981, 522285, 527850, 532061, 535706, 538907, 541647, 544438, 547852, 551931, 556487, 561451, 566633, 571695, 576749, 582338, 588491, 594658, 601085, 609274, 620171, 632579, 644392, 654860, 664631, 673980, 682204, 688639, 693219, 696070, 697540, 698477, 699457, 699710, 698006, 694695, 691538, 689050, 685345, 678547, 669463, 660828, 654322, 649159, 643252, 635031, 624423, 612888, 602512, 594439, 588093, 582184, 576212, 570470, 564914, 558950, 552481, 546413, 541549, 537326, 532159]
53807E32159p095q444q338p220o058n355n111n249n457m909k956l05J327J260
53793D68249P92J397K667L105K517K301L319M757N589O042O880P954Q275P142
53779E30986M574R41l189o975r649j0928j0929r973q776q330r031j0067j0226
53766D38428r135p287n245l463k618l062l923l706k162o50k12j09R27K698L755
53751D04236L345K195J423J552K543L956M927M751L761K952K657K427K444L837
53737D47006O822R617J0330R266Q207P911P683P146O807O714O088M801L994M308
53723E46700M625L507J201p33j301p39K22P73M4k177m734n940n362m220l937m799
53707E23130n983o343n148k715n33k55k159m853o688p233p231p351p420o835n503
$$ y = [532159, 525064, 516620, 508282, 501062, 495004, 489649, 484538, 479289, 473832, 468923, 465967, 465662, 466989, 468249, 469041, 470438, 473105, 476210, 478727, 481028, 484347, 489104, 494693, 500735, 507615, 515569, 523844, 530986, 535560, 536501, 533312, 526337, 516688, 505760, 494831, 484858, 476082, 467752, 458721, 448654, 438428, 429293, 422006, 416761, 413298, 410680, 407618, 403695, 399989, 397827, 397177, 396965, 396856, 397783, 400481, 404236, 407581, 409776, 411199, 412751, 415294, 419250, 424177, 428928, 432689, 435641, 438298, 440725, 443169, 447006, 453828, 463445, 473775, 483041, 491248, 499159, 506842, 513988, 520795, 527509, 533597, 538398, 542392, 546700, 551325, 554832, 556033, 555300, 553999, 553260, 553482, 554255, 554299, 552122, 547388, 541448, 536086, 531866, 527929, 523130, 517147, 510804, 505656, 502941, 502408, 502153, 499994, 495141, 488453, 481220, 473989, 466638, 459218, 452383, 446880]
53692D46880m146l545l688l941l924l757l389k471j172m70r32j776j954j710j989
53677D08016k593k278q59J43l16j149p20O29J010l00j805j771k21J519K461K504
53661D04270J918J126P77J144J548J113J63J3J041J875J242k10p82N2J403K655
53645D19348M092N686O484N839M405L319K940K962L188L628M162M599M834M674
53631D80160L975L165L007L598M128L993L430K762J898J041Q41J061K72k002l782
53616E07547k811L10K771K977J813N99m52j381j697j223p01p50r77o97R4R49J583
53599E07954J830J491O48k65j025j781k499k846k826k924l275l229k286r90l84
53584D87593p27j149o35P20J646J093l03p30M53J701J390K21K45J847L180K748
$$ y = [446880, 442734, 439189, 435501, 431560, 427636, 423879, 420490, 418019, 416847, 416377, 415445, 413669, 411715, 410005, 408016, 405423, 403145, 402286, 402429, 402113, 400964, 400244, 400873, 401883, 401583, 399778, 398007, 397786, 399305, 401766, 404270, 406188, 407314, 408091, 409235, 410783, 411896, 412059, 412072, 413113, 414988, 416230, 416020, 415238, 415290, 416693, 419348, 423440, 429126, 435610, 441449, 445854, 449173, 452113, 455075, 458263, 461891, 466053, 470652, 475486, 480160, 484135, 487300, 490307, 493905, 498033, 502026, 505456, 508218, 510116, 511157, 511998, 513059, 513331, 511329, 507547, 504736, 505046, 507817, 510794, 512607, 513206, 512754, 511373, 509676, 508453, 507752, 507002, 506025, 505328, 505422, 506371, 507954, 509784, 511275, 511923, 511658, 510633, 508852, 506353, 503507, 500681, 497757, 494482, 491253, 488967, 487977, 487593, 486866, 485717, 485082, 485802, 487448, 488541, 488238, 487508, 487961, 489662, 491052, 491273, 491518, 493365, 496545, 499293]
53568D99293J211J51J82R55K028L047L648L854M125M718N428O005O239N656M064
53553E50604K520K569M174N543N507M930N033N446N108M208L960M812N946O392
53539F16752N893M793L745L294L273K821J426l44j542j803j253q9J184J662R57
53524F40769j23m95j38P1m44j428k198k178j319m14n57j809k861k537j278n64
53508F22497j102k111k249r96P58J393K47j407j719m68R21J608K216L210L947
53493F26745M142M802O554Q186Q277P279O545O232N772N633O673Q177Q437P287
53479G20741O378O788P958R241J0888J2966J4626J5275J5491J6183J7495J9001
53467H73031K0374K1433K2187K3089K4792K7357L0111L2209L3053L2467L1222
$$ y = [499293, 500504, 500655, 500837, 501792, 503820, 506867, 510515, 514369, 518494, 523212, 528640, 534645, 540884, 546540, 550604, 553124, 555693, 559867, 565410, 570917, 575847, 580880, 586326, 591434, 595642, 599602, 604414, 610360, 616752, 622645, 627438, 631183, 634477, 637750, 640571, 641997, 641653, 640111, 638308, 637055, 636966, 638150, 639812, 640769, 640646, 640151, 640013, 640084, 639640, 638212, 636014, 633836, 632517, 632103, 631546, 629737, 626876, 624339, 623061, 622497, 621395, 619284, 617035, 616039, 616797, 618190, 618437, 617030, 615311, 614843, 615764, 617372, 619588, 622798, 626745, 630887, 635689, 642243, 650429, 658706, 665985, 672530, 678762, 684534, 690167, 696840, 705017, 713454, 720741, 727119, 733907, 741865, 751106, 761994, 774960, 789586, 804861, 820352, 836535, 854030, 873031, 893405, 914838, 937025, 960114, 984906, 1012263, 1042374, 1074583, 1107636, 1140103, 1171325]
53456A171325L1064L3230L6942M0173M1817M2358M2700M3370M4757M6957M9267
53445A623960N0780N1444N1717N1445N0412M9533M9937N0907N0617M9073M8403
53434B178228M9648N1357N2122N2416N2656N1515M8164M4516M2960M2831M1448
53423B707861L8021L4240L1304K8793K6726K6249K7415K8143K6752K4127K2115
53412C021746K0719J8303J4038Q887M331J126r06k780o103j1927j9390k6011k9790
53399B992243l0897l1194l2431l5048l8436m1923m5303m8419n0460n0319m8026
53388B539787m5399m4441m5050m5261m4003m2537m2484m3303m2982m0688l7354
53377B066285l3853l0115k6307k3246k0884j7660j2511o587j781J727N202R232
$$ y = [1171325, 1202389, 1235619, 1272561, 1312734, 1354551, 1396909, 1439609, 1482979, 1527736, 1574693, 1623960, 1674740, 1726184, 1777901, 1829346, 1879758, 1929291, 1979228, 2030135, 2080752, 2129825, 2178228, 2227876, 2279233, 2331355, 2383771, 2436427, 2487942, 2536106, 2580622, 2623582, 2666413, 2707861, 2745882, 2780122, 2811426, 2840219, 2866945, 2893194, 2920609, 2948752, 2975504, 2999631, 3021746, 3042465, 3060768, 3074806, 3083693, 3088024, 3089150, 3088244, 3085464, 3079361, 3067434, 3048044, 3022033, 2992243, 2961346, 2930152, 2897721, 2862673, 2824237, 2782314, 2737011, 2688592, 2638132, 2587813, 2539787, 2494388, 2449947, 2404897, 2359636, 2315633, 2273096, 2230612, 2187309, 2144327, 2103639, 2066285, 2032432, 2002317, 1976010, 1952764, 1931880, 1914220, 1901709, 1895122, 1893341, 1895068, 1900270, 1909502]
53365A909502J3272J7077K1184K5698K9854L3177L6174L9391M2583M5286M7716
53354B260914N0533N3974N7572O0659O3037O5252O8072P1530P4810P7358P9698
53343B983409Q2551Q5666Q8364R0986R4728R9934J05464J09997J13178J15211
53333C969488J16115J15920J15114J14433J14364J14890J15463J15231J13699
53324E004717J11171J08140J04482R9687R3663Q6724P9151P1440O4634N9331N4649
53313E937789M9262M3269L7643L1971K4515J4870M774m639j4789k7631m3004n9327
53301E994703p5768r1933j06188j16267j21721j24467j26697j29325j32360j35436
53291D834541j37592j37733j35903j33433j31436j29829j28180j26625j25309
$$ y = [1909502, 1922774, 1939851, 1961035, 1986733, 2016587, 2049764, 2085938, 2125329, 2167912, 2213198, 2260914, 2311447, 2365421, 2422993, 2483652, 2546689, 2611941, 2680013, 2751543, 2826353, 2903711, 2983409, 3065960, 3151626, 3239990, 3330976, 3425704, 3525638, 3631102, 3741099, 3854277, 3969488, 4085603, 4201523, 4316637, 4431070, 4545434, 4660324, 4775787, 4891018, 5004717, 5115888, 5224028, 5328510, 5428197, 5521860, 5608584, 5687735, 5759175, 5823809, 5883140, 5937789, 5987051, 6030320, 6067963, 6099934, 6124449, 6139319, 6144093, 6139454, 6124665, 6097034, 6054030, 5994703, 5918935, 5827002, 5720814, 5604547, 5482826, 5358359, 5231662, 5102337, 4969977, 4834541, 4696949, 4559216, 4423313, 4289880, 4158444, 4028615, 3900435, 3773810, 3648501]
53282C648501j23674j21215j18471j16305j14303j10940j05559r9282r3421q7777
53272B557554q1298p3970o6954o0907n5161m8903m2407l6628l2131k8863k6365
53261B003967k3845k0585j6811j3450j0587p018k196K335M741N555P020J0097
53249A939223J3699J6821J9688K2371K4058K4655K5796K8962L3392L6989L8915
53238B224569M0273M2457M5615M8823N1192N2676N3881N5172N6198N6635N6987
53227B784478N7874N8613N7523N3971M9281M5275M2473M0144L7422L4056L0594
53216C291704K8006K6568K4976K1458J5880R859M528o34o375j2344j8036k3981
53204C361609l0915l8524m5983n3038n9655o5185o8988p1525p3865p6353p8544
$$ y = [3648501, 3524827, 3403612, 3285141, 3168836, 3054533, 2943593, 2838034, 2738752, 2645331, 2557554, 2476256, 2402286, 2335332, 2274425, 2219264, 2170361, 2127954, 2091326, 2059195, 2030332, 2003967, 1980122, 1959537, 1942726, 1929276, 1918689, 1911671, 1909475, 1911810, 1916551, 1922106, 1929126, 1939223, 1952922, 1969743, 1989431, 2011802, 2035860, 2060515, 2086311, 2115273, 2148665, 2185654, 2224569, 2264842, 2307299, 2352914, 2401737, 2452929, 2505605, 2559486, 2614658, 2670856, 2727491, 2784478, 2842352, 2900965, 2958488, 3012459, 3061740, 3107015, 3149488, 3189632, 3227054, 3261110, 3291704, 3319710, 3346278, 3371254, 3392712, 3408592, 3418451, 3422979, 3422345, 3415970, 3403626, 3385590, 3361609, 3330694, 3292170, 3246187, 3193149, 3133494, 3068309, 2999321, 2927796, 2853931, 2777578, 2699034]
53193B699034q0054q0730q0319p8828p7015p5581p4120p1681o8394o5645o4532
53182A882135o4740o5126o5000o4553o4268o4130o3541o1983n9505n6383n2691
53171A200215m8778m5640m3755m1802l7873l2140k6962k3985k2520k1268k0114
53160H35378j9216j7860j5660j3778j3420j3827j3289j1661j0416j0483j1243
53149F84525j1561j0815r164p619p441q615r496q905p796p700q269q005o785n905
53135E66449n818n637n016m790n356n858n569m863m311l849l355l088l071k865
53121E03003k460k603l649m749m762l618k407k283l395m660m684l239j616j109
53107D57769j588k088k242k280k110j516j069j524k420k465j485p49j046j573
$$ y = [2699034, 2618980, 2538250, 2457931, 2379103, 2302088, 2226507, 2152387, 2080706, 2012312, 1946667, 1882135, 1817395, 1752269, 1687269, 1622716, 1558448, 1494318, 1430777, 1368794, 1309289, 1252906, 1200215, 1151437, 1105797, 1062042, 1020240, 982367, 950227, 923265, 899280, 876760, 855492, 835378, 816162, 798302, 782642, 768864, 755444, 741617, 728328, 716667, 706251, 695768, 684525, 672964, 662149, 652985, 645366, 637925, 629310, 619814, 610909, 603113, 595413, 587144, 579139, 572354, 566449, 560631, 554994, 549978, 545188, 539832, 533974, 528405, 523542, 519231, 515382, 512027, 508939, 505868, 503003, 500543, 497940, 494291, 489542, 484780, 481162, 478755, 476472, 473077, 468417, 463733, 460494, 458878, 457769, 456181, 454093, 451851, 449571, 447461, 445945, 444876, 443352, 440932, 438467, 436982, 436233, 435187, 433614]
53093D33614j275l40K40q3j117k335l179l310k844k079j044K84J477K012J966
53078D21987J812J643J227O62K24j49m18P9J621K903K232q8j886j891r83l53J68
53061D28790J184K235K226Q71r21j873j358N3J011P50j74r64j772k840l144j577
53045D22497P54J318n59k873l875m028m276m210l156j756j072j038r39o43m10
53030C95734k06j02n09j216j090L26J884K385K153J882J083q76l035l784l056
53015C91573k009r36P60K632L106J757J61k40Q0j61j119j868j849j388r61o92
52999C88846o38j064k108l282l693l013j985j615j842j614m54O07K36j416k772
52984C64193k672j660j197j911k912k902j743n99n36j466k661l673m170l487j317
$$ y = [433614, 432339, 431999, 432239, 432156, 431039, 428704, 425525, 422215, 419371, 417292, 416248, 416532, 418009, 420021, 421987, 423799, 425442, 426669, 427331, 427555, 427406, 426988, 427067, 428688, 431591, 433823, 433735, 431849, 429958, 428975, 428622, 428790, 429974, 432209, 434435, 435306, 434385, 432512, 431154, 431207, 432218, 432968, 432794, 431830, 430058, 427218, 424074, 422497, 423251, 424569, 424010, 421137, 417262, 413234, 408958, 404748, 401592, 399836, 398764, 397726, 396787, 396144, 395734, 395528, 395426, 394917, 393701, 392611, 392937, 394821, 397206, 399359, 401241, 402324, 401448, 398413, 394629, 391573, 389564, 388628, 389388, 392020, 395126, 396883, 397044, 396804, 396884, 396723, 395604, 393736, 391887, 390499, 389538, 388846, 388208, 387144, 385036, 381754, 378061, 375048, 373063, 371448, 369606, 367992, 367538, 368145, 368381, 366965, 364193, 361521, 359861, 358664, 356753, 353841, 350939, 349196, 348597, 348061, 346595, 343934, 340261, 336091, 332604, 331287]
52969C31287J354K991L153K490J348l98k095k395j174j02n50j871k543k149j401
52954C27945q85o10l48J52Q60J118L22q24p87O73K019K256K255K815K822J010
52938C40793j556k540j551m79p19j572j608m35J212K299K208J164Oq18j616k378
52922C32410k099j65K307L597L425K773K128J255L45j6J0l20r58j102o09j28K80
52905C43133J292K785L443K463P13m03m19K52J080J572J267M9j778l756n248n518
52889C40927m549l521l499l857l154j402o5K13L56Q92R20k39j689k195j737r35
52873C16466n6N53J68j065j597m99Q55N89r07j632r25o0R1J53O46R05M59J97J101
52854C15442K458K633J359K13N90J902K318J052o50r89K78J675J834R05q5o79
$$ y = [331287, 332641, 335632, 338785, 341275, 342623, 342225, 340130, 337735, 336561, 336459, 335909, 334038, 331495, 329346, 327945, 327060, 326450, 326102, 326254, 327114, 328232, 328554, 327730, 326943, 327616, 329635, 331891, 334146, 336961, 339783, 340793, 339237, 336697, 335146, 334667, 333948, 332376, 330768, 330333, 331545, 333844, 336052, 337216, 337222, 336404, 334788, 332410, 330311, 330146, 332453, 336050, 339475, 342248, 344376, 345631, 345976, 345960, 345970, 345650, 344692, 343590, 342981, 342853, 343133, 344425, 347210, 350653, 353116, 353829, 353426, 353007, 353259, 354339, 355911, 357178, 357227, 355449, 351693, 346445, 340927, 336378, 332857, 329358, 325501, 322347, 320945, 320880, 321093, 321449, 322341, 323261, 323022, 321333, 319138, 317401, 316466, 316410, 316963, 317131, 316066, 314469, 313970, 314825, 315414, 314507, 312875, 311950, 311890, 311981, 312134, 312780, 313685, 314144, 314341, 315442, 317900, 320533, 321892, 322105, 322695, 324597, 326915, 327967, 327317, 326328, 326606, 328281, 330115, 331020, 330935, 330256]
52838C30256j136j613j911j920j561m51J542L409L647K246J055J465K466J974
52824C39468l19k521k919j752m07K63K57j88q17j173q52J9Q14J019O71L35O30
52807C32528J627K621K836K353J935J908J912J907K531L823M485L413J375L5l11
52792C64978o96j491j971j991k514l814m594l736j899m82J17K04l29j730l395
52777C36657m329m241l508k443j417j081j436j279K10J751J398n36j531k07J914
52762C19922K621J806J099J453K115J783J70j582j936n65J075J287J33q55q35
52747C27691m50j77Q04L033N091M856K141j169l582n265o631o971n432k621k04
52732C11114Q78R61N43l64j569k252j866r32k85R3P25J368J144M7o41N1J444K033
$$ y = [330256, 329120, 327507, 325596, 323676, 322115, 321664, 323206, 326615, 330262, 332508, 333563, 335028, 337494, 339468, 339149, 336628, 333709, 331957, 331550, 331813, 332070, 331882, 331065, 329892, 329040, 329059, 329873, 330892, 331563, 331898, 332528, 334155, 336776, 339612, 341965, 343900, 345808, 347720, 349627, 352158, 355981, 360466, 363879, 365254, 365289, 364978, 364282, 362791, 360820, 358829, 356315, 352501, 347907, 344171, 342272, 341790, 341907, 342111, 341782, 340052, 336657, 332328, 328087, 324579, 322136, 320719, 319638, 318202, 316923, 317133, 318884, 320282, 319746, 318215, 318008, 319922, 322543, 324349, 325448, 326901, 329016, 330799, 330969, 329387, 327451, 326886, 327961, 329248, 329381, 328526, 327691, 327241, 327064, 327868, 330901, 335992, 340848, 342989, 341820, 338238, 332973, 326342, 319371, 313939, 311318, 311114, 311992, 312953, 313496, 313132, 311563, 309311, 307445, 306513, 306228, 306321, 307046, 308414, 309558, 309605, 308964, 309015, 310459, 312492]
52714C12492J240j62j021p62K72R82L90j218k368k024p85pj83q06j340j529j055
52697C02116K04J602K241K070J782J671J360P33K79L12N72Q55J373K104K421J836
52681C23531P76J49L96J196J894K037J724J541J875K312J960N30j302k543k615
52666C33461j493K86J646J598J77j531k458k335j422n4J225J602O79r21k095k326
52650C26039j997j686j468j032k96L30M36J98J45L72M36K23L15J051J726J497
52634C26289O80L18O22P97M03j35o15j527k839l305j901N17J966J597M62L8O83
52617C24050J682K259K160J559Q01K10j49n83j489k696l309k545p38Q52J386J208
52601C24658J101J348J828K519L271L490K789J692R97P21M74N45J604L310M352
$$ y = [312492, 313732, 313570, 312549, 311787, 312059, 313041, 313431, 312213, 309845, 307821, 307036, 307029, 306846, 306040, 304700, 303171, 302116, 302320, 303922, 306163, 308233, 310015, 311686, 313046, 313779, 314058, 314370, 314942, 315797, 317170, 319274, 321695, 323531, 324307, 324456, 324852, 326048, 327942, 329979, 331703, 333244, 335119, 337431, 339391, 339921, 338619, 336076, 333461, 331968, 332254, 333900, 335498, 335675, 334144, 331686, 329351, 327929, 327875, 329100, 330702, 331381, 330460, 328365, 326039, 324042, 322356, 320888, 319856, 319560, 319890, 320326, 320524, 320669, 321041, 321477, 321700, 322015, 323066, 324792, 326289, 326969, 327287, 327909, 328706, 329109, 328974, 328359, 326832, 323993, 320688, 318787, 319304, 321270, 322867, 323329, 323367, 324050, 325732, 327991, 330151, 331710, 332511, 332721, 332572, 331989, 330500, 327804, 324495, 321950, 321212, 322064, 323450, 324658, 325759, 327107, 328935, 331454, 334725, 338215, 341004, 342696, 343693, 344414, 344888, 345433, 347037, 350347, 354699]
52586C54699M081L120K091Q20o57j451j026l35p17j998k686j856j72R05M44j266
52570C53996k770k508l69J902K500J643J185K142L371L107J249n75j056p08j064
52555C62045k693m441m714l182r43O56J027J93j603l790n226m752k258R08K859
52540C34086K683J191O3K22J077J439R59M03O67J776K895L052J829k68j999k240
52524C47835r77O31J351J151J166K262L755L999K405L94k51K67M0j838l826l838
52508C54526j873J51P58K11m10n83m92l51K0Q90J952K231J068q04j865j540n41
52491C53348N07J625K238J046j716l201j075L042N147L597N34j298j327m95K62
52476C62234J67j231l164l896k630l78J401K141J927J052L12N76J513J724P23
$$ y = [354699, 358780, 361900, 363991, 364811, 364154, 362703, 361677, 361342, 360625, 358627, 355941, 354085, 353913, 354818, 355262, 353996, 351226, 348718, 348349, 350251, 352751, 354394, 355579, 357721, 361092, 364199, 365448, 364873, 363817, 363109, 362045, 359352, 354911, 350197, 347015, 346072, 346728, 347755, 347948, 346345, 342555, 337329, 332577, 330319, 331227, 334086, 336769, 337960, 338023, 338245, 339322, 340761, 341720, 342123, 342790, 344566, 347461, 350513, 352342, 352074, 350075, 347835, 346858, 347489, 348840, 349991, 351157, 353419, 357174, 361173, 363578, 363972, 363721, 363988, 364028, 362190, 358364, 354526, 352653, 352804, 353562, 353773, 353363, 352780, 352288, 351937, 351957, 352847, 354799, 357030, 358098, 357294, 355429, 353889, 353348, 353855, 355480, 357718, 358764, 357048, 353847, 352772, 355814, 360961, 364558, 365092, 363794, 362467, 361972, 362234, 362401, 361170, 358006, 354110, 351480, 351102, 352503, 354644, 356571, 357623, 357935, 358511, 360024, 361748, 362471]
52461C62471k72j18O40P50M7n48k95O22J277P61o62j296J01K392L361K879K917
52444C75027M150M755L470J696J046Q61j08j222j345j278k339l543k872q27N2
52429C77523p86j058N21K091J527m28j430p11N25J136J149R70P08M41O09J659
52413C84446L335M534M294L018K241K767L594L279J832L73o05j474k185k004p72
52398D06673O46J553K105K477K158P74j022k131k168j654j249j192j287j208q08
52383D03667l25j47m05q46j103r42m53o8k48r02j377j233o61L7Q32J386Q32r49
52365C97095k350j536J036K823K241M90l01J36L28m78j199n74R52J849J620J314
52349D03446J812K587K770K690L271M399N152N542O491P795P691N375K657J827
$$ y = [362471, 362199, 362081, 362721, 363471, 363518, 362970, 362675, 363297, 364574, 365335, 364673, 363377, 363478, 365870, 369231, 372110, 375027, 379177, 383932, 387402, 389098, 390144, 391005, 390897, 389675, 388330, 387052, 384713, 381170, 378298, 377471, 377523, 376737, 375679, 376200, 378291, 379818, 379390, 377960, 377249, 377774, 378910, 380059, 381029, 381737, 382178, 382787, 384446, 387781, 392315, 396609, 399627, 401868, 404635, 408229, 411508, 413340, 413713, 413108, 411634, 409449, 407445, 406673, 407319, 408872, 410977, 413454, 415612, 416386, 415364, 413233, 411065, 409411, 408162, 406970, 405683, 404475, 403667, 403342, 403195, 402790, 401944, 400841, 399899, 399446, 399378, 399130, 398228, 396851, 395618, 394957, 394994, 395826, 397212, 398044, 397095, 394745, 393209, 394245, 397068, 399309, 399799, 399498, 399634, 399962, 399484, 398285, 397711, 398663, 400512, 402132, 403446, 405258, 407845, 410615, 413305, 416576, 420975, 426127, 431669, 438160, 445955, 453646, 459021, 461678, 463505]
52335D63505K651K886J357p69j767j351p05j120k731m271m301k840j344q14p11
52320D47675k64J27k11p56m50O04J392J599J752J943J667J014R17J914L393M232
52304D66548L660J745l81j124q6J244J282L86k2K68L14N7M68J466J428m24k542
52287D74287k884j217J128K942L621K840R57m78K22K917N337N317L193J422J667
52272E01271K936L357L213M537P693J0241J0254R004Q789R509R470Q583Q358R119
52258F06334R573R191Q738Q215O580M135K984M123N885O355N692M982M317L371
52244F90475K665K814L409L773M017M444M735M736N128O225O874N858L867K874
52230G51894L706N107N187L288O15q28k40R98J026L3j46R52J537M64o77K67K912
$$ y = [463505, 466156, 469042, 470399, 469630, 467863, 466512, 465807, 464687, 461956, 457685, 453384, 450544, 449200, 448386, 447675, 447411, 447538, 447327, 446571, 446121, 446725, 448117, 449716, 451468, 453411, 455078, 456092, 457009, 458923, 462316, 466548, 470208, 471953, 471572, 470448, 470362, 471606, 472888, 473274, 473252, 473520, 473834, 473891, 474359, 475825, 477253, 476829, 474287, 471403, 470186, 471314, 474256, 477877, 480717, 481674, 481196, 481418, 484335, 489672, 494989, 498182, 499604, 501271, 504207, 507564, 510777, 515314, 523007, 533248, 543502, 552506, 561295, 570804, 580274, 588857, 597215, 606334, 615907, 625098, 633836, 642051, 648631, 652766, 655750, 659873, 665758, 672113, 677805, 682787, 687104, 690475, 693140, 695954, 699363, 703136, 707153, 711597, 716332, 721068, 726196, 732421, 739295, 745153, 749020, 751894, 755600, 760707, 765894, 769182, 769797, 768969, 768729, 769727, 770753, 770786, 770640, 771592, 773129, 773593, 772916, 773183, 776095]
52213G76095M896M871L555K428K558M192O355P214N999M188L849N210O792P442
52199H45644P202O547N856N434N184M608L763L665M877O356O727O083N390M760
52185I22096L777K917L142M166M732M537M454M813N020N056N751P093P804P314
52171I92672O754P032P184N907M012L760N917Q621R537Q384O906O806Q205R964
52157A091661J0946J0747R580Q064P088P340Q708J0509J2313J4037J5150J4803
52145A220946J3123J1502J0841J0376R204Q095Q389R637R987Q858P662P510P651
52132A343781O884N332L976L270L157L752N054O242O191M789L116K270K302K332
52118A402448J444n17k724m045m115l800m159n085n330m208k873l150n138o715
$$ y = [776095, 780991, 785862, 789417, 791845, 794403, 798595, 804950, 812164, 818163, 822351, 826200, 831410, 838202, 845644, 852846, 859393, 865249, 870683, 875867, 880475, 884238, 887903, 892780, 899136, 905863, 911946, 917336, 922096, 925873, 928790, 931932, 936098, 940830, 945367, 949821, 954634, 959654, 964710, 970461, 977554, 985358, 992672, 999426, 1006458, 1013642, 1019549, 1023561, 1027321, 1033238, 1041859, 1051396, 1059780, 1066686, 1073492, 1081697, 1091661, 1102607, 1113354, 1122934, 1130998, 1138086, 1145426, 1154134, 1164643, 1176956, 1190993, 1206143, 1220946, 1234069, 1245571, 1256412, 1266788, 1275992, 1284087, 1292476, 1302113, 1312100, 1320958, 1328620, 1336130, 1343781, 1350665, 1355997, 1359973, 1363243, 1366400, 1370152, 1375206, 1381448, 1387639, 1392428, 1395544, 1397814, 1400116, 1402448, 1403892, 1403375, 1400651, 1396606, 1392491, 1388691, 1384532, 1379447, 1374117, 1369909, 1367036, 1363886, 1358748, 1352033]
52104A352033n943l408j358r23j136p53J69Q91J226J506J849K115K190J965J406
52089A351829R33J120J694J722J173J307K780M343M402L035J429K00n53l87P70
52074A375797J624Q92o31j058j42O83Q59J370K695M034N076O545Q351R024Q114
52059A423233P427Q593J0812J2272J2508J1877J0096P133M505L711L875K895N42
52046A519479j502k472l313m479n018m390l402k533j075J060K321J745Q32J515
52032A498768L160L485J944L13j80l89j389k722l346l288l326l706m057m099l720
52017A477448k846j874j733k712l595k875o26J640K851L276L606L977M057L519
52003A484113K386J418J742L316M014J681k844o122o006l766j811q35l42n45j915
$$ y = [1352033, 1346090, 1342682, 1341324, 1340401, 1339265, 1338512, 1338681, 1339572, 1340798, 1342304, 1344153, 1346268, 1348458, 1350423, 1351829, 1352762, 1353882, 1355576, 1357298, 1358471, 1359778, 1362558, 1366901, 1371303, 1374338, 1375767, 1375967, 1375414, 1375027, 1375797, 1377421, 1378313, 1377682, 1376624, 1376482, 1377165, 1378024, 1379394, 1382089, 1386123, 1391199, 1397744, 1406095, 1415119, 1423233, 1430660, 1439253, 1450065, 1462337, 1474845, 1486722, 1496818, 1503951, 1508456, 1512167, 1516042, 1518937, 1519479, 1517977, 1515505, 1512192, 1507713, 1502695, 1498305, 1494903, 1492370, 1491295, 1492355, 1494676, 1496421, 1497253, 1498768, 1501928, 1505413, 1507357, 1507670, 1507490, 1507101, 1505712, 1502990, 1499644, 1496356, 1493030, 1489324, 1485267, 1481168, 1477448, 1474602, 1472728, 1470995, 1468283, 1464688, 1461813, 1461187, 1462827, 1465678, 1468954, 1472560, 1476537, 1480594, 1484113, 1486499, 1487917, 1489659, 1492975, 1496989, 1498670, 1495826, 1489704, 1483698, 1479932, 1478121, 1477286, 1476944, 1476399, 1474484]
51988A474484l576m006l245k783l268l884m175m905o397p445o873n353m529m835
51974A409210n152m475l102k154k456l892n406n536l394M55M107N579M296J581
51960A389661m57p13K12J143J726K396L216L579L091K123J274O85J68m77j512
51945A406115l257n683q315j0816j3219j5385j6739j7140j7527j8915k0887k1933
51933A236299k1388k0229j9663j9669j9537j9181j9091j9215j8828j7596j6040
51922A025862j4693j3497j2427j1991j2524j3467j4058j4310j4548j4313j2808
51911H77226j0355q308p225o129m143j896n18J25J237L376N876P906R320J0230
51897H76722J0464R770Q305O514M682K833J075j91o33n27o06j214j725j173O58
$$ y = [1474484, 1470908, 1466902, 1463657, 1460874, 1457606, 1453722, 1449547, 1444642, 1438245, 1430800, 1423927, 1418574, 1414045, 1409210, 1404058, 1399583, 1396481, 1394327, 1391871, 1387979, 1382573, 1377037, 1373643, 1374098, 1378205, 1383784, 1388080, 1389661, 1389204, 1388491, 1388703, 1389846, 1391572, 1393968, 1397184, 1400763, 1403854, 1405977, 1407251, 1407936, 1408104, 1407627, 1406115, 1402858, 1397175, 1388860, 1378044, 1364825, 1349440, 1332701, 1315561, 1298034, 1279119, 1258232, 1236299, 1214911, 1194682, 1175019, 1155350, 1135813, 1116632, 1097541, 1078326, 1059498, 1041902, 1025862, 1011169, 997672, 985245, 973254, 960730, 947263, 933205, 918895, 904347, 890034, 877226, 866871, 858563, 851338, 845209, 841066, 839170, 838652, 838777, 840014, 843390, 849266, 857172, 866492, 876722, 887186, 896956, 905261, 911775, 916457, 919290, 920365, 920174, 919541, 919014, 918408, 917194, 915469, 914296, 914954]
51882I14954L022M936N933O301P023R095J2291J4888J5473J4869J5157J6746J7495
51869A058183J5284J0381M712k24l960o565q612j1087j4435j7853k0273k1580
51857I83971k2261k2377k1706k0562j9604j8992j8357j7407j6081j4349j2309
51846G79966j0181p847m995k050j65L10N40J608L105M059M398M377L576J753q4
51831G78370r67j631l214m963n138l837k881k800k079J96K910M932O801R437J2533
51816G87669J5294J7689J9998K2107K3984K5909K7344K6559K2433J5892Q662J257
51804A014797o645j4294j9679k1537k0852j9933k0197k1022k0753j8777j6181
51793H14927j4212j2704j0736q345o598o140o652p650q704r019q072o773o660
$$ y = [914954, 917976, 922912, 928845, 935146, 942169, 951264, 963555, 978443, 993916, 1008785, 1023942, 1040688, 1058183, 1073467, 1083848, 1088560, 1088336, 1084376, 1077811, 1069199, 1058112, 1043677, 1025824, 1005551, 983971, 961710, 939333, 917627, 897065, 877461, 858469, 840112, 822705, 806624, 792275, 779966, 769785, 761938, 756943, 754893, 754728, 755038, 755578, 757186, 760291, 764350, 768748, 773125, 776701, 778454, 778370, 777403, 775772, 772558, 767595, 762457, 758620, 755739, 752939, 750860, 751056, 753966, 758898, 765699, 775136, 787669, 802963, 820652, 840650, 862757, 886741, 912650, 939994, 966553, 988986, 1004878, 1013540, 1014797, 1008152, 993858, 974179, 952642, 931790, 911857, 891660, 870638, 849885, 831108, 814927, 800715, 788011, 777275, 768930, 762332, 756192, 749540, 741890, 733186, 724167, 716095, 709322, 702662]
51780G02662p650p979o756n170m610m916n261n431n335m432k685j138n02m4J102
51765F41855K439K916K462J640N57p84j714j666j132p49o0J489K885K395P5j781
51749F50827r99K395O392Q628Q037N590L236J703o7k750m929m898l232j879j187
51734F66867J21J973K201l45l712n192m555l615l441l553l405l191k934k137q78
51719F34204k63r52j828j237N77J477K72j422j209Q76K437J972O60M95J830L659
51703F41548N357O970Q241Q526P732O427M944L079Q59j129k397l061l476l738
51689F79882l834l915m085m073l585k937l026m282n819o002m110j032J751L514
51675F38447M331M567M985O649R612J2014J1828R518P621P513P949P249N464L636
$$ y = [702662, 695012, 687033, 680277, 675107, 670497, 665581, 660320, 654889, 649554, 645122, 642437, 641299, 640797, 640753, 641855, 644294, 647210, 649672, 651312, 651869, 651085, 649371, 647705, 646573, 645824, 645764, 647253, 650138, 652533, 652608, 650827, 649828, 652223, 658615, 667243, 675280, 680870, 684106, 685809, 685742, 682992, 678063, 673165, 669933, 668054, 666867, 666988, 668961, 671162, 670817, 667105, 661913, 657358, 653743, 650302, 646749, 643344, 640153, 637219, 635082, 634204, 633941, 632989, 631161, 629924, 630501, 631978, 632250, 630828, 629619, 630495, 632932, 634904, 635564, 636059, 637889, 641548, 646905, 653875, 662116, 670642, 678374, 684801, 689745, 692824, 693683, 692554, 690157, 687096, 683620, 679882, 676048, 672133, 668048, 663975, 660390, 657453, 654427, 650145, 644326, 638324, 634214, 633182, 634933, 638447, 642778, 647345, 652330, 658979, 668591, 680605, 692433, 701951, 709572, 717085, 725034, 732283, 737747, 741383]
51661G41383K272J572K027L521M685M349K975J595J25j942l906m526l985l682
51647G46463m092m243l440k288j666j732k169k583k428j385j09J94q37k307l303
51632G14075l751l866l361j748P46K914L330J565j246l436m519n349o362o551
51618F82441m970k440o30Q8P23J941L387M541N152M895L761K736L015M430N708
51603G14778O251O687P550Q597R458R827Q863N753J197k895n545p455r197j0143
51589G43726r854r096q430p010m088q36P83M41n75j495k858n113p641r514j0466
51574F67974j0733j0415r352p438n000k948k343l369m827n097l689j578K6Q78
51560F02089J529K217K388J520J82l25M50J363J066k99j456j709j424r13K4J138
$$ y = [741383, 743655, 745227, 747254, 750775, 755460, 759809, 762784, 764379, 764504, 762562, 758656, 754130, 750145, 746463, 742371, 738128, 734688, 732400, 730734, 729002, 726833, 724250, 721822, 720437, 720328, 720522, 719685, 717378, 714075, 710324, 706458, 703097, 701349, 702095, 705009, 708339, 709904, 708658, 705222, 700703, 695354, 688992, 682441, 677471, 675031, 674401, 674489, 675212, 677153, 680540, 685081, 690233, 695128, 698889, 701625, 704640, 709070, 714778, 721029, 727716, 735266, 743863, 753321, 763148, 772011, 777764, 778961, 776066, 770521, 763066, 753869, 743726, 733872, 724776, 716346, 709336, 705248, 704412, 705195, 705636, 705061, 703566, 700708, 695595, 687954, 678440, 667974, 657241, 646826, 637474, 630036, 625036, 622088, 619745, 616376, 611549, 606452, 602763, 601185, 601211, 602089, 603618, 605835, 608223, 609743, 609925, 609600, 610050, 611413, 612479, 612180, 610724, 609015, 607591, 606678, 606702, 607840]
51544F07840J535J048Q35J741K881K915K160K066L004L932M304M911O343P973
51530F53488R241J0804J3247J5394J5301J2679R070N606K159r12j769Q33N350
51517G50491Q749R767R752J0462J2285J4768J7549K0134K1702K1913K1539K1726
51505I40837K2896K4557K5785K5762K4484K3142K3164K4582K6135K7199K8709
51494A217252L1596L5149L7581L7447L4055K7481J9030J0715L331m250j2978k1765
51482A414644k8941l4515l9550m3952m6612m7305m6741m4999m1616l7299l3842
51471I69272l1900l0247k7599k4105k0681j7957j6116j4790j3058j0437p819o429
51459G48134o111n872n689o137o605n920m688m757o006o141m433l128l876n147
$$ y = [607840, 609375, 610423, 611258, 612999, 615880, 618795, 620955, 623021, 626025, 629957, 634261, 639172, 645515, 653488, 662729, 673533, 686780, 702174, 717475, 730154, 739224, 744830, 746989, 746077, 744308, 745141, 750491, 759240, 769007, 778759, 789221, 801506, 816274, 833823, 853957, 875659, 897572, 919111, 940837, 963733, 988290, 1014075, 1039837, 1064321, 1087463, 1110627, 1135209, 1161344, 1188543, 1217252, 1248848, 1283997, 1321578, 1359025, 1393080, 1420561, 1439591, 1450306, 1453637, 1449387, 1436409, 1414644, 1385703, 1351188, 1311638, 1267686, 1221074, 1173769, 1127028, 1082029, 1040413, 1003114, 969272, 937372, 907125, 879526, 855421, 834740, 816783, 800667, 785877, 772819, 762382, 754563, 748134, 742023, 736151, 730462, 724325, 717720, 711800, 707112, 702355, 696349, 690208, 685775, 682647, 678771, 673624]
51445F73624m956m057m217m937m397k693j677k084k937l497l867l682k283l79
51431F27961J94j116k715k930j826o14j62m62q87o41N20J808K156J438M73k0J06
51414F23283Q19K010L206L747L330K064K91j188j243M25K468L058J746m72k686
51399F40858m725o411p131o507m921l131j552m5J725L470L955K281l38j158R52
51384F17322L953N286N108N554P471R680J1160J2106J2656J2209J0486Q074N455
51371G26520K778Q39Q85K649L833K503p19l644n008n298n611o508p681q212p355
51356F89971n386l405k268k005k221k432k114j221o09r24j221J09K766M462L949
51341F77451K571J952J650N76n05K17K928O008Q289R867J0844J0983J0856J1801
$$ y = [673624, 668668, 664611, 660394, 655457, 651060, 648367, 646690, 644606, 641669, 638172, 634305, 630623, 628340, 627961, 628155, 627039, 624324, 621394, 619568, 618954, 618792, 618330, 617443, 616802, 617322, 619130, 621286, 622724, 623197, 623177, 623283, 624102, 626112, 629318, 633065, 636395, 638459, 638750, 637562, 636319, 636744, 639212, 642270, 644016, 643544, 640858, 636133, 629722, 622591, 616084, 611163, 608032, 606480, 606435, 608160, 611630, 615585, 617866, 617528, 616370, 617322, 621275, 626561, 631669, 637223, 644694, 654374, 665534, 677640, 690296, 702505, 712991, 721065, 726520, 729298, 730137, 731022, 733671, 737504, 740007, 739288, 735644, 730636, 725338, 719727, 713219, 705538, 697326, 689971, 684585, 681180, 678912, 676907, 674686, 672254, 670140, 668919, 668310, 667386, 666165, 666274, 669040, 673502, 677451, 680022, 681974, 683624, 684200, 683695, 683912, 686840, 692848, 701137, 711004, 721848, 732831, 743687, 755488]
51327G55488J4129J6472J7630J8145J9372K1766K4751K7682L0282L2517L4701
51316A012935L7501M1295M5608M9566N2685N4885N5790N4494N0092M2510L2668
51305A530029K1863J0793p13j2911k5259l6562m5837n2696n7047n8936n8736n7022
51293A156966n4301n1209m8665m7063m5378m1964l6554l0635k5657k1768j8652
51282G35120j6420j4919j3194j0767q714q339r272j0045j0045r645q818p174n204
51269F02564l970l438k638j695j921l412m301l455k291k482l213k494m00R22L12
51254E68088r98j314m73M25M86k26q73o37L46R20K62j087j948j887j241l75K62
51237E59730q1j553k930k879j819j261j521j441m32O18Q24M65K39L06N20P98R84
$$ y = [755488, 769617, 786089, 803719, 821864, 841236, 863002, 887753, 915435, 945717, 978234, 1012935, 1050436, 1091731, 1137339, 1186905, 1239590, 1294475, 1350265, 1404759, 1454851, 1497361, 1530029, 1551892, 1562685, 1561972, 1549061, 1523802, 1487240, 1441403, 1388707, 1331660, 1272724, 1213988, 1156966, 1102665, 1051456, 1002791, 955728, 910350, 868386, 831832, 801197, 775540, 753772, 735120, 718700, 703781, 690587, 679820, 671106, 662767, 653495, 643450, 633405, 623760, 614942, 607768, 602564, 598594, 595156, 592518, 590823, 588902, 585490, 581189, 577734, 575443, 572961, 569748, 567254, 566854, 567776, 568088, 567090, 565776, 565303, 565728, 566214, 565988, 565115, 564478, 564824, 565744, 566006, 564919, 562971, 561084, 559843, 559468, 559730, 559649, 558096, 555166, 552287, 550468, 549207, 547686, 546245, 545813, 546431, 547255, 547720, 547959, 548265, 548785, 549583, 550567]
51220E50567J110J766L223M407M050K929L226N318O875N909L151N00j238j945
51206E89848j169Q39K258J607j90j200j153j181j553j430n69M07J269K102K169
51191E92054N43k074l761l888l682l976m004l059j874j336j003o3J040J094j00
51176E65911j420j830j369o75j33L68R93J433J012m28j888j989n37J136J615Q05
51160E63004k52n68Q8J312K450K957K772K375K414L236M645O046O788O649N932
51145F09848N041M047K892J871J537K014K733L012K756K365K044J479L63r04j482
51130F39616j198r27j479k438k728k204j775j901j841q42P09J867K330K455K440
51115F32084K118J340J66j149k141k437k255k215k506k713k653k669k885l007
$$ y = [550567, 551677, 553443, 556666, 561073, 565123, 568052, 571278, 576596, 583471, 589380, 592531, 593031, 591793, 589848, 588679, 589518, 591776, 593383, 593193, 591993, 590840, 589659, 588106, 586676, 586107, 586514, 587783, 589885, 592054, 592597, 590523, 586762, 582874, 579192, 575216, 571212, 568153, 566279, 564943, 563940, 563877, 564917, 566011, 565911, 564491, 562661, 561292, 560617, 560484, 560852, 561845, 563278, 564290, 563862, 561974, 559985, 559448, 560584, 562199, 563004, 562752, 562184, 562272, 563584, 566034, 568991, 571763, 574138, 576552, 579788, 584433, 590479, 597267, 603916, 609848, 614889, 618936, 621828, 623699, 625236, 627250, 629983, 632995, 635751, 638116, 640160, 641639, 642002, 641098, 639616, 638418, 637491, 636012, 633574, 630846, 628642, 626867, 624966, 623125, 622283, 622992, 624859, 627189, 629644, 632084, 634202, 635542, 635708, 634559, 632418, 629981, 627726, 625511, 623005, 620292, 617639, 614970, 612085, 609078]
51101F09078l012l158k977j533P93K113J471J91k99n14j290j563K6K187K175k10
51085F03478k178j868n66l24j208j969k064j790j278l33J111K857M347M634L195
51070F06044R77k29L00J706K985L913M396M031K935K054K104K743L251L405L486
51055F44101L892M802N652N242L328J777K747N699P735P153N082L179J547j97
51041G01739j432j481r29o74m40M61J657K112J628R81Q65J349J990K036J094r1
51025G10865k97M23P31J75j5R18J853J685J261J866K908K885J762O50k06j217
51009G26247j811j009N04R05p3p78j70J159K804N416Q764J0774R873P282N595
50994G75482N757O570O748O221N609N359N712O851Q630J0314J0892R947Q298P470
$$ y = [609078, 606066, 602908, 599931, 598398, 599191, 601304, 602775, 602966, 602667, 602153, 600863, 599300, 599326, 601513, 603688, 603478, 601300, 599432, 598866, 598542, 597334, 595365, 593301, 591511, 590233, 589900, 591011, 593868, 598215, 602849, 606044, 607021, 606792, 607092, 608798, 611783, 615696, 620092, 624123, 627058, 629112, 631216, 633959, 637210, 640615, 644101, 647993, 652795, 658447, 663689, 667017, 668794, 671541, 677240, 684975, 692128, 697210, 700389, 701936, 701739, 700307, 698826, 697897, 697223, 696783, 697244, 698901, 701013, 702641, 703622, 704487, 705836, 707826, 709862, 710956, 710865, 710568, 710991, 711722, 711897, 711882, 712800, 714653, 716338, 717599, 719465, 722373, 725258, 727020, 727670, 727464, 726247, 724436, 723427, 723931, 724836, 724763, 723985, 723815, 724974, 727778, 733194, 741958, 752732, 762605, 769887, 775482, 781239, 787809, 794557, 800778, 806387, 811746, 817458, 824309, 832939, 843253, 854145, 864092, 872390, 879860]
50980H79860Q140R318R400P900N758M141L558L836M238L668J570j282l584n162
50966I31359p005r525j1739j2524j1862j0304q079n440l171j834j006j6Q77J022
50952H50753P63J242K755M283M986N204N562N928N932N914O451P248P450O965
50938I21436O475O115N188L698L092M569P204Q799Q328O683N269M839N703P882
50924A005280J0534J2163J1992J0691R383Q530Q103Q186Q657Q770P722N454K489
50911A117954o81l546n395n924n896o508p998r251q914o641l385o46P32J251K152
50896A057304M085O598Q978J1075J2999J4721J6459J8901K2300K5685K7812K8814
50884A255731L0171L2956L6667L9971M2193M3857M5878M8325N0001M9516M6694
$$ y = [879860, 888000, 897318, 906718, 914618, 920376, 924517, 928075, 931911, 936149, 939817, 941387, 940105, 936521, 931359, 924354, 914829, 903090, 890566, 878704, 868400, 860321, 854881, 851710, 849876, 848870, 848854, 849731, 850753, 851516, 852758, 855513, 859796, 864782, 869986, 875548, 881476, 887408, 893322, 899773, 907021, 914471, 921436, 927911, 934026, 939214, 942912, 946004, 950573, 957777, 966576, 974904, 981587, 986856, 991695, 997398, 1005280, 1015814, 1027977, 1039969, 1050660, 1060043, 1068573, 1076676, 1084862, 1093519, 1102289, 1110011, 1115465, 1117954, 1117273, 1113727, 1108332, 1102408, 1096512, 1090004, 1082006, 1072755, 1063841, 1057200, 1053815, 1053169, 1053901, 1055152, 1057304, 1061389, 1067987, 1076965, 1088040, 1101039, 1115760, 1132219, 1151120, 1173420, 1199105, 1226917, 1255731, 1285902, 1318858, 1355525, 1395496, 1437689, 1481546, 1527424, 1575749, 1625750, 1675266, 1721960]
50873A721960M2505L7603L1715K4878J8310J3209R291N472J552j926n248r606
50861A889715j5337k1160k5621k8466l0222l1203l1605l1867l2114l1585k9427
50850A581108k6059k3090k1665k1414k1286k0952k0820k0792j9932j7753j5282
50839A352063j4079j4331j4662j3869j2107j0261q893q182q160q503q567q105
50827A222344p467o793n707m304l560l973m407l376j112O06N45q54k311k787j904
50812A174940m4J783K789L197L790M909O325P638Q281P606N855M729N880R001
50798A246679J2197J4116J4807J4697J3907J2798J2142J2388J3308J4505J5633
50787A397177J6268J6336J6543J7547J8865J9588K0001K1333K3869K6668K9230
$$ y = [1721960, 1764465, 1802068, 1833783, 1858661, 1876971, 1890180, 1899471, 1904943, 1906495, 1904569, 1899321, 1889715, 1874378, 1853218, 1827597, 1799131, 1768909, 1737706, 1706101, 1674234, 1642120, 1610535, 1581108, 1555049, 1531959, 1510294, 1488880, 1467594, 1446642, 1425822, 1405030, 1385098, 1367345, 1352063, 1337984, 1323653, 1308991, 1295122, 1283015, 1272754, 1263861, 1255679, 1247519, 1239016, 1230449, 1222344, 1214877, 1208084, 1202377, 1198073, 1194513, 1190540, 1186133, 1182757, 1181645, 1182251, 1182796, 1181942, 1179631, 1176844, 1174940, 1174896, 1176679, 1179468, 1182665, 1186455, 1191364, 1197689, 1205327, 1213608, 1221214, 1227069, 1231798, 1237678, 1246679, 1258876, 1272992, 1287799, 1302496, 1316403, 1329201, 1341343, 1353731, 1367039, 1381544, 1397177, 1413445, 1429781, 1446324, 1463871, 1482736, 1502324, 1522325, 1543658, 1567527, 1594195, 1623425]
50776A623425L2021L4956L7007L8108M0030M4159M9429N3752N6824O0194O4874
50765B134779P0059P4240P6824P8483Q0480Q3598Q7390R0404R1311Q9750Q6185
50754C043503Q1361P5843O9488O1348N0756L8528K6257J4406K370r371j8752k4766
50742C410971k9200l4155l8846m0598l8548l4405k9578k3472j5396o487J439Q179
50730C129904J5027K2763L0760L8046M4268M9404N3180N5298N5849N5016N2601
50719C602116M8419M3089L7667L2286K5840J7506Q129o89q440j5929k3857l2156
50707C733981m0727m9862n9579o9232p8068q5651r1676r6036r9218j01720j02760
50696B859452j00598r4769q7248q0617p5562p0815o4997n7850n0120m3042l7647
$$ y = [1623425, 1655446, 1690402, 1727409, 1765517, 1805547, 1849706, 1899135, 1952887, 2009711, 2069905, 2134779, 2204838, 2279078, 2355902, 2434385, 2514865, 2598463, 2685853, 2776257, 2867568, 2957318, 3043503, 3124864, 3200707, 3270195, 3331543, 3382299, 3420827, 3447084, 3461490, 3463860, 3454489, 3435737, 3410971, 3381771, 3347616, 3308770, 3268172, 3229624, 3195219, 3165641, 3142169, 3126773, 3120286, 3121725, 3129904, 3144931, 3167694, 3198454, 3236500, 3280768, 3330172, 3383352, 3438650, 3494499, 3549515, 3602116, 3650535, 3693624, 3731291, 3763577, 3789417, 3806923, 3815052, 3814363, 3805923, 3789994, 3766137, 3733981, 3693254, 3643392, 3583813, 3514581, 3436513, 3350862, 3259186, 3163150, 3063932, 2962212, 2859452, 2758854, 2664085, 2576837, 2496220, 2420658, 2349843, 2284846, 2226996, 2176876, 2133834, 2096187]
50685B096187l3863l0430k6212k1338j6582j2117p597l167M82L189N788R271J3736
50672A977347J8241K1545K3197K3978K5069K6650K7710K7430K6280K5395K5353
50661B248195K5869K6280K5926K4524K2660K1400K1123K1159K1040K1348K2756
50650B502280K4912K7034K8990L1016L3017L5078L8079M2604M7520N0908N2300
50639B913738N3061N4545N6891N9460O1271O0988N7758N2485M7323M3507M0539
50628C501566L7766L5736L5339L6460L8361M0945M4726M9730N5073N9801O3836
50617C999339O7975P3044P9275Q6612R5428J06264J18694J31088J42074J51693
50607E051486J60344J67226J70883J70941J68069J62287J52757J39697J25285
$$ y = [2096187, 2062324, 2031894, 2005682, 1984344, 1967762, 1955645, 1948048, 1944881, 1945363, 1948552, 1954340, 1963611, 1977347, 1995588, 2017133, 2040330, 2064308, 2089377, 2116027, 2143737, 2171167, 2197447, 2222842, 2248195, 2274064, 2300344, 2326270, 2350794, 2373454, 2394854, 2415977, 2437136, 2458176, 2479524, 2502280, 2527192, 2554226, 2583216, 2614232, 2647249, 2682327, 2720406, 2763010, 2810530, 2861438, 2913738, 2966799, 3021344, 3078235, 3137695, 3198966, 3259954, 3317712, 3370197, 3417520, 3461027, 3501566, 3539332, 3575068, 3610407, 3646867, 3685228, 3726173, 3770899, 3820629, 3875702, 3935503, 3999339, 4067314, 4140358, 4219633, 4306245, 4401673, 4507937, 4626631, 4757719, 4899793, 5051486, 5211830, 5379056, 5549939, 5720880, 5888949, 6051236, 6203993, 6343690, 6468975]
50598F468975J12020J00765R0888Q1440P1630O0775M8627L5455K1518O775q680
50587G090188k4342l9591n3672o5261p2983p6635p7175p5126p0003o1904n2589
50576F420907m4055l6704k9937k3859j9239j6258j4582j4493j6657k0683k5159
50565F159281k9423l4173l9651m4333m6625m7530n0493n8077o9215p9916q6386
50554E573459q7210q3108p5581o6186n6383m7039l8067k9160k0953j4906j1932
50543E042934j1816j4179j9223k7142l7491m9563o2710p5663q6352r3519r8183
50532D467093j02467j07039j10485j11078j08268j02578r5197q7812q1709p6316
50522C484144o9601o0617n0985m3015l6804l0338k2382j4089p343k266K694Q615
$$ y = [6468975, 6580995, 6681760, 6772648, 6854088, 6925718, 6986493, 7035120, 7070575, 7092093, 7098868, 7090188, 7065846, 7026255, 6972583, 6907322, 6834339, 6757704, 6680529, 6605403, 6535400, 6473496, 6420907, 6376852, 6340148, 6310211, 6286352, 6267113, 6250855, 6236273, 6221780, 6205123, 6184440, 6159281, 6129858, 6095685, 6056034, 6011701, 5965076, 5917546, 5867053, 5808976, 5739761, 5659845, 5573459, 5486249, 5403141, 5327560, 5261374, 5204991, 5157952, 5119885, 5090725, 5069772, 5054866, 5042934, 5031118, 5016939, 4997716, 4970574, 4933083, 4883520, 4820810, 4745147, 4658795, 4565276, 4467093, 4364626, 4257587, 4147102, 4036024, 3927756, 3825178, 3729981, 3642169, 3560460, 3484144, 3414543, 3353926, 3302941, 3259926, 3223122, 3192784, 3170402, 3156313, 3148970, 3146704, 3149398, 3158013]
50510C158013J4860K0145K4051K7076K9706L2163L4777L7931M1587M5508M9978
50499C515795N5617O2317O9190P5922Q3393R2262J01815J11085J20497J31129
50489D419022J42551J52627J59616J63441J64775J63928J61137J57049J52348
50480E836494J47506J43364J41169J41375J42823J43794J43542J42348J40577
50471G122992J38366J36051J34175J32875J31804J30682J29820J30038J32090
50462H318893J35783J39597J41554J40776J37742J32911J25675J15049J00637
50453I488617Q2282N9527L2508K917k7132n7086q7566j17976j45816j68801j86591
50442H874883j99669k07641k09713k06137j97989j85655j68773j47837j24842
$$ y = [3158013, 3172873, 3193018, 3217069, 3244145, 3273851, 3306014, 3340791, 3378722, 3420309, 3465817, 3515795, 3571412, 3633729, 3702919, 3778841, 3862234, 3954496, 4056311, 4167396, 4287893, 4419022, 4561573, 4714200, 4873816, 5037257, 5202032, 5365960, 5527097, 5684146, 5836494, 5984000, 6127364, 6268533, 6409908, 6552731, 6696525, 6840067, 6982415, 7122992, 7261358, 7397409, 7531584, 7664459, 7796263, 7926945, 8056765, 8186803, 8318893, 8454676, 8594273, 8735827, 8876603, 9014345, 9147256, 9272931, 9387980, 9488617, 9570899, 9630426, 9662934, 9665851, 9638719, 9581633, 9494067, 9376091, 9230275, 9061474, 8874883, 8675214, 8467573, 8257860, 8051723, 7853734, 7668079, 7499306, 7351469, 7226627]
50433G226627j01806p9291n7077l6068j8693p294k584m102j1720k5835m5861o9328
50421F766968r3229j16045j37682j57530j73610j84197j89740j92502j94300j95039
50411E133094j93466j89056j82902j76651j70558j63062j52764j40626j29423
50402C634586j20838j13873j06511r8089q9382q0983p2781o4783n7493n1164m5426
50391B733263l9869l4542k9592k4839j9976j4967j0201o391m083k842j097K367
50379B547231O776J0092J1763J3790J8326K4783L0393L3524L5427L8404M3079
50368B813588M8204N2732N7180O2608O8835P4313P7833P9809Q1619Q3931Q6227
50357C586879Q7913Q9319R1371R4543R8557J02965J07587J12228J16259J18800
$$ y = [7226627, 7124821, 7045530, 6988453, 6952385, 6933692, 6926398, 6923814, 6919712, 6907992, 6882157, 6836296, 6766968, 6673739, 6557694, 6420012, 6262482, 6088872, 5904675, 5714935, 5522433, 5328133, 5133094, 4939628, 4750572, 4567670, 4391019, 4220461, 4057399, 3904635, 3764009, 3634586, 3513748, 3399875, 3293364, 3195275, 3105893, 3024910, 2952129, 2887346, 2829853, 2778689, 2733263, 2693394, 2658852, 2629260, 2604421, 2584445, 2569478, 2559277, 2552886, 2548803, 2545961, 2544864, 2547231, 2554007, 2564099, 2575862, 2589652, 2607978, 2632761, 2663154, 2696678, 2732105, 2770509, 2813588, 2861792, 2914524, 2971704, 3034312, 3103147, 3177460, 3255293, 3335102, 3416721, 3500652, 3586879, 3674792, 3764111, 3855482, 3950025, 4048582, 4151547, 4259134, 4371362, 4487621, 4606421]
50347D606421J19343J18059J15376J11520J06594J00837R4382Q6836P7626O6865
50337E603859N5263M2876K8527J1191q454k8545m7934o6718q5022j02057j16650
50326E286336j27854j34747j36421j32931j25831j17104j07704r7449q5979p3361
50316D146955o0185m7579l7011k9343k4077k0069j7146j6540j9657k6593l6061
50305C812694m6338n6149o4932p2631p9363q5060q9369r1900r2604r1842r0041
50294B952465q7367q3944q0351p7497p5644p3894p1113o7216o2980n8741n4126
50283B159592m9253m5203m2656m0652l7696l3808l0638k9376k9196k8069k4836
50272A768209k0305j6443j4585j4391j4504j4004j2891j1331r256p029n620n378
$$ y = [4606421, 4725764, 4843823, 4959199, 5070719, 5177313, 5278150, 5372532, 5459368, 5536994, 5603859, 5659122, 5701998, 5730525, 5741716, 5733262, 5704717, 5656783, 5590065, 5505043, 5402986, 5286336, 5158482, 5023735, 4887314, 4754383, 4628552, 4511448, 4403744, 4306295, 4220316, 4146955, 4086770, 4039191, 4002180, 3972837, 3948760, 3928691, 3911545, 3895005, 3875348, 3848755, 3812694, 3766356, 3710207, 3645275, 3572644, 3493281, 3408221, 3318852, 3226952, 3134348, 3042506, 2952465, 2865098, 2781154, 2700803, 2623306, 2547662, 2473768, 2402655, 2335439, 2272459, 2213718, 2159592, 2110339, 2065136, 2022480, 1981828, 1944132, 1910324, 1879686, 1850310, 1821114, 1793045, 1768209, 1747904, 1731461, 1716876, 1702485, 1687981, 1673977, 1661086, 1649755, 1640499, 1633470, 1627850, 1622472]
50260A622472n265m123k238n50J234M269Q333J1524J2840J3714J6032J9604K2769
50247A720615K4834K6672K9083L1666L3452L3851L2857L0975K8916K6810K3779
50236B043510J9030J3303Q324M727J578j679l879l834k471k044l357m978n428
50223B062802m991m629l956j491K912O652O108j58r957j9151k4682k6127k4869
50210A958463k2299j8990j5112j1051p475m933l424k343r19J070L095M502N134
50197A885718N256N155N134N595O584P535Q020Q559R845J1284J1429J0129R113
50184A989356R724J1088J1471J0788J0490J1332J2473J2937J3022J3854J6163
50173B122698J9676K3341K6099K7839K9584L2366L6182M0408M4896M9883N5246
$$ y = [1622472, 1617207, 1613084, 1610846, 1610296, 1611530, 1615799, 1624132, 1635656, 1648496, 1662210, 1678242, 1697846, 1720615, 1745449, 1772121, 1801204, 1832870, 1866322, 1900173, 1933030, 1964005, 1992921, 2019731, 2043510, 2062540, 2075843, 2084167, 2088894, 2090472, 2088793, 2084914, 2081080, 2078609, 2076565, 2073208, 2068230, 2062802, 2057811, 2053182, 2049226, 2047735, 2050647, 2057299, 2063407, 2063249, 2053292, 2034141, 2009459, 1983332, 1958463, 1936164, 1917174, 1902062, 1891011, 1883536, 1878603, 1875179, 1872836, 1871917, 1872987, 1876082, 1880584, 1885718, 1890974, 1896129, 1901263, 1906858, 1913442, 1920977, 1928997, 1937556, 1947401, 1958685, 1970114, 1980243, 1989356, 1999080, 2010168, 2021639, 2032427, 2042917, 2054249, 2066722, 2079659, 2092681, 2106535, 2122698, 2142374, 2165715, 2191814, 2219653, 2249237, 2281603, 2317785, 2358193, 2403089, 2452972, 2508218]
50162B508218O0756O6883P4235Q2288Q9816R6789J04631J14288J25010J35469
50152C458383J44851J52271J56169J55286J49555J39580J26089J10654R5880Q3731
50142D772449P4096O5687N7568M8880L7899K2783K947k1228m9427q0812j12725
50131D818117j41461j64428j80735j90042j92344j88940j82079j73048j61650
50122C243390j47954j33457j19900j07804r6862q7079p8911p2662o8131o4469
50112B266161o0311n4753m8434m2853l8510l4574l0642k7464k5206k2286j7412
50101A863716j1944q614q121q430p598n836m367l467k531j277J16J787M200P362
50087A814996J0608J3223J4900J5478J4768J2926J0772R410R339J0098J0801J1111
$$ y = [2508218, 2568974, 2635857, 2710092, 2792380, 2882196, 2978985, 3083616, 3197904, 3322914, 3458383, 3603234, 3755505, 3911674, 4066960, 4216515, 4356095, 4482184, 4592838, 4688718, 4772449, 4846545, 4912232, 4969800, 5018680, 5056579, 5079362, 5082309, 5061081, 5011654, 4930842, 4818117, 4676656, 4512228, 4331493, 4141451, 3949107, 3760167, 3578088, 3405040, 3243390, 3095436, 2961979, 2842079, 2734275, 2637413, 2550334, 2471423, 2398761, 2330630, 2266161, 2205850, 2151097, 2102663, 2059810, 2021300, 1986726, 1956084, 1928620, 1903414, 1881128, 1863716, 1851772, 1843158, 1835037, 1826607, 1819009, 1813173, 1808806, 1805339, 1802808, 1801531, 1801647, 1803434, 1807634, 1814996, 1825604, 1838827, 1853727, 1869205, 1883973, 1896899, 1907671, 1917081, 1926420, 1936518, 1947319, 1958430]
50075A958430J1654J3334J6188J9125K1126K2468K4280K6877K9255L0578L1439
50064B204754L2928L4957L6478L7159L7854L9309M1517M4553M8979N4700O0357
50053B673545O4719O8142P1810P6148Q0994Q6911R5008J05393J16762J27925J38992
50042C706349J50805J63902J78521J95010K13545K33354K52694K69740K83273
50033E647193K92210K94784K89051K75121K56487K38002K22206K08249J94392
50024G917695J80093J65056J47525J24899R5297N7558J0939m3323j00578j54858
50014H400303k02765k44139k79120l06368l24520l33778l35317l30294l20046
50005E723956l06157k89553k70413k49513k28645k09066j90454j72070j54191
$$ y = [1958430, 1970084, 1983418, 1999606, 2018731, 2039857, 2062325, 2086605, 2113482, 2142737, 2173315, 2204754, 2237682, 2272639, 2309117, 2346276, 2384130, 2423439, 2464956, 2509509, 2558488, 2613188, 2673545, 2738264, 2806406, 2878216, 2954364, 3035358, 3122269, 3217277, 3322670, 3439432, 3567357, 3706349, 3857154, 4021056, 4199577, 4394587, 4608132, 4841486, 5094180, 5363920, 5647193, 5939403, 6234187, 6523238, 6798359, 7054846, 7292848, 7515054, 7723303, 7917695, 8097788, 8262844, 8410369, 8535268, 8630565, 8688123, 8699062, 8655739, 8555161, 8400303, 8197538, 7953399, 7674279, 7367911, 7043391, 6709613, 6374296, 6044002, 5723956, 5417799, 5128246, 4857833, 4608320, 4379675, 4170609, 3980155, 3808085, 3653894]
$$ [...]
##END NTUPLES=NMR SPECTRUM
##END=
