
##TITLE=AC1002_Guinea_6278607_ac5B1C9jLt
##JCAMPDX= 6.0         $$ Bruker NMR JCAMP-DX V2.0
##DATA TYPE= NMR SPECTRUM
##DATA CLASS= NTUPLES
##ORIGIN= BRUKER
##OWNER= Administrator
$$ 1.72 TOPSPIN		Version 2.1
$$ 2012-06-03 10:47:09.781 -0500  Administrator@TOPSPIN
$$ Compression mode = diff/dup
##.OBSERVE FREQUENCY= 400.13188235
##.OBSERVE NUCLEUS= ^1H
##.ACQUISITION MODE= SIMULTANEOUS (DQD)
##.ACQUISITION SCHEME= undefined
##.AVERAGES= 64
##.DIGITISER RES= 22
##SPECTROMETER/DATA SYSTEM= spect
##.PULSE SEQUENCE= noesygpps1d.comp
##.SOLVENT NAME= COFFEE_meoh
##.SHIFT REFERENCE= INTERNAL, COFFEE_meoh, 1, 14.9671
##AUDIT TRAIL= $$ (NUMBER, WHEN, WHO, WHERE, PROCESS, VERSION, WHAT)
$$ ##TITLE= Audit trail, TOPSPIN		Version 2.1
$$ ##JCAMPDX= 5.01
$$ ##ORIGIN= Bruker BioSpin GmbH
$$ ##OWNER= Administrator
$$ $$ C:\Bruker\TOPSPIN/data/COFFEE/nmr/AC1002_Guinea_6278607_ac5B1C9jLt/12/pdata/1/auditp.txt
$$ ##AUDIT TRAIL=  $$ (NUMBER, WHEN, WHO, WHERE, PROCESS, VERSION, WHAT)
(   1,<2012-06-03 10:47:04.562 -0500>,<Administrator>,<TOPSPIN>,<go>,<TOPSPIN 2.1>,
      <created by zg
	started at 2012-06-03 10:35:34.343 -0500,
	POWCHK enabled, PULCHK disabled,
       configuration hash MD5:
       D5 CA 7A 23 FE 6B EE E2 50 67 74 61 24 F7 5E 3B
       data hash MD5: 64K
       BA E3 3C 37 75 6E F1 98 DB 8C A3 02 22 8C F1 EC>)
(   2,<2012-06-03 10:47:07.609 -0500>,<Administrator>,<TOPSPIN>,<proc1d>,<TOPSPIN 2.1>,
      <Start of raw data processing
       efp LB = 0.3 FT_mod = 6 PKNL = 1 PHC0 = 0 PHC1 = 0 SI = 128K 
       data hash MD5: 128K
       17 B2 79 BB 02 F1 E5 B7 28 01 48 5F 72 68 6D DA>)
(   3,<2012-06-03 10:47:08.734 -0500>,<Administrator>,<TOPSPIN>,<proc1d>,<TOPSPIN 2.1>,
      <pk PHC0 = 33.15125 PHC1 = 0 
       data hash MD5: 128K
       79 EB 0A 5F AC 69 D1 5D D0 1E 70 81 86 0D 41 A0>)
(   4,<2012-06-03 10:47:09.437 -0500>,<Administrator>,<TOPSPIN>,<proc1d>,<TOPSPIN 2.1>,
      <abs ABSG = 1 
       data hash MD5: 128K
       1E 11 61 E1 B9 0B 2E 03 E2 C3 DA 93 AB A9 C3 4F>)
(   5,<2012-06-03 10:47:09.515 -0500>,<Administrator>,<TOPSPIN>,<proc1d>,<TOPSPIN 2.1>,
      <abs ABSG = 2 
       data hash MD5: 128K
       5F D4 73 0A 25 78 48 AF A2 54 93 D1 F1 D4 DB A5>)
(   6,<2012-06-03 10:47:09.562 -0500>,<Administrator>,<TOPSPIN>,<proc1d>,<TOPSPIN 2.1>,
      <abs ABSG = 3 
       data hash MD5: 128K
       15 C1 2F B1 CE 10 74 EC F2 94 9A AD 35 E4 BE D2>)
(   7,<2012-06-03 10:47:09.625 -0500>,<Administrator>,<TOPSPIN>,<proc1d>,<TOPSPIN 2.1>,
      <abs ABSG = 4 
       data hash MD5: 128K
       1E 31 EA 9B 10 36 F8 21 D0 BD 0E 4C 99 94 23 65>)
(   8,<2012-06-03 10:47:09.687 -0500>,<Administrator>,<TOPSPIN>,<proc1d>,<TOPSPIN 2.1>,
      <abs ABSG = 5 
       data hash MD5: 128K
       62 41 D9 DF 03 97 9D 24 76 7F 79 4F 59 41 09 D8>)
$$ ##END=
$$ 
$$ $$ hash MD5
$$ $$ F1 D8 B0 A0 2E 94 FA 71 40 6C 52 53 30 D3 95 2F
##$RELAX= 
##$RELAX= 
##$RELAX= 
##$RELAX= 
##$RELAX= 
##$RELAX= 
##$RELAX= 
##$RELAX= 
$$ Bruker specific parameters
$$ [...]
##$TP07= 0
##$TPNAME0= <>
##$TPNAME1= <>
##$TPNAME2= <>
##$TPNAME3= <>
##$TPNAME4= <>
##$TPNAME5= <>
##$TPNAME6= <>
##$TPNAME7= <>
##$TPOAL= (0..7)
0.5 0.5 0.5 0.5 0.5 0.5 0.5 0.5
##$TPOFFS= (0..7)
0 0 0 0 0 0 0 0
##$TUNHIN= 0
##$TUNHOUT= 0
##$TUNXOUT= 0
##$USERA1= <user>
##$USERA2= <user>
##$USERA3= <user>
##$USERA4= <user>
##$USERA5= <user>
##$V9= 5
##$VALIST= <valist>
##$VCLIST= <CCCCCCCCCCCCCCC>
##$VD= 0
##$VDLIST= <DDDDDDDDDDDDDDD>
##$VPLIST= <PPPPPPPPPPPPPPP>
##$VTLIST= <TTTTTTTTTTTTTTT>
##$WBST= 2048
##$WBSW= 25
##$XGAIN= (0..3)
0 0 0 0
##$XL= 0
##$YL= 0
##$YMAX_a= 9787704
##$YMIN_a= -6254674
##$ZGOPTNS= <>
##$ZL1= 120
##$ZL2= 120
##$ZL3= 120
##$ZL4= 120
##$ABSF1= 14.9671
##$ABSF2= -5.58543
##$ABSG= 5
##$ABSL= 3
##$ALPHA= 0
##$AQORDER= 0
##$ASSFAC= 0
##$ASSFACI= 0
##$ASSFACX= 0
##$ASSWID= 0
##$AUNMP= <proc_prof1d_extract.lims>
##$AXLEFT= 0
##$AXNAME= <>
##$AXNUC= <1H>
##$AXRIGHT= 0
##$AXTYPE= 0
##$AXUNIT= <>
##$AZFE= 0.1
##$AZFW= 0.1
##$BCFW= 0
##$BC_mod= 0
##$BYTORDP= 0
##$COROFFS= 0
##$CY= 15
##$DATMOD= 1
##$DC= 0
##$DFILT= <>
##$DTYPP= 0
##$F1P= 0
##$F2P= 0
##$FCOR= 0.5
##$FTSIZE= 131072
##$FT_mod= 6
##$GAMMA= 0
##$GB= 0
##$INTBC= 1
##$INTSCL= 1
##$ISEN= 128
##$LB= 0.3
##$LEV0= 0
##$LPBIN= 0
##$MAXI= 10000
##$MC2= 0
##$MEAN= 0
##$ME_mod= 0
##$MI= 0
##$NCOEF= 0
##$NC_proc= -3
##$NLEV= 6
##$NOISF1= 0
##$NOISF2= 0
##$NSP= 0
##$NTH_PI= 0
##$NZP= 0
##$OFFSET= 14.9671
##$PC= 1
##$PHC0= 33.15125
##$PHC1= 0
##$PH_mod= 1
##$PKNL= yes
##$PPARMOD= 0
##$PPDIAG= 0
##$PPIPTYP= 0
##$PPMPNUM= 2147483647
##$PPRESOL= 1
##$PSCAL= 4
##$PSIGN= 0
##$PYNMP= <proc.py>
##$REVERSE= no
##$SF= 400.130005405713
##$SI= 131072
##$SIGF1= 0
##$SIGF2= 0
##$SINO= 400
##$SIOLD= 131072
##$SPECTYP= <>
##$SREGLST= <1H.CDCl3>
##$SSB= 0
##$STSI= 131072
##$STSR= 0
##$SW_p= 8223.68421052632
##$SYMM= 0
##$S_DEV= 0
##$TDeff= 65536
##$TDoff= 0
##$TI= <>
##$TILT= no
##$TM1= 0
##$TM2= 0
##$TOPLEV= 0
##$USERP1= <user>
##$USERP2= <user>
##$USERP3= <user>
##$USERP4= <user>
##$USERP5= <user>
##$WDW= 1
##$XDIM= 131072
##$YMAX_p= 451022814
##$YMIN_p= -303673564
##$CURPLOT= <Network HP LaserJet P1505>
##$CURPRIN= <$Network HP LaserJet P1505>
##$DFORMAT= <normdp>
##$LAYOUT= <+/1D_H.xwp>
##$LFORMAT= <normlp>
##$PFORMAT= <normpl>
##$SURQMSG= 1
$$ End of Bruker specific parameters
$$ ---------------------------------
##NTUPLES= NMR SPECTRUM
##VAR_NAME=  FREQUENCY,     SPECTRUM/REAL,   SPECTRUM/IMAG
##SYMBOL=    X,             R,               I
##VAR_TYPE=  INDEPENDENT,   DEPENDENT,       DEPENDENT
##VAR_FORM=  AFFN,          ASDF,            ASDF
##VAR_DIM=   131072,        131072,          131072
##UNITS=     HZ,            ARBITRARY UNITS, ARBITRARY UNITS
##FACTOR=    0.0627417313425165, 1,          1
##FIRST=     8223.62146879498, 4390,         -97994
##LAST=      0,             6395,            -97321
##MIN=       0,             -303673564,      0
##MAX=       8223.62146879498, 451022814,    0
$$ Real data points
##PAGE= N=1
##DATA TABLE= (X++(R..R)), XYDATA
$$ [...]
67357 91812 89501 88711 90136 92215 92348 89438 84739 80324 77316 75635 74853 74785 75395 76547 78053 79899
67341 79899 82177 84640 86523 87267 87425 88303 90336 92236 92307 90413 88116 86952 87168 88135 89295 90365
67325 90365 91103 91376 91287 90940 90219 89056 87743 86747 86304 86403 86929 87519 87418 86012 83722 82066 82517 85308
67307 85308 89423 93624 97209 99822 101023 100583 99099 97738 96998 96102 94148 91696 90568 91874 94744
67292 94744 97319 98583 98776 98426 97679 96625 95562 94625 93477 91717 89382 86877 84689 83438 83845 86140
67276 86140 89555 92871 95404 97073 97645 96826 95363 95147 97372 100929 103481 104017 103604 103632 104213 104587 104329
67259 104329 103605 102786 102386 103000 104600 106024 105838 103887 101630 100721 101402 102336 101944 99889 97329 95800
67243 95800 96015 97846 101030 105207 109333 111959 112522 111757 110396 108232 105212 102787 102895 105602 108732
67228 108732 110057 109125 106813 104054 101571 100131 100174 101277 102570 103803 105668 108873 112988 116438 117879
67213 117879 117638 117508 118923 121489 123461 123475 121654 119413 118572 120148 123370 126124 126984 126677 126916 128088
67197 128088 128879 128141 126245 124468 123841 124668 126315 127253 126137 123256 120247 118250 117163 116835 117743 119862
67181 119862 122077 123739 125864 129543 133784 136318 136376 135368 134737 134363 133502 132249 131220 130358 129035 127419
67165 127419 126991 128999 132414 134192 132209 127703 124081 123397 124863 126910 129414 133057 137413 140964 142825
67150 142825 143528 144028 144572 144505 142800 139034 134320 130843 129757 129847 129030 126955 125299 125664 128081 131492
67134 131492 134759 137120 138632 140416 143603 147724 150893 151965 151821 152127 153433 154995 155914 155839 154840 153183
67118 153183 151273 149646 149006 150062 152883 156429 159323 161210 162749 164149 164524 163276 161481 161049 162701
67103 162701 165418 167751 169050 169320 168656 167317 166105 166019 167232 168732 169366 169263 169729 171634 174366 176724
67087 176724 178300 179339 179706 179006 177747 177352 178564 180524 181958 182777 183947 186108 188931 191732 194174
67072 194174 196253 197924 199037 199676 200441 202000 204160 205644 205322 203565 201921 201434 201831 202421 203239 204985
67056 204985 208108 212162 215855 217864 218021 217672 218358 220197 222166 223887 226237 230021 234916 240026 244566
67041 244566 247587 248139 246567 244866 244817 246358 248547 251232 254502 257254 258103 257761 258890 263059 268987
67026 268987 274263 277767 279895 281543 283713 287199 291543 294926 296288 297144 300019 305148 310106 313041
67012 313041 314929 317788 321752 325291 327774 330173 333025 335252 335949 336329 338645 343562 349708 355659 361206
66997 361206 366508 371205 375039 378514 382156 385610 388269 390455 393184 396906 401204 405738 410724 416284
66983 416284 421960 427259 432252 437224 442018 446229 449960 453985 459046 465246 472172 479252 485774 490920
66969 490920 494415 497168 500740 505905 512132 518789 526266 535237 545098 554069 561107 567065 573595 581369
66955 581369 589715 597682 605058 612462 620643 629631 638595 646739 654136 661176 667467 672318 676594 682978
66941 682978 693388 706708 720025 731835 742999 754688 766609 777712 787777 797594 808013 819553
66929 819553 832728 847966 864821 881651 896618 909118 920193 931651 944977 960750 978316
66918 978316 995767 1011078 1024086 1037002 1052147 1069401 1086796 1103437 1120627 1139839 1160852
66907 1160852 1182549 1204481 1226727 1248970 1270759 1292219 1313636 1334829 1355848 1377833 1402055
66896 1402055 1428196 1454586 1480146 1505238 1530698 1556975 1584320 1612884 1642440 1672677 1703867
66885 1703867 1736434 1769826 1802778 1834980 1867600 1901742 1937117 1972736 2008174 2043593 2079222
66874 2079222 2115528 2153455 2193660 2235703 2278519 2321543 2364922 2408851 2453335 2498499 2544535
66863 2544535 2591198 2637765 2683802 2729751 2776615 2825107 2875140 2926117 2977542 3029311 3081485
66852 3081485 3134155 3187619 3242229 3297442 3351341 3402101 3450337 3499187 3551312 3606164 3660823
66841 3660823 3713138 3763098 3811259 3857224 3900365 3941078 3980090 4016855 4049960 4079293 4106647
66830 4106647 4133527 4159316 4182459 4202672 4220847 4237342 4251701 4263915 4274366 4282344 4286007 4284485
66818 4284485 4278787 4269926 4257372 4240289 4219276 4195745 4170413 4143448 4115195 4085468 4052912 4016550
66806 4016550 3977407 3937105 3895408 3850976 3804219 3757314 3711097 3663900 3614103 3562266 3509932
66795 3509932 3457734 3405517 3353181 3300543 3247317 3193891 3141122 3088822 3035652 2981243 2927171
66784 2927171 2874873 2823802 2772775 2722048 2672699 2624778 2577401 2530084 2482760 2435159 2387481
66773 2387481 2341102 2297187 2254957 2212768 2170558 2129707 2090598 2051978 2012996 1974395 1937121
66762 1937121 1900956 1865179 1829677 1794695 1760196 1726090 1692716 1660644 1630258 1601708 1574845
66751 1574845 1549004 1523243 1496941 1469943 1442252 1414126 1386371 1359910 1334973 1311252 1288744
66740 1288744 1267765 1248099 1228923 1209715 1190575 1171548 1152428 1133406 1115003 1096945 1077928
66729 1077928 1057185 1035793 1015794 998350 983143 969082 955031 940162 924361 908347 893014
66718 893014 878543 864307 849623 834534 820000 807212 796417 786425 775729 764183 753025 743046
66706 743046 733317 722264 709607 696728 685246 675619 667010 658168 648493 638483 629050 620363 611687
66693 611687 602539 593576 585754 578764 570918 560861 549148 537873 528844 522297 517387 513511 510662
66680 510662 508568 506210 502668 497983 492576 486303 478979 471566 465568 461021 456290 450431 444634 440430
66666 440430 437340 433517 428190 422258 416674 411587 407158 403966 401980 399998 396798 392375 387527 382723
66652 382723 377989 373514 369644 366323 363152 360069 357472 355390 352995 349329 344385 339064 334050 329184
66638 329184 324183 319569 316260 314297 312668 310617 308505 306820 304893 301532 296854 292574 290191 289571
66624 289571 289621 289675 289539 288832 287182 285031 283323 282212 280656 277706 273782 270341 268520 268271 268515 267899
66608 267899 265721 262504 259580 257829 256931 256027 254760 253287 251547 249213 246498 244366 243568 243636 243147 241092
66592 241092 237963 235438 234696 234885 233592 229284 222970 217014 212708 209852 208356 208727 210486 211497 209996
66577 209996 206630 203468 201498 200115 198668 197294 196262 195575 195337 195638 195934 195404 194069 192690 191416
66562 191416 189503 186790 184526 184042 185241 187025 188663 190056 190987 190897 189431 186946 184511 183387 183984
66547 183984 185169 185221 183773 182163 181512 181216 180072 178156 176646 176127 176017 175518 174403 173000 172066 172432
66531 172432 173904 174744 173187 169476 165511 162525 160153 157897 156283 155965 156578 157195 157321 156859 155689 153878
66515 153878 151784 149447 146493 143313 141560 142443 144907 146578 146383 145127 143614 141576 138966 137080 137226
66500 137226 138792 139638 138423 135797 133289 131759 131238 131707 133385 136209 139446 142043 143339 143462 143142
66485 143142 143139 143562 143499 141561 137374 132664 130304 131744 135588 139081 140726 140909 140409 139419 138237 137623 137605
66468 137605 136734 133779 129887 127747 128365 129744 129411 127424 125975 126469 128034 128986 128794 127946 126433 123376
66452 123376 118556 113663 111212 112053 114552 116484 117201 117382 117275 116351 114759 113995 115415 118590 121671 123028
66436 123028 122204 119877 117513 116591 117330 118376 118374 117530 116870 116351 114883 112326 110158 109559 109779 109259 107764
66419 107764 106443 106043 106025 105636 105125 105504 107333 110050 112473 113892 114661 115630 116971 117765 116960 114619 111974
66402 111974 110225 109476 108898 107814 106554 106241 107767 110833 113966 115590 115290 114101 113410 113464 113201 111781
66386 111781 109937 109199 109872 110641 110377 109457 108684 107829 106283 104590 104111 105291 107328 109449 111304 112150
66370 112150 111158 108982 107659 108155 109130 108990 108126 107985 108792 109466 109342 108731 108084 107703 108131 109737 111953
66353 111953 113817 115105 116016 116061 114587 112361 111153 111345 111328 109919 108080 107213 106761 105054 102149 100393
66337 100393 101816 105886 110230 112906 113430 112199 109789 106995 104895 104355 105449 107525 109627 110696 109808
66322 109808 106995 103801 102210 102632 103606 103819 103633 103999 104678 104635 103842 103501 104445 106289 108306 110251 112082
66305 112082 113523 114224 113942 112543 110293 107926 105686 102605 97793 92455 89323 89759 92536 95836 99143
66290 99143 102483 105209 106799 107992 109784 111747 112511 111656 110147 109038 108630 108632 108329 106932 104698 103430
66274 103430 104729 107907 110812 112688 114779 117774 120183 120261 118438 116590 115471 114223 112377 111003 111310
66259 111310 112924 114377 115067 115996 118356 121813 124549 124952 123038 120250 118055 116820 115953 114985 114287 114471
66243 114471 115205 115242 114042 112757 112829 113898 114200 113101 112027 112344 113342 113326 112029 110837 110866 111779 112604 112917
66225 112917 113026 113478 114561 115955 116909 117082 117123 118031 119989 122105 123175 122466 120151 117440 115964 116364
66209 116364 117644 118434 118673 119440 121332 123711 125503 126169 125939 125646 126215 127720 129116 129463 129042 128577 127880
66192 127880 126507 125383 126140 128506 129808 127869 123466 119321 117528 118422 120908 123140 123774 123362 123818
66177 123818 125879 128008 128545 127887 127410 127258 126717 126151 126766 128513 129815 129678 128749 127952 127367 127036 127608
66160 127608 129151 130163 128975 125962 123361 122769 123498 123680 122495 120876 120199 120862 122352 124174 126034
66145 126034 127116 126083 122426 117527 113745 112390 112906 113950 114851 115920 117630 119750 121467 122415 123235
66130 123235 124616 125956 125891 124351 123097 123616 125441 127357 129289 131624 133400 132967 130454 127945 126870
66115 126870 126670 126570 127138 129089 131628 133236 133442 132810 131708 130169 128659 127857 127654 127203 126105 124954
66099 124954 124730 126111 129243 133493 137398 139518 139636 138895 138738 139912 142157 144386 145406 145157 145105 146552
66083 146552 148558 148542 145379 141023 138392 138318 139446 140601 141970 143864 145480 145678 144482 143108 142573 142786
66067 142786 143008 142807 142384 142176 142352 142727 143099 143643 144792 146572 148144 148327 146749 144356 142668 142513 143459
66050 143459 144307 144071 142576 140290 137738 135319 133717 133921 136144 138939 140336 140145 140199 141645 142913 141476
66034 141476 137214 132645 129850 128537 127550 126906 127359 128900 130899 133217 135942 138337 139418 139760 141405
66019 141405 145261 149551 151734 151445 150509 150379 150729 150783 150828 151500 152226 151550 149177 146761 146175 147476 149100
66002 149100 149693 149155 148002 146439 144357 141938 139974 139522 141066 143846 146226 147154 147121 147262 147711 147559
65986 147559 146494 145626 146214 148208 150617 152834 154937 157030 159005 160912 162945 165076 167199 169563 172513
65971 172513 175695 178140 179400 180253 181992 185201 189362 193479 196901 199633 201931 203671 204364 203974 203336
65956 203336 203239 203348 202790 201745 201515 202648 203970 204229 203981 204753 206708 208460 209392 210908 214681 220530
65940 220530 226976 233343 240128 247340 253639 257642 259422 260157 260753 261325 261681 261706 261359 260707 259951 259054 257540
65923 257540 255150 252547 250778 249939 248930 246689 243272 239578 236436 234143 232396 230370 227273 223196
65909 223196 219201 216334 214870 214592 215231 216221 216587 215778 214404 213617 213925 215040 216557 218152 219351 219867
65893 219867 220122 220758 221620 221958 221704 221832 223226 225876 229437 233769 238474 242629 245773 248758 252781 257741
65877 257741 262244 265264 267120 268755 270687 272998 275839 279424 283712 288473 293513 298506 302743 305595
65863 305595 307380 309355 312453 316191 319179 320667 321279 322328 324695 328364 332605 336519 339760 342860
65849 342860 346516 350500 353751 355617 356364 356242 354912 352455 350105 348869 347935 345762 342578 340313 339772
65834 339772 339266 336729 331990 326046 319200 311384 303725 298135 295055 292699 288946 283273 276561 269729
65820 269729 263050 256360 249522 242964 237826 235045 234029 232870 230395 227447 225454 224228 222190 218637
65806 218637 214629 211322 208534 205661 203092 201593 200813 199789 198900 199903 203457 207717 210308 210982 211352
65791 211352 212480 213859 214721 215260 216266 218265 221302 224996 228479 230796 231774 232259 233257 235113 237569
65776 237569 240203 242618 244639 246599 249016 251736 253898 255119 256269 258497 261824 265417 269118 273898
65762 273898 280440 287769 293769 297033 297977 298180 298849 300000 300910 301108 300801 300510 300484 300411 299566 297349 293908
65745 293908 290199 287170 284894 282690 280068 277292 275031 273706 273148 272650 271421 269257 266677 264131 261398
65730 261398 258318 255818 255266 256777 259109 261556 264845 269524 274418 277773 279482 281080 283704 287049
65716 287049 290401 293778 297609 301765 305291 307006 306378 304058 301409 299059 295965 290389 281925 272200
65702 272200 263528 257284 253630 252147 252190 252866 253271 253008 252340 251796 251858 253190 256862 263682 273002 282661
65686 282661 290744 297293 303764 310910 317949 323831 328491 332446 335960 339219 342618 345991 347889 346510
65672 346510 341309 333123 322927 311276 298986 287490 277989 270485 263925 257180 249882 242451 235404
65659 235404 228747 222208 215922 210407 205843 202058 199378 198530 199079 198848 195942 190957 186214 183128 181289
65644 181289 179870 178777 178268 178350 178833 179519 180352 181699 184083 187057 189076 189476 189858 192068 195278 196903
65628 196903 196252 195287 195458 195901 195580 195240 195910 197123 198187 200019 203976 209685 215634 221369 227666 235025
65612 235025 243390 252933 263684 274711 285075 295259 306146 316867 325556 332401 340005 349995 360879
65599 360879 370152 377142 382607 386674 388747 388935 388266 387577 387216 387686 389453 391992 394031 395207 396729
65584 396729 399688 403094 404293 401404 394885 386691 378360 370177 361676 352276 341473 329092 315667
65571 315667 302206 289346 277080 265542 255469 247353 240505 233734 226817 220600 215544 210929 205831
65558 205831 200367 195454 191550 188145 184537 180840 177950 176515 176138 175842 175201 174620 174492 174616 174728 174982
65542 174982 175390 175292 174158 172651 172022 172567 173515 174404 175556 176987 177936 178072 178363 179918 182499 184862 186250
65525 186250 186892 187439 188717 191695 196774 203022 208957 214260 220037 227246 235663 244782 254835 266045
65511 266045 277454 287659 296810 306739 318543 330753 340675 347147 351034 353143 352830 349268 343213
65498 343213 336490 329932 322766 314171 304599 295086 285831 276079 265232 253602 242240 232442 225224
65485 225224 220570 217043 212845 207782 203799 202919 204792 206905 207228 205896 204038 201887 199063 196251 195193
65470 195193 196517 198585 199263 198252 196772 195292 192672 187840 181537 175896 172616 171884 172692 173727 174036
65455 174036 173348 171986 170413 168764 166808 164352 161666 159486 158537 158962 160224 161634 163000 164659 166932
65440 166932 169622 172122 173949 175083 175723 175773 174923 173448 172627 173711 176419 179041 180300 180531 180682 180920
65424 180920 180965 181277 182749 185281 187648 188980 189556 189914 190032 189770 189326 188733 187578 185832 184345 183805 183676
65407 183676 182869 181062 178627 175651 171963 167868 163947 160254 156775 154534 154901 157453 159901 160888 161616
65392 161616 163559 165765 166220 165333 165872 169061 172806 174927 176503 180145 185791 190344 191548 190406 189181
65377 189181 188645 188378 188546 189789 191808 193526 194718 196311 198788 201283 202667 202869 202666 202690 203038 203414
65361 203414 203256 202196 200727 199971 200330 200816 200318 199158 198707 199656 201452 203436 205670 208262 210563 211740
65345 211740 211937 212215 213283 214690 215585 215972 216804 218818 221679 224456 226599 228048 228694 228469 227998 228392
65329 228392 229913 231433 231830 231518 231798 232968 233999 234193 234165 234663 235215 234823 233679 233238 234461 236737 238891
65312 238891 240667 242648 245010 247132 248598 250031 252489 256272 260703 264969 268786 272299 275780 279523
65298 279523 283758 288579 294239 301443 310680 320962 329888 335636 338651 340806 343191 345252 345911 344699
65284 344699 341776 337575 332653 327391 321765 315949 310945 307653 305144 301032 294238 286458 280051 275310
65270 275310 270860 266027 261406 257309 253116 248388 243563 239266 235802 233363 231669 229302 224780 218731
65256 218731 213607 210437 207330 202487 197434 195306 196496 198018 197320 195016 193336 193418 194904 197037 199076
65241 199076 200290 200413 199746 198308 195567 191709 188529 188051 190422 193970 197184 199925 202778 206028 209368
65226 209368 212023 212965 211579 208383 204755 201843 199985 199151 199351 200321 201205 200998 199339 196775 194374 193106
65210 193106 193358 194734 196282 196989 196263 194268 192072 191200 192573 195700 199101 201577 202917 203522 203709 203494
65194 203494 202730 201277 199223 197045 195247 193685 191518 188181 184283 181200 179752 179532 179600 179508 179393 179312
65178 179312 178966 178241 177623 177690 178366 179046 179409 179614 179618 178930 177482 176277 176452 177722 178426 177395 175402 174286
65160 174286 174811 175891 176152 175856 176642 179285 182364 183710 182773 180832 179149 177995 177574 178617 181215 183996
65144 183996 185498 185844 186018 185998 184887 182805 181296 181497 182905 184297 184930 184405 182380 179273 176589 175751
65128 175751 176911 179488 183308 188319 193482 197024 198089 197550 196881 196623 196247 195284 194161 193843 194794 196506
65112 196506 198125 199310 200258 201080 201665 202132 202885 203972 204906 205455 206218 207908 210345 212670 214477 216285
65096 216285 218921 222794 227789 233471 239267 244754 250028 255687 262332 270093 278796 288494 299560 312059
65082 312059 325189 337780 349450 360853 372545 384076 394717 404663 414704 424782 433768 440901
65070 440901 446733 452204 457275 460875 461899 460013 455870 450804 445951 441376 436299 430154 422835 413833
65056 413833 402102 387455 371580 356982 345117 335863 328189 320658 311832 301197 289790 279317
65044 279317 270561 262936 255404 247448 239374 232132 226596 222633 219109 215217 211443 208740 207160 205960
65030 205960 204805 204111 204293 205249 206527 207548 207947 208113 209008 210859 212556 213136 213331 214598 216984 219233
65014 219233 220758 222135 223613 224637 225145 225788 226269 225019 221589 218101 216872 217392 217215 215511 214106
64999 214106 214815 217098 219114 220262 221659 224171 226817 227647 225986 223180 220984 219876 219457 219817 221270
64984 221270 222868 222600 219687 215770 213031 211807 210769 208928 206529 204278 202530 201235 200128 198950
64970 198950 197831 197325 197805 199089 200842 202859 204516 204528 201990 197386 192013 186798 182328 179495 178979
64955 178979 180127 181344 181836 182263 183506 185453 187242 188143 188046 187581 187941 190063 193806 198194 202460 206347
64939 206347 209562 211733 213090 214515 216681 219632 223197 226949 229697 230199 228956 228299 229853 232776 235378
64924 235378 237590 240386 243374 244793 244182 243468 244582 246994 248538 247927 245546 242285 238713 235355 232743
64909 232743 230744 228483 225390 222045 219559 218256 217361 215979 214016 212007 210356 209139 208518 208791 209722
64894 209722 210287 209628 208188 207228 207048 206302 203628 199610 196465 195845 197541 200340 203361 206042 207428 206556
64878 206556 203735 200787 199459 199766 200342 200311 200343 201682 204496 207489 209051 208552 206588 204321 202612 201532
64862 201532 200571 199404 198492 198735 200479 203079 205502 207057 207471 206688 205029 203309 202267 201950 202005 202507
64846 202507 203994 206687 210217 214257 218875 223902 228414 231417 232987 234325 236638 240195 244479 248979
64832 248979 253615 258474 263362 267826 271608 274775 277280 278733 279103 279394 280963 283983 287111 288883 288977
64817 288977 287880 285838 282680 278553 274364 271356 270075 269517 267626 263390 258463 255769 256175 257525 257464
64802 257464 256077 254729 253425 251010 247569 244716 243170 241539 238251 233668 229501 226829 225436 224557
64788 224557 223626 222489 221318 220109 218248 215141 211424 208848 208509 209790 211385 212654 213448 213432 212573 211754
64772 211754 211874 212487 212337 211251 210555 211476 213924 217059 220139 222357 222721 221187 219538 220119 223474 227964
64756 227964 231981 235725 240219 245273 249648 253217 257684 264468 272559 279394 283494 285471 286647 287639
64742 287639 288354 288498 287698 285728 282988 280404 278564 277308 276297 275487 274726 273316 270466 266151 261495
64727 261495 258366 258317 261225 264871 266556 265556 263638 263041 264426 266883 269150 270367 270334 269694 269588 270655
64711 270655 272688 275460 279293 284362 290087 295783 301364 306735 311092 313752 315393 317548 320927 324862
64697 324862 328272 330497 331433 331696 332606 335222 339243 343382 346749 349203 350484 349956 347544 344233 341194
64682 341194 338744 336282 332816 327435 319943 311469 304177 299884 298807 299560 300228 299599 297699 295255 292638
64667 292638 289616 286290 283648 282535 282368 281721 280197 278966 279342 281478 284625 288026 291288 294373 297565
64652 297565 301042 304288 306212 306057 303972 300769 297494 295096 293822 292777 290659 287141 283095 279366
64638 279366 275912 272360 268761 265486 262915 261527 261703 262985 264045 263894 262887 262164 262418 263475 264628
64623 264628 265057 264447 263616 264042 266181 268802 270707 272733 277051 284562 293848 302758 310124 315678 319292
64608 319292 321160 322277 323772 325677 326859 326290 323957 320465 316281 311746 307416 303816 300900 298250
64594 298250 295950 294888 295903 298704 301783 303375 302698 300491 298312 297114 296696 296857 298600 303277 310552
64579 310552 318248 324556 329519 334040 338596 343598 349739 356779 362967 367062 370164 373914 377485 378341
64565 378341 375915 372504 370139 368402 365970 362598 358549 353510 347336 340907 335127 329828 324602 319907
64551 319907 316318 313413 310370 307106 303899 300530 296801 293384 291126 289913 289052 288307 287713 286978 286042
64536 286042 285628 286092 286291 284918 282624 281524 282834 286278 291556 298660 306611 313599 319158 324974 332734
64521 332734 342042 351137 358961 365795 372412 379257 386156 392397 397295 400807 403332 404959 405472 404972 403691
64506 403691 401059 395943 388264 379580 371559 364455 357560 350553 343818 337838 332838 328707 324879 320636
64492 320636 315853 311182 307226 303978 301284 299311 298129 297327 296489 295699 295195 294920 294828 295165 296002 296854 297201
64475 297201 297031 296477 295365 293588 291522 289582 287846 286616 286680 288198 289781 289735 288151 286865 287349 289360
64459 289360 291560 292659 291986 289911 287925 287451 288332 289248 289820 291249 294415 298383 301661 304177 307008
64444 307008 310674 314891 319679 325451 331901 337976 343339 348770 354540 359413 362177 363437 364628 365617
64430 365617 364657 360992 356308 352963 351461 350404 348373 345192 341686 339041 338298 339720 342425 345009 346599
64415 346599 346972 345973 343591 340740 339061 339393 340847 341975 342543 343590 345811 348499 350376 351190 352148 354606
64399 354606 358413 361883 363680 364476 366177 369489 373024 375313 377105 380801 387724 396709 405523 413002
64385 413002 419521 425978 432917 440336 447841 455024 462176 470537 481443 495145 510871 528042 546865
64372 546865 567513 589485 612525 637815 667322 701799 740140 780973 824316 871350 923181
64361 923181 980352 1043098 1111306 1184317 1261269 1341506 1424097 1507078 1587771 1664040 1734851
64350 1734851 1799530 1856824 1904727 1940964 1963797 1972876 1969464 1955469 1932148 1899823 1858476 1808026
64338 1808026 1748379 1680060 1604870 1525221 1442833 1358963 1275848 1196620 1123154 1054940 990729
64327 990729 930412 874562 823148 775960 733661 697034 665297 636406 609177 584232 562726
64316 562726 545026 530683 518812 508148 497485 486509 475770 465727 456362 447759 440194 433304
64304 433304 425946 417555 409157 402444 398105 395481 393460 391182 388139 384290 380228 376881 374905 374378
64290 374378 374894 375755 376313 376519 377138 379150 382813 387286 390984 392276 390275 385499 379799 375270 372927
64275 372927 372359 372499 372597 372543 372613 373162 374433 376411 378726 380860 382605 384231 385953 387320 387519 386490 385406
64258 385406 385703 387733 390460 392257 391897 389293 385666 382577 380206 377024 371856 365808 361125 358348 355808
64243 355808 352067 347529 343218 339233 335298 331714 328668 325351 321061 316755 314240 313995 314869 315879 317101
64228 317101 318750 320591 322659 325510 329094 332158 333516 333538 333888 336077 340595 346922 353908 360519 366793
64213 366793 373786 382059 390390 396579 399523 400112 400142 400812 402284 404103 405680 406556 406596 405988 404983 403702
64197 403702 402295 401211 401032 401880 403132 403926 403867 402965 400983 397472 392760 388374 385808 385034 384779 384183
64181 384183 383550 383444 383809 384324 385025 386071 387270 388359 389617 391771 395328 400259 406300 413276 421090
64166 421090 429542 438296 447108 456229 466390 478066 490726 503201 514868 526060 537172 547813
64154 547813 557133 564575 570009 573510 575420 576339 576622 576055 574278 571177 566447 559213 548866 536243
64140 536243 523320 511545 500831 490322 479756 469869 461653 455464 450894 447409 444818 442909 440971
64127 440971 438482 436306 436266 439010 443104 446838 450050 453150 455152 454220 449927 443551 436094 427523 418280
64112 418280 409924 403309 397292 390348 382694 375737 370008 364805 359731 355586 353530 353753 354922 354808 352014
64097 352014 347580 344210 343165 342522 339594 334657 330896 330518 332228 333189 332470 331700 332808 336023 340087
64082 340087 343819 347192 350950 355231 358709 359443 356817 352395 348614 346706 346065 345543 344987 345317 347184
64067 347184 349907 351997 352609 352162 351668 352037 354086 358364 364265 369954 374159 377859 383199 390752 398812
64052 398812 405576 410917 415587 419822 423623 427564 432106 436508 439564 441248 442521 443545 443347 441651
64038 441651 439866 439474 440217 440766 440594 440243 440036 439560 438495 437072 435468 433317 430044 425238 418661 410491
64022 410491 401673 393389 385952 378895 372319 367190 363814 360986 357651 354636 353535 354277 355151 355153 354981 355502
64006 355502 356477 357311 358050 358953 359882 360731 361788 363113 364282 365399 367505 371055 374603 376201 375863 375597
63990 375597 376957 379543 382044 383862 385231 386346 387078 387542 388538 391021 394932 398807 401163 402275 403832
63975 403832 406558 409064 409717 408828 407979 407817 407727 407429 407626 408947 411335 414653 418901 423594 427893 431698
63959 431698 435773 440451 445024 448842 452171 455404 458120 459567 459594 458507 456463 453647 450777 448911 448778
63944 448778 450471 453435 456589 458947 460562 462564 465980 470734 475930 480681 484526 487687 491302 496779
63930 496779 504369 512780 520691 528249 536615 546494 557786 570322 584144 599017 614293 629485 644833
63917 644833 661350 680358 702606 727499 753447 779304 805290 832278 860510 889503 919070
63906 919070 950055 983976 1021953 1063862 1108553 1155204 1204344 1257193 1314257 1375452 1441505
63895 1441505 1514003 1593655 1679781 1772396 1873837 1987243 2114136 2254631 2409464 2580574
63885 2580574 2769964 2979116 3209311 3461424 3735323 4030310 4345829 4680694 5031728
63876 5031728 5394316 5764210 6137522 6508691 6869758 7212237 7528944 7813681 8060315
63867 8060315 8263179 8418096 8522545 8575125 8575055 8521729 8414580 8253990 8042730 7786260
63857 7786260 7491595 7166313 6818378 6455684 6084973 5711515 5340054 4975585 4622906
63848 4622906 4285918 3967485 3669417 3392362 3136406 2902077 2690176 2500398 2330725
63839 2330725 2178451 2041209 1917028 1804588 1703964 1615968 1539788 1471938 1408525 1348126
63829 1348126 1291657 1240006 1192772 1149032 1108227 1070187 1035015 1003069 974593 949349 926958
63818 926958 907416 890856 877007 865384 855792 848224 842521 838675 837199 838547 842332 847807 855047
63805 855047 864891 877634 892408 908261 925495 945560 969517 996610 1024423 1050701 1074992 1098165
63793 1098165 1120435 1140704 1158158 1173550 1188091 1201667 1213028 1221238 1225970 1226808 1223443 1216416
63781 1216416 1206555 1193691 1177035 1156891 1134758 1111376 1085865 1057360 1026473 994320 961064
63770 961064 926527 891780 858893 828896 800662 772185 742754 713750 687277 663982 642348
63759 642348 620436 598204 577584 560175 545552 532192 519412 507714 497512 488297 479175 469796
63747 469796 460496 451724 443573 435991 429263 423895 419764 415844 411310 406656 402942 400065 396667 391989
63733 391989 386851 382402 378757 375480 372601 370282 368114 365635 363130 360951 358444 354672 350133 346607
63719 346607 345117 344899 344626 343702 342077 339771 337252 335542 335030 334544 332418 328500 324547 322600 323286 325651
63703 325651 328170 329798 330348 330184 329723 329298 329279 329871 330649 330701 329572 327866 326611 326301 326831 328023 329656
63686 329656 331239 332403 333535 335392 338032 340783 343441 346768 351390 356872 362419 367861 373154 377479
63672 377479 380012 381557 384207 388973 394664 399645 404008 409301 416716 426240 437181 448609 459425
63659 459425 468843 476914 483987 489664 492959 493664 492855 491787 490716 489111 486534 483014 478917 474828 471285
63644 471285 468340 465605 462982 461050 460435 461076 462378 463872 465393 466881 468378 470113 472294 474931 478103
63629 478103 482218 487611 493852 499759 504222 507033 508981 511168 514039 517085 519653 521948 524748 528116
63615 528116 531053 532782 533752 534974 536996 540170 545248 552569 560829 567751 572166 574619 575826 575485 573095
63600 573095 569096 564491 559757 554827 549875 545370 541221 536432 529989 522055 514078 507597 503028 499712
63586 499712 496982 494733 492860 490861 488610 487075 487468 489797 493042 496749 501606 508300 516631 526049
63572 526049 536251 546836 557133 566970 577046 587991 599600 611556 624328 638640 654607 672286
63560 672286 692627 716671 743768 771756 799317 827415 857889 891194 926107 961411 997306
63549 997306 1035105 1075808 1119078 1163441 1207139 1248485 1285573 1316342 1339536 1355422 1365125 1369464
63537 1369464 1368903 1364434 1357680 1349800 1340738 1329825 1316752 1301748 1285193 1267480 1249076 1230349
63525 1230349 1211292 1191788 1172183 1153359 1136040 1120231 1105622 1092497 1081749 1073854 1068343 1064829
63513 1064829 1064138 1067496 1074593 1083438 1092526 1102306 1113891 1127122 1140839 1154603 1169106 1184920 1201664
63500 1201664 1218551 1235164 1251660 1268727 1287372 1308245 1331051 1354989 1379746 1405861 1434460
63489 1434460 1466999 1504688 1547306 1592867 1639167 1685190 1729870 1770003 1801096 1820770 1830177
63478 1830177 1831961 1828209 1820753 1811558 1801497 1789817 1776016 1761277 1746694 1730918 1711169 1686391
63466 1686391 1658005 1627620 1595398 1560882 1524324 1486572 1448365 1410175 1372399 1335460 1299929
63455 1299929 1266537 1235762 1207559 1181778 1158539 1137735 1118600 1100501 1083834 1069305 1056554
63444 1056554 1044518 1033149 1023681 1016776 1011221 1004913 996729 987249 978114 970808 965375 960124 953212
63431 953212 944732 936602 930289 925515 921612 919072 918756 920135 921450 921699 921768 923502 928026 934873 942200
63416 942200 947882 950916 952029 952742 953733 954256 952980 949097 942612 933989 923850 912865 901617 890297
63402 890297 878562 865940 852667 840058 829670 821922 815699 809485 802773 796301 791102 787642 785908
63389 785908 786059 788624 793866 801222 809909 820131 833012 848922 866475 884089 902122 922352 945398
63376 945398 970015 995489 1023414 1055829 1092200 1129489 1165007 1198073 1228828 1256751 1281207
63365 1281207 1302913 1324001 1346522 1371224 1397899 1426755 1459127 1496534 1538963 1584469 1630690
63354 1630690 1676309 1720453 1761096 1795169 1820529 1837108 1845844 1847403 1842602 1833281 1821569 1808316
63342 1808316 1793066 1775520 1756100 1734918 1711158 1684102 1654177 1622432 1589487 1555752 1522335
63331 1522335 1490867 1462300 1436366 1412308 1389686 1368574 1349574 1333725 1321855 1313800 1308636 1305701
63319 1305701 1304855 1305731 1307570 1310268 1314885 1322542 1333295 1346759 1363305 1383712 1407694 1433615 1459875
63306 1459875 1485976 1512094 1538261 1564536 1591739 1621396 1654641 1691207 1729796 1769608 1811222
63295 1811222 1855466 1901479 1946465 1987468 2022776 2051481 2072673 2085877 2091716 2091289 2085157 2073577
63283 2073577 2057380 2037898 2016295 1993521 1970284 1946119 1919029 1887372 1852053 1815694 1779626
63272 1779626 1742840 1704013 1663358 1622317 1582626 1546057 1513841 1485650 1460079 1436633 1416430
63261 1416430 1400520 1388431 1378754 1370008 1360438 1348248 1332990 1315792 1297471 1277557 1256127 1235197
63249 1235197 1216754 1200247 1183664 1166467 1149819 1134326 1119366 1104692 1090987 1078433 1066071
63238 1066071 1053055 1039472 1025599 1011449 997521 984946 974224 964471 954504 944171 934208 925361
63226 925361 917933 911625 905346 897744 888534 879075 871266 865903 862102 857999 851955 843547 833631 823264
63212 823264 812609 801138 788613 775330 761673 748255 736457 727698 721726 716416 709797 701829
63200 701829 693802 686543 679800 673041 666364 660632 656782 654788 653325 650998 647836 644899 642354 638973
63186 638973 634026 628712 624792 622391 620110 617036 613669 610944 609161 608010 606977 605616 604057 603388
63172 603388 604879 608367 611828 613058 611617 608811 606038 603779 602211 601940 603410 605829 607588 607994 607977
63157 607977 608694 609981 610787 610736 610493 610813 612056 614604 618809 624212 629595 634258 638640 643290 647868 651869
63141 651869 655892 661336 668889 677887 687205 696275 705101 713701 721907 729704 737583 746310 756227 766953
63127 766953 778075 789959 803440 818682 834854 851034 866951 882713 898385 914164 930402
63116 930402 946987 963163 978477 993514 1009080 1024850 1039450 1051790 1061870 1070420 1078148 1085211
63104 1085211 1090842 1093562 1092175 1086613 1077550 1065498 1050869 1034669 1018210 1001794 984398 965109
63092 965109 944621 924830 907140 891456 876810 862616 849172 836964 825763 814878 804396
63081 804396 795617 789628 785701 781856 777062 772144 768396 766189 765447 766573 769816 774064 777487 779613
63067 779613 781924 786058 792162 799438 807519 816396 825483 833841 841511 849699 859188 869082 877664 884261
63053 884261 889858 895970 903212 910903 917851 923593 928955 935279 943036 951475 959670 967478 975263 983208
63039 983208 991434 1000364 1010286 1020662 1030539 1039632 1048420 1057136 1065296 1072445 1078797 1084751 1090050 1093809
63025 1093809 1095327 1094738 1092854 1090278 1086630 1080916 1072866 1063464 1053691 1043188 1031034 1017527 1004024
63012 1004024 990859 976706 960790 944825 931742 922772 916596 911211 905909 901428 898771 898175 898977
62999 898977 900254 901534 902896 904531 906487 908846 911838 915732 920883 927785 936628 946792 957277 967705
62985 967705 978384 989348 1000018 1009990 1019494 1028818 1037948 1046995 1056207 1065211 1073132 1080056 1087521
62972 1087521 1096682 1106553 1114887 1120409 1123499 1125184 1126270 1127065 1127078 1125188 1120930 1115423 1110445 1106793 1104161
62957 1104161 1102244 1101196 1101291 1102878 1106410 1111884 1118478 1125334 1132281 1139294 1146169 1153721 1164318 1179585
62943 1179585 1198090 1216972 1235553 1255493 1277553 1300425 1323300 1347437 1374013 1402025 1429616
62932 1429616 1456244 1482326 1507829 1532537 1556762 1580427 1602096 1620230 1634970 1647543 1658358
62921 1658358 1666798 1672326 1674396 1671530 1661965 1645455 1623416 1597201 1567245 1533935 1498261 1461278
62909 1461278 1423731 1386392 1349993 1314591 1279800 1245832 1213540 1183213 1154205 1126099 1099430
62898 1099430 1074804 1052071 1030828 1010949 991962 972669 952322 931779 912585 895127 878470
62887 878470 861798 845139 828732 812605 796962 782196 768230 754556 741322 729608 719996 711453
62875 711453 702488 693129 684831 678268 672087 664413 655217 646635 640951 638522 637661 636253 633358 629419
62861 629419 625372 621885 619375 618150 618108 618525 618642 618455 618530 619069 619632 619940 620487 622082 624921 628270 630932
62844 630932 632207 632794 634584 638861 644598 649423 652647 656477 663583 674180 686308 698316 709943
62831 709943 721372 732507 743295 753669 762894 769808 774009 776222 777389 778004 778273 777916 775741 770555
62817 770555 762908 754876 747543 739770 730278 719863 710314 701845 693023 682982 672431 662522 653900
62804 653900 646982 641823 637280 631458 623899 616561 611591 608523 604764 598865 592369 588001 586709 587135
62790 587135 587562 587508 587353 587343 587590 588522 590461 592791 594280 594389 593700 592887 591920 590632 589441 588910 588951 589057
62772 589057 589055 589104 589178 589171 589375 590172 591259 591829 591707 591725 592688 594387 595859 596273 595331 593221 590596 588389 587167
62753 587167 586667 586134 585132 583885 582924 582471 582128 581147 579233 577061 575629 574930 573702 570890 566968 563273
62737 563273 560392 557995 556095 555293 555428 555048 553050 550076 547383 545046 542579 540810 541348 543955 546192
62722 546192 546489 546085 546782 548133 548558 548449 550068 554266 559113 562374 564142 566313 570335 576077 582192
62707 582192 587107 590219 592542 595654 599726 603248 604858 604597 603111 600727 597978 596028 595558 595901 596084
62692 596084 596059 595869 594341 590009 583204 575980 569922 565065 561038 558014 556004 554079 550986 546192 540023
62677 540023 533258 527000 522521 520654 521269 523500 526499 529986 534154 539046 544022 548072 550867 553290
62663 553290 556664 561698 568342 576250 584927 593772 602498 611323 620305 628995 637423 646989 659371 674670
62649 674670 691608 709516 729050 750794 774314 799124 825706 854839 886547 920304 955739
62638 955739 992510 1029990 1067909 1107082 1148784 1193348 1239774 1286599 1332722 1377340 1419497
62627 1419497 1457881 1490971 1517339 1535940 1546243 1548256 1542443 1529440 1509708 1483727 1452662 1418241
62615 1418241 1381371 1341418 1297824 1252155 1207262 1164336 1122252 1080309 1040083 1003386 969466
62604 969466 935843 901590 868491 838980 813977 792719 773694 755534 737853 721499 707546
62593 707546 696063 686401 678331 671836 665864 658591 649508 640295 632966 627872 624147 621354 619668 618869
62579 618869 618249 617565 617268 617572 617904 617604 616780 616118 615994 615914 614797 611801 607143 602146 598262 595837 593815
62562 593815 590737 586042 580459 575212 570945 567511 564842 563753 565380 569577 574334 577260 577590 576328
62548 576328 574591 572480 569677 566477 563638 561601 560379 560043 560711 561994 562982 563034 562317 561432 560772 560390
62532 560390 560163 559877 559390 558910 558903 559485 560206 560768 561704 563864 567298 571096 574222 576028 576035 574105 571234 569465
62514 569465 570085 572013 572668 570619 566940 563786 562074 560914 559071 556454 554052 552659 551976 550976 549028
62499 549028 546632 545149 545823 548787 552666 555227 554902 551981 548251 545426 544182 544593 546696 550010 553114
62484 553114 554741 555363 556840 560282 564984 569711 574130 578373 582003 584426 585942 587410 589095 590883
62470 590883 593551 598594 606305 615046 623079 630444 638391 647717 658506 671006 685774 703018 722522
62457 722522 744051 767151 790799 814180 837825 863114 890551 919293 948411 977610 1006477
62446 1006477 1034172 1060573 1086787 1113577 1139864 1163614 1183770 1200393 1213414 1222443 1227861 1231033
62434 1231033 1233202 1234879 1236479 1238620 1241494 1244907 1249603 1257801 1271325 1289386 1309122 1328509 1348148
62421 1348148 1370094 1395513 1423709 1452652 1479751 1502507 1519425 1530633 1537120 1539267 1536478 1528231
62409 1528231 1514509 1494750 1467482 1432255 1391459 1348832 1306094 1262288 1216525 1169827 1123654
62398 1123654 1078188 1033397 990721 952096 917799 886788 858918 835245 815899 799136 783108
62387 783108 767655 753797 742278 733177 726256 720955 716305 711361 705697 699521 693693 689597 688295
62374 688295 689511 691751 693379 693117 689922 683673 676290 670828 668579 667767 665863 662393 658683 655724 653571
62359 653571 652334 652337 653242 654199 655168 657188 660938 665644 669754 672253 673207 673638 675061 678433 683051 686911
62343 686911 688713 689365 691071 695086 700786 706894 713128 720314 729032 738603 747648 755586 763275 772157
62329 772157 782985 795485 808943 822924 837562 853404 870901 889832 909356 928852 948652
62318 948652 969852 993553 1020367 1050250 1082352 1115200 1147613 1179613 1212222 1246338 1282143
62307 1282143 1319713 1359795 1403593 1451791 1504084 1559851 1619178 1682894 1751567 1824846 1902167
62296 1902167 1983666 2069530 2158328 2246794 2331809 2412011 2486826 2554481 2611890 2656537 2687792
62285 2687792 2706331 2712949 2708252 2692985 2668119 2634425 2592016 2540519 2480209 2413232 2343312 2273670
62273 2273670 2205323 2137652 2070264 2003824 1939463 1878151 1820447 1766042 1713688 1662413 1612782
62262 1612782 1566082 1522312 1480136 1438994 1399933 1363697 1329315 1295707 1263704 1235003 1209508
62251 1209508 1185090 1160034 1134648 1110397 1088537 1069834 1054585 1042346 1032264 1024046 1018002 1013858
62239 1013858 1010349 1006597 1003319 1001913 1002663 1004548 1006630 1008986 1012376 1017500 1024551 1033008 1041889 1050666
62225 1050666 1059836 1070154 1081508 1093251 1105564 1119462 1135165 1151450 1167375 1183844 1202458
62214 1202458 1223279 1244917 1266787 1290106 1316379 1346010 1378986 1416003 1457873 1504264 1554009
62203 1554009 1606576 1662425 1721964 1785089 1851957 1923388 1999882 2080702 2164437 2250009 2336459
62192 2336459 2422033 2504298 2581210 2651261 2712297 2760991 2794348 2811580 2814006 2803294 2780374
62181 2780374 2745921 2700985 2646767 2584305 2514847 2440096 2361590 2280158 2196524 2112330 2030009
62170 2030009 1951636 1878160 1809529 1745092 1684052 1626180 1572156 1522757 1477763 1436306 1398230
62159 1398230 1364238 1334414 1307415 1281698 1256948 1233756 1212442 1192921 1175386 1160290 1147718
62148 1147718 1137381 1129170 1123164 1119096 1116312 1114424 1113710 1114785 1118052 1123421 1130434 1138827 1149079 1162040
62134 1162040 1177746 1195073 1212994 1231802 1252584 1275939 1301778 1329869 1359651 1389944 1419933
62123 1419933 1450328 1482437 1516127 1549966 1583423 1617350 1651709 1684401 1713613 1740324 1767279
62112 1767279 1796368 1828474 1865074 1907915 1956887 2009959 2065753 2124794 2187469 2252170 2316682
62101 2316682 2380406 2443507 2504140 2558121 2601791 2634150 2655746 2666645 2666425 2655487 2635086 2606122
62089 2606122 2568796 2523628 2472077 2415846 2356192 2294232 2231237 2168008 2104535 2041167 1979936
62078 1979936 1923673 1873474 1827675 1783852 1741507 1702328 1668038 1638462 1611785 1586288 1561676
62067 1561676 1538938 1519232 1502937 1489528 1478199 1468619 1461155 1456284 1453783 1452802 1453070 1455630 1461672
62054 1461672 1470767 1481228 1492494 1506038 1522928 1541238 1557097 1568089 1574566 1577988 1579581 1580905
62042 1580905 1583991 1589510 1595535 1599236 1599451 1596704 1591278 1582712 1571408 1559503 1549375 1541796 1536283
62029 1536283 1532924 1533047 1537847 1547024 1559428 1574968 1595154 1621272 1652390 1685889 1719928 1754816
62017 1754816 1791764 1831037 1871908 1914064 1958269 2005504 2055811 2108201 2161469 2214898 2268121
62006 2268121 2320448 2370640 2417733 2462083 2505160 2547922 2589354 2626764 2657472 2680236 2695175
61995 2695175 2702496 2701445 2690726 2670106 2641294 2606794 2567922 2524227 2474649 2418781 2357258 2291818
61983 2291818 2225098 2159421 2095233 2031319 1967004 1903620 1843378 1787480 1736014 1689022 1646557
61972 1646557 1607780 1571011 1535076 1500287 1467951 1439092 1413578 1390300 1368382 1348215 1330730
61961 1330730 1315340 1299423 1280798 1260311 1240934 1224365 1209439 1193974 1177323 1160740 1145920
61950 1145920 1133640 1123580 1115142 1108347 1103737 1101313 1100233 1100175 1102353 1108066 1116459 1124992 1132252 1139026
61936 1139026 1146183 1152702 1156645 1157269 1155270 1151459 1146031 1138812 1129469 1117610 1103217 1086847 1069095
61923 1069095 1050227 1030719 1011660 994022 977857 962784 948829 936120 924061 911714 898989
61912 898989 886808 876177 867823 862583 860996 862113 863578 863648 862715 862266 862883 864063 865735 868791 873656
61897 873656 879269 884343 889385 896477 906973 920211 934895 950956 969311 990317 1013471 1038473
61885 1038473 1065723 1095726 1128859 1165740 1206879 1251736 1299053 1348468 1400723 1455810 1512156
61874 1512156 1568547 1625633 1684050 1741797 1795327 1843150 1886856 1928390 1967689 2003333 2034080
61863 2034080 2058961 2076948 2087543 2091377 2089647 2083384 2073633 2061793 2049384 2037825 2028665 2023313
61851 2023313 2022183 2024901 2031857 2044719 2064558 2090047 2118330 2147188 2175417 2201559 2223501 2239505
61839 2239505 2248799 2251052 2246012 2233845 2215249 2190968 2161554 2127647 2090137 2050084 2008833 1967928
61827 1967928 1928303 1889656 1851309 1813579 1777594 1743818 1711623 1680391 1650007 1620081 1589856
61816 1589856 1559588 1531091 1506008 1484197 1464623 1447183 1432632 1421252 1412902 1408182 1408130 1412506
61804 1412506 1419535 1427984 1438695 1453583 1473828 1499622 1530890 1567357 1608336 1653474 1703565 1759785
61792 1759785 1822053 1888981 1959686 2034773 2114857 2198547 2282649 2364393 2442971 2518708 2591041
61781 2591041 2657618 2715339 2762161 2797774 2822535 2836054 2837399 2826910 2807354 2782772 2756378
61770 2756378 2730070 2705748 2685972 2672735 2666147 2665036 2668602 2676677 2688375 2701253 2712155 2718561
61758 2718561 2718805 2711413 2694784 2667539 2629025 2579526 2520217 2452892 2379566 2302139 2222237 2141127
61746 2141127 2059803 1979388 1901500 1827811 1758982 1694218 1632234 1572684 1516510 1465034 1418895
61735 1418895 1377699 1340323 1305497 1272449 1241199 1212259 1186058 1162804 1142711 1125927 1111960
61724 1111960 1099444 1086849 1073593 1060438 1048885 1040189 1034684 1031593 1029364 1026548 1022772 1019016 1016770
61711 1016770 1016831 1018759 1021353 1023516 1024891 1026057 1028126 1031817 1036732 1041756 1046281 1050787 1056070 1062326
61697 1062326 1069388 1077443 1086830 1097053 1106576 1113870 1118344 1120177 1119670 1117070 1112756 1107201 1100694 1093195
61683 1093195 1084494 1074573 1063924 1053394 1043555 1034386 1025742 1017860 1010949 1004564 998041 991536 986016
61670 986016 982090 979407 977230 974993 972335 969532 968067 969623 973870 978190 980440 981228 982520 984734
61656 984734 986532 987101 987227 987867 988779 988965 987713 984799 980239 974233 967038 958672 948945 937852 925773
61641 925773 913354 901358 890299 879847 868979 857261 845725 835922 828395 822581 817629 812539
61629 812539 806076 797874 789530 783393 780205 778846 778179 777690 776342 772710 767189 762649 761665 763828 766653
61614 766653 768398 769016 768957 768202 766351 763048 758480 753862 750990 750848 752944 756189 759767 762893 764806
61599 764806 765734 767036 769545 772516 775033 777650 781536 786681 792147 797622 803537 810060 817243 825840
61585 825840 836562 848550 859927 869993 879724 889868 899785 908521 915850 921690 925407 926420 924995
61572 924995 921963 918073 913844 909453 904462 898249 891012 883883 877882 873285 869975 867591 865153 861595
61558 861595 857256 853970 852965 853278 852945 851116 848067 843595 836648 826821 815436 804610 795330 786516
61544 786516 775846 761605 744080 725382 707976 693331 681649 672244 663972 655726 647068 638339
61532 638339 630007 622060 614324 607118 601088 596295 591869 586971 582031 578577 577423 577243 575503 570996
61518 570996 564985 559587 555717 553180 552055 552710 554481 555557 554709 552375 549599 546577 542913 538813 535343
61503 535343 533568 533800 535489 537516 538853 539308 539643 540790 543021 545744 547788 547985 546121 543515 542079
61488 542079 542556 544145 545921 547779 549685 551084 551931 553459 556855 561749 567111 572999 579899 586641 591019
61473 591019 593061 595874 601918 609608 615133 617031 617349 618429 620196 621013 619749 616191 610527 603669 597546
61458 597546 593761 591972 590544 588828 587694 587611 587408 585758 583056 580810 579613 578825 578064 577875 578626 579676
61442 579676 580188 580248 580713 582253 584826 587725 589831 590261 589232 588080 588104 589568 592038 595197 598699 601587
61426 601587 602764 602299 601637 602067 603282 603885 603114 601570 600302 599688 599517 599735 600498 601560 602177 601942 601328
61409 601328 601080 601235 601179 600601 600000 600126 601096 602172 602357 601209 599085 596496 593365 589402 585405 583490
61393 583490 585241 589691 593878 595577 595077 594186 594219 595415 597841 601914 607712 614255 620159 625164 630514
61378 630514 637373 645206 652520 659139 666640 676029 685926 694034 699844 704847 710355 716261 721907 727062
61364 727062 731759 736025 740139 744528 749141 753554 757857 762687 768034 772687 775389 776103 775714 774816 773157
61349 773157 770011 764884 758027 750399 742910 735825 729180 723398 718832 714913 710693 706299 702973 701486
61335 701486 701225 700995 700010 698130 696054 695278 696641 698672 698741 696383 694255 695106 698967 704149 709703 715636
61319 715636 721672 727229 732216 736760 740592 743667 746871 751094 756120 761500 767898 776257 785952 795115
61305 795115 802676 808914 814073 817790 820137 822169 825004 829082 834472 841184 848995 857599 867064 877594
61291 877594 888850 900169 911499 923537 936937 951936 968625 986805 1005439 1022920 1038105
61280 1038105 1050765 1061141 1069611 1076691 1082835 1088182 1092820 1096891 1099905 1100429 1097315 1091033 1083079 1074331
61266 1074331 1064891 1055239 1046367 1038618 1031324 1023768 1015876 1007993 1000717 994869 990728 987316 983264 978357
61252 978357 973460 969141 965492 963170 963205 965542 969057 973351 979228 986836 994659 1001290 1007278 1014151 1022231
61237 1022231 1030291 1036936 1041489 1043719 1043465 1040633 1035400 1028596 1021764 1016233 1012036 1008326 1004932 1002602
61223 1002602 1001498 1000604 999327 998792 1000638 1005122 1011304 1018625 1027357 1037656 1049116 1061367 1074455
61210 1074455 1088470 1103160 1118078 1132898 1147592 1162518 1178348 1195665 1214437 1233825 1252659
61199 1252659 1270521 1288552 1308727 1331803 1356270 1379854 1401691 1422204 1441164 1457034 1468397
61188 1468397 1475015 1477143 1474790 1468173 1458049 1444887 1428267 1407818 1384457 1360160 1336622 1314381
61176 1314381 1293043 1272150 1251953 1233286 1216519 1201021 1186172 1172408 1160285 1148910 1136761
61165 1136761 1124231 1113941 1107964 1105841 1105755 1106390 1106873 1106176 1103841 1100617 1097434 1094189 1090369 1086237 1082596
61150 1082596 1079868 1078191 1077928 1079257 1081533 1083701 1085104 1085540 1085175 1084927 1086340 1090440 1097146 1106083 1117087
61135 1117087 1129433 1141760 1153863 1167695 1185371 1206721 1229899 1253728 1278039 1302027 1323867
61124 1323867 1342279 1357419 1369926 1379948 1387484 1393131 1398040 1403149 1408448 1412990 1415908 1417349 1417839
61111 1417839 1416888 1413352 1407527 1401496 1396499 1391090 1383054 1372276 1360342 1348024 1334595 1319300 1302171
61098 1302171 1283614 1264280 1245131 1226588 1208020 1189187 1171642 1157351 1146255 1136655 1127865 1120910
61086 1120910 1116567 1114215 1112905 1112178 1111369 1109317 1105372 1099791 1092661 1083211 1070701 1055566 1039438 1024383
61072 1024383 1011979 1002481 995028 989113 985414 984508 985586 987690 991555 998478 1007582 1016145 1023007 1029966
61058 1029966 1039285 1051338 1065362 1081101 1098654 1117732 1137968 1159303 1181440 1203658 1225649
61047 1225649 1247732 1269739 1290503 1309077 1325837 1341960 1358368 1375210 1391430 1404752 1413331
61036 1413331 1417867 1420800 1422858 1421820 1415631 1405390 1393863 1381988 1368428 1352120 1333723 1314609
61024 1314609 1295710 1277641 1261000 1245969 1232096 1218880 1206454 1195464 1186286 1178462 1171175 1164338
61012 1164338 1158880 1155672 1154580 1155068 1157203 1161219 1166452 1171765 1176947 1182665 1189174 1196278 1204567 1215362
60998 1215362 1229156 1245315 1263578 1284493 1308049 1333399 1360589 1390932 1424661 1459635 1493797
60987 1493797 1528025 1565259 1607465 1654594 1705897 1760852 1818928 1879559 1942636 2008763 2079154
60976 2079154 2155316 2238096 2326680 2419270 2515109 2615172 2720693 2832087 2949803 3075037
60966 3075037 3208772 3350963 3501360 3660369 3828554 4006269 4194344 4394086 4606081
60957 4606081 4830256 5067741 5321470 5594484 5889365 6210046 6562076 6949643 7374118
60948 7374118 7837302 8344951 8906342 9532731 10237805 11037062 11944419 12971768 14134165
60939 14134165 15452864 16951568 18655345 20598428 22827451 25388984 28318611 31648541
60931 31648541 35401000 39515526 43740688 47621620 50671670 52628546 53578104 53847893
60923 53847893 53801091 53722589 53820410 54207893 54800163 55246759 55051454 53837468 51543335
60914 51543335 48400225 44756391 40921288 37115014 33481324 30102662 27010474 24206071
60906 24206071 21683030 19433509 17443435 15692692 14160792 12827938 11671709 10667513
60898 10667513 9792732 9027893 8354905 7757680 7224706 6748474 6322075 5938059 5590202
60889 5590202 5274433 4988031 4729109 4496077 4285807 4092751 3911387 3739075 3575265
60880 3575265 3418998 3269046 3125530 2989131 2859176 2734625 2616419 2506440 2404331
60871 2404331 2307959 2217169 2134356 2060395 1992441 1927118 1864176 1805600 1752555 1704638 1660998
60860 1660998 1620593 1581958 1544118 1507571 1473445 1441877 1411901 1382622 1353790 1325380 1297303
60849 1297303 1269585 1242486 1216462 1192144 1170203 1151046 1134714 1120994 1109344 1098760 1088259
60838 1088259 1077623 1067371 1057830 1048569 1038770 1027915 1016118 1004124 992881 982733 973100 963296
60826 963296 953439 944124 935513 927426 920100 914079 909430 905823 903241 901737 900605 898916 896987 896213
60812 896213 897132 898753 900165 901629 903476 905147 906297 907934 911303 916278 921885 927879 934620 941740
60798 941740 948352 954673 962186 971660 981666 989558 993690 994574 994267 994701 996284 997966 998772 999023 999770
60783 999770 1001327 1002863 1003285 1002042 999333 996148 993868 993055 992729 991631 990115 989827 991401 993668 995637
60768 995637 998245 1003285 1011288 1021336 1032395 1043929 1055644 1067738 1081344 1097665 1116426 1135849
60756 1135849 1154345 1171599 1187871 1202972 1216312 1227429 1236097 1242309 1246382 1248694 1249025 1246534 1240602
60743 1240602 1231353 1219311 1205177 1190107 1175309 1160751 1145087 1127747 1110487 1095730 1083640
60732 1083640 1071962 1058804 1044462 1030223 1016552 1003178 990275 978650 968895 960800 953427 945491
60720 945491 935983 924905 913275 902126 891517 880742 869337 857740 847058 838206 830976 823845
60708 823845 815107 804508 793519 783735 775289 767170 758768 750512 742999 736065 729142 722328 716582 712453
60694 712453 708884 704013 697537 691613 688658 688575 689134 688935 688799 689905 691806 693187 693747 694230 694955 695318
60678 695318 694747 693427 692062 691341 691488 691849 691129 688527 684550 680406 677037 675122 675261 677125 678850 678494
60662 678494 676102 673347 671113 668622 665041 660691 656107 651162 645960 641633 639029 637053 633447 627202
60648 627202 619463 612184 606614 602948 600502 598000 594502 590571 588034 588029 589556 590523 590072 589284 589473 590440
60632 590440 590937 590441 589720 589591 589934 590398 591536 594396 599080 604348 608806 611976 614032 615121 615549 616436
60616 616436 619496 625661 633933 641839 647299 650198 652178 654945 658909 663362 667531 671183 674472 677577
60602 677577 680499 683096 685477 688454 693081 699269 705149 708563 709224 709007 710055 713040 717226 721628 725807
60587 725807 729844 733817 737264 739217 738887 736186 731379 724633 716442 708051 700561 693668 686234 678290
60573 678290 671470 666990 664012 660790 656925 653658 652086 651828 651557 650394 648549 646807 645652 645073 645093
60558 645093 646021 647864 649924 651670 653663 656747 660386 662904 663619 663738 664651 666345 668222 670553 674031
60543 674031 678421 682689 686216 688967 690808 691708 692604 694997 699293 704194 707930 709682 709735 708941 708339 708793
60527 708793 710493 712854 715069 716788 718408 720866 724975 730705 737226 743879 750781 758320 766638 776212
60513 776212 788235 803246 819537 834359 847242 861111 879381 902684 929190 957407 987335
60502 987335 1018914 1050628 1080321 1106860 1130265 1150358 1165951 1175608 1178944 1176944 1171214 1163202
60490 1163202 1154156 1145513 1138988 1136042 1137165 1141871 1149799 1161903 1180065 1205141 1235804 1269962 1307073
60477 1307073 1348441 1395538 1449025 1509299 1576426 1648680 1722022 1791948 1855414 1910444 1954850
60466 1954850 1986596 2005079 2011079 2005687 1990195 1966734 1937890 1905574 1871037 1835776 1801430 1768827
60454 1768827 1738158 1710256 1686659 1668233 1654691 1645826 1642270 1644617 1652635 1665918 1684730 1709740
60442 1709740 1741476 1780377 1826894 1881390 1944542 2017819 2102324 2196614 2296856 2400099 2506495
60431 2506495 2617005 2729320 2837302 2934574 3017961 3087660 3145206 3191903 3228847 3257994 3282943
60420 3282943 3308164 3336846 3369256 3403012 3434336 3458528 3469695 3461253 3427773 3367011 3280504
60409 3280504 3172270 3046711 2907646 2759222 2606881 2456328 2311481 2174286 2046450
60400 2046450 1929959 1825368 1730891 1644336 1565103 1493383 1428416 1368950 1314821 1266532 1223547
60389 1223547 1184479 1148934 1117699 1090915 1067418 1046173 1027008 1009516 992584 975790 960223
60378 960223 947071 936236 927063 919564 913899 909326 904663 899386 893371 886003 876609 865646 854517
60365 854517 844167 834561 825444 816785 808421 800142 792292 785554 779876 774316 768326 762602 758279 755822
60351 755822 755107 755950 757919 759984 761170 761426 761361 761329 761345 761747 763057 765079 766920 768182 769486 771427 773687
60334 773687 775671 777494 779657 782219 784945 787846 790795 793038 794104 794996 797273 800855 804028 805937
60320 805937 807815 810999 814961 818454 821688 825908 831120 835718 838610 840659 843629 848465 854975 862486
60306 862486 870217 877266 882895 887103 890921 895770 902016 908028 911358 911333 910032 910156 912483 916092 920383
60291 920383 925640 931833 938290 944872 952383 961384 971470 982112 993366 1005311 1017554 1029658 1041236
60278 1041236 1051175 1057825 1060823 1061929 1063039 1063901 1062878 1059655 1056070 1054214 1054599 1056263 1057818 1058101 1056558
60263 1056558 1053542 1049930 1045995 1040853 1033316 1023332 1012375 1002394 994532 988965 985781 985327 987339 990272
60249 990272 992530 994481 998566 1007190 1021184 1040491 1065303 1095705 1130808 1169019 1208761 1248199
60237 1248199 1284713 1315482 1338331 1351374 1352532 1340832 1318198 1288788 1256073 1221318 1184940
60226 1184940 1148175 1112718 1079550 1048911 1021036 996247 974528 955533 938914 924329 911348
60215 911348 899627 889025 879382 870422 862122 854816 848648 843256 838436 834840 833344 833726 834521 834433 833563
60200 833563 832946 833117 833553 833503 832984 832600 832516 832024 830272 827198 823520 819998 816862 813794 810234 805939 801541
60183 801541 798387 797404 798214 799712 801327 803234 805505 807822 810167 813089 816848 820870 824535 828106 832322
60168 832322 837311 842554 847886 853927 861196 869018 875590 879265 879931 879250 879473 881736 885305 888363 889582
60153 889582 889216 889024 891070 896135 903007 909478 914211 917543 920558 923823 927273 930788 934258 937211 939116
60138 939116 940345 942308 946070 950910 954767 956316 956315 956603 958021 959783 960815 961042 961054 961099 960953 960511 959882
60121 959882 959088 958216 957688 957800 958160 958307 958672 960025 961997 963313 963650 964029 964951 965560 965642 967069 971573
60104 971573 977799 982355 983740 983680 984402 986059 987356 987495 986706 985650 984997 985160 986006 987280 989560 994108
60088 994108 1001412 1010545 1020406 1031015 1043142 1057346 1073892 1092925 1113891 1135129 1154725 1171575
60076 1171575 1185249 1195387 1201911 1205363 1206262 1204439 1199724 1192894 1185137 1176913 1168231 1159764 1152520 1146476
60062 1146476 1140607 1134418 1128371 1122670 1116881 1111324 1107698 1107461 1110310 1115055 1121228 1128863 1137192 1144757
60048 1144757 1150937 1156604 1163181 1171525 1181654 1193004 1204900 1217179 1230325 1244634 1259351 1273071
60036 1273071 1284920 1294976 1303670 1311258 1317757 1322806 1325585 1325455 1322879 1319235 1315526 1311594 1306711 1300543
60022 1300543 1293388 1285884 1278704 1272248 1266384 1260622 1254596 1248087 1240609 1231458 1220417 1207990 1194638
60009 1194638 1180167 1164314 1147663 1131485 1116673 1103198 1090573 1078371 1066127 1053147 1038904
59998 1038904 1023667 1008401 993914 980346 967656 956247 946558 938232 930458 923363 918151 915228
59986 915228 912951 909307 904376 899964 896866 893947 890310 887025 885732 886385 887485 888101 888563 889296 890022
59971 890022 890343 890385 890349 889794 887826 884115 879565 875721 873305 871434 868606 864348 859435 854570 849680 844727
59955 844727 840349 836906 833575 829253 824104 819413 816118 814237 813676 814841 818156 823298 828961 833293
59941 833293 835061 834919 835171 837671 842184 847300 852399 857790 863326 868140 871786 874608 876880 878558 880005
59926 880005 881885 884178 886463 889481 894993 903231 911707 917777 921776 926395 933298 941502 949010 955005
59912 955005 960096 965075 969907 973909 976872 979815 984116 989750 994954 998072 999237 999814 1000785 1002421 1005008
59897 1005008 1008806 1013252 1017039 1019309 1020329 1020868 1021276 1021235 1020039 1017045 1012138 1005949 999568 994005 989793
59882 989793 986693 983673 979681 974777 970122 966557 963595 960191 955960 951224 946541 942939 941955 944330
59868 944330 948886 953577 957464 960820 963689 965703 967341 970059 974780 981203 988867 997747 1007469 1017155
59854 1017155 1026653 1036713 1047146 1056078 1062354 1067627 1074451 1082755 1089942 1094372 1097005 1099210 1100647
59841 1100647 1100372 1098797 1097078 1095018 1090991 1084170 1075908 1068469 1062918 1058624 1054511 1050311 1046690 1044483
59827 1044483 1043923 1044539 1045720 1047311 1049503 1052241 1055065 1057837 1061307 1066486 1073430 1081036 1088202 1094749
59813 1094749 1100956 1106596 1110913 1113411 1114250 1113909 1112849 1111540 1110403 1109549 1108750 1107780 1106643 1105478 1104329
59798 1104329 1102989 1100986 1098000 1094571 1092075 1091404 1091745 1091275 1089164 1086354 1084339 1083907 1085369 1089182 1095577
59783 1095577 1104016 1113773 1124863 1137617 1151319 1163984 1173776 1180283 1184200 1186243 1186834 1186693 1187101 1189010
59769 1189010 1191720 1192713 1189304 1180665 1168125 1153556 1137849 1121076 1103564 1086238 1070084 1055695
59757 1055695 1043202 1032164 1021644 1010959 1000498 991447 984586 979593 975467 971226 966152 959916 952738
59744 952738 945206 937738 930390 923200 916296 909534 902425 894673 886485 878181 869903 861962 854919 848809
59730 848809 842714 835725 828168 821264 815651 810911 806515 802540 799223 796478 794154 792221 790259 787216
59716 787216 782226 775582 768582 762601 758503 756576 756497 757446 758646 759771 760703 761265 761593 762455 764536 767572
59700 767572 770897 774784 780406 788130 796583 803896 809401 813729 817762 822146 827478 834066 841315 847877
59686 847877 852697 855789 858025 860376 863233 866100 867860 867707 866019 864159 863316 863608 864397 865276 866463
59671 866463 868148 869602 869336 866474 861880 857515 854599 852765 851161 849808 849426 850283 851855 853504 855027
59656 855027 856558 858375 860749 863503 865758 866782 867274 869238 874214 881925 890967 900439 910560 921945
59642 921945 934785 948712 963033 977010 990121 1002242 1013540 1024177 1034166 1043514 1052423 1061168
59630 1061168 1069617 1076966 1082227 1085129 1086280 1086340 1085431 1083747 1082286 1082171 1083242 1083967 1082975 1080211 1076500
59615 1076500 1072600 1068882 1065370 1061618 1057082 1052004 1047539 1044566 1042801 1041583 1041045 1041732 1043341 1044687
59601 1044687 1045067 1045016 1045668 1047856 1051907 1057565 1063849 1069646 1074941 1081050 1089123 1098610 1107613 1114542 1118925
59586 1118925 1120805 1120096 1116787 1111216 1103669 1094083 1082657 1070512 1058963 1047956 1035939 1021805 1006547
59573 1006547 992444 980937 971987 965172 960299 956634 952571 946891 939871 932531 925203 917531 909465
59560 909465 901304 892829 883329 872715 861898 851792 842522 833857 825815 818417 811360 804368 797544
59547 797544 791015 784680 778775 774308 772197 772038 772196 771204 768867 766198 764635 765025 766783 768111 767559
59532 767559 765380 762917 760898 759065 757407 756730 757504 758940 759873 760049 759817 758946 756684 752933 748627 744674
59516 744674 740971 736712 731483 725970 721695 719829 719980 720371 719613 718139 717458 718228 719609 720389 720013 718633
59500 718633 717039 716643 718539 722109 725292 726737 727062 727601 728829 730760 734007 739188 745621 751836 757490
59485 757490 763893 772431 783139 794965 806828 818387 830469 844913 863441 886282 912039 938518
59473 938518 963105 982694 994634 998497 996417 991248 984747 977671 970758 964843 960347 957301 955767
59460 955767 955753 956761 957823 958050 956985 954490 950489 944961 938163 930753 923323 915601 906409 894906 881764
59445 881764 868719 857155 847557 839964 834053 828848 823314 817529 812419 808074 803257 797110 790527 785134
59431 785134 781478 778922 776861 775387 775072 776609 780311 785466 790591 794778 798281 801381 803508 804347 805111
59416 805111 807474 811387 815069 817155 817872 818015 817817 817326 817154 818157 820550 823652 826416 828182 829054 829616
59400 829616 830248 830913 831728 833285 836065 839916 844605 850488 858021 866906 876405 886292 896702 907192
59386 907192 916817 925175 932585 939001 943419 944677 942465 937570 931538 925948 921259 916300 909617 901459
59372 901459 893721 887805 883349 879385 875926 873860 873917 876300 880844 886936 893657 900605 908394 917930 929497
59357 929497 943052 958998 977783 998715 1020114 1041364 1064410 1092174 1124712 1157019 1181238
59346 1181238 1191675 1188178 1175346 1159114 1143837 1131337 1121673 1115012 1113115 1118360 1130398 1144127
59334 1144127 1152037 1148858 1133831 1109512 1079971 1049927 1023517 1002388 985470 971145 959098 949733
59322 949733 942815 937518 933289 929947 927452 926180 926905 929777 933766 937863 942423 948458 955952 963870
59308 963870 971786 980460 990541 1001474 1012108 1021900 1031133 1040397 1050236 1060859 1071696 1081542 1089893
59295 1089893 1098205 1108978 1123118 1138766 1153582 1167840 1184165 1204128 1226335 1248472 1270000
59284 1270000 1291683 1313362 1333804 1352594 1370694 1388956 1407182 1424805 1441252 1455383 1465786
59273 1465786 1472228 1475908 1477926 1478376 1477093 1474002 1468331 1459013 1446798 1434553 1424164 1414241 1402244
59260 1402244 1387899 1372940 1358226 1343027 1327056 1311498 1297660 1285810 1275588 1266596 1258294 1250229
59248 1250229 1242597 1235933 1230213 1225003 1220567 1218029 1218323 1221537 1227155 1234212 1241434 1248336 1256284 1267513
59234 1267513 1282827 1301047 1320845 1342126 1365248 1389681 1413787 1435096 1450402 1456560 1452111 1438042
59222 1438042 1416725 1390556 1361743 1332484 1304543 1278860 1255921 1236115 1219432 1205378 1193792
59211 1193792 1185395 1180938 1179977 1181046 1182982 1185576 1188806 1191864 1193410 1192800 1190812 1188803 1187180 1184997
59197 1184997 1181095 1175086 1166973 1156550 1143964 1130451 1117590 1105833 1094536 1083307 1072442 1062000
59185 1062000 1051424 1040468 1029786 1020176 1011792 1004373 997751 991911 987048 983692 982186 981920 981778 981503
59171 981503 981945 983702 986332 989200 992238 995406 998189 1000210 1001575 1002160 1001377 999357 997536 997186 998016
59156 998016 999026 999967 1000883 1001083 1000188 999908 1002940 1009575 1016770 1021380 1023475 1025654 1029816 1035588 1041755
59141 1041755 1048144 1055577 1064322 1073348 1081463 1088855 1096882 1106236 1115972 1124719 1132263 1139324 1146363 1153536
59127 1153536 1161599 1171620 1183310 1194469 1202900 1208699 1214090 1220887 1228456 1234362 1236881 1236477 1234658
59114 1234658 1231884 1227486 1221616 1216091 1212483 1210117 1207104 1203107 1199897 1199034 1200151 1201948 1203926 1206390
59100 1206390 1209318 1212128 1214472 1216612 1218874 1221102 1222705 1223112 1222210 1220523 1218911 1217855 1216945 1215137 1211635
59085 1211635 1206622 1201213 1196636 1193244 1190235 1186330 1180868 1174396 1168394 1164303 1162369 1161233 1158988 1155082
59071 1155082 1150993 1148686 1148600 1149616 1150767 1152263 1154687 1157869 1161098 1164224 1168149 1174233 1183338 1195361
59057 1195361 1209511 1224970 1241178 1257544 1273262 1287829 1301592 1315355 1329547 1344186 1359462
59046 1359462 1375602 1392002 1407233 1420251 1431074 1439921 1446290 1449608 1450344 1449656 1447921 1444319 1438111
59033 1438111 1429870 1421187 1413423 1406929 1401193 1395363 1388695 1380833 1371891 1362107 1351238 1338404 1322916
59020 1322916 1305315 1287092 1268976 1249957 1228654 1205423 1182311 1160889 1140995 1121979 1104270
59009 1104270 1089010 1076598 1066228 1056629 1046844 1036638 1026674 1018004 1010984 1005086 1000009 996173 993316
58996 993316 989633 983718 976896 971954 969610 967957 965726 964136 964507 965746 965868 965042 965321 967723 971177
58981 971177 974340 977043 979751 982779 986395 990774 995501 999937 1004330 1009724 1016532 1024121 1032252 1041961
58967 1041961 1054276 1068697 1083776 1098815 1114367 1131364 1150364 1171383 1193783 1216252 1237277
58956 1237277 1255752 1271262 1284223 1295774 1306754 1316366 1322575 1324447 1323456 1321677 1319355 1315388 1309938
58943 1309938 1305188 1303229 1304059 1306006 1307444 1307831 1307636 1307564 1307452 1305907 1301476 1294128 1284956 1274443 1261878
58928 1261878 1246670 1229439 1211464 1193711 1176695 1160556 1144863 1129045 1113499 1099648 1088408
58917 1088408 1079295 1071618 1065801 1062743 1062349 1063516 1065211 1066920 1068531 1070627 1074478 1080694 1088032 1094466
58903 1094466 1099443 1104316 1110590 1118556 1127461 1136077 1142996 1147415 1149888 1151496 1152063 1150071 1144649 1136635
58889 1136635 1127270 1116969 1106130 1096089 1087923 1080746 1072484 1062335 1051587 1041983 1034198 1028135 1023840
58876 1023840 1021525 1020984 1021372 1021556 1020702 1018766 1016341 1013674 1009975 1004274 996998 989959 984418 979721 974391
58861 974391 968088 961783 956215 951068 945907 941168 937773 936118 935958 937033 939278 942437 945992 949644
58847 949644 953539 957857 962438 967062 971928 977641 984823 993874 1004915 1017686 1031480 1045328 1058309
58834 1058309 1069794 1079746 1089013 1099006 1110628 1123594 1137209 1151722 1168248 1187088 1206644 1224534
58822 1224534 1239653 1252680 1264597 1275285 1283969 1290734 1296871 1303358 1309360 1312804 1312510 1309367 1305301
58809 1305301 1301498 1297872 1293838 1289097 1283831 1278526 1273537 1268508 1262452 1254726 1245690 1235924 1225161 1212711
58795 1212711 1198708 1183970 1168552 1151486 1132404 1112617 1094020 1077460 1062650 1049058 1036294
58784 1036294 1024186 1013178 1004256 997753 992472 986561 979000 969879 959800 949750 941012 934164 928347
58771 928347 922432 916740 912620 910448 909113 907581 905849 904093 901932 899034 895653 892214 889043 886776
58757 886776 886052 886385 886327 885385 884796 885678 887353 888462 888930 889704 891161 892994 895182 897749 899755 899899 898259
58740 898259 896299 894956 893699 891747 889203 886546 883880 881226 879040 877959 878306 879992 882453 884719
58726 884719 886226 887771 891083 897240 905920 916097 926734 936876 946185 955604 966437 978339 989283
58713 989283 998019 1005392 1012372 1017983 1020520 1020075 1018418 1016604 1014023 1009808 1004112 997781 991600 986037
58699 986037 981068 976206 971146 966211 961654 956941 951659 946891 944494 944869 946477 947775 948627 949493 950383
58684 950383 951340 953144 956617 961750 968302 976863 988294 1002098 1016227 1029004 1040885 1053896 1069347
58671 1069347 1086388 1102946 1117751 1131035 1143304 1154158 1162881 1169708 1175711 1181463 1186496 1190189
58659 1190189 1192627 1194399 1196068 1198032 1200547 1203691 1207593 1212639 1218968 1225668 1230941 1233228 1231907 1227050
58645 1227050 1219150 1209014 1197134 1182949 1165491 1145010 1123147 1101121 1078571 1054840 1030663
58634 1030663 1007661 986479 966201 945522 923945 902074 881319 863265 848751 837397 828156
58623 828156 820172 812952 806082 799254 792436 785752 779364 773652 769166 766127 764378 764092 765962 770145
58609 770145 775445 780265 784213 788254 793438 800011 807571 815487 823144 830201 836664 842485 847353 851142
58595 851142 854139 856256 856391 853376 847452 840179 832936 826133 819802 814145 809308 805165 801506 797997
58581 797997 793946 788714 782559 776567 771574 767622 764543 762366 760765 758701 755301 750991 747342 745742
58567 745742 746278 747705 748320 747248 745339 744746 747142 752062 757075 759787 759791 758788 758978 761399 765592 770419
58551 770419 775012 779217 783513 788350 793263 796887 798374 798604 799320 801141 803319 805436 808150 811697 814838
58536 814838 816393 817181 819296 823787 829951 836574 842844 848263 852905 858008 865401 875952 888970 903061
58522 903061 917009 930133 942770 956354 971983 988675 1003975 1016562 1027448 1038305 1049603
58511 1049603 1060905 1072197 1084142 1097497 1112806 1130284 1149538 1169782 1190691 1212663 1235962
58500 1235962 1260198 1284974 1310394 1336395 1362112 1386629 1409836 1431661 1450697 1464516 1471648
58489 1471648 1472766 1469846 1464545 1457326 1447547 1434204 1417021 1397167 1376564 1356144 1334982 1311574
58477 1311574 1285873 1259552 1234097 1209256 1183902 1158019 1133034 1110229 1089740 1071361 1055323
58466 1055323 1041653 1029542 1018240 1008063 999677 992914 987364 983626 982548 983269 983454 981849 979346
58453 979346 977013 974406 970797 967101 965287 966135 968423 970209 970294 968610 965934 963382 961796 961340 961555
58438 961555 961609 960663 958528 956158 954988 955507 956877 958193 959744 962725 968116 975999 985551 995387 1004419
58423 1004419 1012812 1021862 1032698 1045400 1059509 1074801 1091206 1108398 1125929 1143484 1160593 1176310
58411 1176310 1189430 1198857 1203786 1204029 1200381 1194185 1186250 1176622 1165617 1154493 1144736 1137099 1131560
58398 1131560 1127684 1124669 1121648 1118488 1115983 1115031 1116059 1119370 1125155 1132588 1139595 1144287 1146230 1145913
58384 1145913 1143616 1139586 1134783 1130486 1127223 1124658 1122377 1120298 1118563 1117546 1117782 1119466 1122306 1126173
58370 1126173 1131429 1138073 1145150 1151702 1158060 1165480 1174743 1185656 1197649 1210205 1222836 1235223 1247335
58357 1247335 1259073 1269999 1279612 1287419 1292429 1293293 1289652 1282887 1274833 1266274 1257344 1248690 1241116 1234453
58343 1234453 1227968 1221905 1217558 1215749 1216031 1217472 1219567 1222439 1226841 1233832 1243599 1254600 1264686 1273079
58329 1273079 1280402 1286749 1290797 1291273 1288588 1284585 1281092 1278878 1277453 1275635 1272790 1269729 1267970 1268113
58315 1268113 1269593 1272166 1276859 1284869 1295876 1307912 1318792 1327625 1335306 1343810 1354623 1367450 1380508
58302 1380508 1392220 1402570 1412800 1424086 1436762 1450605 1465456 1481271 1497633 1513563 1528167
58291 1528167 1541393 1553871 1565959 1577328 1587542 1596713 1605506 1614888 1625869 1638836 1652880 1666444
58279 1666444 1679146 1692489 1708355 1727258 1748502 1771451 1795818 1820984 1845816 1869350 1891319
58268 1891319 1912135 1932567 1953215 1973971 1994054 2012643 2029251 2043652 2056156 2068029 2080837
58257 2080837 2095094 2110277 2126333 2144096 2163805 2184496 2205685 2228581 2254481 2282800 2311829
58246 2311829 2340772 2369865 2399149 2428451 2458263 2489366 2521688 2554613 2588259 2623396 2660091
58235 2660091 2697276 2733735 2769064 2804007 2840474 2880616 2924871 2971202 3017164 3062557 3109318
58224 3109318 3159140 3212002 3266656 3321788 3377036 3433698 3494156 3559866 3630253 3704177 3781870
58213 3781870 3864613 3953089 4046950 4145585 4248543 4355707 4467814 4586254 4711656 4843376
58203 4843376 4981009 5125491 5277779 5437320 5602841 5773928 5951068 6135091 6327338
58194 6327338 6529169 6740307 6959018 7185144 7421741 7672543 7939039 8221240 8519766
58185 8519766 8835652 9169445 9522004 9894993 10289329 10704803 11142593 11606351 12099373
58176 12099373 12622810 13178255 13769500 14399509 15068092 15775095 16523549 17317148 18157231
58167 18157231 19045186 19985170 20981351 22035308 23149769 24332185 25590795 26930163
58159 26930163 28354927 29875019 31502337 33245041 35110457 37111278 39263634 41581452
58151 41581452 44078355 46773290 49689483 52851032 56286863 60036699 64149776 68683609
58143 68683609 73711532 79327373 85634756 92733948 100723945 109712322 119819820 131187334
58135 131187334 143988880 158428582 174714153 193037212 213574131 236482345 261899173
58128 261899173 289964166 320726931 353676868 386970087 417072303 439583299 451022814
58121 451022814 450309080 438861338 419533613 395425896 369222041 342931754 317804086
58114 317804086 294474985 273314109 254587700 238216423 223510962 209401080 195058061
58107 195058061 180301003 165462148 150999892 137272262 124523193 112900818 102441414
58100 102441414 93086186 84741397 77315821 70716920 64848077 59621425 54961640 50798214
58092 50798214 47067315 43720289 40718595 38020472 35580897 33362070 31334957 29472681
58084 29472681 27751078 26154591 24674067 23299239 22018850 20826073 19717385 18687039
58076 18687039 17727770 16835419 16007656 15239353 14523937 13858010 13239782 12663712 12120990
58067 12120990 11604915 11112508 10641954 10192249 9764541 9360176 8977618 8613999 8268828
58058 8268828 7943126 7635480 7341806 7058780 6785273 6521085 6266448 6022123 5787960
58049 5787960 5561999 5342692 5130897 4927869 4732714 4544068 4362962 4191458 4029503
58040 4029503 3875651 3730066 3594057 3467122 3347076 3233019 3125840 3025663 2930979 2840631
58030 2840631 2754921 2674432 2599136 2528892 2463527 2402186 2343584 2287099 2233030 2181996 2134519
58019 2134519 2090524 2048627 2006827 1964676 1923684 1884634 1845940 1806205 1767077 1731476 1699650
58008 1699650 1669009 1637543 1605481 1573814 1543140 1514190 1487726 1463381 1439841 1416560 1394244
57997 1394244 1373401 1353428 1333352 1312582 1290759 1267825 1244560 1222244 1201459 1181844 1163180
57986 1163180 1146033 1130963 1117553 1104642 1091467 1078561 1067372 1058658 1051213 1042688 1031952 1020081
57974 1020081 1008847 998915 989838 980951 971733 962081 952789 944826 937444 928029 914902 899416 884225
57961 884225 870357 857379 845572 836006 828568 821679 814292 806812 799689 792364 784347 776418 769980
57948 769980 765525 762170 758494 753599 747552 740964 734277 727787 722363 719369 719224 720490 721168 720751 720539
57933 720539 722223 726570 733035 739930 745311 748360 749730 750222 749686 747725 744601 740581 735245 728623 722337
57918 722337 718096 715378 712016 706922 700888 694876 689204 684529 681929 681361 681476 681524 682072 683163 683254 681240
57902 681240 678314 676374 675346 673638 670897 668729 668399 669139 669337 668643 668187 668962 670507 671207 669685 666025
57886 666025 661842 659195 659097 660720 662038 661647 660304 660373 663355 668088 671936 673705 674777 677277 681748
57871 681748 686971 691491 694774 697230 699750 703149 707439 711489 713782 713750 712223 710474 708924 706907 703444
57856 703444 697990 690534 681421 671327 661111 651243 641465 631405 621519 612858 605747 599273 592528
57843 592528 585979 581071 578698 578417 578757 577821 574150 568045 561947 558438 557520 556689 553932 549709 545584
57828 545584 542023 538629 535738 534273 534037 533481 531548 528843 526557 525034 523928 522951 521699 519294 515175
57813 515175 510061 505362 501683 498500 495080 490948 485759 479797 474583 471637 470160 467237 461225 453943
57799 453943 448488 445834 444785 444469 445137 446790 448825 451403 455695 462245 470302 479180 488930 498915 507112
57784 507112 512147 515271 519042 524455 530360 535281 538655 540576 541542 542516 544161 545747 545804 544132 542258
57769 542258 541347 540489 537936 533578 529189 526196 524170 521957 519604 518307 518719 520233 522134 524523 527455
57754 527455 529885 530462 529201 527476 526418 526083 526189 526578 526574 524707 519791 511916 502168 491748 481565
57739 481565 472081 463275 455136 448241 443190 439526 436226 433433 432404 433174 433595 431863 429105 428194 430532
57724 430532 435073 440013 444224 447344 449702 452249 455665 459517 462984 466204 470112 475197 481254 488116
57710 488116 495657 503220 509957 515719 520723 524509 526228 525922 524506 522412 519154 514307 507958 500232
57696 500232 491412 482617 475209 469295 463864 458584 454240 451020 447703 443354 438722 435080 432515 430332
57682 430332 428407 427167 426685 426674 426975 427217 426445 424104 421175 419371 419111 419129 418191 416415 414571 412810 410791
57665 410791 408785 407880 408718 410460 411607 411901 412828 415885 420842 426171 430631 433627 434494 432801 429635
57650 429635 427321 427127 427920 427771 426358 425236 426151 429667 435088 441118 446834 452438 458873 466460 474388
57635 474388 481873 489184 496831 504174 509623 512153 512022 510122 507185 503564 499313 494403 489165 484410
57621 484410 480899 478981 479033 481763 487496 495567 505265 517231 533140 554032 579693 609769 644739
57608 644739 685614 733376 788767 851428 918164 982314 1035679 1071619 1086862 1081448 1057898 1020244
57596 1020244 972945 920130 865554 812614 763651 719183 678385 640604 606299 576586 552229
57585 552229 533040 517784 504491 491524 478817 467798 459681 454035 449393 444889 440666 436866 433083
57572 433083 429090 425406 422729 421171 420308 419566 418200 415511 411717 408367 407071 407674 408143 406433 402208
57557 402208 396635 390828 384895 378661 372946 369391 368474 368269 366176 361866 357346 353883 350439 346162 342967
57542 342967 343640 347853 352122 353985 354374 355218 356417 356537 355386 354221 353648 352640 349879 345298 340062
57527 340062 335524 332420 330638 329435 327852 325124 320965 315755 310374 305486 300923 296138 291271 287286
57513 287286 284835 283413 281861 279272 275175 269394 262347 255265 249533 245668 242986 240126 235937 230323
57499 230323 224603 220637 219163 219122 218912 218090 217451 217698 218547 219178 219082 218305 217110 215676 214175 213021 212829
57482 212829 213952 216049 218316 220139 221383 222206 222968 224315 226839 230390 234030 236904 238956 240662 242370
57467 242370 244100 245682 246796 247067 246425 245369 244637 244587 244880 244753 243717 242151 241112 241312 242389 243416
57451 243416 243978 244322 244612 244597 244095 243286 242409 241504 240572 239621 238517 237204 236024 235360 234930 233912 231726
57434 231726 228327 223973 219424 216152 215247 215966 216361 215609 214704 214468 214092 212391 209510 206392 203296 199976
57418 199976 196894 195084 194791 194939 194075 191463 187433 183012 178923 174666 168987 161581 153814 147366 142742
57403 142742 139592 137746 137027 136583 135436 133625 132051 131195 130575 129473 127822 126441 126531 128493 131071 132326
57387 132326 131896 131563 133013 135778 138095 138990 138577 137122 135160 134027 134846 136954 138497 138609 138058 137831
57371 137831 138139 138855 139733 139965 138534 135449 132022 129672 128893 129264 129697 128747 125662 121366 117738 115782
57355 115782 115162 115375 116331 117638 118407 118275 117795 117347 116394 114370 111664 109114 106935 104731 102311 99992
57339 99992 98188 97081 96718 97159 98265 99238 98691 95896 92099 89831 90330 92277 93654 94173 94934 96361
57323 96361 97761 98742 99772 101219 102826 104346 105849 107295 108447 109169 109179 107894 105478 103597 103881 105741
57307 105741 106978 106370 104389 101609 98187 95029 93501 93337 92562 90372 88601 89200 91508 93145 92682
57292 92682 90489 87808 85904 85346 85327 84397 82332 80243 78400 75515 71120 67124 65492 65519 64975 62976
57276 62976 60020 56046 50529 44365 39788 37954 37681 36811 34081 29828 25662 23233 22545 21849 19872
57261 19872 17408 15629 13721 9846 4112 -1123 -3845 -3797 -1493 2321 5841 6667 4176 379 -2359
57245 -3624 -4433 -5487 -6807 -8505 -10978 -14385 -18286 -21756 -23952 -25079 -26571 -29520 -32942 -34619 -33950
57230 -33950 -32990 -34176 -37793 -42135 -45503 -47499 -48984 -51261 -54828 -58584 -60759 -60863 -60021 -59175 -57908
57215 -57908 -55594 -52664 -49817 -46705 -42424 -36754 -29873 -21321 -10540 1664 13487 24095 34263
57202 34263 44762 55208 64979 74256 83325 91553 98087 103292 108637 115091 122317 129604 136990 145243
57188 145243 155043 166318 178070 188866 197939 206001 214538 224102 233748 242279 249485 255799 261441
57175 261441 266632 272063 278156 284078 288604 292003 296111 302260 310039 318485 327522 337507 348045 358189
57161 358189 367690 377398 388490 401567 416271 431497 446285 460816 476260 493474 512390 532893
57149 532893 555541 580801 608328 637838 670164 706210 744992 783903 821315 858175 896582
57138 896582 937325 979264 1020787 1061281 1101118 1140606 1179471 1217507 1255303 1293775 1333106
57127 1333106 1372724 1412253 1451679 1490572 1528163 1564674 1601640 1640255 1680248 1721141 1763696
57116 1763696 1808946 1856320 1904025 1951193 1998686 2047858 2099392 2153268 2209040 2265993 2323522
57105 2323522 2381287 2438704 2494830 2549327 2602954 2656385 2709218 2761096 2813063 2866483 2921064
57094 2921064 2975354 3028807 3081852 3134010 3183492 3228757 3269044 3303194 3329484 3347073 3356355
57083 3356355 3357394 3349171 3330756 3302001 3262637 3211886 3149513 3076189 2992241 2897088 2790478
57072 2790478 2673157 2545492 2406150 2252726 2083028 1895313 1687962 1459170 1206126
57063 1206126 924208 607896 252879 -143501 -583989 -1072608 -1614200 -2213997 -2878197
57054 -2878197 -3614165 -4430080 -5335514 -6342357 -7464136 -8714769 -10109323 -11665402 -13401827
57045 -13401827 -15336555 -17488509 -19881569 -22544747 -25509596 -28811876 -32497244 -36623505
57037 -36623505 -41259394 -46488108 -52414950 -59166819 -66879166 -75680029 -85676094 -96935471
57029 -96935471 -109470823 -123235561 -138126445 -153972522 -170530086 -187541378 -204847219
57022 -204847219 -222415338 -240155559 -257609952 -273801835 -287436765 -297337250 -302799523
57015 -302799523 -303673564 -300220079 -292921582 -282362675 -269183126 -254056188 -237652168
57008 -237652168 -220578320 -203320577 -186224831 -169527297 -153403390 -138000042 -123445952
57001 -123445952 -109853372 -97316519 -85902761 -75640497 -66514394 -58470702 -51426792
56994 -51426792 -45281805 -39929158 -35267628 -31205644 -27660140 -24556258 -21829200 -19424240
56986 -19424240 -17294336 -15399100 -13705678 -12188008 -10823906 -9593535 -8480159 -7470108
56978 -7470108 -6551142 -5712202 -4945104 -4244567 -3605311 -3020115 -2481420 -1983641 -1522894
56969 -1522894 -1095463 -697661 -326540 20286 345205 650444 938163 1211080 1471848 1721230
56959 1721230 1959097 2189584 2423181 2668395 2918374 3147745 3325920 3435055 3476541 3463774
56949 3463774 3411972 3333791 3239591 3137698 3033670 2929959 2826213 2719798 2607048 2485237
56939 2485237 2353725 2213539 2066804 1916920 1768117 1623517 1483890 1349130 1220449
56930 1220449 1100005 988654 885440 789507 701322 621570 549840 485065 426428 373065 323485
56919 323485 276116 230271 186098 143957 104401 68338 36401 8162 -17469 -41173 -62912 -82608
56907 -82608 -100421 -116382 -130339 -142425 -153123 -162614 -170368 -175652 -178317 -178928 -178242 -176673 -174274 -171317
56893 -171317 -168932 -168967 -172901 -180724 -190827 -200961 -209522 -216397 -222750 -229633 -236569 -241838 -244452 -245325
56879 -245325 -246013 -246701 -246189 -243620 -239319 -233799 -226757 -217389 -205198 -190260 -173379 -156492 -142500 -133936
56865 -133936 -131646 -134836 -142199 -152725 -165575 -179566 -193103 -204777 -214186 -222029 -229202 -235871 -241730
56852 -241730 -246892 -251966 -257219 -262267 -266755 -270716 -274012 -276097 -276843 -277016 -277313 -277310 -276014 -273113 -268983 -263736
56836 -263736 -257274 -250216 -243697 -237760 -230739 -220897 -208269 -194227 -179594 -163993 -147060 -129503 -112499
56823 -112499 -96438 -80867 -65651 -51710 -40336 -31976 -26052 -21934 -19612 -19115 -19478 -18808 -15576 -9633
56809 -9633 -1867 6957 16877 28434 42210 58723 78509 101894 128631 157899 188655 219749
56797 219749 249524 275545 295188 306726 309911 305763 296182 283732 271128 260232 251532 244895
56785 244895 240733 239945 242726 248117 255280 264931 278996 298981 325262 357813 396690 441083 488323
56772 488323 534510 575979 609805 633367 644575 642957 630003 608247 580432 549521 518439 488979
56760 488979 461392 435649 412790 394485 381643 374141 371544 373334 378685 387015 398914 415686
56748 415686 437646 463364 490692 517760 542584 562286 573483 573763 563006 543528 518788 491460
56736 491460 462664 433235 405187 381050 361835 346515 333616 322613 313773 307602 304677 305081
56724 305081 307724 311235 315863 323277 333832 345177 354459 360752 364057 363042 355683 342012 324637
56711 324637 306310 288148 270366 253404 237542 222121 205969 188580 170832 154705 142059
56700 142059 133133 126178 118932 110463 101408 92881 85653 79951 75265 70582 65572 61235 58511 56619
56686 56619 53888 50087 46626 44337 42509 40569 39190 38712 37631 34103 28561 23540 20942 20375 20309
56671 20309 19971 19704 20002 20813 21761 22676 23653 24637 25257 25224 24682 23918 23024 22242 22337 23945 26517 28586 29258
56652 29258 28915 28353 27848 27312 26756 26063 24793 22832 21054 20759 22315 24577 25743 24820 22422 20226
56636 20226 19523 20230 21283 21785 21615 21211 21221 22104 23590 24682 24876 25208 27237 30875 34168 35548 35513
56619 35513 35629 36710 38657 41405 44975 48804 51854 53493 53907 53824 54234 56027 59172 62343 64103 64612
56603 64612 65493 67827 70871 73164 74338 75092 75684 75401 73814 71729 70199 69070 67447 65550 65075 67339
56587 67339 71746 76542 80331 82350 82153 80209 78394 78603 80772 83264 85332 88162 93034 99313 104909
56572 104909 108330 109819 110843 112898 116635 121763 127680 134047 140611 146785 151857 155503 157646 158139
56558 158139 157192 155839 155133 154945 154396 153415 152888 153191 153542 153067 151692 149770 147762 146467 146551 147461 147776
56541 147776 147111 146711 147640 149405 150975 152229 153581 155076 156739 159161 162772 167028 171050 174545 177457
56526 177457 179334 179898 179746 179775 180378 181744 184148 187112 189145 189431 189115 189673 190624 190397 189238 189539 192962
56509 192962 198556 204329 209622 215171 221487 228091 234253 239976 246050 253232 261524 270438 279805 289818
56495 289818 300190 309913 318257 325437 331834 337244 341628 346132 352376 360800 370250 379018 385773 389886
56481 389886 391680 392294 392679 392707 391672 389384 386251 382534 378166 373153 367649 361780 355790 350060 344471
56466 344471 338238 330986 323617 317318 312019 306620 300531 294205 288274 282962 278349 274463 271011 267548
56452 267548 264001 260634 257640 255156 253401 252343 251447 250319 249314 248945 248966 248592 247403 245507 243166
56437 243166 240855 239342 239013 239379 239817 240464 241796 243678 245468 246598 246445 244235 240034 235410 232162
56422 232162 230572 229659 228786 228220 228502 230096 233229 237184 240237 241320 241331 241876 243235 244667 246023 247667
56406 247667 249280 250313 251327 253318 255844 257421 257794 258250 259564 261145 262407 263500 264472 265143 266091
56391 266091 268217 270938 272364 271894 271276 272388 275114 278029 280032 280772 280590 280681 282283 285170 287933 290077
56375 290077 292545 295695 298254 299229 299622 301146 304045 307106 309138 309661 308859 307603 306992 307321 308067 309008
56359 309008 310358 311553 311277 309330 307240 306223 305766 305108 304750 305209 305396 303831 300871 298241 296691 295419
56343 295419 293696 291946 291069 291419 292504 293194 292400 290019 287122 285041 284589 286099 289372 293261 296208
56328 296208 297760 298765 299676 299747 298692 298013 299417 302555 305514 307181 308131 309521 312021 315482 318794
56313 318794 320356 319681 318329 318418 320400 323136 325772 328445 331163 333168 333925 333963 334180 334706 335005 334904 334944
56296 334944 335488 335932 335379 334068 333430 334326 335933 336982 337514 338508 340299 342474 345002 348162 351457 353922
56280 353922 355487 356734 357391 356713 355555 356130 359068 362471 364766 366802 369959 373903 377764 382196 388378
56265 388378 395711 402241 407089 411045 415015 419043 422761 425818 427994 429517 430990 432453 433067 432348 431094
56250 431094 430361 430165 430023 430206 431553 434373 438232 442402 446066 448684 450663 453042 456146 459380 462664
56235 462664 466815 471875 476371 479220 481140 483189 485155 486543 487892 489747 491496 492793 495015 499488
56221 499488 505095 509523 512350 515145 518949 523456 528359 533658 538722 542756 546354 551090 557345 563862
56207 563862 569538 574377 578603 582254 586067 591651 600179 611489 624631 638615 652530 665616 677577
56194 677577 688758 700191 713440 729698 748573 768445 788357 808699 829736 850870 872217
56183 872217 895483 921948 950664 979980 1009736 1040439 1071292 1100695 1127954 1152969 1175140
56172 1175140 1194137 1210671 1224649 1233658 1235609 1232115 1226766 1220603 1211935 1200298 1187602 1174917
56160 1174917 1160928 1144554 1126810 1108984 1090926 1072359 1054196 1037262 1020910 1004087 986879
56149 986879 970059 953960 938696 924783 912715 902283 892845 884021 875862 868594 862260 856480 850889
56136 850889 845995 842859 841387 839953 837566 835293 834304 833735 832291 830972 831944 835054 837719 838338 837913
56121 837913 838181 839932 843220 847419 850892 852427 853275 856074 861551 867925 873679 879069 884605 890033 895385
56106 895385 901384 908190 915318 923260 933587 946762 961241 975274 988233 999856 1009939 1019570
56094 1019570 1031270 1046978 1066666 1089187 1113306 1137709 1161437 1184894 1209507 1236209 1265270
56083 1265270 1297436 1333787 1374506 1419192 1468301 1522811 1582848 1648628 1722527 1807808 1904889
56072 1904889 2011001 2123849 2243294 2368627 2496370 2621870 2741436 2852411 2953315
56063 2953315 3045062 3130347 3210667 3284996 3351496 3408460 3453034 3481426 3491841 3485807 3465995
56052 3465995 3434703 3395109 3351181 3304243 3251119 3187292 3110763 3021970 2922189 2814118 2702709
56041 2702709 2593229 2488818 2390933 2301039 2220357 2148771 2085525 2030638 1984488 1946320 1914188
56030 1914188 1886306 1862049 1841828 1826168 1814666 1806141 1800249 1798073 1799964 1803686 1806599 1809205 1814357
56017 1814357 1823099 1833589 1844224 1855429 1867833 1881075 1895236 1911383 1929808 1949469 1969853
56006 1969853 1991691 2015260 2039795 2065096 2091955 2120609 2150598 2182298 2216483 2252152 2287134
55995 2287134 2321204 2356257 2393046 2430304 2467458 2505515 2544654 2583717 2622828 2663834 2707317
55984 2707317 2751776 2796420 2842093 2888900 2936006 2984432 3036760 3093185 3151233 3210466 3273966
55973 3273966 3343772 3418240 3495447 3575969 3660801 3749770 3843493 3943632 4049798 4159545 4272649
55962 4272649 4391664 4516983 4645693 4777219 4915711 5064444 5222032 5386776 5560575
55953 5560575 5745573 5940845 6145600 6362177 6592860 6837045 7094362 7367155 7657080
55944 7657080 7962627 8282635 8618902 8973163 9345466 9737773 10154623 10597544 11063483
55935 11063483 11551638 12066985 12614124 13192943 13803777 14451208 15138639 15864376 16627366
55926 16627366 17431689 18281345 19176390 20118872 21116924 22178207 23305156 24501705 25778702
55917 25778702 27147475 28614359 30187024 31879612 33706002 35675185 37799411 40099633
55909 40099633 42596936 45307408 48253212 51471154 55004539 58898206 63211511 68026446
55901 68026446 73433084 79516221 86363997 94076573 102758347 112521883 123518827 135958087
55893 135958087 150087551 166180681 184545908 205496636 229254455 255857173 285064079
55886 285064079 316074320 347029017 374767778 395449712 405959742 405163042 394106722
55879 394106722 375203759 351184297 324446813 296842858 269660102 243693706 219393372
55872 219393372 197012911 176681973 158421089 142163815 127789301 115138247 104023751
55865 104023751 94257641 85672872 78119748 71455825 65553494 60309526 55636494 51452227
55857 51452227 47686668 44290004 41222517 38441597 35906993 33591610 31476700 29540554
55849 29540554 27760324 26120573 24611292 23220033 21932724 20739384 19632649 18603200
55841 18603200 17642057 16744726 15908108 15126000 14392135 13704592 13062659 12462302 11899039
55832 11899039 11372302 10882533 10426806 10001460 9606297 9241935 8905747 8594618 8309277
55823 8309277 8051707 7820474 7612631 7428224 7268877 7133451 7018418 6920664 6836133 6756890
55813 6756890 6672611 6574009 6452893 6301659 6116720 5901692 5664573 5412745 5152473 4890797
55803 4890797 4634388 4387231 4151657 3930350 3725183 3535405 3359264 3196387 3046809
55794 3046809 2909143 2781673 2664045 2556158 2456823 2365031 2280936 2203969 2131626 2061827
55784 2061827 1994918 1931967 1872949 1818143 1769253 1727237 1690723 1658148 1629590 1604786 1581368
55773 1581368 1556944 1531221 1504577 1476562 1447414 1418813 1391201 1362488 1331336 1299499 1268807
55762 1268807 1238115 1205727 1172837 1141954 1113620 1087055 1062390 1039849 1018376 997492 978956
55751 978956 964269 952157 940928 931468 925171 920641 915576 910631 908303 908939 910852 913566 917820 922847
55737 922847 926733 929442 932776 937173 940788 941932 940491 937084 932684 928799 925988 922310 915188 904816
55723 904816 894013 884660 875832 865235 850919 831820 808437 783185 758777 736089 714501 693896
55711 693896 675123 658809 644979 633699 624999 618378 613169 608991 605235 600905 595724 590460 585323
55698 585323 579227 571618 563719 556785 550506 544455 539515 536012 531819 524465 514203 503025 491574
55685 491574 479148 466017 453507 442144 431528 421600 412409 403347 394401 387288 383233 380383 375764
55672 375764 369365 363837 360369 357282 352953 347917 343630 340862 339613 338950 336836 331829 325127 319302
55658 319302 314972 310517 305171 300302 297039 294490 291340 287902 285694 285703 287621 290051 291261 290503 288705
55643 288705 287149 285717 283331 279764 275685 271098 265148 257656 249621 242076 235575 230733 227918 226156
55629 226156 223587 219363 214254 209351 205220 202383 201361 201886 202974 203966 204739 205079 204965 205412 207703 211515
55613 211515 214973 216877 217807 218678 219236 218479 215755 211009 204731 198137 192814 189607 188042 186976 185700
55598 185700 184556 184778 187463 192282 197544 201946 205715 209434 212579 214289 215119 216661 219455 222412 224434
55583 224434 225636 226684 227672 228011 227071 224702 221169 216520 210199 201947 193039 185577 180220 175651 170741
55568 170741 166016 162327 159566 157690 157493 158952 160126 159306 157185 155287 153581 151588 150520 151757 153930
55553 153930 154172 151931 149055 146389 143018 139133 136784 136962 138223 139235 140639 143278 146326 148482 149659
55538 149659 150396 150620 149991 148659 147054 145682 145448 147030 149560 151155 151276 151405 152888 155343 157813 160283
55522 160283 163252 166817 171002 176179 182477 189444 196825 204988 214121 223867 234265 246378 261367
55509 261367 279289 298987 318675 336642 352021 364838 374750 380196 379889 374851 367565 359162 348803
55496 348803 335817 320815 304473 286911 268886 252015 236937 222572 208083 194493 183411
55485 183411 174965 167817 160625 152974 145501 139445 135472 132779 130113 127494 125742 124438 122025 118298
55471 118298 115067 113605 113006 111973 110835 110645 111476 112678 113817 114294 113035 109753 105809 102743 100524
55456 100524 98190 95545 93283 91955 91644 92154 92822 92720 91720 90837 90907 91491 91557 90487 87954 83880 79286
55439 79286 76129 75215 75037 73742 71520 69966 69760 70220 70675 70940 70625 69235 67134 65466 64999 65608 66876
55422 66876 68434 69717 70135 69716 69186 69247 70070 71489 73359 75590 77949 79999 81391 82313 83343 84542
55406 84542 84980 83693 80968 78080 75918 74460 73419 72498 71111 68873 66495 65288 65589 66509 67226 67553
55390 67553 67301 66386 65742 66704 69031 70897 71451 71968 73682 75875 77159 77479 77630 77745 77524 77213 77166 76981
55372 76981 76221 75519 75894 77317 78874 80051 81034 82092 83371 84953 86419 86871 86136 85543 86653 89493
55356 89493 92638 94727 95406 95267 95506 97170 100052 102659 103737 103440 102630 101736 100788 99844 98769 97200
55340 97200 95232 93351 91230 87777 83180 79658 78926 79861 80095 79197 78682 79342 80275 80489 79972 78932 77228
55323 77228 74923 72551 70508 68844 67723 67416 67663 67527 66084 63125 59500 57042 57539 61049 65540
55308 65540 68777 70303 71227 72702 75201 78475 81252 81632 78995 75252 73166 73599 75290 76915 78229
55293 78229 79393 80521 81986 84041 85823 85691 83083 79456 77006 76715 77749 78412 77707 76211 75367 75770
55277 75770 76547 76630 75925 74739 72918 70563 68993 69661 72199 74654 75788 76200 77056 78587 80139 81072
55261 81072 81284 81261 81824 83566 86431 89879 93150 95215 95084 92785 89664 87107 85201 83198 80947 79163
55245 79163 78454 78575 78561 77392 75022 73057 73594 76835 80549 82640 83407 84396 85974 87431 88846 91225
55229 91225 94784 98457 101249 102997 103698 103119 101398 99318 97764 97286 97912 98794 98465 96431 94346 94651
55213 94651 98013 102719 106396 107724 106925 105572 105531 107090 108412 107769 105913 105055 105902 107102 107482 107399 107679
55196 107679 108525 109713 110879 111395 110917 110058 109654 109488 108821 107863 107376 106977 105402 102563 99742 97527 95219
55179 95219 92666 90989 90695 90595 89591 88299 87878 88248 88403 87705 86126 84031 82454 82667 84712 87140
55163 87140 88856 90317 92164 93663 93549 91719 89103 86490 84392 83434 83844 84904 85785 86557 87615 88536
55147 88536 88424 87085 85074 82886 80949 80194 81589 84973 88933 91985 93507 93792 93788 94714 97187 100524
55131 100524 103240 104373 104132 103286 102303 101177 99797 98291 96995 96138 95657 95355 95025 94306 92784 90733
55115 90733 89506 90471 93389 96381 97673 97010 95343 93748 92832 92687 93025 93552 94288 95283 96144 96379 96183
55098 96183 96415 97678 99805 102093 103618 103689 102771 102637 104549 107336 108510 107356 105595 104688 104005 102501
55082 102501 100752 99946 99693 98449 95963 93997 94317 96805 99831 101983 103039 103479 103522 102963 101895 100922
55066 100922 100240 98991 96449 93505 91903 92008 92506 92427 92305 92958 94304 95848 97246 97847 96883 94920
55050 94920 93974 95254 97745 99893 101574 103317 104737 105221 105356 106022 106587 105643 103327 101309 100439 99892
55034 99892 98903 97994 98050 99198 100988 102779 103723 103306 102327 102513 104758 108316 111817 114232 114753 112990 109964
55017 109964 107921 108204 109812 110728 110119 108474 106297 103924 102410 103135 105951 108695 109320 108057 106780
55002 106780 106549 106688 106347 106103 107406 110692 114620 117234 117707 116890 116269 116408 116519 115703 114393 113990 114987
54985 114987 116217 116337 115374 114119 112695 110731 108580 107216 106931 107151 107549 108365 109538 110575 111365 112071
54969 112071 112111 110676 108664 108497 110998 113791 114153 112510 111565 112543 113917 113816 112320 111044 111289 112878
54953 112878 114316 114073 112157 110217 109714 110440 111505 113056 115868 119512 122400 123870 125050 127152 129753
54938 129753 131375 131238 130006 129126 129746 131849 134221 135589 135975 136562 138122 140061 141267 141450 141300 141542
54922 141542 142121 142183 140795 137895 134613 132407 131755 131915 131979 131866 132179 133441 135665 138344 140601 141540 140829
54905 140829 139060 137417 136864 137521 138726 139687 140166 140520 141149 142095 143307 145086 147770 150903 153026 152710
54889 152710 149908 146104 142995 141142 140074 139551 140114 142189 145189 148128 150784 153504 155930 156892 155990
54874 155990 154615 154745 156873 159650 161579 162723 164547 168091 172585 176325 178920 181921 186724 192633
54860 192633 197945 202400 207256 213255 220026 227530 236293 245583 253086 257553 260472 263820 267137 268167
54846 268167 265668 260171 252573 243474 233746 224438 216012 208540 202404 197902 194441 191114 187798 184729
54832 184729 181488 177747 174731 174291 176356 178718 179692 179688 179705 179697 179259 178891 179561 181600 184765 188960 194285
54815 194285 200784 208614 218020 228630 239181 248389 255830 261641 265777 267945 267939 265748 261672 256579
54801 256579 251576 247072 242468 237044 230806 224262 217920 212355 208137 205141 202323 198804 194918 191604
54787 191604 189030 186458 183279 179575 175679 171819 168185 164751 160925 156136 151071 147582 146732 147407 147659
54772 147659 147094 146988 148098 149501 149971 149443 148315 146262 142965 139483 137472 137083 136962 136487 136626 138058
54756 138058 139778 140475 140268 140055 139880 139130 137847 136829 136639 137305 138667 140198 140960 140709 140683 142229 144801
54739 144801 146392 145938 144350 143227 143483 145187 147733 149973 151061 151364 151815 152481 152709 152628 153290 155010
54723 155010 156697 157358 157351 157604 158425 159670 161405 163804 166867 170669 175374 180678 185764 190142 193949 197261
54707 197261 199953 202648 206901 213769 222835 233133 244212 255618 266201 275044 282572 289651 295820
54694 295820 299375 299126 295340 289097 281522 273591 265802 257956 249847 242144 235873 230990 226369 221427
54680 221427 217037 214370 213446 213312 213163 212741 212003 211009 209972 208932 207558 205802 204484 204492 205508 206477 207552
54663 207552 210491 216384 223882 230746 236604 242918 250498 258552 266327 274114 281898 288340 292103 293177
54649 293177 291832 287277 278860 267986 257245 247829 239216 231298 225095 220868 217015 211748 205183 199042
54635 199042 194831 192696 191546 189908 187165 184187 182288 181563 180970 180053 179451 179328 178467 175782 171968 168772
54619 168772 167147 166809 167080 167279 166729 165329 164070 164167 165618 167091 167279 165943 163760 161640 160149 159184
54603 159184 158169 156841 155699 155398 155873 156482 156870 157132 157115 156231 154373 152618 152407 154010 156230 157862
54587 157862 159038 160741 163311 166015 168032 169063 168841 166994 163942 161218 160110 160524 161815 163910 166535
54572 166535 168142 167274 164878 163631 164736 166828 168279 169016 169406 168949 167251 165284 164418 164852 165886 167039
54556 167039 167976 168040 167035 166024 166251 167531 168707 169501 170857 173456 176865 180280 183334 185838 187342
54541 187342 187455 186472 185509 185859 187954 190854 193060 193975 194190 194263 193902 192776 191461 190871 191075 191347 191204
54524 191204 190863 190795 191253 192139 193058 193680 194208 195176 196614 197914 198747 199576 200934 202747 204708 206648 208182
54507 208182 208704 208261 207725 207585 207388 206999 207320 208821 210320 210552 210211 211018 213238 215557 217117 218187 218977
54490 218977 219346 219827 221545 224680 228106 230842 232901 234511 235621 236464 237604 239095 240564 242431 245948
54475 245948 251604 258322 264555 269241 271566 271168 269208 267951 268351 269060 268643 267723 267815 268990 270033 270291
54459 270291 270053 269466 268467 267625 267709 268326 268152 266729 264996 263780 262777 261459 260072 259138 258638 258265 257886
54442 257886 257172 255438 252732 250654 251007 253545 256045 256950 257182 258683 261704 264433 265297 264764 264505 265342
54426 265342 266666 267716 268765 270789 274304 278839 283435 287370 290439 292827 294896 296995 299345 302076
54412 302076 305466 310040 316179 323452 330503 335896 339232 341336 343287 345311 346692 346675 345398 344004 343883
54397 343883 345695 348935 352310 354547 355019 353885 351792 349398 347099 345122 343683 342713 341523 339275 336079
54382 336079 333192 331712 331295 330595 328671 325476 321378 316981 313318 311216 310305 309400 308123 307339 307544 307632
54366 307632 306053 302867 299963 299264 301082 304155 306976 309032 310782 312449 313287 312497 310533 308665 307365
54351 307365 306098 304731 303907 303596 302497 299673 295782 291904 288223 284956 283538 285281 289293 293221 295930
54336 295930 298119 300425 302390 303546 304152 304358 303683 302002 300329 300004 301524 304412 307647 309942 310264
54321 310264 308616 306016 303434 301139 299240 298292 298881 300908 303595 306027 307591 308191 308258 308301 308284 307734 306554
54304 306554 305459 305374 306550 308315 309526 309294 307528 304949 302555 301084 300765 301144 301026 299210 295768 292166
54288 292166 289650 287963 286083 283546 280265 275832 270267 265104 262164 261198 260135 257965 255911 255202 255133
54273 255133 254353 253004 252255 252393 252643 252583 252469 252159 250825 248167 245255 243692 244151 245783 246766 245554 242141
54256 242141 238315 236200 236212 236667 235674 233235 231202 231376 234025 238027 241830 244069 244064 242454 241081 241478
54240 241478 243369 245129 245540 244500 242238 239016 235844 234319 234995 236685 237933 238260 237328 234178 228744
54225 228744 223276 220423 220111 219893 218437 216938 216716 217072 216561 215246 214518 215103 216231 216656 215960 214759
54209 214759 213821 213080 211846 210239 209823 211912 215494 217916 217727 215866 213982 212838 212771 214440 218121 222910
54193 222910 227465 231106 233657 234809 234343 232646 230359 227816 225288 223469 223100 224210 226026 227483 227646
54178 227646 226020 222835 218945 215233 212247 210290 209459 209589 210558 212628 215866 219252 221101 220637 218632
54163 218632 216395 214714 213743 213073 211708 208890 205247 202355 200807 199570 197664 195582 194445 194495 195068
54148 195068 195460 195297 194662 194307 195073 196661 197699 197522 197007 197049 197185 196569 195484 194810 194627 194408 194232 194804
54130 194804 196488 199027 201870 204038 204223 202042 199043 197547 198556 201320 204550 207233 208531 207947 205817
54115 205817 203144 200907 199756 199993 201389 203291 205255 207161 208481 208283 206591 204919 204519 204789 204408
54100 204408 203351 202518 201867 200404 198062 196294 196505 198668 201517 203487 203630 202468 201705 202292 203116 202557
54084 202557 200865 199677 199453 199042 197897 197027 197156 197454 197061 196817 198315 201767 205688 208432 209463 209413
54068 209413 209423 210300 212005 213973 215805 217227 217618 216347 213720 210871 208609 207006 206172 206435 207492 208313
54052 208313 208445 208589 209352 210293 210981 212138 214549 217241 218037 216091 212979 210938 210684 211342 211953 212387 212888
54035 212888 213336 213260 212340 210609 208315 205978 204538 204802 206384 207675 207512 206593 206650 208305 210490 212013
54019 212013 212897 213938 215630 218075 221454 225764 230158 233265 234547 234990 235978 237649 238902 239181 239496
54004 239496 241043 243350 244828 245029 245162 246085 247044 247090 246701 246970 247966 249041 250209 252091 254797 257877
53988 257877 261214 265028 269268 273825 278904 284281 288698 291325 293379 296966 302595 309303 316891 326021
53974 326021 336019 344828 351994 359948 371109 385015 399372 412676 424669 435373 445139 454963 465449
53961 465449 475680 483945 489215 491433 491204 489889 489058 488815 487443 483669 478408 473079 467179 459194 449426
53946 449426 440166 432915 426868 420383 412833 404778 397232 391017 386095 381423 376121 370613 365889 361929
53932 361929 357904 353673 349799 346148 341992 337750 335107 334624 334473 332525 328763 324718 321354 318640 316574
53917 316574 315284 314134 311847 307919 303359 299833 298272 298288 298664 298531 298330 299387 302216 305548 307547
53902 307547 307753 307312 307499 308679 310636 313082 315570 317628 319523 322450 327370 333772 339937 344336 346616
53887 346616 347527 348421 350677 354980 360923 367597 374612 382115 389720 396174 400775 404815 410660 419135 428483
53872 428483 436451 442986 450166 459452 469736 478465 484302 488203 492006 496492 500916 504063 505531 506200
53858 506200 507693 511308 517314 525234 534597 545041 555670 565114 572807 579907 588221 598335 609365
53845 609365 620261 630458 639249 645671 649648 652489 655619 659306 663120 666845 670122 671723 670319 665917
53831 665917 659722 652726 645241 637662 630658 624283 617694 610154 601820 593331 585096 577206 569524 561713
53817 561713 553597 545647 538685 533026 528383 524621 521949 520310 519332 519168 520641 524162 528944 533525 536425
53802 536425 536134 531436 522466 510879 498328 485228 471465 457570 444374 432052 420478 410234
53790 410234 402258 396509 391773 386799 380991 374090 366119 357927 351069 346670 344576 343778 343360 342995 342838
53775 342838 343077 343364 342775 340633 337290 333731 330540 327702 325270 323539 322398 321207 319624 318102 317219
53760 317219 316959 317049 317641 319100 321238 323269 324571 325274 326141 328054 331414 335620 339259 341344 342525 344591
53744 344591 348468 353152 357162 360781 366000 374058 383697 392463 399350 405477 412324 420128 428336 436856
53730 436856 446000 455378 463696 469918 474214 477398 479896 481788 483626 486293 489790 492862 494435 494941
53716 494941 495387 495455 493693 489803 485534 482547 480225 476618 471045 464689 458799 453392 447848 441802 435167
53701 435167 428045 420945 414552 408943 403559 398086 392678 387097 380509 372791 365417 360195 357282 355073
53687 355073 351978 347818 343497 339781 336621 333518 330339 327576 325694 324466 323267 321805 320067 317824
53673 317824 315051 312813 312686 314776 317163 317986 317439 317041 317534 318372 318940 319344 320021 321220 322830 324226
53657 324226 324508 323565 322756 323744 326579 329545 331058 331182 331137 331917 333830 336879 340960 345514 349372 351440
53641 351440 351744 351623 352548 354797 357656 360780 364594 369145 373340 376003 377161 377699 378176 378787 380115 382875
53625 382875 386766 390376 392545 393275 393117 392202 390309 387636 385069 383629 383724 385063 387309 390527 394566
53610 394566 398198 399761 399049 397733 397259 397057 395741 393492 391927 391774 391985 391357 389865 387955 385600 382859
53594 382859 380639 379993 380862 382089 382454 381385 379048 376301 374341 373790 374115 374261 373838 373427 373806 375090
53578 375090 376588 377297 376648 375037 373570 373075 373372 373688 373752 374202 375814 378516 381341 383295 384122 384226 384179
53561 384179 384426 385250 386615 388140 389610 391561 394905 399785 405231 410241 414868 419924 425878 432417 438826
53546 438826 444336 448341 450795 452403 454030 455959 458019 460315 463397 467593 472389 476462 478308 477270
53532 477270 474377 471899 471463 472630 473660 473533 472755 472260 472130 471611 470183 468391 467530 468277 469745 470404
53516 470404 470016 469738 470019 469517 467171 464325 463293 464330 465679 466408 467384 469262 471331 473046 475025 477644
53500 477644 480078 481869 484173 488040 492479 495694 497546 499253 501191 502675 503820 506025 510315 516355
53486 516355 523318 530611 537519 543358 548470 554137 560943 568086 574819 581734 589896 599401 609575 620158
53472 620158 631564 644228 658320 673863 690605 707990 725685 743904 762818 782138 801840
53461 801840 822819 845968 870901 896478 922371 949130 976839 1005001 1034035 1065567 1100496
53450 1100496 1137760 1175833 1214539 1254394 1294920 1334973 1374430 1414298 1455175 1496678 1538345
53439 1538345 1579893 1620449 1658790 1694881 1730182 1765795 1801291 1836024 1870621 1906081 1941985
53428 1941985 1976820 2009792 2041269 2071409 2099473 2124959 2148717 2172298 2196281 2219610 2240715
53417 2240715 2259248 2276574 2294263 2312174 2328420 2341232 2350310 2356130 2358702 2357681 2353296 2346415
53405 2346415 2337662 2326783 2312754 2294407 2271508 2245585 2219051 2192854 2165527 2135264 2102323
53394 2102323 2068351 2033832 1997622 1959122 1919671 1881319 1845084 1810954 1778855 1748880 1720741
53383 1720741 1693484 1665843 1637025 1607398 1578272 1550757 1525126 1501754 1482185 1468269 1460138
53372 1460138 1455794 1452935 1450718 1449804 1451443 1456671 1465703 1477859 1492495 1510001 1531274 1556301 1584036
53359 1584036 1613731 1645511 1679467 1715165 1752466 1792072 1834776 1880715 1929699 1981639 2036349
53348 2036349 2093554 2153380 2216178 2281620 2348725 2417048 2487046 2559073 2633106 2709952 2791272
53337 2791272 2877202 2964952 3051273 3135966 3221599 3309948 3400016 3489710 3578249 3666295 3754405
53326 3754405 3842030 3927851 4010649 4089632 4163966 4232371 4293849 4348929 4399536 4447052 4490921
53315 4490921 4529581 4562181 4588810 4609591 4624472 4633583 4636839 4633211 4621200 4600070 4569862 4530250
53303 4530250 4480293 4419634 4349261 4270818 4185852 4095991 4003027 3908040 3810799 3710724 3608327
53292 3608327 3505262 3403119 3302647 3204000 3106996 3011019 2915314 2819899 2725796 2633958 2544338
53281 2544338 2456645 2371714 2291145 2215381 2143070 2072869 2005150 1941266 1881879 1827026 1777220
53270 1777220 1733034 1693559 1656694 1621510 1589247 1561393 1537785 1517504 1500791 1488783 1481479
53259 1481479 1477108 1473741 1470886 1469170 1469049 1470397 1473281 1478471 1486696 1497543 1509766 1523041 1538781
53246 1538781 1558444 1581375 1605325 1629144 1654004 1681666 1712457 1745496 1780191 1816728 1855326
53235 1855326 1895631 1936829 1978203 2019685 2061858 2105129 2149109 2193210 2237486 2281906 2324984
53224 2324984 2364357 2399029 2430003 2458453 2484526 2508399 2530956 2552320 2570791 2584468 2593188
53213 2593188 2597780 2598244 2593935 2584874 2571595 2554102 2532270 2506900 2479046 2448482 2414091 2375684
53201 2375684 2334204 2290170 2243181 2193092 2140514 2085862 2028987 1970157 1910549 1851329 1792896
53190 1792896 1735310 1678842 1623843 1570616 1519576 1470906 1423849 1376921 1329077 1280316 1231235
53179 1231235 1182672 1135896 1092255 1052040 1014019 976490 938764 901667 866880 835826 808720
53168 808720 784464 761512 738948 716921 696508 679227 665978 655894 646640 636366 625035 613498
53156 613498 601944 590002 577803 565986 554887 544520 535070 526688 519060 511814 504918 498093 490661
53143 490661 482935 476797 473484 471425 467894 462337 456263 450227 443124 434762 427016 421525 417851 414746
53129 414746 411866 409331 406772 403773 400437 396883 393086 389642 387520 386545 385331 383297 381408 380209
53115 380209 378708 376250 374016 373145 372619 370729 367858 365968 365673 365426 363556 359824 354986 350073 346223
53100 346223 344226 343873 344288 344892 345574 346198 346537 346551 346165 345097 343404 341721 340398 338980 337248 336075
53084 336075 336247 336979 336868 336018 335980 337561 339777 341079 340676 338641 335709 333210 332303 332968 334298 335768
53068 335768 337546 339645 341695 343698 346123 348914 351109 351770 350768 348639 346272 344810 344948 346053 346644
53053 346644 346013 344729 343368 341694 339548 337684 336849 336510 335289 332520 328868 325520 323156 321647 320412
53038 320412 319090 317902 317194 316646 315403 313264 311284 310818 312097 313962 314736 313267 309668 305535 303100
53023 303100 303537 306068 308945 311191 313046 315050 317249 319332 321069 322448 323624 324722 325493 325308 323861
53008 323861 321836 320373 319721 318886 316884 314003 311449 309956 309114 307991 306100 303727 301591 300246 299710
52993 299710 299629 299754 300015 300057 299141 297046 294782 293741 294086 294568 294068 292655 290939 289161 287567 287005 288167
52976 288167 290404 292181 292907 293626 295587 298567 301011 301631 300498 298575 296450 293825 290373 286706 283997
52961 283997 282640 281979 281475 281350 281594 281171 279182 276373 274473 274092 274113 273190 271180 269194 268808 270950 274795
52944 274795 277980 278774 277805 276776 276000 274509 272258 270419 269354 268212 267053 267490 270105 272941 273978
52929 273978 273775 274106 275088 275537 275433 276050 277775 279564 280749 281907 283551 285121 285740 285149 283600 281576
52913 281576 279831 279044 279213 279988 281548 284385 288150 291556 293716 294921 295828 296496 296583 295953 294685 292789
52897 292789 290284 287433 284727 282578 280909 279041 276437 273815 272872 274258 276263 276403 274159 271391 270144
52882 270144 270826 272441 273737 274008 273508 273242 273755 274198 273350 271481 270159 270053 270094 269268 268166 267897 268285
52865 268285 268230 267514 267210 268200 269992 271275 271269 270260 268963 267619 265866 263482 261003 259327 258844 259266 260195
52848 260195 261456 262907 264359 265822 267488 269364 271172 272596 273331 273008 271603 269896 268916 268770 268595
52833 268595 267908 267378 267805 268826 269421 269531 270354 272688 275531 276954 276259 274632 273486 272876 272103 271266 271149
52816 271149 271833 272625 273469 275039 276956 277403 275542 273089 272149 272572 273056 273965 276947 281965 286881 290327
52800 290327 293228 296934 301449 306049 310104 312580 312385 310235 308776 309515 310769 309963 306948 303501 300285
52785 300285 296140 290291 283699 277843 273233 269536 266456 264091 262705 262249 261972 260852 258852 257415 258052
52770 258052 260611 263403 264835 264437 262690 260638 259571 260286 262451 265129 267881 270886 274068 276695 277956
52755 277956 277524 275549 272466 268864 265178 261539 258279 256406 257064 260389 265240 270059 273693 275504 275299
52740 275299 273440 270728 267938 265569 263961 263321 263382 263279 262074 259536 256392 253711 251953 250710 249478
52725 249478 248472 248304 248906 249361 249024 248296 247888 247744 247330 246875 247554 250027 253084 254357 252758 250020 249187
52708 249187 251307 254218 255169 254041 252898 252762 252432 250915 249538 250474 253994 258249 261348 262683 262638 262027
52692 262027 261724 261999 262184 261513 260096 258546 257041 255642 255171 256636 259678 262512 263772 263751 263554 263668
52676 263668 263833 263869 264077 264690 265208 264621 262725 261019 261456 263971 266154 266131 264942 264960 266612 268181 268590
52659 268590 268664 269241 269646 268933 267540 266707 266886 267588 268297 268752 268690 268040 267132 266110 264459 261802 258923 257227
52641 257227 257117 257503 257048 255481 253581 252287 251981 252348 252662 252328 251345 250368 250297 251771 254880 259168 263805
52624 263805 267845 270449 271084 269754 267194 264874 264516 267095 271873 276687 279742 281195 282494 284172 285124
52609 285124 284414 282885 282071 282098 281730 280325 278662 277703 277545 277911 278825 280232 281510 282033 282048 282512 284153
52592 284153 286858 289986 293149 296651 301036 306113 310693 313585 314588 314269 313166 311772 310789 310532 310247
52577 310247 308867 306422 303891 301834 300155 299177 299696 301574 303349 303780 302979 301614 299937 298115 296523
52562 296523 295049 293027 290680 289693 291233 293979 295266 293849 290624 286984 283489 280092 276781 273924
52548 273924 272444 273388 276783 281237 285268 288623 291663 294065 295177 295297 295440 295935 296255 296142 295865 295318
52532 295318 293958 291853 289914 288856 288744 289682 291947 295040 297457 297946 296469 293780 290849 288983 289436
52517 289436 292161 295486 297674 298390 298259 297667 296733 295937 295902 296667 297773 298984 300381 301844 302932 303349
52501 303349 303192 302627 301571 299827 297578 295736 295441 296874 298760 299633 299516 299690 300880 302574 304292 306318
52485 306318 308510 309476 308070 305093 302340 300319 298135 295551 293747 293517 293764 292686 290081 287683 287208
52470 287208 288549 290217 291334 292662 295356 299088 302173 303552 303701 303189 301442 297942 293946 291653 291835
52455 291835 293458 295539 298009 300588 302382 303356 304993 308343 312282 314919 316258 318160 321739 325979
52441 325979 329169 330719 331077 330614 329337 327480 325723 324706 324497 324551 324031 322277 319232 315618 312588 310962
52425 310962 310567 310423 309761 308842 308530 309138 310091 310915 312065 314293 317356 319922 320942 320865 321334 323772 328145
52408 328145 332923 336341 338005 339309 341986 346246 350646 353844 356009 358123 360271 361288 360214 357647
52394 357647 355251 354131 354025 354046 353746 353112 351845 349234 345055 340318 336716 335222 335311 335502 334589 332360
52378 332360 329360 326168 323015 320063 317809 316809 316919 317184 316916 316716 317902 320899 324636 327798 330179
52363 330179 332418 334762 336755 338060 338887 339312 338771 336765 333846 331297 329832 329041 328170 327104 326386 326682
52347 326682 328461 331943 336873 342403 347496 351694 355396 359347 363836 368370 372122 374698 376382 377487
52333 377487 377698 376514 374320 372418 371684 371811 372240 373097 374357 374720 372733 369074 366319 365967 366815 366995
52317 366995 366463 366395 367025 367597 368067 369246 371085 372352 372698 373914 378054 384819 391650 396157 397837 397765
52301 397765 397446 398016 399774 402028 403645 403976 403244 402104 401099 400580 400788 401774 403214 404399 404497 403114
52285 403114 400904 399597 400979 405462 411632 417292 421036 422955 424110 425491 427382 429513 431723 434377
52271 434377 438012 442649 447850 453532 460222 468018 475656 481472 485436 489509 495612 503863 513190 522885
52257 522885 532665 541756 549150 554855 559889 564912 569805 574790 580712 587529 593594 597535 600183 603526
52243 603526 608183 613088 617405 621484 625773 629984 633793 637498 641500 645781 650292 655219 660399 665069
52229 665069 668635 671173 672781 673064 671900 670199 669162 669056 669417 670085 671242 672580 673487 674254 676203 680085
52213 680085 684947 689151 692112 694435 696701 698936 701291 704392 708504 712917 716777 720275 724363 729400
52199 729400 734879 740637 747329 755053 762192 766704 768454 769430 771558 775163 779744 785305 792204 800197
52185 800197 808356 815829 822165 827045 830374 832774 835470 839172 843139 845799 846607 847089 849612 855030 861954
52170 861954 868570 874707 881628 890133 899514 908307 915545 921388 927072 934083 942695 951490 959046 965943
52156 965943 974042 983824 993714 1002305 1009806 1016628 1022070 1025783 1029460 1035453 1044085 1053741 1063255 1072760
52142 1072760 1082283 1091144 1099160 1107140 1115503 1123399 1129900 1135333 1140749 1146592 1152605 1158622 1164745 1170886
52128 1170886 1176667 1181878 1186725 1191563 1196491 1201119 1204652 1206350 1206008 1203937 1200496 1195838 1190167 1184040
52114 1184040 1178224 1173225 1168854 1164362 1159236 1153943 1149474 1146042 1142821 1139434 1137016 1136849 1138216 1138670
52100 1138670 1136632 1132919 1129544 1127851 1128109 1130022 1132800 1135147 1135970 1135154 1133354 1131254 1129367 1128320 1128702
52085 1128702 1130430 1132540 1133908 1134200 1133987 1133913 1133937 1133650 1133114 1132851 1132946 1132882 1132500 1132353 1132572 1132253 1130915 1129801
52067 1129801 1130459 1132493 1134328 1136032 1139647 1146386 1155339 1165660 1178314 1194235 1211957 1228687 1243133
52054 1243133 1255967 1267999 1279231 1289435 1298350 1305323 1309804 1312123 1312896 1311881 1308571 1303745 1299056
52041 1299056 1294936 1290323 1284926 1280448 1278691 1279385 1280826 1281933 1282678 1283080 1283011 1282962 1283909 1286010 1287968 1288072
52025 1288072 1285624 1281230 1275984 1270548 1264960 1259203 1253894 1250184 1248811 1249396 1250862 1252376 1253613 1254300
52011 1254300 1254048 1252735 1250813 1249133 1248686 1250278 1253785 1257503 1259006 1257345 1254160 1251981 1251673 1252161 1252374
51996 1252374 1252341 1252229 1251535 1250008 1248519 1248006 1247984 1247122 1244948 1241955 1238231 1233216 1226997 1220618 1214699 1208757
51980 1208757 1202378 1195965 1189616 1182422 1174051 1166151 1160636 1156949 1152624 1146704 1141128 1138265 1138318 1139913
51966 1139913 1142085 1144595 1146884 1148146 1148524 1149303 1151546 1154967 1158303 1160478 1161467 1162414 1164848 1169143 1173590
51951 1173590 1175657 1174538 1171891 1169576 1167341 1163592 1157835 1150993 1143285 1133402 1120577 1106261 1092378
51938 1092378 1078636 1063031 1044887 1025932 1008043 991141 973876 955461 936194 916901 898642
51927 898642 882427 868435 855760 843395 831135 819094 806932 794333 781958 771030 761988 754120
51915 754120 746477 738481 729658 719535 708185 696610 686357 678806 674645 673650 674921 677571 681190
51902 681190 685537 690080 694346 698691 704327 712380 722826 734100 743725 749926 753102 755287 757750 759547
51888 759547 759067 756431 753416 751276 749743 748343 747712 749199 753751 761459 771581 782790 793935 804915
51874 804915 816472 829118 842757 857274 872529 887482 900102 908705 912940 913244 910024 903723 894928
51861 894928 883832 870159 854131 836803 818863 799948 780070 761070 745316 733060 722115
51850 722115 710259 697137 683833 671616 661393 653532 647606 642751 638695 636126 635858 637996 642105
51837 642105 647636 653856 659812 664887 669218 673214 676888 679980 682537 684995 687864 691739 697513 706067
51823 706067 717590 731512 747246 764655 783459 802273 818594 829913 834910 833773 827769 818681
51811 818681 808305 797956 788153 778770 769434 759730 749309 738223 727145 716711 706459 694973
51799 694973 681611 667773 655785 646635 639416 633049 627803 624597 623263 622263 620139 616786 612991
51786 612991 609082 604456 598495 591526 584525 578052 571893 565798 560004 554728 549670 544647 540379 537766
51772 537766 536332 534322 530855 527358 526153 527874 530887 533036 533416 532525 531448 531102 531708 532585 532665 531457
51756 531457 529431 527417 525919 525073 524835 524987 525315 526212 528746 533600 539999 546248 551353 555598 559380
51741 559380 562137 562984 562030 560354 558661 556597 553657 550235 547212 544726 541996 538495 534885 532436 531754
51726 531754 532325 533073 533005 531545 528823 525786 523559 522319 521125 519111 516615 514755 514105 514276 514720 515393
51710 515393 516517 518187 520448 523420 527047 531082 535692 541780 550126 560246 570539 579665 587361 593907
51696 593907 599313 603390 606176 607770 607953 606446 603437 599297 593884 586843 578810 571440 565695 560763
51682 560763 555537 550673 547946 547585 547573 546190 544215 543743 545572 548871 553025 558578 566194 575573 585661
51667 585661 595320 603695 610610 616844 623362 630010 635647 639874 643855 648751 653798 656671 655625 650913
51653 650913 644422 638417 634273 631670 628976 624880 619602 614167 608780 602705 595815 589523 585691 584925
51639 584925 586216 587982 589130 589255 588259 586013 582520 578364 574811 573179 574019 576920 580850 584357 585650
51624 585650 583336 577682 570838 565111 560839 556397 550556 544386 540266 539284 540307 541808 543769 547150
51610 547150 552062 557472 562611 567730 573232 578951 584877 591899 601110 612604 625462 638561 650705
51597 650705 660130 664783 663538 657089 647608 637473 627985 618919 609442 599725 591472 586527 585140 585847
51583 585847 586693 586171 583410 578369 572007 565676 559973 554388 548022 540423 531863 523196 515463 509239 504383
51568 504383 500611 498121 497253 497755 498952 500470 502218 503770 504549 504711 505139 506376 508133 509963 511700
51553 511700 512924 512806 511030 508368 505816 503620 501740 500732 501323 503179 504889 505371 504866 504372 504493 505134
51537 505134 506022 507116 508528 510423 513234 517739 524538 533415 543530 554336 565867 577816 588717
51524 588717 596603 600540 601324 600918 601361 603750 607631 611588 615017 619121 625644 634924 645922 657776
51510 657776 670190 682460 693574 703837 715181 728972 744254 758975 772358 785244 798549
51499 798549 812436 826867 842171 858926 877762 899305 923876 950995 979192 1006214 1029635
51488 1029635 1047807 1060466 1067975 1069909 1065094 1053346 1036293 1015737 991922 964400 934025 902854
51476 902854 872072 841276 810239 780452 754222 732659 715095 700204 687034 674925 663118
51465 663118 651117 639446 629472 622037 616531 611639 606612 601246 595124 588080 581331 576733 574356 572086
51451 572086 568355 564082 560771 557852 553571 547926 542899 539701 537306 534048 529470 524267 519523 516396
51437 516396 515465 515865 515916 515067 514320 514333 514219 513063 511673 511705 513522 516008 518226 520246 522403 524698 527187
51420 527187 530179 533652 536919 539286 540779 541941 542988 543437 542612 540433 537575 534783 532198 529554 526932
51405 526932 524845 523338 521405 517745 512055 505350 499127 494489 491897 491236 491903 493091 494171 494767 494508
51390 494508 493108 490830 488546 487026 486451 487010 489668 495449 503803 512583 520361 528218 538409 551437
51376 551437 565301 577440 586484 592168 595029 596824 599981 605255 610394 612226 609861 604982 599344 593177
51362 593177 586015 577979 569805 562452 556941 553826 552437 551234 549226 546540 543511 540065 536378 533227
51348 533227 531049 529297 527488 526306 526755 528579 530429 531551 532491 534166 537030 541240 546779 552983 558623
51333 558623 563020 566749 570776 575252 579735 584297 589662 596197 603575 611801 621895 634869 650412
51320 650412 667506 686386 708994 736983 769793 805196 841421 878232 916176 955373 994932
51309 994932 1032927 1066907 1094896 1116219 1131155 1139764 1141362 1135196 1121314 1100550 1073841 1041757
51297 1041757 1004764 963952 921391 879470 839761 802808 768992 738882 712304 687761 663774
51286 663774 640554 619501 601221 585024 570395 557737 547229 537975 529053 520731 513861 508510
51274 508510 503953 499718 495917 492639 489658 486719 483697 480566 477578 475399 474617 475079 476053 476983 477691
51259 477691 477858 476795 474137 470554 467361 465258 463676 461582 458772 455938 453469 450924 448130 446103
51245 446103 445935 447128 448131 448472 449159 450739 452236 452674 452617 453241 454774 456825 459447 462538 464676 464132
51229 464132 461177 458138 456871 457218 458225 459699 461784 463911 465228 465848 466926 469515 473724 478791 483472
51214 483472 486492 487215 486080 484157 482159 480062 477673 475260 473433 472528 472316 472283 472046 471464 470624 469882
51198 469882 469761 470442 471264 471074 469222 466199 463236 461483 461438 462702 464070 464330 463422 462555 462738 463430 463151
51181 463151 461411 459477 459058 460552 462839 464586 465585 466806 469147 472154 474178 473955 471850 469352 467662
51166 467662 467148 467944 470297 474012 477992 480857 482115 482595 483612 485704 488221 490235 491665 493102 494595
51151 494595 495286 494644 493472 493031 493595 494594 495870 497749 499951 501588 502611 504300 507620 511689 514542
51136 514542 515026 513510 511147 509006 507624 506906 506670 507449 510170 514488 518203 519265 518030 516572 516078
51121 516078 516032 515821 515708 515807 515354 513814 511798 509987 507886 504640 500659 497323 495254 493821 492333 490743
51105 490743 489052 486956 484549 482753 482613 484437 487717 491436 494367 495764 496082 496501 497473 498282 498323 498040
51089 498040 498093 498305 498162 497789 497590 497378 496774 496194 496463 497574 498734 499623 500622 501765 502406 502229 501815 501864
51071 501864 502533 503664 504967 505841 505958 506224 508133 511713 515199 517353 519036 521661 525183 528809 532701
51056 532701 537381 541925 544504 544875 544946 546538 549719 553623 557670 561302 563573 563977 563374 563360 564855 567662
51040 567662 571022 574160 576481 577737 578186 578530 579668 582207 585876 589519 592056 593422 594179 594471 594055
51025 594055 593235 592882 593222 593421 592792 591795 591450 592261 594086 596412 598292 598652 597402 595811 595112 595088 594732
51008 594732 593946 593726 594787 596763 598801 600238 600690 600217 599695 600554 603838 609722 617902 627826 638377
50993 638377 647945 655391 660862 665429 670134 675566 682054 689745 698328 707001 715045 722524 730241 738778
50979 738778 747679 755844 762612 767941 771600 773007 772351 771094 770513 770142 768473 764759 759123 751376 741369
50964 741369 730568 721514 714858 708368 700064 691242 685046 682841 683449 685385 688090 691106 693858 696645
50950 696645 700409 705016 709126 712411 716428 722265 728561 733272 736565 740369 745476 750779 755506 760660
50936 760660 767532 775872 784331 792137 799580 807215 815324 824075 833601 843623 853193 861169 867197 872269
50922 872269 877963 884946 892455 899405 905514 910826 914706 916351 916153 915376 914150 910893 904424 895889 887690
50907 887690 881026 875336 869830 864531 859870 856150 853716 852954 853793 855710 858609 863321 870800 880994
50893 880994 892839 905276 918060 931805 947562 966336 988571 1013844 1041243 1070222 1101025
50882 1101025 1134105 1169363 1206341 1245076 1286096 1329151 1372338 1413084 1449932 1482938 1512484
50871 1512484 1538369 1560125 1577619 1590993 1600563 1607125 1611834 1615087 1615606 1611177 1600453 1583972 1563549
50858 1563549 1540998 1517397 1493261 1469025 1445038 1421022 1395984 1369330 1342011 1316018 1292593
50847 1292593 1271546 1252378 1235240 1220301 1206956 1194385 1182423 1171120 1159943 1148232 1136184
50836 1136184 1124571 1113747 1103712 1094852 1087545 1081112 1074284 1066890 1060051 1054462 1049566 1044821 1040645
50823 1040645 1037399 1034426 1031133 1028324 1027273 1027745 1027957 1026467 1023351 1019690 1016756 1015614 1016463 1018083 1018734
50808 1018734 1018018 1017248 1017722 1019362 1021557 1024563 1029253 1035830 1043570 1051663 1059671 1067307 1074533 1081937 1090380
50793 1090380 1100162 1111039 1123006 1136298 1150501 1164560 1178095 1192015 1207345 1224042 1241415
50782 1241415 1259025 1276692 1294561 1313877 1336733 1363842 1393321 1423085 1453691 1487095 1523185
50771 1523185 1559918 1597165 1637970 1684961 1737436 1793280 1851975 1914221 1980159 2049871 2124392
50760 2124392 2203964 2285954 2366678 2444967 2521954 2597575 2669559 2735968 2796369 2849689 2893096
50749 2893096 2924473 2944711 2956173 2959725 2954438 2939543 2915570 2883941 2846412 2804956 2761782 2719512
50737 2719512 2681090 2648605 2621895 2599203 2579706 2564708 2556000 2553987 2557983 2567369 2581591 2599903
50725 2599903 2622086 2648750 2679824 2713151 2745620 2775373 2802077 2825514 2845141 2860909 2873273
50714 2873273 2882131 2886619 2886217 2881365 2872647 2859789 2841557 2816261 2782508 2740220 2691039 2637110
50702 2637110 2579269 2517004 2450385 2381407 2312960 2246785 2182797 2120207 2058964 2000182 1945411
50691 1945411 1895527 1850269 1808942 1771540 1738969 1711994 1690110 1671732 1655668 1642211 1632517
50680 1632517 1626889 1624129 1622947 1623641 1627776 1636184 1647961 1661565 1676304 1692319 1709585 1727550 1745688
50667 1745688 1764051 1783230 1803770 1825452 1847185 1867888 1887476 1906569 1925330 1943252 1960107
50656 1960107 1976313 1992160 2007622 2023311 2040597 2059994 2080340 2100575 2121742 2146111 2174776
50645 2174776 2207245 2243087 2282672 2326161 2372918 2422243 2473898 2527597 2582619 2638118 2693207
50634 2693207 2746569 2796690 2842758 2884875 2923244 2957709 2988344 3015958 3041819 3067273 3093782
50623 3093782 3122844 3155483 3191943 3231818 3274199 3317937 3362422 3408223 3456537 3508160 3563646
50612 3563646 3624428 3692871 3770795 3858413 3954744 4058362 4167424 4279684 4393008 4505597
50602 4505597 4615549 4720871 4820269 4913560 5001104 5083348 5161013 5234825 5304414 5367988 5423640
50591 5423640 5470557 5508641 5537676 5557737 5569953 5575968 5576747 5572635 5564603 5554839 5545941 5539792 5537114
50578 5537114 5537695 5541055 5547154 5556382 5568652 5582703 5596535 5608254 5616215 5618858 5615139 5605010 5588829
50565 5588829 5566383 5537195 5501825 5461989 5418763 5370947 5315698 5250884 5176884 5096467 5013391
50554 5013391 4931195 4853044 4782021 4720706 4670023 4628828 4595216 4568190 4547684 4533015 4521794
50543 4521794 4510493 4495760 4475077 4446605 4408814 4360511 4301384 4232576 4156271 4074105 3986173
50532 3986173 3892287 3794168 3695523 3599546 3507157 3418207 3333561 3254944 3183079 3117212 3056708
50521 3056708 3002193 2954739 2914589 2881196 2854164 2833684 2820185 2813772 2813736 2818580 2826967 2838883
50509 2838883 2855361 2876748 2901729 2928558 2956700 2986583 3018238 3051204 3085689 3122820 3163534
50498 3163534 3208071 3256867 3311162 3372200 3440375 3515725 3598757 3690168 3789999 3897592 4012175
50487 4012175 4133032 4259221 4389470 4522226 4655501 4787097 4915752 5042279 5169228
50478 5169228 5299295 5434029 5573720 5717975 5866321 6018645 6175273 6336485 6501771
50469 6501771 6669624 6838175 7006342 7174675 7344864 7517918 7692735 7866948 8039177
50460 8039177 8209673 8378367 8543029 8699786 8844613 8973508 9082092 9166526 9224770 9255802
50450 9255802 9257612 9227284 9163573 9068568 8946343 8800620 8634224 8450112 8252271 8045930
50440 8045930 7837272 7632545 7436885 7254043 7087331 6940408 6816602 6717524 6642431 6588809
50430 6588809 6553450 6533173 6524448 6522090 6518653 6505901 6477332 6429168 6359351 6266796 6152144 6018331
50418 6018331 5869418 5708886 5539413 5363634 5184184 5002982 4821149 4639838 4460858
50409 4460858 4286368 4118234 3957697 3805444 3661892 3527404 3402140 3285732 3177441
50400 3177441 3076767 2983714 2898358 2820467 2749824 2686649 2631338 2583791 2543118 2507901 2476807
50389 2476807 2449276 2425808 2407275 2393809 2384572 2378634 2375563 2374967 2376174 2378997 2384533 2394479 2409652
50376 2409652 2429431 2452491 2477643 2504208 2532296 2562915 2597301 2635799 2677595 2721724 2768177
50365 2768177 2817843 2871525 2929237 2990468 3054898 3122636 3193914 3268973 3348430 3433334 3524362
50354 3524362 3621126 3722721 3828776 3939453 4054463 4172800 4293442 4415457 4537123 4655836
50344 4655836 4769609 4878079 4981281 5077844 5165238 5241594 5306383 5359192 5398565 5422365 5428846
50333 5428846 5417079 5386593 5337020 5268276 5181207 5078089 4962484 4838627 4711015 4584045
50323 4584045 4461156 4344005 4233151 4129915 4036927 3956302 3887999 3830839 3784535 3749510
50313 3749510 3724869 3707770 3694944 3683693 3671070 3653325 3627230 3591482 3546102 3491026 3426296
50302 3426296 3353422 3275427 3195092 3113545 3030624 2946002 2859742 2772520 2685960 2602375 2523287
50291 2523287 2448152 2375196 2303693 2234804 2169895 2108756 2050119 1993563 1940125 1891099 1846852
50280 1846852 1806817 1770031 1735523 1702700 1671662 1643029 1617457 1595440 1577054 1561250 1545735
50269 1545735 1528592 1510141 1492483 1477244 1464735 1455186 1449200 1446252 1444109 1441041 1437885 1436864 1438951
50256 1438951 1443516 1450050 1458863 1470116 1483409 1498597 1516173 1536475 1558863 1581712 1602889 1620661
50244 1620661 1634787 1646606 1657443 1667147 1674822 1680597 1685782 1691332 1697100 1702691 1708279 1714363 1721249
50231 1721249 1728800 1736237 1742294 1746164 1748240 1749473 1750354 1751310 1753677 1759279 1769185 1783843 1803996 1829676
50217 1829676 1857693 1881370 1893947 1892326 1877901 1854953 1828564 1802788 1779615 1759503 1742683
50206 1742683 1729291 1718516 1709001 1700523 1694183 1690476 1688260 1686244 1684482 1683699 1684166 1685981 1689444 1694171
50192 1694171 1698767 1702511 1706629 1712638 1720012 1726795 1732250 1737612 1744289 1752484 1761789 1772137 1783842
50179 1783842 1797207 1812300 1828785 1846060 1863931 1882890 1903484 1925974 1951180 1980846 2016137
50168 2016137 2056260 2099741 2146753 2199022 2257670 2322563 2393718 2471658 2555836 2643996 2733717
50157 2733717 2823354 2910693 2992097 3064606 3128488 3186553 3241055 3292134 3338904 3380659 3416517
50146 3416517 3444573 3461886 3465097 3451180 3418299 3366443 3297085 3212156 3113685 3004484 2888672
50135 2888672 2771015 2655786 2546197 2444372 2351239 2266506 2189252 2118727 2054412 1995441
50125 1995441 1940449 1888155 1837848 1789380 1743220 1700534 1662394 1628421 1596845 1566566 1538543
50114 1538543 1514241 1493317 1474167 1456554 1442105 1431774 1424142 1417069 1409912 1403270 1397469 1392528
50102 1392528 1388976 1387429 1387578 1388658 1390758 1394584 1399969 1405666 1410887 1416224 1422819 1431298 1441764 1454158
50088 1454158 1468203 1483346 1498947 1514364 1529053 1543076 1557401 1573001 1589642 1606120 1621694
50077 1621694 1636634 1651455 1666519 1682490 1700168 1719427 1739168 1758892 1779704 1803182 1829806
50066 1829806 1858988 1889986 1922026 1954104 1985743 2017948 2052667 2091141 2133314 2178894 2228507
50055 2228507 2283516 2344957 2412819 2486319 2564872 2649024 2740567 2841821 2954777 3080599 3219378
50044 3219378 3370130 3531173 3700554 3875761 4053032 4227540 4394897 4552622 4700429
50035 4700429 4839603 4972165 5099745 5222353 5337938 5443008 5533190 5603165 5646978 5659431
50025 5659431 5637413 5580084 5488677 5366660 5219239 5051505 4867218 4670131 4465943 4261457
50015 4261457 4061527 3867918 3681501 3504414 3339248 3187023 3047078 2918698 2801918
50006 2801918 2696728 2602285 2517177 2440068 2369964 2306095 2247724 2194094 2144721 2099862 2060210
49995 2060210 2025629 1994408 1964487 1935466 1908651 1884893 1863122 1841571 1819772 1798501 1778148
49984 1778148 1758297 1739010 1721347 1706060 1692613 1680286 1669591 1661529 1655713 1650293 1643915 1637054
49972 1637054 1631324 1628173 1628232 1630970 1634625 1637394 1639276 1642030 1646711 1652019 1655953 1658386 1660842 1664075
49958 1664075 1667099 1668666 1668505 1666879 1663965 1660230 1656572 1653522 1650856 1648502 1647222 1647872 1650492 1654665
49944 1654665 1660195 1666786 1673706 1680808 1689598 1702112 1718696 1738011 1759573 1785209 1817169 1855521
49932 1855521 1898379 1944430 1994297 2049440 2110558 2177455 2249813 2327610 2411058 2500501 2595984
49921 2595984 2696251 2798123 2897348 2990377 3075364 3151721 3219315 3278423 3330131 3376264 3418553
49910 3418553 3457535 3491666 3517223 3529253 3523088 3495294 3443706 3367493 3267976 3149267 3017511
49899 3017511 2879015 2738895 2600907 2467787 2341501 2223471 2114743 2015857 1926686 1846852
49889 1846852 1776373 1715495 1663811 1620007 1582718 1551117 1524361 1500908 1479011 1457671 1436619
49878 1436619 1415586 1394316 1373309 1353861 1336878 1321866 1307322 1291959 1275420 1258051 1240286
49867 1240286 1222227 1203709 1184836 1166476 1149953 1135964 1123830 1112093 1100030 1088517 1079286
49856 1079286 1073298 1069870 1067407 1064974 1063041 1062700 1064289 1066908 1069216 1070518 1071088 1071647 1072697 1074330 1076570
49841 1076570 1079752 1084437 1090837 1098380 1106051 1113294 1120518 1128569 1137699 1147077 1155323 1161342 1164655 1165176
49827 1165176 1163174 1159543 1155593 1151986 1147849 1141480 1132168 1121027 1109730 1098746 1087287 1074808 1061981
49814 1061981 1049981 1039266 1029470 1020263 1011797 1004257 997456 991279 986279 983177 981700 980500 978735
49801 978735 977291 977767 980517 984530 989247 995419 1003696 1013337 1023210 1033388 1044670 1056836 1068570
49788 1068570 1079126 1088991 1098580 1107303 1114502 1120583 1126475 1132357 1137478 1140998 1142541 1142140 1140003 1136170
49774 1136170 1130232 1121767 1111461 1101375 1093534 1088329 1084658 1081376 1078283 1075888 1074711 1074666 1074785 1073835
49760 1073835 1071661 1069708 1069706 1071964 1075469 1079372 1083673 1088583 1094110 1100473 1108073 1116663 1125110 1132487 1138972
49745 1138972 1145272 1151539 1157262 1161837 1164698 1165198 1163095 1159134 1154554 1149810 1144198 1136945 1128262 1118915
49731 1118915 1109035 1098048 1086065 1074870 1066718 1061920 1058115 1052455 1044316 1035437 1027604 1020982 1014911
49718 1014911 1009543 1005858 1004284 1003980 1003699 1002917 1001944 1001325 1001542 1003143 1006666 1012177 1019165 1027131 1036071
49703 1036071 1045982 1056041 1064892 1072023 1078289 1084577 1090387 1094467 1096661 1098279 1100503 1103156 1105277 1106097
49689 1106097 1104894 1100702 1093191 1083688 1074419 1066632 1060125 1054632 1050785 1049175 1049135 1049286 1049048 1048837 1048776 1048071
49673 1048071 1046088 1043477 1041499 1040487 1039738 1039033 1039473 1042256 1047067 1052432 1057605 1063442 1071080 1080237 1089350
49658 1089350 1097346 1104779 1112957 1122284 1132039 1141848 1152676 1165566 1179592 1191936 1200402 1205205 1207841
49645 1207841 1208837 1207466 1203337 1197228 1190247 1183009 1176026 1170235 1166548 1165064 1165030 1165506 1165978 1166383 1166566 1165691
49629 1165691 1162661 1157624 1152722 1150462 1151247 1153263 1154878 1156283 1158502 1161785 1165792 1170669 1177083 1185371
49615 1185371 1195260 1206213 1217667 1229310 1241623 1255635 1271391 1286821 1298764 1305174 1306140 1303310
49603 1303310 1298975 1295250 1293138 1292173 1291485 1291192 1292377 1295861 1301409 1307598 1311701 1310197 1300809 1284553
49589 1284553 1265092 1245805 1227904 1211187 1195427 1180660 1167041 1155121 1145685 1138798 1133496 1128997
49577 1128997 1125826 1125165 1127282 1131020 1134654 1136989 1137908 1138181 1138594 1139059 1138889 1137960 1137047 1136618 1135904 1133777
49561 1133777 1130183 1126092 1122204 1118401 1114518 1111076 1108968 1108626 1109603 1110894 1111769 1112434 1113773 1116294 1119640
49546 1119640 1123392 1128044 1134547 1142882 1151594 1159012 1164745 1169819 1175498 1182131 1189079 1195608 1201669 1207716
49532 1207716 1213914 1219879 1225224 1229976 1234250 1237924 1241105 1244637 1249501 1255592 1261639 1266617 1270894 1275557
49518 1275557 1280790 1285416 1288229 1289475 1290698 1293263 1297374 1302532 1308404 1314872 1321574 1328062 1334468 1341496
49504 1341496 1349534 1358137 1366616 1374794 1382908 1391053 1399127 1407151 1415120 1422439 1427866 1430356 1429971 1427743
49490 1427743 1424549 1420233 1414026 1405827 1396717 1388179 1381211 1376514 1374906 1376649 1380431 1383884 1385476 1385423
49476 1385423 1384731 1384131 1384209 1385688 1388824 1392989 1397545 1402817 1409596 1418037 1427768 1438931 1452337 1468545
49462 1468545 1487350 1508278 1531048 1555354 1580598 1605925 1630211 1651926 1669524 1682444 1691724
49451 1691724 1699388 1707031 1714799 1721731 1727111 1731400 1735619 1740019 1743880 1746480 1747365 1745350 1738269 1724741
49437 1724741 1705797 1684029 1661435 1638826 1616768 1595846 1576023 1556876 1538774 1522859 1509545
49426 1509545 1497822 1486483 1475423 1465342 1456810 1450018 1444871 1440820 1437050 1433244 1429777 1426907 1424345
49413 1424345 1422002 1420376 1419476 1417899 1413988 1407931 1401887 1397812 1395618 1393697 1390932 1387792 1385470 1384129
49399 1384129 1382419 1379032 1374554 1371143 1370215 1370993 1371733 1371746 1371483 1370973 1369158 1365107 1359272 1353002 1347043 1340980
49383 1340980 1334154 1326670 1319250 1312493 1306794 1302822 1301188 1301348 1301592 1300843 1299907 1300215 1301847 1303876 1306214
49368 1306214 1309749 1314623 1319928 1325485 1332564 1342175 1353936 1367389 1383070 1401176 1420447 1439748
49356 1439748 1459647 1480569 1500179 1514666 1522663 1526153 1527523 1527542 1526555 1525775 1526397 1528718 1533059 1540617
49342 1540617 1552506 1568773 1588903 1612325 1637671 1662498 1684877 1704727 1722908 1739800 1755676
49331 1755676 1771543 1788152 1804543 1818942 1831097 1842473 1853991 1864644 1872616 1876810 1877023 1873702
49319 1873702 1868139 1862032 1856041 1849257 1840803 1831482 1823019 1816005 1809674 1803806 1799801 1799243 1802043 1806697
49305 1806697 1811917 1817166 1821927 1825668 1828854 1832869 1838189 1843350 1846641 1848296 1849963 1852320 1854354 1854964
49291 1854964 1854087 1852097 1849348 1846795 1845908 1847182 1849587 1852253 1855808 1861119 1867613 1874155 1881034 1889535
49277 1889535 1899571 1909159 1916542 1921694 1925309 1927302 1927042 1924363 1919679 1913471 1906250 1898789 1891918 1886102
49263 1886102 1881314 1877110 1872792 1867917 1862826 1858373 1854967 1852239 1849749 1847520 1845562 1843343 1840243 1836422
49249 1836422 1832858 1830596 1830094 1831082 1832735 1834108 1834763 1835158 1836371 1839388 1844484 1851067 1858129 1865080 1872154
49234 1872154 1879865 1888181 1896645 1905235 1914618 1925368 1937369 1950194 1963718 1978056 1993216 2009046
49222 2009046 2025259 2041265 2056319 2070125 2083087 2095585 2107297 2117609 2126654 2135518 2145277 2155846
49210 2155846 2165639 2172276 2173786 2169407 2159468 2144809 2126644 2106712 2086818 2067863 2049638 2031769
49198 2031769 2014525 1998594 1984521 1972580 1962739 1954591 1947849 1943161 1941712 1943639 1947712 1953189 1960911
49185 1960911 1971231 1981404 1986706 1984348 1975212 1961555 1944415 1923845 1900527 1875899 1851014 1826081
49173 1826081 1801154 1776839 1754399 1735293 1720334 1708997 1699800 1691598 1684362 1678730 1675194 1673743
49161 1673743 1673763 1674075 1673620 1672358 1671002 1669651 1667429 1663887 1659964 1656855 1654524 1652152 1649554 1647223 1645235
49146 1645235 1643091 1640573 1638008 1635859 1634854 1636199 1640550 1646860 1653461 1660342 1668911 1679147 1688675 1695732
49132 1695732 1701662 1709001 1718028 1726909 1734766 1742734 1751840 1761502 1770752 1779650 1788790 1798382 1808564 1819735
49118 1819735 1831748 1843421 1853803 1863507 1873900 1885435 1897774 1911424 1928141 1949436 1975424
49107 1975424 2005418 2038844 2074855 2111269 2144405 2170162 2185558 2189937 2185330 2175645 2164957 2155854
49095 2155854 2148662 2141883 2133680 2123581 2112912 2103356 2095126 2086974 2077943 2068553 2059991 2052709 2046287
49082 2046287 2040377 2035235 2031365 2029135 2028833 2030750 2034979 2041299 2049374 2059053 2070457 2083882 2099591
49069 2099591 2117428 2136523 2155722 2174737 2194737 2217137 2241590 2265894 2288571 2311039 2336203
49058 2336203 2365021 2395686 2426417 2457657 2490672 2525334 2560925 2598556 2640992 2689965 2745134
49047 2745134 2805965 2873263 2948330 3032082 3125831 3231368 3348094 3469962 3587086 3692195
49037 3692195 3786297 3877508 3972457 4066703 4143322 4183007 4177936 4136705 4076067 4008297 3935693
49026 3935693 3854333 3760636 3654990 3541742 3427191 3317051 3214924 3122564 3040723 2969241
49016 2969241 2907036 2853017 2806874 2768381 2736443 2709649 2687315 2668940 2653045 2637802 2622787
49005 2622787 2609075 2597640 2588675 2582255 2578300 2575803 2573483 2571587 2571839 2575181 2580735 2587471 2595592 2605595
48991 2605595 2617128 2629676 2643347 2658007 2672594 2686480 2700786 2717071 2735203 2753792 2772413
48980 2772413 2792010 2813107 2835006 2857179 2880364 2905514 2932365 2959824 2987477 3015934 3045601
48969 3045601 3075701 3104813 3132009 3157070 3179918 3200648 3220268 3240422 3261681 3282735 3302096
48958 3302096 3320077 3337943 3355695 3372432 3389014 3408420 3432490 3459695 3487384 3515117 3544400
48947 3544400 3575814 3608002 3639417 3669854 3700138 3731230 3763698 3797354 3831164 3863953 3895142
48936 3895142 3924498 3951593 3976083 3998150 4018048 4035608 4050933 4065144 4079488 4093837 4106960
48925 4106960 4118147 4127730 4136175 4143698 4150800 4158147 4165704 4172771 4179002 4184512 4188911 4191395 4192329 4193757
48911 4193757 4197519 4203321 4209284 4214006 4217458 4220158 4222134 4222819 4221756 4219396 4217261 4217064 4219404 4223261
$$ [...]
##END NTUPLES=NMR SPECTRUM
##END=
