
##TITLE=AC1003_Arabica_6279629_PtdVFPNt5I
##JCAMPDX= 6.0         $$ Bruker NMR JCAMP-DX V2.0
##DATA TYPE= NMR SPECTRUM
##DATA CLASS= NTUPLES
##ORIGIN= BRUKER
##OWNER= Administrator
$$ 1.72 TOPSPIN		Version 2.1
$$ 2012-06-03 19:08:46.906 -0500  Administrator@TOPSPIN
$$ Compression mode = diff/dup
##.OBSERVE FREQUENCY= 400.13188235
##.OBSERVE NUCLEUS= ^1H
##.ACQUISITION MODE= SIMULTANEOUS (DQD)
##.ACQUISITION SCHEME= undefined
##.AVERAGES= 64
##.DIGITISER RES= 22
##SPECTROMETER/DATA SYSTEM= spect
##.PULSE SEQUENCE= noesygpps1d.comp
##.SOLVENT NAME= COFFEE_meoh
##.SHIFT REFERENCE= INTERNAL, COFFEE_meoh, 1, 14.96706
##AUDIT TRAIL= $$ (NUMBER, WHEN, WHO, WHERE, PROCESS, VERSION, WHAT)
$$ ##TITLE= Audit trail, TOPSPIN		Version 2.1
$$ ##JCAMPDX= 5.01
$$ ##ORIGIN= Bruker BioSpin GmbH
$$ ##OWNER= Administrator
$$ $$ C:\Bruker\TOPSPIN/data/COFFEE/nmr/AC1003_Arabica_6279629_PtdVFPNt5I/12/pdata/1/auditp.txt
$$ ##AUDIT TRAIL=  $$ (NUMBER, WHEN, WHO, WHERE, PROCESS, VERSION, WHAT)
(   1,<2012-06-03 19:08:41.796 -0500>,<Administrator>,<TOPSPIN>,<go>,<TOPSPIN 2.1>,
      <created by zg
	started at 2012-06-03 18:57:10.078 -0500,
	POWCHK enabled, PULCHK disabled,
       configuration hash MD5:
       D5 CA 7A 23 FE 6B EE E2 50 67 74 61 24 F7 5E 3B
       data hash MD5: 64K
       01 2E 2B FA 6A BC 8D B2 1C 6B 09 C6 BF 52 FC AA>)
(   2,<2012-06-03 19:08:44.718 -0500>,<Administrator>,<TOPSPIN>,<proc1d>,<TOPSPIN 2.1>,
      <Start of raw data processing
       efp LB = 0.3 FT_mod = 6 PKNL = 1 PHC0 = 0 PHC1 = 0 SI = 128K 
       data hash MD5: 128K
       24 E5 4B 7E 53 FA 89 18 F6 19 92 6D 20 E4 45 B6>)
(   3,<2012-06-03 19:08:45.875 -0500>,<Administrator>,<TOPSPIN>,<proc1d>,<TOPSPIN 2.1>,
      <pk PHC0 = 30.26184 PHC1 = 0 
       data hash MD5: 128K
       AE A2 88 83 13 62 E0 7F 51 8D 94 E9 3E F2 AD 14>)
(   4,<2012-06-03 19:08:46.562 -0500>,<Administrator>,<TOPSPIN>,<proc1d>,<TOPSPIN 2.1>,
      <abs ABSG = 1 
       data hash MD5: 128K
       8B 8C E2 20 A7 D6 09 10 FF 25 CF 50 6B 19 3C AE>)
(   5,<2012-06-03 19:08:46.640 -0500>,<Administrator>,<TOPSPIN>,<proc1d>,<TOPSPIN 2.1>,
      <abs ABSG = 2 
       data hash MD5: 128K
       B3 EB 35 B6 8B 4E 0F FE 57 31 E3 A8 07 99 08 D1>)
(   6,<2012-06-03 19:08:46.687 -0500>,<Administrator>,<TOPSPIN>,<proc1d>,<TOPSPIN 2.1>,
      <abs ABSG = 3 
       data hash MD5: 128K
       9D 14 AD 18 C8 49 02 CC 3A BC 3D 9C 6C B3 30 92>)
(   7,<2012-06-03 19:08:46.750 -0500>,<Administrator>,<TOPSPIN>,<proc1d>,<TOPSPIN 2.1>,
      <abs ABSG = 4 
       data hash MD5: 128K
       C6 9E C5 20 CF BF 65 8F 8A F7 A9 09 02 27 6F 4D>)
(   8,<2012-06-03 19:08:46.812 -0500>,<Administrator>,<TOPSPIN>,<proc1d>,<TOPSPIN 2.1>,
      <abs ABSG = 5 
       data hash MD5: 128K
       EC 0C D7 B6 17 74 13 31 33 6C E7 3E AB BB 8C FF>)
$$ ##END=
$$ 
$$ $$ hash MD5
$$ $$ 4D CB A2 95 CE 76 8A EE 01 3C 67 CF B7 2D FD A1
##$RELAX= 
##$RELAX= 
##$RELAX= 
##$RELAX= 
##$RELAX= 
##$RELAX= 
##$RELAX= 
##$RELAX= 
$$ Bruker specific parameters
$$ [...]
##$TP07= 0
##$TPNAME0= <>
##$TPNAME1= <>
##$TPNAME2= <>
##$TPNAME3= <>
##$TPNAME4= <>
##$TPNAME5= <>
##$TPNAME6= <>
##$TPNAME7= <>
##$TPOAL= (0..7)
0.5 0.5 0.5 0.5 0.5 0.5 0.5 0.5
##$TPOFFS= (0..7)
0 0 0 0 0 0 0 0
##$TUNHIN= 0
##$TUNHOUT= 0
##$TUNXOUT= 0
##$USERA1= <user>
##$USERA2= <user>
##$USERA3= <user>
##$USERA4= <user>
##$USERA5= <user>
##$V9= 5
##$VALIST= <valist>
##$VCLIST= <CCCCCCCCCCCCCCC>
##$VD= 0
##$VDLIST= <DDDDDDDDDDDDDDD>
##$VPLIST= <PPPPPPPPPPPPPPP>
##$VTLIST= <TTTTTTTTTTTTTTT>
##$WBST= 2048
##$WBSW= 25
##$XGAIN= (0..3)
0 0 0 0
##$XL= 0
##$YL= 0
##$YMAX_a= 10726033
##$YMIN_a= -6954129
##$ZGOPTNS= <>
##$ZL1= 120
##$ZL2= 120
##$ZL3= 120
##$ZL4= 120
##$ABSF1= 14.96706
##$ABSF2= -5.58547
##$ABSG= 5
##$ABSL= 3
##$ALPHA= 0
##$AQORDER= 0
##$ASSFAC= 0
##$ASSFACI= 0
##$ASSFACX= 0
##$ASSWID= 0
##$AUNMP= <proc_prof1d_extract.lims>
##$AXLEFT= 0
##$AXNAME= <>
##$AXNUC= <1H>
##$AXRIGHT= 0
##$AXTYPE= 0
##$AXUNIT= <>
##$AZFE= 0.1
##$AZFW= 0.1
##$BCFW= 0
##$BC_mod= 0
##$BYTORDP= 0
##$COROFFS= 0
##$CY= 15
##$DATMOD= 1
##$DC= 0
##$DFILT= <>
##$DTYPP= 0
##$F1P= 0
##$F2P= 0
##$FCOR= 0.5
##$FTSIZE= 131072
##$FT_mod= 6
##$GAMMA= 0
##$GB= 0
##$INTBC= 1
##$INTSCL= 1
##$ISEN= 128
##$LB= 0.3
##$LEV0= 0
##$LPBIN= 0
##$MAXI= 10000
##$MC2= 0
##$MEAN= 0
##$ME_mod= 0
##$MI= 0
##$NCOEF= 0
##$NC_proc= -3
##$NLEV= 6
##$NOISF1= 0
##$NOISF2= 0
##$NSP= 0
##$NTH_PI= 0
##$NZP= 0
##$OFFSET= 14.96706
##$PC= 1
##$PHC0= 30.26184
##$PHC1= 0
##$PH_mod= 1
##$PKNL= yes
##$PPARMOD= 0
##$PPDIAG= 0
##$PPIPTYP= 0
##$PPMPNUM= 2147483647
##$PPRESOL= 1
##$PSCAL= 4
##$PSIGN= 0
##$PYNMP= <proc.py>
##$REVERSE= no
##$SF= 400.130005422379
##$SI= 131072
##$SIGF1= 0
##$SIGF2= 0
##$SINO= 400
##$SIOLD= 131072
##$SPECTYP= <>
##$SREGLST= <1H.CDCl3>
##$SSB= 0
##$STSI= 131072
##$STSR= 0
##$SW_p= 8223.68421052632
##$SYMM= 0
##$S_DEV= 0
##$TDeff= 65536
##$TDoff= 0
##$TI= <>
##$TILT= no
##$TM1= 0
##$TM2= 0
##$TOPLEV= 0
##$USERP1= <user>
##$USERP2= <user>
##$USERP3= <user>
##$USERP4= <user>
##$USERP5= <user>
##$WDW= 1
##$XDIM= 131072
##$YMAX_p= 515284722
##$YMIN_p= -545132576
##$CURPLOT= <Network HP LaserJet P1505>
##$CURPRIN= <$Network HP LaserJet P1505>
##$DFORMAT= <normdp>
##$LAYOUT= <+/1D_H.xwp>
##$LFORMAT= <normlp>
##$PFORMAT= <normpl>
##$SURQMSG= 1
$$ End of Bruker specific parameters
$$ ---------------------------------
##NTUPLES= NMR SPECTRUM
##VAR_NAME=  FREQUENCY,     SPECTRUM/REAL,   SPECTRUM/IMAG
##SYMBOL=    X,             R,               I
##VAR_TYPE=  INDEPENDENT,   DEPENDENT,       DEPENDENT
##VAR_FORM=  AFFN,          ASDF,            ASDF
##VAR_DIM=   131072,        131072,          131072
##UNITS=     HZ,            ARBITRARY UNITS, ARBITRARY UNITS
##FACTOR=    0.0627417313425165, 1,          1
##FIRST=     8223.62146879498, 7347,         -110493
##LAST=      0,             8340,            -109873
##MIN=       0,             -545132576,      0
##MAX=       8223.62146879498, 515284722,    0
$$ Real data points
##PAGE= N=1
##DATA TABLE= (X++(R..R)), XYDATA
$$ [...]
62386A381015j1737q840n590k891p36J674M604P233Q321P261M624J640j069m095
62372A381414q038j2053j4511j5212j5640j6695j7411j6855j6013j6402j7635
62361A214949j7947j6831j5503j4781j4127j3128j2434j2508j2553j1577r752
62350A063808q026o934o432o287n996m865k871r67N2N56J378K572L551M028M091
62335A037658L737L142L053M011N346N839N366N021N593O730P807Q767R808J1001
62321A122879J2573J4813J7193J8216J6983J4634J3524J4873J7751K0402K2183
62310A306024K3942K6650L0043L2877L4561L6175L9533M5259N2149N8435O3309
62299A748957O7120P0459P3453P5783P6986P6602P4113O8995O1104N1099M0238
$$ y = [1381015, 1369278, 1360438, 1354848, 1351957, 1351221, 1352895, 1357499, 1364732, 1373053, 1380314, 1384938, 1386578, 1385509, 1381414, 1373376, 1361323, 1346812, 1331600, 1315960, 1299265, 1281854, 1264999, 1248986, 1232584, 1214949, 1197002, 1180171, 1164668, 1149887, 1135760, 1122632, 1110198, 1097690, 1085137, 1073560, 1063808, 1055782, 1048848, 1042416, 1036129, 1030133, 1025268, 1022397, 1021430, 1021482, 1022038, 1023416, 1025988, 1029539, 1033567, 1037658, 1041395, 1044537, 1047590, 1051601, 1056947, 1062786, 1068152, 1073173, 1078766, 1085496, 1093303, 1102070, 1111878, 1122879, 1135452, 1150265, 1167458, 1185674, 1202657, 1217291, 1230815, 1245688, 1263439, 1283841, 1306024, 1329966, 1356616, 1386659, 1419536, 1454097, 1490272, 1529805, 1575064, 1627213, 1685648, 1748957, 1816077, 1886536, 1959989, 2035772, 2112758, 2189360, 2263473, 2332468, 2393572, 2444671, 2484909]
62288B484909K9518J9239R537R26o278j2794j9822k7549l4919m1009m5958n0087
62276B305713n2857n3421n1937m9669m7855m6791m5983m4755m2792m0296l7777
62265A791580l5666l4262l3846l4400l5196l5284l4612l4060l4064l3872l2803
62254A413515l1377l0280k8718k5243k0275j6480j5914j7535j8347j6631j3304
62243A179411j0281q244o532m701l373l064k883j419J103K849L032L262N187P826
62229A162173Q925Q328Q025Q931R730R531R613J1350J3956J5753J6512J7010J7329
62216A317166J7204J7317J8402J9599J9610J9334K1214K5689L0267L2792L3993
62205A572587L5800L8697M1988M5471M9363N3335N6992O0991O6228P2019P6204
$$ y = [2484909, 2514427, 2533666, 2543203, 2544129, 2537851, 2525057, 2505235, 2477686, 2442767, 2401758, 2355800, 2305713, 2252856, 2199435, 2147498, 2097829, 2049974, 2003183, 1957200, 1912445, 1869653, 1829357, 1791580, 1755914, 1721652, 1687806, 1653406, 1618210, 1582926, 1548314, 1514254, 1480190, 1446318, 1413515, 1382138, 1351858, 1323140, 1297897, 1277622, 1261142, 1245228, 1227693, 1209346, 1192715, 1179411, 1169130, 1160886, 1154354, 1149653, 1146280, 1143216, 1140333, 1138914, 1140017, 1142866, 1145898, 1149160, 1154347, 1162173, 1171098, 1179426, 1187451, 1196382, 1206112, 1215643, 1225256, 1236606, 1250562, 1266315, 1282827, 1299837, 1317166, 1334370, 1351687, 1370089, 1389688, 1409298, 1428632, 1449846, 1475535, 1505802, 1538594, 1572587, 1608387, 1647084, 1689072, 1734543, 1783906, 1837241, 1894233, 1955224, 2021452, 2093471, 2169675]
62194B169675P7273P5551P2078O7031N9646M9395L7033K4474J3419L957n171j4723
62182B629638k3945l1850l8852m6252n4313o1772o7308p0726p2467p2618p0783
62171B018752o6701o0848n4584m9555m6417m4052m0543l5150k9094k4350k1890
62160A545568k1134k0706j9518j7426j5054j3054j1451r779p690n350l312k057
62148A399037j470p42Q99L208N054N775N946O508P615Q781R696J0319J0581J0552
62134A481759J0588J0742J0528R969J0255J2220J4601J5142J3492J1759J1872
62123A612927J3417J4577J4323J3114J2003J1635J1867J2193J2691J4231J7246
62112A760224K0790K3694K6273K9649L3635L6918L9338M2231M5827M8046M6950
$$ y = [2169675, 2246948, 2322499, 2394577, 2461608, 2521254, 2570649, 2607682, 2632156, 2645575, 2649532, 2644361, 2629638, 2605693, 2573843, 2534991, 2488739, 2434426, 2372654, 2305346, 2234620, 2162153, 2089535, 2018752, 1952051, 1891203, 1836619, 1787064, 1740647, 1696595, 1656052, 1620902, 1591808, 1567458, 1545568, 1524434, 1503728, 1484210, 1466784, 1451730, 1438676, 1427225, 1417446, 1409756, 1404406, 1401094, 1399037, 1397567, 1396825, 1397724, 1400932, 1405986, 1411761, 1417707, 1424215, 1431830, 1440611, 1450307, 1460626, 1471207, 1481759, 1492347, 1503089, 1513617, 1523586, 1533841, 1546061, 1560662, 1575804, 1589296, 1601055, 1612927, 1626344, 1640921, 1655244, 1668358, 1680361, 1691996, 1703863, 1716056, 1728747, 1742978, 1760224, 1781014, 1804708, 1830981, 1860630, 1894265, 1931183, 1970521, 2012752, 2058579, 2106625, 2153575]
62101B153575M3032L7877L1765K4035J5006O030j929q606j3799j7679k1378k6063
62089B221866l1456l6356m0393m4157m7581m9361m8408m5143m0957l6855l2982
62078A768217k9147k5531k2733k1093k0182j9345j8596j8339j8267j7510j6035
62067A541439j4748j3900j2585j0439q405o940m939j777J025J792J260J127J019
62054A473929p40l793n783n852n702o514p093o165m687m472n794p694r717j1947
62040A387976j3734j3727j1275p288l559j287q2J390L521N035M893M241N088P379
62026A368571R110R373R468J0460J1564J1959J2593J4738J7915K0638K2490K4109
62014A542988K5655K6637K7034K7513K8570L0037L1388L2152L2354L2802L4203
$$ y = [2153575, 2196607, 2234484, 2266249, 2290284, 2305290, 2311320, 2309391, 2300785, 2286986, 2269307, 2247929, 2221866, 2190410, 2154054, 2113661, 2069504, 2021923, 1972562, 1924154, 1879011, 1838054, 1801199, 1768217, 1739070, 1713539, 1690806, 1669713, 1649531, 1630186, 1611590, 1593251, 1574984, 1557474, 1541439, 1526691, 1512791, 1500206, 1489767, 1481362, 1474422, 1469483, 1467706, 1468731, 1470523, 1471783, 1472910, 1473929, 1473189, 1469396, 1463613, 1457761, 1452059, 1445545, 1438452, 1432287, 1427600, 1423128, 1417334, 1409640, 1399923, 1387976, 1374242, 1360515, 1349240, 1341952, 1338393, 1337106, 1337024, 1338414, 1341935, 1346970, 1351863, 1356104, 1361192, 1368571, 1377681, 1387054, 1396522, 1406982, 1418546, 1430505, 1443098, 1457836, 1475751, 1496389, 1518879, 1542988, 1568643, 1595280, 1622314, 1649827, 1678397, 1708434, 1739822, 1771974, 1804328, 1837130, 1871333]
62003A871333L5730L5368L2247K7538K2397J6219Q111r22q833j4974k0277k5380
61991A978557l0157l4866m0181m5778n0171n2504n3554n4491n5376n5338n3745
61980A452396n0910m7857m5492m3784m1835l9002l5584l2045k8203k3930k0173
61969A043581j8102j7455j6832j5648j4648j4275j3665j1904r322o941n283m384
61957H95122m378n197o021n848m724l829m068m838m516k235R25K802K422J199
61943H56816J455L785O405P228O026M151K622J257l20j778k598l024l697m537
61929H73791m816m527m796o366q271q927q153p246p170p697q373r225j0118j0323
61915G67783r370p754o280n252m678m521m355l486k056j307j953k999l011j906
$$ y = [1871333, 1907063, 1942431, 1974678, 2002216, 2024613, 2040832, 2048943, 2048021, 2039188, 2024214, 2003937, 1978557, 1948400, 1913534, 1873353, 1827575, 1777404, 1724900, 1671346, 1616855, 1561479, 1506141, 1452396, 1401486, 1353629, 1308137, 1264353, 1222518, 1183516, 1147932, 1115887, 1087684, 1063754, 1043581, 1025479, 1008024, 991192, 975544, 960896, 946621, 932956, 921052, 911730, 904789, 899506, 895122, 890744, 885547, 879526, 873678, 868954, 865125, 861057, 856219, 851703, 849468, 850393, 853195, 855617, 856816, 858271, 862056, 868461, 875689, 881715, 885866, 888488, 889745, 889425, 887647, 885049, 882025, 878328, 873791, 868975, 864448, 859652, 853286, 845015, 836088, 827935, 820689, 813519, 805822, 797449, 788224, 778106, 767783, 758413, 750659, 744379, 739127, 734449, 729928, 725573, 722087, 720031, 718724, 716771, 713772, 710761, 708855]
61901G08855n40Q55K566M130M625M238M246N193O193O421O273O558P462Q815J0571
61886G86461J2349J3237J2900J2456J3390J5681J7743J8312J7825J7658J8431
61875I56443J9432J9632J8832J7556J6073J4082J1552R291Q126P727O864M875
61863A110485K309R6j383k093j928j023j07J98L48J529M081O886Q696R595J0558
61848A148247J1911J3084J3790J4373J4580J3179R743O024M139L823K849K36k507
61835A253471l723l728l686l617k749j246k87o13j887l507n240p056q933j0889
61821A196310j2866j4582j5681j5918j5134j3397j1319r710q719p837o886o196
61809A058065n593m154j648P54K046K856M313O198P531Q559J0685J4357J8202
$$ y = [708855, 708315, 709170, 711736, 715866, 720491, 724729, 728975, 734168, 740361, 746782, 753055, 759613, 767075, 775890, 786461, 798810, 812047, 824947, 837403, 850793, 866474, 884217, 902529, 920354, 938012, 956443, 975875, 995507, 1014339, 1031895, 1047968, 1062050, 1073602, 1082893, 1091019, 1098746, 1105610, 1110485, 1112794, 1112890, 1111507, 1109414, 1107486, 1106463, 1106356, 1106554, 1106902, 1108431, 1112512, 1119398, 1128094, 1137689, 1148247, 1160158, 1173242, 1187032, 1201405, 1215985, 1229164, 1238907, 1244931, 1249070, 1252893, 1255742, 1255978, 1253471, 1249748, 1246020, 1242334, 1238717, 1235968, 1234722, 1234435, 1233822, 1231935, 1228428, 1223188, 1216132, 1207199, 1196310, 1183444, 1168862, 1153181, 1137263, 1122129, 1108732, 1097413, 1087703, 1078984, 1071147, 1064261, 1058065, 1052472, 1048318, 1046670, 1047424, 1049470, 1052326, 1056639, 1062837, 1070368, 1078927, 1089612, 1103969, 1122171]
61796A122171K0676K1772K2681K4191K5813K6489K6138K6205K8028L0718L1676
61785A406558K9496K5377K1106J7000J2686Q659N626L133K86k824n515p510q328
61772A505750o855l184J87J150J214L541Q169J1774J2166J0433Q211N542K308
61759A560406n68k682n055q274j1358j3620j5932j8879k1212k1655k0940k0552
61747A399679k0554k0159j9632j9960k1147k2074k1860k0608j9103j8288j8263
61736A178031j7600j4742j0619q354r402j1455j1425r139o599m859l572k760k962
61723A064543l853m395m245l736k746r55R96J962J815J379J058P36Q40K228M917
61708A060544P998J0693J2688J3689J3695J3530J4038J4942J5412J5263J4570
$$ y = [1122171, 1142847, 1164619, 1187300, 1211491, 1237304, 1263793, 1289931, 1316136, 1344164, 1374882, 1406558, 1436054, 1461431, 1482537, 1499537, 1512223, 1520882, 1526508, 1529641, 1529927, 1527103, 1521588, 1514078, 1505750, 1498895, 1495711, 1495898, 1497048, 1498262, 1501803, 1509972, 1521746, 1533912, 1544345, 1552556, 1558098, 1560406, 1559838, 1557156, 1552101, 1543827, 1532469, 1518849, 1502917, 1484038, 1462826, 1441171, 1420231, 1399679, 1379125, 1358966, 1339334, 1319374, 1298227, 1276153, 1254293, 1233685, 1214582, 1196294, 1178031, 1160431, 1145689, 1135070, 1126716, 1117314, 1105859, 1094434, 1085295, 1078696, 1073837, 1070265, 1067505, 1064543, 1060690, 1056295, 1052050, 1048314, 1045568, 1044613, 1045609, 1047571, 1049386, 1050765, 1051823, 1052559, 1053399, 1055627, 1060544, 1068542, 1079235, 1091923, 1105612, 1119307, 1132837, 1146875, 1161817, 1177229, 1192492, 1207062]
61697A207062J2733R398N879L861K919J002k605o601j0080j3526j6891j8732j8378
61684A156041j7306j7056j7109j6232j4762j3881j3337j1714q876o543o094o886
61672A006245p338o837n979n325m753l980l180k652k221j425k91N90Q59P68N71
61657I65052J28n30r65j139j759l092m181m185l846m389n547o076n921o190p027
61642I10333p297o719o580p573q445p794o103n003n385o987q879r615q059n048
61628H10846l149l639m704l966j826o51j323k454k888l093l758m519m688m169
61614G66019l127j595J13J330J732J449M54j265k717k232N57L906N788N856N119
61599G81387M409M077M396N200N386L856J056j167j395J30K048L127L040K453
$$ y = [1207062, 1219795, 1229193, 1235072, 1238933, 1241852, 1242854, 1240249, 1233648, 1223568, 1210042, 1193151, 1174419, 1156041, 1138735, 1121679, 1104570, 1088338, 1073576, 1059695, 1046358, 1034644, 1025768, 1019225, 1013131, 1006245, 998907, 992070, 986091, 980766, 976013, 972033, 968853, 966201, 963980, 962555, 962264, 962854, 963713, 964481, 965052, 965180, 964650, 963685, 962546, 960787, 957695, 953514, 949329, 945483, 941094, 935547, 929471, 923550, 917360, 910333, 903036, 896317, 889737, 882164, 873719, 865925, 859822, 854819, 849434, 842447, 833568, 823953, 815894, 810846, 807697, 804058, 799354, 795388, 793562, 792911, 791588, 789134, 786246, 783153, 779395, 774876, 770188, 766019, 762892, 761297, 761410, 762740, 764472, 765921, 766375, 765110, 762393, 760161, 760718, 764624, 770412, 776268, 781387, 785796, 789873, 794269, 799469, 804855, 808711, 809767, 808600, 807205, 807335, 809383, 812510, 815550, 818003]
61585H18003K396L166L916L687K657J845J874K640L930N371N889M433J596o03
61571H60800j189j489l230o211q872j0387j1048j0993r857p774n684m487m375
61558G75204m910n169m157k012m70j124l309m923n201n291n908o161n366m563
61544G16640n079o605p820q096p561o252m422l116l230m270m966m780l957k605
61530F43881r10K02j20j232j620r59l54m70o15m4P82P69n00k240k905j391J558
61513F33832L563L144J672J585K981L663K592J418J840L181L651K799J524N89
61499F68034K76P22J518J717J170J075K182L357L220K324K072K229J393k49p67
61484F90273N98K268K772K714L368M601N366N252M455K953R22n97n81O42J766
$$ y = [818003, 820399, 823565, 827481, 831168, 833825, 835670, 837544, 840184, 844114, 849485, 855374, 859807, 861403, 860800, 859611, 858122, 854892, 848681, 839809, 829422, 818374, 807381, 797524, 789750, 784066, 779579, 775204, 770294, 765125, 760968, 758956, 758486, 757362, 754053, 749130, 743929, 738638, 732730, 726569, 721203, 716640, 711561, 704956, 697136, 689040, 681479, 675227, 670805, 667689, 664459, 660189, 655223, 650443, 646486, 643881, 642971, 643173, 643053, 641821, 640201, 639242, 638888, 638418, 637803, 637759, 638541, 639310, 638810, 636570, 633665, 632274, 633832, 637395, 640539, 642211, 643796, 646777, 650440, 653032, 654450, 656290, 659471, 663122, 665921, 667445, 668034, 668310, 669032, 670550, 672267, 673437, 674512, 676694, 680051, 683271, 685595, 687667, 689896, 691289, 691040, 690273, 690871, 693139, 695911, 698625, 701993, 706594, 711960, 717212, 721667, 724620, 725542, 724945, 724364, 725006, 726772]
61469G26772J984J337L9j492k258j562k27J12q18j585j144j81K13K00N90J295
61453G23275J421O80j95k96O95K472M100M389K992J104K74P04J405J913K691L746
61437G51370M104L339K534K933M366N854O962P561O925M600J876Q53J789K719
61423H07785K226J421K157M208N412M366J888l10j540k246k797k877k126q80J45
61408H16832P54J370K075K139J022n30j202r04r59k134l252k492L98L785N845
61393H22747O007M893L557K826K888L215L184K747K273J939J725K029L497N951
61379H69478Q035Q417P112N172L383J797L50o76r10k20J244L015M357M836M861
61364I20251N127N448M869L232J824J789K514K508J503N38K4j007l179n341n806
$$ y = [726772, 728756, 730093, 730132, 728640, 726382, 724820, 724593, 724705, 723887, 722302, 721158, 720977, 721190, 721390, 721980, 723275, 724696, 725376, 725181, 724885, 725580, 728052, 732152, 736541, 739533, 740637, 740911, 741615, 743020, 744933, 747624, 751370, 755474, 758813, 761347, 764280, 768646, 774500, 781462, 789023, 795948, 800548, 802424, 803277, 805066, 807785, 810011, 811432, 813589, 817797, 823209, 827575, 829463, 829153, 827613, 825367, 822570, 819693, 817567, 816687, 816832, 817586, 818956, 821031, 823170, 824192, 823662, 822460, 821556, 820597, 818463, 815211, 812719, 813117, 816902, 822747, 828754, 833647, 837204, 840030, 842918, 846133, 849317, 852064, 854337, 856276, 858001, 860030, 863527, 869478, 877513, 885930, 893042, 898214, 901597, 903394, 903744, 903068, 902158, 901938, 903182, 906197, 910554, 915390, 920251, 925378, 930826, 935695, 938927, 940751, 942540, 945054, 947562, 949065, 949603, 949627, 948620, 945441, 940100, 934294]
61349I34294m527l119k937l891n078n795n714m835l699l268l944m961n165m332
61335H73029l172k104p98O97J228j45k413l394k375r12n04n83L16K239L899M704
61319H69712N245N908O239O066O050O571O996O643N778N015M312L296K119J406
61305I41356J525K371L601M742N272N013M252L447L045L459M682N891O234O083
61291A000973O568P713Q083O866N165M434M517M210L062J582K18p66q42K91J895
61276A053969K670K029M52j087j756j496j478k963n192n587l046K79J931K608
61262A041333M654Q022J0157R797Q436P741P735Q186R710J2348J4723J5811J6412
61249A175065J7609J8929J9218J8490J7724J7263J6511J4967J2674R737O030J514
$$ y = [934294, 929767, 926648, 923711, 919820, 914742, 908947, 903233, 898398, 894699, 891431, 887487, 882526, 877361, 873029, 869857, 867753, 866955, 867652, 868880, 868735, 866322, 862928, 860553, 859641, 859137, 858554, 858870, 861109, 865008, 869712, 874957, 880865, 887104, 893170, 899220, 905791, 912787, 919430, 925208, 930223, 934535, 937831, 939950, 941356, 942881, 945252, 948853, 953595, 958867, 963880, 968132, 971579, 974624, 978083, 982765, 988656, 994890, 1000973, 1007541, 1015254, 1023337, 1030203, 1035368, 1039802, 1044319, 1048529, 1051591, 1053173, 1053391, 1052625, 1051783, 1052074, 1053969, 1056639, 1058668, 1059120, 1058033, 1056277, 1054781, 1053303, 1050340, 1045148, 1039561, 1036515, 1036794, 1038725, 1041333, 1045987, 1054009, 1064166, 1073963, 1082399, 1090140, 1097875, 1106061, 1115771, 1128119, 1142842, 1158653, 1175065, 1192674, 1211603, 1230821, 1249311, 1267035, 1284298, 1300809, 1315776, 1328450, 1338187, 1344217, 1345731]
61237A345731l298p216r077r083r120j0872j3789j5904j6448j6360j6293j5788
61225A202483j4833j4432j4740j4193j1735q658o849o236n360l694j966o80L21
61212A099428J098J622K294L390M275M238L878M568O570Q790J0335J1300J1882
61199A173668J1750J0702R210P858O714N622M773M547M858M956M175K960K635
61186A254428L763N047M696K712P73r7n26j054j062k02M73J15l47L61J803K791
61170A273674L583N267P501Q880R457J0736J2905J4122J3356J2162J2452J3853
61158A397948J4550J3772J2177J0516R224Q844R620J0675J0747R744Q791Q585
61146A525193Q604Q217P822Q378J0127J2345J4161J5298J6064J6915J7968J8636
$$ y = [1345731, 1342433, 1335217, 1326140, 1317057, 1307937, 1297065, 1283276, 1267372, 1250924, 1234564, 1218271, 1202483, 1187650, 1173218, 1158478, 1144285, 1132550, 1123892, 1117043, 1110807, 1105447, 1101753, 1099787, 1099107, 1099428, 1100526, 1102148, 1104442, 1107832, 1112107, 1116345, 1120223, 1124791, 1131361, 1140151, 1150486, 1161786, 1173668, 1185418, 1196120, 1205330, 1213188, 1219902, 1225524, 1230297, 1234844, 1239702, 1244658, 1248833, 1251793, 1254428, 1258191, 1263238, 1267934, 1270646, 1271419, 1271322, 1270796, 1269742, 1268680, 1268478, 1268951, 1269066, 1268719, 1269080, 1270883, 1273674, 1277257, 1282524, 1290025, 1298905, 1308362, 1319098, 1332003, 1346125, 1359481, 1371643, 1384095, 1397948, 1412498, 1426270, 1438447, 1448963, 1458187, 1467031, 1476651, 1487326, 1498073, 1507817, 1516608, 1525193, 1533797, 1542014, 1549836, 1558214, 1568341, 1580686, 1594847, 1610145, 1626209, 1643124, 1661092, 1679728]
61134A679728J7910J5435J2296J0066Q887P247M155P63j185j836k783m343n121
61121A741219m790n365q397j2203j3741j2593j1172j1169j1717j1511j0932j0941
61109A616688j1070r943p437n047m011l893l399k027m12P52J693L266N928R269
61095A590357J2485J5081J7153J9263K1947K4921K6807K6290K3807K1393K0520
61084A820024K0746K1032K1589K3305K5819K7511K7610K7227K7870K9643L1488
61073B103864L2572L2862L2629L1971L0860K9252K7192K4987K3144K1844K0514
61062B411691J8248J4862J1286Q710P385O596N723M848M059K779M42k401m504
61049B489724n557o658q787j1518j3670j4862j5897j7782k0728k4077k6945k9009
$$ y = [1679728, 1697638, 1713073, 1725369, 1735435, 1744322, 1751569, 1755724, 1756487, 1755302, 1753466, 1750683, 1746340, 1741219, 1736429, 1731064, 1722667, 1710464, 1696723, 1684130, 1672958, 1661789, 1650072, 1638561, 1627629, 1616688, 1605618, 1595675, 1588238, 1583191, 1579180, 1575287, 1571888, 1569861, 1569449, 1570201, 1571894, 1575160, 1581088, 1590357, 1602842, 1617923, 1635076, 1654339, 1676286, 1701207, 1728014, 1754304, 1778111, 1799504, 1820024, 1840770, 1861802, 1883391, 1906696, 1932515, 1960026, 1987636, 2014863, 2042733, 2072376, 2103864, 2136436, 2169298, 2201927, 2233898, 2264758, 2294010, 2321202, 2346189, 2369333, 2391177, 2411691, 2429939, 2444801, 2456087, 2464797, 2472182, 2478778, 2484501, 2489349, 2493408, 2496187, 2496629, 2494228, 2489724, 2484167, 2477509, 2468722, 2457204, 2443534, 2428672, 2412775, 2394993, 2374265, 2350188, 2323243, 2294234]
61037B294234l0748l2864l5585l8674m1711m3886m3999m1655l8246l5615l3761
61026A877490l1141k7482k4689k4200k4810k4302k2177j9464j6643j3369r834
61015A639379p038n679n671o619p728p572n039q26K907M598M586M449N536Q034
61001A623317J0992J3349J5139J7385K0569K3866K6367K8254L0106L1819L3216
60990A874379L5152L8904M4595N1032N6805O1001O3404O4707O6105O8146P0602
60979B494832P3752P8550Q4772R0546R4925R9459J05677J12598J18718J25029
60969C478858J33489J43439J52317J59441J66468J74476J83403J94236K08673
60960D994800K26371K45362K65735K89867L18283L48527L79551M14588M58241
$$ y = [2294234, 2263486, 2230622, 2195037, 2156363, 2114652, 2070766, 2026767, 1985112, 1946866, 1911251, 1877490, 1846349, 1818867, 1794178, 1769978, 1745168, 1720866, 1698689, 1679225, 1662582, 1649213, 1639379, 1632341, 1626662, 1620991, 1614372, 1606644, 1599072, 1594033, 1593207, 1596114, 1600712, 1605298, 1609747, 1615283, 1623317, 1634309, 1647658, 1662797, 1680182, 1700751, 1724617, 1750984, 1779238, 1809344, 1841163, 1874379, 1909531, 1948435, 1993030, 2044062, 2100867, 2161868, 2225272, 2289979, 2356084, 2424230, 2494832, 2568584, 2647134, 2731906, 2822452, 2917377, 3016836, 3122513, 3235111, 3353829, 3478858, 3612347, 3755786, 3908103, 4067544, 4234012, 4408488, 4591891, 4786127, 4994800, 5221171, 5466533, 5732268, 6022135, 6340418, 6688945, 7068496, 7483084, 7941325]
60951G941325N13074N80246O60531P52823Q53985R62234J079028J206934J348792
60942A5898972J510218J699043J919994K172136K447241K713286K887479K843076
60934C4091445K483084J835062J068492L99004l6403k20739k05659n9705J21336
60925C9475917J91289O49m98361j195989j888928k408145k694982k780002k719790
60916B5481658k561348k342987k099714j857901j631311j426183j246501j092926
60908A1222787r61361q46372p45204o57419n82450n18783m64291m16456l73418
60899E657033l35418l03783k77906k54581k31070k07553j85783j66636j50041
60890C544262j36305j26143j19578j15482j12062j07727j02016r5847r0308q5212
$$ y = [7941325, 8454399, 9034645, 9695176, 10447999, 11301984, 12264218, 13343246, 14550180, 15898972, 17409190, 19108233, 21028227, 23200363, 25647604, 28360890, 31248369, 34091445, 36574529, 38409591, 39478083, 39877087, 39840684, 39619945, 39414286, 39354581, 39475917, 39667206, 39667855, 39169494, 37973505, 36084577, 33676432, 30981450, 28201448, 25481658, 22920310, 20577323, 18477609, 16619708, 14988397, 13562214, 12315713, 11222787, 10261426, 9415054, 8669850, 8012431, 7429981, 6911198, 6446907, 6030451, 5657033, 5321615, 5017832, 4739926, 4485345, 4254275, 4046722, 3860939, 3694303, 3544262, 3407957, 3281814, 3162236, 3046754, 2934692, 2826965, 2724949, 2629102, 2538794, 2453582]
60880B453582p9707p4192p0300o8501o7011o3980n9839n6423n4394n2594m9815
60869A756826m6263m3042m0747l8912l6843l4670l3177l2506l1663k9737k7113
60858A362153k4819k3236k2197k1795k1903k1364j9089j5848j3546j2700j2176
60847A153480j1516j1638j2569j2418r858o344m491n084o801q084q194p201o012
60834A043270n802o467o432m924l380l399m287m276l348k975l582m285m891n947
60820I79275o690n301j999L02l96k597l659l199k584k274j663q18m92n80k73L17
60804I47369K81k12J94J835L193L069K236J987K079J337m57k565m705p012q670
60789I39959q074n014j716q76l066o620r554j0999j1123j0659j0601j1618j3139
$$ y = [2453582, 2373875, 2299683, 2229383, 2160882, 2093871, 2029891, 1970052, 1913629, 1859235, 1806641, 1756826, 1710563, 1667521, 1626774, 1587862, 1551019, 1516349, 1483172, 1450666, 1419003, 1389266, 1362153, 1337334, 1314098, 1291901, 1270106, 1248203, 1226839, 1207750, 1191902, 1178356, 1165656, 1153480, 1141964, 1130326, 1117757, 1105339, 1095481, 1089137, 1084646, 1079562, 1072761, 1064677, 1056483, 1049282, 1043270, 1037468, 1031001, 1024569, 1019645, 1016265, 1012866, 1008579, 1004303, 1000955, 997980, 994398, 990113, 985222, 979275, 972585, 967284, 965285, 965587, 965191, 962594, 958935, 955736, 953152, 950878, 949215, 948397, 947905, 947325, 947052, 947369, 947650, 947438, 947632, 949467, 952660, 955729, 957965, 959952, 962031, 963368, 962911, 960346, 955641, 948629, 939959, 931885, 926871, 925155, 924279, 921213, 914593, 905039, 894040, 882917, 872258, 861657, 850039, 836900]
60776H36900j3567j1984r479q096q419q974q348p090o662p052o668m672k217q10
60762G32862m81k98O3L22N82J214J882J735O39p08j839k843l477l043j513J50
60746G25247J242K070K935L215K279P59m4J64L19o36k491m018m256l543l153l648
60730G16441l929k705p65m77k572m816m870l411k918m117n349n333m748m715n076
60715F60640m987m250l322k539j982j606j063J34J806K959K906K193J913K429
60701F55231L200L694L858L840L648L294K982K939L121L138K671J986J813K472
60687F97887L384L792L738L795M002L770K859J703N88p00k128l076l252l179l176
60672G10007k551p07J445K261J474N09O74J756K603K307O39j867l933m295k996
$$ y = [836900, 823333, 811349, 801870, 793774, 785355, 776381, 768033, 760943, 754281, 747229, 740561, 735889, 733672, 732862, 732381, 732083, 732146, 732468, 733050, 734264, 736146, 737881, 738520, 737812, 735973, 733130, 729653, 726610, 725097, 725247, 726489, 728559, 731494, 734709, 736988, 737747, 737703, 737867, 738186, 737550, 735059, 731041, 726785, 723242, 720089, 716441, 712512, 709807, 709042, 708565, 705993, 701177, 696307, 692896, 689978, 685861, 680512, 675179, 670431, 665716, 660640, 655653, 651403, 648081, 645542, 643560, 641954, 640891, 641025, 642831, 645790, 648696, 650889, 652802, 655231, 658431, 662125, 665983, 669823, 673471, 676765, 679747, 682686, 685807, 688945, 691616, 693602, 695415, 697887, 701271, 705063, 708801, 712596, 716598, 720368, 723227, 724930, 725518, 724818, 722690, 719614, 716362, 713183, 710007, 707456, 706749, 708194, 710455, 711929, 712438, 713112, 714868, 717471, 719778, 720417, 718550, 714617, 710322, 707326]
60657G07326j497j112j751k521l050l690m703n862o704o816o075m968m245l902
60643F50430l065j461l89j147k916l519k279p69l83n76j86O53J038P96M15J27
60627F36769J82J348L809N987N966M033K441K567L668M635N450O181O081M686
60613F93803K899J835J338O47j01k60j32p89k358l637l615k536j211jJ129K047
60597F89058K500K503K421K618L046L186K602J644J294J895K472J818M8j598k301
60582G13206k343k230k072j940k108k502k614k391k488l124l306k147l96M24J78
60567F84147K18J213K115J859R96P16J088J290J152J181J321Q19m28j517j720
60552F94450j217l41Q88K056K208J153J61N17J971L305L831L622K851J843J286
$$ y = [707326, 705829, 704717, 702966, 700445, 697395, 693705, 689002, 683140, 676436, 669620, 663545, 658577, 654332, 650430, 647365, 645904, 645515, 644368, 641452, 637933, 635654, 634885, 634502, 633926, 633740, 634393, 635431, 636227, 636642, 636769, 636951, 638299, 642108, 648095, 654061, 658094, 660535, 663102, 666770, 671405, 676855, 683036, 689117, 693803, 696702, 698537, 699875, 700522, 700421, 700161, 700029, 699240, 696882, 693245, 689630, 687094, 685883, 685882, 687011, 689058, 691558, 694061, 696482, 699100, 702146, 705332, 707934, 709578, 710872, 712767, 715239, 717057, 717105, 715507, 713206, 710863, 708633, 706561, 704621, 702513, 700011, 697397, 695006, 692518, 689394, 686088, 683941, 683545, 683969, 684147, 684365, 685578, 687693, 689552, 690548, 691264, 692352, 693642, 694794, 695975, 697296, 698115, 697687, 696170, 694450, 693233, 692892, 693780, 695836, 698044, 699197, 699358, 699875, 701846, 705151, 708982, 712604, 715455, 717298, 718584]
60537G18584J472J802J843K331M024O045O700N706M292L231K149P98k42m32K72
60522G58575J910M265O077N918M236L168L825N122N754N912O248O595O756P478
60508H31839R328J1406J2400J2355J2349J2758J2838J1850R869P591N657L993
60496I54233J804j132l323k818J95L350N028N903P000P943Q241Q766J0384J2337
60482A017911J3609J4913J7535K0926K3310K4270K5051K6420K7887K8950K9611
60471A270393K9461K7647K3975J9089J3512P495J782k661n911r113j2914j6518
60459A346237j8425j7739j4859j1323q628o794m635j771N81J541K235M309P692
60446A278421J1141J4319J7817K1749K5794L0191L5177L9923M3542M6676N0339
$$ y = [718584, 720056, 721858, 723701, 726032, 730056, 736101, 742801, 748507, 752799, 756030, 758179, 758977, 758735, 758303, 758575, 760485, 764750, 770827, 776745, 780981, 784149, 787974, 793096, 798850, 804762, 811010, 817605, 824361, 831839, 841167, 852573, 864973, 877328, 889677, 902435, 915273, 927123, 936992, 944583, 950240, 954233, 956037, 954905, 951582, 948764, 948959, 952309, 957337, 963240, 970240, 978183, 986424, 995190, 1005574, 1017911, 1031520, 1046433, 1063968, 1084894, 1108204, 1132474, 1157525, 1183945, 1211832, 1240782, 1270393, 1299854, 1327501, 1351476, 1370565, 1384077, 1391572, 1393354, 1390693, 1384782, 1375669, 1362755, 1346237, 1327812, 1310073, 1295214, 1283891, 1275263, 1268469, 1263834, 1262063, 1262644, 1264185, 1266420, 1270729, 1278421, 1289562, 1303881, 1321698, 1343447, 1369241, 1399432, 1434609, 1474532, 1518074, 1564750, 1615089]
60435A615089N3674N4649N2944N0176M7251M3413L8203L2581K7638K3590K0275
60424B059483J7252J3196O744j909j1560k2044l3931m6223n6446o3501o8459p2027
60412A720575p3257p1579o8114o3898n8545n1930m5679m1481l8979l6543l3337
60401A137233k9693k6202k3267k0910j8621j6124j4295j4148j4942j4861j3685
60390I30485j2796j2353j0766p777n586n543o080n530m810n310o029n261l510
60377H39134k322j494JJ326P30j318k591k470k364k793k480p80J171K349L052
60362H29151L493K910R96j098k002j562m24Q55J916K669L639N336O965O798M445
60347H64087J758Q11J714L140M234N073N707N874N702N809O358O716O471O238
$$ y = [1615089, 1668763, 1723412, 1776356, 1826532, 1873783, 1917196, 1955399, 1987980, 2015618, 2039208, 2059483, 2076735, 2089931, 2096675, 2094766, 2083206, 2061162, 2027231, 1981008, 1924562, 1861061, 1792602, 1720575, 1647318, 1575739, 1507625, 1443727, 1385182, 1333252, 1287573, 1246092, 1207113, 1170570, 1137233, 1107540, 1081338, 1058071, 1037161, 1018540, 1002416, 988121, 973973, 959031, 944170, 930485, 917689, 905336, 894570, 886793, 881207, 875664, 869584, 864054, 859244, 853934, 847905, 842644, 839134, 836812, 835318, 835319, 836645, 837375, 836057, 833466, 830996, 828632, 825839, 823359, 822579, 823750, 826099, 829151, 832644, 835554, 836550, 835452, 833450, 831888, 831464, 832319, 834235, 836904, 840543, 845879, 852844, 859642, 864087, 865845, 866656, 868370, 871510, 875744, 880817, 886524, 892398, 898100, 903909, 910267, 916983, 923454, 929692]
60333I29692O756P557P529O714O311O533N898L770K140L103N481O225M851L865
60319A006425M594N351M748M275N745Q212R457R173Q552P903O717N391M854M977
60305A096374N015N134N852O563O348N718N817O449O781P398R488J2239J3417
60292A192593J2648J1759J1533J0528P909N162L751K925J270j057l080m767o466
60279A244708p480o797m931l699m142n593o668o651n915n482n990o968p373p035
60265A159984o867p443q080p878o954n880m495k138J157M557P484R919J1706J2347
60251A157419J1869J1242J1268J1303R915O905M112L630N553P923Q750P500M816
60238A262205J586j516m396p716j2106j6845k0100k0849j9884j8482j6936j5067
$$ y = [929692, 936448, 944005, 951534, 958248, 964559, 971092, 976990, 980760, 982900, 986003, 991484, 997709, 1002560, 1006425, 1011019, 1016370, 1021118, 1025393, 1031138, 1039350, 1048807, 1057980, 1066532, 1074435, 1081152, 1086543, 1091397, 1096374, 1101389, 1106523, 1112375, 1118938, 1125286, 1131004, 1136821, 1143270, 1150051, 1157449, 1166937, 1179176, 1192593, 1205241, 1217000, 1228533, 1239061, 1246970, 1252132, 1255883, 1258808, 1260078, 1259021, 1255941, 1251174, 1244708, 1237228, 1230431, 1225500, 1221801, 1217659, 1212066, 1205398, 1198747, 1192832, 1187350, 1181360, 1174392, 1167019, 1159984, 1153117, 1145674, 1137594, 1129716, 1122762, 1116882, 1112387, 1110249, 1111406, 1115963, 1123447, 1133366, 1145072, 1157419, 1169288, 1180530, 1191798, 1203101, 1213016, 1219921, 1224033, 1227663, 1233216, 1241139, 1249889, 1257389, 1262205, 1263791, 1262275, 1257879, 1250163, 1238057, 1221212, 1201112, 1180263, 1160379, 1141897, 1124961, 1109894]
60226A109894j3241j1886j0547q542o260m896n107o572q505r932r992q860p917
60213I97637q046q306p249n077l302k691k782l059l293l024k113j606k524l850
60199I40715l433j061J065J399Q41P77J023Q72P47J408K382K620K194J984K110
60184I55643J853J169R29J451J747R14l59m51J208L504N088N771O001N682M463
60169I94613L047K956M750P384R715J1460J2244J1166Q528O678P538J0066J1797
60156A101942J2184J2619J3599J4016J3316J2481J2469J3160J4109J4904J4640
60145A249439J2655J0044Q701Q567P709N588M114M465N002L826J649L27j01r23
60131A321062k266l142l540m503o097o958o210m709l996m648n851o226n120l339
$$ y = [1109894, 1096653, 1084767, 1074220, 1065678, 1059418, 1054522, 1049415, 1042843, 1034338, 1024406, 1014414, 1005554, 997637, 989591, 981285, 974036, 968959, 965657, 962966, 960184, 957125, 953832, 950808, 948695, 947089, 944565, 940715, 937282, 936221, 937286, 938685, 939526, 940303, 941326, 942198, 942945, 944353, 946735, 949355, 951549, 953533, 955643, 957496, 958665, 959594, 961045, 962792, 963706, 963347, 962896, 964104, 967608, 972696, 978467, 984468, 990150, 994613, 997660, 1000616, 1005366, 1012750, 1022465, 1033925, 1046169, 1057335, 1065863, 1072541, 1080079, 1090145, 1101942, 1114126, 1126745, 1140344, 1154360, 1167676, 1180157, 1192626, 1205786, 1219895, 1234799, 1249439, 1262094, 1272138, 1280839, 1289406, 1297115, 1302703, 1306817, 1311282, 1316284, 1320110, 1321759, 1322086, 1321985, 1321062, 1318796, 1315654, 1312114, 1307611, 1301514, 1294556, 1288346, 1283637, 1279641, 1274993, 1269142, 1262916, 1257796, 1254457]
60117A254457k342k538k918k700k392k689l261l477l490l592l418k891l104m724
60103A210921o305n933m165l330m007m295l022j516j214j407q07P1l8o82k83J181
60087A175169J956J188R2m0N25J124K163M145O180O854O199N449N133M769M494
60072A225400N355P415Q853P975N414L332K922L577M138M127L836L876M612N698
60058A296530O322O238O179O796P693P965P306O067M726L897M167N236N716M706
60044A379544L001J922J525R85J46n31j076j719j718mK944N193N377L658P69k586
60028A397430n470p302q779j0976j3406j4427j3702j2718j2621j3041j3453j4014
60016A257521j4389j3467j1192r300r182j0127j0718j0740j0671j0217q717o456
$$ y = [1254457, 1252115, 1249577, 1246659, 1243959, 1241567, 1238878, 1235617, 1232140, 1228650, 1225058, 1221640, 1218749, 1215645, 1210921, 1204616, 1198683, 1194518, 1191188, 1187181, 1182886, 1179864, 1178348, 1177134, 1175727, 1174920, 1174991, 1174953, 1174271, 1173988, 1175169, 1177125, 1178313, 1178405, 1178365, 1178890, 1180014, 1182177, 1186322, 1192502, 1199356, 1205555, 1211004, 1216137, 1220906, 1225400, 1230755, 1238170, 1247023, 1254998, 1260412, 1263744, 1266666, 1270243, 1274381, 1278508, 1282344, 1286220, 1290832, 1296530, 1302852, 1309090, 1315269, 1322065, 1329758, 1337723, 1345029, 1351096, 1355822, 1359719, 1363886, 1369122, 1374838, 1379544, 1382545, 1384467, 1385992, 1386977, 1387123, 1386592, 1385516, 1383797, 1382079, 1382075, 1385019, 1390212, 1395589, 1399247, 1400016, 1397430, 1391960, 1384658, 1375879, 1364903, 1351497, 1337070, 1323368, 1310650, 1298029, 1284988, 1271535, 1257521, 1243132, 1229665, 1218473, 1209173, 1199991, 1189864, 1179146, 1168406, 1157735, 1147518, 1138801, 1132345]
60004A132345m612m174n295p085p818o397m026l161m304n244m261k452j662j607
59990A070247p48J054K478K742K243J665J755L294N982P875P370N277L599K881
59976A117714K199J231N44P3q89k154k743k844l950o489q801r300q598q520r751
59961A057722j1292j1770j0671q543o542n620n779o192o108n550n069n065n401
59948I64120n513m962m015l461l659m029l813l047k325j788r35N26K048K675K005
59933I33827P78L80J563L626N119N327M688L892L276L130L677M415M286K992J494
59918I82470P26M57qo69j050j071j045j133j308j549j718j628j436j449j425q14
59902I67350J94P82R68J655K843L144J924N06K23N68N37N07J207J923J560O85
$$ y = [1132345, 1127733, 1123559, 1118264, 1111179, 1103361, 1096964, 1092938, 1089777, 1085473, 1080229, 1075968, 1073516, 1071854, 1070247, 1069499, 1070553, 1073031, 1075773, 1078016, 1079681, 1081436, 1084730, 1090712, 1098587, 1105957, 1111234, 1114833, 1117714, 1119913, 1121144, 1121688, 1121761, 1120872, 1118718, 1115975, 1113131, 1109181, 1102692, 1093891, 1084591, 1075993, 1067473, 1057722, 1046430, 1034660, 1023989, 1015446, 1008904, 1003284, 997505, 991313, 985205, 979655, 974586, 969521, 964120, 958607, 953645, 949630, 946169, 942510, 938481, 934668, 931621, 929296, 927508, 926573, 927099, 929147, 931822, 933827, 934605, 934985, 936548, 940174, 945293, 950620, 955308, 959200, 962476, 965606, 969283, 973698, 977984, 980976, 982470, 983196, 983653, 983645, 982976, 981926, 980855, 979810, 978677, 977369, 975820, 974102, 972474, 971038, 969589, 968164, 967350, 967544, 968326, 969294, 970949, 973792, 976936, 978860, 979366, 979589, 980157, 980694, 981201, 982408, 984331, 985891, 986576]
59886I86576O67J313J276N90P66K322L892M158L311K380K304L609N808P213O754
59871A032939N877O951R662J0888Q615M329O85j535k988l718l068j160Q85K218
59857A070580L004L889N068N953N802M926M883O697R100R646P693N165L929L576
59843A149911K543L94k022l950n148n282m133k450j571j799j845m88J709L068
59829A128937L060L040M385O658Q320Q749Q571Q188P335O266O150P447Q888Q898
59815A224892P376N339L556K356J935J802O31k126m870n435l696j534m63m44q14
59800A228505j110r33n1J148K023K494K879L268L809N099P269R297J0293J0834
59786A284824J1666J1781R663O007L184K033J333O69J469M327P311Q209O995M979
$$ y = [986576, 987243, 988556, 989832, 990422, 991188, 993510, 997402, 1001560, 1004871, 1007251, 1009555, 1013164, 1018972, 1026185, 1032939, 1038816, 1045767, 1055429, 1066317, 1074932, 1079261, 1079946, 1078411, 1075423, 1071705, 1068637, 1067477, 1068362, 1070580, 1073584, 1077473, 1082541, 1088494, 1094296, 1099222, 1104105, 1110802, 1119902, 1129548, 1137241, 1142406, 1146335, 1149911, 1152454, 1152848, 1150826, 1146876, 1141728, 1136446, 1132313, 1129863, 1128292, 1126493, 1124648, 1124160, 1125869, 1128937, 1131997, 1135037, 1139422, 1146080, 1154400, 1163149, 1171720, 1179908, 1187243, 1193509, 1199659, 1207106, 1215994, 1224892, 1232268, 1237607, 1241163, 1243519, 1245454, 1247256, 1247887, 1245761, 1240891, 1235456, 1231760, 1230226, 1229763, 1229319, 1228505, 1227395, 1226462, 1226411, 1227559, 1229582, 1232076, 1234955, 1238223, 1242032, 1247131, 1254400, 1263697, 1273990, 1284824, 1296490, 1308271, 1317934, 1323941, 1327125, 1329158, 1330491, 1331160, 1332629, 1336956, 1344267, 1352476, 1359471, 1364450]
59772A364450K908J010l33j253k729n062o906o983o012n720o483p086o470m745
59758A308586k728j235n57j43P71J824J562n77l203m727n397o493q115q931p920
59743A262717n398k443j27P95K12j286l181n481p926r280q395n827l397k185j727
59728A207071j226o34k44J2M05Q77J120J015P97Q74J517K526L210K982K056J400
59712A223758J828L167M391M686M292M150M674N188M981M573N214P101Q880R384
59698A296267R191R718J1137J2074J1434R770Q468Q135Q338Q594Q799Q702P818
59685A418445O336N408N740O303N549L688K513K708K736J209q27j186O37L114
59671A462373M737N198M829M097L617L600L366K328J327J699L091L566K312R61
$$ y = [1364450, 1367358, 1368368, 1368035, 1366782, 1364053, 1358991, 1352085, 1345102, 1339090, 1333370, 1326887, 1319801, 1313331, 1308586, 1305858, 1304623, 1304066, 1303923, 1304694, 1306518, 1308080, 1307503, 1304300, 1299573, 1294176, 1287683, 1279568, 1270637, 1262717, 1257319, 1254876, 1254749, 1255544, 1255756, 1254470, 1251289, 1245808, 1237882, 1228602, 1220207, 1214380, 1210983, 1208798, 1207071, 1205845, 1205211, 1204967, 1204979, 1205384, 1206261, 1207381, 1208396, 1209193, 1210067, 1211584, 1214110, 1217320, 1220302, 1222358, 1223758, 1225586, 1228753, 1233144, 1237830, 1242122, 1246272, 1250946, 1256134, 1261115, 1265688, 1270902, 1278003, 1286883, 1296267, 1305458, 1315176, 1326313, 1338387, 1349821, 1359591, 1368059, 1376194, 1384532, 1393126, 1401925, 1410627, 1418445, 1424781, 1430189, 1435929, 1442232, 1447781, 1451469, 1453982, 1456690, 1459426, 1460635, 1459808, 1458622, 1459259, 1462373, 1467110, 1472308, 1477137, 1481234, 1484851, 1488451, 1491817, 1494145, 1495472, 1497171, 1500262, 1503828, 1506140, 1507101]
59657A507101J500L722N646N883M944M445N397P212Q273P767O699O651P870R454
59643A592564J1094J3272J5613J6506J5132J2937J2101J3159J4763J5280J4016
59632A746437J1301Q113N492L833K893K505K808L494L468J896o96k938m059m507
59618A780040n235o741q691j0228j0575r597p947o671o326o279n096k242Q45K221
59604A697478J913J766K602L189K790K936M950P236P232N202L591L090K115K07
59590A746297j010j179k683p138j2605j6299j8437k1174k4735k6971k6659k5182
59578A562225k4451k4595k4395k3171k1479k0053j8769j6955j4666j3031j2982
59567A347678j4157j5633j7175j8809j9689j8857j6990j5957j6361j6903j6438
$$ y = [1507101, 1508601, 1512323, 1517969, 1523852, 1528796, 1533241, 1538638, 1545850, 1554123, 1561890, 1568589, 1575240, 1583110, 1592564, 1603658, 1616930, 1632543, 1649049, 1664181, 1677118, 1689219, 1702378, 1717141, 1732421, 1746437, 1757738, 1765851, 1771343, 1775176, 1778069, 1780574, 1783382, 1786876, 1790344, 1792240, 1791544, 1788606, 1784547, 1780040, 1774805, 1768064, 1759373, 1749145, 1738570, 1728973, 1721026, 1714355, 1708029, 1701750, 1696654, 1694412, 1695257, 1697478, 1699391, 1701157, 1703759, 1706948, 1709738, 1712674, 1717624, 1724860, 1732092, 1737294, 1740885, 1743975, 1746090, 1746297, 1745287, 1744108, 1741425, 1734287, 1721682, 1705383, 1686946, 1665772, 1641037, 1614066, 1587407, 1562225, 1537774, 1513179, 1488784, 1465613, 1444134, 1424081, 1405312, 1388357, 1373691, 1360660, 1347678, 1333521, 1317888, 1300713, 1281904, 1262215, 1243358, 1226368, 1210411, 1194050, 1177147, 1160709]
59556A160709j5273j3920j2049r465o974n377m504l891l506l190k331q50M53J166
59542A080998J955L262M254L960K715J636J228J126P84M3n25J56K252M008L406
59527A111258Q93j127j713k427m372o304o726n987m876k954j08J655J20m010p612
59512A065710q402o542l669j520j040j763k403k417k160j320R83L878M687K613
59498A046635L96N66K049K724L173M934O691N829L014J681L045N038O318P962
59484A100055J0445J2311J3081J4612J7962K1384K3155K4021K4733K3236J7025
59473A302020P324j552o675q482q620p835o234m061j638O11J885J624M71l64q60
59458A267614k338n346q466j0082j0558j1374j2521j2303j0075p704p256q275
$$ y = [1160709, 1145436, 1131516, 1119467, 1110002, 1103028, 1097651, 1093147, 1089256, 1085750, 1082560, 1080229, 1079379, 1079832, 1080998, 1082953, 1086215, 1090469, 1094429, 1097144, 1098780, 1100008, 1101134, 1101918, 1101961, 1101436, 1101592, 1103844, 1107852, 1111258, 1112151, 1111024, 1109311, 1106884, 1102512, 1096208, 1089482, 1083495, 1078619, 1075665, 1075557, 1077212, 1077332, 1073322, 1065710, 1057308, 1050766, 1047097, 1045577, 1044537, 1042774, 1040371, 1037954, 1035794, 1034474, 1035457, 1039335, 1044022, 1046635, 1047031, 1047597, 1049646, 1052370, 1055543, 1060477, 1067168, 1072997, 1076011, 1077692, 1080737, 1085775, 1092093, 1100055, 1110500, 1122811, 1135892, 1150504, 1168466, 1189850, 1213005, 1237026, 1261759, 1284995, 1302020, 1309344, 1307792, 1301117, 1292635, 1284015, 1276180, 1269946, 1265885, 1264247, 1264858, 1266743, 1268367, 1268838, 1268474, 1267614, 1265276, 1259930, 1251464, 1241382, 1230824, 1219450, 1206929, 1194626, 1184551, 1176847, 1169591, 1161316]
59446A161316q695p791o706o259n839m811l481k167n00J588L280L964M129M473
59432A132501M891M937M602M156L894M331N690O996O927N881N628O458O548N050
59418A208490L690L866M110K651P28Q18K585L397K407J387J425J337P4j377j499
59403A234089l03J095K041K806L948N612P240Q063Q170Q532R542J0298R997R156
59389A320286Q426P271N076K661J202M66m37j242j157o80r69j865k099j110Q20
59374A336649L485O180P158N671L745L734M933N245N249P422J1583J4727J5854
59361A431635J7319K0501K3647K5496K7660L1253L4198L4638L4526L6456L8420
59350A755749L5207K4734J0421k539j0969j3990j2236p916l930j632LK229M066
$$ y = [1161316, 1152621, 1144830, 1138124, 1131865, 1126026, 1121215, 1117734, 1115567, 1115067, 1116655, 1119935, 1123899, 1128028, 1132501, 1137392, 1142329, 1146931, 1151087, 1154981, 1159312, 1165002, 1171998, 1178925, 1184806, 1190434, 1196892, 1203440, 1208490, 1212180, 1216046, 1220156, 1222807, 1223535, 1224353, 1226938, 1230335, 1232742, 1234129, 1235554, 1236891, 1236965, 1235588, 1234089, 1233786, 1234881, 1236922, 1239728, 1243676, 1249288, 1256528, 1264591, 1272761, 1281293, 1290835, 1301133, 1311130, 1320286, 1328712, 1335983, 1341059, 1343720, 1344922, 1345388, 1344951, 1343709, 1342552, 1341872, 1340903, 1339038, 1336939, 1335829, 1336649, 1340134, 1346314, 1353472, 1359143, 1362888, 1366622, 1371555, 1376800, 1382049, 1389471, 1401054, 1415781, 1431635, 1448954, 1469455, 1493102, 1518598, 1546258, 1577511, 1611709, 1646347, 1680873, 1717329, 1755749, 1790956, 1815690, 1826111, 1823572, 1812603, 1798613, 1786377, 1778461, 1774531, 1772899, 1772902, 1775131, 1779197]
59337A779197K612m030j4515k5047l2335l5494l5288l2489k7822k2784j9075j7068
59325A515862j5780j4416j2934j1206q822n938l187n89K304M985O079N307M171
59312A465836M088M922N825O373O313N391M247M340O095P985Q434P904Q147R890
59298A555790J2139J3629J4209J4701J5618J6352J5962J4859J4732J6146J7269
59287A721406J6308J4376J4083J5733J6909J5843J3112R886O565L597J537l45
59275A849010l586p996j1623j3899j6436j9668k1362k0209j8614j9560k2437k4346
59263A649274k4266k3465k2688k1412j9622j8171j7436j7151j7286j7559j6591
59252A433627j3425r578p789q649j0065j0146r000p412n337k344J535O008J0733
$$ y = [1779197, 1781809, 1777779, 1763264, 1738217, 1705882, 1670388, 1635100, 1602611, 1574789, 1552005, 1532930, 1515862, 1500082, 1485666, 1472732, 1461526, 1452704, 1446766, 1443579, 1442990, 1445294, 1450279, 1456358, 1461665, 1465836, 1469924, 1474846, 1480671, 1487044, 1493357, 1498748, 1502995, 1507335, 1513430, 1521415, 1529849, 1537753, 1545900, 1555790, 1567929, 1581558, 1595767, 1610468, 1626086, 1642438, 1658400, 1673259, 1687991, 1704137, 1721406, 1737714, 1752090, 1766173, 1781906, 1798815, 1814658, 1827770, 1837656, 1844221, 1847818, 1849355, 1849010, 1845424, 1837428, 1825805, 1811906, 1795470, 1775802, 1754440, 1734231, 1715617, 1696057, 1673620, 1649274, 1625008, 1601543, 1578855, 1557443, 1537821, 1519650, 1502214, 1485063, 1467777, 1450218, 1433627, 1420202, 1410624, 1402835, 1394186, 1384121, 1373975, 1364975, 1357563, 1352226, 1349882, 1351417, 1357425, 1368158]
59239A368158J5009J7908J8939J7995J4716Q775R98o661j2525j6056j7220j5926
59227A394110j2488q024l910r27R09K065L178M702O594Q547J0527J2830J5456
59214A433569J7803J9227J9769J9993K0135J9930J9480J9579K0513K0858J8706
59203A649562J4249R901P318N494K708r46m188o627q519r473r263r354j1401j4467
59189A614994j6022j5704j5742j7262j8632j8238j6650j4927j2906j0582r265
59178A449064r665j0289r463p723o668o513o432o314o569o794o336n664n851o917
59164A347866p805p773p001o073n484n258m667l044j073j98m49l11O59Q38q52
59149A299375l029l894l573k987k038o99l89k056m070m338l521l720m748m456
$$ y = [1368158, 1383167, 1401075, 1420014, 1438009, 1452725, 1461500, 1462498, 1455837, 1443312, 1427256, 1410036, 1394110, 1381622, 1373598, 1369688, 1368761, 1369670, 1371735, 1374913, 1379615, 1386209, 1394756, 1405283, 1418113, 1433569, 1451372, 1470599, 1490368, 1510361, 1530496, 1550426, 1569906, 1589485, 1609998, 1630856, 1649562, 1663811, 1673712, 1681030, 1686524, 1689232, 1688286, 1684098, 1677471, 1668952, 1659479, 1650216, 1640862, 1629461, 1614994, 1598972, 1583268, 1567526, 1550264, 1531632, 1513394, 1496744, 1481817, 1468911, 1458329, 1449064, 1439399, 1429110, 1419647, 1411924, 1405256, 1398743, 1392311, 1385997, 1379428, 1372634, 1366298, 1360634, 1354783, 1347866, 1340061, 1332288, 1325287, 1319214, 1313730, 1308472, 1303805, 1300761, 1299688, 1299490, 1299041, 1298730, 1299389, 1300227, 1299375, 1296346, 1292452, 1288879, 1285892, 1283854, 1283155, 1282766, 1280710, 1276640, 1272302, 1268781, 1265061, 1260313, 1255857]
59135A255857k529j117j263j320J39J996K446J659J152J504J970J925J588J357
59121A265364J108L82q74k121k969l873n464p191p635o485n166m962n464n638
59107A209012n343m840l793k004l37K64R4j02n07j566k695l063l131l957n400
59092A172632o453p007p662q032o939m615l168m205o863q809q752p592p139p801
59078A077595p906o000l338k522l607l695j320J153J318P37K399N712P294O267
59064A074087N465P074R966J2252J3920J5628J6827J6616J5351J4069J3045J1879
59052A226179J0494R410R221J0043J1216J1686J1110J0185R346P866N136K091
59040A333983L1j340l101m927n515m976m786n293n245m172l377l778m452m221
$$ y = [1255857, 1253328, 1252211, 1250948, 1249628, 1249767, 1251763, 1254209, 1255868, 1257020, 1258524, 1260494, 1262419, 1264007, 1265364, 1266472, 1266854, 1265980, 1263859, 1260890, 1257017, 1251553, 1244362, 1236727, 1230242, 1225076, 1220114, 1214650, 1209012, 1203669, 1198829, 1195036, 1193032, 1192695, 1192959, 1193053, 1192951, 1192444, 1190878, 1188183, 1185120, 1181989, 1178032, 1172632, 1166179, 1159172, 1151510, 1143478, 1136539, 1131924, 1128756, 1124551, 1117688, 1108879, 1100127, 1092535, 1085396, 1077595, 1069689, 1063689, 1060351, 1057829, 1054222, 1050527, 1049207, 1050360, 1051678, 1052415, 1054814, 1060526, 1067820, 1074087, 1079552, 1086626, 1096592, 1108844, 1122764, 1138392, 1155219, 1171835, 1187186, 1201255, 1214300, 1226179, 1236673, 1246083, 1255304, 1265347, 1276563, 1288249, 1299359, 1309544, 1318890, 1326756, 1331892, 1333983, 1334014, 1332674, 1329573, 1324646, 1319131, 1314155, 1309369, 1304076, 1298831, 1294659, 1291282, 1287504, 1283052, 1278831]
59026A278831l351k794k799l129l775m704n593o333p127p806p778o955n961n194
59012A205532m570m179m252m347l772l038l600n618p230o777m758k914k282k888
58998A145307m471o466p819p693o319m631l317k450j790j020M7J282K288K677
58984A105625K268J243L86O35J937K957K541J158J53K3L03O39R88J101R80J636
58968A124573M050P435R810J0544J1054J2616J4624J5679J5456J4743J4064J2969
58956A267617J0661P193L917K404K578K469M25k752m604l723j037J318J924J213
58942A289603J161L304O635Q358P324N521N146N578M813K758J071L95J6p8R97
58927A342602L037M583N208O131Q130J0349J1734J2295J2515J2585J2715J3226
$$ y = [1278831, 1275480, 1272686, 1269887, 1266758, 1262983, 1258279, 1252686, 1246353, 1239226, 1231420, 1223642, 1216687, 1210726, 1205532, 1200962, 1196783, 1192531, 1188184, 1184412, 1181374, 1177774, 1172156, 1164926, 1158149, 1153391, 1150477, 1148195, 1145307, 1140836, 1134370, 1126551, 1118858, 1112539, 1107908, 1104591, 1102141, 1100351, 1099331, 1099378, 1100660, 1102948, 1105625, 1107893, 1109136, 1109522, 1110157, 1112094, 1115051, 1117592, 1118750, 1118903, 1118926, 1119229, 1119868, 1120856, 1121957, 1122937, 1124573, 1128623, 1136058, 1145868, 1156412, 1167466, 1180082, 1194706, 1210385, 1225841, 1240584, 1254648, 1267617, 1278278, 1285471, 1289388, 1291792, 1294370, 1296839, 1297264, 1294512, 1289908, 1286185, 1285148, 1286466, 1288390, 1289603, 1290764, 1294068, 1300703, 1309061, 1316385, 1321906, 1327052, 1332630, 1337443, 1340201, 1341272, 1341667, 1341683, 1341605, 1342602, 1345639, 1350222, 1355430, 1361561, 1369691, 1380040, 1391774, 1404069, 1416584, 1429169, 1441884, 1455110]
58915A455110J4164J5568J7875K0962K3322K3579K2492K1765K1225J9177J5494
58904A670733J2108J0070Q173N192J623j594m419p004r101j0940j3300j6042j8004
58891A627495j8910j9932k1623k2800k2359k0887j9583j8744j8111j7544j6568
58880A410434j4326j0824p246m554k693j565j383j533n76J593L023K258M80j75
58866A372913M60P50j44j186j089j25K34o72j571o60J866L798L907L600M520N946
58850A392547O440O900R331J3116J5394J5292J5059J6355J8106J8967J9552K0726
58838A567785K1714K1434K0240J9105J8361J8290J9507K1692K3229K3212K2697
58827A797266K2992K3853K4113K3061K0497J6724J3094J1220J0977J0474Q605
$$ y = [1455110, 1469274, 1484842, 1502717, 1523679, 1547001, 1570580, 1593072, 1614837, 1636062, 1655239, 1670733, 1682841, 1692911, 1701084, 1706276, 1707899, 1706305, 1701886, 1694882, 1685781, 1674841, 1661541, 1645499, 1627495, 1608585, 1588653, 1567030, 1544230, 1521871, 1500984, 1481401, 1462657, 1444546, 1427002, 1410434, 1396108, 1385284, 1378038, 1373484, 1370791, 1369226, 1367843, 1366310, 1365734, 1367327, 1370350, 1372608, 1373088, 1372913, 1373373, 1374123, 1373979, 1372793, 1371704, 1371579, 1371813, 1371141, 1369570, 1368910, 1370776, 1374574, 1378481, 1382081, 1386601, 1392547, 1398987, 1405887, 1415218, 1428334, 1443728, 1459020, 1474079, 1490434, 1508540, 1527507, 1547059, 1567785, 1589499, 1610933, 1631173, 1650278, 1668639, 1686929, 1706436, 1728128, 1751357, 1774569, 1797266, 1820258, 1844111, 1868224, 1891285, 1911782, 1928506, 1941600, 1952820, 1963797, 1974271, 1982876]
58816A982876O161M032K042J90p87r30j410k510l056k721l062n174q128j0811
58802A956712j3484j6325j8364j9267k0350k2336k3844k3722k3157k3732k4939
58791A727192k5434k5307k5289k4879k3258k1172k0122k0332k0747k0408j8892
58780A481352j6438j4447j4512j6084j6656j5129j3162j2082j0756q081n294l851
58768A334860k944j331K66Q88J629L698N771N919M721L893L272J993J255K679
58754A366569M851M853K720J100Q16k2k301m462n297n554o083o710p481q829j0050
58739A324120r723q175p483q424r375q909p630o681o115n545m961m093k256N05
58725A235255L160N045O450P643Q463R121J0212J1592J2375J2239J1583J0191
$$ y = [1982876, 1989037, 1993069, 1995111, 1995301, 1994514, 1993584, 1992174, 1989664, 1986608, 1983887, 1980825, 1975651, 1967523, 1956712, 1943228, 1926903, 1908539, 1889272, 1868922, 1846586, 1822742, 1799020, 1775863, 1752131, 1727192, 1701758, 1676451, 1651162, 1626283, 1603025, 1581853, 1561731, 1541399, 1520652, 1500244, 1481352, 1464914, 1450467, 1435955, 1419871, 1403215, 1388086, 1374924, 1362842, 1352086, 1344005, 1338711, 1334860, 1331916, 1330585, 1330851, 1331739, 1333368, 1337066, 1342837, 1348756, 1353477, 1357370, 1360642, 1362635, 1363890, 1366569, 1371420, 1376273, 1378993, 1380093, 1380909, 1380887, 1378586, 1374124, 1368827, 1363273, 1357190, 1350480, 1342999, 1334170, 1324120, 1314397, 1306222, 1298739, 1290315, 1280940, 1272031, 1264401, 1257720, 1251605, 1246060, 1241099, 1237006, 1234750, 1235255, 1238415, 1243460, 1249910, 1257553, 1266016, 1275137, 1285349, 1296941, 1309316, 1321555, 1333138, 1343329]
58713A343329P043J992l367p009q180p712p441r069j2580j5804j6470j4708j2597
58700A237427j1483j0915j0027q615o780m775l344l030l048k112n92m11k260m201
58686A165834m011j876K77J491K571M286N961O518O182O135O556O326N145M637
58672A216032O050P938P944O357N565O187O289M909L676L837M217L629L072L646
58658A289348M407M334M547O240P979P590N498L741K681J172r47k947n146q335
58644A320162j1898j4729j7342k0757k4021k5330k5024k4881k4919k3696k1438
58633A086127k0003j9667j8745j6615j4478j2807j0775q650p943q403p623m772
58621I35646k259k193l339l204j482K54J021J154J315J931L061M132M405M065
$$ y = [1343329, 1350372, 1352364, 1348997, 1341988, 1333808, 1326096, 1318655, 1309586, 1297006, 1281202, 1264732, 1250024, 1237427, 1225944, 1215029, 1205002, 1196387, 1189607, 1184832, 1181488, 1178458, 1175410, 1173298, 1172706, 1172295, 1170035, 1165834, 1161823, 1159947, 1160224, 1161715, 1164286, 1168572, 1174533, 1181051, 1187233, 1193368, 1199924, 1206250, 1211395, 1216032, 1222082, 1230020, 1237964, 1244321, 1249886, 1256073, 1262362, 1267271, 1270947, 1274784, 1279001, 1282630, 1285702, 1289348, 1293755, 1298089, 1302636, 1308876, 1316855, 1324445, 1329943, 1333684, 1336365, 1337537, 1336590, 1333643, 1328497, 1320162, 1308264, 1293535, 1276193, 1255436, 1231415, 1206085, 1181061, 1156180, 1131261, 1107565, 1086127, 1066124, 1046457, 1027712, 1011097, 996619, 983812, 973037, 964387, 956444, 948041, 940418, 935646, 933387, 931194, 927855, 924651, 923169, 923423, 924444, 925598, 926913, 928844, 931905, 936037, 940442, 944507]
58607I44507M111N036O566Q663J1450J3920J4125J1244O458J476k772n873p602
58594A011309q312q606q457p551o475o305p104q009q682r199q697o097k395l12
58580I15108q96k160j932n13M20J98p29j982l264l728k541o2K195K871J911N00
58564I05396j36J23N33Q38J484K233J758l46k182j498J583N008P277Q204P915
58549I38190O804O026O533P836Q911R741J0544J0368Q328N647M431M689M704M055
58535A036807M051N137O086O154O050O365O897P914J0178J3196J5176J5438J5276
58522A154725J5910J7025J7857J8247J7988J6545J4218J2434J2160J2855J3460
58511A323424J3621J3748J4565J6635J9586K2073K3421K4867K7952L2032L4764
$$ y = [944507, 948618, 953654, 960220, 968883, 980333, 994253, 1008378, 1019622, 1026080, 1027556, 1024784, 1018911, 1011309, 1002997, 994391, 985934, 978383, 971908, 965603, 958499, 950490, 941808, 932609, 923912, 917815, 915420, 915108, 914212, 912052, 910120, 909607, 910027, 910225, 909496, 907514, 904250, 900522, 897981, 897919, 900114, 902985, 904896, 905396, 905260, 905383, 905916, 906754, 908238, 910471, 912229, 911883, 909701, 908203, 909786, 914794, 922071, 930275, 938190, 944994, 951020, 957553, 965389, 974300, 984041, 994585, 1004953, 1013281, 1018928, 1023359, 1028048, 1032752, 1036807, 1040858, 1045995, 1052081, 1058235, 1064285, 1070650, 1077547, 1085461, 1095639, 1108835, 1124011, 1139449, 1154725, 1170635, 1187660, 1205517, 1223764, 1241752, 1258297, 1272515, 1284949, 1297109, 1309964, 1323424, 1337045, 1350793, 1365358, 1381993, 1401579, 1423652, 1447073, 1471940, 1499892, 1531924, 1566688]
58500A566688L4873L3111L0662K7931K4809K0896J5665R379L434j273n452r619
58488A751104j2348j2258j0761j0552j1985j3335j4173j5939j9159k2593k5348
58477A582653k7713k9702l0735l0984l1054l0297k7473k3274k0142j9219j9234
58466A292826j8559j6734j4055j1346r947j0209j0347q627o034m628m157k890
58454A175293j232j314l163m318l584k302j516o92K57M30m0J01Q77J137J162K407
58438A163503M339M629L169K818N093P919Q894Q346P869Q103R186J1332J3921
58425A259121J5749J6864J8317J9851K0028J9006J8746J9960K1161K1180K0206
58414A470189J8007J3791Q363L844O63k622o228q657r576j0198j0297q204m397
$$ y = [1566688, 1601561, 1634672, 1665334, 1693265, 1718074, 1738970, 1754635, 1764014, 1767448, 1766175, 1760723, 1751104, 1738756, 1726498, 1715737, 1705185, 1693200, 1679865, 1665692, 1649753, 1630594, 1608001, 1582653, 1554940, 1525238, 1494503, 1463519, 1432465, 1402168, 1374695, 1351421, 1331279, 1312060, 1292826, 1274267, 1257533, 1243478, 1232132, 1222185, 1211976, 1201629, 1193002, 1186968, 1182340, 1178183, 1175293, 1174061, 1172747, 1169584, 1165266, 1161682, 1159380, 1157864, 1157172, 1157429, 1157859, 1157819, 1157920, 1158797, 1159934, 1161096, 1163503, 1167842, 1172471, 1175640, 1178458, 1183551, 1191470, 1200364, 1208710, 1216579, 1224682, 1233868, 1245200, 1259121, 1274870, 1291734, 1310051, 1329902, 1349930, 1368936, 1387682, 1407642, 1428803, 1449983, 1470189, 1488196, 1501987, 1510350, 1514194, 1514857, 1512235, 1506007, 1497350, 1487774, 1477576, 1467279, 1459075, 1454678]
58401A454678j755j107J37L678P822J0654J2713J4810J5977J5320J3610J1600
58389A558137Q933N735K960L26l595q399j1665j2584j3011j4081j4541j3356j1133
58376A473726q252m472j000K97K27J382L461L604K070K908P316J0962J0376P821
58362A510426O970P426O619M201J533q99l120m634n578o807p791p012n280n369
58348A490685p325p779n237k141l19J465L640L979J952O94K161M272N395P369
58334A498811J1168J3803J2997J1193J1392J2456J2045J1004J1246J2069J1891
58323A630075J1170J0755R918Q641Q977J1626J4043J4294J3653J3352J2414J0934
58311A769852J1472J4580J6950J6721J6354J7514J7761J5661J4486J6923K0459
$$ y = [1454678, 1452923, 1451816, 1451953, 1455631, 1463453, 1474107, 1486820, 1501630, 1517607, 1532927, 1546537, 1558137, 1567070, 1572805, 1575765, 1576091, 1572496, 1564097, 1552432, 1539848, 1526837, 1512756, 1498215, 1484859, 1473726, 1465474, 1461002, 1460002, 1460299, 1460526, 1461908, 1465369, 1468973, 1471043, 1473951, 1481267, 1492229, 1502605, 1510426, 1517396, 1524822, 1531441, 1535642, 1537175, 1536276, 1533156, 1528522, 1522944, 1516137, 1508346, 1501334, 1496054, 1490685, 1483360, 1475581, 1470344, 1468203, 1467884, 1469349, 1472989, 1476968, 1478920, 1479614, 1481775, 1486047, 1491442, 1498811, 1509979, 1523782, 1536779, 1547972, 1559364, 1571820, 1583865, 1594869, 1606115, 1618184, 1630075, 1641245, 1652000, 1661918, 1670559, 1679536, 1691162, 1705205, 1719499, 1733152, 1746504, 1758918, 1769852, 1781324, 1795904, 1812854, 1829575, 1845929, 1863443, 1881204, 1896865, 1911351, 1928274, 1948733]
58300A948733K1976K2593K3818K3436J9845J6334J6115J6850J5022J2152J1620
58289B148494J2580J2146J0723J0401J0749J0638J1457J4293J6915J7655J8987
58278B295038K3056K7166K8148K7659K8594K9866K9429K8763K9469K9114K5647
58267B601949K2178K2122K3067K1061J7493J6162J6750J6865J7379K0005K2543
58256B817574K2204K0869K1833K4223K5703K7312L0430L2683L2230L2318L5956
58245C123335M0222M1611M2577M6348M9829M8871M6361M7449N0449N0399M8423
58234C635874M9439N3271N5924N7311O0156O3381O3967O3358O5182O8811P1621
58223D308295P4698P9733Q3622Q3220Q2131Q5431R1166R4431R6256J00601J06181
$$ y = [1948733, 1970709, 1993302, 2017120, 2040556, 2060401, 2076735, 2092850, 2109700, 2124722, 2136874, 2148494, 2161074, 2173220, 2183943, 2194344, 2205093, 2215731, 2227188, 2241481, 2258396, 2276051, 2295038, 2318094, 2345260, 2373408, 2401067, 2429661, 2459527, 2488956, 2517719, 2547188, 2576302, 2601949, 2624127, 2646249, 2669316, 2690377, 2707870, 2724032, 2740782, 2757647, 2775026, 2795031, 2817574, 2839778, 2860647, 2882480, 2906703, 2932406, 2959718, 2990148, 3022831, 3055061, 3087379, 3123335, 3163557, 3205168, 3247745, 3294093, 3343922, 3392793, 3439154, 3486603, 3537052, 3587451, 3635874, 3685313, 3738584, 3794508, 3851819, 3911975, 3975356, 4039323, 4102681, 4167863, 4236674, 4308295, 4382993, 4462726, 4546348, 4629568, 4711699, 4797130, 4888296, 4982727, 5078983, 5179584, 5285765]
58212E285765J09348J11666J16636J22390J25633J28964J36091J43968J48124
58203F428585J51466J58944J68068J74003J79318J88823J99386K05265K09165
58194H063023K17507K29127K39239K50026K66321K85463L02577L20925L45449
58185A0519657L71426L91723M09953M33730M60671M84439N08820N41462N79343
58176A4701224O15035O51426O94667P38719P73534Q02931Q37523Q76057R11369
58167B1602485R48565R98242J057668J118122J184460J267149J361786J458361
58159C0996838J563571J690431J832768J974820K118817K276893K443841K607288
58151D7505267K777778K977712L207166L453217L726230M052300M437829M880009
$$ y = [5285765, 5395113, 5506779, 5623415, 5745805, 5871438, 6000402, 6136493, 6280461, 6428585, 6580051, 6738995, 6907063, 7081066, 7260384, 7449207, 7648593, 7853858, 8063023, 8280530, 8509657, 8748896, 8998922, 9265243, 9550706, 9853283, 10174208, 10519657, 10891083, 11282806, 11692759, 12126489, 12587160, 13071599, 13580419, 14121881, 14701224, 15316259, 15967685, 16662352, 17401071, 18174605, 18977536, 19815059, 20691116, 21602485, 22551050, 23549292, 24606960, 25725082, 26909542, 28176691, 29538477, 30996838, 32560409, 34250840, 36083608, 38058428, 40177245, 42454138, 44897979, 47505267, 50283045, 53260757, 56467923, 59921140, 63647370, 67699670, 72137499, 77017508]
58143G7017508N405195O056272O849848P788429Q901709J0222949J1733389J3383810
58135A47359109J5154848J7032404J8953180K0879707K2941294K5418870K8577612
58128B96317024L2511535L6898792M0509321M0979098L5766022K4106831Q196099
58121E15284722p907948k0818102k9415509l4355509l6630928l6843061l5410027
58114C13903638l2862802k9767258k6548166k3476353k0712821j8302635j6199872
58107A46033731j4351324j2732032j1308514j0030971q876902p857387o971132
58100G3905469o191508n502808m909456m403300l957463l558660l214044k921560
58092C9246670k662946k429627k227517k052780j889342j733648j596748j478878
$$ y = [77017508, 82422703, 88478975, 95328823, 103117252, 112018961, 122241910, 133975299, 147359109, 162513957, 179546361, 198499541, 219379248, 242320542, 267739412, 296317024, 328828559, 365727351, 406236672, 447215770, 482981792, 507088623, 515284722, 507376774, 486558672, 457143163, 422787654, 386156726, 349313665, 313903638, 281040836, 251273578, 224725412, 201249059, 180536238, 162233603, 146033731, 131682407, 118950375, 107641861, 97610890, 88733988, 80876601, 73905469, 67713961, 62211153, 57301697, 52898397, 48940934, 45382274, 42168230, 39246670, 36583724, 34154097, 31926580, 29873800, 27984458, 26250810, 24654062, 23175184]
58084B3175184j365875j253787j153660j068392r86982r05840q35104p79364p30923
58075A4095257o86070o49959o21608n91261n56567n25583n00677m74669m45686
58066I043177m20600m00858l79431l54667l33306l17086k99879k80524k65156
58057E991670k54351k41008k23701k09474k00867j92394j82453j76440j75105
58048D135877j71651j63525j56054j51461j45188j36070j29310j26196j21106
58039B835316j12108j04591j01092r7000q9679q2694p7694p0996o1687n4731n2549
58028A930495n1240m8113m5486m4195m1016l5533l2434l3847l5857l5263l3625
58017A493886l2536l0913k8945k8753k9593k8281k5347k4751k6683k6996k4530
$$ y = [23175184, 21809309, 20555522, 19401862, 18333470, 17346488, 16440648, 15605544, 14826180, 14095257, 13409187, 12759228, 12137620, 11546359, 10989792, 10464209, 9963532, 9488863, 9043177, 8622577, 8221719, 7842288, 7487621, 7154315, 6837229, 6537350, 6256826, 5991670, 5737319, 5496311, 5272610, 5063136, 4862269, 4669875, 4487422, 4310982, 4135877, 3964226, 3800701, 3644647, 3493186, 3347998, 3211928, 3082618, 2956422, 2835316, 2723208, 2618617, 2517525, 2420525, 2330846, 2248152, 2170458, 2099462, 2037775, 1983044, 1930495, 1879255, 1831142, 1785656, 1741461, 1700445, 1664912, 1632478, 1598631, 1562774, 1527511, 1493886, 1461350, 1430437, 1401492, 1372739, 1343146, 1314865, 1289518, 1264767, 1238084, 1211088, 1186558]
58006A186558k2523k2045k0634j8075j6875j6588j4561j2584j5226k1012k3070
57995I83365j9701j6468j6413j6248j4119j3140j4605j5105j3267j2419j3793
57984H18087j3796j0854q585r305j0394r831r491j0365j0234q505p850q803q362
57971F91712n999n304p586r603r655j0080j1635j1454q920p541q669r187p663
57958E78416o799p476o647l722k643m690n634l213j190k341l628k281q29j739
57944E25584k541o82J632J882J776L152L824J898m1O01J802R67k21O60J865N79
57928E42737k139l499l386l060k133j67J303J354J594K899L300J702L24P94J384
57913E43007Q76J346L976N928M910L285L904N266M570K452Q04j045m069o299n929
$$ y = [1186558, 1164035, 1141990, 1121356, 1103281, 1086406, 1069818, 1055257, 1042673, 1027447, 1006435, 983365, 963664, 947196, 930783, 914535, 900416, 887276, 872671, 857566, 844299, 831880, 818087, 804291, 793437, 784852, 775547, 765153, 755322, 745831, 735466, 725232, 716727, 708877, 700074, 691712, 685713, 680409, 672823, 663220, 653565, 643485, 631850, 620396, 611476, 603935, 595266, 586079, 578416, 571617, 564141, 557494, 553772, 551129, 546439, 540805, 537592, 536402, 534061, 530433, 528152, 527323, 525584, 523043, 522361, 523993, 525875, 527651, 530803, 534627, 536525, 536484, 537085, 538887, 539854, 539633, 540293, 542158, 542737, 540598, 537099, 533713, 530653, 528520, 528353, 529656, 531010, 532604, 535503, 538803, 540505, 540829, 541623, 543007, 543883, 545229, 549205, 555133, 560043, 563328, 567232, 572498, 577068, 579520, 580324, 579279, 575210, 568911, 562982]
57898E62982n086o525q741q462n983m138l664l331l209m143n091m305k215m65
57884D97624Q52K447L623L397K749L467N580P700Q762Q205O051L920L905N326
57870E63608N129K568N15O15O14j509m220n635o657q164q420o400m624n336o611
57855E15473n608l124j551q44K8J81j040j320J320M447M345J617j51P8K93o03
57839E13541j927l414n085n737m423k579k042k154j430o42j228k093j117J193
57825D80863K637K834K916K779J708Q16J733L656M477M170M127M118K937J431
57811E21202J748L762N077M536L270K530K714M177O705Q611Q631Q138R200J1108
57797F01409J1360R651Q166Q115Q532Q642R002R787J0020R016P250N381L628K157
$$ y = [562982, 557896, 551371, 542630, 534168, 528185, 524047, 520383, 517052, 513843, 509700, 504609, 500304, 498089, 497624, 498476, 500923, 504546, 507943, 510692, 514159, 519739, 527439, 536201, 544406, 550457, 554377, 558282, 563608, 568737, 571305, 571820, 572435, 573049, 571540, 567320, 561685, 555028, 546864, 538444, 532044, 527420, 522084, 515473, 509865, 506741, 505190, 504346, 504374, 504555, 503515, 502195, 503515, 507962, 512307, 513924, 513773, 513851, 514144, 513541, 511614, 508200, 503115, 497378, 492955, 490376, 488334, 486180, 484750, 484108, 482880, 480787, 479670, 480863, 483500, 486334, 489250, 492029, 493737, 494553, 496286, 499942, 504419, 508589, 512716, 516834, 519771, 521202, 522950, 526712, 531789, 536325, 539595, 542125, 544839, 549016, 555721, 564332, 572963, 581101, 590301, 601409, 612769, 622420, 630586, 638701, 647233, 655875, 664877, 674664, 684684, 693700, 700950, 706331, 709959, 712116]
57783G12116J199P55P85J253J578R95n7k91J37m82k354l337k499k058l760n616
57767F98364m871k282n94l12Q0Q39R39O10J139K419L103K866K481K123J483J000
57751G09387J163J246M70m36m65o5J3L55J551K583K513K269K642K211k56k945
57735G22236l436k537k562l048j668J300K997K452J762K481L716M230M090L617
57721G35630K685J444L00p46j429o94J609L445L029J465Q26P62k99j664j233O35
57705G45765J311j2j347j304p63p42r23q42m61P35L274O015O783N036K490J032
57689G66047J385L438O222P888P422O126O013P293Q836J0036J0610R769P695O555
57675H65335P775R536R438Q214P920P894O097L442K956M960O876P685Q806J0300
$$ y = [712116, 713315, 714070, 714855, 716108, 717686, 718681, 718624, 718333, 718470, 717988, 715634, 712297, 709798, 707740, 703980, 698364, 693493, 691211, 690617, 690305, 690385, 691224, 692163, 692773, 693912, 696331, 699434, 702300, 704781, 706904, 708387, 709387, 710550, 711796, 712266, 711830, 711365, 711300, 711313, 711668, 713219, 715802, 718315, 720584, 723226, 725437, 725181, 722236, 718800, 716263, 713701, 710653, 708985, 710285, 713282, 715734, 717496, 719977, 723693, 727923, 732013, 735630, 738315, 739759, 740059, 739313, 737884, 737190, 738799, 742244, 745273, 746738, 747564, 748326, 748027, 746363, 745130, 745765, 747076, 747064, 745717, 744413, 743650, 742908, 741985, 741143, 740682, 741417, 744691, 750706, 757489, 762525, 765015, 766047, 767432, 770870, 777092, 784980, 792402, 798528, 804541, 811834, 820670, 830706, 841316, 851085, 858780, 865335, 873110, 882646, 892084, 900298, 908218, 916112, 922209, 925651, 928607, 933567, 940443, 948128, 956934, 967234]
57661I67234J0213Q289O786O656O321N154M779N645N605L456R83j77r18k263l099
57646A024664k354j281j503k393k299j175l79o42j412j545j49K463M514M512L256
57631A024277K696L156L479L620M746O723P999Q357R313J1250J2725J3317J4668
57618A126326J7634K0785K2886K4829K7797L1350L4526L7226L9678M2108M5466
57607A470611N0447N5041N5113M8371L5998K0101K003j6114l0768m0178m5661
57596A604964m8681m8566m4680l8695l2841k7452k1988j6948j3139j0381q288
57585A293305p124o574n251k707m55K71K79O54R02L72j5Q51K440L613M246M502
57569A289309L835K321J493K311L543L781L612M083M438L492K094J926K730K911
$$ y = [967234, 977447, 985736, 992522, 999178, 1005499, 1010653, 1015432, 1021077, 1026682, 1030138, 1031121, 1030944, 1030026, 1027763, 1024664, 1022310, 1021029, 1019526, 1017133, 1014834, 1013659, 1013280, 1012638, 1011226, 1009681, 1009532, 1011995, 1016509, 1021021, 1024277, 1026973, 1030129, 1033608, 1037228, 1041974, 1048697, 1056696, 1065053, 1074366, 1085616, 1098341, 1111658, 1126326, 1143960, 1164745, 1187631, 1212460, 1240257, 1271607, 1306133, 1343359, 1383037, 1425145, 1470611, 1521058, 1576099, 1631212, 1679583, 1715581, 1735682, 1737685, 1721571, 1690803, 1650625, 1604964, 1556283, 1507717, 1463037, 1424342, 1391501, 1364049, 1342061, 1325113, 1311974, 1301593, 1293305, 1286181, 1279607, 1274356, 1271649, 1271194, 1271465, 1271744, 1272398, 1273300, 1273672, 1273657, 1274508, 1276948, 1280561, 1284807, 1289309, 1293144, 1295465, 1296958, 1299269, 1302812, 1306593, 1310205, 1314288, 1318726, 1322218, 1324312, 1326238, 1328968, 1331879]
57555A331879K348K294K926L117K690K768L658M152L479K497K349L017L836M628
57541A375638N695P039Q038P924O625N092M334M149L442K029J282K492N228P881
57527A446888R246R101P870O332N233M787M821N430O673P725P416N964M911M862
57513A537259M612L165J374O17R33J595K583M266O171P325P510P290P099P089
57499A598888P570Q761J0188J0935J0534R313Q176Q099R479J1636J3219J3347
57487A720145J2243J0940J0661J2034J4317J5825J5873J5699J6545J7580J7215
57476A879077J5835J5343J6202J7009J7012J6959J7077J6466J5185J4887J6258
57465B057310J7693J7748J7205J7453J8139J7953J6683J5180J3980J2953J1633
$$ y = [1331879, 1334227, 1336521, 1339447, 1342564, 1345254, 1348022, 1351680, 1355832, 1359311, 1361808, 1364157, 1367174, 1371010, 1375638, 1381333, 1388372, 1396410, 1404334, 1410959, 1416051, 1420385, 1424534, 1427976, 1430005, 1431287, 1433779, 1439007, 1446888, 1456134, 1465235, 1473105, 1479437, 1484670, 1489457, 1494278, 1499708, 1506381, 1514106, 1521522, 1527486, 1532397, 1537259, 1541871, 1545036, 1546410, 1547027, 1547960, 1549555, 1552138, 1556404, 1562575, 1569900, 1577410, 1584700, 1591799, 1598888, 1606458, 1615219, 1625407, 1636342, 1646876, 1656189, 1664365, 1672464, 1681943, 1693579, 1706798, 1720145, 1732388, 1743328, 1753989, 1766023, 1780340, 1796165, 1812038, 1827737, 1844282, 1861862, 1879077, 1894912, 1910255, 1926457, 1943466, 1960478, 1977437, 1994514, 2010980, 2026165, 2041052, 2057310, 2075003, 2092751, 2109956, 2127409, 2145548, 2163501, 2180184, 2195364, 2209344, 2222297, 2233930]
57454B233930R360N946K625J154J430J372k29k198l027k864k476j784o05M34R71
57439B244039J721L232M943O420Q148J0044J0740R669Q517R068J0778J1998J2466
57426B351783J3009J3675J3934J4013J4511J5072J4831J3848J2987J2728J3029
57415B503420J3761J4438J4173J2839J1666J1792J2859J3820J4376J4853J5401
57404B653398J6025J6720J6930J5877J3970J2862J3431J4798J5861J6422J6337
57393B822631J5247J3959J4204J5999J7091J6441J6117J7990K0464K0689J8598
57382C009430J6448J5516J5581J6648J8738K0514K0430J9070J8400J8928J9382
57371C209085J8902J7987J7320J7178J7725J8748J9432J9412J9294J9199J8006
$$ y = [2233930, 2243290, 2249236, 2251861, 2253015, 2254445, 2255817, 2255588, 2253390, 2250363, 2247499, 2245023, 2243239, 2242634, 2243068, 2244039, 2245760, 2248992, 2253935, 2260355, 2268503, 2278547, 2289287, 2298956, 2307473, 2316541, 2327319, 2339317, 2351783, 2364792, 2378467, 2392401, 2406414, 2420925, 2435997, 2450828, 2464676, 2477663, 2490391, 2503420, 2517181, 2531619, 2545792, 2558631, 2570297, 2582089, 2594948, 2608768, 2623144, 2637997, 2653398, 2669423, 2686143, 2703073, 2718950, 2732920, 2745782, 2759213, 2774011, 2789872, 2806294, 2822631, 2837878, 2851837, 2866041, 2882040, 2899131, 2915572, 2931689, 2949679, 2970143, 2990832, 3009430, 3025878, 3041394, 3056975, 3073623, 3092361, 3112875, 3133305, 3152375, 3170775, 3189703, 3209085, 3227987, 3245974, 3263294, 3280472, 3298197, 3316945, 3336377, 3355789, 3375083, 3394282, 3412288]
57360C412288J5453J3599J4283J6295J7268J7328J8374K0373K1213K0227J9280
57349C605981J9877K1236K1866K1388K0331J9458J9585K0907K2304K2516K1786
57338C837235K1276K1240K1151K1262K2349K4024K4955K4734K4100K3392K2329
57327D088047K1280K1213K2236K3487K4508K5522K6443K6848K6802K6531K5691
57316D358608K4163K3079K3448K4358K4199K3261K3117K3808K3817K2842K2407
57305D617107K3332K4545K4944K4786K4721K5004K5964K7811K9690L0461L0629
57294D908994L1740L3626L4128L2183K9411K7807K7409K7159K6646K6016K5270
57283E230389K4569K4370K4634K4697K4474K4795K6090K7672K8654K8712K7737
$$ y = [3412288, 3427741, 3441340, 3455623, 3471918, 3489186, 3506514, 3524888, 3545261, 3566474, 3586701, 3605981, 3625858, 3647094, 3668960, 3690348, 3710679, 3730137, 3749722, 3770629, 3792933, 3815449, 3837235, 3858511, 3879751, 3900902, 3922164, 3944513, 3968537, 3993492, 4018226, 4042326, 4065718, 4088047, 4109327, 4130540, 4152776, 4176263, 4200771, 4226293, 4252736, 4279584, 4306386, 4332917, 4358608, 4382771, 4405850, 4429298, 4453656, 4477855, 4501116, 4524233, 4548041, 4571858, 4594700, 4617107, 4640439, 4664984, 4689928, 4714714, 4739435, 4764439, 4790403, 4818214, 4847904, 4878365, 4908994, 4940734, 4974360, 5008488, 5040671, 5070082, 5097889, 5125298, 5152457, 5179103, 5205119, 5230389, 5254958, 5279328, 5303962, 5328659, 5353133, 5377928, 5404018, 5431690, 5460344, 5489056, 5516793]
57272E516793K5881K4242K4176K5373K5797K4214K1812K0631K1339K3139K5041
57261E778438K6412K7034K7277K7929K9200L0227K9900K8120K6076K5279K5987
57250F081879K6595K5278K2487K0709K1194K2323K2279K1761K2150K2474K0825
57239F329954J8009J6781J7629J8233J7503J7184J8491J9886J9699J8842J9196
57228F531407K0926K2908K4471K5345K5092K4014K3632K4944K6978K8043K7571
57217F805331K5906K3351K0427J8101J6590J4766J1682P975M887K671Q53p34j983
57204F949823k755k427j66L491O493P645Q110R434J1308J2622J3608J5072J6307
57191G048565J5856J4022J2650J2256J1337R038O801O304P098P519P018O374N973
$$ y = [5516793, 5542674, 5566916, 5591092, 5616465, 5642262, 5666476, 5688288, 5708919, 5730258, 5753397, 5778438, 5804850, 5831884, 5859161, 5887090, 5916290, 5946517, 5976417, 6004537, 6030613, 6055892, 6081879, 6108474, 6133752, 6156239, 6176948, 6198142, 6220465, 6242744, 6264505, 6286655, 6309129, 6329954, 6347963, 6364744, 6382373, 6400606, 6418109, 6435293, 6453784, 6473670, 6493369, 6512211, 6531407, 6552333, 6575241, 6599712, 6625057, 6650149, 6674163, 6697795, 6722739, 6749717, 6777760, 6805331, 6831237, 6854588, 6875015, 6893116, 6909706, 6924472, 6936154, 6944129, 6949016, 6951687, 6952540, 6951806, 6949823, 6947068, 6944641, 6944475, 6947966, 6954459, 6962104, 6970214, 6979648, 6990956, 7003578, 7017186, 7032258, 7048565, 7064421, 7078443, 7091093, 7103349, 7114686, 7123724, 7130525, 7136829, 7143927, 7151446, 7158464, 7164838, 7170811]
57178G170811N252L898K475J342j54k704n731p901q784r131r339q448n162O30
57164G127054P686J4411J9501K2195K2565K1588K0530K0217K0909K2475K4504
57153G343635K6645K8960L1499L3523L4005L3064L1874L0788K8830K5621K2531
57142G670975K0837J9997J8998J8286J8732J9494J8761J6142J2757R319N730K172
57130G852200j085m829j0127j6403k1861k5926k9700l3939l8095m1639m4884m8200
57118G535512n1720n6064o1989o9003p5506q0617q4782q8599r2324r6701j02766
57107F675441j10480j18852j27835j38704j52077j66768j81170j94577k06488
57098E278490k15731k21241k23106k22210k19257k14672k09125k03932k00954
$$ y = [7170811, 7176063, 7179961, 7182436, 7183778, 7183624, 7180920, 7175189, 7167288, 7158504, 7149373, 7140034, 7131586, 7126424, 7127054, 7134740, 7149151, 7168652, 7190847, 7213412, 7235000, 7255530, 7275747, 7296656, 7319131, 7343635, 7370280, 7399240, 7430739, 7464262, 7498267, 7531331, 7563205, 7593993, 7622823, 7648444, 7670975, 7691812, 7711809, 7730807, 7749093, 7767825, 7787319, 7806080, 7822222, 7834979, 7844298, 7850028, 7852200, 7851115, 7846286, 7836159, 7819756, 7797895, 7771969, 7742269, 7708330, 7670235, 7628596, 7583712, 7535512, 7483792, 7427728, 7365739, 7296736, 7221230, 7140613, 7055831, 6967232, 6874908, 6778207, 6675441, 6564961, 6446109, 6318274, 6179570, 6027493, 5860725, 5679555, 5484978, 5278490, 5062759, 4841518, 4618412, 4396202, 4176945, 3962273, 3753148, 3549216, 3348262]
57089C348262k01770k06366k12877k19143k24178k27522k28024k24679k18674
57080A385029k13454k12553k17737k28702k43646H529b69567k97751l20869l47871
57070a236058l78248m11572m47626m86441n28893n76418o29340o86533p47380
57061f128509q12819q83793r60367j043466j135692j238972j353229j478758j618271
57052a6653876j775069j951332k150073k376733k636950k934872l275697l667775
57044c7422377m120378m641931n242696n937088o742312p678529q771647j0049508
57036i0606466j1529095j3208186j5070491j7094530j9254453k1512538k3804843
57029b12080602k6028578k8065173k9856940l1458404l2930120l4091417l4383056
$$ y = [3348262, 3146492, 2940126, 2727249, 2508106, 2283928, 2056406, 1828382, 1603703, 1385029, 1171575, 959022, 741285, 512583, 268937, 8529, -269567, -567318, -888187, -1236058, -1614306, -2025878, -2473504, -2959945, -3488838, -4065256, -4694596, -5381129, -6128509, -6941328, -7825121, -8785488, -9828954, -10964646, -12203618, -13556847, -15035605, -16653876, -18428945, -20380277, -22530350, -24907083, -27544033, -30478905, -33754602, -37422377, -41542755, -46184686, -51427382, -57364470, -64106782, -71785311, -80556958, -90606466, -102135561, -115343747, -130414238, -147508768, -166763221, -188275759, -212080602, -238109180, -266174353, -296031293, -327489697, -360419817, -394511234, -428894290]
57022d28894290l3074194k9702043k4350178j7528258r834158j749455O317045
57015e38815531J3913804K0547199K5800755K9458577L1547781L2288918L1993471
57008c53265026L0971342K9492260K7784746K6024835K4308622K2649940K1020651
57001a71012630J9396340J7771430J6153152J4558628J3014245J1547436J0177838
56994f8393561Q918039P777438O760173N862768N078331M400593L821212L327222
56986b2447785K905219K545613K240191J978808J751723J552858J378675J226380
56978f868318J094757R83320Q88625Q04464P27318O57861N95621N36542a01443
56968C22644L76967L35886K98976K67699K43284K21978J98004J69313J37259J03239
$$ y = [-428894290, -461968484, -491670527, -516020705, -533548963, -543383121, -545132576, -538815531, -524901727, -504354528, -478553773, -449095196, -417547415, -385258497, -353265026, -322293684, -292801424, -265016678, -238991843, -214683221, -192033281, -171012630, -151616290, -133844860, -117691708, -103133080, -90118835, -78571399, -68393561, -59475522, -51698084, -44937911, -39075143, -33996812, -29596219, -25775007, -22447785, -19542566, -16996953, -14756762, -12777954, -11026231, -9473373, -8094698, -6868318, -5773561, -4790241, -3901616, -3097152, -2369834, -1711973, -1116352, -579810, -101443, 322644, 699611, 1035497, 1334473, 1602172, 1845456, 2067434, 2265438, 2434751, 2572010, 2675249]
56958B675249O9366M0082J8660K983j1688k6565l8869m6346m9162m8289m5300
56947B540121m3459m5972n2694o0442o6580p0819p3910p6373p8475q0177q1138
56936A810082q1440q1567q1157p8884p4489o9586o5402o1049n5297m8622m2171
56925A070418l5941k9477k3309j8293j4539j2175j2099j4455j7439j9046j9264
56914H54381j9274j9301j8461j6118j2376p932m141k396k567k880j959q3K056
56901G48949M465P143R564J1608J3717J5389J4979J1858P380K946j416n775r235
56888H31572j1230j2392j3106j2611j0498p679m915j869J452M031N658P732J1073
56875G87218J4601J7451K0684K5444L0779L4599L5331L1695K2838J0410j281r076
$$ y = [2675249, 2744615, 2784697, 2803357, 2806340, 2794652, 2768087, 2729218, 2682872, 2633710, 2585421, 2540121, 2496662, 2450690, 2397996, 2337554, 2270974, 2200155, 2126245, 2049872, 1971397, 1891220, 1810082, 1728642, 1647075, 1565918, 1487034, 1412545, 1342959, 1277557, 1216508, 1161211, 1112589, 1070418, 1034477, 1005000, 981691, 963398, 948859, 936684, 924585, 910130, 892691, 873645, 854381, 835107, 815806, 797345, 781227, 768851, 760919, 756778, 754382, 751815, 748935, 746976, 746893, 748949, 753414, 760557, 770121, 781729, 795446, 810835, 825814, 837672, 845052, 847998, 846582, 840807, 831572, 820342, 807950, 794844, 782233, 771735, 764056, 759141, 757272, 758724, 762755, 768413, 776145, 787218, 801819, 819270, 839954, 865398, 896177, 930776, 966107, 997802, 1020640, 1031050, 1029769, 1020693]
56863A020693j3699j7339k0080k0583j8710j5442j1293o779l479k698l591m205
56851H82795l770k876k261k502l936n741o174m708k753j412k22R90J135K36N19
56836H49320L106N598N407L836M156O853R461J0395J0465J1041J2711J5250J7158
56823I64757J5977J0891M232j216n326r191j2091j2493j1056r860r048o855k831
56810I15890J430M726P352R816J2396J5846K0630K5541K8986L1331L4010L6544
56798A144498L6589L3003K6758J8748Q837k268j2055j8041j9733j8475j6128j3724
56786A168009j0613n343J763P864J0820J2264J5636K1943K9334L6181M2246M7272
56774A377376N0741N2958N3985N1446M1887K5123N249j3185k8232l9393m5851
$$ y = [1020693, 1006994, 989655, 969575, 948992, 930282, 914840, 903547, 896768, 893289, 890591, 887000, 882795, 879025, 876149, 873888, 871386, 867450, 861709, 855535, 850827, 848074, 846662, 846440, 847430, 848565, 848801, 849320, 852426, 858024, 863431, 867267, 871423, 878276, 887737, 898132, 908597, 919638, 932349, 947599, 964757, 980734, 991625, 995857, 994641, 989315, 980124, 968033, 955540, 944484, 934624, 925576, 918721, 915890, 917320, 922046, 929398, 939214, 951610, 967456, 988086, 1013627, 1042613, 1073944, 1107954, 1144498, 1181087, 1214090, 1240848, 1259596, 1268433, 1266165, 1254110, 1236069, 1216336, 1197861, 1181733, 1168009, 1157396, 1152053, 1153816, 1161680, 1172500, 1184764, 1200400, 1222343, 1251677, 1287858, 1330104, 1377376, 1428117, 1481075, 1535060, 1586506, 1628393, 1653516, 1658765, 1645580, 1617348, 1577955, 1532104]
56763A532104m7357m5423m2089l8090l3039k6913k0572j5137j1070p684l647J616
56751A242699P360J2793J8265K4281K9991L3613L3704K9117J8779L200j4226k9111
56739A410465l9174m4455m5414m2669l8140l4166l1123k7378k1865j5415r541
56728A061125n202k671j310M32L598P482J0923J4195J7896K0397J8540J1207O54
56715A157266r900j8548k4484k7334k7546k6481k5487k5081k4801k3485k0371
56704I03748j6635j4797j5560j6521j5382j3032j1607j0949r469p509o924p771
56692G57592q208p639p320p734p893p451p194p140o433n254m641m328l175j660
56678F71522j342j743p00J795L143K245R97O98Q2j673k892k168o88M8N69J697
$$ y = [1532104, 1484747, 1439324, 1397235, 1359145, 1326106, 1299193, 1278621, 1263484, 1252414, 1244730, 1241083, 1242699, 1250059, 1262852, 1281117, 1305398, 1335389, 1369002, 1402706, 1431823, 1450602, 1453802, 1439576, 1410465, 1371291, 1326836, 1281422, 1238753, 1200613, 1166447, 1135324, 1107946, 1086081, 1070666, 1061125, 1055923, 1053252, 1051942, 1052374, 1055972, 1063454, 1074377, 1088572, 1106468, 1126865, 1145405, 1156612, 1157266, 1147366, 1128818, 1104334, 1077000, 1049454, 1022973, 997486, 972405, 947604, 924119, 903748, 887113, 872316, 856756, 840235, 824853, 811821, 800214, 789265, 779796, 772287, 765363, 757592, 749384, 741745, 734425, 726691, 718798, 711347, 704153, 697013, 690580, 685326, 680685, 676357, 673182, 671522, 670180, 668437, 667737, 669532, 672675, 674920, 675917, 676615, 676697, 675024, 672132, 669964, 669276, 669324, 669893, 671590]
56662F71590K536K192J629J923K338J959J494J678J510R8j291j062J49P18N48
56647F88009L37l26j979l419l220k265k418l192k317N19K799K591Q23m74n88l9
56631F74841P00J442J832J501N20n81j317j670k021k475k440j381N0M42n54j702
56615F67187j850j355j228j565j583q68N1L06m06j425j716j072n05r13j709j545
56599F49804j48J448K180J605k32k360k812n51K731M365M125M080N210O334O666
56584F82445P132Q317R186Q820P699O298M195J498m72j182j812l147m118l752
56570G21107k948k907l133k508j194j62J40m30j990l630l518j384M94J49j555
56555F96531k690l121l826m596m441l555k980k896k761k660l095l911m648n276
$$ y = [671590, 674126, 676318, 677947, 679870, 682208, 684167, 685661, 687339, 688849, 688947, 687656, 686594, 686743, 687461, 688009, 688346, 688020, 686041, 682622, 679402, 677137, 674719, 671527, 669210, 669729, 672528, 675119, 675942, 675468, 674880, 674841, 675541, 676983, 678815, 680316, 680836, 680255, 678938, 677268, 675247, 672772, 670332, 668951, 669001, 669443, 668889, 667187, 665337, 663982, 662754, 661189, 659606, 658738, 658789, 659095, 658689, 657264, 655548, 654476, 653971, 653058, 651349, 649804, 649656, 651104, 653284, 654889, 654657, 652297, 649485, 648934, 651665, 656030, 660155, 664235, 669445, 675779, 682445, 689577, 697894, 707080, 715900, 723599, 729897, 734092, 735590, 735118, 733936, 732124, 728977, 724859, 721107, 718159, 715252, 712119, 709611, 708417, 708255, 708395, 707965, 705975, 702345, 698827, 697443, 697937, 698086, 696531, 693841, 690720, 686894, 682298, 677857, 674302, 671322, 668426, 665665, 663005, 659910, 655999, 651351, 646075]
56541F46075n480m223j481O55L62j272j771p99j81p87j420q40P55K442L404L017
56525F38456J470K64Q80K840M244M171L408K856K512K161J970K038K230K690L725
56510F75915N004N583N050M147M081N381P383Q693Q355O843N656N790O910P991
56496G62782Q145O925M657K607J857J800Q69j050k312k040j487k036l268l951
56482G73498l721k722r35R97J480j34k357l499l696l836l706k828k004k196k710
56467G41631k334j668k319m035m668l075n63Q80N36j076k995m302m522l891k964
56452G04635k176j986k811m197m858m196l021k134j163K27J036K06j539k453k012
56437F73558j232j050j416j747j531p20Lj70r65j272q56n54l41J034L519M703
$$ y = [646075, 640595, 636372, 634891, 635546, 635908, 634636, 632865, 632066, 631885, 631098, 629678, 628838, 629593, 632035, 635439, 638456, 639926, 640190, 641070, 643910, 648154, 652325, 655733, 658589, 661101, 663262, 665232, 667270, 669500, 672190, 675915, 680919, 686502, 691552, 695699, 699780, 705161, 712544, 721237, 729592, 736435, 742091, 747881, 754791, 762782, 770927, 777852, 782509, 785116, 786973, 788773, 789642, 788592, 786280, 784240, 782753, 780717, 777449, 773498, 769777, 767055, 766120, 767117, 768597, 768463, 766106, 762607, 758911, 755075, 751369, 748541, 746537, 744341, 741631, 739297, 737629, 735310, 731275, 726607, 723532, 722969, 723849, 724385, 723309, 720314, 716012, 711490, 707599, 704635, 702459, 700473, 697662, 693465, 688607, 684411, 681390, 679256, 678093, 678320, 679356, 679562, 678023, 675570, 673558, 672326, 671276, 669860, 668113, 666582, 665862, 665865, 665695, 664730, 663458, 662602, 662048, 661707, 662741, 666260, 670963]
56421F70963K863l45j988j499n25k43n57j195j743j302K82J434O36j484l134l586
56405F58577l060j555N21J580O32r81j406r00p96r89n41J43J14N8J182K598K446
56388F57623J216J176K619L504L054K889L948M743L796J745O8p13p30j68K66l18
56372F84718j558j949r42K49L83l28r31q94k71M89O89K30J15J258L010L985L985
56355F92238L889L905L388K187Q96j55r02q70J93J277J146J19n11m52l47k18L10
56338G06093N91l22j778k112j140l13l26l77J74R67J645K093J733J25j679j991
56322G03383p50N29R83J074J173J055Q53J039J589K366L784N657O280M576K407
56307G35998K433M260N253M696M301M653M224K440R16P07P97K45k99j48L49J106
$$ y = [670963, 673826, 673481, 671493, 669994, 669469, 669226, 668669, 667474, 665731, 664429, 664711, 666145, 666781, 665297, 662163, 658577, 655517, 653962, 654483, 656063, 656695, 655714, 654308, 653408, 652612, 651623, 651082, 651225, 651339, 651397, 652579, 655177, 657623, 658839, 660015, 662634, 666138, 669192, 672081, 676029, 680772, 684568, 686313, 686381, 685668, 684938, 684770, 685036, 684718, 683160, 681211, 680269, 680518, 680901, 680573, 679642, 678748, 678477, 678966, 679655, 679885, 680000, 681258, 684268, 688253, 692238, 696127, 700032, 703420, 705607, 706503, 706348, 705446, 704576, 704769, 706046, 707192, 707311, 706800, 706348, 706001, 705783, 706093, 706684, 706362, 704584, 702472, 701332, 701019, 700693, 700316, 700490, 701457, 703102, 705195, 706928, 707053, 705374, 703383, 702633, 703162, 704145, 705219, 706392, 707447, 708300, 709339, 710928, 713294, 717078, 722735, 729015, 733591, 735998, 738431, 742691, 747944, 752640, 756941, 761594, 765818, 768258, 769174, 769881, 770678, 770923, 770624, 770476, 770825, 771931]
56291G71931K729M804N635M557K907J963J567J315J408J716J582J099J065J383
56277H05661J296J219K321L993M204K860K325L679M935M222K548J848K203K648
56263H45962L257M781P109R256J0241R336O526L126R99O56J182K022L457N274
56249I13184O605P327Q084Q814Q916Q845R626J0859J1300J1391J2793J5250J6578
56236A049572J6199J5888J6282J5665J3518J2395J4333J7633J9269J8878J8447
56225A228079J9303K1097K2897K3978K4244K4602K6155K8626L0666L1867L3057
56214A514571L4536L5779L6985L9132M2085M4618M6668M9631N4098N9113O3920
56203B021136O8511P2543P5989Q0703Q8623R8442J07176J15155J25879J40211
$$ y = [771931, 774660, 779464, 785099, 789656, 792563, 794526, 796093, 797408, 798816, 800532, 802114, 803213, 804278, 805661, 806957, 808176, 810497, 814490, 818694, 821554, 823879, 827558, 832493, 836715, 839263, 841111, 843314, 845962, 849219, 854000, 861109, 870365, 880606, 889942, 896468, 899594, 900593, 901249, 902431, 904453, 907910, 913184, 919789, 927116, 935200, 944014, 952930, 961775, 971401, 982260, 993560, 1004951, 1017744, 1032994, 1049572, 1065771, 1081659, 1097941, 1113606, 1127124, 1139519, 1153852, 1171485, 1190754, 1209632, 1228079, 1247382, 1268479, 1291376, 1315354, 1339598, 1364200, 1390355, 1418981, 1449647, 1481514, 1514571, 1549107, 1584886, 1621871, 1661003, 1703088, 1747706, 1794374, 1844005, 1898103, 1957216, 2021136, 2089647, 2162190, 2238179, 2318882, 2407505, 2505947, 2613123, 2728278, 2854157, 2994368]
56193B994368J54487J65834J75812J86981J99060K10582K21435K31459K38924
56184D778942K42602K43210K40983K33985K20701K02036J79028J50951J17765
56175F610203Q2098M6528J0715k6599o4323r9732j30869j56669j76431j90855
56165E904066k02032k10905k16316k17653k16375k13622k08622k00959j92229
56156D025353j83761j74858j65001j55620j47897j40777j32937j24757j16758
56147B682987j08135r8527q9299q1499p4450o7704o2128n7808n3211m7967m3906
56136A898353m1880m0083l7096l3960l1612k9078k5880k3287k1406j8141j3184
56125A582746r778j0082j1788j1916j0960j0513r672p018l753j866j075j47Q64
$$ y = [2994368, 3148855, 3314689, 3490501, 3677482, 3876542, 4087124, 4308559, 4540018, 4778942, 5021544, 5264754, 5505737, 5739722, 5960423, 6162459, 6341487, 6492438, 6610203, 6692301, 6738829, 6749544, 6722945, 6658622, 6558890, 6428021, 6271352, 6094921, 5904066, 5702034, 5491129, 5274813, 5057160, 4840785, 4627163, 4418541, 4217582, 4025353, 3841592, 3666734, 3501733, 3346113, 3198216, 3057439, 2924502, 2799745, 2682987, 2574852, 2476325, 2387026, 2305527, 2231077, 2163373, 2101245, 2043437, 1990226, 1942259, 1898353, 1856473, 1816390, 1779294, 1745334, 1713722, 1684644, 1658764, 1635477, 1614071, 1595930, 1582746, 1572968, 1562886, 1551098, 1539182, 1528222, 1517709, 1508037, 1501019, 1497266, 1495400, 1494325, 1494178, 1495042]
56112A495042J878L939O911Q554Q085P900R612J1420J1720J1952J3240J3790J2637
56099A616680J2450J5195J8341J9047J8830K0386K2950K4758K7087L1608L6631
56088A863963M0117M3787M9940N6922O2160O7098P4489Q3175R0217R5908J01782
56077B629558J05705J04058R7271Q8550P8664O6749N4860M6757M2823M0279L7484
56066C392758L4272K9468K2117J3951O981J93p865j5477k0920k6929l7295n0760
56054C340494o2912p2427q0697q6978q8984q7194q3853p8789p0755o1658n4748
56043B511499m9534m2967l4722k7211k1352j6370j2526j0223p825m099r13J47
56031B283904J353M939Q464Q768P760R185J2280J3959J4708J6685J8548J8045
$$ y = [1495042, 1496920, 1500859, 1507770, 1516324, 1524409, 1532309, 1541921, 1553341, 1565061, 1577013, 1590253, 1604043, 1616680, 1629130, 1644325, 1662666, 1681713, 1700543, 1720929, 1743879, 1768637, 1795724, 1827332, 1863963, 1904080, 1947867, 1997807, 2054729, 2116889, 2183987, 2258476, 2341651, 2431868, 2527776, 2629558, 2735263, 2839321, 2936592, 3025142, 3103806, 3170555, 3225415, 3272172, 3314995, 3355274, 3392758, 3427030, 3456498, 3478615, 3492566, 3499547, 3499740, 3491875, 3476398, 3455478, 3428549, 3391254, 3340494, 3277582, 3205155, 3124458, 3037480, 2948496, 2861302, 2777449, 2698660, 2627905, 2566247, 2511499, 2461965, 2418998, 2384276, 2357065, 2335713, 2319343, 2306817, 2296594, 2288769, 2284670, 2283757, 2283904, 2285257, 2290196, 2298660, 2307428, 2315188, 2324373, 2336653, 2350612, 2365320, 2382005, 2400553, 2418598]
56019B418598J7338J9678K3174K4023K3542K5468K8554K8882K7590K9089L2949
56008B698885L4735L3789L3429L4404L4889L5779L9245M3089M3302M1125M0933
55997C113604M2585M2622M1515M2521M4820M5064M4287M5953M8810M9409M9794
55986C610984N4468O1317O4214O3297O3906O6534O7049O6030O8369P3918P7735
55975D337821P9466Q3420Q9565R3674R6035J00692J06384J07981J06693J08966
55965E310697J15217J19690J21592J26156J34272J41246J46414J53985J63992
55956F533261J72388J80053J91488K05028K15124K23630K37386K55350K70289
55947H483997K82589K99435L20584L38399L52319L69616L91403M11897M32013
$$ y = [2418598, 2435936, 2455614, 2478788, 2502811, 2526353, 2551821, 2580375, 2609257, 2636847, 2665936, 2698885, 2733620, 2767409, 2800838, 2835242, 2870131, 2905910, 2945155, 2988244, 3031546, 3072671, 3113604, 3156189, 3198811, 3240326, 3282847, 3327667, 3372731, 3417018, 3462971, 3511781, 3561190, 3610984, 3665452, 3726769, 3790983, 3854280, 3918186, 3984720, 4051769, 4117799, 4186168, 4260086, 4337821, 4417287, 4500707, 4590272, 4683946, 4779981, 4880673, 4987057, 5095038, 5201731, 5310697, 5425914, 5545604, 5667196, 5793352, 5927624, 6068870, 6215284, 6369269, 6533261, 6705649, 6885702, 7077190, 7282218, 7497342, 7720972, 7958358, 8213708, 8483997, 8766586, 9066021, 9386605, 9725004, 10077323, 10446939, 10838342, 11250239, 11682252]
55938A1682252M59154M92759N24741N54751N89602O27169O57404O80359P06446
55929A6974637P37954P67768P97233Q36559Q86261R37440R91574J059592J140263
55920B5129281J221734J306018J408147J528495J651016J772032J904450K050055
55912C7971228K196431K346294K519809K722000K939617L176888L460900L804975
55904F1138142M204036M675386N264664O000421O881878P916898R121448J0471625
55896A15674498J1915644J3452293J5139854J7014997J9077000K1367010K3964325
55889B37605621K6864422K9935490L2932149L5239984L5445692L1558200K2338232
55882D51919790Q722001o267113j9276622k8410641l3554119l5494278l5094798
$$ y = [11682252, 12141406, 12634165, 13158906, 13713657, 14303259, 14930428, 15587832, 16268191, 16974637, 17712591, 18480359, 19277592, 20114151, 21000412, 21937852, 22929426, 23989018, 25129281, 26351015, 27657033, 29065180, 30593675, 32244691, 34016723, 35921173, 37971228, 40167659, 42513953, 45033762, 47755762, 50695379, 53872267, 57333167, 61138142, 65342178, 70017564, 75282228, 81282649, 88164527, 96081425, 105202873, 115674498, 127590142, 141042435, 156182289, 173197286, 192274286, 213641296, 237605621, 264470043, 294405533, 327337682, 362577666, 398023358, 429581558, 451919790, 460641791, 454374678, 435098056, 406687415, 373133296, 337639018, 302544220]
55875C02544220l3099074l0183266k6894199k3583272k0470991j7713574j5374950
55868A35224894j3414750j1761561j0368045r186380q152180p225731o410336
55861F8705911n708330n094545m548898m076933l678745l329893l011039k727929
55853C6529599k485883k270964k071523j894181j743928j609988j484009j371767
55845B1597356j275386j183602j090526j005622r34867q69615q03542p43400o93754
55836A2997042o47504o00457n59615n28444m99039m66954m39026m18667l97960
55827H439376l72251l48402l30667l12100k88124k65497k49883k36970k23633
55818E811849k15333k14407k12773k04527j94947j89499j84692j77287j71736
$$ y = [302544220, 269445146, 239261880, 212367681, 188784409, 168313418, 150599844, 135224894, 121810144, 110048583, 99680538, 90494158, 82341978, 75116247, 68705911, 62997581, 57903036, 53354138, 49277205, 45598460, 42268567, 39257528, 36529599, 34043716, 31772752, 29701229, 27807048, 26063120, 24453132, 22969123, 21597356, 20321970, 19138368, 18047842, 17042220, 16107353, 15237738, 14434196, 13690796, 12997042, 12349538, 11749081, 11189466, 10661022, 10161983, 9695029, 9256003, 8837336, 8439376, 8067125, 7718723, 7388056, 7075956, 6787832, 6522335, 6272452, 6035482, 5811849, 5596516, 5382109, 5169336, 4964809, 4769862, 4580363, 4395671, 4218384, 4046648]
55809D046648j70476j67074j57077j46294j40585j36366j28834j20809j15848
55800B763285j10726j02403r4889r1971r0080q5041p9064p4949p0217o3016n7021
55789A843908n4669n2315m7606m4592m5912m6908m3381l8453l6129l4731l2274
55778A366938l1360l2958l2273k6904k2250k2585k3496j9974j5424j5278j7487
55767A106949j6940j4408j3689j4011j2556j0859j1984j4384j4728j3920j4588
55756I54882j5576j4302j1928j1082j1031r752q104p585o784m126j368n31l29
55743H52384P95J438N33L59K615M850M441K595J089j145m809p499p762p936r532
55728H32416j0130q446p789j0352j2669j1236q277p178o658m444k516l233m035
$$ y = [4046648, 3876172, 3709098, 3552021, 3405727, 3265142, 3128776, 2999942, 2879133, 2763285, 2652559, 2550156, 2455267, 2363296, 2273216, 2188175, 2109111, 2034162, 1963945, 1900929, 1843908, 1789239, 1736924, 1689318, 1644726, 1598814, 1551906, 1508525, 1470072, 1433943, 1399212, 1366938, 1335578, 1302620, 1270347, 1243443, 1221193, 1198608, 1175112, 1155138, 1139714, 1124436, 1106949, 1090009, 1075601, 1061912, 1047901, 1035345, 1024486, 1012502, 998118, 983390, 969470, 954882, 939306, 925004, 913076, 901994, 890963, 881211, 873107, 865522, 858738, 854612, 853244, 852713, 852384, 853179, 854617, 855150, 855509, 858124, 862974, 867415, 870010, 871099, 869954, 865145, 857646, 849884, 841948, 832416, 822286, 813840, 806051, 795699, 783030, 771794, 763517, 756339, 749681, 745237, 742721, 739488, 735453]
55715G35453j456K991O272R675J5473K0753K0549J4878P350r25j0617j9499k4175
55702G76722k5161k5433k5345k3482k0821j9411j8411j5922j3188j2599j3105
55691E63844j1982r659q438p912o041l440k280k134j155j11j034k847k598l83
55677E03830Q37k43k358m567o732p969p651o976o874n960l441j914l744o644o793
55662D32801m641l531l974l564j585L22J511K679L540L450L536N078O824O928
55648D49374O099N595L875r07o539r098q549q088q834r201q670q164p258n007
55634C84628k965l600o079p225o123m203j752J724M384L665P50o37K96J166J382
55619C65411K871N626O911N729M189L574K709J158L82P51P04j35j65Q69J045k50
$$ y = [735453, 733997, 736988, 743260, 752935, 768408, 789161, 809710, 824588, 831938, 831013, 820396, 800897, 776722, 751561, 726128, 700783, 677301, 656480, 637069, 618658, 602736, 589548, 576949, 563844, 551862, 542203, 533765, 525853, 519812, 516372, 514092, 511958, 510803, 510692, 509658, 506811, 504213, 503830, 504667, 504424, 502066, 497499, 490767, 482798, 475147, 468171, 461297, 455337, 451896, 449982, 446238, 439594, 432801, 428160, 424629, 420655, 417091, 415506, 415828, 417339, 420018, 423558, 427008, 430544, 435622, 442446, 449374, 455473, 461068, 464943, 464036, 457497, 448399, 439850, 431762, 422928, 413727, 405057, 396893, 389635, 384628, 381663, 378063, 371984, 364759, 358636, 354433, 352681, 354405, 358789, 362454, 363204, 362567, 362863, 364029, 365411, 368282, 373908, 380819, 386548, 390737, 394311, 397020, 398178, 398560, 399311, 400015, 399880, 399715, 400584, 401629, 401379]
55603D01379j071m53j26j256k304j821r81j382k321k072m97J184K208K621K569
55588C95677K100J241n1j601k827l482m037m637m584l834l763n055o201n801m951
55573C48194n262o007n643m842n111n539m053j272J76j94m57ml83k137l761m282
55557B99423m276l963k832j540j737l449m723m304k766j021L48M57r70k319j928
55542B64400q46j292k833k921j047O72J187J626K441K393J115j39r70k401m220
55527B57165m431k329K24J492J674J368N39k67J34J581K552K647K930L399K731
55512B71409J133Q37K780N242O691P509P814O321K923J9o58n90k064m836p024
55497B97506p900p987p400n833l613j520J37J445K313K471J652k40k545l740l060
$$ y = [401379, 400308, 399855, 399729, 398473, 396169, 394348, 393367, 391985, 389664, 387592, 387095, 388279, 390487, 393108, 395677, 397777, 399018, 398967, 397366, 394539, 391057, 387020, 382383, 377799, 373965, 370202, 365147, 358946, 353145, 348194, 342932, 336925, 331282, 326440, 321329, 315790, 311737, 310465, 310641, 310447, 309990, 309986, 309603, 307466, 303705, 299423, 295147, 291184, 288352, 286812, 285075, 281626, 276903, 272599, 269833, 268812, 269160, 269617, 268647, 266328, 264400, 263554, 262262, 259429, 256508, 255461, 256133, 257320, 258946, 261387, 263780, 264895, 264756, 263786, 261385, 257165, 252734, 250405, 250629, 252121, 253795, 255163, 255702, 255435, 255569, 257150, 259702, 262349, 265279, 268678, 271409, 272542, 273379, 276159, 281401, 288092, 295601, 303415, 309736, 312659, 312678, 312020, 311430, 309366, 304530, 297506, 289606, 281619, 274219, 268386, 264773, 263253, 263390, 264835, 267148, 269619, 271271, 271031, 268486, 264746, 261686]
55482B61686j752j377j386j87J777K406J391P90J651K420J619n1j336k185k847
55467B62619k874k273k120k932l713l582l022k678k208j255m27l02m48l00k31
55452B34254j044k912n163o639o322m423k621k275k732k381q94P87K039K692K371
55437B04737J287P86J239O28k330m944l665L44K497J383J32Q07J595Q37o8K67
55421B05532O27j63p67K66J927K694K823K865K050J48j086m62M38l29k052k825
55405B11686k418j781j065n6N75K98j01J49M77L37L68P64J15k321m573m260j797
55388A96397M26J113O51k44p79K7K079L637L400K219J406O68o53j630r44Q11J817
55371B10401J397K47r04j448p12R28J754J003L23J228K327J287j307k410o19K317
$$ y = [261686, 259934, 258557, 257171, 256984, 258761, 261167, 262558, 263348, 264999, 267419, 269038, 268987, 267651, 265466, 262619, 259745, 257472, 255352, 252420, 248707, 245125, 242103, 239425, 237217, 235962, 235535, 235233, 234785, 234485, 234254, 233210, 230298, 225135, 218496, 212174, 207751, 205130, 202855, 200123, 197742, 196848, 197635, 199674, 202366, 204737, 206024, 206810, 208049, 208677, 206347, 201403, 197738, 198082, 200579, 201962, 202094, 202901, 204496, 205333, 205265, 205532, 206159, 205996, 205229, 205495, 207422, 210116, 212939, 215804, 217854, 218002, 216916, 216454, 216892, 216563, 214511, 211686, 209268, 207487, 206422, 206366, 206941, 207239, 207138, 207287, 207764, 208101, 208469, 209233, 209348, 207027, 202454, 198194, 196397, 196823, 197936, 198587, 198343, 197564, 197591, 199670, 203307, 206707, 208926, 210332, 211000, 210347, 208717, 207773, 208584, 210401, 211798, 212045, 211141, 209693, 208981, 209909, 211663, 212666, 212989, 214217, 216544, 217831, 216524, 214114, 213495, 215812]
55355B15812M144M469M205M011L746K778P30j660k965k812k351k457k538j956
55341B23156j273j034o68J48M17l92q63K43J650J342l47j561j931k430k901k211
55325B11345o19L39L61O24J390J511O90J45M56M82p63k531l446l047j728j87O85
55308B05707M14k18%Q38P68o60j923j721q92j091k379l195k424o13P75P70m69
55291A93687j937k541j806j47J397J802Q33o25j264o02O43J496J679J468J046
55276A95129L63n73j495j826r13J170L112L352J848J72m17k74m30j072j539j383
55260A95224q62o20j007j543j202K51J514J157m58j697j888j661j294l52P93R47
55244A87302J46rJ094J949J417O22J072K293K828K419J687P31m82j230r76n23
$$ y = [215812, 219956, 224425, 228630, 232641, 236387, 239165, 239895, 238235, 235270, 232458, 230107, 227650, 225112, 223156, 221883, 220849, 220181, 220329, 220746, 220354, 219491, 219734, 221384, 222726, 222379, 220818, 218887, 216457, 213556, 211345, 210726, 211065, 211426, 212050, 213440, 214951, 215641, 215786, 216242, 216724, 215961, 213430, 209984, 206937, 205209, 205022, 205707, 206121, 205903, 205903, 206741, 207509, 206849, 204926, 203205, 202313, 201222, 198843, 195648, 193224, 192611, 193386, 194156, 193687, 191750, 189209, 187403, 187256, 188653, 190455, 191288, 190663, 189399, 188797, 189440, 190936, 192615, 194083, 195129, 195492, 194919, 193424, 191598, 190685, 191855, 194967, 198319, 200167, 200339, 199922, 199648, 199218, 198146, 196607, 195224, 194362, 193742, 192735, 191192, 189990, 190241, 191755, 192912, 192454, 190757, 188869, 187208, 185914, 185562, 186355, 187302, 187448, 187439, 188533, 190482, 191899, 192521, 193593, 195886, 198714, 201133, 202820, 203551, 203069, 201839, 200863, 200340]
55228B00340q12j350j114k61L64O73R50P59l65j744k342k137j464RK246L650K735
55211B00137M58r41r25p51q47j11J936M037M732L829J980j09j745k402k141j462
55195B05675q14n38q10j073k79J583L018L019K471K359J703p94l913m889l176
55180B03542j143p48j320j202p5J118J600J419J229J614K216J853K72q80j5J877
55164B11357K245L74j871k732k380j674p60K87P31J34q07j200j069q43l81N86
55148B01997J541J597P68Q0K13O50N70K43P12K000K480R40j462k483j828j267
55132B06751j631j553nJ697J822Q87P16J656K385J975P53n87j386j031K58J018
55116B13725K41j027j065k6M67k9k60N45J566J845J550J249R64M75r9m31l84j94
$$ y = [200340, 199528, 198178, 197064, 196803, 197167, 197840, 198790, 199549, 199184, 197440, 195098, 192961, 191497, 191506, 193752, 197402, 200137, 200595, 199654, 198729, 197978, 197131, 197020, 198956, 202993, 207725, 211554, 213534, 213425, 211680, 209278, 207137, 205675, 204861, 204323, 203513, 202440, 202161, 203744, 206762, 209781, 212252, 214611, 216314, 215520, 211607, 206718, 203542, 202399, 201651, 200331, 199129, 199054, 200172, 201772, 203191, 204420, 206034, 208250, 210103, 210375, 209495, 209480, 211357, 213602, 213976, 212105, 209373, 206993, 205319, 204559, 204846, 205577, 205711, 204904, 203704, 202635, 201792, 201411, 201997, 203538, 205135, 205903, 205983, 206196, 206846, 207416, 207659, 208371, 210371, 212851, 213791, 212329, 209846, 208018, 206751, 205120, 203567, 203562, 205259, 207081, 207968, 208684, 210340, 212725, 214700, 215453, 214866, 213480, 212449, 212707, 213725, 213966, 212939, 211874, 211848, 212315, 212286, 212026, 212571, 214137, 215982, 217532, 218781, 219745, 220220, 220121, 219690, 219306, 219112]
55098B19112l80j172j740q10J344K473R93j696k887j940n89j92k87J08J077K016
55082B15430K292J572R2j386k396l059l170j958L25J668O46j390k039j043L5O61
55066B06280J644K795K637R70k89L62K004K699J829K79q93j357j395j240o02P80
55050B16503J996J501n56j778n19J682K248J052q4l88m93m60K22J034J139J358
55034B24457K958M723M046J093j031q54l12r44j256M27K849L668K673J245oj234
55018B42502k009j693o04M43J140J318N46q54j339J05K373L496K957J777Q63K06
55002B51227n55j609k820l709l795l106j932j65K293M476M871L281J231R1k83
54987B49496p52j689k885l795l661k379j252j672k999l181j587L09J342J921K331
$$ y = [219112, 218732, 217560, 215820, 215010, 216354, 218827, 219820, 218124, 215237, 213297, 212708, 212516, 212229, 212337, 213414, 215430, 217722, 219294, 219386, 218000, 215604, 212545, 209375, 207417, 207742, 209410, 210056, 208666, 206627, 205584, 205619, 206280, 207924, 210719, 213356, 214326, 214037, 214399, 216403, 219102, 220931, 221210, 220317, 218960, 217565, 216325, 215723, 216503, 218499, 220000, 219444, 217666, 217147, 218829, 221077, 222129, 222045, 221657, 221164, 220704, 220926, 221960, 223099, 224457, 227415, 232138, 236184, 237277, 236246, 235392, 235080, 234136, 232880, 233307, 236156, 239824, 242497, 243742, 243736, 242502, 240493, 238800, 238196, 238639, 239779, 241097, 241643, 240789, 239450, 239555, 241928, 245424, 248381, 250158, 251021, 251227, 250672, 249063, 246243, 242534, 238739, 235633, 233701, 233536, 235829, 240305, 245176, 248457, 249688, 249779, 249496, 248744, 247055, 244170, 240375, 236714, 234335, 233083, 231411, 228412, 225231, 223644, 223953, 225295, 227216, 229547]
54972B29547J811K68q12l97O25J164J561K127J646p01l127l033n26J728J965R90
54956B34836L45M72J003J679K218J992N43j655l312l399k145p87j80R4P60J477
54940B33941J243mj173j497j272r85n13M21J724L027L760L313J861O96Q29J509
54924B46880J304K49m15k92o9Q7O05J088O68k46n51p35k236m266m070j171J440
54907B38270J615J042K135M266N203M525L375K236R80R6r0m44j595k482j930p31
54891B56471m42j012j286r90n79J2Q86J179L21n54n9J295K026K026K157K246J538
54874B65235O85J204L046M501M645M211L956L752L592M021N080N894N764N062
54860C20648M747N469P018Q266P902N611K271j166m237o349o838o215n982o538
$$ y = [229547, 231358, 231626, 230814, 230417, 231042, 232206, 233767, 235894, 237540, 236839, 233712, 230679, 230153, 231881, 233846, 234836, 235181, 235653, 236656, 238335, 240553, 242545, 243088, 241433, 238121, 234722, 232577, 231790, 231610, 231704, 232464, 233941, 235184, 235180, 234007, 232510, 231238, 230253, 229740, 230161, 231885, 234912, 238672, 241985, 243846, 244542, 245371, 246880, 248184, 248433, 248018, 247726, 247657, 247744, 248349, 249437, 250105, 249859, 249308, 248573, 246337, 242071, 238001, 236830, 238270, 239885, 240927, 243062, 247328, 252531, 257056, 260431, 262667, 263647, 263743, 263653, 263209, 261614, 259132, 257202, 256471, 256029, 255017, 253731, 252741, 252162, 252174, 253060, 254239, 254560, 254006, 253947, 255242, 257268, 259294, 261451, 263697, 265235, 265920, 267124, 270170, 274671, 279316, 283527, 287483, 291235, 294827, 298848, 303928, 309822, 315586, 320648, 325395, 330864, 337882, 346148, 354050, 359661, 361932, 360766, 356529, 350180, 343342, 337127, 331145, 324607]
54846C24607o576n446m426m539m805m216l724m338m771l231m63J338J601J251
54832B82262M87p64j112P33L202L503J829J037K208L546L918M414N550N937N060
54817C21810M780O417Q504R111Q552P899O404K613k777p110q670q150p296p084
54803C35003p225o920o017n393n744o280n573l745k542k914l761l721l024k649
54789B69495k600k182j474j392k356l606m069l423k230j154l39L25O06J94l99
54774B45396j61Q38J178K01p36j68J265J864J301M59m00j465j983j118J13l8r87
54757B45559l03K381M278L199K63k104k994k654j180Q86K068J618P15P25J311
54742B53768J494J475J981K629K469J543O31j08r12j362q20K96Q82O58L45M67
$$ y = [324607, 318031, 312585, 308159, 303620, 298815, 294599, 290875, 286537, 281766, 278535, 278072, 279410, 281011, 282262, 282749, 281985, 280873, 281606, 284808, 288311, 290140, 291177, 293385, 296931, 300849, 305263, 310813, 316750, 321810, 326590, 333007, 341511, 350622, 359174, 367073, 373477, 376090, 373313, 366203, 357533, 349383, 342087, 335003, 327778, 320858, 314841, 309448, 303704, 297424, 291851, 288106, 285564, 282650, 278889, 275168, 272144, 269495, 266895, 264713, 263239, 261847, 259491, 255885, 251816, 248393, 246163, 245009, 244670, 244995, 245601, 245795, 245396, 245235, 246073, 247251, 247452, 246716, 246548, 247813, 249677, 250978, 251437, 251037, 249572, 247589, 246471, 246584, 246546, 245559, 245256, 247637, 251915, 255114, 255377, 253273, 250279, 247625, 246445, 247331, 249399, 251017, 251732, 252457, 253768, 255262, 256737, 258718, 261347, 263816, 265359, 265990, 265882, 264970, 263608, 262788, 263084, 263966, 264624, 264969, 265436]
54726B65436Q47J239J553J611J352J180J439J758J642J425J930L225M433M871
54712B93941M786M966N903P369Q573Q889Q545Q187P782O684N107M418N102N339
54698C85591L004j415n242o874p199p608p999p542o283n073m456m443m898n380
54684C14183m952l056n72Q73O86k63j105j930k943l483k754j041O13J754K694
54669B98704L527L877L791M031N019O164O631O387O025N883N645M662K570j44
54655C62772k318l315l883n104o672p307o812o352o388n867m323l195l745m843
54641B92648m375k210j95L03m45j494k064j646n03J69m27j481j750j401j478k075
54625B71576k420k421k506k271r14R10J380r2k114l191l042j962l48Q80P70l54
$$ y = [265436, 266283, 267522, 269075, 270686, 272038, 273218, 274657, 276415, 278057, 279482, 281412, 284637, 289070, 293941, 298727, 303693, 309596, 316965, 325538, 334427, 342972, 351159, 358941, 365625, 370732, 375150, 380252, 385591, 388595, 387180, 381938, 375064, 367865, 360257, 352258, 344716, 338433, 333360, 328904, 324461, 319563, 314183, 309231, 306175, 305603, 306476, 307162, 306899, 305794, 303864, 300921, 297438, 294684, 293643, 294256, 296010, 298704, 302231, 306108, 309899, 313930, 318949, 325113, 331744, 338131, 344156, 350039, 355684, 360346, 362916, 362772, 360454, 357139, 353256, 348152, 341480, 334173, 327361, 321009, 314621, 308754, 304431, 301236, 297491, 292648, 288273, 286063, 285868, 286171, 285726, 284232, 282168, 280522, 280019, 280188, 279761, 278280, 276530, 275129, 273651, 271576, 269156, 266735, 264229, 261958, 261044, 261954, 263334, 263242, 261128, 257937, 254895, 252933, 252585, 253465, 254235, 253881]
54609B53881j199j286j164q78J15J333J346O5p51l8J050J096M35J30K11J61J69
54592B54676O64J226J054R4r61j437j047j1Q96J054Q68J043J165K69j139j350
54576B57064r1Q60N00N8N90J014J46r31n47O88P52p12k139k442j920r74L39J476
54558B53731J716J380J543K321K632J817M24q26j791k361k115r67L78J052P34
54543B59668k69j242j345k04J606K976L224K440J165N8l44k6L27or55j770j923
54526B63380j669j602j831j742q34K90L38q52j614m04K012L418K910J556M22m91
54510B63287j172j056j63N44N87N73P39L85n58r08j84L13m14j288q79L43J079
54493B61228J417K163K884K483J240M65M79N44N00Q29J313J270R66J202J600R75
$$ y = [253881, 252682, 251396, 250232, 249354, 249469, 250802, 252148, 252213, 251462, 251424, 252474, 253570, 254005, 254135, 254346, 254507, 254676, 255340, 256566, 257620, 257714, 256753, 255316, 254269, 254258, 255154, 256208, 257076, 258119, 259284, 259553, 258414, 257064, 256973, 257833, 258333, 258391, 258981, 259995, 260141, 259210, 258663, 259351, 260103, 259391, 257252, 254810, 252890, 251916, 252255, 253731, 255447, 256827, 258370, 260691, 263323, 265140, 265564, 264738, 262947, 260586, 258471, 257504, 257882, 258934, 259668, 259399, 258157, 256812, 256608, 258214, 261190, 264414, 266854, 268019, 268077, 267733, 267707, 268034, 268028, 267073, 265303, 263380, 261711, 260109, 258278, 256536, 255702, 255992, 256330, 255478, 253864, 253460, 255472, 258890, 261800, 263356, 263778, 263287, 262115, 261059, 260896, 261440, 262027, 262600, 263339, 263724, 263166, 262258, 262074, 262387, 261973, 260685, 259806, 260149, 261228, 262645, 264808, 267692, 270175, 271415, 271880, 272359, 272903, 273403, 274232, 275545, 276815, 277781, 278983, 280583, 281558]
54477B81558n01j151j63J332J906J403M30n49j290j829k610l683l899k151N53
54462B69356J755N78j217j707r96l77m37q36j074o90N45K044K625J909Q90O13
54446B72981Q74P51r3j250k234k804k755j918l76J393K549K405J264L89N38Q22
54430B72536k8j590k066p70R62J730J835K345L288L655K796J146k97q52o20k29
54414B83841j8L60J173J830J673J259J839L512N038N594N496M820K750q02l991
54399C14374m728l045q77J42j08q86j524j767j738j573r84M20K152K833J643o53
54383C03681k545l176k523j024M14O93k48j054o75N2m08j779k033j39K317K855
54367B94408Q70j767k599q61J901L325K422K34j542k140j668l87J159J931J400
$$ y = [281558, 281057, 279906, 279743, 281075, 282981, 284384, 284814, 284265, 282975, 281146, 278536, 274853, 270954, 268803, 269356, 271111, 271689, 270472, 268765, 267769, 267392, 266955, 266119, 265045, 264355, 264900, 266944, 269569, 271478, 272368, 272981, 273855, 274606, 274513, 273263, 271029, 268225, 265470, 263552, 263176, 264569, 267118, 269523, 270787, 271176, 271714, 272536, 272508, 270918, 268852, 268082, 269044, 270774, 272609, 274954, 278242, 281897, 284693, 285839, 285542, 284690, 284070, 283841, 283823, 284183, 285356, 287186, 288859, 290118, 291957, 295469, 300507, 306101, 311597, 316417, 319167, 318365, 314374, 309646, 306601, 305724, 305866, 305758, 304872, 303348, 301581, 299843, 298270, 297286, 297706, 299858, 302691, 304334, 303681, 301136, 297960, 295437, 294413, 294827, 295520, 295272, 294218, 293543, 293595, 293187, 291408, 289375, 289236, 291553, 294408, 295278, 293511, 290912, 290051, 291952, 295277, 297699, 297933, 296391, 294251, 292583, 292196, 293355, 295286, 296686]
54352B96686N44O81J502J541O03K34J287K506K417J469J133J692K257K325K003
54337C18880J097n54j838j015J941M807N483M085K214J005M79J02p02k079l275
54322C30630l201k011j328k066k774j411J680L962M035L314L868N686O966O484
54308C53834M659K619J093L08J81K56q8r69j729j727j298j431k342k894j934N3
54292C48591J299P88p50k070k873l561m175m311l810k887j816j003r64j574j782
54277C19102r17j4o52k562l593k529p72m56j597k131n31K436M684M961L681J956
54261C21066L71r42j584j108m9K02q87k114k095j030j14K26M54P90R44P17l7j605
54243C13205l392l567j250J447J620l95j385J97K339K807J968J170L38j025k074
$$ y = [296686, 297230, 297911, 299413, 300954, 301557, 301791, 303078, 305584, 308001, 309470, 310603, 312295, 314552, 316877, 318880, 319977, 319423, 317585, 316570, 318511, 323318, 328801, 332886, 335100, 336105, 336584, 336686, 335984, 333905, 330630, 327429, 325418, 324090, 322024, 319250, 317839, 319519, 323481, 327516, 330830, 334698, 340384, 347350, 353834, 358493, 361112, 362205, 362513, 362694, 362950, 362862, 361893, 360164, 358437, 357139, 355708, 353366, 350472, 348538, 348591, 349890, 350678, 349928, 347858, 344985, 341424, 337249, 332938, 329128, 326241, 324425, 323422, 322458, 320884, 319102, 318185, 318171, 317519, 314957, 311364, 308835, 308063, 307607, 306010, 303879, 303348, 305784, 310468, 315429, 319110, 321066, 321437, 320495, 318911, 317803, 317754, 317956, 317069, 314955, 312860, 311830, 311716, 311942, 312396, 313186, 314130, 314847, 314810, 313205, 309813, 306246, 304996, 306443, 308063, 307668, 306283, 306480, 308819, 311626, 313594, 314764, 315102, 314077, 312003]
54228C12003j638q9J334K218K702K365Q53j003j947j713p56O45K105K805K501
54213C22385J949J459L10j359j657L49K551K510J036O48J417J225k49q25N43K191
54197C34483K609K425K459J950K02j682k297j948j786j847j343k92M79P06Q79
54182C34997J180J110M08k62L9J248J986R26j472l243l258k594k865l887m114
54167C20199k930j230N9O68L41j077k688l073k238j762k392k722j145J783L856
54152C05649L688J934M03L59J483K213J447j25q69l49K34j33q85q27J73J100J058
54135C16553J27r21j466j459j071j57J464L170L811L206K481K340K042R91J78
54120C31289O17J325O54j010j789j141j43O54J437J377o49l311l537r10J307P89
$$ y = [312003, 310365, 310276, 311610, 313828, 316530, 318895, 319748, 318745, 316798, 315085, 314329, 314974, 317079, 319884, 322385, 324334, 325793, 326103, 324744, 323087, 323436, 325987, 328497, 329533, 330181, 331598, 332823, 332574, 331749, 332292, 334483, 337092, 339517, 341976, 343926, 344128, 342446, 340149, 338201, 336415, 334568, 333225, 332933, 333412, 334118, 334997, 336177, 337287, 337695, 337433, 337472, 338720, 340706, 341632, 340160, 336917, 333659, 331065, 328200, 324313, 320199, 317269, 316039, 316098, 316766, 317107, 316030, 313342, 310269, 308031, 306269, 303877, 301155, 300010, 301793, 305649, 309337, 311271, 311674, 312033, 313516, 315729, 317176, 317051, 316182, 315833, 316067, 315934, 315049, 314222, 314395, 315495, 316553, 316680, 315759, 314293, 312834, 311763, 311606, 313070, 316240, 320051, 323257, 325738, 328078, 330120, 331111, 331289, 331906, 333231, 333885, 332875, 331086, 329945, 329802, 330456, 331893, 333270, 332621, 329310, 325773, 324863, 326170, 326959]
54104C26959p85r69l80r83k412k758j883j258j074m4J993L461L350K379J601J212
54088C28409J037R38O27k5m93m33n50j447j956m02K528M101L167J657J578K168
54072C40904J487l82j423n93R12J372M30r38j472m25J964M393N387M662L341K626
54056C62245K621K633K105R14q05k537l443l144k270j628j154m33J11k36q59k46
54040C53874J564K543J494j52n42j02m43j549j944j159j89L30O73P15j67j548
54024C53398j881n51J241K126K008J563J369J766K615L033K485K024L064M980
54010C79240N654M627L722L984M077K813J245P91Q80K24q83j332j285j672k208
53995C99877j698k7J656K639L309M181N240O269P003P100O587O074O038O307O751
$$ y = [326959, 326174, 325205, 324825, 323842, 321430, 318672, 316789, 315531, 314457, 314413, 316406, 319867, 323217, 325596, 327197, 328409, 329446, 330384, 331011, 330986, 330493, 330060, 329510, 328063, 326107, 325705, 328233, 332334, 335501, 337158, 338736, 340904, 342391, 342009, 340586, 339993, 340905, 342277, 342707, 341769, 340297, 339872, 341836, 346229, 351616, 356278, 359619, 362245, 364866, 367499, 369604, 370518, 369713, 367176, 363733, 360589, 358319, 356691, 355537, 355104, 355215, 354979, 354120, 353874, 355438, 357981, 359475, 359323, 358781, 358679, 358236, 356687, 354743, 353584, 353395, 353725, 354398, 355113, 354946, 353398, 351517, 350966, 352207, 354333, 356341, 357904, 359273, 361039, 363654, 366687, 369172, 371196, 374260, 379240, 384894, 389521, 393243, 397227, 401304, 404117, 405362, 406153, 407033, 407257, 406374, 405042, 403757, 402085, 399877, 398179, 398152, 399808, 402447, 405756, 409937, 415177, 421446, 428449, 435549, 442136, 448210, 454248, 460555, 467306]
53980D67306P724R119R827R099P839P505Q200Q843Q751Q149P493P201P662Q674
53966E83392R283Q923Q175P617O717M908L047K421K774K676J589K83p49j950l597
53951F35509n104n814n777n598n855o645p378p322o694o476o772o229m041j547
53937E54257o84j444k222k104j538j045p61r30j546j671m74J216J784J092L38
53922E44268l41k243n677q821r903r261q300p487o348m840l615l124l089k793
53908D68426j695O9J610K079J581R16M90L1n64p99k75O41J153Q91L08L77J776
53891D77015M077N988O582O121N418M893M607M675N038N337N586O508Q424J0364
53877E60633J1155J0914J0518J0053Q937P254N782M771L840L062L041L897N068
$$ y = [467306, 475030, 484149, 493976, 503075, 510914, 518419, 526619, 535462, 544213, 552362, 559855, 567056, 574718, 583392, 592675, 601598, 609773, 617390, 624107, 629015, 632062, 634483, 637257, 639933, 641522, 641805, 641056, 639106, 635509, 630405, 624591, 618814, 613216, 607361, 600716, 593338, 586016, 579322, 572846, 566074, 559845, 555804, 554257, 553573, 552129, 549907, 547803, 546265, 545220, 544459, 543529, 541983, 540312, 539838, 541054, 542838, 543930, 544268, 543927, 541684, 536007, 527186, 517283, 508022, 499722, 492235, 485887, 481047, 477432, 474308, 471219, 468426, 466731, 466800, 468410, 470489, 472070, 472986, 473476, 473507, 472943, 472144, 471869, 472510, 473663, 474554, 474862, 475239, 477015, 481092, 487080, 493662, 499783, 505201, 510094, 514701, 519376, 524414, 529751, 535337, 541845, 550269, 560633, 571788, 582702, 593220, 603273, 612210, 619464, 625246, 630017, 633857, 636919, 639960, 643857, 648925]
53864F48925O208P289P999Q055Q173R502J1965J4157J5074J4981J4464J3709J3021
53851G93522J2934J3312J3191J1958J0018Q056O320M870L734K555Q16j291k954
53838H77041l895m746n943p081p709q126q948j0286j1650j2439j2487j2424j3175
53825G58132j4674j5530j4718j3161j2573j3105j3418j2852j2102j1602j0682
53814F13715q826o709n425n488o738q400r189q352o714n676n338m814m220m491
53800E23335n131m298j963q72k910o161p272n621l330k048j618j659k456l847
53786D74149m577l615j614n31j660m131n549m438j916l72o45j417j276k13J198
53771D43393K776M136M327L020J303L82K47L88R55K151L211L167K313J904K667
$$ y = [648925, 655133, 662422, 670421, 678476, 686649, 696151, 708116, 722273, 737347, 752328, 766792, 780501, 793522, 806456, 819768, 832959, 844917, 854935, 862991, 869311, 874181, 877915, 880470, 881286, 879995, 877041, 873146, 868400, 862457, 855376, 847667, 839541, 830593, 820307, 808657, 796218, 783731, 771307, 758132, 743458, 727928, 713210, 700049, 687476, 674371, 660953, 648101, 635999, 624397, 613715, 604889, 598180, 592755, 587267, 580529, 572129, 562940, 554588, 547874, 542198, 536860, 532046, 527826, 523335, 518204, 513906, 511943, 511071, 508161, 502000, 494728, 489107, 485777, 483729, 482111, 480452, 477996, 474149, 469572, 465957, 464343, 463812, 462152, 458021, 452472, 448034, 446118, 445746, 445101, 443684, 442408, 442195, 443393, 446169, 450305, 454632, 457652, 458955, 459337, 459584, 459972, 460927, 463078, 466289, 469456, 471769, 473673, 476340]
53756D76340M223N577N581L611O96o94Q40L825N698N913O011O964P992Q163P728
53741E48468P456P567P955Q586R270R629R701J0009J0631J0768R725P890O158
53728F63813M779L358J843P42J43p68k601m451m698l268k216l319n804p398p318
53713F32837o910p370q249q720r076r839j0347r468p491o046o067o727o736n973
53699E23818n294n174n147m665l947l541l388k915k127j701j706j152L22J247
53685D84630Q3k313l608l233k832l222k900p17J700J830l07k281k301p46J107
53670D64890K425K724J728q2j433j286J79J797K511K353K414L644N575O592N655
53655D99686L388J327N73J333L102M826N439M819L927L684M051M501M783M794
$$ y = [476340, 480563, 486140, 491721, 495332, 496028, 495334, 496174, 499999, 505697, 511610, 517621, 524585, 532577, 540740, 548468, 555924, 563491, 571446, 580032, 589302, 598931, 608632, 618641, 629272, 640040, 649765, 657655, 663813, 668592, 671950, 673793, 674535, 674678, 673910, 671309, 666858, 662160, 658892, 656676, 653357, 647553, 640155, 632837, 625927, 618557, 610308, 601588, 592512, 582673, 572326, 562858, 555367, 549321, 543254, 536527, 529791, 523818, 518524, 513350, 508203, 503538, 499591, 496050, 492662, 489747, 487620, 485919, 484213, 483061, 483383, 484630, 484713, 482400, 478792, 475559, 472727, 469505, 466605, 465888, 467588, 469418, 469111, 466830, 464529, 463783, 464890, 467315, 470039, 471767, 471685, 470252, 468966, 469145, 470942, 473453, 475806, 478220, 481864, 487439, 494031, 499686, 503074, 504401, 504974, 506307, 509409, 514235, 519674, 524493, 528420, 532104, 536155, 540656, 545439, 550233]
53641E50233M312L375K575K472K968L645M251M625M583M223L906L712L377K868
53627F01125K356J593J86j340j898j435j004q60r2J300J663K41j174o48J175K459
53611F03647K994L616L781K267j74j223k70Q82Q17J01m00q21j152n38J166K481
53595F17174K036M17p24n56O33K292L774M251L384J894R13Q41J215J499J655K003
53579F42701K708L362L334K684K267K444K308J067l06n1J838L414L291K128J307
53564F74496J315J926K835L613L971M542O170P885P243L835J065K491P079J0042
53550G38508Q366L815J62q32N4J634L409M972N680N366M773M740N095M795L316
53535G93853J502N93N86K43j064k247j889k70Q78M73r36k334l392m006l673k170
$$ y = [550233, 554545, 557920, 560495, 562967, 565935, 569580, 573831, 578456, 583039, 587262, 591168, 594880, 598257, 601125, 603481, 605074, 605260, 603920, 602022, 600587, 599583, 598723, 598631, 599931, 601594, 601835, 600661, 600013, 601188, 603647, 606641, 610257, 614038, 616305, 616131, 614908, 614638, 615520, 616337, 616438, 616038, 615217, 614065, 613527, 614693, 617174, 619210, 619627, 618903, 618347, 618980, 621272, 625046, 629297, 632681, 634575, 635488, 636329, 637544, 639043, 640698, 642701, 645409, 648771, 652105, 654789, 657056, 659500, 661808, 662875, 662569, 662518, 664356, 667770, 671061, 673189, 674496, 675811, 677737, 680572, 684185, 688156, 692698, 698868, 706753, 713996, 717831, 718896, 721387, 728466, 738508, 746874, 750689, 750851, 750019, 750073, 751707, 755116, 760088, 765768, 771134, 775907, 780647, 785742, 790537, 793853, 795355, 795948, 796534, 796777, 795713, 793466, 791577, 791307, 792185, 792658, 791722, 789388, 785996, 781990, 778317, 776147]
53519G76147l61O03N87J49o39j937k881k152j07J202Q09J19K57j82k779n884o192
53502G56759l436q32m01n24P83K647L175K702K863L618L503K357J565J696J899
53487G78374J903K769N000P319Q156P463O440O173O953Q273R129Q933Q421Q980
53473H74286J0823J2463J2440J1121J0365J1663J4791J8025J9642J9475J8958
53462A034052J9425K0719K1843K2550K3481K4938K6510K7940K9407L0741L1291
53451A312897L1046L1206L2983L6067L8745L9507L8440L7084L6872L7715L8356
53440A710918L8046L7256L6523L5517L3911L2315L1375L0647K9556K8787K9342
53429B074193L0588L0825K9718K8561K8180K8187K8517K9830L1778L2497L0784
$$ y = [776147, 775786, 776389, 776976, 777125, 776486, 774549, 771668, 769516, 769409, 770611, 771420, 771539, 771796, 771614, 768835, 762951, 756759, 753323, 752491, 752090, 751566, 752349, 754996, 758171, 760873, 763736, 767354, 770857, 773214, 774779, 776475, 778374, 780277, 783046, 788046, 795365, 803521, 810984, 817424, 823597, 830550, 838823, 847952, 856885, 865306, 874286, 885109, 897572, 910012, 921133, 931498, 943161, 957952, 975977, 995619, 1015094, 1034052, 1053477, 1074196, 1096039, 1118589, 1142070, 1167008, 1193518, 1221458, 1250865, 1281606, 1312897, 1343943, 1375149, 1408132, 1444199, 1482944, 1522451, 1560891, 1597975, 1634847, 1672562, 1710918, 1748964, 1786220, 1822743, 1858260, 1892171, 1924486, 1955861, 1986508, 2016064, 2044851, 2074193, 2104781, 2135606, 2165324, 2193885, 2222065, 2250252, 2278769, 2308599, 2340377, 2372874, 2403658]
53418B403658K7604K4511K1811J9079J6453J4386J2893J1858J1138R736O105K97
53406B579529n240q304r458j0786j2929j4837j5814j6306j6871j7619j8573j9497
53394B413295j9667j8867j8293j9204k0945k1708k1137k0839k2059k4174k5727
53383B180675k5809k4167k1169j8097j6206j4956j2368p905l656j607q32J081
53371B034984M489P300Q037P641P784Q755R848J0915J2479J4663J7005J9321K1958
53358B185179K5063K8091L0412L2042L3476L5022L6549L7783L8693L9659M1314
53347B563283M4011M7303N0202N2177N3670N5266N6729N7524N8216O0395O4750
53336C163526O9808P3351P4841P5756P7506P9831Q1514Q1948Q1323P9780P7333
$$ y = [2403658, 2431262, 2455773, 2477584, 2496663, 2513116, 2527502, 2540395, 2552253, 2563391, 2573127, 2579232, 2579529, 2574289, 2565985, 2556527, 2545741, 2532812, 2517975, 2502161, 2485855, 2468984, 2451365, 2432792, 2413295, 2393628, 2374761, 2356468, 2337264, 2316319, 2294611, 2273474, 2252635, 2230576, 2206402, 2180675, 2154866, 2130699, 2109530, 2091433, 2075227, 2060271, 2047903, 2039998, 2036342, 2034735, 2033903, 2034984, 2039473, 2046773, 2054810, 2062451, 2070235, 2078990, 2088838, 2099753, 2112232, 2126895, 2143900, 2163221, 2185179, 2210242, 2238333, 2268745, 2300787, 2334263, 2369285, 2405834, 2443617, 2482310, 2521969, 2563283, 2607294, 2654597, 2704799, 2756976, 2810646, 2865912, 2922641, 2980165, 3038381, 3098776, 3163526, 3233334, 3306685, 3381526, 3457282, 3534788, 3614619, 3696133, 3778081, 3859404, 3939184, 4016517]
53325D016517P4613P2664P1522O9762O6185O1539N7647N5068N2449M8332M2623
53314D688921L6085K9199K2145J5251Q764K444m057j0758j7655k5058l3124m1273
53302D670884m8602n4595n9006o1568o2591o3493o5703o8861p0938p0422o8042
53291C977063o5956o5627o6490o6684o4997o2217o0314o0140o0465n9634n7528
53280C287011n5181n2992n0452m7460m4784m2888m1208l8946l6039l3025l0461
53269B813575k8717k7826k7251k6193k4390k2450k1379k1965k4302k7397k9380
53258B532325k8881k6301k3314k1143j9906j9352j9262j8921j7180j3715r669
53247B314681o664n317n035m823l987k271L81L944Q000J1457J3232J3622J4353
$$ y = [4016517, 4091130, 4163794, 4235316, 4305078, 4371263, 4432802, 4490449, 4545517, 4597966, 4646298, 4688921, 4725006, 4754205, 4776350, 4791601, 4800365, 4802809, 4798752, 4787994, 4770339, 4745281, 4712157, 4670884, 4622282, 4567687, 4508681, 4447113, 4384522, 4321029, 4255326, 4186465, 4115527, 4045105, 3977063, 3911107, 3845480, 3778990, 3712306, 3647309, 3585092, 3524778, 3464638, 3404173, 3344539, 3287011, 3231830, 3178838, 3128386, 3080926, 3036142, 2993254, 2952046, 2913100, 2877061, 2844036, 2813575, 2784858, 2757032, 2729781, 2703588, 2679198, 2656748, 2635369, 2613404, 2589102, 2561705, 2532325, 2503444, 2477143, 2453829, 2432686, 2412780, 2393428, 2374166, 2355245, 2338065, 2324350, 2314681, 2308017, 2302700, 2297665, 2292842, 2288855, 2286584, 2286965, 2290909, 2298909, 2310366, 2323598, 2337220, 2351573]
53234B351573J6676J9963K2870K5164K7447K9629L0974L1299L0949K9860K7919
53223B644323K5957K4844K3791K1245J7471J4381J2601J0576P197L285l28m263
53211B801080q948j3217j6133j8771k2569k6912l0010l1449l2380l3780l5805
53200B531106l8297m0614m1638m1141m0573m1263m2447m2559m1716m1212m0996
53189B078650l9694l7218l5454l5667l6768l6964l6028l4966l4237l3343l1995
53178A686316l0818l0577l1029l0940k9421k6904k4428k2288k0161j8333j7589
53167A403828j7591j6822j4899j3690j4898j7697k0097k1782k3805k5972k6524
53156A190051k4685k2013k0680k1378k3195k4735k4998k3886k2166k0626j9357
$$ y = [2351573, 2368249, 2388212, 2411082, 2436246, 2463693, 2493322, 2524296, 2555595, 2586544, 2616404, 2644323, 2670280, 2695124, 2718915, 2740160, 2757631, 2772012, 2784613, 2795189, 2802386, 2805671, 2805343, 2801080, 2792132, 2778915, 2762782, 2744011, 2721442, 2694530, 2664520, 2633071, 2600691, 2566911, 2531106, 2492809, 2452195, 2410557, 2369416, 2328843, 2287580, 2245133, 2202574, 2160858, 2119646, 2078650, 2038956, 2001738, 1966284, 1930617, 1893849, 1856885, 1820857, 1785891, 1751654, 1718311, 1686316, 1655498, 1624921, 1593892, 1562952, 1533531, 1506627, 1482199, 1459911, 1439750, 1421417, 1403828, 1386237, 1369415, 1354516, 1340826, 1325928, 1308231, 1288134, 1266352, 1242547, 1216575, 1190051, 1165366, 1143353, 1122673, 1101295, 1078100, 1053365, 1028367, 1004481, 982315, 961689, 942332]
53145I42332j8162j7179j6504j5806j5101j5224j6452j7402j6765j5551j5913
53134G62273j7967j9515j9021j7065j4648j1968r510q567r543j0975j1259j0370
53122F01865r104p752o415n680n850o276o304o158o056n356l657k042j967l282
53108E25966m465m483l441j810j17P46J55j245k102k182k562l795m866m523l000
53093D88276j598j022r28q97j075j538j730j153l40l66j341j982j209L65J152
53078D74614N82l38m36L96J518K465L137L451L252K502J373L13j04L40J197J865
53062D96127K328K954L563L467K627K070K679L952M420L190Q72q48o46J021K068
53047E29844R52j416k818k742k875m167n053l900j884j512k895l691k683j357
$$ y = [942332, 924170, 906991, 890487, 874681, 859580, 844356, 827904, 810502, 793737, 778186, 762273, 744306, 724791, 705770, 688705, 674057, 662089, 652579, 644012, 634469, 623494, 612235, 601865, 592761, 585009, 578594, 572914, 567064, 560788, 554484, 548326, 542270, 536914, 533257, 531215, 529248, 525966, 521501, 517018, 513577, 511767, 511650, 512396, 512551, 511306, 509204, 507022, 504460, 500665, 495799, 491276, 488276, 486678, 485656, 484728, 483831, 482756, 481218, 479488, 478335, 477995, 477629, 476288, 474306, 473097, 473462, 474614, 475196, 474858, 474422, 474818, 476336, 478801, 481938, 485389, 488641, 491143, 492516, 492829, 492725, 493065, 494262, 496127, 498455, 501409, 504972, 508439, 511066, 513136, 515815, 519767, 524187, 527377, 528249, 527401, 526755, 527776, 529844, 530796, 529380, 526562, 523820, 520945, 516778, 511725, 507825, 505941, 504429, 501534, 497843, 495160, 493803]
53033D93803j235j668j435j077j891l473l982k720r36NM5k23m93n77k21L31J98
53016D74451r69k158j943j45J923K782K100P67j17l64p11j719k917l493l453l309
53000D60725k920j813o27p02j744j600O13K752K567J087R62K287K548N80j814
52985D62901k672k115j107J12J296J601R47O03J245J671P28p24j198q82q83j010
52969D60513j13J717L052L212K864K426J317o91k511k814j549R0Q78N68m5N9J098
52952D70071K398L262L570L356K556J475Q57R53J144J011R71J309J475J076O96
52937D96180P52N40m13r64J50K027K504J099m35n41N51J737K388K555K656L032
52921E13818L305K578R18j58K99J049M79p59p48P38K156K753L021K908J817N70
$$ y = [493803, 492568, 490900, 489465, 488388, 486497, 483024, 479042, 476322, 475386, 475391, 475436, 475213, 474720, 474143, 473922, 474253, 474451, 473482, 471324, 469381, 469236, 471159, 473941, 476041, 476808, 476691, 476327, 475616, 473897, 470980, 467487, 464034, 460725, 457805, 455992, 455365, 454663, 452919, 451319, 451932, 454684, 457251, 458338, 459300, 461587, 464135, 464715, 462901, 460229, 458114, 457007, 457119, 458415, 460016, 460963, 461566, 462811, 464482, 465210, 464486, 463288, 462406, 461523, 460513, 460400, 462117, 465169, 468381, 471245, 473671, 474988, 474297, 471786, 468972, 467423, 467513, 468391, 468959, 468914, 468973, 470071, 472469, 475731, 479301, 482657, 485213, 486688, 487545, 488498, 489642, 490653, 491624, 492933, 494408, 495484, 496180, 496932, 497472, 497059, 496095, 496245, 498272, 500776, 501875, 501440, 500899, 501450, 503187, 505575, 508130, 510786, 513818, 517123, 519701, 520619, 520461, 520760, 521809, 522288, 521529, 520781, 521519, 523675, 526428, 529449, 532357, 534174, 534744]
52905E34744R02K555L136J668L3j31J62o60k150k920k851k644k346j912k162l621
52889E21803n249n653m877l678j916P23L055L188J072j096j322K27J837K181J382
52874E11677N45L78M21j28j098j516j068m65k86m45q64j524j705n91J048J300
52858E05679k07j625j574q60o09m54Q4J79p61j539r37J75L88J59P11J550J332
52841E01691L75J47P38J099J262J917K174M13k502l604j942J98R65J287K301K838
52825E09357J377j178k670k613k180j988j591p64K15J361K810M017M200L507K808
52810E16668K421K001J505J296J160K98j314k491k359j718k055l486m490l790
52796E03646j873l25r5q56j827k628l347m196n256o202o245m852k693j269j246
$$ y = [534744, 535646, 538201, 541337, 543005, 543038, 542907, 543069, 542409, 540259, 537339, 534488, 531844, 529498, 527586, 525424, 521803, 516554, 510901, 506024, 502346, 500430, 501153, 504208, 507396, 508468, 507372, 506050, 506277, 508114, 510295, 511677, 512222, 512600, 513021, 512893, 511795, 510279, 509211, 508746, 508460, 508015, 507151, 505627, 503922, 503331, 504379, 505679, 505472, 503847, 502273, 501413, 500804, 500350, 500434, 500613, 499852, 498313, 497376, 497551, 497939, 498098, 498809, 500359, 501691, 502066, 502213, 502951, 504050, 505312, 507229, 509403, 509816, 507314, 503710, 501768, 501966, 502931, 504218, 506519, 509357, 510734, 509556, 506886, 504273, 502093, 500105, 498514, 497750, 497965, 499326, 502136, 506153, 510353, 513860, 516668, 519089, 521090, 522595, 523891, 525051, 525349, 524035, 521544, 519185, 517467, 515412, 511926, 507436, 503646, 501773, 501448, 501353, 500497, 498670, 496042, 492695, 488499, 483243, 477041, 470796, 465944, 463251, 461982, 460736]
52781D60736j622j051L71J378J300Q19Q16J120Q10m46j722j688m3K076L143K547
52765D68544Q45q30j340k58J317J329p64k698k097n3J48j998l163j116J789K154
52749D61809M36l78L18L65r96j774o44Q65P49p10j784j577m98N87Q39k1j189j537
52731D54860j163j105j456j193k21J15o87j228n07K80j92q37L84L193N086M483
52715D59812K229Pj231j162J0J110P06j133k630k461j326p50j000j088m33M16
52699D51076Q03J027J863L274M092L199R01j135j441p4J637K536K561K319K202
52684D74840K183K279K766L737M755N197M822L807K389Q96j60n82j016k258l818
52669D99837m046k128O56K339K424J926J795K111K495K398J112j529m464o165
$$ y = [460736, 459114, 458063, 458434, 459812, 461112, 461931, 462747, 463867, 464677, 464231, 462509, 460821, 460778, 462854, 465997, 468544, 469389, 468559, 467219, 466961, 468278, 469607, 468843, 466145, 464048, 463995, 464143, 462145, 458982, 457866, 459655, 461809, 462245, 461867, 462185, 462550, 461554, 459780, 459136, 460001, 460750, 460040, 458256, 456679, 456181, 456768, 457607, 457586, 456397, 454860, 453697, 452592, 451136, 449943, 449722, 449837, 449150, 447922, 447415, 447695, 447503, 446666, 447050, 450243, 455329, 459812, 462041, 462048, 460817, 459655, 459665, 460775, 461481, 460348, 457718, 455257, 453931, 453181, 452181, 451093, 450660, 451076, 451879, 452906, 454769, 458043, 462135, 465334, 466235, 465100, 463659, 463585, 465222, 467758, 470319, 472638, 474840, 477023, 479302, 482068, 485805, 490560, 495757, 500579, 504386, 506775, 507671, 507511, 506929, 505913, 503655, 499837, 495791, 493663, 494319, 496658, 499082, 501008, 502803, 504914, 507409, 509807, 510919, 509390, 504926, 498761]
52655D98761o116m904l028o41J604K700K687K848L868M670L856J743L0k14M12
52640E08276N83k84j629k424k194j370o61k80NK86L55L3p84k185l828m722m035
52623D85142k135j20J427K485K718J767L51k11O7j73j354k066j274o9k9q80j158
52606D84488m10O16J425K009J923O73r96j421O3K436M395N484N810N501M825M103
52590E20924L254K074J001P56J048N96j111k929l482k839k063j668j313p26j82
52575E13340P4K64P94J660K319K209J571J529K786M227L655N46k716l346j523
52560E27389r6q58k320j858Q14L354L618J833j22q34m02J77J88k75p22j015j474
52543E27397k171k560k094r63J66R34J343J356J025Q20J043J057P2j275j292L56
$$ y = [498761, 492645, 487741, 484713, 484072, 485676, 488376, 491063, 493911, 497779, 502449, 506305, 508048, 508078, 507864, 508276, 508859, 508575, 506946, 504522, 502328, 500958, 500297, 500017, 500022, 500308, 500663, 500696, 499912, 497727, 493899, 489177, 485142, 483007, 482887, 484314, 486799, 489517, 491284, 491635, 491424, 491491, 491318, 489964, 487898, 486624, 486555, 486526, 485646, 484488, 484078, 484694, 486119, 488128, 490051, 490724, 489728, 488307, 488370, 490806, 495201, 500685, 506495, 511996, 516821, 520924, 524178, 526252, 527253, 528009, 529057, 529653, 528542, 525613, 522131, 519292, 517229, 515561, 514248, 513522, 513340, 513414, 513678, 514472, 516132, 518451, 520660, 522231, 523760, 526546, 530773, 534428, 534974, 532258, 528912, 527389, 527293, 526435, 524115, 522257, 523071, 526425, 530043, 531876, 531754, 530920, 530518, 530695, 530883, 530608, 529886, 528871, 527397, 525226, 522666, 520572, 519609, 519775, 520709, 522052, 523408, 524433, 525253, 526296, 527353, 527425, 526150, 524858, 525214]
52527E25214J810J345m04j522j344o85l5J022K606L883L972K769P58j389k894
52512E35106l167k214n07J289K246J419r42k955k951j571r16j719k574k070m49
52497E18025J071J637J041k74j235j070m65p35j659j582m9J183O90n60q33j13
52481E15072M97R15J963L503M281L661K283R83L4l95n0Q87J731K003J790J445
52465E40603J320J602K019J857Q16m04r37r09j093j590j562m14J356K652K881
52450E48197K457K294K767L198K671J314R3o27j457k660l488l413l020k897k580
52435E42849j582o30o64j319j611j448j213n05J085K438J905k84k179k602j890
52420E32350m29J591K889J919m19j053J097L329K952J018L92J506K408K212K132
$$ y = [525214, 527024, 528369, 527965, 526443, 525099, 524414, 524379, 525401, 528007, 531890, 535862, 538631, 539389, 538000, 535106, 531939, 529725, 529218, 530507, 532753, 534172, 533230, 530275, 527324, 525753, 524837, 523118, 520544, 518474, 518025, 519096, 520733, 521774, 521500, 520265, 519195, 518730, 517995, 516336, 514754, 514705, 515888, 516578, 516018, 515185, 515072, 515569, 516484, 518447, 521950, 526231, 529892, 532175, 533158, 533192, 532797, 532747, 533634, 535365, 537368, 539158, 540603, 541923, 543525, 545544, 547401, 548217, 547813, 546876, 545967, 544874, 543284, 541722, 541308, 542664, 545316, 548197, 550654, 552948, 555715, 558913, 561584, 562898, 562991, 562364, 560907, 558247, 554759, 551346, 548326, 545429, 542849, 541267, 540637, 539973, 538654, 537043, 535595, 534382, 533877, 534962, 537400, 539305, 539021, 536842, 534240, 532350, 531921, 533512, 536401, 538320, 537901, 536848, 537945, 541274, 544226, 545244, 545636, 547142, 549550, 551762, 553894]
52405E53894K979L807L593K866K798L639M624M855L879J852m33k103k934l317
52391E79999l545l591l542l710m063m003k967j140O28J444R82l21j644k415k567
52376E49545k128r84O84K051K295J533P46P20J323J796J561Q41N56J375K718L127
52360E67759J992M50R8J185K678L657L844L188J991J380K381M327N360N004N075
52345F10369P158J0169J1573J0382P729M807J707j561m200n360n129m226l260
52332F40158k599k446k490k047r29J33M36J53k53r24k097l013k531q39N17P46
52316F21975R35K342M415N587N659O050P563R084R153P970O924O547N965M462
52302G04631K676J755J880K305K586K982L571L636K528Q62K65J743M472O456O405
$$ y = [553894, 556873, 560680, 564273, 567139, 569937, 573576, 578200, 583055, 586934, 588786, 588353, 586250, 583316, 579999, 576454, 572863, 569321, 565611, 561548, 557545, 554578, 553438, 554066, 555510, 556492, 556171, 554527, 552112, 549545, 547417, 546433, 547117, 549168, 551463, 552996, 553742, 554462, 555785, 557581, 559142, 559983, 560539, 561914, 564632, 567759, 569751, 570201, 570299, 571484, 574162, 577819, 581663, 584851, 586842, 588222, 590603, 594930, 600290, 605294, 610369, 617527, 627696, 639269, 649651, 657380, 662187, 663894, 662333, 658133, 652773, 647644, 643418, 640158, 637559, 635113, 632623, 630576, 629647, 629780, 630216, 630369, 630116, 629192, 627095, 624082, 621551, 620712, 621229, 621975, 622910, 625252, 629667, 635254, 640913, 646963, 654526, 663610, 672763, 680733, 687657, 694204, 700169, 704631, 707307, 709062, 710942, 713247, 715833, 718815, 722386, 726022, 728550, 729412, 729677, 731420, 735892, 742348, 748753]
52287G48753M995M163N042O680P215O323N836P461J0411J2219J1748J0429J0256
52274H51531J1522J3089J4144J4818J5438J6002J6455J6938J7780J9463K2315
52263A029495K5823K8663L0076L0839L2071L3450L3664L2680L2116L2949L4141
52252A375967L4321L3933L4431L6036L7593L8337L8479L8045L6497L3981L1845
52241A769465L1052L0855K9907K8250K7143K6917K6015K2659J7121J1741Q622
52230B029747P578O568M047M89k559m420n610o473o481n365m146m193n529o748
52216A996905o563m873k369K62K603M506O046P250Q011Q496R363J1025J2951J4421
52202B068034J5717J7607J9783K1139K1814K3424K6432K8641K7775K4605K1932
$$ y = [748753, 753748, 757911, 762953, 769633, 776848, 783171, 789007, 796468, 806879, 819098, 830846, 841275, 851531, 863053, 876142, 890286, 905104, 920542, 936544, 952999, 969937, 987717, 1007180, 1029495, 1055318, 1083981, 1114057, 1144896, 1176967, 1210417, 1244081, 1276761, 1308877, 1341826, 1375967, 1410288, 1444221, 1478652, 1514688, 1552281, 1590618, 1629097, 1667142, 1703639, 1737620, 1769465, 1800517, 1831372, 1861279, 1889529, 1916672, 1943589, 1969604, 1992263, 2009384, 2021125, 2029747, 2037325, 2043893, 2047940, 2048429, 2045870, 2041450, 2035840, 2029367, 2022886, 2017521, 2013375, 2009182, 2003653, 1996905, 1990342, 1985469, 1983100, 1983362, 1985965, 1990471, 1996517, 2003767, 2011778, 2020274, 2029637, 2040662, 2053613, 2068034, 2083751, 2101358, 2121141, 2142280, 2164094, 2187518, 2213950, 2242591, 2270366, 2294971, 2316903]
52191B316903K0910K0078J8052J5394J3177J1009P558K504k782o481q027q686
52179B399609j0388j3631j6922j8824j9979k1898k4244k5094k4164k3797k5670
52168B174998k8182k8587k6636k4375k3119k2423k1762k1369k1118k0132j8029
52157A919266j5497j3220j1175r355q104p234n807l540j491o48n74l53j65p51
52143A841352j668j380P49L520N230N304M385L505L453M401N654O177N714N030
52129A891426M805M722M159L286K706K111K51l457p847j0924j1668j0704r525
52116A859341r304j0091j0786j0110p946n537m104l518k819j747j044j150j384
52103A789801q85J51P82P84J038K285L933M628L936K882K600K988L215L150L442
$$ y = [2316903, 2337813, 2357891, 2375943, 2391337, 2404514, 2415523, 2423081, 2425585, 2422803, 2416322, 2408295, 2399609, 2389221, 2375590, 2358668, 2339844, 2319865, 2297967, 2273723, 2248629, 2224465, 2200668, 2174998, 2146816, 2118229, 2091593, 2067218, 2044099, 2021676, 1999914, 1978545, 1957427, 1937295, 1919266, 1903769, 1890549, 1879374, 1870019, 1861915, 1854681, 1848874, 1845334, 1843843, 1843195, 1842621, 1842268, 1842103, 1841352, 1839684, 1838304, 1839053, 1842573, 1847803, 1853107, 1857492, 1860997, 1864450, 1868851, 1874505, 1880682, 1886396, 1891426, 1896231, 1900953, 1905112, 1908398, 1911104, 1913215, 1913466, 1910009, 1902162, 1891238, 1879570, 1868866, 1859341, 1850037, 1839946, 1829160, 1819050, 1811104, 1805567, 1801463, 1797945, 1795126, 1793379, 1792335, 1791185, 1789801, 1788916, 1789067, 1789849, 1790633, 1791671, 1793956, 1797889, 1802517, 1806453, 1809335, 1811935, 1814923, 1818138, 1821288, 1824730]
52088A824730M216M607M038L182L163M242N874P505Q642Q693P662O686O950Q199
52074A908389R208R653J0395J1874J3341J4302J5751J9109K4302K9581L3276L5317
52062B134498L7050L9605M2595M4573M4788M4008M3343M2912M2308M1793M1881
52051B599354M2088M1238L9084L6512L4103L1580K8889K6626K5022K3470K1429
52040B949395J8937J5964J2303Q258M414M55m521j0061j4192j6013j7150j9674
52028B928115k3551k7059k8907k9048k8242k7562k7577k7398k5461k1872j8730
52017B642708j7427j6900j5405j2742r639o325k893J18K763O006R819J2507J3367
52004B605957J4305J6954J9932K1194K1547K3007K4989K5203K3684K2648K2594
$$ y = [1824730, 1828946, 1833553, 1837591, 1840773, 1843936, 1848178, 1854052, 1861557, 1870199, 1878892, 1886554, 1893240, 1900190, 1908389, 1917597, 1927250, 1937645, 1949519, 1962860, 1977162, 1992913, 2012022, 2036324, 2065905, 2099181, 2134498, 2171548, 2211153, 2253748, 2298321, 2343109, 2387117, 2430460, 2473372, 2515680, 2557473, 2599354, 2641442, 2682680, 2721764, 2758276, 2792379, 2823959, 2852848, 2879474, 2904496, 2927966, 2949395, 2968332, 2984296, 2996599, 3004857, 3009271, 3009726, 3005205, 2995144, 2980952, 2964939, 2947789, 2928115, 2904564, 2877505, 2848598, 2819550, 2791308, 2763746, 2736169, 2708771, 2683310, 2661438, 2642708, 2625281, 2608381, 2592976, 2580234, 2570595, 2564270, 2561377, 2561495, 2564258, 2570264, 2580083, 2592590, 2605957, 2620262, 2637216, 2657148, 2678342, 2699889, 2722896, 2747885, 2773088, 2796772, 2819420, 2842014]
51993B842014K1766J9596J7435J5413J1673N671n19n321r577j4162j8136k0653
51981B865200k2635k4960k6835k7460k7675k8634l0145l1636l3264l4910l5462
51970B541584l4387l2747l1712l1278l1308l2160l3272l3020l1258l0129l0837
51959B189476l1491l0057k7637k6603k6887k6650k5555k4792k4459k3443k1813
51948A900089k0976k1425k2283k3298k5375k8616l1480l2527l1844l0243k8142
51937A603880k5832k4054k3513k3993k4317k3338k1202j9479j9525k0843k1838
51926A355946k1998k2096k2280k1762k0818k1005k2361k2611k0586j8370j8080
51915A123979j8403j6851j3806j1501j0069p656l987q50R30K300L751M800N832
$$ y = [2842014, 2863780, 2883376, 2900811, 2916224, 2927897, 2933568, 2933049, 2927728, 2918151, 2903989, 2885853, 2865200, 2842565, 2817605, 2790770, 2763310, 2735635, 2707001, 2676856, 2645220, 2611956, 2577046, 2541584, 2507197, 2474450, 2442738, 2411460, 2380152, 2347992, 2314720, 2281700, 2250442, 2220313, 2189476, 2157985, 2127928, 2100291, 2073688, 2046801, 2020151, 1994596, 1969804, 1945345, 1921902, 1900089, 1879113, 1857688, 1835405, 1812107, 1786732, 1758116, 1726636, 1694109, 1662265, 1632022, 1603880, 1578048, 1553994, 1530481, 1506488, 1482171, 1458833, 1437631, 1418152, 1398627, 1377784, 1355946, 1333948, 1311852, 1289572, 1267810, 1246992, 1225987, 1203626, 1181015, 1160429, 1142059, 1123979, 1105576, 1088725, 1074919, 1063418, 1053349, 1045693, 1041706, 1040856, 1041786, 1044086, 1047837, 1052637, 1058469]
51902A058469P806J0010J0593R704R397R946R189O511M658N940Q996J1143J2047
51889A174409J3245J5571J8759K2171K4201K2284J5481O356j385o488j0009j2548
51877A282047j3401j2281j0152q192o958o631p191q323r708j1389j3477j5767
51865A158577j7929j9801k1205k1998k2421k2841k2975k2171k0561j8974j7578
51854I30123j5753j3614j2168j1417r892p011m431l805m345m045k261K72K944
51841H44597N225N878M011O36k323m298o081p965r366j0093j0543j0654r904q384
51827G80736o708m967k892q96K78Q25J590K696L677M849O845Q804Q917P174N785
51812H16713O041O548N660M032L099K328J00l145m795l537j253o14j848k948k458
$$ y = [1058469, 1066275, 1076285, 1086878, 1096582, 1105979, 1115925, 1125114, 1131625, 1136283, 1142223, 1151219, 1162362, 1174409, 1187654, 1203225, 1221984, 1244155, 1268356, 1290640, 1306121, 1312477, 1311092, 1304604, 1294595, 1282047, 1268646, 1256365, 1246213, 1238021, 1231063, 1224432, 1217241, 1208918, 1199210, 1187821, 1174344, 1158577, 1140648, 1120847, 1099642, 1077644, 1055223, 1032382, 1009407, 987236, 966675, 947701, 930123, 914370, 900756, 888588, 877171, 867279, 860268, 855837, 852032, 847687, 843642, 841381, 841653, 844597, 849822, 855700, 859711, 860347, 858024, 853726, 847645, 839680, 830314, 820221, 809678, 799024, 789120, 780736, 774028, 769061, 766169, 765273, 765551, 766376, 767966, 770662, 774339, 779188, 786033, 794837, 803754, 810928, 816713, 822754, 829302, 834962, 838994, 842093, 844421, 844521, 841376, 836581, 833044, 831791, 831177, 829329, 826381, 823923]
51797H23923q87O01J797L168M460M523K598p16m032o332p371p445p273p750r119
51782G90145j0486j0668r556q113p031o015m589l086k310k492k859k284k56K605
51768G23005M892N396L953J487o80j641j378p37p27j535k398k581k307k190k065
51753G20494j033J100L098L475K165N35j58J46Q23J556K215K122N14j947l078
51738G32027j520J328K787J993M08m74n65j62P86J755J508o6j207o46L45l36k652
51721G35309m662n111m233k427J78K895M648N147M851M067L218L487N626Q368
51707G61361R759R836J0103J0511R399O733M735M259L044p51n381p849p891p490
51693H00378p650p818p801q111q584q457p674o761n718m314l040k322j311R08
$$ y = [823923, 823036, 823637, 825434, 828602, 833062, 837585, 840183, 839467, 835435, 829103, 821732, 814287, 807014, 799264, 790145, 779659, 768991, 759435, 751322, 744291, 738276, 733687, 730601, 728291, 725799, 722940, 720656, 720400, 723005, 727897, 733293, 737246, 738733, 738053, 736412, 735034, 734297, 733570, 732035, 729637, 727056, 724749, 722559, 720494, 719461, 720561, 723659, 727134, 729299, 729834, 729676, 729822, 730645, 732201, 734416, 736538, 737052, 735105, 732027, 730507, 731835, 734622, 736615, 737023, 736549, 735984, 735822, 736608, 738363, 739871, 739805, 738598, 737952, 738297, 737961, 735309, 730647, 725536, 721303, 718876, 719054, 721949, 726597, 731744, 736595, 740662, 743880, 747367, 752993, 761361, 771120, 780956, 791059, 801570, 810969, 817702, 822437, 826696, 829740, 828989, 823608, 815759, 807868, 800378, 792728, 784910, 777109, 768998, 760414, 751957, 744283, 737522, 731804, 727490, 724450, 722128, 720817, 721725]
51679G21725L386M346M004M330O037P713Q219P996P394N668K654q6r41j16J178
51664G83507K323L304L920L905L197J553j200m055n113l827j913j165j365j450
51650G81621j694l127n383o708o096m258k449j217l00J013L313O016P144N101
51636G72976O70l514n489n352m426l945m504n636n863m117j402o8j009k450k237
51621G23634n12P72N91PL99J486J917J429J350K626M230M518L697L631N221P307
51605G62303Q655R615J0883J1829J1399R797P774M957O16m135o743o058l434p66
51591H16692J237K621L545M450N583N804L272k038p755j1723j3904j5005j4809
51578G77970j3097j0993r777r227q511p927q197q556p373m606k126j362j861k350
$$ y = [721725, 725111, 729457, 733461, 737791, 743828, 751541, 759760, 767756, 775150, 780818, 783472, 783386, 782445, 782329, 783507, 785830, 789134, 793054, 796959, 800156, 801709, 800509, 796454, 791341, 787514, 785601, 784436, 783071, 781621, 779927, 776800, 771417, 764709, 758613, 754355, 751906, 750689, 750389, 751402, 754715, 760731, 767875, 772976, 773646, 770132, 764643, 759291, 754865, 750920, 746416, 740780, 734917, 730800, 729398, 729330, 728321, 725871, 723634, 723122, 723894, 724485, 724492, 724891, 726377, 728294, 729723, 731073, 733699, 737929, 742447, 746144, 749775, 754996, 762303, 770958, 780573, 791456, 803285, 814684, 824481, 832255, 837212, 837828, 833693, 826950, 820892, 817458, 816692, 817929, 820550, 824095, 828545, 834128, 839932, 843204, 841166, 833411, 821688, 807784, 792779, 777970, 764873, 753880, 744103, 734876, 726365, 718438, 710241, 701685, 694312, 689706, 687580, 686218, 684357, 682007]
51564F82007k202j596j025r02j084r04k70k54j625l252l270j719n53q88j695j663
51548F59105r52l81l8M69J195K131L583N606P575Q863R489R749R970J0861J3087
51533G40312J5829J6818J4755J0811O837L059j104m831o274n060k797r32N40K020
51519G89983L348M510O101Q323J0293J1107J0984J0727J0621J0562J0797J1632
51507H98988J2571J2583J1385J0099J0399J3065J7240K1015K3128K4170K5810
51496A080453K8551L0915L1274K9896K8164K6218K2585J6424R100K743k097o657
51484A297569j2154j8451k4448k9158l2226l3849l4483l4451l3695l1906k9035
51473I83713k5617k2554k0404j8921j7443j5842j4723j4310j3510j1064p625n622
$$ y = [682007, 679805, 678209, 677184, 676282, 675198, 674294, 674024, 673770, 672145, 668893, 665623, 663904, 663351, 662463, 660768, 659105, 658153, 657772, 657734, 658203, 659398, 661529, 665112, 670718, 678293, 687156, 696645, 706394, 716364, 727225, 740312, 756141, 772959, 787714, 798525, 805362, 808421, 807317, 802486, 796212, 791152, 788355, 787423, 787963, 789983, 793331, 797841, 803942, 812265, 822558, 833665, 844649, 855376, 865997, 876559, 887356, 898988, 911559, 924142, 935527, 945626, 956025, 969090, 986330, 1007345, 1030473, 1054643, 1080453, 1109004, 1139919, 1171193, 1201089, 1229253, 1255471, 1278056, 1294480, 1303580, 1306323, 1304226, 1297569, 1285415, 1266964, 1242516, 1213358, 1181132, 1147283, 1112800, 1078349, 1044654, 1012748, 983713, 958096, 935542, 915138, 896217, 878774, 862932, 848209, 833899, 820389, 809325, 801700, 796078]
51461G96078o365q217q656p461o514o696o705n359l596l070l733m037l188j948
51447G20533j307j265j253r70m31L31J161J598J236K97l82k04M31M92l06r56o07
51430G18398j66j333l946n680n094l720l723m544l842j451q0j515m054m950l950
51415F70350k883k616k321j452q27j327k578l448l160j699K30J424J075k15q64
51400F49689r1J291K122K299K374K476K380K329K959M522O745R279J1575J2520
51386G12469J1235Q407O004N343O039P066P833P793O158L040J00j179j437k349
51372G76522l999m816m230l766m850o893q359q714q322p325n858m711m504m419
51358F95756l035m72J413J282m2o54L85K466M453N667O043N710M737L401K425
$$ y = [796078, 789713, 781496, 772840, 765379, 758865, 752169, 745464, 740105, 736509, 733439, 729706, 725669, 722481, 720533, 719226, 717961, 716708, 715738, 715307, 715638, 716799, 718397, 719633, 719930, 719548, 719344, 719775, 720267, 719961, 719005, 718398, 718232, 716899, 712953, 707273, 702179, 698459, 694736, 690192, 686350, 684899, 684819, 683304, 679250, 674300, 670350, 667467, 664851, 662530, 661078, 660251, 658924, 656346, 652898, 649738, 648039, 648269, 649693, 650768, 650553, 649689, 649598, 650889, 653011, 655310, 657684, 660160, 662540, 664869, 667828, 672350, 679095, 688374, 699949, 712469, 723704, 732111, 738115, 743458, 749497, 756563, 764396, 772189, 778347, 781387, 781487, 780308, 778871, 776522, 772523, 767707, 763477, 759711, 754861, 747968, 739609, 730895, 722573, 715248, 709390, 704679, 700175, 695756, 692721, 692249, 693662, 694944, 694902, 694248, 694633, 697099, 701552, 707219, 713262, 718972, 723709, 727110, 729535]
51343G29535K483L294L822L778M224N872P383O639L818J840L166O963J0246J1252
51329H04315J0789J0515J1017J1983J3438J5822J8848K1244K2259K2991K5300
51318I88521K9442L3610L6063L6950L7415L7659L6605L3244K7595K0542J3197
51307A330843O193p67q375j6353k3242k8000l1179l3786l5727l6398l6205l6064
51295A050940l5770l4267l1497k8612k6199k3698k0809j8194j6347j5036j4243
51284G86268j4347j4812j4081j1746r616r457j0521j0518q497n612l443k611k853
51271F68154l520l884l552k728j902j440j579k288k958k789j781o79K53J561L320
51256F44188M462M180L084K248J924K022K793L936L954J975m95j263n71o30k036
$$ y = [729535, 732018, 735312, 739134, 742912, 747136, 753008, 760391, 767030, 770848, 772688, 775854, 782817, 793063, 804315, 815104, 825619, 836636, 848619, 862057, 877879, 896727, 917971, 940230, 963221, 988521, 1017963, 1051573, 1087636, 1124586, 1162001, 1199660, 1236265, 1269509, 1297104, 1317646, 1330843, 1337036, 1336269, 1327894, 1311541, 1288299, 1260299, 1229120, 1195334, 1159607, 1123209, 1087004, 1050940, 1015170, 980903, 949406, 920794, 894595, 870897, 850088, 831894, 815547, 800511, 786268, 771921, 757109, 743028, 731282, 721666, 712209, 701688, 691170, 682673, 677061, 673618, 671007, 668154, 664634, 660750, 657198, 654470, 652568, 651128, 649549, 647261, 644303, 641514, 639733, 639054, 639307, 640868, 644188, 648650, 652830, 655914, 658162, 660086, 662108, 664901, 668837, 672791, 674766, 674271, 673008, 672437, 671807, 669771]
51241F69771k751j390L25j58k525l861k440J99J324K84j058q41O72J698J150l41
51225F60058j353r21J079L963O283O671N309M009M264N595O421O045M999L773
51211G16195K255M80q96j133j14J545K855L117K604K307K599K567J173j230l303
$$ y = [669771, 667020, 665630, 665955, 665797, 663272, 659411, 656971, 657170, 658494, 658778, 657720, 656879, 657551, 659249, 660399, 660058, 658705, 657784, 658863, 662826, 669109, 675780, 681089, 685098, 689362, 694957, 701378, 707423, 712422, 716195, 718450, 718930, 718034, 716901, 716787, 718332, 721187, 724304, 726908, 729215, 731814, 734381, 735554, 734324, 731021]
$$ [...]
##END NTUPLES=NMR SPECTRUM
##END=
