
##TITLE=AC1004_Arabiga_6278662_KrDU9wGVXB
##JCAMPDX= 6.0         $$ Bruker NMR JCAMP-DX V2.0
##DATA TYPE= NMR SPECTRUM
##DATA CLASS= NTUPLES
##ORIGIN= BRUKER
##OWNER= Administrator
$$ 1.72 TOPSPIN		Version 2.1
$$ 2012-06-03 12:22:20.078 -0500  Administrator@TOPSPIN
$$ Compression mode = diff/dup
##.OBSERVE FREQUENCY= 400.13188235
##.OBSERVE NUCLEUS= ^1H
##.ACQUISITION MODE= SIMULTANEOUS (DQD)
##.ACQUISITION SCHEME= undefined
##.AVERAGES= 8
##.DIGITISER RES= 22
##SPECTROMETER/DATA SYSTEM= spect
##.PULSE SEQUENCE= zg30
##.SOLVENT NAME= COFFEE_meoh
##.SHIFT REFERENCE= INTERNAL, COFFEE_meoh, 1, 14.98061
##AUDIT TRAIL= $$ (NUMBER, WHEN, WHO, WHERE, PROCESS, VERSION, WHAT)
$$ ##TITLE= Audit trail, TOPSPIN		Version 2.1
$$ ##JCAMPDX= 5.01
$$ ##ORIGIN= Bruker BioSpin GmbH
$$ ##OWNER= Administrator
$$ $$ C:\Bruker\TOPSPIN/data/COFFEE/nmr/AC1004_Arabiga_6278662_KrDU9wGVXB/10/pdata/1/auditp.txt
$$ ##AUDIT TRAIL=  $$ (NUMBER, WHEN, WHO, WHERE, PROCESS, VERSION, WHAT)
(   1,<2012-06-03 12:22:12.875 -0500>,<Administrator>,<TOPSPIN>,<go>,<TOPSPIN 2.1>,
      <created by zg
	started at 2012-06-03 12:21:06.218 -0500,
	POWCHK enabled, PULCHK disabled,
       configuration hash MD5:
       D5 CA 7A 23 FE 6B EE E2 50 67 74 61 24 F7 5E 3B
       data hash MD5: 64K
       94 65 9E 84 EA 0A E7 ED 30 8F F3 8D 67 23 14 99>)
(   2,<2012-06-03 12:22:15.828 -0500>,<Administrator>,<TOPSPIN>,<proc1d>,<TOPSPIN 2.1>,
      <Start of raw data processing
       efp LB = 0 FT_mod = 6 PKNL = 1 PHC0 = 0 PHC1 = 0 SI = 32K 
       data hash MD5: 32K
       E5 BF FB 41 81 EB 78 C9 78 46 2F F0 93 8E 55 BE>)
(   3,<2012-06-03 12:22:16.218 -0500>,<Administrator>,<TOPSPIN>,<proc1d>,<TOPSPIN 2.1>,
      <pk PHC0 = 210.0311 PHC1 = 0 
       data hash MD5: 32K
       46 0A 8C A0 80 55 D1 18 2E 98 B5 BC 20 53 65 D1>)
(   4,<2012-06-03 12:22:16.265 -0500>,<Administrator>,<TOPSPIN>,<proc1d>,<TOPSPIN 2.1>,
      <abs ABSG = 1 
       data hash MD5: 32K
       5E F7 C9 85 2F D6 28 97 78 F9 EF 1F B5 71 57 15>)
(   5,<2012-06-03 12:22:16.296 -0500>,<Administrator>,<TOPSPIN>,<proc1d>,<TOPSPIN 2.1>,
      <abs ABSG = 2 
       data hash MD5: 32K
       F0 A9 64 3F B1 CB 30 DB E6 94 F1 D8 CE 6B 68 E1>)
(   6,<2012-06-03 12:22:16.328 -0500>,<Administrator>,<TOPSPIN>,<proc1d>,<TOPSPIN 2.1>,
      <abs ABSG = 3 
       data hash MD5: 32K
       D1 16 23 3D AB ED F1 B6 E4 0C 0D 0F BB 58 AF F2>)
(   7,<2012-06-03 12:22:16.375 -0500>,<Administrator>,<TOPSPIN>,<proc1d>,<TOPSPIN 2.1>,
      <abs ABSG = 4 
       data hash MD5: 32K
       33 B9 70 CD 3F CF 63 D0 61 FF 87 B1 74 B5 F9 C9>)
(   8,<2012-06-03 12:22:16.421 -0500>,<Administrator>,<TOPSPIN>,<proc1d>,<TOPSPIN 2.1>,
      <abs ABSG = 5 
       data hash MD5: 32K
       D8 5B 1C 4E A5 27 B8 7E D8 2E DD 25 8F 12 D3 67>)
$$ ##END=
$$ 
$$ $$ hash MD5
$$ $$ 47 67 52 92 40 95 CD 8C 8D 33 BF 85 ED 3A 7B 0D
##$RELAX= 
##$RELAX= 
##$RELAX= 
##$RELAX= 
##$RELAX= 
##$RELAX= 
##$RELAX= 
$$ Bruker specific parameters
$$ --------------------------
$$ [...]
##$TP= (0..7)
150 150 150 150 150 150 150 150
##$TP07= 0
##$TPNAME0= <>
##$TPNAME1= <>
##$TPNAME2= <>
##$TPNAME3= <>
##$TPNAME4= <>
##$TPNAME5= <>
##$TPNAME6= <>
##$TPNAME7= <>
##$TPOAL= (0..7)
0.5 0.5 0.5 0.5 0.5 0.5 0.5 0.5
##$TPOFFS= (0..7)
0 0 0 0 0 0 0 0
##$TUNHIN= 0
##$TUNHOUT= 0
##$TUNXOUT= 0
##$USERA1= <user>
##$USERA2= <user>
##$USERA3= <user>
##$USERA4= <user>
##$USERA5= <user>
##$V9= 5
##$VALIST= <valist>
##$VCLIST= <CCCCCCCCCCCCCCC>
##$VD= 0
##$VDLIST= <DDDDDDDDDDDDDDD>
##$VPLIST= <PPPPPPPPPPPPPPP>
##$VTLIST= <TTTTTTTTTTTTTTT>
##$WBST= 2048
##$WBSW= 25
##$XGAIN= (0..3)
0 0 0 0
##$XL= 0
##$YL= 0
##$YMAX_a= 502805
##$YMIN_a= -608006
##$ZGOPTNS= <>
##$ZL1= 120
##$ZL2= 120
##$ZL3= 120
##$ZL4= 120
##$ABSF1= 14.98061
##$ABSF2= -5.57192
##$ABSG= 5
##$ABSL= 3
##$ALPHA= 0
##$AQORDER= 0
##$ASSFAC= 0
##$ASSFACI= 0
##$ASSFACX= 0
##$ASSWID= 0
##$AUNMP= <proc_prof1d_extract_pilot.lims>
##$AXLEFT= 0
##$AXNAME= <>
##$AXNUC= <1H>
##$AXRIGHT= 0
##$AXTYPE= 0
##$AXUNIT= <>
##$AZFE= 0.1
##$AZFW= 0.1
##$BCFW= 0
##$BC_mod= 0
##$BYTORDP= 0
##$COROFFS= 0
##$CY= 15
##$DATMOD= 1
##$DC= 0
##$DFILT= <>
##$DTYPP= 0
##$F1P= 0
##$F2P= 0
##$FCOR= 0.5
##$FTSIZE= 32768
##$FT_mod= 6
##$GAMMA= 0
##$GB= 0
##$INTBC= 1
##$INTSCL= 1
##$ISEN= 128
##$LB= 0
##$LEV0= 0
##$LPBIN= 0
##$MAXI= 10000
##$MC2= 0
##$MEAN= 0
##$ME_mod= 0
##$MI= 0
##$NCOEF= 0
##$NC_proc= -8
##$NLEV= 6
##$NOISF1= 0
##$NOISF2= 0
##$NSP= 0
##$NTH_PI= 0
##$NZP= 0
##$OFFSET= 14.98061
##$PC= 1
##$PHC0= 210.0311
##$PHC1= 0
##$PH_mod= 1
##$PKNL= yes
##$PPARMOD= 0
##$PPDIAG= 0
##$PPIPTYP= 0
##$PPMPNUM= 2147483647
##$PPRESOL= 1
##$PSCAL= 4
##$PSIGN= 0
##$PYNMP= <proc.py>
##$REVERSE= no
##$SF= 400.13
##$SI= 32768
##$SIGF1= 0
##$SIGF2= 0
##$SINO= 400
##$SIOLD= 32768
##$SPECTYP= <>
##$SREGLST= <1H.CDCl3>
##$SSB= 0
##$STSI= 32768
##$STSR= 0
##$SW_p= 8223.68421052632
##$SYMM= 0
##$S_DEV= 0
##$TDeff= 65536
##$TDoff= 0
##$TI= <>
##$TILT= no
##$TM1= 0
##$TM2= 0
##$TOPLEV= 0
##$USERP1= <user>
##$USERP2= <user>
##$USERP3= <user>
##$USERP4= <user>
##$USERP5= <user>
##$WDW= 1
##$XDIM= 32768
##$YMAX_p= 463211386
##$YMIN_p= -740041
##$CURPLOT= <Network HP LaserJet P1505>
##$CURPRIN= <$Network HP LaserJet P1505>
##$DFORMAT= <normdp>
##$LAYOUT= <+/1D_H.xwp>
##$LFORMAT= <normlp>
##$PFORMAT= <normpl>
##$SURQMSG= 1
$$ End of Bruker specific parameters
$$ ---------------------------------
##NTUPLES= NMR SPECTRUM
##VAR_NAME=  FREQUENCY,     SPECTRUM/REAL,   SPECTRUM/IMAG
##SYMBOL=    X,             R,               I
##VAR_TYPE=  INDEPENDENT,   DEPENDENT,       DEPENDENT
##VAR_FORM=  AFFN,          ASDF,            ASDF
##VAR_DIM=   32768,         32768,           32768
##UNITS=     HZ,            ARBITRARY UNITS, ARBITRARY UNITS
##FACTOR=    0.250966925370066, 1,           1
##FIRST=     8223.43324360095, 69204,        12728
##LAST=      0,             -18069,          26410
##MIN=       0,             -740041,         0
##MAX=       8223.43324360095, 463211386,    0
$$ Real data points
##PAGE= N=1
##DATA TABLE= (X++(R..R)), XYDATA
$$ [...]
23835 -287584 -14697 -4406 -201385 -99317 -362371 102512 -280018 4027 25549 -407682 -89119
23823 13649 69437 -114726 -225201 -64784 109509 103901 -10184 -61081 -111418 -104559 -185582
23812 -185582 39619 -52158 -84612 -69695 237049 423 299564 65015 41310 127381 -109993
23800 -27226 123912 -231860 -108390 -388612 -61639 35501 -3370 -52207 -218943 90834 83620
23789 83620 -347303 82609 159861 -22465 8235 -40369 12720 91298 -20869 -59366 172889
23777 -80846 51160 -413693 -174890 312389 106899 -115646 -36485 43301 14449 248891
23767 248891 70607 186458 33695 52534 164399 -198443 -14050 -24265 -299431 -148894
23756 -515465 -22810 129731 -225108 -139261 46322 -240838 140855 182342 48125 -182311
23745 -157091 -86456 327471 206029 -92848 95034 194336 -33866 -144530 -14915 129397 -168092
23733 -317544 -12059 63331 -147841 168691 -81707 66616 5727 2371 178726 203083 -72807
23721 334758 -2693 647 -45933 -7326 230183 5175 -24279 -186404 299026 227818 176083 -115954
23708 -225296 -244296 -80296 56842 62077 40831 -32349 36656 -229952 -35039 168988 -106672
23696 -100806 27242 51474 -110681 -145151 16374 -94663 -118615 143006 162246 -161192 169125
23684 -40795 -91674 12722 249588 33796 -335319 -152590 -13195 -38135 137926 -72063 -294032
23673 -294032 -43071 4095 4494 -527309 199243 25321 61791 -11455 333142 -31209 -91197
23662 -91197 172634 -133976 -115989 129717 -215339 55448 83698 87875 18713 112590 40938
23650 232684 46720 2290 4453 -273941 34546 -111043 -165485 -105505 103606 94116 3057 246397
23638 246397 -216433 -133168 217031 -35634 -112270 -128825 1660 -9242 -2990 -105796 396115
23626 165764 -47100 200080 32974 13952 -244401 -7923 -374079 62152 32675 75608 -163908
23614 -177413 -402458 -31928 -49881 -154354 -71263 388718 27941 -186359 158994 181422
23604 181422 -48298 64250 333644 223645 164819 63753 -50174 60938 107226 -2726 194497
23592 -104133 -261588 71985 202170 -180551 52578 -24381 212132 -262429 142196 178583
23582 178583 188437 -46848 -98523 43877 60396 197443 208858 -89744 -1167 199234 -13150
23570 -195995 -53226 60032 258478 -17661 -159331 -53117 -49192 -148830 52611 94677 -15010
23558 277197 247193 339766 -68005 74448 322680 -19393 -87618 -276284 -81049 74792 158033
23547 158033 10099 -46537 41457 -353736 154648 35894 -27207 -32626 -126320 -28955 133270
23535 105691 102185 89650 28269 -100292 114280 66367 -180488 373713 -406162 70804 -236457
23523 37219 141345 -195700 -159512 15226 -49970 -167154 -342228 446364 -42028 8036 18759
23512 18759 -77995 -45297 -146199 16440 154119 -347466 -91354 -101938 16070 245144 -171151
23500 70121 -217348 28437 117160 -121394 217082 -55691 -197857 -233149 220393 309726 -205286
23488 -84433 43828 376956 -99370 -179188 229795 -171965 -28123 97458 -321279 74249 -130511
23476 -220873 228285 129929 -51175 65722 282090 246153 159780 -108496 100744 -18696 77025
23464 -231593 -35809 -71009 -273682 101911 7444 -143393 -107267 -45344 185831 16549 -356063
23452 4929 -111852 -3456 3029 -262223 -42171 10379 65466 186147 80005 -181629 -49696
23440 -115575 -161532 258224 -132102 -125771 39949 90137 -119826 149367 -261920 84575 -36270
23428 -304018 -172271 -206856 -380795 31991 -94435 19230 14294 -485332 80624 146762 71558
23416 112483 -325954 -143629 132 -71142 140997 -273465 -136873 -223171 -73222 -158388 -59106
23404 86144 77004 -470025 -295013 -55649 -349096 -266582 181083 172332 -35654 146586 -21679
23392 -379319 -204621 -80426 -172642 32577 24196 105711 -225819 99711 -183378 -180513 89349
23380 33536 304583 154911 184787 -275953 -14732 -216301 239687 -62793 -127348 -61879 -166010
23369 -166010 -145069 -179604 -50494 -42983 13637 -15978 -6092 41370 -2480 -148161 134495 -44354
23356 -101293 -125981 132305 -130142 335080 -97093 -92000 -115826 -199494 83092 76623 -211664
23344 168267 -32269 216021 90210 -4686 -25726 -38992 167530 266116 -74036 184116 262279
23333 262279 -158746 42325 101295 -25620 -207231 10997 283464 -121008 -408557 -60150
23322 32111 21370 -60741 -144724 68061 158903 -86003 -30993 -10119 -209728 -25053 -234209
23311 -234209 58420 19353 98085 -290983 162165 -64517 107352 -118270 86173 -287641
23300 -194125 -49262 3693 37111 38177 -135699 24001 -103167 101234 196677 39704 11451
23288 -167707 33545 -139102 57974 149762 1551 -75658 115133 226337 211902 71792 -269193
23276 -90646 -122877 -562531 67851 -72684 219725 71626 193700 -319285 18731 -78383 5073
23264 -208916 157946 -132333 -76132 125748 260447 -128877 -72072 325992 102942 341847
23254 341847 452489 -284886 -385194 -39506 206540 -24410 -244337 -146392 -204649 95010
23243 -16438 233282 -129512 -232710 -101118 -131072 88064 24300 100627 54162 -249293 79146
23231 27372 214769 45535 -33731 -58732 51352 3052 -134958 28617 -38416 55076 22021
23219 -114363 -163344 160631 43923 -58139 -42348 51155 -128111 7065 -10685 38234 -111953
23207 -106179 63323 -57748 -46542 -527411 55633 295477 -163013 210287 159068 162206 -245639
23195 -176797 239787 11740 141275 39435 -192133 -13702 219839 -65695 -183943 -101400
23185 -101400 122110 -19498 -243766 141985 21454 -87119 -357692 59066 353903 -114039
23174 -18288 -102062 7489 -157809 -82767 269803 38916 137042 5142 63909 280753 -402735
23162 105843 -273987 -205176 -145003 40023 11313 -126686 173160 -42517 -247266 23794 -205997
23150 -135759 49209 15532 -130781 -106469 -116465 -83394 197879 27754 -161054 37060 265515
23139 265515 299461 -479573 -49690 -35534 -213675 -238198 170199 -171371 -103525 -90005 -214864
23128 -214864 293637 222063 79053 -8754 87535 -310794 66034 22570 145241 -129706 -246164
23117 -246164 413517 -85504 -262042 284506 235849 31118 238590 -167528 -254966 -205913
23107 -205913 -279322 -76431 141967 -12191 -343383 -33887 48513 44291 -98730 -14534 -321752
23096 -321752 11445 50642 -218339 -73053 85579 80016 446582 45099 -54384 -35641 -316223
23085 -316223 251973 -28022 214414 -41679 179171 171225 -58535 -202536 -204502 233908 27731
23073 -247302 38812 173089 272735 222085 -176644 68718 -66535 -95075 -167287 128730 -67218
23061 26125 108725 27582 200283 -124062 -17962 -142943 -237336 43836 -84661 107080 -8488
23049 -239571 -346557 2778 -118247 -92554 250951 -15065 -33808 32484 -57449 -261832 -55812
23037 19417 193041 -112610 -188371 149855 169690 -268409 76067 124265 -99109 -86012 -289072
23026 -289072 -120304 -294174 -155526 -33719 -205393 17529 -220572 176044 97691 -66928
23015 71828 44193 150969 -113279 93410 289608 84424 297211 -32021 82903 7939 365732
23004 365732 -336146 -506049 119560 226947 -102505 -188086 -143348 -9202 -173949 -199120
22994 -199120 267157 -209550 -178193 -72245 -98842 63783 -62892 116161 120782 -53019 148997
22982 64114 -52351 124159 -45768 94143 185496 -192255 284588 226997 196431 263901 -15173
22970 -68110 19563 -1125 -197491 240426 -200654 -32101 19270 -9452 102796 117707 -227375
22958 -62393 -159688 68877 19349 142570 -49244 -106540 338497 59155 -24863 219597 -104408
22946 -167155 103677 82187 -29996 318622 -109741 259320 9807 59992 96615 -352 -268986
22935 -268986 143352 -178849 -139473 46800 132261 -141521 -6660 -116329 145703 -108091
22924 136841 102242 -206299 98348 172047 -110781 19797 -51378 247894 37265 -151107 -558528
22913 -558528 -105283 73042 373463 -141498 -126443 70371 222258 -64141 158258 -81556
22902 184488 42256 -41670 -121267 -1194 101255 108176 -222612 -194775 184366 -73833 -204323
22891 -204323 66777 67791 76231 -45852 208184 -72658 -190443 171286 196186 17959 -277110
22879 -89503 -130274 -115114 161220 -81776 141393 -148329 51558 67991 163079 -205096 -345060
22868 -345060 320030 152245 8780 -229345 52098 93237 150933 175981 11213 -21264 250544
22856 -8033 -90667 -312663 226061 74735 214851 -325652 -34149 -95638 -136968 257716 98880
22844 -239974 -104742 78114 -138188 -61614 321670 -192893 -124335 100670 -277246 -98586
22833 -95528 -180748 -181761 -371600 -292580 -382614 -114178 246557 77992 22814 -156486 -96781
22822 -96781 267063 325581 28550 174961 -177644 -167431 230097 -71572 -113389 -229881 -415755
22811 -415755 -73686 -338522 62290 166988 109723 67724 122666 -62535 -27279 -313594 -339426
22800 -339426 -225660 -146796 -113060 -143958 -20557 21679 10128 -130707 29119 -289687 4394
22788 -184744 -57159 68196 -42767 71716 93665 -132137 3856 -27051 -109881 322173 -95692
22776 -244238 403934 -78980 -35871 -66642 -122600 -89712 221527 80924 -358685 121635 -332667
22764 154892 167085 20498 50823 -102669 -251447 -41143 124455 164747 22964 -57091 19015
22752 81148 -41251 31034 248855 -29663 -278362 -119258 -5433 268624 183442 124972 -344217
22740 229231 -23735 -139267 189354 19055 -19705 -280065 226524 -71686 20568 75738 -77737
22728 -331304 85884 78519 111135 112051 -139915 -37777 -23946 -24506 39743 -25308 -112682 -79234
22716 -79234 22158 14395 -199550 128253 87240 -80196 -13942 -169469 -122617 66762 -98226
22704 -116148 -98825 -603603 -4532 -73470 -63245 -80258 -227012 -534125 -39225 49873 -45684
22692 -3514 -280989 -11471 -149509 -230916 226246 -240849 53709 163419 -177092 -150262 -26647
22680 55501 152293 7831 -72658 -315309 25918 -175967 284014 -188178 79133 -16825 289351
22668 24953 -14412 105104 -111070 54762 -244031 329390 133743 89875 -161150 26094
22657 -125910 -27427 -304048 -43216 -282490 -380093 189982 183294 64062 20966 -215127 -49006
22645 -169641 -135012 197839 277065 -307422 -182556 -195026 51775 -46188 240378 17953 -123697
22633 83980 127324 -200180 84533 -102121 -319685 246836 299824 34174 127124 -120497 -238789
22622 -238789 -51381 -298043 105843 -95060 162062 -79380 -144827 -163924 -157068 -78869 -84690
22611 -84690 -3294 -105458 -168749 -89062 -321056 -182569 -52836 53424 29010 -158598 86098
22599 211176 72314 -81262 -103906 -217776 -142222 113528 -116430 -29908 -39125 24749 -112774
22587 -209742 6965 -101803 207627 -49739 50988 -139927 221404 3750 -96112 -251411 79779
22575 259061 8309 41331 -105021 129943 -13566 177021 10525 -60695 -127515 -60462 -187033
22564 -187033 262168 -252635 -195231 -133529 330488 -197200 -234229 -154243 56352 34801 -1761
22552 43432 -215340 -105449 94906 -184595 -64703 -168080 -308539 -207240 598398 -234127
22541 -95435 61360 -78404 -166979 132831 -38632 -98630 2562 -170127 -168828 -111550 -180868 -49765
22528 -194839 45529 163781 124953 35922 38083 185685 6116 190302 -103393 5500 -204966
22516 129659 50526 151808 58356 -29480 307366 -47852 78415 -291341 -173255 255955
22505 -301734 43624 -7218 7128 64695 -68047 159793 -82594 10907 70648 -523156 -1129 -34583
22493 -34583 807 45995 -359971 174332 110350 117471 -72672 -252038 -369748 -282369 28908
22481 -164147 -13906 222151 324397 -79670 245006 237746 -236099 42273 157697 -32768 269936
22469 461580 52658 135823 -210209 197624 -113546 9501 341524 -3405 -365035 -218131 -219031
22458 -219031 12629 -226576 48769 -63000 -146589 136870 98133 -173027 -17647 -315007 -275027
22447 -275027 29003 -280007 238993 28230 204620 -55672 -69282 -139829 -116870 311942 -299861
22435 119861 -77559 -328870 107153 -158679 -205770 -186023 -13628 175297 163497 -285710
22424 118415 -171768 -226794 -181142 -22524 118047 -208219 -108077 -148507 80626 -44348 -148181
22413 -148181 -341978 184376 -131326 75666 -71740 95404 209663 23091 239674 -59751
22402 126113 -290412 33875 -30515 -24107 -208918 -2108 143386 7596 -53812 49362 -72839
22390 55609 38079 -1832 -14161 265401 38190 -131107 -173376 -110770 48013 -110906 -102759
22379 -102759 -254534 50097 167404 -2092 176473 -64872 -224033 -299090 -182303 -114689 -66421
22368 -66421 37813 -137943 -32029 161527 88111 -246135 -41740 -301224 -156653 74255 -29089
22356 21635 -2175 -90373 -183174 275187 -66326 -214988 -326309 -75254 -121635 113586 -33114
22344 -249197 -135556 -49871 -19666 -140275 108215 -203201 -235866 71415 -1152 97137 -49862
22332 259474 247100 234476 -47308 -139946 -215526 -378717 64294 -313274 104273 -109116 -81117
22321 -81117 -139457 -62584 57623 -277405 145968 -92440 63550 184998 103730 133976 -84083
22309 -283838 -232073 -250547 -49336 158696 -11241 174098 178812 -111471 -141209 -130258 110987
22297 -89755 -103470 2473 -160698 91684 -106860 -320229 -138575 -153576 -59374 91182 -76446
22285 48151 -103010 161446 -68444 -178800 -221563 51110 199152 131468 86151 -33916 -150237
22274 -150237 -83869 59402 257277 -75767 161395 -45858 -153962 -187034 -235103 -158530 -80584
22263 -80584 -255081 167549 -22258 229855 74927 -294105 -463792 -296631 -140815 43948
22252 219532 -83555 -161472 -233895 -48695 309028 -43594 -478470 118934 -35539 -83995 -237659
22241 -237659 -76654 69482 -284751 -139444 -396042 105138 280755 -249420 -197917 52125
22230 -125192 64867 -24774 -144389 166969 39941 90265 -110133 119670 -23580 448481
22219 -105365 68527 -132766 -210650 -32267 168590 -45919 107663 -68593 -103058 153636 -211088
22207 126403 -134552 -123048 -201047 51569 175907 90593 29762 22838 93500 -37761 -234015
22196 -234015 68680 -143254 35937 67037 29473 59687 64936 -89420 -516357 43605 79956
22185 79956 -154985 -332062 -391563 185114 -190402 -130892 41469 -139678 10126 -58583 33928
22173 88103 115520 -237618 -68498 306764 103723 -148037 -30721 -227047 -24359 -201656
22163 -201656 -298897 2839 191382 -192833 371692 -123239 -61655 46453 119176 -20824 172657
22151 -77248 -475042 143241 87885 160380 196378 88611 -159555 -177944 212013 -106535 92958
22139 -261099 95057 124539 710 -264246 -63319 -970 103482 -6085 -24458 53752 -390832 -56125
22126 -203914 -159 -22502 -344578 -98515 -19947 416095 -66334 -37252 -56544 -196380 -69780
22114 -23283 152257 -69575 -263481 -21181 184499 -85963 -166093 -99479 130530 305200 267110
22103 267110 183702 58871 -122374 -37843 -28343 160494 7693 -181204 63760 162588 20608
22091 -95180 -103764 -56547 -322950 31250 -115993 -149314 339226 -192651 -154420 -21658 41227
22079 -171037 -223047 -31628 -410417 -134171 -194827 -51618 -54911 -1615 -224904 -191655 27228
22067 -7273 53841 56535 -244545 -175871 98356 -161478 84431 62686 294162 -235844 92443
22055 -188598 -135344 122603 -10041 167951 -137798 284671 -189145 2503 174498 -249909
22044 -169063 37670 -35887 -24303 138381 62070 -81817 -9222 86162 290452 35496 40089
22033 40089 116218 332963 -297251 59213 120365 -558089 -213720 140017 256616 101218
22022 -325896 71033 -155967 55315 -107739 -104988 -244265 14846 325522 61698 1204 -107023
22010 -58536 -306029 -98795 -104091 62328 49903 178209 -255905 -151068 13868 -130328 -307455
21999 -307455 310618 -243409 -108103 -241947 -5276 8189 -2846 236632 -58338 1396 297135
21988 297135 63645 64200 -109778 146518 19760 18213 83709 -261706 -41828 148473 -171865
21976 71493 235888 -103296 68709 10624 -70844 34176 -232994 40363 -224963 -244409 -422830
21965 -422830 -187895 316843 -13541 11341 -39843 -27169 -44437 227875 90541 199500 -12836
21953 -142494 -67522 -229604 -75119 384392 75814 43862 10198 -54487 26425 -332385 100667
21941 -155703 14508 -104408 -169477 3851 -300016 -237132 -76349 112542 -339974 -23380 176561
21929 -198751 -120684 -16760 90243 51184 -198643 -174070 47984 84173 -115717 29954 -373006
21917 -76277 -14845 -336372 -154197 282456 -50797 180252 358597 -76260 -253180 -207568
21907 -207568 -107270 -239740 -244359 -242980 -126715 26021 -115192 19643 38442 95509 4279
21895 -414291 162527 33462 149848 -93429 193655 101097 38952 8800 -44581 -367409 -176101
21883 210440 -177434 194431 -163346 -168101 62059 -49112 66039 -132381 -252306 -176412 -111583
21872 -111583 45383 40276 -326207 -201958 -185569 15142 -94032 123587 94248 -139607 -182694
21861 -182694 -49357 -43969 -131146 249811 175040 -131735 -83138 -222524 -129637 -21358 -15497
21850 -15497 -38725 172837 -96703 38046 -253057 -79377 -317849 -180678 -144492 -249523 -222434
21839 -222434 55735 -50249 -159411 94151 -126358 319781 122989 -128410 1639 41352 -252286
21827 -118093 -69017 303145 -260164 141243 26762 223698 -72692 -34905 128529 -11394
21816 72387 45787 -205475 -304478 53277 -156283 44689 -46484 71403 -141089 123339 -97196
21804 -1411 -21200 -106887 139227 -11774 -77809 189478 -40276 -35982 -27804 16117 -344155 170642
21791 -164946 162944 -98393 140141 -49007 232543 -44684 6463 -79888 -218376 -119872 56584
21779 103074 169796 -77510 -39639 -230873 -70748 121543 3233 311320 114972 422732 -48751
21767 214682 -253272 -117638 340876 50963 86838 -211769 -318366 288578 -98819 -148227
21757 -148227 197579 -209508 -61821 -132725 74539 14375 -219042 -363691 25736 19232 -56461
21745 29597 173046 -219486 -137571 445543 69420 -42820 -96673 64934 -370484 53825 90774
21734 90774 102100 -246816 -125008 130602 4586 87380 19041 57167 -124907 -185060 31500
21722 157024 -177982 -64588 -159641 -378815 -24376 58010 -84455 122541 224823 -216067
21711 -14405 -79657 -62750 24055 -180581 391608 150620 18330 -137841 -234837 -197683 31960
21699 -172099 -370557 -123162 -373750 285548 -30251 75081 -202975 -423691 -130517 321753
21688 59733 -4210 -135587 107902 134728 211721 -417990 -199216 -14210 30604 131819 89623
21677 89623 -98712 31299 -118333 -73324 210039 103461 33999 -48509 103316 -95249 -14031
21665 -99202 136783 17731 -274945 43070 -136971 102230 113431 -21780 -125571 -248143
21655 -248143 -92186 -20774 159292 308837 -272944 151386 174195 -499771 29328 -135806
21644 227595 -250095 -95915 -216848 135188 -142614 -123668 220321 -169382 14650 433563
21634 433563 87820 -344204 257247 -225822 96351 -69026 -211023 53545 -94968 -335036
21624 -335036 -144784 -45176 -101010 -149340 -253097 -392794 -143578 -219969 -112188 -91598
21614 -91598 -396950 24705 -272639 -387034 20365 9292 -205081 -194907 431434 8863 -55954
21602 23888 -253714 126629 36152 -8179 -79549 -173658 159343 -238709 42913 248568 -101318
21590 46859 194673 71650 -208741 88152 16730 -109864 318239 18164 -161425 -212000 42568
21578 -225044 215017 195683 441695 -266524 13346 -504957 124039 -155523 -532 129684
21567 94841 81616 62121 -120479 92875 10191 235999 -26973 -98644 63476 -101018 139527
21555 -67165 -165202 85472 60355 87660 -178310 49521 3544 -260437 -114093 -186701 145582
21543 -2190 127546 130184 -96432 -285238 -184905 14748 -384824 -147864 104475 -112225 -67968
21532 -67968 -229598 -23347 -125908 -164591 24402 -302807 43178 15384 228618 3156 -170952
21520 -39183 50851 53571 152768 -94841 -100286 96963 -1806 -333695 -136845 -275075 -271474 -19533
21507 -149056 143211 8164 141545 -118005 131274 26381 70224 -381662 235939 118823
21497 118823 -147668 -158741 99062 14279 -367341 -216938 286162 16279 -22510 120353
21486 -234917 76105 120927 104779 346120 -241264 -68211 -11999 136414 29544 -241941 -87725
21474 -51003 -49337 206609 -281479 -70919 138242 -196176 28881 -309388 -137272 100672
21463 147002 -312769 -75645 -224721 67350 6411 278601 -17839 -314781 88007 6953 -153530
21451 280731 -196936 -138648 -281038 -28377 -235127 24493 -152518 77699 -216460 58189
21440 -308951 -17119 97919 -154944 -241475 -476769 -29727 -119477 113641 -133097 295549
21429 -12686 -229070 -122024 -14399 332731 78986 -145756 10930 42075 39663 -97659 80864
21417 -161690 -50109 -20613 10703 229409 159053 29127 -118546 -203567 -271051 -192638 65078
21405 142364 -200548 -202221 -34625 35291 -56150 35570 160675 -148002 -43871 -21466 -105825
21394 -105825 -268398 -96558 -287357 -158008 -29563 102603 -228746 -222982 -8494 -184673 166189
21382 -139387 -18074 19142 -69186 -220418 -34538 87633 31632 93943 -190436 -43980 48330
21370 287699 387331 -153806 -133252 50574 -40380 181960 -127357 -168075 -191466 -50773 -266978
21359 -266978 -44191 -328272 -294859 -77956 309607 139962 49356 -40344 -36380 113758 54709
21347 63962 -59237 -42346 -41419 135127 12614 -27017 -111917 86710 -135390 18258 152593
21336 152593 252330 -37150 -34789 105894 -227864 -131714 -160811 -45597 -30167 -127149 -121806
21325 -121806 -289442 -86427 376 -29998 266896 142160 102757 75940 23720 211360 34787
21313 150087 211807 -186918 -89722 -64616 136810 -15891 -136229 -185535 -391875 -213281
21303 -213281 135639 -291514 -37632 -77082 -378628 -360005 134826 -156080 22783 73033
21293 73033 -78817 -176745 136593 35610 -189686 22538 -159647 61229 -87231 39303 108143
21282 108143 210254 12943 188584 -296959 -105545 -6456 -95529 -102010 -78483 162653 -452964
21270 -220721 24469 -268300 -88605 -23758 133876 -233122 230557 74262 51409 84330 12871
21258 -245752 -104923 135159 -121162 42619 125225 -290547 -112341 111958 -15978 -83022
21248 -83022 83245 -114453 -216028 -123964 -119894 -210945 -271885 -88413 -59824 -127928 54878
21236 -274161 -124392 -123370 -74031 -156588 41520 -114686 -198796 -57971 88534 -34322 -275415
21225 -275415 -58660 345916 -48482 7800 19434 -154262 -154614 -171690 -256866 -175429 -174947 -238589
21213 -238589 -332856 298571 -177396 -55274 137572 59704 33773 -399554 -24153 -312077
21203 -312077 -350233 -198515 106468 37117 -116159 209052 -296185 34732 117013 -45060
21192 -108270 79055 -276930 -386399 -8007 -209683 -139565 104288 -314056 -631470 -145494
21181 -20616 -448386 -238152 -196484 -102378 -87567 361661 -295868 -98303 152851 -18458 -34300
21170 -34300 222978 -114642 25379 -156373 79754 231231 -205170 -232025 1530 -323365 -231713
21159 -231713 -391213 244398 -155132 97873 -21251 -157458 100602 -127476 -163237 131807
21148 -279113 -193244 -141062 196018 -372549 -169054 59649 -36544 -246677 311848 -245279
21137 -31990 -70231 111187 177426 87384 25132 42146 -177935 -323876 -54792 220959 -131459
21125 34202 -35153 -362878 87424 30571 -50819 2594 62059 -151658 -37286 -33 -181853 -3039
21112 -61348 -196160 -153005 28084 -288337 -44097 17352 -247599 185835 -252421 27504 -61646
21100 38069 203017 -355588 290296 201273 -153451 27136 -221886 191065 49591 66711
21090 66711 -150517 130160 454859 360041 7157 26957 18993 10476 -174649 225355 -38566
21078 -165250 154029 -276264 262605 -6912 -230035 -4253 -198368 -187 218343 -23299 98430
21066 108149 70584 -112670 55311 94386 53375 169788 -287391 -25006 -143284 378160
21055 -159378 105072 221777 44036 -759 -222199 -84826 76184 13259 -204104 -21367 324299
21043 -15764 -226794 312328 -415087 232523 5293 140956 -94885 78958 -301579 64028 -172024
21031 -96534 -15013 421947 126689 -194509 129439 -52834 354344 -102081 140534 215762
21021 215762 -123677 -315619 -329872 -136652 -56373 -144042 -153455 -77373 -98892 337081 165395
21009 -43462 -81665 145317 124118 300309 8718 -165273 -245600 14344 34963 -141841 121676
20997 -25680 -146382 -40069 55154 -442241 -49562 1944 31129 -142762 -71825 -7001 -54871
20986 -54871 -209513 32171 -147203 34752 -130711 -55961 -81149 247926 -128668 -240895
20976 -240895 184588 -148666 -14360 -161008 -39676 26761 -173243 -86787 -288311 -140855
20965 25603 -242892 -182297 -117026 -222319 -514748 -64702 46456 -214624 -104846 -223671
20955 -223671 144772 -104374 203715 148570 -47459 -220233 165801 250770 -294955 154713
20944 -194959 -59364 -420609 -1510 21976 8989 -20975 -433147 40454 -103348 -67801 -262858
20933 -262858 -105296 -366974 168548 -165772 177046 118450 -83662 63595 -153638 12806
20922 456655 -94014 -211635 75772 11862 -35771 -225350 95911 -268565 -70431 -162524 -200594
20911 -200594 449629 -365840 -241584 -10088 40152 -269189 -197982 -129886 68151 -221817
20900 49559 -2673 -29732 202295 -28535 -274083 49984 -109827 -87671 73953 -103467 13 89017
20888 89017 -146591 -63451 -16725 30156 -156722 -374971 -237046 -219490 248273 -155174
20877 -7336 -55182 124591 -108872 -187010 262590 -245556 54971 104655 308378 46099 30502
20866 30502 213675 61285 108546 29747 -35191 -226434 -9475 -364809 -56432 40863 44570
20855 44570 362360 -286702 110755 -104974 -124766 -329430 -190167 32459 -91977 -281864
20845 -281864 -13942 -38838 -294417 -291968 -149185 -58339 84223 -373952 -74464 -88024 137120
20833 -446362 -160486 -228199 -150016 -58021 -98049 -148271 -368777 -71244 129171 -150104 -186138
20822 -186138 -257911 -52723 55569 -265716 15132 64311 -5198 116199 267938 -40925 238456
20810 128861 -111929 43499 -196769 35348 -277320 -185725 -70481 -22006 187477 -29819 -33739
20799 -33739 56232 132437 -371594 -61144 41019 -221772 -339246 -106972 -61163 -109458 -42227
20787 -138505 50689 -245759 -66825 -425849 -289522 -85729 -34087 -79766 -206305 -92046 262272
20775 -79519 -83412 44713 -107884 47516 -304761 -118754 225720 -85378 287455 74084 234280
20764 234280 327353 -93680 -250925 -253752 66201 396722 -107226 -126300 -18153 150483 252915
20753 252915 -406599 256847 338690 151517 72849 199597 198086 214676 -146525 -13829 -164096
20742 -164096 -22318 -46356 218383 -5318 91554 -1138 -291506 -8428 135099 -200360 -36044
20730 -126778 -36843 -111881 -35976 -201147 92116 -157340 119727 -27135 429145 156892
20719 -44707 -34546 147231 -25428 -245909 -84011 -10223 -110213 71671 47885 -131442 91085
20707 -120034 128113 -60849 -74781 -318191 -102202 -241420 23606 -4551 -207206 -105426
20697 -105426 -79721 -37813 169764 247687 -60149 51724 117774 -283946 -254625 -195222 201480
20685 121791 -10336 -134508 113868 74325 -146543 -295830 48823 -361806 93172 3504 -77185
20673 -87179 79349 -179615 -54592 -9494 -248264 -16702 78692 78436 -67753 111915 203813 27994
20660 -237766 71517 -253745 -278904 -89174 132496 -80499 36358 94062 54396 -49376 -92594
20649 -92594 -149935 24685 -47922 -80836 -44760 483599 -29984 -275792 -22985 -402563 73475
20637 18915 -256554 -180661 -268556 -200321 -5711 -215671 -135372 -58376 -116470 11220 -514925
20625 -25702 -221549 242181 50343 -76650 -259656 -177003 -121682 -141199 94584 -740041 -106671
20613 427883 -240266 -31437 -358701 76566 92045 17237 23108 84168 187608 13102 40272
20602 40272 -237295 -3953 -9622 109693 306191 156353 322041 120632 53592 -198192 307926
20590 -148551 114676 -178209 -73242 113589 36501 119336 299586 -142541 -72886 -175078
20580 -175078 -55213 -272139 -276792 -59968 -208820 667 -179635 236780 113347 59846 -169690
20568 -10627 143867 -51596 -94140 160532 75676 334312 230399 141882 374086 -177276
20557 347137 -64139 192856 -158078 -189635 97075 8324 -48201 -347085 -290318 -80062 -253777
20546 -253777 6547 -374538 129386 -167909 22352 -193052 81765 -271957 -123956 -169014
20536 -169014 -185532 -73205 209625 33691 22783 -231440 -240586 -83054 62953 -20815 -483553
20525 -483553 -364222 -298387 -183125 -95659 -75348 -248553 152331 -33850 -96242 100599
20514 -227640 -23133 -12515 -112752 -23663 141896 -910 52937 -245385 -67111 104291 -27476
20502 -110100 -97951 10713 -47128 27925 27198 118125 118268 155168 143726 -108457 14124 -110765
20489 -69874 -219768 -413923 25237 -42553 -113963 -217061 -186361 -165471 54016 126434 7555
20477 -199042 15944 -350346 -33012 180720 -272741 -39868 -76142 -240410 119100 -13119
20466 -60196 112431 -186615 139210 -191605 -41752 -316559 -112224 66486 -125140 210363
20455 -471982 -120917 -12958 -131435 -239294 -189347 -121136 126923 73487 201059 -114552
20444 -616909 -86408 130343 282736 165743 -25388 -3619 -14021 165404 -347915 119636
20433 -152450 176927 -132916 -65436 29486 74320 265899 66858 282775 84889 -353775
20422 234265 -260663 76951 83670 -108031 -74482 -103151 295086 -167972 36238 -336621 19107
20410 -27548 -239347 -297627 244649 -63839 -89001 -68272 -9495 -49417 -147758 22233 -87039
20398 -378876 10468 -61983 417305 -120936 243879 -30391 34835 149 -59607 -4937 -511 -311470
20386 -311470 141889 33773 -30430 -94146 -148907 163581 -53798 258162 -146417 7295 -49
20374 -115487 -302627 -134476 254645 -46379 78707 -83596 -285666 -17252 85545 -105062
20363 8164 -169870 -5461 -291419 -209914 37391 186194 -65147 -169373 -302866 31535 -265019
20351 -178542 15955 -181102 30687 -133505 -11857 233547 -165258 -158851 144237 -103473
20340 -74182 213221 -66651 195489 56386 3581 21186 -192792 -126184 9942 44948 67168
20329 67168 -136755 -58162 -74761 -119005 -261521 -98749 -513405 196595 178238 -82274 -80146
20318 -80146 218344 -267425 19773 1670 -298119 -284515 -111527 -212903 86334 79883 223265
20307 223265 -39703 -117282 -120461 -176421 -345021 -299967 -29067 6309 -55167 -142522 -51198 -185380
20295 -185380 -349645 -215061 -508018 100747 -92413 -121599 -86898 -49494 -8300 89106 16185
20283 -18557 65137 -159427 31796 -258640 -50820 84774 328525 296763 -135717 -173289 -240220
20272 -240220 105213 -41512 -75963 -217122 -2736 -168492 151524 -5440 32333 67891 120258
20261 120258 -214915 52508 -219106 -48549 -347951 -375377 282378 -174736 20547 -165652
20250 118439 -108963 -248652 -268072 224166 267584 165979 -34992 -208981 -50783 -286801
20240 -286801 -22404 -136041 5069 105961 -86655 258318 -263745 -255455 232307 -280729 71065
20228 -215490 -97758 219848 -117089 -71169 -125693 204415 82148 -38390 18373 314629 -138917
20216 -390791 -30111 89837 -25312 118371 -235838 -176743 -108467 43955 -107840 -135564 -60306
20204 157063 -10258 51115 156410 44527 67832 70589 13956 -76708 -57883 54922 -204377
20192 127176 -11875 -17710 -85765 -19222 -176747 66698 111808 -46785 46601 -205561 -174389
20181 -174389 110679 -226412 -187681 -21972 -164677 472700 54644 241734 -266842 -225627
20171 -225627 -141428 -30784 -117114 -176224 18465 -389386 -79081 -112881 106191 57536 -325838
20159 -93905 -129440 -146446 130703 201376 309943 118279 -54202 -170910 -136419 208689 -135050
20147 -66087 121324 -72492 -98561 62137 -157229 -130617 -274644 -319244 -6788 -176643 -247005
20136 -247005 205471 22039 143801 -34884 39944 -88988 54517 81215 -56100 90385 -54429
20124 -51147 -109664 119593 -276786 -16065 131044 270679 -276651 -19240 27692 -223443
20113 -40375 159584 -144976 -55817 -110069 -114415 -193181 108060 64490 -127527 -140545 280191
20101 -76739 -3460 -112412 46404 -189192 57391 -481583 -148314 -274512 273504 -228154
20090 252871 -283317 75991 -349455 -234659 -292249 -191873 -13165 -436715 101048 144906
20080 144906 196380 124729 -16048 218868 -20889 28057 -50882 49276 -585670 -245684 -100870
20068 -173986 -23321 -55180 -116762 -173694 -71660 -170894 176022 -70671 -140159 182853 17781
20056 -48788 -188179 -113513 242108 -200700 -70936 101047 238555 115159 26149 -142571
20045 170403 8333 235057 -253890 -238120 -100466 -31722 -149796 -113033 34257 -43923 46236
20033 -255652 28421 -213713 256733 288145 -46833 -68581 37704 226094 104677 30092 -83048
20021 -196186 -116533 -222533 110542 7623 6839 -203650 21413 -103837 -24099 -355233 -5613
20009 5473 -30797 -81236 -178364 -85519 -75517 -193293 -155757 -106478 54675 74687 2685 -75102
19996 13601 182113 -161858 -98298 -447709 249533 -63361 207376 42378 72952 -53887 -161864
19985 -161864 -47216 -59743 162576 333285 -31392 -406992 -45265 -517694 36849 -4773 309419
19973 -170626 30447 128376 168083 10102 -6502 -117892 -391497 118938 -59817 -92279 249232
19961 -119255 209561 -222514 -273654 -32215 -172149 -165372 64472 51571 -56661 -62990 -209573
19950 -209573 -283732 -218238 149941 114454 -227847 -13370 244204 -184952 -244 197452 -98377
19938 37631 -325004 -161931 -43804 184257 -74265 113732 -265296 -275583 -35479 -46815 146862
19926 -193885 -139464 18554 -2251 -248830 -204707 -133306 19668 237297 12422 -95797 -246567
19915 -246567 -132557 210415 24830 -230165 -5286 -235841 -83257 -47649 -273252 -106819
19904 -70419 195922 99802 -10042 211389 -12285 -94893 -133703 -95961 -144089 -118365 8157
19892 440092 181331 4617 -266699 -13168 45223 -109055 -258630 -12510 306643 100004
19881 -79524 -59444 -118324 -263759 -60773 -180421 -40748 -38805 -63382 -466110 -204534 151967
19869 144433 -103817 262929 -98243 131495 -84721 14512 -286791 -89444 -179529 -163112 -238356
19858 -238356 -106383 78956 -131463 170038 -293162 48573 156098 183668 -408730 -33052
19847 -101376 130303 -226591 -15053 29774 89622 400083 -144897 -132080 78523 -68609 -205303
19836 -205303 -299335 -283203 97303 247962 -29790 -153112 73894 -186977 214494 -148374
19825 58310 258927 -107399 192684 -120025 128915 151264 23535 -56643 -96815 70456 20093
19813 302801 -32014 -80596 375861 -155850 350443 42616 -31720 58249 -204753 -20883 -415704
19802 -415704 2690 -89269 211530 120313 -214911 -20860 -106778 -122087 -427249 -195663 161937
19790 -63519 -134411 -77760 -4651 36439 -129960 -212416 -377974 -395086 105475 93380 -11797
19778 -251076 121710 112883 45478 -143793 -124034 106038 225719 84686 88524 250481 -124395
19766 -191878 -222412 -227263 204004 205908 2406 71127 -356109 -83143 -336638 425967 -271901
19754 160247 -84691 -9342 -102247 -33407 -192608 -59919 -18970 -8505 21655 -143576 -234202
19743 -234202 -227048 174630 4686 46962 -210179 -439618 -167054 -288706 -26982 105222 -281539
19731 -223001 -273886 -48290 -68449 -98312 -476668 -4377 -40872 -193795 7567 -50163 -355752
19720 -355752 27990 -139681 -23084 -364333 167983 156842 -43352 352943 72817 -167038
19709 -42386 -76397 203644 267389 -116974 -182695 -155545 -114412 -82506 66344 83313 -28561
19697 -93850 -1634 380006 -305176 146969 -122786 -47388 -132199 17409 54079 101152 -218977
19685 171656 100518 337722 -43613 -138289 162241 35133 -34463 -404808 -241224 174152
19674 -48901 -104384 -258806 133311 133604 93289 -46312 -30078 201369 -29078 310603 -84462
19662 200102 -234901 -25165 28345 -214560 -47525 -567900 -211697 -272427 68516 117676 135273
19651 135273 329434 -268382 -199751 55990 135748 269284 -70205 132744 -43359 -125652 -50413
19639 -57034 -100926 -162542 -61235 125825 -378843 -55069 -272800 133981 -242247 -279359 -295934
19628 -295934 16224 33950 -122968 -186601 -40708 135542 -86874 -107007 -247149 -267357 -100474
19616 -370607 63233 -83054 -170198 99214 -245964 -27502 298354 -10795 142890 -130312 28999
19604 121067 211905 36507 -30597 102134 -95710 167513 -97868 254298 -120060 -42645 -143147
19593 -143147 -217079 -22076 -145604 -133727 -148414 -133253 133851 -71152 -438942 -13377 -394265
19582 -394265 -119241 42914 -175816 -121743 -42100 112416 -150410 25766 -195191 -49741
19571 -209215 -49331 22479 -39806 -42878 -41930 -139039 -22162 -78186 1284 89503 118842 -118834
19558 44881 -54244 -158431 -7720 129201 -299915 164947 -66341 -126986 181041 -313198 -364819
19547 -364819 8140 23780 356261 -253212 69247 -22013 -52653 430333 -330832 -180311 -386786
19536 -386786 -23189 -134213 139089 -165879 -217074 -36145 -305130 176233 110472 39273
19525 -41770 22244 -71207 60503 19855 -270660 -105275 -63553 286712 -78672 -107794 -209424
19514 -209424 10717 -13025 -205904 48500 -13248 191901 -358387 -330171 70852 -83494 -84680
19503 -84680 -43998 -167981 97222 79996 -139918 -404017 3838 -198690 -93664 -168119 -141961
19492 -141961 -419487 -106269 -215464 -36345 -101247 20169 -278315 -206141 -15921 -96980 -74198
19481 -74198 -66298 -435944 133587 8458 -132161 -429799 121233 613 -574 -9009 -45620 -23386
19469 -23386 -149572 101133 -270335 -125909 -86655 -20906 -276844 4291 -376011 150596
19458 -54527 -133039 -359968 118802 119786 -287372 -37219 124481 -261735 125557 -319409 -37194
19446 -2190 -5478 -146795 -49222 187400 -252756 -136939 -24349 135430 -74904 -297392 15045
19434 -25305 -135815 -361858 -14155 -139240 -221783 -301176 45210 -216009 192181 -187101
19423 148246 -73000 21744 29956 69212 65769 -97231 -115119 211909 -203069 -375425 -322336
19412 -322336 -292818 106217 -293987 54360 -78159 -38904 52817 6310 145742 51329 243883
19401 243883 -171031 -35627 -105139 -287509 -126433 21556 5068 -130978 81199 -53355 -329264
19390 -329264 144869 -128450 301905 153599 -84422 -219326 194057 99728 167842 -13419
19379 3255 -121413 -75112 162189 81489 -50018 402684 96075 -163421 145384 -9752 7825
19367 78196 -147197 -97101 142560 -315287 -160297 -323318 -43534 307834 -72506 -231481
19357 -231481 -25911 31507 -206666 -13115 -114489 -202020 180609 -145052 -202932 -448291
19347 -448291 -143469 -104588 -116258 -94310 143608 -50451 46607 302076 222038 -122345 50368
19335 -46282 51160 -32868 64254 -141144 -336423 98941 -27919 -194624 -188368 140489 -106496
19323 -88217 -109902 97979 -285586 3128 -354636 -130868 -139896 -129508 249982 -13109 -222811
19312 -222811 -114032 -20117 -26828 200756 -128052 -72105 -240843 -135688 25945 103411 -371443
19300 -139869 85019 208589 -232854 306777 120097 -168059 -877 -210868 28629 -113925
19289 -211662 123027 -492400 -250414 -61917 7383 148964 -85559 23026 212342 -120701
19278 -35218 -23127 -176939 63058 -523708 -87141 295580 -109489 104076 -230822 158598
19267 -284269 -13731 31446 7564 40638 182535 -133127 280846 -56798 -64665 22280 229628
19256 229628 -134154 215922 -101351 -135111 -63409 -147777 -20341 -41480 121558 -172218
19245 49375 -45072 103657 -386938 -92843 -9101 -98173 -158563 -168854 -426731 -184416 3991
19233 -117773 14494 -78954 26092 -64061 -161304 24774 -70547 -201382 36469 19875 -287920
19221 237919 -200577 -241126 -114802 66345 -86607 -123528 -7954 -79452 -8652 -1798 -177699
19210 -177699 -404079 -134656 3386 78262 -227554 -117665 -118697 143611 -131768 140042
19199 -75756 23711 -52561 131647 -111492 -429250 -79602 -719 -378022 20896 -8629 241406
19187 -105475 59736 -91350 -155892 -59631 -230748 -241260 54813 60415 -154481 24422 89807
19176 89807 -138822 86976 64097 213891 -78137 -230589 -278216 -103746 3328 -238137 -36507
19164 -94604 -152685 27926 -286802 -106697 34239 86328 -31859 -234590 -96651 -40742 156933
19152 91896 164972 126360 157334 7285 92618 -93106 -4193 -54960 -62324 -80066 94273 -6151
19139 147720 -5698 74933 154373 -425005 -149973 -67473 -138795 90370 -35925 -373443 -295424
19128 -295424 -230990 203860 -204444 -5505 -171630 -7216 -319274 -216183 -15881 52322 -133009
19116 56568 -227484 -510522 100958 -251076 -183899 44546 -193972 -189181 -241405 181648 16341
19104 -327792 -43062 237747 -360928 33753 -244897 -196967 -119134 179153 -295525 -2148 -105384
19093 -105384 -10609 12233 116536 -55461 -242912 165684 -135592 -59970 413907 -41033
19082 -14027 112709 -87963 -355830 168933 31240 21537 355101 984 -137815 64394 96859
19071 96859 -11535 -192389 -45820 31089 -293730 -207019 185184 -132617 12959 349487 -172777
19059 -178958 -322170 94014 89101 -3121 -405136 -249591 114391 -49454 1712 -196809 -332645
19048 -332645 37558 -27918 -167571 -77903 -195075 -105604 -112002 -43914 159387 -77786 -123560
19037 -123560 -429121 -74117 93738 -75807 107821 -209263 -119779 380838 87384 -21162 219279
19025 -88222 109395 133313 23804 -434433 -211402 41124 20269 62184 116711 -42662 108169
19013 -38369 280483 167970 182612 157584 387094 94967 -152187 34208 132091 -110340 -123655
19002 -123655 268741 -145269 -48952 -71010 -188260 111365 -79280 -391291 -144474 163086
18991 -330385 -119188 -83610 73352 -261021 164983 6955 36567 -28336 -37759 83609 -219640
18979 290712 -304195 -96771 -157597 -35068 -339975 -123885 -168423 -18829 -133892 -494946
18969 -494946 -37153 194431 -100043 -18153 -12383 -110790 -84176 -173406 -380183 31050 -157943
18957 -66796 -45603 -45127 22996 29240 -220551 -231174 -39529 271892 19682 46194 57967 110198
18945 110198 54714 -200777 -138840 121653 117985 72958 105353 241173 -67458 77356 -13933
18933 156074 172359 -378509 -132579 21505 -137583 -107373 -223155 -262187 50841 -179938
18922 -195785 -251682 -51547 217698 -294864 66609 258050 -254802 140363 -22351 -119877
18912 -119877 6894 -87922 -19780 -430185 17723 122249 25551 -111642 52285 -15644 -155033
18901 -155033 328101 -53217 38705 248649 15918 -44938 101770 -144238 -40869 80599 -406287
18889 -33450 119887 -100774 -519995 -8495 -69148 -189481 41434 59009 -74858 -35616 -163387
18878 -163387 142096 113371 -167533 135565 165947 -25747 -107591 -101252 98050 -185149 -144517
18867 -144517 11773 118005 104104 -173315 -86205 -54014 -474953 107990 222858 -49294
18856 -20152 -261483 339796 -88268 -87203 27637 -463707 63087 -92383 -203815 92593 -188386
18844 88307 44220 -69233 12794 -185990 -51281 236860 -66550 42770 -79077 -168509 -73567
18832 -79862 -6340 52279 194667 140986 -19756 58925 -149326 165347 37846 -234014 -109823
18820 -239530 -65620 80754 -115757 48095 -30840 -151017 -390893 148535 89774 50666 -36768
18808 -86719 130988 -59937 -93152 -204618 2724 -198468 -46097 -84401 -225792 65607 -32495
18796 -61944 -164852 93704 12706 50464 338691 369081 133692 94204 -127932 25160 -322946
18784 65054 96644 119386 -192066 -156769 -220384 -60753 -121323 -200848 89436 98774 -96207 -5340
18771 -600063 -52617 -15541 57921 -46761 328102 -171472 -293420 -142597 272971 -301503
18760 20118 -37200 46280 -448745 75061 -46728 132533 -7831 66851 229789 -170054 239008
18748 -38580 -215761 22421 -57306 -60414 294468 157409 -90472 -144484 240707 -216629 -230742
18737 -230742 341271 -128919 -77660 -223229 -128183 547 30717 258886 237470 97497 329
18725 -225101 -55530 163266 -53891 -394686 -46685 -203938 -226182 36379 250262 267659 -5414
18713 -285233 -95373 -113904 -273971 -157741 -219 228415 18105 -145968 113421 85813 -177862
18701 49411 -124439 78102 -296674 187226 98837 148651 134347 -143762 -111816 -23156 48064
18689 -18156 -64337 -37335 -100957 -283729 -111898 -108576 139193 65519 -449569 -7130 27562
18677 1542 45009 -192834 287324 -428120 -52573 -289184 -160282 -201108 -167052 -188657 -171275
18666 -171275 -138510 -469543 156534 137390 113993 -250940 67014 -130846 -199661 -214422 -108791
18655 -108791 -92884 -206237 116547 86476 203103 137038 -248293 -304863 -69212 -185246
18645 -185246 23216 -18244 14943 4774 -91987 -164757 -69789 -300841 15938 60362 -29388
18633 -140754 249327 -94983 -369035 -77514 -293637 29953 -242852 -335357 -35070 -8491 252708
18621 -159793 -152560 -295807 -169114 28269 -66835 -206208 -10337 120769 -102189 -216433
18611 -216433 -1290 11852 -36731 274300 -59473 -12753 -261765 83779 121656 3450 8642 -175301
18598 -240051 207404 -69541 84486 -400857 -2271 383381 167569 20706 -285130 49909 120958
18587 120958 93806 -238447 -113932 146613 -176678 -107668 98328 -136617 234935 -155612
18576 -385124 347319 -1609 -267294 -126447 121310 -297561 705 285810 -169239 147836
18565 57190 -20718 -273358 -201245 -326804 37699 -47457 2589 -42052 81912 -104507 136392
18553 -249008 10865 164107 -21109 -276677 -228499 -44269 44354 155216 21286 37615 -235719
18541 -28240 22086 -95602 102817 116605 -2684 -46454 17332 -351166 -19280 -159860 -52559
18529 81587 -67231 92336 -172918 -108363 45472 2088 -238070 -91644 -31299 -122612 57432
18517 279982 -77733 -71832 -257286 -94896 -12480 -139176 -193421 -150912 139837 -156346 -377039
18506 -377039 91384 252550 26227 -176249 88585 -316527 13632 165402 -20890 102519
18495 272310 -414728 -176401 56980 -30168 -134251 -210443 21359 -211181 -147463 86581 -254349
18483 307036 76391 -86017 -73998 102224 2252 -97018 -55137 121450 -33670 -370824 248618
18471 -158368 203347 163363 -325502 -23462 39499 64063 -79244 -81662 110639 -52020 -158245
18460 -158245 -350409 -341818 147181 84106 -52512 -258491 124775 -75746 211021 53671 -32230
18448 -97576 -178994 -39059 -25470 -197625 -128127 -52137 -42621 90671 -564210 -72656 -131197
18437 -131197 -170578 3476 -208150 264522 -76838 -189150 -280678 70178 -91402 59438 6094
18425 306385 -248433 148473 84818 -159804 -309670 39080 220312 150767 188271 174134
18415 174134 -266828 52213 105152 45769 -215712 44158 -302883 -309512 48135 -489651 -29512
18403 167386 -303712 -178374 -34162 -204435 134992 -40980 -134421 109840 -873 -36783 110776
18391 -4984 -223061 -346871 41568 128914 39146 82381 -118293 -227148 -67840 68120 219319
18380 219319 -50818 -25045 -106866 127619 -170354 62211 -18623 -96490 -74978 168792 218118
18369 218118 -179999 -52996 162851 67096 109816 -131958 -162656 -76885 105025 54925 50251
18358 50251 -101724 66110 -61354 115922 -91675 -60054 261331 169414 -102611 -241510 -102230
18346 208440 -197865 546 -123681 93921 -78923 -98538 -39423 -96132 72120 -209106 -278624
18335 -278624 -139790 -144832 -147004 -80061 180482 -347190 -311107 -190933 -47361 225433 -375435
18323 -384009 65282 -107744 -337228 246433 73556 -73351 -26882 31693 -269464 -37087 -193358
18312 -193358 -425067 37594 -122519 389932 150698 -148979 -122733 195592 -50940 -135387
18302 -135387 -323185 -343994 -167413 101762 -22911 -178422 126399 38982 -87978 -203553
18292 -203553 -50117 74261 58414 120748 240969 88116 130112 -24736 187867 123694 -189338
18280 -187520 -80603 290061 52047 130568 20388 -146672 -184100 -23022 -34568 -130269 -72449
18269 -72449 -10615 43096 -50547 -68911 53782 -240531 91482 -332664 166903 158887 44712
18257 -55202 -1593 130184 92915 145633 -266326 -91904 -57377 -224164 -146512 20191 -263564
18245 -2131 -148635 -127761 -197086 103136 -81382 -250467 -307960 -206159 -165076 16908 74846
18234 74846 -104940 -232061 -13405 -177160 124374 30581 62917 -64153 -97423 -116827 220319
18222 -23106 -193612 159886 58147 -400466 242106 -195796 283387 -81476 -145718 72525
18211 89891 396138 95073 180219 12688 53386 192014 -204030 -183472 -121605 -226455 65699
18199 -61368 -28845 -148986 -65665 -149558 221107 -259667 -187686 -260499 152673 -4978 -175171
18188 -175171 203695 -100914 -34893 -149888 -233254 -276626 -140237 -276157 -121457 98097
18177 -47299 -10479 132564 64108 -144079 -184615 69382 318267 -280983 54022 -13592 3994
18165 -206477 -153556 28208 91336 18850 -143801 -57500 101976 -16963 -140373 437970 -291783
18153 41345 201241 -68254 -166757 92257 -64349 -203446 38643 225902 137307 126472 74846
18142 74846 183214 -123805 76692 -114647 -43339 -47515 -63782 22681 -175226 120770 -1133
18130 81267 119011 -33409 -108792 -146390 -208463 -304497 -34719 145918 93947 -200416 280624
18118 -66772 -85384 -132344 -107421 -173207 -228182 -39941 -230602 47870 124423 52553 -227005
18106 217693 -63303 3048 -413611 221533 -126622 -88013 37353 74482 -41572 24154 -121696
18094 -43070 -41348 168950 3574 -178198 -138819 45849 10110 -385862 34652 -12511 -115 415090
18081 192395 -130987 -35309 263220 -174984 384796 92209 -206972 -366568 -13568 505083
18070 -235079 86620 -26315 -44216 -50696 107660 -336330 205278 61337 -116913 -57342 -113400
18059 -113400 64397 202425 -39442 81974 -247844 -456554 118528 -213971 -150068 307363
18048 43275 -197379 15097 35212 -139067 -118165 -177518 -234999 -60876 -271500 -170372 -14253
18036 88857 -183100 -67678 -243540 110183 101763 -268491 -36474 -153004 9672 135386 -59691
18024 -242910 -74462 -135999 9478 -203400 278365 352943 80511 -204542 -202733 51668 -65814
18012 -24512 -23997 -50421 -67073 42720 303774 9681 -224354 33909 16350 -371584 -35222 -142192
18000 -142192 110137 -131725 137659 -4398 255085 -186386 -65923 88014 -214691 -424599
17990 -424599 -204745 -2447 -80445 81030 55375 293552 322372 -22400 -252963 -348417 52628
17978 -2010 194754 -75513 181452 -272222 44992 -189207 -58870 170202 348168 205484
17968 205484 -59813 36830 217230 -48072 49551 135351 179015 -139101 75968 258246 168676
17957 168676 -249387 108063 68374 137589 -23466 480512 -107843 -287433 -371094 289903
17946 127510 -35798 -1377 -46047 -285023 255553 -82742 -68697 55649 35127 334195 83859
17934 44460 -47555 292800 101391 158375 75623 304554 -219865 -382605 128125 110210
17924 110210 -223948 -3555 39515 -189872 170867 -175844 202533 37607 12765 -231495
17913 -12699 254925 97129 -54707 -246420 251944 -39934 123941 171771 -181782 -42810 81618
17901 -49648 -70993 112568 327460 116070 220934 197271 -307605 96967 296549 296982 -5862
17889 -35392 -249470 60819 67438 -57275 84740 131128 129866 -7847 239219 -52032 -137901 395079
17876 -161812 -247021 13370 45155 92779 23711 -329972 163786 -146416 -408984 -31052 314463
17864 -56630 -263022 32197 -96523 -271194 101485 -149542 294923 -182683 28130 -157470
17853 -46326 -102987 80549 -178259 -243125 -171781 -47350 48134 -38516 225314 -334059 97040
17841 -128521 66053 354163 3793 4411 307344 212757 111202 -97470 -129475 206744 285600
17830 285600 53785 -32229 -94846 -31921 79597 181775 -63237 -65818 458573 246904 -189953
17818 11720 -192203 55732 85267 205354 45963 193170 -32459 196045 22277 -122086 92406
17806 98880 66504 167741 -82595 -31616 141916 33403 144411 282537 6550 295301 48918
17794 130231 -142839 18758 67912 479815 -16250 -55921 93404 269248 199557 -118869 225277
17782 72313 -28967 50757 15616 -153087 164457 -15633 129549 74878 132355 -71397 60714
17770 -187877 296350 65035 67501 -30749 -96156 85980 86876 36304 -57955 132956 247907
17759 247907 82988 19944 397073 -12428 308135 -56437 107545 34531 83316 -107249 88483
17747 -41189 28555 -125439 80006 -174424 293806 -86520 54895 -117057 1088 -198649 -92350
17735 -220910 184924 -4898 360576 230482 203796 66270 -109472 -33245 -72735 177508 178700
17724 178700 -198999 142982 -135442 56205 -131739 -222243 -178569 -53480 -217900 175337
17713 176875 268868 61303 -203417 232264 -3182 -71720 -167262 -51220 88257 60310 33142
17702 33142 12720 -303016 129086 -100413 -81764 111504 94602 23596 40239 356357 214887
17691 214887 -99978 90627 185110 -41839 -226400 -18635 233557 179146 36190 50866 178299
17680 178299 -78892 -61333 -42094 95383 69356 23252 89894 -216867 7370 112612 -45845
17668 41329 -183777 178575 337760 254505 -181684 -81315 -293913 -15301 78151 88654 156227
17657 156227 104479 142086 114725 219770 136970 19701 5882 -383084 120617 272296 223620
17646 223620 131244 127873 -260055 -184837 76729 -96709 -149615 -181022 -55742 -231779 88183
17634 247186 16668 -126015 -96461 114252 65128 -59350 294102 -126579 -79970 414171
17623 -177779 -88397 5735 170646 289341 -198429 182197 285780 34250 78002 208772
17613 208772 332485 248365 297724 262411 -170862 531972 -43872 122474 -3132 -4540 26770
17601 337159 -72707 24729 173706 -16198 156145 29256 17484 -255208 -105596 181970
17590 105156 170079 104585 28277 21022 20432 138431 58008 142476 52281 -59054 -33968 198198
17577 -173699 -54205 -24691 -202988 -16699 238764 -82168 237218 43263 318635 -63109 178789
17565 225451 -237064 380563 -133208 203222 -330971 -262091 -19336 275368 409200 83011
17554 211075 -61847 -39238 -113537 131806 -63689 266551 -326164 282121 -64466 29008 -291781
17542 243173 -34759 270257 -10067 -285649 -233818 -119652 119803 -36226 197630 386813
17532 386813 156145 196135 83708 344321 227942 -192836 325722 -137519 81135 -135081
17521 78533 -157548 -31668 -160474 -12611 452570 -207515 182511 292162 -31046 -86374
17511 -86374 334668 61784 283508 -32153 8951 88690 125955 -5961 -74443 59639 348688
17500 348688 56998 -19089 258260 76052 -47831 117052 -71804 168308 173657 -244579 147120
17488 67079 -76348 -135451 181194 205042 -210566 407422 149195 129813 274473 163269
17478 163269 -104679 -149243 248301 -131170 167894 298382 182555 136157 233467 -218623
17467 -83601 -151056 339068 334642 124854 248963 345158 -141774 14450 75282 250824 10609
17455 337428 41676 -134359 262124 237878 140505 -298147 223394 276981 -100646 -37499
17444 -355752 318326 174587 318406 680271 144275 64385 294316 388802 184246 58575
17433 330359 220051 310840 251610 622697 279428 187095 205788 291392 -233661 382326
17422 71033 180852 206921 117422 129793 459914 392925 117288 327462 -3189 -134730 70612
17410 149880 389940 291918 454081 139136 -769 336744 81355 331885 164899 536694
17400 536694 318357 99276 236588 42824 162437 -3934 266644 105522 113657 204571 419108
17389 419108 -10841 119986 -128902 99587 -29871 115129 -81415 187189 183575 455631 237127
17378 237127 46265 -85119 282590 -38773 189037 71857 288515 237191 48821 56749 108812
17367 108812 242156 103348 -71520 278371 104063 399172 253361 63907 204083 545147
17357 545147 273087 -136246 94452 126323 -101302 169611 97432 -159689 330527 -132781
17346 423154 20244 280589 -129393 107698 54281 -48998 136730 165837 -186015 -120703
17336 -120703 229344 42511 99519 648298 100212 133232 166565 -65807 -10475 162239 351907
17325 351907 160592 119662 179534 -33251 -120317 355833 200361 98598 72001 400375 144606
17313 155603 163096 294467 99923 102367 478676 152805 168571 239838 -119004 142807 315569
17302 315569 118172 -293746 182621 209991 36193 408523 62045 280198 276745 276495 -96334
17290 143812 135019 41519 26294 114391 16993 377553 -22469 -145536 108526 -6188 60086
17278 314716 83480 74648 -162451 336116 -158164 325522 133197 -59496 -36395 -48300 39759
17266 367188 262320 204512 -1164 419261 159087 81513 231594 120793 247310 36947
17255 417166 10368 46329 360443 543847 456410 194342 483955 485950 400903 288615 349321
17244 349321 148937 155320 199041 60386 224245 257240 141497 591994 407243 52161 121025
17233 121025 269846 -7272 541910 109578 308844 8621 -102445 -128941 104001 434588
17223 434588 133172 274766 667046 28377 185215 11337 180504 363995 136886 102798
17213 102798 390011 263758 391044 443720 327288 283097 392031 219052 -196303 103368
17202 94622 126612 236185 407695 246379 -101085 207350 294501 223397 121290 274235
17192 274235 316108 187985 442603 152074 227703 88932 52069 493511 444040 488052 584059
17181 584059 544218 687024 385371 66774 331813 180078 247490 296582 143438 592841
17171 592841 316652 -73712 83793 71057 292929 544536 346112 364221 339297 283371 128369
17159 522630 168891 357803 206797 191430 189341 334753 750640 -16473 97857 490512
17149 490512 464412 255321 334645 200369 238712 260252 187806 417480 414785 310362 178411
17138 178411 686130 466113 351573 282135 121615 154159 347258 -146188 408110 476997
17128 476997 204331 132569 190587 119044 206981 270041 395413 398351 89430 163450 307964
17117 307964 453543 417140 10143 462614 476500 83762 154529 155885 470650 301182 253231
17106 253231 184510 242632 87867 410584 361137 434679 331676 480046 520378 150965 299685
17095 299685 540424 70852 142277 222799 192738 647765 422562 236002 359127 336677
17085 336677 484697 487164 523120 668338 1240 396054 607032 422515 183874 357175
17075 357175 311877 416517 625525 349714 486326 351777 660229 332621 766414 358241
17064 565729 366531 439035 378209 409552 295172 393387 650292 390358 563019 250046
17053 415506 457138 557480 376044 358374 282138 731463 697280 756007 632066 481510
17043 481510 361172 274720 447322 556261 322186 592625 178777 645548 527892 161088
17032 800975 646172 338822 398596 478501 394480 622893 531233 555166 570477 803126 696807
17021 696807 380443 705866 708629 872094 477262 654918 682379 584190 663276 392668
17011 392668 652338 587935 551707 771415 879266 562827 555183 834262 818538 792314 909880
17000 909880 604937 452218 642220 534854 804196 443474 802244 801792 1031086 606474
16990 606474 878872 731808 597431 846778 1089942 659893 829940 963580 349314 1362832
16980 1362832 825402 895176 617271 768728 885634 771518 1020253 660641 1076527 1025198
16970 1025198 734445 740331 800385 1115739 686710 894399 712455 936816 707267 1239887
16960 1239887 825234 779442 982766 606183 1075789 925857 1066309 856443 891777 934643
16950 934643 1030608 773049 987679 779575 977313 933216 1032412 1217673 1107666 937261
16940 937261 1107893 1146418 1208027 1078349 1142809 1143200 994878 1206681 1223998 1186538 1130818
16929 1130818 1190454 1165701 1330848 1465871 1065285 1067572 1381257 1270844 1602104 1205396
16919 1205396 1079902 1510217 1128849 1460026 1371186 1325705 1550751 1449329 1054746 1282684
16909 1282684 1164058 1596472 1268662 1639328 1500908 1385916 1366103 1628025 1365837 1515837
16899 1515837 1089222 1837399 1593547 1498402 1867318 1689115 1460162 1618592 1545329 1608654
16889 1608654 1460489 1460802 1961858 1765319 1940184 1864671 1798232 2093129 1817012 1788844
16879 1788844 1964760 1707137 2207514 2058217 2397798 1887044 2044984 2072565 2030780 2302973
16869 2302973 2129814 2062497 2184893 2463218 2374465 1997689 2341839 2166327 2691647 2054200
16859 2054200 2391478 2672647 2650472 2589305 2620221 2329518 2479396 2522358 2416814 2888956
16849 2888956 2398036 3077701 2809726 3237743 3100823 2817261 2948484 3101171 3192161 2982411
16839 2982411 3000759 3239681 3339294 2973116 3433190 3453040 3584707 3556093 3625597 3411158
16829 3411158 4115345 3511776 3808530 3687016 3641361 3844855 4059275 4335268 4264804 4570946
16819 4570946 4476731 4319145 4417729 4488071 4865634 4601654 4732010 4830214 5027863 5317456
16809 5317456 5069162 5547546 5495937 5535891 5650106 5421711 5834322 6014818 6100631 6443689
16799 6443689 6288683 6584017 6648812 6849882 6984824 7126054 7245019 7313242 7149981 7512757
16789 7512757 7848129 7858643 8085586 8227232 8799492 9038307 8995698 9182092 9454660 9767670
16779 9767670 9951253 10422503 10301470 10622914 11188167 11556288 11787312 12112324 12321411
16770 12321411 12780585 13113782 13219809 13918169 14294551 14868825 15230643 15710878 16499776
16761 16499776 16518693 17155726 17812608 17987303 19009003 19372047 20380096 21117436 22088725
16752 22088725 22752938 23373559 24276151 25483839 26331970 27456123 28475138 29676248 30948302
16743 30948302 32380936 33959352 35448036 36500479 38661202 40288207 42471382 44413786
16735 44413786 46920823 48864200 51221051 53987268 56742106 59838376 63049791 66543589
16727 66543589 70058492 73879138 78046174 82385301 86660280 91823531 97124687 101989903
16719 101989903 107707197 113118497 118743981 125059371 130877827 136848197 142511673 148105241
16711 148105241 153226788 158339953 162353286 166175689 169367426 170916890 172232674 172495033
16703 172495033 171836424 170282358 167678875 164552821 160380022 155769859 150226251 145095378
16695 145095378 139166686 133323478 127484041 121405519 115781421 109790367 104320501 99067333
16687 99067333 93584624 88943097 83764220 79245907 75459201 71345350 67338956 64008316
16679 64008316 60500930 57551314 54283633 51740338 49225266 46451055 44257350 42209243
16671 42209243 40121792 38206298 36598468 34799007 33376874 31509475 30634895 28746148
16663 28746148 28381647 26568974 25627745 24729665 23668185 22348119 22048612 21013262 20335269
16654 20335269 19416639 18663173 18400431 17497302 16867637 16472540 15852393 15241584 14949797
16645 14949797 14212408 13310850 13304468 12990701 12860588 12239863 11734203 11158493 11194155 11191031
16635 11191031 10609741 10151410 10094341 9606067 9569003 9218058 9044984 8830749 8258100 8553053
16625 8553053 8494061 7869809 7765880 7486496 7342038 7212891 6843243 7023641 6490938 6735973
16615 6735973 6222978 6312180 6174349 5956901 5893652 5650682 5701853 5327133 5337596 5374873
16605 5374873 5312050 5027774 4898724 4883846 4687933 4636558 4573527 4278443 4428161 4447672
16595 4447672 4135063 4157515 4034228 4140585 3974312 4030798 3865794 3691855 3499720 3199088
16585 3199088 3741996 3637398 3306480 3562260 3680244 2752510 3065232 3088598 3178744 2718999
16575 2718999 3028020 2889895 2716280 2947626 2626293 2812484 3083683 2457925 2681919
16566 2681919 2455456 2500278 2460046 2235886 2276272 2636912 2391124 2441265 2242121 2511106
16556 2511106 2441040 2216940 2356443 2167509 2048589 1925085 1773886 1586384 2284355 2128480
16546 2128480 1895991 1916820 2129067 2185826 1637970 1695196 1822274 1782958 1599766 1726429
16536 1726429 1975079 1691515 1458778 1628912 1626938 1445458 1507258 1433903 1351559 1328580
16526 1328580 1413467 1364551 1458100 1210486 1407592 1308696 1341671 1476896 921561 1678645
16516 1678645 968404 1315097 1262876 1217336 1468986 942888 1065105 1303764 1244156 1211949
16506 1211949 1342276 1303022 977796 1091365 1083164 985476 1022917 1093802 1083766 1053394 810833
16495 810833 1121116 1231582 1092984 756199 1402099 1020003 921805 688416 785685 1163343
16485 1163343 798210 651007 1106917 1185666 937340 1248445 962635 1066662 773750 997515
16475 997515 771747 575064 863932 987688 410608 775681 990965 476441 842696 783425
16465 783425 878247 803236 785928 904387 528684 1111225 460534 334265 865857 873104
16455 873104 824506 718000 486963 686952 328733 537038 523466 377712 498303 545876
16445 545876 600851 541278 869988 735558 605774 456244 616399 487621 490590 443364
16435 443364 550443 544699 669825 582125 384167 308726 653533 497456 18426 777292
16425 777292 695679 600941 696449 636844 652803 248495 218433 647578 268118 528046 276873
16414 276873 512599 675021 820972 385310 581532 437416 405992 392116 464710 242149
16404 242149 432464 362162 683153 232380 382767 210425 585688 264891 561735 306025
16394 306025 713185 236344 582278 396706 342478 417981 615605 481857 49733 314107
16384 314107 465285 370786 321914 632178 209854 210159 290349 667959 345406 581820 405120
16373 405120 317274 547655 34139 275600 489378 -120289 567145 535845 281948 334827
16363 334827 96895 389785 206534 292146 539398 273395 -45773 143225 237542 409501
16353 409501 607554 39465 478719 73314 291041 292780 68007 408396 334312 297188 439038
16342 439038 62581 126245 126461 212390 90726 238403 394113 335638 279129 459182 219921
16330 105115 173685 562264 386631 260040 376969 414610 483773 348584 -37766 220572
16319 452865 201163 343648 79987 199725 280270 232149 135833 263795 114913 207223
16309 207223 121788 114941 -235857 323698 311657 42125 105560 219281 261763 55896 334687
16298 334687 -283134 391280 -2528 37644 314748 327445 163009 395637 371786 201164
16288 201164 198590 35218 12970 -54831 -94979 193163 -193076 166741 -15840 5629 342521
16277 342521 -122122 164339 80561 94345 213052 90438 -84059 97370 122347 442177 -61010
16265 -62780 101385 151793 -144042 -179931 67271 301451 241691 369839 211352 206560 133171
16254 133171 320034 49284 -143641 -52731 246324 -115692 -146823 -36100 -204261 354944
16243 -239570 -57082 101614 -244439 49120 185836 62356 165215 151920 25080 124523 306887
16232 306887 253760 163591 41739 131877 -28976 -2785 398242 58063 -75545 264873 -227191
16220 238607 174312 134833 192558 389762 262367 155189 25027 196467 22276 -27981 70437
16208 -314322 301085 223267 -412387 -264481 466440 178463 -21183 198463 -74116 388726
16197 -36397 238041 -18820 564404 -140663 289978 -168272 52182 389235 225817 97667
16186 193858 470150 31545 88473 163700 44751 -133289 273309 -16412 188833 260941 -38540
16174 -82874 -205279 -126825 -180805 -73742 -113493 18294 -136821 213922 240011 -10063 62630
16162 -11983 294196 -109760 178503 100409 -27426 171006 87580 269836 433534 76628
16151 177660 135646 215019 170094 170662 -81424 -201697 44247 150649 292045 -206366 229773
16139 65395 326746 -32550 80807 101897 119659 -8004 -115336 -193059 243740 13183 1756
16127 -135960 94958 55710 2853 -513522 158433 -16470 184370 -683 105320 300234 -85428
16115 75268 -90643 16542 35175 141188 68699 150427 115820 -367414 298128 -37710 -240629
16104 -240629 -119278 -19172 207866 63723 -7537 356392 -22932 257628 39749 -62002 175547
16092 15445 -82645 -80362 60522 186089 222966 47151 32294 340403 238949 355145 -50361
16080 -137228 -140913 30746 67629 -71436 -94379 366437 82041 37106 -173970 137842 268242
16069 268242 -376452 77039 87921 -23444 261166 -302804 -181427 49725 188373 -20635
16058 -247569 21478 109244 -32547 -202406 -39404 -51230 158521 -3742 146245 -150575 203602
16046 106479 -115595 175429 5568 -69887 134080 -190694 -144997 -133713 164419 -39665 -95249
16035 -95249 6416 -44602 -105225 -25414 -97508 -66738 -136596 -9158 69815 186364 -225926 143932
16022 148976 -186094 -54407 -162058 30743 73537 -168194 -316901 -58835 22543 82024 -157403
16010 -36240 355128 -226260 -154580 -53874 63049 148839 -119648 310086 -87008 133323 217066
15999 217066 -51649 34900 169336 -71029 75858 -51223 -137023 -184287 -475194 -131324 -187801
15988 -187801 94576 92024 -150679 -113466 168240 47217 -270053 378846 166370 64030 -164753
15976 -323521 -10393 190958 90159 -59111 77132 326407 115565 216217 318508 282471
15966 282471 28937 74057 104922 129030 66765 337336 55371 88374 100044 -176941 -59067
15954 -65966 182780 -15599 -22643 -169539 -150818 113653 -33728 107909 -134575 -148418 8914
15942 -164398 -38979 -132146 -221873 107210 -454786 148539 -92195 87249 -79757 -96101 -73714
15931 -73714 17481 -196786 327924 7638 2282 323914 170730 -178258 -160604 -367737 183613
15919 -75685 241843 203633 -145168 -270 -177323 88736 -284713 -84338 -456446 247481 417465
15908 417465 -181041 -71851 -265993 -208605 -50458 -419832 -20892 -216536 -61884 86188 264334
15897 264334 2209 -87880 6167 -106312 -163030 45952 -116542 -92642 -182426 -219405 -51407
15885 99170 -335270 31418 217990 -146963 125909 -146574 -178845 -41995 -210055 -250575
15875 -250575 -399009 -390673 162665 65199 -180379 6248 -9256 36761 271611 285216 95447
15863 -111433 44150 -19195 73422 86547 -153346 -112053 -109877 128252 155741 49117 -107114
15851 189475 -245490 -246348 315213 -29677 -36350 -129912 239206 31654 25782 80981 -263791
15839 -87602 -69930 -264959 197349 334833 -295867 57012 206102 -50333 -95890 88554 227957
15828 227957 -150475 -138177 -123300 -80986 315291 365708 143018 45878 -25263 -69451 275875
15816 -305727 79450 -7438 10041 27619 150773 -113278 -283231 -276214 -151792 -209957 -222059
15805 -222059 -164751 -137552 -53191 50459 296515 -174349 59634 29172 -228317 -739 -107925
15794 -107925 -6012 -242674 -171793 343143 68779 -94742 -136944 48501 -174364 188856 107623
15783 107623 -251593 6361 -14743 6502 -96364 125120 314598 47236 -143811 122211 -166932
15771 -68814 147016 162253 70471 -89997 -148140 224476 183584 87559 -17813 99952 -123584
15759 -93084 88428 162792 -155580 -55149 161377 -40984 -143529 -14531 130584 4987 -8514
15747 145166 -142936 143838 -165642 -5983 164792 6232 -107537 524283 50031 91787 50445
15736 50445 139282 199280 238 -163281 42095 -68807 428156 -96427 -364495 142226 293621
15725 293621 -102665 -297316 -235853 133366 -190631 -27126 29723 -134857 -70442 -151751
15715 -151751 -155785 76508 -157291 343000 -340452 -134060 -22299 -169447 52652 -127238
15704 -242 352368 -8530 -973 -16378 106124 88682 -105009 -85120 309188 34565 23487 177350
15692 177350 -312172 17119 -115990 -70618 -14591 11143 134452 130513 3333 -229934 -242311
15681 -242311 12585 184975 107291 -134750 54787 144797 14367 -252266 -179850 92893 45877
15669 18407 169155 -128797 82233 -55896 -7975 -100478 -30888 30879 -261101 345848 1867
15657 -96932 -323348 -98697 160438 -6181 21872 -23727 285 338716 237013 -109502 10433
15645 -70244 -68164 -212438 59193 -302313 384885 -111990 -236087 94294 289830 -12033 23292
15633 -72164 -281843 -126331 103067 14756 -214615 77958 -92702 159220 45426 -131261
15622 -67355 -89121 89169 -144174 -73517 -103503 -368501 -47066 158023 44512 -159714 -121836
15611 -121836 -76836 263122 53015 -257582 325124 137025 119231 39515 -374391 -159040
15600 -120576 25559 -229553 -162935 122844 -128955 214642 -328863 -145915 -27061 -459566
15590 -459566 1789 -155764 16392 -188587 65738 -210542 -3473 -172920 -22387 -214633 -193254
15579 -193254 -172577 218026 99677 689 -9651 212980 180300 -91224 198624 -234284 35466
15567 -355344 48921 146337 233580 -173118 -38006 -51212 329538 -45862 4110 301811 -302574
15555 -7689 -36431 73569 106611 36996 -53931 89268 65136 240482 -79048 170613 118729
15544 118729 -143824 -87557 155180 195186 280652 304559 -274840 -68281 -278281 20729 -36652
15532 160743 -165001 137325 165178 481494 120435 -525412 -155681 -105480 260526 -82113
15521 -383074 46735 -9847 112556 -183968 -97494 314707 -283900 -66167 -137632 -45244 -11060
15509 235270 -336560 100706 143882 35891 -130542 -37816 -72719 2007 -68840 -114918 265788
15497 25715 -151836 -179817 -89070 19035 429121 -107998 -132269 -64315 -11323 -333492 -105533
15485 -159756 87324 18886 -352091 40991 -43333 -29343 -146150 41632 177815 -122241 330909
15473 35229 125334 -218580 184038 -43143 227910 -178404 58407 -72802 -240167 192361
15462 156277 247749 101025 -258175 123998 -139349 161770 100600 -144073 -154896 140665
15451 154697 -149765 447045 152611 167457 66342 -102479 -37593 -97161 128635 -131654
15440 243912 260704 -5477 21412 7948 -138414 18290 105677 219588 -87733 -289903 82918
15428 -460171 87877 -226959 -107556 -249245 321479 72700 225222 105839 -213562 -76516
15417 -152154 -99657 -246548 -4556 251867 79171 201596 18926 164206 112094 -95918 -180201
15406 -180201 -3730 -215843 -241127 45305 -156952 159916 242603 14263 -122581 -90359 -117140
15395 -117140 158513 -122065 109545 -86699 -159515 -71640 -165882 -83982 -96740 -202687 -67056
15383 101044 -182472 -323172 -50566 234217 81851 32958 -609719 -268324 270047 -20519
15372 -137703 309231 141791 -3722 -120646 284348 -30126 127065 -86651 53869 -237879
15361 83641 68140 -194063 267196 249157 91608 389903 156842 193485 41953 -228080 -63479
15349 -233567 -35439 -190594 229416 281560 -39267 33758 331389 -79997 35020 115938 -180984
15337 325760 -137040 121554 327461 -314046 6962 109483 292689 -64814 29146 -217880
15326 -110613 -163061 239644 132865 -265364 -208941 -219308 236357 -268451 59893 30614
15316 30614 -108261 142133 -396106 143181 -163370 63612 -166596 151763 -84417 158404
15305 -80947 -226736 -37412 129594 145044 381981 -46544 -5274 -179817 171002 100323 260212
15294 260212 -57438 -18785 -248737 440660 -91119 126613 91531 90475 111110 345952 76748
15282 65469 -75748 -22826 -294587 323671 302719 -14893 -225161 169602 -67385 96113 -362340
15270 152407 -66171 95937 209631 -166412 -11029 250840 129390 11498 77768 306485
15260 306485 -95572 -16921 -87306 -162577 -117256 240962 73947 -120663 119788 -21738 78257
15248 101632 5008 95051 -2908 100500 144692 -56531 -127595 -189796 257394 518881 106760
15236 412431 279750 427904 829367 885573 906707 663419 901692 455469 44677 354180
15226 354180 103179 244236 412048 -119465 64041 -272218 -16146 279568 -67514 -66395
15216 -66395 297599 16115 40161 -237675 -85228 199123 -3143 4268 -223823 162759 -114117
15204 -24609 170246 56852 495714 -127262 -71465 -265349 193479 69457 195071 110019
15194 110019 -103177 -39051 -209577 -24826 293863 13947 102129 274347 -123419 382360
15183 183712 328528 245416 -97948 -46364 -67740 267324 111717 -260648 343373 216898
15173 216898 186435 313746 -177086 155601 142214 49657 188246 15871 -169659 82218
15162 87064 -182333 156814 -116583 66822 217457 93913 146275 51418 99640 128298 129184
15151 129184 -6080 -192523 -12930 11540 -77467 -198174 -72588 181134 -144023 332988 -112281
15139 318546 111297 151925 -16595 384503 199803 -331863 -260665 97718 -61081 122573
15128 -94815 -19932 137691 252623 331092 140983 -180587 1824 408473 -73458 83381 151426
15117 151426 -91085 151579 53649 232698 -360766 -83964 -15591 193423 357401 71095
15106 266172 331018 162730 291085 91611 157763 210714 63925 114409 338613 58614 -84510
15094 106116 40688 40657 111909 59507 -128347 226827 92049 340772 291235 -26129 162392
15082 78235 134689 123685 -7957 176172 280509 310837 293272 507363 -139065 307093 -343029
15070 206112 -155121 89878 437167 63388 267757 242326 222536 60080 323566 67273 192309
15059 192309 324708 242821 57514 27908 136451 219191 259005 24159 24437 205080 214011
15048 214011 285992 17742 -50483 -144595 -415713 253480 305450 -57901 31733 -13486 254665
15036 -31214 -91456 165124 478294 315887 80130 38973 213573 207087 452192 256225 274496
15025 274496 123357 11778 -164903 96665 2383 223358 386587 293580 23001 233738 40160
15013 370223 260216 145810 249700 204467 182809 28012 74934 363162 216397 136171
15003 136171 147004 80523 357775 264506 -72314 412187 260797 158116 239904 203019 143128
14992 143128 252934 149992 250997 249046 235437 -53777 339368 28827 148477 -39551 111115
14980 346486 62869 274872 372909 318700 36072 64516 157954 65004 476394 373848 321306
14969 321306 199687 197685 286275 510970 60716 41090 206465 366419 207934 64438 255853
14958 255853 236814 252702 69897 348046 300875 351611 226340 243720 226407 283625 256915
14947 256915 380022 95981 88296 -11665 299639 333020 356445 194738 440554 127632 345941
14936 345941 324923 469609 387256 400102 325644 297046 246992 244844 102266 84152 48650
14925 48650 104823 159285 245142 391479 139789 181952 -115457 211740 363865 390048 470621
14914 470621 366536 -31120 601717 176426 417012 387335 395302 347810 547196 332625
14904 332625 436195 247937 304422 424517 388448 376871 88254 191820 470634 403180
14894 403180 170264 261312 -46333 241827 129049 -22335 166553 71156 496361 -13630
14883 69698 303146 165881 161134 423014 154727 -211374 65120 174475 350479 403451
14873 403451 259021 538256 171999 136356 197362 263662 306452 446773 409293 103150
14862 695884 55199 235937 434838 314894 14705 33161 673081 563496 481243 309190
14852 309190 246974 511186 381152 270811 542648 445748 34685 318287 478800 326257
14842 326257 316115 558336 246224 7691 489110 357578 567949 489389 504519 157433
14831 438413 449376 141518 483209 319046 720668 207273 541074 472255 586420 326167
14821 326167 232464 449466 423533 564530 432019 281532 709789 479633 455817 510505
14811 510505 193191 485683 414940 736616 152410 403055 146208 251126 505235 728329
14801 728329 225783 639485 418513 485284 115901 404067 529931 800915 492356 298237
14791 298237 614684 351865 250753 455311 359370 474781 608640 656851 542343 444029
14781 444029 398561 583132 481945 543797 275366 946504 507402 382352 404964 438073
14771 438073 419975 748077 646288 600848 491209 461882 423762 537870 605858 396647
14761 396647 562528 478910 751350 658428 744162 369144 563480 523981 549303 383529
14751 383529 677052 516949 407216 554183 527366 333875 735747 297140 977904 655038
14741 655038 590695 645590 623232 767429 719683 521786 432289 469235 1229717 374301 534614
14730 534614 189689 828534 526460 576053 706521 754040 885880 610522 595276 624676
14720 624676 745514 893405 607824 741905 992528 867771 523197 474380 905338 983209
14710 983209 825194 776322 1055675 914782 662693 620220 651720 1038574 816410 1050661
14700 1050661 631213 600390 800307 866201 829853 1089677 663678 933510 572324 841702
14690 841702 970105 805182 733156 782371 675966 763290 566049 787636 656368 551445
14680 551445 1105366 754656 983396 1016505 1122933 882323 979377 996427 819403 684257
14670 684257 877833 863279 715376 613358 862626 826701 769469 869162 928569 977561 1440958
14659 1440958 671339 910414 698071 885465 931353 1007588 1109391 556292 917112 1120985
14649 1120985 822338 922107 832655 928788 816210 840683 1192853 1188767 728248 872578
14639 872578 1372810 978817 1050378 1160892 800633 1345162 1091566 881562 1100043 1036537
14629 1036537 939421 1543158 1164081 1386524 1198351 906249 1221921 1033528 1128176 936605
14619 936605 1211031 1255628 1155019 718494 1305805 1038404 1303252 1345459 843788 1209183
14609 1209183 1411718 1624308 1059705 1481879 1213556 1475260 1410614 1463376 1089432 1468280
14599 1468280 1649127 1551823 1455388 1407639 1425611 1487762 1233213 1283381 1357545 1462041 1517066
14588 1517066 1509060 1467189 1324886 1345289 1765424 1334895 1918500 1652575 1703450 1740275
14578 1740275 1564327 1630162 1484458 1447763 1634668 1781383 1810835 1830194 1592558 1626017
14568 1626017 1573954 1986657 1728033 1615371 1826726 1549034 1809518 1897630 1933265 1970856
14558 1970856 1570025 1982955 1709893 2126647 1946464 2221033 2549708 2143986 2409562
14549 2409562 2575146 2243773 2601055 2290629 2433862 2829527 2723719 2907645 2956501 3464530
14539 3464530 3880851 4325876 5072640 5856620 6767882 8789064 13063436 20039148 30669476
14530 30669476 30238464 17652336 10918915 6642381 4708586 3633409 3174835 3202405
14522 3202405 2454051 2053768 2045572 1958364 2218954 2309030 2326568 2211329 2235518 2027826
14512 2027826 2121988 2145529 2258142 1947902 2267226 2333338 2131241 2366735 2010367 2342989
14502 2342989 2265440 2439925 2371711 2134794 2512540 2178541 2227120 2540847 2544741 2768538
14492 2768538 2534916 2711891 2465807 2493972 2675972 2718268 2601542 2917218 2634924 2633452
14482 2633452 2993690 2951092 2771995 2946970 3051890 2898029 2825416 3075361 3049447 3186849
14472 3186849 3180613 3623920 3239490 3278090 3582373 3343070 3384246 3346353 3591572 3531710
14462 3531710 3899737 3300304 3338550 3727395 4091211 3814814 3460430 4134932 4029123 4044989
14452 4044989 4168746 4000453 4297548 4530884 4213613 4203586 4072914 4456597 4406031 4094190
14442 4094190 4361602 4887692 4484764 4959922 4431659 5134507 4963802 5045300 5050024 5166152
14432 5166152 4864145 5111937 5134861 4888192 5555062 5237806 5597957 5331108 6063175 5703398
14422 5703398 5581266 5723241 5856352 6176887 5991599 5896322 6168100 6039256 6388191 6379017
14412 6379017 6710428 6589863 6820592 6725332 7024789 7068992 6978260 7428670 7293861 7543392
14402 7543392 7481358 7572761 8088489 8064410 7961002 8011825 7519289 8181909 8338576 8773553
14392 8773553 8533943 8523669 8792944 9037656 9367727 9637240 9602959 9717755 9977587 9855214
14382 9855214 10271582 10652375 10195645 10780632 10899368 11081051 11068915 11411625 11603167 11815927
14372 11815927 12187471 12193520 12099360 12661752 12844539 13029282 12972217 13450499 13809429 13984079
14362 13984079 14140174 14650871 14591630 15075541 15116568 15819708 15795910 16524495 16322230 16975413
14352 16975413 17413016 17575790 17974686 18064786 18816842 19102649 19555787 20146298 20398499
14343 20398499 21110922 21012688 21761642 22349863 22757746 23563967 24111695 24729073 25091020
14334 25091020 26045510 26458295 27249389 27831638 28626221 29497631 29930010 31030743 32404352
14325 32404352 32911320 33779930 34588824 35382055 36733740 37573361 38893338 40059901 41341908
14316 41341908 42615294 44097770 45441188 46662600 48385746 49890518 51765419 53242325
14308 53242325 55564073 57017091 59420471 61581101 63859434 66498981 69359722 71513640
14300 71513640 74576850 77547484 80957843 84300732 87742589 91808391 95836328 100119036
14292 100119036 104676289 109642313 114821195 120469264 126602314 132703840 139539539 146506105
14284 146506105 154572417 162425874 171024412 180296721 189445128 199934826 210974331 222604251
14276 222604251 235125116 248026160 261797967 276136219 290528530 305390368 320755104
14269 320755104 335795645 351223544 365969636 379816271 393149282 405704937 418224684
14262 418224684 429294305 438697298 447206125 454724959 460120270 461872137 462113400 463211386
14254 463211386 458826223 450862322 444328938 435979604 423571804 410944797 397568055
14247 397568055 383552343 368828155 354466197 339162554 324397727 309453600 295286874
14240 295286874 281526517 268039582 255185030 242599645 230636489 218968216 207798876
14233 207798876 197465141 186862085 176661038 167688961 158938503 150684262 143235200
14226 143235200 135774202 129444726 123095009 117614398 112349705 106807925 101821267 97433886
14218 97433886 93155812 89581235 85762862 82205901 79026533 75568573 72573272 69882813
14210 69882813 67321921 64916993 62478254 59902022 57771832 56056249 54271670 52182213
14202 52182213 50507789 48790896 47406838 46096948 44508456 43022185 41824317 40345123
14194 40345123 39296168 38131460 37270456 36468417 34907010 34136577 32948743 32374762 31629094
14185 31629094 30784381 29801415 29022963 28395371 27410707 26830161 26419121 25818707 24806154
14176 24806154 24257633 23688738 23247874 22787638 22436093 21522308 20845232 20460576 20120420
14167 20120420 19690558 19153361 19008143 18397593 18232249 17857748 17223284 16802627 16832779
14158 16832779 16040330 15873784 15653788 15403614 14989901 14609500 14124630 14456838 13807194
14149 13807194 13590667 13352570 13247439 12836495 12546685 12358632 12161546 12019010 11728692
14140 11728692 11366961 11214521 11286041 11005872 11039679 10543167 10637014 10268955 10158678 9794253
14130 9794253 9674295 9700874 9578899 9573623 9063529 9263303 9283330 8752070 8770086 8776325 8364819
14119 8364819 8394867 8181646 8075849 7995626 8388709 7823933 7365431 7644124 7781643 7563714
14109 7563714 7340769 7051109 7228259 7062901 6633756 6943255 7062460 6700045 6232267
14100 6232267 6660265 6304639 6200294 6043950 6244056 6053897 5888997 6053432 5812203
14091 5812203 5625398 5656822 5606429 5452214 5636483 5384679 5050767 5015703 5497150 5026465
14081 5026465 5045164 5310501 4915524 4858004 5146471 4939768 4974762 5036130 4844116 4913580
14071 4913580 4407420 4767073 4368286 4406009 4386914 4226208 4316495 4286189 4252851 3884212
14061 3884212 4268965 4271570 3983163 4021474 4174555 4011409 3642140 4157084 3711971 3747608
14051 3747608 3981005 3903388 3857894 3747800 3754383 3502008 3609262 3438733 3534541 3533972 3684877
14040 3684877 3751617 3309500 3217334 3130913 3434302 3126103 3599411 3077402 3041275 3085172
14030 3085172 3048173 3124023 3217435 2870234 2763028 2796694 3023743 2661736 3044067 2796004
14020 2796004 2579408 3212903 2982936 2700645 2678875 2503044 2992973 2668811 2575866 2633208
14010 2633208 2266673 2688732 2708430 2463397 2451381 2155596 2484571 2273236 2391325 2096252
14000 2096252 2112944 2132731 2409864 2118268 1990936 2333969 2321457 2259578 2142014 2126406
13990 2126406 2222735 2126776 1917239 2133031 2094096 1709702 1954499 2033162 1893815 2284321
13980 2284321 2087539 2311879 2348692 2757766 3069646 3922545 5440543 8785863 14681885
13971 14681885 25673850 30523751 20342985 13635899 9125972 7084644 5251063 4580924
13963 4580924 3959372 3512119 2860426 2845658 2455805 2479976 2036657 2329467 2496958 2269467
13953 2269467 2401665 2228804 2178566 2116832 2053634 2072428 1690546 1903914 1989147 2083770
13943 2083770 1698111 1779312 1873242 1744249 1693135 1790711 1643650 1589712 1473199 1627978
13933 1627978 1637442 1699167 1687271 1663973 1730799 1722679 1790459 1516174 1187548 1685377 1614022
13922 1614022 1540275 1635372 1507283 1660995 1425662 1735764 1229503 1451901 1206162 1340526
13912 1340526 1211267 1352423 1556239 1326434 1634691 1259495 1490100 1338676 1246842 1199524
13902 1199524 1314186 1378329 1143565 1517832 1145256 1376537 1203962 1267268 1065123 1159480
13892 1159480 989844 1092852 853320 1234673 1135721 1227850 1520877 1308210 1303578 1040609
13882 1040609 1149661 941841 1113073 952391 1126679 1114187 1380370 1194931 962953 1260396
13872 1260396 825646 1337613 1266773 1288184 1069715 1041182 1158865 779139 722860 1054871
13862 1054871 1224081 878368 821578 1151605 1260683 1099376 1200810 1256225 1130599 1369253
13852 1369253 1044405 1262990 1101966 864984 864580 835400 765968 675825 794393 1229253
13842 1229253 1048144 858822 742515 1076114 574122 798812 836728 1009623 1120081 907191
13832 907191 785373 755888 835025 903873 733090 1076200 938404 597748 639405 1148773
13822 1148773 790987 459338 810707 1006326 908395 610111 878812 1243208 750877 946827
13812 946827 598620 629232 654781 498609 843368 909865 805585 787651 910841 743686
13802 743686 705278 866272 907691 616251 623821 822601 641094 826971 656468 365442
13792 365442 569457 814035 613064 731298 615290 920161 733678 824565 394760 470692
13782 470692 455385 893659 553136 747559 433969 838047 810478 679549 529929 384982
13772 384982 622450 835278 596728 802251 561242 1003858 689229 548693 527215 560432
13762 560432 561418 395274 488708 735987 429476 558321 710943 245532 546130 378236
13752 378236 423760 363279 326396 641468 333616 365869 478361 801157 574117 488230
13742 488230 546584 671459 588574 466355 1110310 327725 423746 591171 643782 560142
13732 560142 597646 403395 319118 642935 587940 639681 148584 685491 575147 361754
13722 361754 751855 824076 595981 651025 383338 344550 495806 710993 779705 203970
13711 279119 666482 707471 572551 914600 346171 558338 515444 234843 682675 583757
13701 583757 310283 490611 480268 699381 434246 280936 239641 609008 710207 659682
13691 659682 359596 541813 238372 503379 557664 430211 379469 608698 355867 480579
13681 480579 463210 174372 331281 550525 170234 229105 339553 102424 470243 185884
13670 536612 406151 114754 411531 548440 426211 378614 418851 351059 712933 531960
13660 531960 300083 203142 255084 564520 510384 604487 288701 821405 422759 630580
13650 630580 99604 322294 617557 278816 328493 508897 750831 377240 163127 260908
13640 260908 234015 151913 366740 301366 480841 436304 179488 414682 289814 275181
13630 275181 260879 193880 162626 423522 80820 313461 375108 109725 344282 355420 624990
13619 624990 524417 401518 460438 548811 506517 378272 271031 387841 354917 158909
13608 515323 415047 437868 290265 415839 356407 344248 -72832 490227 455605 405717 229858
13597 229858 142920 473227 303653 334062 333595 258046 195029 590750 267454 255688 145073
13586 145073 211091 -12192 550464 291457 437291 192715 226581 324018 263570 442597
13576 442597 519678 410392 336277 15589 77767 -11867 230578 109539 442880 267758
13566 267758 363241 165328 466170 233523 239258 475156 193292 56088 579423 288421
13555 47846 25343 182905 228348 108403 361682 400092 71032 34170 137458 91412 605696
13544 605696 224617 410924 406406 340097 135341 222037 548039 360572 282657 185970 454565
13533 454565 328867 497708 288993 240970 243139 417826 192677 565428 167483 -13946
13522 298872 19465 -122937 228323 170406 -64762 216253 122207 314861 229843 112432
13511 550179 326131 317927 118050 146195 57376 363561 391660 235103 116656 73969 -216587
13499 30299 193545 420061 15074 19088 491226 471093 359793 259985 397183 57351 68696
13488 68696 190295 370177 95224 364680 123388 165687 71464 -6171 185420 171878 266084
13477 266084 88064 -9517 25985 147744 191228 169067 320890 385589 69169 278791 171306
13466 171306 234509 224508 215210 161949 293255 390148 259485 197000 -85795 237160 -157483
13454 102898 333881 227058 295760 5873 291087 176940 289154 125210 512189 165086
13443 -81674 466939 241940 51948 646028 -13407 -296008 -34864 -13488 410229 76657 284445
13432 284445 242037 -9958 115585 513384 100526 162790 51924 393003 128315 356578
13422 356578 -28461 37555 -203914 269733 93143 80727 236056 -265887 175037 257994
13412 257994 354952 515718 236835 314840 228381 206266 -20501 277249 238374 148627 33865
13400 209412 -262080 103482 295029 29192 -255569 107101 179214 461517 497331 389743
13390 389743 212044 -60161 83131 -236153 179087 66746 320428 123239 164719 489323
13380 489323 36080 181714 179677 247907 85522 159136 346022 333874 89098 -145301 246688
13368 207442 21537 204500 263240 -190627 356626 40337 54047 -147856 192596 221587
13358 221587 345661 230827 372687 -133319 19300 143677 -87030 136255 237869 -945
13347 247263 30524 305612 35972 218873 279464 234540 137896 150750 310894 179470 304152
13336 304152 157605 94309 161448 117893 422787 305661 171875 416747 309402 404678
13326 404678 158648 355858 441826 369479 428621 494849 140130 202629 59664 -77447 305204
13314 62175 37564 393251 370004 264346 -123395 118031 245154 270314 372822 165047
13303 125110 356402 -329770 132538 227871 100478 149304 370357 109375 169593 62121
13292 -77078 -5495 163574 -18977 -312946 253423 151840 187723 194029 181338 107576 -127536
13280 389538 259621 -186644 288822 173543 76664 -46006 -13690 239810 58812 133694
13270 133694 -187303 -22164 148337 -137222 220215 46508 189602 157424 169734 -52211
13259 126454 173504 26601 -203098 -71060 -142970 -144857 389706 232670 120567 -165040 -82057
13247 141221 335523 -140737 102226 91147 -89731 54755 -15067 -26257 197540 12569 -71100
13235 379119 267057 161234 -64342 136951 234037 209186 102206 78064 187958 -63555
13224 80109 5430 4575 287170 185857 38022 17533 -32672 328870 38936 -129022 15186
13212 79541 -4886 5513 -46094 64751 -237275 246025 -83248 266577 56647 69473 -623 -145351
13200 -145351 138328 -21336 -18776 15845 90408 56705 125195 330603 81031 146959 308844
13189 308844 -96647 5114 145083 -7763 205230 105948 82959 -143225 -107971 98433 199652
13178 199652 68492 -38018 61697 289383 -130750 209609 236563 -2367 102806 26459 1626
13166 -251377 45793 279395 107108 84909 51783 75816 82597 122396 88754 296690 -96657
13154 16179 325720 -73538 367679 44453 1555 112184 -21184 224921 -45298 43454 151616
13143 151616 145886 153499 155193 -16334 102582 198447 -98775 -33418 43619 -118690 149986
13131 200806 -14613 -88450 295767 -159007 -259270 242864 119359 -45367 221329 -28890
13120 -267786 172516 95000 -69494 -89776 122383 -273417 63487 148946 5705 164325 67744
13108 272498 -41304 46754 -60483 149280 113075 565029 10740 -136647 96051 -14306 100468
13096 199301 169128 171802 -111247 230891 -67254 76937 11692 268818 -108963 -130901 95895
13084 -7909 -63285 -168006 -93966 -160607 206443 37852 109800 -39878 -191033 142396 369335
13073 369335 112775 48220 -55581 228337 265589 -8367 71809 45417 121491 50136 255784
13062 255784 324743 8927 84031 -40394 -347924 119673 -98271 -80726 193140 21526 -166343
13050 213171 249697 168455 -184939 30587 360839 -106348 -77519 3628 -389523 320941 65723
13038 116111 112161 300787 -20397 12942 75067 312994 60655 -9123 -34156 62665 276374
13027 276374 185774 42823 207991 270643 -95868 145792 84387 151918 265063 -195725 -172279
13016 -172279 -279455 -166300 172395 87698 -16128 -303052 238610 147371 178662 30316
13005 200677 -116656 180734 -159583 353446 467902 -13604 144898 43809 138793 -62061
12994 195823 222131 112714 232508 -147289 144671 -183693 -174483 -6785 211118 105854
12984 105854 -218657 -121615 64531 23837 48455 -24034 78430 172181 204051 -156234 140758
12972 90148 132268 -66258 -169336 -27257 168270 -123710 137129 -106044 2349 -191747 -74502
12960 177164 -160689 -12274 3057 259138 -162835 162394 -79847 170145 297093 183695
12950 183695 -33393 -19673 -37544 -224928 243489 -215443 80799 250592 208349 149807 -123423
12938 -190209 -35492 108276 406751 52833 368755 -221973 -232638 357272 251023 36670
12927 -105530 -114519 27677 140141 19347 -212982 -221629 -96454 -278769 -401106 -69661 1964
12915 239859 -209518 119412 -17619 202495 -25725 142871 2616 273858 186086 36497 29947
12904 29947 -95591 59221 139917 -299901 74600 62473 54658 -231841 88323 99338 125010
12893 125010 344024 55447 -98918 9407 18033 -23515 131920 119933 -128468 46262 -62112
12881 -73754 160669 178297 -10015 -56354 -18910 299709 79371 -305880 -217889 -80441 -9511
12869 29167 294476 -58509 189759 -41048 1309 -255888 54580 61250 -105803 72523 -176758
12857 285639 98303 -167484 -114259 -77302 111896 26127 87059 -24264 118589 213575 -1658
12845 99000 -66980 149726 340624 153996 -9100 -141316 -8155 233496 -17904 93557 -486095
12833 -18035 227 -25176 -28128 -220676 -164387 193422 4322 -37153 -281529 37188 -194339 -19656
12820 27934 -298607 -24995 -134302 114710 258218 -54637 130384 -243760 254337 -33346
12809 12854 -181924 480661 12317 -17881 -178778 116694 195096 -27739 -198245 90955 18869
12797 -14832 69129 -319522 -74394 -78627 -85618 34616 237109 -312462 -286229 -197560 275610
12785 -165438 -85466 44513 229697 -158290 66473 -102407 -211577 -87773 -187391 -343719
12775 -343719 78755 58656 7096 463426 196523 26117 37605 -83156 80421 89380 15272
12763 -94366 9590 -351406 -53610 63497 -204071 104027 14357 -19867 120310 371375 -20787
12751 -372085 -102302 198495 81522 66888 -24555 -467306 -7642 -6771 68112 -129796 122066
12739 -133908 -38038 -175141 -82683 -77711 -41724 -162822 50778 -135190 -142311 89330 124614
12728 124614 -116290 -54212 125761 145550 374018 331366 109314 -262731 -26553 -122540
12718 -122540 21260 -181494 227625 34325 -4812 -92994 146947 -84849 -72946 82956 -174700
12706 65461 58132 -219658 332227 -497222 -178954 -258875 181500 102959 30670 202031 58522
12694 270907 71084 237593 276437 41651 250850 116339 397938 363216 174653 71455
12683 -6928 58244 45714 -8176 91473 249744 -82568 117589 -142455 145676 -153749 -149280
12672 -149280 -243368 89747 -307834 -156617 70323 -38623 112193 -37466 314638 -86862 46194
12660 423883 29905 -98468 31061 -113333 83200 15379 173558 -64687 -79743 199597 -149281
12648 -68733 -73439 112569 -347381 363969 148982 34892 -47326 238936 -126383 -202967 313584
12636 41908 148699 275289 -156436 40251 -11950 63706 -153077 149416 40415 236881
12626 236881 -25509 341988 71144 75970 547561 28500 -9729 -129582 99160 235722 299794
12615 299794 159986 146741 -90664 423833 161609 112870 26330 351540 460385 370280
12605 370280 -67155 -46428 122852 -299923 -61925 -68687 183496 223955 319571 -155595 33853
12593 -137180 13206 3415 279166 167859 -17932 44231 297355 171929 123451 -71734 114053
12581 6020 12590 -152676 408099 84191 -208464 -139415 23735 377551 41362 27382 -39633
12569 -61588 16964 -263942 117048 -164280 239502 -13229 170833 277052 -61869 -24586
12558 -27248 11027 147923 242267 -488850 -35250 -44652 -56108 -152813 -13672 59497 -11615
12546 -84599 -122926 88162 -332359 63101 222193 16629 -14029 -20077 16163 1789 -7144 120430
12533 -279673 28998 43971 210345 -147656 161074 -152486 -8265 -277783 -65286 -234423
12523 -234423 -85002 47146 87378 261039 -10655 159367 -25833 -116604 -217011 109598 -143140
12511 -47892 -3553 -154291 -4356 -270283 -271250 553069 -72254 -244024 -132292 -27640 -65753
12500 -65753 70594 235386 -28440 -100627 -117696 398471 85626 130516 14280 -228884 172294
12488 -52189 4745 35260 -33572 67181 -115218 22797 -33061 34334 -54928 14230 -265133
12476 -24348 -55192 -206730 283979 -176259 65085 -145008 61717 49072 -340 149694 -451481
12464 -210376 -135502 96572 -165964 168527 135733 217449 79858 -126612 126634 -31378 -162507
12453 -162507 104644 20498 52350 77805 -193233 73731 260261 180326 247265 -53492 -41275
12442 -41275 4118 205527 -116316 -80178 -407030 109642 229307 5302 -228243 20468 -22593
12430 260802 144234 40708 9487 49750 180769 -181730 -159022 140251 -256918 134674
12419 533 -259984 20717 104363 -216509 114579 246813 -319864 -110785 25637 151779 103775
12408 103775 -55675 85642 27561 -37535 38505 20010 -53983 55149 -112343 -217877 7001
12396 -105977 -106047 -21878 -181166 68281 -326063 -333408 259946 -308535 69430 -151626 -106597
12385 -106597 -368617 113282 -340091 103257 -140478 40090 41268 44850 -309959 -111868
12374 285149 -55015 -222608 -109314 -14035 -166110 60131 -51095 53360 35437 -128235 -179748
12363 -179748 103722 -83338 72324 -99889 -142638 -62471 -37749 166774 -247289 -144885 100159
12351 -45742 -128658 383381 -104392 69368 -49688 3903 25671 -38722 18520 -70769 186373
12339 83362 150796 -38811 7815 269911 371843 -153303 136064 -224235 -126071 113607 -73816
12327 -12370 483723 -124861 -119419 -263659 -116175 212188 -133361 -21456 458067 81314
12316 -15164 -111775 -88782 -339110 -451453 -102840 -384520 6380 -125313 -132526 292724 -306184
12304 57707 129575 -286261 23995 231672 -150861 107862 -47674 -118185 -122417 -175381 -76997
12292 -193793 -115213 137297 -79139 130394 188468 27303 -46503 -402741 -57944 15625 85884
12281 85884 197039 266845 -52262 408894 -115794 159338 -134956 -19417 -65156 64332 65791
12270 65791 128553 -111512 -47151 485022 214750 -127730 -34028 389264 -31031 -12554 215387
12258 601014 279060 198141 185193 262105 202631 70140 87937 143675 -48462 -45693 96148
12246 172886 193973 -143575 153010 -111150 -69049 242748 -193344 149340 -132828 306501
12235 113912 246990 -135559 205317 256968 144296 144965 -4066 177826 312591 30300 130398
12224 130398 -69240 105660 7809 104849 291550 -16689 -1403 69159 249695 -1080 -21310
12213 -21310 291849 9206 313639 230313 347412 355276 224665 84355 301019 25977 76818
12202 76818 332184 -101461 -138717 178718 -122476 200995 950 147252 -7483 189401 254075
12191 254075 -174717 39663 12993 -96220 183342 257592 76813 -30544 132433 310507 173526
12180 173526 210665 -43387 203790 -129709 -152158 189795 276941 -51729 459085 -101601
12169 -41750 315391 231585 92231 -95403 179403 -65793 79554 204439 69369 -4767 -28351
12158 -28351 29109 364283 -41043 -10258 -58859 130864 109543 360517 -46517 163510 -94541
12146 -4322 -131512 258237 351652 -144810 -24983 349315 -928 -86296 85135 200977 -144649
12134 244161 -290292 199699 -201315 -226787 -94154 -128946 209100 120892 244569 -226794
12123 -24773 11515 26060 -230466 -106517 55422 14749 -6105 151404 227897 -61695 86589
12111 -132842 32991 214593 -20 -18756 11211 98888 127345 144575 -126887 100516 -129843
12099 -122495 357754 -32911 240384 52953 126548 -182509 87197 -112739 -74 -34214 -200423
12088 -200423 -21340 -125657 -2175 188564 176655 -241600 -265596 -41078 -384793 -106434 29169
12076 -336151 -88590 -230054 58522 -144078 176673 99307 220812 20839 -65646 -165502 468184
12064 1041559 1378208 872105 282451 288119 -20714 277700 164541 159806 29292 160908
12054 160908 -192197 29438 -51790 182464 51896 -9628 -186832 337362 -109258 -439901
12044 -439901 -113127 -239609 237465 105068 -70275 329601 145272 87732 -49329 -69742
12034 -69742 -175160 19683 -41912 -109613 127995 64655 75155 6468 -178316 184644 94644
12023 94644 -222707 -86448 23498 56816 77224 -199870 -65830 -70170 147620 -157617 -292461
12012 -292461 -255375 -93771 113897 -11451 119746 75440 188806 55403 76702 -191678 37130
12000 210595 138077 182217 34991 331285 124208 17617 304150 -45226 -74720 -276009 -72416
11988 -107950 -135300 -32822 -67333 283455 -387939 58574 11995 -145786 -74558 -18714 338407
11976 -69371 28293 176829 -238067 -75558 -433780 135825 18215 36302 -226276 -35987 33444
11964 -169838 -295353 78189 142636 -80178 -277426 -161676 -43179 79789 82637 -79354 -336130
11953 -336130 47047 -167584 -127409 219889 -178141 -113580 -29617 134491 101921 -40805 -3758
11941 -260829 -247804 -193749 17221 82615 99256 -101847 -165779 64366 -24533 -117172 -85149
11930 -85149 6821 -143889 82009 133281 -55431 -37751 -41505 -113831 -123062 -32671 5560 -3690
11917 112229 -4961 -189688 116207 -410311 182834 -21329 -259275 -95637 -226749 50344
11906 124798 -280592 633 212231 -60909 20901 270748 -183648 -227138 7662 -317707 40823
11894 -356701 -9940 41208 183429 -189209 -323383 -124992 134854 -119825 -271499 -89664
11883 63559 -268953 -19521 -152532 -256863 -118680 -165749 68135 -28047 -258837 -162092 328508
11871 -6662 125689 -224163 -389635 -21076 -54714 -92704 -256152 -3982 -141662 33799 11867
11859 358698 131868 -343483 -114777 159957 49200 -169470 -159080 -100576 -211747 169464
11848 -259909 -27116 -174986 28982 -205388 249037 -66819 -64074 -174632 -235661 2514 -169322
11836 -86714 -29271 -49909 -108458 88327 333977 65783 49962 285914 -85346 204475 206645
11825 206645 -179089 394 -389200 -201304 109457 -127597 110888 -217499 -589743 202591
11814 -206206 -224582 -115799 33804 -72925 319184 -301921 25796 53724 -215541 -4523 -86648
11803 -86648 -348625 257447 -21493 -266152 193596 -77783 -203801 -216937 -146199 -53263 -24395
11791 -20777 155142 95347 -79077 206118 -439100 -229873 128852 207732 362077 -145475
11780 -143770 76329 74147 -134280 -18750 14650 -5371 157830 -39802 166557 -8728 -349569
11769 -349569 -11614 81486 118767 -48736 54623 -183492 133225 42126 187439 206806 148672
11758 148672 46193 -242708 -221509 79930 -107825 -361946 13692 186359 200471 -341514
11747 -33537 81566 -508098 -101572 -185433 81064 -158215 132567 121781 -14929 -98765 -71164
11736 -71164 -38186 -40499 153326 247653 -109040 116769 -61259 -52765 -109972 18525 175509
11725 175509 125386 239393 39026 13183 -452191 -217641 281220 234517 -173509 -4675 61555
11713 -63739 96768 -183389 195891 114495 -368210 -26266 -15025 -67632 -145912 139476 358412
11702 358412 84248 -138077 200706 -250195 189646 129075 123284 -9528 74421 -192899 -243101
11691 -243101 211820 -149358 94354 13963 260032 -37623 -450460 125412 -52784 -161036
11681 -161036 -158791 -80296 117649 22894 474159 93335 207852 -36174 185927 -44661 11710
11669 -149202 -5787 -123748 -74521 252386 -253650 -73467 -238103 192177 -80019 -83348 228275
11657 71734 -257493 267584 113886 83602 -189599 168862 -53283 50555 48658 65444 100161
11646 100161 197892 172651 8914 -34299 -31107 96358 331723 -7724 32750 -207737 38778 13005
11633 103801 236687 -54078 -260900 -203706 198247 130024 -140324 193107 237679 428759
11623 428759 -21848 -168498 -88543 -140190 -189099 187973 193936 -287559 126160 -217778 5039
11611 -27407 -52710 -147567 -79928 83381 -15218 -34461 -95484 43774 -4875 143583 227206 -248731
11598 -113901 -166486 -48216 66552 219634 39828 -72628 -18602 -60371 -104621 73707 -31896
11586 399560 -105969 13405 5404 120694 80382 313036 14820 97562 -331368 -158111 225366
11574 -128333 -134485 33323 65715 313856 -104460 196622 -51891 34115 229647 17198 328898
11563 328898 370218 -36422 -150241 251733 144734 243879 218195 46715 218456 -186554
11552 126033 111816 43743 -68407 162465 122027 132439 166435 -178727 66655 187841 63756
11540 -167385 -83210 333366 134271 -37567 154547 58950 -147430 98257 159680 -530980
11529 -11387 25121 -81254 -8615 -10409 314272 -14210 186747 35208 -35708 187340 449058
11518 449058 -269903 14210 419625 46334 -100796 343580 191779 97225 70122 159928
11508 159928 285000 356234 -44528 33752 60414 -214973 269714 -144971 -105346 -69094 307031
11496 365515 155929 -78015 -68695 72310 -36779 -62758 216418 226821 -175148 112389 73453
11485 73453 246594 -156618 191985 -45648 43551 136999 273143 104402 215019 -125378
11474 53589 295568 316764 2250 -64156 -77882 208236 241488 -3255 35778 86921 226723
11463 226723 120754 -189452 468964 253773 177770 -101189 53107 -212620 176689 6351
11452 -10909 122421 121665 -4983 155012 307136 115648 139084 -1378 -116963 65733 261830
11441 261830 -65177 251947 -54428 -154661 -43802 318607 336061 159351 62922 63945 -126773
11429 110731 -2362 -63130 61894 174207 169782 -88120 -23916 87192 263752 20975 -121321
11417 198796 171971 -121184 -56063 -97357 218090 55499 27330 159453 360149 -320159
11406 -38675 97864 44467 138834 147366 -113832 -259594 164879 -18753 27459 -183754 -170395
11395 -170395 -334430 141335 5156 82172 53275 -63608 194162 161673 -94878 -300412 -23755
11383 92147 -194336 -48985 -34412 130963 -136996 -58788 171720 -35317 145456 -42869 47854
11371 32494 -8193 -285715 -372144 146115 29279 134343 -163048 215117 246901 188693 48411
11359 309318 -187703 -53295 30625 -90604 -174901 -16255 -125699 -163377 -185007 -276731 -249320
11348 -249320 -197223 -20817 136855 -22398 -50083 -31572 39006 165601 187752 -403429 -208137
11337 -208137 -86743 153828 -173239 -44811 -195000 -17994 -9053 238788 86721 197517 139298
11326 139298 -86113 46171 -175008 127816 -67501 -235734 -351461 -29977 18612 80637 -230283
11314 249698 -232342 -220895 68221 99253 -304088 -305433 155698 145255 -59077 173385 -331533
11302 25538 -172067 -78515 -381914 174852 442858 73956 14842 -9027 -190957 -126121 -171619
11291 -171619 -124084 94529 -6009 -53626 -86226 19546 -171836 -18731 77591 -232814 160374
11279 64944 110305 -147461 -54004 135838 91553 -267823 259059 -1534 42054 -26783 -168637
11268 -168637 109792 -101999 -14063 137466 10180 -59674 57957 15555 -235751 -229797 115451
11256 -72090 -171121 -353425 171519 45247 6990 -175073 -214635 5108 88992 -45036 62790
11244 -166568 309877 -126951 -8918 298817 148976 -294600 16015 56485 -275273 138347
11233 -222574 -287655 -204524 -89005 215681 337064 25304 140423 -165435 -112916 -64246 83010
11221 188425 256492 -187059 -219552 -190103 1719 4677 151413 -178324 338171 -178598 95225
11209 265042 -332268 -256048 88914 15414 140207 -212922 42910 -162497 -115974 7145 108464
11198 108464 158385 191686 -161989 1180 -191846 -38125 -105644 100518 -28407 187642 -155976
11186 -258767 3238 -31163 -188851 88580 -231737 5930 15250 -176492 -118279 -144156 86293
11174 -103726 -45619 -318669 61505 -150072 -168591 -313418 -49531 -174858 230757 -175967
11163 -288035 -251333 8111 -134301 -293962 -61044 -81739 322743 3120 -127434 6086 -14773
11151 -103709 -98406 -107720 61273 -161070 22933 286906 -15002 -126300 -228555 -133957 48063
11139 -258009 -70618 240968 49297 -7664 175807 -190878 129477 -180453 207360 78194
11128 -54017 -328332 194420 -138289 240990 -436609 72644 198224 -71319 51172 203109
11118 203109 98521 98504 205454 106387 145699 -222747 -81852 265220 -8840 53774 -15782 242830
11105 -88038 100091 -167716 -180321 -439572 -27028 2910 208496 286260 199038 -126102 -39316
11093 77083 54773 209600 126051 295420 170067 57515 506865 165228 391331 -138405
11082 -34682 145715 148412 -4050 -89033 76500 263668 540370 318081 37885 38439 -164507
11070 146707 178831 83029 180189 -92174 201591 332411 -55856 164180 301441 197875
11060 197875 393753 279206 546652 362581 417019 379188 299800 6174 216063 271137 283215
11049 283215 377253 298146 270250 332700 601006 357788 323697 686095 779674 603456 318336
11038 318336 261322 615666 251567 520917 564509 519213 961377 454822 309413 594030
11028 594030 641500 742774 709863 754953 408700 394450 606773 625103 925456 374693
11017 575290 726149 402866 331667 805741 1016238 699289 343515 617353 431739 598030
11007 598030 296036 647408 588442 309274 517384 724336 502074 733074 302880 629124
10997 629124 653860 404652 810325 629095 420682 510295 224202 358731 428731 556170
10987 556170 471255 681789 642190 577538 525304 449231 545224 827761 586071 516953 734014
10976 734014 717988 642878 960483 521193 710600 788144 836740 922878 1018529 779294 1011072
10965 1011072 1020405 1283345 1254072 1599009 1199686 1487346 1763009 1767554 2106593 2144143
10955 2144143 2205068 2834064 2175325 2004670 1938898 1993454 1909309 1396182 1714515 1766424
10945 1766424 1985505 1645772 1514422 1656331 1984516 1616866 1790435 1498124 1251395
10936 1251395 1624809 1197199 689871 625648 824844 765850 234037 356898 147563 155914
10926 155914 229242 305945 131698 355473 248154 399864 201208 86959 144041 108723
10916 108723 1728 157238 94838 -151180 211845 103869 -313711 -30942 -326466 -4656 -18686
10905 -18686 -67819 196691 -28258 134619 2192 190798 -178650 25253 -74202 11138 72838
10894 72838 60200 2864 19116 101694 -38013 -289396 -132898 155274 51837 -1130 84400
10882 76035 141962 -85714 185262 145825 -48764 100021 72378 269215 -154319 -173283 -92547
10871 -92547 134979 -160352 173991 70720 61313 -86617 89462 -107485 14257 95525 -20905
10859 -115128 94980 -84037 172611 -183306 -103063 -84154 85262 98732 -55054 -94676 -231015
10848 -231015 265554 127690 95287 -111077 -52391 132145 -288846 -12400 -28694 85839
10837 -150296 -221071 -98508 77653 -164136 -234294 -7848 29552 -202698 322749 67471 261741
10826 261741 -180659 43179 305 -199741 -118976 -142238 -106982 398533 42362 -6748 25725
10814 15506 315139 92978 -130277 -119108 95806 -83746 -137760 -122059 42194 178151 -295674
10802 -188858 -107242 -256059 864 89991 -186037 -297695 -55573 -58099 236132 126840 -142357
10790 -106361 -241802 -121529 -251777 -304420 -364644 -234446 292744 -150373 -29305 -213250
10780 -213250 48116 148451 133564 140168 140493 -368245 -229079 -91257 45536 -297933 119146
10768 97419 136269 -158884 -59453 -15321 139203 189010 210343 23159 -150695 -52170 1503
10756 -277289 168175 -30721 274774 22896 90530 -23290 -289364 -168792 -61518 -48671 -119181
10745 -119181 83682 93856 -34200 228586 172879 154848 -66467 81216 -254396 -172893 -50805
10733 -42273 80966 144890 -221082 -12660 220169 -108511 -334598 -244661 -193813 -246910 -180240
10722 -180240 41033 -313063 -55088 -200537 -122692 -25829 124790 -190680 186643 -18872
10711 173319 -16266 395714 -162307 -78661 -10276 116977 -334025 -141612 -180928 156973
10700 -42427 -117028 143484 208999 -133386 12365 -98033 -112317 -143102 -162509 315793 110987
10688 -265512 -89001 -196846 -18361 -308438 63494 -116793 -117911 71337 -8199 -214598 130706
10676 -129207 -163510 -231236 169522 -69617 281186 83944 -185411 -150713 -47483 142145 -79488
10664 -202068 55748 -216392 129380 -545624 -113409 -278402 -202116 139399 -55152 -76135
10654 -76135 78013 -202496 -225276 290039 -229466 -100730 20716 -244958 24682 -273031
10643 210875 -30525 -174609 -212781 -178946 -252629 140078 -255335 105031 -177938 162363
10632 -180412 -78654 -11973 -14063 -118744 -124420 -205873 43448 108162 130884 -117537 -137119
10621 -137119 -135212 50890 59380 -92508 -265927 6186 -428933 -296411 -26973 7436 38059 38890
10609 38890 156219 -153556 -167345 -10658 -210424 291134 28226 -58893 16136 54458 -29524
10597 11295 -141741 -55982 -129519 -136801 23370 124930 249609 154244 340763 -137881 -280649
10586 -280649 -125004 -25974 -57323 254119 -62314 92087 -528870 -97230 -190859 -562 -108277
10575 -108277 -69471 143424 -211446 -167854 -181599 -23058 -204717 -86246 49415 -245281 50228
10563 78581 61289 55221 107268 -214323 -3100 91226 -45934 130372 92096 -118485 -89414
10552 -89414 -52917 70591 -240370 -116090 -18150 108012 62803 -219792 -365674 146141
10541 -479041 -128482 -56479 -149678 51321 -273209 -118801 -148997 -173934 97689 203664 -175357
10529 -109321 -31450 -179259 -184439 -53475 50949 112565 -235148 -103786 27855 -88886 -315556
10518 -315556 -114359 69190 345044 -320734 111043 325923 180695 25042 -140757 128618
10507 -50170 -86297 -176436 -393900 -363748 210453 225191 133081 295560 -192888 -3587 -255652
10496 -255652 -266164 -24813 9347 68797 162510 97286 50802 133302 20079 95743 -23009 12212
10483 -34811 -53546 -6613 36214 -129472 -17917 -2868 173375 -183240 -67061 -335100 -34000
10471 -152617 141469 37364 267109 92761 224873 193695 664378 128578 242512 -22492
10460 335971 118578 -22615 -29319 -154673 23341 159349 76583 166330 31652 -173270 -286330
10449 -286330 75519 -267810 132935 154270 34303 -247582 184607 -301264 -44128 -222452
10439 -222452 -52642 227182 54659 -160881 71217 270267 -270271 20619 98426 261000
10429 261000 87685 12687 -98668 69768 35702 277228 69505 15477 -219673 -186644 -66337
10417 -221544 -105951 218264 260233 -113735 -97358 -34397 -61997 50737 208360 163052 -212150
10405 -238271 323563 29122 -202085 117527 63756 144808 82258 -36007 -247634 -135219
10395 -135219 -377094 -80216 -187824 88215 -45199 -120141 15985 -41715 117905 231960 -19846
10383 62399 -125224 280310 220257 -182510 -137022 -114712 424795 -123032 45082 100983 -31751
10371 169557 86079 -175148 65847 203833 -10524 319845 214979 176119 167073 80927 307767
10360 307767 76549 630734 297788 20859 141748 154593 43189 197941 257046 551972
10350 551972 408638 219348 75810 541425 163719 209033 221046 161021 57196 -182077
10339 110572 50315 168172 42771 19854 291337 362700 261607 137836 -66348 211804
10328 172975 115310 548302 353208 307705 425217 149081 402483 -93302 383062 -232819
10317 184843 491552 -11299 123101 -40968 39710 -69073 225690 67049 132530 55315 162233
10306 162233 176264 346531 22248 173718 276553 107187 -75539 -85872 75920 -70753 -132222
10295 -132222 179722 -108111 162972 42925 450832 -54978 103523 29304 -48310 -314532
10285 -314532 -206348 145401 -262790 -141100 -246861 5119 28090 -268919 -55571 9918 -159851
10273 -38574 163821 -341426 125686 -118073 185596 123356 18021 34655 -194633 -29165
10262 -288395 -547 -29471 127421 -145896 85660 -296560 28992 105475 -53388 134890 -474306
10250 21411 333935 35192 -7856 178710 189636 191641 270878 141353 660805 431518 261566
10239 261566 188254 134773 78120 22811 16365 131525 338575 -400879 118531 -200201 36095
10227 -132161 -131475 -50969 148540 157513 97018 -80327 46535 347984 -191547 63587 315110
10216 315110 -3421 -14110 -147820 16977 51301 42517 -277803 87378 -38311 -70826 -136130
10205 -136130 95945 -123183 -112172 127720 -208945 59944 210730 133024 -36733 -270322
10195 -270322 -121519 413460 -152738 -88761 46784 -207094 -263178 -189605 -73453 -131123 -18652
10183 -48023 184559 -111032 -231 -338999 184351 184249 -432804 125473 142823 -406667 -509302
10172 -509302 126775 -163695 128092 -17097 -25545 -97366 -89172 -99896 -31821 22343 -129929
10160 131523 210808 -239589 -41663 121177 -433553 71084 170712 -26715 -385180 -265200
10150 -265200 -137375 -225045 -182871 -295163 55131 -430361 136649 -144475 -253579 -138531
10140 -138531 -255066 62894 -127716 -107220 -152892 -257408 67088 -52218 225129 -64751 -439793
10129 -439793 -76306 -60094 135701 14152 -223819 -24390 -178846 201388 53160 -17135 310257
10117 121765 -128583 54883 -169876 -51276 50039 -162365 -233652 65510 -120613 -14329 106948
10105 -175454 60351 -136843 -3749 -514038 3758 123198 99979 143830 -78321 75444 -59701
10093 156145 -278123 157593 -75434 -122512 93650 -200676 -262008 -53153 -297042 34882 -146946
10081 -286434 229734 352941 108885 -173395 200974 -56121 4622 -23247 -114840 -214294 141688
10069 61117 173739 346812 44419 292657 -267782 163359 -327210 42172 -357116 -57055
10058 -92565 -198079 -70302 -13230 69242 -5871 274851 198325 -147930 -25734 -53870 -235027
10047 -235027 -54029 -21010 119731 -193769 138740 -118584 -235891 -237705 -185189 -196620 -175310
10036 -175310 5984 119336 -169429 -90534 -331888 -169387 -364740 54739 -166631 -38127
10025 196664 -121584 62791 3122 -66531 -374317 2295 -286699 -38188 -149245 120205 166354
10014 166354 -279902 -156007 -73814 76584 -11148 -51767 59660 197451 -161413 64071 -40980
10002 -164611 205411 66960 -31091 -239517 -31277 -334408 18844 -151858 -22533 196062
9991 -160786 -210727 43862 -50487 68478 -156974 -373645 61033 55556 -16366 -75698 -297290
9980 -297290 -3477 -405966 13275 2885 -80525 53922 31220 -103149 -98300 -150829 -2745 90119
9967 -263182 360932 217391 -88025 101757 -6538 -10125 -48991 -4538 -42427 -296369 -73002
9955 -61402 -133863 -124600 -128480 20456 -20632 -195318 -53884 126742 -49369 -117743 -147710 165127
9942 -50577 -167245 -289306 -270671 -175733 293914 -317888 54766 -174586 8273 -256912 55119
9930 -236165 -95595 28714 273029 -23758 -35894 -65561 -25369 305488 144890 51600 -203944
9918 -267474 62466 -214520 -114406 -40045 139689 230210 -187154 -178619 6204 -5060 33454
9906 27379 -209473 -189721 -84556 -383158 13267 -66730 54182 -209160 -166526 -227035 -23853
9894 -284158 -180297 214853 162704 73167 -84161 186402 101664 -149238 -252768 -143195
9884 -143195 -28513 -190275 -126570 -201761 -333284 210606 -47733 -308962 -216307 -42633 -381788
9873 -381788 -126836 -186197 -236196 -89584 -288866 -73980 -131383 -329046 -80050 -229013 218093
9861 -327668 -250202 -341444 -18939 -8851 79480 1060 95945 -392679 37767 36624 21514 -11988
9848 112780 -124783 -390641 -115666 -260716 -101223 -40086 11370 105838 -91377 -314877
9838 -314877 139943 -268870 -476681 -159018 192595 -99027 -29595 68473 -139447 413030
9827 -183034 -301538 -92914 -93608 188819 -10722 99955 -151175 184347 -61222 -171793 -272560
9816 -272560 -26196 -176279 239531 -157901 72382 -381234 -172505 -308595 68438 -285802
9805 -30324 34873 -52706 270140 224534 -310883 -357487 -271321 -25184 -146921 106241 177326
9794 177326 62424 -395608 -232614 -213040 128643 -120223 85022 -194808 -79322 -103576 69627
9782 -256689 -112191 -101488 7602 136952 -272024 -107062 27685 -37625 -77753 -11956 -127994
9771 -127994 46054 -64550 205818 -129974 -214167 -297446 253092 242739 -148254 -173932 -46471
9759 189399 -107794 -93283 197090 -23165 -130032 -125972 -8386 65592 84496 -29914 -44626
9748 -44626 -184626 -16130 224997 -223336 -354705 -86621 69817 63043 260655 81138 -43181
9736 -41940 -67746 -102544 126746 -555975 -94077 102369 131952 -310308 269513 -120724 -114964
9725 -114964 -94046 165892 -289515 79660 -294569 66733 -299166 -1245 -39756 282407 45419
9713 14348 -34403 -215152 35999 -81104 -35580 23384 -268055 -140426 -322679 71754 51256
9702 51256 -13458 -203265 -396267 20606 994 219164 -100866 -71674 23096 41699 -145110
9690 -165146 -51458 139699 92508 -302689 -269683 80811 -331258 -158397 74283 -94705 96579
9678 -339580 -255260 -197846 -82250 49369 -149055 -218028 -81755 97562 33710 -180908 -168336
9667 -168336 88828 -187173 275606 -26268 180169 28604 -192423 -118303 -169023 -132282 -85353
9656 -85353 -12294 -90707 -275150 212920 329174 -37561 -36848 -339234 -274570 -148043 -329744
9645 -329744 -141332 37971 -4605 -93100 -54222 -187853 182730 167173 -41349 -329659 126297
9633 -54622 -61889 82598 -266731 58544 -16580 -145552 -281202 174090 -85306 -114927 -156802
9622 -156802 -233444 -107549 -422006 -193727 80600 -88039 -120468 100712 -246792 170059
9611 -85683 178389 -183898 -5062 -172719 -88897 -215980 -98038 82083 -38718 -169721 118275
9599 23253 192929 467195 102517 -392737 57782 -203387 -65854 -182924 26309 59123 -106163
9587 -47088 -117738 149861 -278582 163600 -110092 -414123 -23824 -95252 -114474 -318161 -390700
9576 -390700 -247620 179892 266317 251308 193982 196522 -144603 -69908 182706 -58290 155222
9564 38169 -218007 -198442 -103967 171247 -156171 -214154 -149925 18614 -265181 173698 84879
9552 -495810 -178714 -275330 471049 299980 -15218 156183 -118220 -370622 -191410 -8398
9541 44479 169051 -152662 -219848 55507 42034 -31096 86441 113594 188649 160367 -395488
9529 216211 -225466 285075 -37380 -87705 -143901 -139761 218299 56758 -206552 97383 -458232
9517 162213 -36231 -354790 -89781 -132558 -189031 -260900 -264315 -65207 -119391 9051 -207636 -431127
9505 -431127 237984 -32302 -73848 -485084 -217635 4770 172907 -38726 -45054 -15614 -176265
9494 -176265 -380021 -12355 -86919 -66592 -41332 232504 -48099 46383 9744 73863 -193834
9482 -140186 24991 -216989 -206296 -132109 -270686 -351948 217823 26153 -12807 -353485 -196757
9471 -196757 -178211 -193297 136251 182104 -970 252760 -67138 -116682 -332406 -86837 -57335
9460 -57335 95486 -146577 -132648 316933 -274743 -118285 114543 -196400 60335 -18348 10412
9448 -43848 -174124 -171600 -273410 -156043 215477 314473 3165 -221170 204791 -10084 185740
9436 19033 -293397 -92813 -100989 -103443 -928 -5094 397483 -31975 -213686 92276 34386 15114
9423 -102409 -22495 8710 -436024 -72917 -84031 -131635 -249459 -147163 -40824 -341297 127343
9411 -101228 33589 20576 189272 -212889 7310 -29215 -4381 -404381 36319 6558 -54953 -249599
9399 -249599 -283524 115905 -319959 -8459 -209211 139297 28603 -209883 -247629 -26224 219477
9387 -48652 -228009 -173861 -36542 28595 -116138 233573 -103924 87435 -212788 41910 11023
9375 -204425 497595 -197769 21984 -217634 204170 -67906 -9626 188882 -118770 -14551 -365999
9364 -365999 -306517 -92195 82151 40599 -356665 15509 -152650 -75598 15998 23491 -337764
9352 40876 -100630 -192658 -209182 -98831 -231167 53319 -101588 206922 -75182 89993 -69885
9340 -46979 82410 -181305 164047 206194 163884 138468 150147 92684 -279332 25384 -250044
9328 -42962 105542 89 -91747 -25689 44393 -206442 -78520 -112902 -66585 -108671 31900 -63310
9315 -54417 -113316 -123433 -229785 -38873 -227650 9516 -277848 -193796 174075 63292 -220578
9303 -30478 72536 -264361 1992 -46809 -317879 -190868 209328 -201330 1956 -427867 95689
9291 2182 67721 -1040 -199109 132356 -106923 -4209 -1912 -120755 222289 1918 -397535 -86894
9278 -23102 -224025 -266430 -39737 -206621 213020 -84571 12483 40081 -45035 -333187 -76202
9266 -46143 -5960 -262985 245938 4661 -274705 1446 -307599 293028 -272217 -44142 -360450
9255 -360450 -12883 -87987 35621 -46624 -342772 187442 115003 13890 211283 -184690 -140090
9244 -140090 -234378 58757 -219809 198283 195287 28513 44147 -176258 158086 71882 -269325
9232 -272335 -257906 -252951 -223581 -321014 -143249 -307069 -50034 -45333 -34884 -125948 -126656 128069
9219 12418 -12870 -293991 -4856 -263336 205613 -302911 -198899 -283406 -86211 -47189 -53112
9208 -53112 -47835 -76428 151872 16913 -3433 31527 574963 22115 -139060 -81082 -130899 -139133
9196 -139133 -103804 151479 -109589 176763 33785 -159525 -13874 -76522 51241 -85220 78674
9184 121096 -36514 -153829 69210 43488 29537 90704 107065 -170233 -102126 -71066 204291
9172 258763 123111 -115523 -277622 107896 -222762 29289 27537 -50674 -120580 -1682 -45829
9161 -45829 -297415 183454 64399 70157 -157145 21078 -339576 303761 5909 141748 -130321
9149 -71285 -817 170889 137423 -157538 -325609 -474287 -247467 -53359 167638 303355 98203
9137 -7433 93377 -23020 -8886 -13400 -189994 -318252 276907 -97529 -196989 165369 -335533
9125 -169151 37462 -115674 -10032 -119403 -82749 -89749 8685 -160377 -142762 -384205 -330073
9114 -330073 -78796 -8543 100151 18652 -213483 -181556 123652 -338898 7886 -147299 -344562
9103 -344562 307724 -276304 65142 -244494 -272616 143898 -52532 -157914 228086 -87186
9092 -263586 -27321 -197439 -216092 67998 -88157 122607 -152147 -297553 -134582 297100
9081 -309853 -47714 193160 -149565 162099 -1208 -150431 -433508 193331 158953 44682 -121493
9069 59176 -106341 175127 -342508 -326203 -26212 -208363 -89201 -118802 -68514 -263346 -214342
9058 -214342 -129393 -543293 -1660 57457 -44152 140148 127391 84907 -271241 -346912 34221
9046 -229254 -236617 17987 7026 -274583 -157983 -34545 -68219 -38760 -63289 -169320 32217
9034 -141184 -120189 -111491 22318 -303050 57162 -323933 -161922 68308 234833 -6638 -189286
9023 -189286 30589 27692 -211910 -159726 190661 20115 -42299 -359794 -272849 -271285 29933
9011 -86119 -80497 265593 156303 130975 -80191 -3389 105187 -105981 39883 -314538 254075
8999 -303659 -199796 -109038 9102 119599 -126652 -425726 -371936 -317243 -158060 11103 109619
8988 109619 -46142 -302850 -143580 -35136 -15132 -367352 162379 109968 -134842 157846
8977 -89397 62448 29073 -185779 -6445 -120075 -96388 -216144 -271985 -158603 205658 -149869
8965 -247252 -184584 79893 -176564 -75402 47555 -30415 -46850 -44455 121471 880 80791 -140475
8952 26747 123308 108557 -257524 128446 63919 344265 -70201 -149692 121812 -81143 105087
8940 57956 -81563 3869 -327937 15101 -218260 -260365 143979 -260382 65171 105173 283443
8929 283443 -399609 -32216 146940 -79014 -395990 -129906 172328 -43720 135408 -47567
8918 75668 305613 209833 -13011 201120 -210006 163298 393623 323501 403505 720077 1278780
8907 1278780 3078474 5717124 10452128 5233461 3035126 1741442 1114176 574740 156134
8897 467684 266596 662259 353634 122217 305866 478597 170168 -144395 80129 -355912
8886 12680 42303 92730 -283828 -137676 -28024 -10033 190226 -29545 -108365 152879 -23477
8874 -298597 -110698 123466 -31440 -56546 -318957 -20504 -96824 343 218149 -93702 193054
8862 104180 -99635 246773 326481 -126051 -240427 228276 -87582 -479939 45046 -183225
8851 260907 -52316 145680 71280 159339 -4252 166152 -165111 219875 55476 -50993 -212737
8840 -212737 130389 -140147 -84242 -200085 142496 -118792 -101082 -81431 -101248 -11320 -147121
8829 -147121 -137939 -58862 77614 30236 -106816 32413 -23750 -169235 -28735 -279609 153405
8817 82652 -197838 48190 -178412 -79133 -81680 14583 -193797 182814 -125021 -38309 -91153
8806 -91153 154713 23912 -95221 -89866 -229846 -79682 65666 322 -96964 129558 205749 81963
8793 -3680 -135201 -24476 64701 -212015 -128824 -17168 161803 -21282 106790 63336 -166496
8781 151414 78526 35725 -178275 -275547 88190 18091 -275226 -233610 239462 -291658 -28660
8769 -125751 -222337 -56935 -372925 67048 65376 21273 138425 -83703 -128410 -58892 -155507
8758 -155507 -10764 -259858 -93144 -164157 -136115 -339101 119583 -160364 -21886 74774 -54064
8746 -99658 81633 51101 -122400 -66663 -24179 175617 77801 -128257 -356905 -104853 -3483
8734 -271725 70159 -237697 27574 -253680 -161737 6705 -111043 -180844 -571861 -249577 -166025
8723 -166025 -262019 -85728 -247550 197645 -194765 154941 -328687 58630 76020 89884 -159888
8711 204646 38670 -250776 -121956 -243887 -164745 -83091 -142289 -50685 88112 -158709 -447757
8700 -447757 136397 502747 135962 215973 -60523 -158340 74212 -139370 8023 46591 -215670
8688 30758 -241948 178951 199620 67730 206307 -73025 -355515 330882 -154973 -364134
8678 -364134 193273 -81236 -125799 -90993 -165196 -52229 -26261 270949 -127287 449467 91394
8666 22362 5827 -238606 -35834 43689 -32383 43064 -7678 -84830 3117 268288 -352684 -163519
8653 -139294 -262074 -233164 86601 51623 -49266 71812 -278880 -2095 -77951 170483 42138
8641 172440 -88136 -355985 -356163 -99352 -80739 91924 -511489 50914 52975 -63403 -240442 -243235
8629 -243235 -178023 -15551 -223375 -215917 -289960 180206 256856 3770 54828 -161202 -92826
8618 -92826 -112126 -35517 64439 -92777 48248 141709 -113327 229346 -156867 471185 -212262
8606 -17844 -118305 -131041 -115487 -414529 -121135 -228185 74225 -39387 341897 -145959 109792
8594 -180683 -175459 -273294 -137095 -138916 45706 -51590 -119779 -112612 190814 -288681 -205469 129395
8581 114383 21815 -103774 -69650 -6787 34281 79681 -280113 15179 -296408 -220954 177132
8569 -151040 133697 -68701 271438 135379 283214 -137175 64308 138300 82017 62451 -79119
8557 26181 627 11692 -223879 117602 -114991 -196810 292984 -179559 77503 -71682 85456
8545 277287 -499004 254493 -86791 183946 12547 -256664 -7898 -8953 -126123 154709 18921
8533 85315 -154207 -29039 117018 206505 -57515 -203415 -223686 127214 -32682 -1561 -22660
8522 -22660 37452 -72096 -26694 -286820 142621 203976 -168616 -16447 229706 -330840 -351431
8511 -351431 76172 163326 -357870 19185 -499061 -45613 228062 -131168 51607 136645 125768
8500 125768 78284 109352 93351 1992 -221448 35859 -82751 -103441 -82155 -263620 33354
8488 49796 -72330 -265438 52937 -240399 -304504 261015 -213797 81236 -114595 -99433 -30129
8476 -61211 -86358 -206058 -98166 -51715 90514 -141808 9796 287398 109367 -27951 -183140
8465 -183140 -308165 -82158 -116178 -90050 71319 216436 310263 -195571 -326117 -140472 -67860
8453 69767 -321839 95643 -290461 28240 157496 -263252 48913 -263471 -110638 307754
8442 150316 -30719 69437 13659 -122454 69005 -115746 115241 5010 100227 -138439 -278064
8431 -278064 225607 -19569 322719 181982 51403 -77450 -330872 -86503 -145740 109071 -25903
8419 59198 42827 -24848 -50798 -69276 -51256 40291 -222338 -272404 168291 -187670 -225513
8408 -225513 -361784 117160 -56263 26546 26799 -275982 196984 -385012 123303 -108061 -195934
8397 -195934 -299704 -129009 -40079 -47682 -135351 113072 64197 11653 -394107 -251114 -114259
8385 -47287 -4570 -130223 -303280 -90098 -300541 -167210 42385 -73885 -46573 84187 76741
8374 76741 45068 -19995 -314242 -487936 51959 138529 1066 15383 -59652 -211300 -251962
8363 -251962 -86773 -60125 152565 -207321 -330847 -55914 -15374 276735 -39246 -133276 -203177
8352 -203177 -42355 -53932 106504 1138 196784 -277993 102454 -231237 56969 -298376 -211614
8341 -211614 -258544 -30523 201485 146839 -117302 120252 -215175 -114835 135000 17762
8330 -96208 -314232 147973 -100182 156837 -30827 -151611 -5158 -252387 26554 37198 -57521
8318 -408768 -135001 -23889 18287 15757 160587 164205 64471 -220369 177905 129428 21066
8306 -488852 -34430 -68077 -65169 80871 85299 -314431 119612 -235913 16699 143303 164166
8295 164166 -161584 -163527 -200965 21756 -109987 -33090 -343058 -721 -69827 47596 -45564 -176487
8283 -176487 -134223 113441 -91311 -85909 62387 144731 -80943 7214 -346164 -313206 451054
8271 206382 -128882 69140 72812 244767 -163078 -18848 -29152 -144550 11983 -227623 184523
8259 14320 7679 61223 -2052 185198 121093 38067 8731 -248647 -156352 -45072 -152690 112928
8246 229600 123250 -157672 32215 3985 -41816 -130463 243469 95751 -79552 -182633 115645
8234 39946 -29946 227256 -11409 -207912 213180 -62985 55528 -290829 99833 -388977 -231376
8223 -231376 38432 25935 146241 -103563 105034 94006 -310318 172375 92618 271166
8213 271166 -126629 -181762 -241472 976 -101845 -71339 21914 -20157 -448630 44346 15618
8201 -60299 -134959 161315 -64225 -112847 -11480 30584 9472 -77319 -78810 311168 92981 174303
8189 174303 -82389 -295693 117476 -169240 -379758 -198887 -245561 137226 -216328 -239745
8179 -239745 -218688 97431 -94094 -173930 228934 -18674 39653 -197874 -62214 70682 187458
8168 187458 20594 -319655 -194483 23568 -174011 238344 -60200 -117037 66781 111129 -53902
8156 -161258 -573622 9583 16746 -278849 131304 -13261 -84862 -23978 -45106 220109 -203838
8144 -9990 -47818 51255 84297 146115 -147826 -152071 -35242 -144496 96463 119982 -237053 284497
8131 10447 -34235 -62659 -39941 59791 -176041 31721 -348321 -81606 -187279 -105650 -172319
8120 -172319 6101 418994 178599 -104728 -60466 107392 57230 -168405 227771 29692 -417893
8108 -163534 -149195 24671 -92342 42921 -89143 -420355 100303 -35508 -119204 -114056 -56233
8096 -109272 1112 -54939 -20355 219496 -217940 -252117 -120187 -211529 -46955 91389 133514
8085 133514 -37595 -65414 -156094 140394 43135 -231676 -90870 -233656 6823 213176 83484
8073 253882 122421 -68877 233603 -171761 -176258 27200 199296 -405470 155899 -21024 69270
8061 315678 -16751 -204568 -149685 1315 -258067 115199 -13300 12479 126453 239341 150973
8050 150973 -76146 -498112 -54621 -52165 -11228 102876 -167259 -206347 -198505 39642 67455
8039 67455 -95101 -237431 -164369 20426 204344 115743 143975 126697 -203822 -202280 90717
8027 -94649 132634 95571 -102209 97417 125785 -249162 -63405 -23001 -152948 -108186 19693
8015 333582 -165658 -142194 -440115 -46096 83180 -3945 -75920 -179527 179890 -3004 -21947
8004 -21947 -9542 1841 49696 406640 69317 -94244 135893 -104615 140951 -25557 -8051 87480
7991 -79891 46488 46777 5699 -130121 -75713 -120106 100226 -22487 -297363 -261678 -53698 170369
7978 25641 -145516 -350572 -53633 -247045 81711 481837 72351 49713 -24142 194855 -9626
7966 30151 -278959 -329674 -101994 143682 31788 17363 154780 -46056 -154689 -105735 -24476
7954 -45606 126492 144379 -109995 -171701 -79589 -66341 145061 -164462 43256 50556 -206198
7942 -128768 -267804 57895 -374313 -147111 -212173 151738 -78967 -27967 -99109 81532 -16703
7930 -69074 -414806 -161389 -66573 -266905 86209 56540 -160068 -234985 69413 -68808 118915
7918 147983 -93125 -12451 -198838 -58017 -99432 -26012 -117314 -142741 -50487 17777 124388
7907 124388 56831 -6828 77710 -82759 -139081 4606 61858 -145977 -4613 229231 -32694 -41589
7895 -41589 -54832 -198690 -157912 -49836 196918 66685 156443 -14468 -208323 -24191 -213623
7884 -213623 -333367 18725 116072 -211153 -134249 87721 -30003 194279 -20465 -157921 -401141
7873 -401141 -267601 138067 -183861 148609 227059 -341843 94381 90087 -156097 -45996 160245
7861 123183 -14550 77926 45255 -218029 103246 -77863 -53314 -66139 -96153 79527 -206667
7849 -218125 -192883 -91273 143247 19614 -606688 11782 87111 -168926 88904 107051 -209950
7837 -195768 -147957 3719 -158818 -231189 157332 -168158 -149351 -16600 -12459 9589 84899 173659
7825 173659 107122 -131826 -106280 -112858 37346 -22621 -124373 215809 192452 148388 44543
7813 222558 -246146 -60501 3072 -143616 -150990 -80499 160003 30864 -277264 220207 -68338
7801 -167937 143546 2876 -208988 -46274 -185042 116539 -6511 -73433 174922 61864 -10684
7789 -182781 42358 -76998 -103753 52167 -35161 -110690 -216998 -67394 -48432 -62426 148804
7777 -133474 -248889 -185850 -239443 -208477 -238358 -199579 143903 -82095 -153176 139720 26432
7765 -131626 -311234 245516 -301750 37048 118492 344301 229204 -353221 -177344 -2319
7754 -46009 -20421 336460 43923 -71827 -73393 8994 -283177 49561 -384646 -203140 142600
7742 177862 -338989 131650 133826 -134961 -173201 80681 -190085 84151 -199624 -210136 -176752
7731 -176752 150315 -125222 55121 -44648 -216864 -84463 -247000 -23883 -133683 40783 47260
7720 47260 451532 28990 44911 -189228 280156 -249791 -251448 -63956 282063 -131642 176743
7708 77183 -404213 75197 -81458 101490 108369 -18165 209504 -128040 -155254 -163492 -58856
7696 93791 -141047 67489 116986 -221258 29929 -96315 373841 -149929 -167788 -73324 -103419
7685 -103419 -35445 -246976 -99412 -134687 11656 -175044 -36772 -62544 21790 -33025 144048
7673 98934 88849 -273328 -132763 -207937 -53606 543451 -50063 24687 -76378 -31950 -126964
7662 -126964 16997 -20428 -85267 -150301 -11831 -94124 13944 90125 -28422 -113929 221033
7650 26777 148622 -29145 22094 137821 -17042 -239705 -7317 73147 -86365 -257479 -88838
7638 -30449 69108 -118415 -246331 -120730 151860 27874 8125 469262 299650 -164625 80954
7626 -300099 132365 -197064 -176048 156230 65049 -41096 65220 -426967 -306863 127448
7615 -245323 218332 -240861 258969 60093 3176 3559 345519 -368682 71635 101228 -119059
7603 -266706 -468919 -185115 -105819 152897 197510 -233581 47833 -327728 -18847 -98823 -161940
7592 -161940 -208592 33273 -76020 -173925 116150 -95759 -173805 -76047 75631 -218242 167545
7580 -178234 -93759 34021 259 -83677 -96696 188893 108791 261051 64036 145874 -230332
7568 93334 275222 -242765 -84181 -142894 -369008 233887 -246922 -123818 -135729 -82386 -7091
7556 254222 40301 203081 -74359 -95955 75519 -104238 -41533 88452 -183603 -91138 132142
7544 77156 418249 130553 -84746 239080 180621 -221918 -41039 -179641 47315 -118130 -132010
7533 -132010 -53263 4931 -37711 -61160 -12274 127118 -174395 -39465 -188504 -272101 240765
7521 18657 -280381 -142617 43611 -332669 -168237 -196747 73362 -191272 -252808 252239 138365
7510 138365 -266469 -118806 -308204 -101715 -45032 -498606 -9875 -49510 -162717 -105457 215071
7498 -294977 39513 300180 -253416 -100608 53506 -225369 -331763 -49692 -44940 253530 -53056
7486 134975 175446 13798 34944 -182346 -39349 -171420 29605 113071 -67212 -250229 210527
7474 58043 -321391 165899 -190876 272810 12847 -307407 -37217 53926 158796 184092 164516
7463 164516 156731 -69848 12345 -70301 4713 110132 -117059 31258 283774 173064 -205430
7451 -298492 -121420 -194747 207217 -396077 -80781 220792 -194997 113199 -307 18700 -104969
7439 55565 -143578 18436 41594 -103720 305338 195230 148895 -99396 129523 -49991 -149613
7428 -149613 173968 -379346 -55261 315631 -451984 144774 116665 -172796 149375 5529
7417 -207088 -94688 -209957 182126 -91951 19278 -272568 -70884 9444 163619 37275 280902
7406 280902 -5196 385516 -114063 129938 -280140 232835 68782 160641 -103376 -88900 -171640
7395 -171640 34042 -116769 -118040 -122723 -239020 -233273 199970 37044 23018 -212104 -7345 59602
7382 -268580 -318985 77293 146797 278021 -41866 45705 -113800 244271 18594 -117461 -82638
7371 -82638 -401072 -129136 17889 171735 -368610 82558 -206074 16041 116194 58122 113651
7360 113651 208788 -133137 -38801 -311543 256867 143974 -324614 -502350 62085 -142211
7349 -132866 112584 34925 226312 -7910 254633 -38191 -67123 -46440 64267 -186988 106715
7337 -8085 -109993 -6145 -7046 -149898 15526 104286 117477 -128724 -206824 206197 -22040 147712
7324 -80635 284765 -223316 278882 2010 -375913 -221887 187787 -127958 158761 10095
7313 219484 -368141 105087 203544 88625 -85733 -215891 47639 -18588 171115 210335 111722
7302 111722 130290 32319 -407543 -192806 159863 221553 -87836 42107 -264719 175878 -46951
7290 118707 283582 29317 -2551 -295039 -12613 -25749 -46411 221373 -95051 120580 53081
7278 -113058 -156411 -44367 69545 205962 -252662 -174531 -105625 2127 10893 -50694 34006 185202
7266 185202 84116 -172202 -112011 -32541 -134542 234048 -220049 -23369 -323455 11403 -66174
7254 5652 4389 186237 -258938 263939 -182833 -41887 -52776 -374167 -1027 176773 23328
7242 -251726 -15454 -196861 -47204 -134255 -356553 65723 -50676 378013 86032 64574 127158
7231 127158 163255 197689 -238446 149989 -1394 -151264 -89353 61598 -133017 182355 -327561
7219 -184409 -63693 -139182 -143389 -52177 27688 61800 -25164 -9252 -80823 149818 -12667 15880
7206 71282 41474 108494 66630 -142110 -20220 -100569 -66590 -104752 202475 101120 161460
7195 161460 -457452 -24100 -180146 -92941 188826 -174091 -21688 29956 66370 -9483 -195934
7184 -195934 -75140 -222974 -166612 102867 80713 119148 -99547 122422 -81010 -91417 -230252
7173 -230252 -9770 132312 -94869 -110763 -219252 -10480 94755 -56654 -98385 29651 -65887
7161 97659 -111416 -5466 -106208 -26391 -147288 52402 208527 107018 28117 241823 -68704
7149 99994 -87558 18938 -190858 1132 200995 -347200 -396351 -337489 -291899 96108 202648
7138 202648 97464 -179732 -157692 125569 -167114 358980 190934 -123476 -117134 -101975 -136414
7127 -136414 134659 -29725 163486 -340785 107620 27612 30991 62569 -2520 -4613 -119317
7116 -119317 217376 -78590 228602 -366496 -159129 -73914 -229973 303041 -99169 -95351 -205784
7105 -205784 -36570 -193775 137473 -345294 66789 30539 -97333 161649 162205 44185 -15437
7093 167188 316064 33289 -961 -93857 138349 -140843 8373 14303 68843 825 -100747 337258
7080 6512 80063 -88290 -349777 28283 -247966 -231133 -175946 59717 3788 -113105 -23934 -136414
7068 -136414 135995 184093 -7400 -74409 -567116 -123995 260969 16521 -325743 -21292 -185249
7057 -185249 -39721 -151216 -86094 -156026 -6750 174491 36879 61759 222488 -137366 200114
7045 -346531 -92751 75672 21089 -254464 -56932 -1457 31878 333964 -1808 109135 75750
7034 75750 397424 208932 172938 -286370 -232979 200997 -61705 66218 -216296 278082 -47268
7022 -15817 173218 30075 -174792 82086 -106640 -67021 -69297 -49626 -175329 82387 -148295
7010 224065 -148723 82880 213959 -217434 200909 -224479 86983 -4596 8197 73227 73064
6999 73064 -148807 41403 131786 -378965 202929 -28275 -155467 -29488 20132 122665 230868
6988 230868 229140 20281 296378 -227181 29834 27307 -92401 123597 -48759 -36141 107979
6976 355061 93992 333467 -50193 73206 -50276 77609 -115349 -90652 76466 -120031 -57922
6964 -174069 49739 -113322 -88538 145292 -1490 81715 -150106 -81151 155911 -121257 -100300
6953 -100300 165394 -38628 -323065 111364 280075 204079 159241 -249111 -284194 -9379 -145354
6942 -145354 -123577 95592 -184172 -3412 243154 198863 -79476 -53282 114847 -16846 -184097
6931 -184097 42720 -150514 62659 -126475 -75013 116785 26653 98737 -76491 -20955 -354166
6920 -354166 -24494 -108031 -133593 -154475 8244 -127302 60516 -160534 -281987 185467 91140
6908 -117050 -268359 -16881 260131 -45573 -114337 -391465 -29134 15312 -277764 28229 -232727
6896 -5571 -84115 -48381 197838 -195094 -84817 -13032 451836 -314485 -70047 -129127 76021
6884 -198406 -367956 -238530 -55369 335790 -100679 -205098 49675 167968 -95292 18238
6873 -25076 23628 21283 57509 -202142 -38633 -224820 176023 -86142 -203422 -37065 340309
6861 -32918 140289 -57085 -89295 171205 59126 -112428 105395 -169047 -245924 -112441 79297
6849 -173884 -68477 -140605 -204604 109204 -222324 110692 165074 -124638 132204 -146004
6838 71698 18490 13433 -268136 159915 -80454 -132153 -32968 -184850 111806 -130443 -180858
6827 -180858 -17764 -24755 15748 -189555 -106969 -311891 70706 -81984 -4420 203200 -297275
6815 -165072 167960 -103084 -54870 63672 -133061 187342 -136209 -19689 -9114 71176 -105573
6803 172503 -219623 -4319 -123560 -252069 37053 261957 -103102 60679 -95089 -136017 -89115
6792 -89115 -162912 -131856 -5001 -24253 33511 -246688 -302959 -27677 -38432 134545 21211 -31491
6779 -99541 226332 -321431 56036 -149375 12685 -100443 63768 -20326 278008 -45644 -214718
6768 -214718 126963 59712 -151510 46996 35751 120954 -109809 -330006 180539 175051 -42485
6756 44018 25187 63143 -117449 -253224 -7396 140366 -429529 85749 369984 129642 -65666
6744 -47094 -144889 132802 241634 -506836 56710 -80717 319262 -59674 74731 -123941 -122986
6733 -122986 -84267 300333 -125124 80179 234211 -83223 -100927 40411 19202 -251150 -209622
6722 -209622 -196166 -149795 152067 63113 118242 -84994 -119337 -110795 41732 -161575 105848
6710 -66021 -214286 66505 135090 217111 -399412 275483 -30953 -38267 -206991 103906 -473283
6698 -151410 60 -129545 91809 -370916 290271 -23416 -67734 100741 -151361 125663 -114868
6686 -177634 -89562 270084 -173618 -138047 -59177 -207655 115489 -94943 144063 -192301
6675 -35192 -228461 -76526 -198046 -13573 327587 -344010 20817 366185 202855 -120851
6664 40985 -177531 -249104 -25800 18067 -32065 -148192 202250 -47923 375543 -43500 72105
6652 162556 421972 -44754 -163115 155883 -325263 -94804 -196413 -69738 -107300 -59518 262246
6640 225167 308468 46707 321858 -209449 268816 -113867 151222 -157378 -148804 -259226
6630 -259226 81291 -94907 44034 274957 -327008 -222829 68075 89568 -140966 186243 -171019
6618 95571 -134116 224547 -141579 -214715 -115540 -17936 -143556 -83023 -204442 -46211 -197189
6607 -197189 398243 -224395 -144015 122109 -1699 -378372 124600 -219704 -162571 248145
6596 62608 83786 -13562 -105242 34293 -127717 315168 -7568 -58823 -636 11747 24747 82537
6584 82537 375079 198186 -2310 -298512 122237 75305 64275 180041 102091 11057 -84338
6572 -87525 12311 125446 -99424 87997 -62653 -117990 -100973 -295678 -132695 285861 8424
6560 -143795 -24674 -30545 25532 10792 -34300 169753 -160630 -279142 319936 -359820 -12278
6548 -154697 -255988 439324 248017 92980 56433 -125211 113297 134909 -21008 -1486 -951
6537 -951 -264161 -119841 -118065 -1856 88625 36208 -111636 204137 -243291 -30419 -211208
6526 -211208 53790 -78019 11795 357521 -212820 42292 -273612 144393 18028 294408 -140755
6514 -125267 130247 114371 -147004 -27886 90009 -87315 -114518 -55330 63655 280125 -44892
6502 -283652 48273 -106748 275011 -24023 -13020 217464 164757 -43373 392915 88556 -208840
6490 23344 -62731 126329 162180 14510 -151724 10840 102187 -214729 47748 -148908 191065
6478 8917 59164 -259307 -83277 -343110 -20136 102666 127124 112746 122818 243527 -236801
6466 -151387 326855 -238782 -48083 -25948 331202 136791 154233 -136389 144844 176677
6456 176677 -60911 87256 89877 -378519 -107390 139285 21334 -368092 104951 -26827 216722
6444 20007 -103255 154424 -60674 32659 -50412 -266922 -50167 113281 -106058 409968 -133621
6432 -64854 233777 319883 -130730 102151 -67614 -379668 -24152 41373 -94069 224373 88353
6420 -167044 -60169 -200372 -45681 49940 144425 -49604 -212187 266331 -160480 180639 -84260
6408 172499 44134 120672 -122409 36410 47586 183388 -119601 -56728 -75400 172675 -152102
6396 -374369 -265497 66703 -94921 33345 29555 260764 -59640 -64581 -217201 81137 -6108 -154140
6384 -154140 57957 -242054 77494 -8268 -10754 19920 -171492 -90955 -146075 273878 -92845
6372 -15230 208222 -101745 430004 -110045 -61700 7404 -297980 240482 134463 279367
6362 279367 287035 8086 28213 266779 353054 -45606 63054 -76912 131314 29965 183177
6351 183177 64874 -254862 13927 -237975 -44736 260320 -193135 343207 -41288 -43597 71291
6339 41171 198187 -63514 -151539 237811 -368769 -88633 -202733 111016 244139 -92363 284118
6327 -11103 -15343 303451 73729 110637 91982 64046 24791 1910 -54062 5748 -10679 95393
6314 43370 -153282 -16478 -2065 93233 -39001 73741 104391 -80781 -181689 -71985 -151709 -534218
6302 -534218 -32301 -16484 -119127 201382 43001 52442 -6220 192586 26940 203708 42861
6290 92688 -34550 -177360 -42017 131990 32666 134686 69298 210255 -76048 192004 -155941
6278 154918 -173195 -24047 -185808 -17608 -110485 -46590 -200331 -5211 -319644 172093 -31014
6266 -412341 -72174 4367 -151234 6804 46439 111384 -31782 62161 254651 -209232 -106644
6255 -106644 223031 -200830 -206375 -52129 36866 -346719 239377 -110236 -69567 -243923 -200531
6244 -200531 -303126 -166831 -367836 300446 -69319 113250 -10862 -271239 183144 -96209
6233 62599 12876 -112554 -114659 -6017 -77485 -64880 98720 -143423 -98853 -35901 40487 280543
6221 280543 -60125 44971 142492 -4965 -15245 -57729 -26814 -27857 271650 -115227 -66778 -261900
6209 -261900 268217 72404 184883 -218816 164113 -15639 -130974 -199350 -97194 -78006 -73727
6198 -73727 416093 14624 103087 -114131 211409 141948 201149 -203492 -238351 -152225 -37371
6186 169869 -15968 -142677 34846 -57536 212159 -31699 -151749 70498 83316 -102376 263855
6174 -75583 154786 -48594 94266 -83992 -449818 -255600 34926 6799 -117960 -347653 185102
6162 -90411 224826 103027 77778 25658 109619 146195 107336 -411970 -71331 52344 -6191
6150 65988 60064 -116125 164651 -129858 -18264 279755 216481 276258 -193876 34381 -67018
6138 252505 -217908 -155218 -149335 88228 66907 -176347 248244 254905 17213 -208621 195217
6126 -25429 -131837 171930 171607 177875 -21199 3735 -110230 164658 27232 48798 -22097 -193928
6114 -193928 31238 -131945 48288 -150026 217580 -58177 -336749 -198273 -241764 9038 -49640
6102 -188963 124787 -18912 -150214 -1438 -275736 -220530 -67704 -47982 -84843 -56778 100919
6090 126253 135663 132313 216063 -50195 171992 218834 -149860 -15064 -142804 142499 55377
6078 -123635 94513 -266291 34974 93792 -233691 -201304 360936 -185578 -81814 18382 257652
6067 257652 335260 -164197 55849 141526 50414 194984 -217188 7012 364415 -63912 -85983
6056 -85983 237317 -121723 -70623 -34793 -21185 51935 -41609 -123847 -58482 -1044 99543 -53033
6043 -15804 -34868 -249329 -271682 183537 124912 63305 78355 -104473 -413202 109291 58495
6032 58495 -420628 160041 61404 -239936 105718 3507 7192 -66797 -232550 32998 -152442
6020 201316 176626 82288 -112437 96712 -106944 -161433 -12812 181722 25738 329556 -85675
6008 -498551 145100 -186103 115048 657 -228881 248243 -46262 394012 -185883 236447
5997 -210657 300898 -108448 205070 108715 359142 -354275 66515 -10312 -163658 52284
5986 184334 -105403 -245917 -274053 -51740 -289909 168491 -202047 8931 249895 -548366
5975 64840 -178219 99989 -304084 206652 1565 78484 66096 252940 -139671 -36564 -95302
5964 -95302 22818 195564 196250 -192908 -18279 45352 165126 -240625 -234598 -47225 8651 72474
5952 72474 -148252 28744 -23312 -192110 -10427 10382 190100 70150 -165502 -215501 75300
5940 38112 11813 99626 129192 -108904 18932 -305152 -116446 -28056 87374 -263719 -22504
5928 -158491 89135 80174 -26818 -76755 26970 158527 -72225 246828 -327222 239737 270978
5917 270978 29217 -208447 -87653 -34848 -130921 55020 -122999 -19484 138475 111651 -1504
5905 150380 52320 -121098 257843 -353087 150064 -210948 -177217 -25072 -155695 28677
5894 -47671 66397 -81644 -229055 255706 -146656 190737 -118962 37256 84793 145082 204193
5883 204193 -141907 54561 160848 70727 63901 132365 -81145 -51519 -162186 160413 112798
5872 112798 -64658 96600 229584 162900 -29674 -22451 102538 -360103 -2845 -74467 39226
5860 168300 -13465 -222289 147268 133066 -30702 186195 -181650 145986 -16380 -46338 60238
5848 103024 -116995 -185005 -117650 142279 -57815 105729 -9206 135170 -195688 -63637 210091
5836 -107657 -181284 -28239 204203 77668 -16774 276754 -172607 76413 -441578 -119606 1672
5824 268986 53781 -1380 -231182 -133680 72520 -131955 -55725 121523 147772 334712 81347
5812 -61748 -272573 -258706 -181991 -191178 -122964 91390 380088 -245218 214123 -149501 -144093
5801 -144093 -23326 98285 73517 147318 -243307 155837 -43497 -47969 19273 -196673 91142
5789 -243325 12742 66629 61157 300037 -50812 -47551 -5021 115294 -84184 -297157 -48774 104038
5776 126101 156375 -123700 -69688 -114547 -98139 131292 258486 -91089 102720 -52454 173018
5764 -89951 -160191 103260 36854 -30384 -58272 117287 28319 -222273 -101818 -311264 -175015
5753 -175015 -101811 -92636 19199 494619 84352 -171168 169667 -227566 202327 -27263 -141186
5742 -141186 -14234 34253 101816 26000 -257523 245966 36451 216897 62372 -5199 -25604
5731 -25604 86033 84151 -318462 46206 85775 -119131 427469 -102132 -63791 -266743 -248419
5720 -248419 -163289 46399 485414 -203397 43268 -354226 31437 -414978 -17300 231064 -70263
5708 -194315 -80684 201330 -158444 -144286 -73706 -100631 215117 291312 -90707 523104 74696
5696 -110924 243819 181602 62032 -6349 -168892 -80326 69020 220433 26156 -38760 -134462
5685 -134462 133270 -223948 117894 110984 -191754 -168838 -97000 -182085 126224 68013 104267
5674 104267 190634 -3387 12438 -228905 -227150 -113100 -45187 -3745 203963 105284 95670 111160
5662 111160 34028 -222537 -204494 -385314 248629 -172392 139647 109132 -274358 -457190
5652 -457190 360696 172841 -236843 163038 -177877 -29524 -48592 -186021 -181387 -37261 253834
5640 221444 78005 -118763 -28282 -56540 330909 -402738 -101561 -125454 -415668 -218257
5630 -218257 -70951 -72921 340992 -33925 146330 129354 -16753 185453 22000 -296524 -110949
5618 -235872 215189 -189360 -191246 214076 -87856 118457 66274 165427 114725 19969 297808
5607 297808 -83087 -90453 -29216 -154402 28743 -150105 184906 228291 83207 -57662 -330987
5596 -330987 95886 -367456 -154011 -228959 201790 -350934 -219557 211335 -216253 306821
5585 -50480 -63151 285706 40648 196290 -307753 -94507 30608 -138590 -234987 146285 -64425
5573 -60471 -11873 -352067 -106054 -20542 118443 148792 209178 -18761 -157291 228800 7457
5561 -154453 -109838 -44673 221636 74749 92176 150916 95419 -138493 -107379 -125580 21875
5549 33327 -95835 46045 62905 -16409 113191 -42733 321843 19149 118106 141288 -212372
5537 -94239 29900 392440 -265513 180121 62662 -192669 -359771 4921 4687 -153047 -201818
5526 -201818 -49822 15716 353836 107955 -56244 -299826 -67517 220664 53631 -341921 -248983
5515 -248983 -68347 -78088 -50381 255249 -145991 -150370 119234 206021 108910 126009 -176035
5503 130293 110712 -74511 -90842 62514 -185809 233298 -128435 -472214 -188989 375274
5492 50125 -61216 -201879 190165 73623 -94928 104008 -189900 153902 22709 -114736 145771
5480 48401 207711 -179831 -83782 -152459 76029 -412174 288293 -125198 99297 -205816 147500
5468 457104 152 -151955 -8188 -51980 53023 529873 37635 -249504 118021 -52365 -891 18407
5455 346802 -37452 -69773 -137783 -32410 316633 -60123 -154329 -64461 -227253 243402 20844
5443 -195313 -260224 -343407 -350700 -88949 288146 -181071 70544 83901 -321493 -5949 -261506
5432 -261506 -112125 -250486 24748 -192382 11926 282480 58334 -6654 30495 -212802 62969
5420 48396 432395 112849 -126765 59497 263660 21978 76521 -220972 -168364 -161711 -67182
5408 -92407 -255187 -245575 -227095 -173482 -124457 -80112 -45196 -79442 122087 -105546 191168
5396 -8879 283545 318460 -13991 145687 179077 189728 -653 216246 -154080 -2172 -30044 -213751
5384 -213751 37962 -156248 71292 -285394 56836 25388 89524 -4817 64522 -294347 -117634
5372 -91452 -189408 17785 218146 217930 194836 -222310 75275 76808 73980 -284861 48672 -147948
5359 -114325 30085 198484 131500 322471 32115 -68261 -75770 46727 130366 61216 -270052
5347 -128931 -136022 1607 196027 78887 209033 -101972 248115 -6645 -115073 53366 3977
5335 141747 -101510 152148 -320986 108970 5459 179305 -83802 -75792 121025 -725 67462
5323 146564 -4143 46312 -205463 142696 -19192 148019 -121405 -176523 229406 -50865 -144189
5312 -144189 235092 127395 -67399 1843 134757 -57914 -375553 -191698 371566 146180
5301 -203665 -8352 51540 -23913 -9263 168993 113488 287153 95083 93721 -223610 -200055 27334
5288 -56241 47857 100927 -135425 195548 9420 -387262 180228 -38713 -5544 -145339 -31785
5276 -107989 -56433 50597 126300 126261 186993 -18853 319335 -261323 203872 -213257 201031
5264 -138164 -240040 -111082 -418364 -27123 46656 -61339 -84243 -282727 77350 84702 61319
5253 61319 183199 -146852 -50079 -55020 -81280 -1664 -4880 263649 -122333 190768 52976
5241 -43648 -103118 -42062 -145872 -296917 58393 112206 -203847 -8194 -13313 377721 115419
5229 -14651 255552 127022 -43553 354259 329491 28467 30251 -325582 151891 23184 -162890
5217 -230334 57950 178277 -53001 -122813 37959 150592 -158935 6821 -186647 -101172 84311
5205 -29765 22897 103206 -476417 -112411 -108024 -271009 -120015 125128 -13109 140560 -121712
5193 243267 -69536 -272482 -223023 41658 22177 -72490 22950 138769 528525 -206811 201809
5181 -79438 121493 -10898 170303 -4782 79035 263662 91257 387682 -182845 120419 -297543
5169 12445 -46832 30398 13345 126012 468925 -429207 -6502 93012 283290 108906 167761
5158 167761 -61796 -166789 -57043 302347 340952 194445 -150991 14377 92025 165383 66615
5146 -65743 7136 185067 306708 63979 -63941 -436766 -51462 148701 169794 91905 269720
5135 269720 24710 -104528 -94278 -113193 75965 -139504 142187 -34455 49464 -226022 -46447
5123 57218 142880 128700 93242 -315927 165692 -89711 -233645 -124143 186632 -365096 -89911
5111 200547 72819 53175 -109217 13362 130940 -170993 -131293 13730 -24447 120650 222070
5100 222070 303006 -129860 84796 -203143 42790 2252 -139890 -41707 -50879 251486 -201531
5088 -83234 196438 48887 -238962 -55759 -39726 -78015 234446 164320 157924 -72488 -149950
5077 -149950 -297543 60235 97926 -137359 288582 64610 115509 -175124 177837 -94138 -16496
5065 101804 260020 -11801 81608 -111195 -109882 149005 54916 -33447 151377 -218859 35249
5053 72890 193146 89868 -93103 -157054 336288 299747 -29603 45129 -88762 38921 -94970
5041 -56247 220504 149091 -128222 -111534 58040 -99130 -463631 -259736 -155930 -227743 -12446
5029 153288 214677 -418125 24146 168697 -258902 -286534 -27192 58043 -404159 228827 113991
5017 -15290 -122134 344830 131581 -183833 30802 -39305 26747 207466 -386629 362799
5006 -66122 99389 -40160 85374 -190728 253562 -146090 162280 86542 373349 -99594 -304339
4995 -304339 43022 307930 63001 -350693 -62824 -254156 41138 160443 238216 161287 94779
4984 94779 129803 -10947 97723 45594 -274632 97434 -279859 4752 60335 -71569 -152840 143929
4971 452968 -55285 -36257 55007 115413 -87517 118061 4347 -433035 22220 80175 74832 -72621
4958 -52897 -148035 -111442 352149 -133376 -130922 88457 -261423 201185 105880 -163845 201331
4946 -81161 180692 116808 336892 456701 -88893 -173927 -136226 29691 -168487 -152012 78924
4934 80175 -75095 154773 345593 -214890 193918 216093 161160 54001 214511 -93080 -72415
4923 -72415 -408466 -261149 330296 32242 -160441 103023 5798 14764 121904 -168643 197165
4911 -206604 -41690 -89245 -24946 -80268 206406 -25149 -19219 158504 372429 -270110 -1127
4899 47752 162179 57541 136795 89751 94316 -12657 -193511 -5868 -24354 6130 -106880 -86826
4887 -86826 242625 -167090 -73433 -63192 -64004 -27171 7036 164481 -29719 226082 -106012
4875 -134659 51050 206249 -160866 107595 -231597 -65117 -28199 131114 270450 193427
4865 193427 -243684 -211391 -43889 62760 182388 218746 2214 106555 -121420 265809 -12480
4853 -173904 163120 -7835 56493 79917 35394 185467 -126766 56795 53144 -60699 -6049 203526
4840 -20411 112433 -221111 -1981 231765 262162 -2173 40853 199726 -259824 314814 84675
4828 -86251 270280 -74697 -15782 -101733 110170 191174 -138373 -128101 155368 82755 -48536
4816 -9447 -27477 237364 16361 -250258 179182 170869 -19883 -62602 35561 264808 134398
4805 134398 49451 -113211 74779 311449 -85623 61690 -169840 227477 -111290 30787 -11390
4793 -11084 -48082 -419451 -289334 159234 -31952 -333838 71070 37985 -44617 261867 -314420
4781 153195 -158549 27230 -152155 179004 -13647 182706 -159769 -414663 52989 -47536
4770 30071 58819 79177 39062 222579 254329 263258 230787 -212812 -24779 -329421 258217
4758 332116 184791 -263524 -52613 -206172 163452 -326408 -255746 -33778 98572 178214 -119423
4746 -247378 -149813 182629 99267 71213 22276 -88928 192684 -120370 83736 142562 450118
4735 450118 -16796 54055 334747 -96961 -90301 -139467 -516148 -81475 -255019 -217300 -122412
4724 -122412 -32238 -150443 173988 -244059 -200527 -90 109221 12639 -77791 70691 -190350
4712 -198716 90749 -294470 56657 276094 79813 -21539 -132018 173787 353801 106783
4701 136925 411588 -260928 -314886 -27960 212515 49681 -126419 160839 119506 -192274
4690 86852 45293 253687 87953 393535 -75654 228550 162509 60399 -112081 -392420 214200
4678 -54241 208694 228870 252962 87763 -166382 192558 -104289 93839 4630 105859 -49413
4666 152597 -18267 -82826 7359 172977 -98989 -90938 348575 263813 -197510 -131015 152889
4654 -59948 -176375 -39063 -27554 -181799 218648 125348 -66198 -154642 37664 85500 210506
4643 210506 -203955 -77694 -87509 267774 -240356 -291781 44342 -171003 65 200728 -45148
4631 -123941 109946 -151744 201701 38776 -8799 323750 -23291 160413 29273 -107369 59722
4619 39705 36895 -149193 239157 -75833 1494 49066 -91062 -111796 -333989 220253 -115638
4607 66862 -21212 -98134 98378 257732 67899 -20430 -131061 -169451 -4907 93916 -4519 193244
4594 -192364 232670 226736 293962 234125 267011 307822 137343 53058 12881 -77674 -33597
4582 26872 434986 178392 -305553 -112958 56483 -32355 14410 -232545 -108639 -117048 231339
4570 -121599 -130048 -12010 347872 -63265 -14652 30939 406977 -100417 330950 11949 41158
4559 41158 177583 -58307 91960 -119976 -200362 63627 148950 -159837 45500 221847 -178412
4547 322422 -287421 167407 -20977 -172803 -354699 -140208 106792 -208224 256331 174994
4537 174994 -166299 67435 102953 111903 -52804 -131629 -48790 21839 21577 443 -290713 308702
4524 199142 87518 273534 21322 -97162 -215591 88631 -70437 -16931 -102893 69661 -184827
4512 -182586 -191842 277834 121806 -32998 -256757 -91240 -209826 -55256 -52202 2190 149874
4501 149874 -294779 126557 -280614 148291 89385 -181442 18259 -54655 -28740 474183
4490 66896 -237187 169402 195173 54096 -147580 212693 94038 169846 -40168 -119516 355175
4478 35653 176730 -64293 -294938 152595 240432 -109077 -27284 -238686 245777 -242235
4467 248133 -123802 -79431 320176 -205284 102114 157166 -3791 -16913 164973 43328 64918
4456 64918 20783 355121 32418 -141767 -10079 59025 139316 -132270 -195628 -127565 -10830
$$ [...]
##END NTUPLES=NMR SPECTRUM
##END=
