
##TITLE=AC1004_Arabiga_6278662_KrDU9wGVXB
##JCAMPDX= 6.0         $$ Bruker NMR JCAMP-DX V2.0
##DATA TYPE= NMR SPECTRUM
##DATA CLASS= NTUPLES
##ORIGIN= BRUKER
##OWNER= Administrator
$$ 1.72 TOPSPIN		Version 2.1
$$ 2012-06-03 12:35:23.093 -0500  Administrator@TOPSPIN
$$ Compression mode = diff/dup
##.OBSERVE FREQUENCY= 400.13188235
##.OBSERVE NUCLEUS= ^1H
##.ACQUISITION MODE= SIMULTANEOUS (DQD)
##.ACQUISITION SCHEME= undefined
##.AVERAGES= 64
##.DIGITISER RES= 22
##SPECTROMETER/DATA SYSTEM= spect
##.PULSE SEQUENCE= noesygpps1d.comp
##.SOLVENT NAME= COFFEE_meoh
##.SHIFT REFERENCE= INTERNAL, COFFEE_meoh, 1, 14.96703
##AUDIT TRAIL= $$ (NUMBER, WHEN, WHO, WHERE, PROCESS, VERSION, WHAT)
$$ ##TITLE= Audit trail, TOPSPIN		Version 2.1
$$ ##JCAMPDX= 5.01
$$ ##ORIGIN= Bruker BioSpin GmbH
$$ ##OWNER= Administrator
$$ $$ C:\Bruker\TOPSPIN/data/COFFEE/nmr/AC1004_Arabiga_6278662_KrDU9wGVXB/12/pdata/1/auditp.txt
$$ ##AUDIT TRAIL=  $$ (NUMBER, WHEN, WHO, WHERE, PROCESS, VERSION, WHAT)
(   1,<2012-06-03 12:35:17.968 -0500>,<Administrator>,<TOPSPIN>,<go>,<TOPSPIN 2.1>,
      <created by zg
	started at 2012-06-03 12:23:47.687 -0500,
	POWCHK enabled, PULCHK disabled,
       configuration hash MD5:
       D5 CA 7A 23 FE 6B EE E2 50 67 74 61 24 F7 5E 3B
       data hash MD5: 64K
       9D C3 72 AC 78 DB 94 37 C2 30 2D FB 8B D0 AB 00>)
(   2,<2012-06-03 12:35:20.859 -0500>,<Administrator>,<TOPSPIN>,<proc1d>,<TOPSPIN 2.1>,
      <Start of raw data processing
       efp LB = 0.3 FT_mod = 6 PKNL = 1 PHC0 = 0 PHC1 = 0 SI = 128K 
       data hash MD5: 128K
       CA D2 84 95 F6 03 81 C0 46 B3 67 39 FB 49 1B 49>)
(   3,<2012-06-03 12:35:22.062 -0500>,<Administrator>,<TOPSPIN>,<proc1d>,<TOPSPIN 2.1>,
      <pk PHC0 = 32.15149 PHC1 = 0 
       data hash MD5: 128K
       29 53 2C 40 2F D7 8C 25 A6 88 A3 B0 2D 8B 5C DB>)
(   4,<2012-06-03 12:35:22.750 -0500>,<Administrator>,<TOPSPIN>,<proc1d>,<TOPSPIN 2.1>,
      <abs ABSG = 1 
       data hash MD5: 128K
       B7 AA 93 F4 AF A9 99 22 F6 14 F8 5A 85 69 82 8A>)
(   5,<2012-06-03 12:35:22.828 -0500>,<Administrator>,<TOPSPIN>,<proc1d>,<TOPSPIN 2.1>,
      <abs ABSG = 2 
       data hash MD5: 128K
       B2 AB 4D D1 8D 23 2E D1 10 E2 0B EB AC FC 02 5F>)
(   6,<2012-06-03 12:35:22.890 -0500>,<Administrator>,<TOPSPIN>,<proc1d>,<TOPSPIN 2.1>,
      <abs ABSG = 3 
       data hash MD5: 128K
       AA 79 C4 16 BD CA 11 EE A5 5D AC E8 78 18 4D A0>)
(   7,<2012-06-03 12:35:22.937 -0500>,<Administrator>,<TOPSPIN>,<proc1d>,<TOPSPIN 2.1>,
      <abs ABSG = 4 
       data hash MD5: 128K
       65 12 C9 A1 E1 B2 12 48 A9 0D 83 D0 DF 47 68 27>)
(   8,<2012-06-03 12:35:23.000 -0500>,<Administrator>,<TOPSPIN>,<proc1d>,<TOPSPIN 2.1>,
      <abs ABSG = 5 
       data hash MD5: 128K
       10 F7 84 A3 E0 E1 3C BF B2 B8 B3 53 9F 47 DE 39>)
$$ ##END=
$$ 
$$ $$ hash MD5
$$ $$ 22 BC E1 E0 A7 07 8A 47 C3 92 E6 90 F3 1F 88 A1
##$RELAX= 
##$RELAX= 
##$RELAX= 
##$RELAX= 
##$RELAX= 
##$RELAX= 
##$RELAX= 
##$RELAX= 
$$ Bruker specific parameters
$$ [...]
##$TP07= 0
##$TPNAME0= <>
##$TPNAME1= <>
##$TPNAME2= <>
##$TPNAME3= <>
##$TPNAME4= <>
##$TPNAME5= <>
##$TPNAME6= <>
##$TPNAME7= <>
##$TPOAL= (0..7)
0.5 0.5 0.5 0.5 0.5 0.5 0.5 0.5
##$TPOFFS= (0..7)
0 0 0 0 0 0 0 0
##$TUNHIN= 0
##$TUNHOUT= 0
##$TUNXOUT= 0
##$USERA1= <user>
##$USERA2= <user>
##$USERA3= <user>
##$USERA4= <user>
##$USERA5= <user>
##$V9= 5
##$VALIST= <valist>
##$VCLIST= <CCCCCCCCCCCCCCC>
##$VD= 0
##$VDLIST= <DDDDDDDDDDDDDDD>
##$VPLIST= <PPPPPPPPPPPPPPP>
##$VTLIST= <TTTTTTTTTTTTTTT>
##$WBST= 2048
##$WBSW= 25
##$XGAIN= (0..3)
0 0 0 0
##$XL= 0
##$YL= 0
##$YMAX_a= 9875615
##$YMIN_a= -6246300
##$ZGOPTNS= <>
##$ZL1= 120
##$ZL2= 120
##$ZL3= 120
##$ZL4= 120
##$ABSF1= 14.96703
##$ABSF2= -5.585501
##$ABSG= 5
##$ABSL= 3
##$ALPHA= 0
##$AQORDER= 0
##$ASSFAC= 0
##$ASSFACI= 0
##$ASSFACX= 0
##$ASSWID= 0
##$AUNMP= <proc_prof1d_extract.lims>
##$AXLEFT= 0
##$AXNAME= <>
##$AXNUC= <1H>
##$AXRIGHT= 0
##$AXTYPE= 0
##$AXUNIT= <>
##$AZFE= 0.1
##$AZFW= 0.1
##$BCFW= 0
##$BC_mod= 0
##$BYTORDP= 0
##$COROFFS= 0
##$CY= 15
##$DATMOD= 1
##$DC= 0
##$DFILT= <>
##$DTYPP= 0
##$F1P= 0
##$F2P= 0
##$FCOR= 0.5
##$FTSIZE= 131072
##$FT_mod= 6
##$GAMMA= 0
##$GB= 0
##$INTBC= 1
##$INTSCL= 1
##$ISEN= 128
##$LB= 0.3
##$LEV0= 0
##$LPBIN= 0
##$MAXI= 10000
##$MC2= 0
##$MEAN= 0
##$ME_mod= 0
##$MI= 0
##$NCOEF= 0
##$NC_proc= -3
##$NLEV= 6
##$NOISF1= 0
##$NOISF2= 0
##$NSP= 0
##$NTH_PI= 0
##$NZP= 0
##$OFFSET= 14.96703
##$PC= 1
##$PHC0= 32.15149
##$PHC1= 0
##$PH_mod= 1
##$PKNL= yes
##$PPARMOD= 0
##$PPDIAG= 0
##$PPIPTYP= 0
##$PPMPNUM= 2147483647
##$PPRESOL= 1
##$PSCAL= 4
##$PSIGN= 0
##$PYNMP= <proc.py>
##$REVERSE= no
##$SF= 400.130005433652
##$SI= 131072
##$SIGF1= 0
##$SIGF2= 0
##$SINO= 400
##$SIOLD= 131072
##$SPECTYP= <>
##$SREGLST= <1H.CDCl3>
##$SSB= 0
##$STSI= 131072
##$STSR= 0
##$SW_p= 8223.68421052632
##$SYMM= 0
##$S_DEV= 0
##$TDeff= 65536
##$TDoff= 0
##$TI= <>
##$TILT= no
##$TM1= 0
##$TM2= 0
##$TOPLEV= 0
##$USERP1= <user>
##$USERP2= <user>
##$USERP3= <user>
##$USERP4= <user>
##$USERP5= <user>
##$WDW= 1
##$XDIM= 131072
##$YMAX_p= 463392822
##$YMIN_p= -408103113
##$CURPLOT= <Network HP LaserJet P1505>
##$CURPRIN= <$Network HP LaserJet P1505>
##$DFORMAT= <normdp>
##$LAYOUT= <+/1D_H.xwp>
##$LFORMAT= <normlp>
##$PFORMAT= <normpl>
##$SURQMSG= 1
$$ End of Bruker specific parameters
$$ ---------------------------------
##NTUPLES= NMR SPECTRUM
##VAR_NAME=  FREQUENCY,     SPECTRUM/REAL,   SPECTRUM/IMAG
##SYMBOL=    X,             R,               I
##VAR_TYPE=  INDEPENDENT,   DEPENDENT,       DEPENDENT
##VAR_FORM=  AFFN,          ASDF,            ASDF
##VAR_DIM=   131072,        131072,          131072
##UNITS=     HZ,            ARBITRARY UNITS, ARBITRARY UNITS
##FACTOR=    0.0627417313425165, 1,          1
##FIRST=     8223.62146879498, 3103,         -106033
##LAST=      0,             7142,            -106037
##MIN=       0,             -408103113,      0
##MAX=       8223.62146879498, 463392822,    0
$$ Real data points
##PAGE= N=1
##DATA TABLE= (X++(R..R)), XYDATA
$$ [...]
64732 323832 317884 311958 307382 304591 302863 301443 300485 300512 301363 302346 303383 305239 308363 312186 316054
64717 316054 320308 325664 331744 337038 340492 342608 344829 348221 352961 358575 364299 369413 373663 377369
64703 377369 380945 384400 387502 390241 392797 395094 396733 397439 397263 396267 394349 391659 388850 386431 383964
64688 383964 380390 375309 369483 363792 357977 350875 341879 331808 322205 314054 307414 302143 298524 296895
64674 296895 296813 296996 296309 294661 292801 291449 290885 291167 292238 293710 295020 296111 297588 299850 302320 303998
64658 303998 304721 305368 306681 308313 309323 309287 308556 307486 305900 303465 300308 296939 293693 290634 288043
64643 288043 286636 286965 288696 290675 291709 291280 289738 288104 287525 288501 290438 292072 292416 291457 290195 290142
64627 290142 292404 296876 302477 308446 315064 322753 331033 339203 347619 357157 367357 376410 383441 389691
64613 389691 396686 404111 410337 414226 415418 413559 408667 402129 396139 391858 388891 386505 384460 382508
64599 382508 380076 376912 373443 370183 367334 365233 364546 365587 367845 370607 373712 377490 382367 388855
64585 388855 397455 408056 419604 430842 441448 452237 464292 477914 492285 506081 518487 529616
64573 529616 539743 548348 554338 557120 556960 554247 549092 541982 534176 526889 520310 513797 506666 498365
64559 498365 488313 476389 463561 451311 440187 429375 417997 406397 395729 386475 377852 368789
64547 368789 359091 349490 340849 333608 327804 323181 319282 315855 313269 312064 311882 311254 308894 304940 300605
64532 300605 296953 294493 293566 294373 296538 299207 301768 304178 306698 309682 313465 317987 322624 326830 330660
64517 330660 334046 336016 335720 334017 332691 331872 329712 325221 319987 315972 312765 308529 302903 297390 293120
64502 293120 289914 287681 287218 288905 291638 293801 294680 294366 292901 290365 287536 285681 285443 286223 286833 286754
64486 286754 286742 288133 291508 296107 300614 304184 306472 307133 306031 303922 302199 301682 302065 302670 303234 303772
64470 303772 304232 304723 305662 307210 308833 309858 310387 311261 313161 315981 319027 321582 323404 324957 327066
64455 327066 330020 333067 335199 336605 339019 344225 352148 360613 367217 371462 375032 380129 387739 397416
64441 397416 407961 417749 424855 428038 427983 426863 426140 425251 422910 419079 414832 410690 406211 401272 396662
64426 396662 392866 389111 384437 379289 375235 373185 372530 372071 371145 369631 367447 364590 361521 359084 357866
64411 357866 357746 358085 358238 357930 357375 357232 358348 361249 365721 371053 376782 382894 389050 394005 396607 397402
64395 397402 398525 401569 406137 410813 414917 418664 422323 426302 431688 439412 448795 458070 466626 475614
64381 475614 485995 497229 508682 521081 535442 551441 568278 586619 608094 633030 660163
64370 660163 688765 719632 753584 790414 830097 873978 923818 980427 1044040 1115280 1194702
64359 1194702 1281734 1374911 1472602 1572509 1670915 1763890 1849517 1927915 1998817 2060145 2109435
64348 2109435 2145737 2169323 2180124 2177398 2160708 2130514 2087767 2033522 1968877 1894706 1811425
64337 1811425 1719744 1622032 1522443 1425183 1332735 1245857 1164753 1089675 1020787 958192 902052
64326 902052 851978 806425 763762 724279 690095 662285 638922 616966 595470 575678 558363
64315 558363 542763 528396 516220 506945 499259 491053 481868 472953 465190 458118 451214 445068 440724
64302 440724 438288 436666 434583 431681 428804 427358 428364 432009 437806 444817 451724 457388 461796 466081
64288 466081 471073 476186 480245 483038 485274 487155 487822 486369 482829 478167 473868 471428 471385 472672 473719
64273 473719 474419 476246 480245 485886 492311 499497 507269 514199 518818 521351 522853 522953 520082 514078 506986
64258 506986 500624 494586 487530 479364 471099 463288 455846 448982 443013 437254 430325 421940 413572 406936
64244 406936 402408 399272 396917 395298 394580 394822 395865 397357 399135 401620 405377 410202 415258 420338 426169
64229 426169 432996 439799 445902 452626 461966 473731 485325 494519 501296 506697 511282 515485 520275 526105
64215 526105 531699 535087 535668 534429 532351 529594 526174 522388 518311 513717 508812 504338 500594 496994
64201 496994 492981 488799 484920 481186 477018 472071 466195 459186 451173 442983 435507 428882 422775 417045
64187 417045 411462 405142 397450 389471 383477 380504 379467 379123 379778 382046 384895 386365 386004 385220 385154 385392
64171 385392 385072 384067 382598 380745 379049 378599 379537 380202 378877 375917 373041 370931 368872 366688 365438
64156 365438 365618 365899 364584 361591 358321 356163 355862 357644 360946 364308 366559 368055 369899 372058 373392
64141 373392 373752 374864 378329 383577 388852 393859 400174 408954 419358 429906 440576 452561 466300
64128 466300 480851 495246 509348 522737 533633 539970 541298 538730 533174 524657 513645 501965
64116 501965 491573 482740 474116 464429 453817 443776 436292 432711 432665 433892 433688 430971 427004 424136
64102 424136 423968 426511 430627 435014 438982 442601 446160 449549 452251 453889 454580 454736 454675 454465 453873 452343
64086 452343 449293 444792 439925 436127 433932 432479 430450 427439 424240 421787 420077 418322 416140 414397
64072 414397 414702 417860 422756 426963 428830 429075 430078 433492 438811 444438 449707 455417 462590 471315 480919
64057 480919 490827 501026 511922 523924 536997 550354 562585 572243 578574 581981 583867 585848 588902
64044 588902 593271 599020 606346 615360 625975 638027 650859 662694 671473 676944 681044 685305 688657
64031 688657 688943 685866 680871 674638 666714 657756 649973 644386 639254 632348 623518 613915 603918 593342
64017 593342 582731 572799 563083 552764 542637 534752 529936 526996 524646 523114 523215 524641 525867 525627
64003 525627 524214 523370 524789 528571 533379 538213 543407 549563 556343 563219 570767 580056 591091 603028
63989 603028 615810 630335 646888 664577 682629 701172 720250 738978 756354 772357 787701
63978 787701 802813 817305 830124 840081 846741 850835 853304 853961 851886 847239 841749 837060 833368 830078
63964 830078 826883 823493 819096 813020 805555 797336 788255 777907 766912 756782 748150 739908 730652
63951 730652 720628 711663 705152 700578 696234 691167 686071 682359 680745 680904 682104 683851 686161 689482
63937 689482 694256 700349 707180 714632 723456 734390 747213 761144 775885 791712 808790 826988
63925 826988 846186 866247 886911 908278 931206 956599 984582 1014953 1047996 1083966 1122166
63914 1122166 1161657 1202765 1246767 1294173 1344522 1397901 1455273 1517015 1582477 1651608 1725898
63903 1725898 1807047 1895684 1991951 2096300 2209052 2330366 2461713 2606583 2768607 2949503
63893 2949503 3149814 3371207 3616914 3889858 4190789 4518058 4868901 5241316 5634814
63884 5634814 6048657 6479145 6919578 7363112 7804181 8236147 8649064 9031558 9374532
63875 9374532 9671889 9918504 10109453 10241194 10311875 10320057 10264207 10143914 9960937 9719176
63865 9719176 9424605 9085394 8711039 8310645 7892081 7462469 7028770 6597891 6176666
63856 6176666 5771384 5386490 5023901 4684357 4369199 4079930 3816335 3576297 3357683
63847 3357683 3159449 2980762 2820121 2675696 2545619 2427591 2319105 2218666 2126158 2041516
63837 2041516 1963456 1889872 1819102 1750679 1685291 1624051 1567266 1513906 1462891 1414752 1371025
63826 1371025 1331909 1295719 1261157 1229102 1201423 1178888 1160979 1147070 1136781 1129577 1124835 1122185
63814 1122185 1121233 1121305 1122096 1124252 1128643 1135254 1143293 1152152 1161564 1171042 1179911 1187951 1195409 1202222 1207752
63799 1207752 1211391 1213042 1212809 1210560 1206019 1199089 1189905 1178624 1165257 1149714 1131940 1112005 1089959
63786 1089959 1065733 1039448 1011883 984299 957585 931722 906230 880932 856117 832116 808864
63775 808864 785741 761894 737111 712553 690099 670611 653164 636319 619715 603878 588905
63764 588905 574259 559790 546076 533491 521644 510192 499689 491079 484602 479646 475451 471534
63752 471534 467613 463681 460213 457818 456499 455494 453930 451385 447832 443504 438953 434763 430852 426512
63738 426512 421540 416819 413154 409996 406228 401978 398433 395718 392272 387026 381082 376216 372578 369194
63724 369194 366233 365091 366070 367451 367526 366464 365404 364557 363293 361660 360637 360767 361337 361276 360423 359555 359396
63707 359396 359940 360671 361179 361420 361548 361707 362035 362655 363498 364179 364180 363173 361345 359674 359784 362856 368273 373818
63689 373818 377791 380611 383750 387540 390948 393344 395278 397278 398999 400220 401797 404724 408717 412564
63675 412564 415608 418180 420742 423290 425589 427498 429158 431269 434957 440738 447698 454263 459706 464352
63661 464352 468435 471612 473799 475629 477603 479379 480440 480943 481196 480671 478411 474525 470580 468166 467448
63646 467448 467375 466996 466293 465985 466894 469387 473125 477338 481551 485925 490727 495686 500295 504605 509066 513474
63630 513474 516774 518319 518771 519088 519049 517679 515007 512357 510578 508920 506452 503906 503083 504531 506782
63615 506782 508129 508401 508562 509231 510336 511821 513733 515546 516235 515440 513896 512203 509700 505418 499851
63600 499851 494743 490909 487284 482692 477739 473983 471670 469539 467069 465803 467569 471820 475682 476787
63586 476787 475445 473689 472754 472313 472021 472668 475160 479122 483662 489170 497031 507360 518327 528384
63572 528384 537979 548178 558747 569036 579957 593256 608885 624811 639815 655054 672289 691984
63560 691984 713910 738377 765617 794730 824487 854880 886912 921206 957744 996470 1036807
63549 1036807 1076477 1111994 1140980 1163574 1181383 1195616 1206370 1213018 1214847 1211792 1204983 1196328
63537 1196328 1187191 1177631 1166963 1154627 1140294 1123673 1104758 1083961 1061468 1036761 1009540 981127
63525 981127 954169 930543 910017 891241 873541 857225 842711 830232 820341 813788 810659 810163
63513 810163 811494 814288 818080 822224 827013 834150 845079 859042 873723 887806 902170 918503 937448
63500 937448 958306 979841 1001136 1022301 1044812 1070775 1101437 1136480 1174694 1214871 1255984
63489 1255984 1297081 1337239 1375131 1408363 1433866 1449552 1455509 1453466 1445584 1433956 1420536 1406720
63477 1406720 1393072 1379770 1367050 1354777 1341896 1326933 1309068 1288347 1264905 1238378 1208168
63466 1208168 1174235 1137650 1100309 1063761 1028248 993194 958543 925058 893324 863402 835863
63455 835863 812091 792629 775925 759853 744097 729972 718097 707462 696970 686770 677664 669980
63443 669980 663469 657629 651775 645396 638983 633989 631398 630563 629876 628405 626461 624731 623367 622105 621043
63428 621043 620920 622358 624907 627262 628712 630041 632560 636502 640820 644323 646396 646818 645787 644231 643305
63413 643305 643207 643074 642257 641008 639560 637324 633674 629058 624700 621415 619192 617599 616149 614661 613827
63398 613827 615076 619189 625235 631434 636903 642083 647803 654818 664060 676268 691036 707032 723586
63385 723586 741474 761707 784091 807478 831084 855117 880461 908174 938916 972148 1005855
63374 1005855 1037456 1065208 1088677 1108285 1125013 1140549 1157112 1176663 1200169 1227562 1258192
63363 1258192 1291367 1326700 1364026 1402951 1442560 1481669 1519097 1553326 1582132 1603265 1615870
63352 1615870 1620992 1620513 1615765 1607308 1595710 1582086 1567794 1553586 1538968 1522381 1502213 1477766
63340 1477766 1449282 1417380 1382884 1347022 1310920 1274542 1236794 1197236 1157332 1119476 1085078
63329 1085078 1054121 1026186 1001220 979539 961834 949014 941123 936505 933089 930760 931431 936336 944371
63316 944371 953906 965219 979828 997892 1017696 1037768 1058273 1080050 1103331 1127987 1154129 1181733
63304 1181733 1210317 1239782 1271164 1305641 1342983 1381723 1420646 1459095 1495599 1527210 1551074
63293 1551074 1566421 1574650 1577767 1577174 1573565 1567202 1558044 1545954 1531060 1513967 1495567 1476430 1455957
63280 1455957 1432246 1403517 1370075 1334258 1297968 1261040 1222916 1185113 1150490 1120151 1092630
63269 1092630 1066479 1042200 1020959 1002828 987326 974517 964175 954516 943164 929187 913160
63258 913160 895629 876749 857209 838201 820351 803709 788762 776293 766019 756468 746667 737200
63246 737200 729289 723580 720037 718249 717532 717433 718274 720447 723009 723944 722161 718374 713682 708120 701112
63231 701112 692596 683226 674053 666180 659853 653705 646001 637018 629046 623556 619728 616360 613562 611431
63217 611431 608774 605092 602604 604017 608724 613312 615660 616568 617291 617727 617750 618432 620713 624078 627628 631597
63201 631597 636785 643087 649532 655471 661197 667748 676467 688143 702038 716302 729874 743541 758645
63188 758645 775360 792890 810862 829656 849599 870776 893712 919496 948866 981548 1016665
63177 1016665 1053532 1091839 1131269 1171327 1211617 1252161 1293264 1334988 1376950 1418764 1460591
63166 1460591 1503002 1546292 1590085 1633541 1675806 1716448 1755836 1794988 1834533 1873699 1910659
63155 1910659 1943989 1973327 1998525 2018741 2032787 2039928 2039797 2031811 2015395 1990893 1959792 1923919
63143 1923919 1884789 1843924 1803279 1764674 1728713 1694606 1661340 1629003 1599028 1573391 1553580
63132 1553580 1539837 1530912 1524678 1519605 1516045 1515959 1521170 1531791 1546223 1562569 1580216 1600192 1623869
63119 1623869 1650948 1678862 1704591 1727173 1748208 1770056 1793835 1818872 1843249 1864742 1881941
63108 1881941 1894802 1903736 1908147 1906534 1898141 1883662 1863949 1838873 1807928 1771242 1729558 1684042
63096 1684042 1636687 1589954 1545015 1500978 1456688 1412679 1370486 1330853 1293804 1259798 1229381
63085 1229381 1201991 1176600 1153451 1133797 1117831 1104133 1091305 1079002 1067297 1056376 1047171
63074 1047171 1040998 1038054 1037307 1038189 1041166 1046210 1052133 1058201 1065157 1073641 1082674 1090834 1097944 1104288
63060 1104288 1108994 1110898 1110786 1111132 1113258 1115874 1116812 1115296 1112091 1108253 1104343 1100341 1095807 1090420 1084821
63045 1084821 1080569 1078714 1078588 1078575 1077959 1077318 1077029 1076432 1075195 1074691 1076782 1081315 1086127 1089796 1093187 1097709
63029 1097709 1103256 1108899 1114654 1121257 1128748 1136645 1145235 1155337 1166782 1178411 1189722 1201487 1214648
63016 1214648 1229702 1247226 1267617 1289864 1311728 1331957 1351619 1372800 1396722 1423488 1452807
63005 1452807 1484446 1518631 1556439 1599147 1646893 1698689 1753926 1813004 1876255 1943404 2014580
62994 2014580 2090762 2172444 2258685 2348053 2439659 2532816 2626857 2722016 2819267 2918256 3016470
62983 3016470 3111681 3204375 3296555 3388977 3480798 3571081 3659077 3743606 3823864 3900500 3974117
62972 3974117 4042640 4101747 4148146 4181012 4199951 4203194 4188719 4156137 4106653 4041950 3964002
62961 3964002 3875500 3779554 3678840 3575387 3471080 3368150 3269088 3176104 3090647 3013610
62951 3013610 2945969 2888737 2842042 2804852 2776276 2756757 2747283 2747767 2756965 2773698 2797210 2826400
62939 2826400 2859715 2896065 2935132 2976623 3019936 3064719 3110977 3158267 3205294 3250487 3292487
62928 3292487 3329991 3361809 3387303 3406080 3416967 3417998 3407914 3387166 3356850 3317080 3266929
62917 3266929 3205656 3133387 3050947 2959856 2862635 2762406 2661752 2562136 2464556 2370269 2280402
62906 2280402 2195150 2114056 2037171 1965212 1898236 1834860 1773630 1714833 1660074 1610122 1564012
62895 1564012 1520262 1478017 1436825 1396425 1357385 1320994 1287671 1256213 1225458 1196087 1169756
62884 1169756 1146855 1126147 1106396 1087355 1069187 1051896 1035549 1020366 1006340 993226 981030
62873 981030 970150 960968 953451 946965 940326 932675 924722 918399 914516 911415 906964 901273 896116 892036
62859 892036 887732 882467 877396 873757 871008 867634 862874 856772 849367 840896 832401 825086 819147 813960
62845 813960 809302 805672 803313 801491 799053 795400 790787 785950 781739 778986 778321 779758 782457 785108
62831 785108 786616 786450 784663 781980 779699 778748 778689 778341 777548 777458 778615 779832 779886 779516 780447 782881 785243
62814 785243 786247 785930 784643 782391 779559 777129 775556 774146 772105 769653 767756 767193 768105 770002 772051
62799 772051 773870 776017 779111 782547 784985 786192 787420 789682 792594 795344 797868 800455 803056 805695
62785 805695 808810 812330 814953 815297 813660 811855 811314 811810 812094 811423 810412 810507 812521 815742 818751 821062
62769 821062 823396 826247 828959 830730 832030 834404 839059 846147 855237 865981 878083 890875 903295
62756 903295 914667 925620 937743 951788 966463 979671 990886 1001680 1013939 1028327 1044584
62745 1044584 1062463 1081968 1103133 1125909 1149933 1174479 1199251 1225202 1253820 1285644 1320363
62734 1320363 1358346 1400754 1447806 1498354 1552110 1611226 1678509 1754742 1838769 1929618 2027328
62723 2027328 2131957 2242944 2359587 2481472 2608503 2740972 2879169 3021969 3165797
62714 3165797 3305719 3437684 3559279 3668521 3762813 3839260 3895439 3929695 3941232 3930270
62704 3930270 3897857 3845201 3773365 3683810 3579190 3463283 3339807 3211203 3078792 2944220
62694 2944220 2810250 2679545 2552981 2429993 2310637 2196517 2089469 1990129 1898166 1813154
62684 1813154 1734666 1662080 1594944 1533292 1477380 1427447 1383744 1345960 1312371 1280586 1249857
62673 1249857 1221901 1198690 1180161 1164895 1152235 1142545 1135831 1131389 1128752 1127912 1128544 1130025 1132533
62660 1132533 1137381 1145871 1158111 1173126 1189931 1208526 1230055 1255856 1286251 1320618 1358773 1401589
62648 1401589 1449758 1502675 1559344 1619892 1685317 1756149 1832257 1913711 2000790 2093235 2190434
62637 2190434 2292289 2398821 2508695 2618939 2726348 2828423 2922772 3006556 3077153 3132946
62627 3132946 3172983 3196271 3201840 3189319 3159075 3111802 3048215 2969351 2877326 2775652 2668381
62616 2668381 2558701 2448671 2340265 2235703 2136001 2039902 1945352 1852074 1761999 1677356
62606 1677356 1599152 1527395 1461751 1401630 1346307 1295409 1249057 1207357 1169912 1135782 1103817
62595 1103817 1073395 1045099 1020103 998420 978433 958937 940836 925626 912703 899806 886117
62584 886117 873374 863473 856291 850445 845068 840137 835875 832609 830598 829468 828302 826624 824701 822773
62570 822773 820851 819486 819559 820712 821188 820146 819229 820740 824996 830607 836790 844108 853134 863553 874683
62555 874683 886027 897340 908916 921782 936792 953541 970884 988592 1007756 1029504 1054105
62544 1054105 1081532 1112229 1147002 1186630 1231723 1282319 1337323 1394883 1453749 1513987 1576210
62533 1576210 1640558 1706576 1773431 1839606 1902763 1960481 2011016 2053039 2085090 2106052 2116026
62522 2116026 2115912 2105867 2084938 2052728 2010968 1962772 1910467 1854810 1796269 1736262 1676547 1617766
62510 1617766 1559292 1500640 1442675 1387357 1336534 1291040 1250540 1213902 1179970 1148394 1119867
62499 1119867 1095323 1074868 1057542 1042049 1027452 1013197 999010 985216 972990 963748 957984 954808
62487 954808 952791 951172 950244 950702 952765 955842 958899 961188 962654 963657 964420 964971 965679 967600 972084
62472 972084 980009 991228 1004493 1018123 1031520 1046329 1065506 1090593 1120170 1151460 1183111 1215946
62460 1215946 1251510 1290872 1334678 1383273 1436431 1493591 1554488 1618907 1685807 1753566 1821351
62449 1821351 1889367 1957323 2023419 2085358 2141603 2191084 2232398 2264236 2286376 2299641 2305220
62438 2305220 2304573 2299748 2293133 2286894 2282821 2282388 2286652 2296323 2312113 2334613 2363761 2399173 2441161
62425 2441161 2490403 2546117 2605488 2665620 2724956 2781780 2832401 2872511 2900158 2916120 2921444
62414 2921444 2915697 2897414 2865102 2817860 2756228 2682667 2600324 2511250 2416565 2318114 2218754
62403 2218754 2120920 2025930 1934890 1849178 1769674 1696343 1628925 1567429 1511876 1462224 1418536
62392 1418536 1380437 1346680 1316338 1290250 1269879 1254684 1242271 1231543 1223924 1220462 1219325 1217715
62380 1217715 1215286 1214060 1215383 1218392 1221362 1223248 1223625 1222019 1217894 1211041 1201803 1190957 1179303 1167299
62366 1167299 1155239 1143613 1132699 1121760 1109379 1095008 1079648 1064691 1050707 1037750 1026153
62355 1026153 1016343 1008211 1001130 994249 986531 977198 966758 957018 949365 943415 938001 933067 929759 928813
62341 928813 929566 930588 930849 930318 929838 930315 931755 933272 934280 935392 937821 942191 948224 955234 962504
62326 962504 969581 976713 984771 994261 1004568 1014584 1023918 1033219 1043506 1055402 1068736 1082674 1096657
62313 1096657 1111425 1128662 1149359 1173068 1198993 1227000 1257087 1288780 1321987 1357895 1398155
62302 1398155 1443644 1494674 1551696 1614580 1681682 1750950 1821791 1894519 1967950 2038780 2103727
62291 2103727 2161218 2210647 2251157 2281861 2302583 2313651 2315343 2308007 2292291 2268854 2238182 2201066
62279 2201066 2158820 2112678 2063260 2011030 1957019 1902732 1849519 1798285 1749714 1704525 1663439
62268 1663439 1626741 1593705 1562727 1532525 1503102 1474978 1447655 1419755 1390799 1361771 1333344
62257 1333344 1304543 1274199 1243114 1213653 1187402 1164299 1143852 1125839 1109551 1093752 1078267
62246 1078267 1064714 1054677 1047806 1042663 1038731 1036267 1034596 1032274 1029261 1027452 1028304 1031107 1034362 1037738
62232 1037738 1041538 1045294 1048411 1051742 1056938 1064280 1072508 1080894 1090247 1101673 1115468 1131476 1149271
62219 1149271 1167646 1185202 1202068 1219882 1239346 1258995 1277413 1295716 1316514 1340943 1367848
62208 1367848 1395578 1423570 1452342 1482914 1516270 1552698 1591761 1633367 1678540 1728479 1783235
62197 1783235 1842028 1904465 1970438 2038910 2107579 2173711 2234621 2287731 2331337 2365514 2391425
62186 2391425 2409421 2418477 2417585 2406963 2387588 2360233 2325353 2283449 2235190 2181429 2123407 2062741
62174 2062741 2001125 1940106 1880969 1824466 1770713 1719637 1671448 1626432 1584704 1546643 1513175
62163 1513175 1484861 1460910 1439810 1420812 1403965 1388817 1374241 1359900 1347054 1337292 1330850 1326509
62151 1326509 1322739 1318754 1314837 1311928 1310717 1311136 1312940 1316318 1321331 1327166 1333033 1339612 1348203 1358221
62137 1358221 1367118 1373620 1379633 1387646 1397186 1405544 1411629 1417470 1425625 1436400 1448129 1459258 1469487
62124 1469487 1479475 1490033 1501383 1512786 1523124 1531997 1539967 1547630 1555082 1562775 1572308 1585490 1602657
62111 1602657 1622654 1644585 1668956 1696884 1728787 1764161 1802073 1841385 1880932 1920022 1958285
62100 1958285 1994372 2025298 2048109 2062242 2069414 2071253 2067945 2059156 2044979 2025453 2000255 1969636
62088 1969636 1934819 1896658 1854702 1808609 1759962 1711679 1665892 1623221 1583648 1547085 1513322
62077 1513322 1482392 1454898 1431167 1410324 1391130 1373498 1358092 1344528 1331233 1317337 1303661
62066 1303661 1291546 1281679 1274380 1270070 1268736 1269526 1271291 1273178 1274576 1275074 1274654 1273327 1270528 1265613
62052 1265613 1259096 1252563 1247192 1243081 1239933 1237144 1232976 1225173 1213386 1199996 1187600 1176536 1165842
62039 1165842 1155753 1147900 1143397 1141861 1142109 1142926 1143381 1143405 1144081 1146592 1150886 1156007 1161579 1168237 1176661
62024 1176661 1186920 1198781 1211988 1226147 1240960 1256695 1273986 1293105 1313860 1336148 1360087
62013 1360087 1385602 1412347 1440062 1468537 1497278 1525788 1554276 1583637 1614542 1646789 1679369
62002 1679369 1710619 1738378 1760793 1777423 1789193 1796983 1800471 1798507 1790307 1776154 1757186 1734619
61990 1734619 1708876 1679276 1644782 1605191 1561448 1514840 1466295 1416510 1366348 1316845 1269076
61979 1269076 1224128 1182762 1144735 1108843 1074200 1041407 1011987 986651 964515 944199 925272
61968 925272 908282 893571 880506 867973 855318 842638 830360 818871 808499 799453 791537 784061
61956 784061 776316 768248 760617 754396 749911 746605 743729 741286 740068 740591 742258 743951 745313 746920
61942 746920 749144 751466 753298 754928 757067 759735 762291 764540 767108 770417 773741 775586 774779 770964
61928 770964 764469 756215 747590 739693 732381 724435 715029 704844 695364 687267 680048 673238 667343 663124
61914 663124 660334 657731 654256 649808 644920 640231 636371 633868 632786 632635 632889 633514 634908 637406 640892
61899 640892 644593 647186 647542 645853 644008 644449 648353 654928 662454 669957 677817 686895 697341 708476
61885 708476 719812 731856 745753 762292 781336 801895 822504 841919 860069 878242 897717
61874 897717 918092 937477 954514 969690 984294 998521 1011220 1021437 1029708 1037455 1045214 1051742
61862 1051742 1055202 1055309 1053908 1053128 1053368 1053688 1053846 1054966 1058091 1063155 1069872 1078723 1090219 1103763 1118200
61847 1118200 1133061 1148299 1163075 1176038 1186976 1197018 1206668 1214609 1219364 1221549 1223424 1226283
61835 1226283 1229157 1230320 1229421 1227757 1226787 1226766 1226682 1225178 1221580 1216165 1209485 1201514 1191700 1179881 1166659
61820 1166659 1152580 1137327 1120338 1102120 1084249 1067942 1053168 1039433 1026933 1016423 1008241
61809 1008241 1002029 997338 994134 992629 992871 994639 997679 1002044 1008129 1016222 1026137 1037647 1051263 1068010
61795 1068010 1088251 1111240 1136150 1162951 1191858 1222504 1254312 1287202 1320993 1354243 1384481
61784 1384481 1409789 1429870 1445739 1458753 1469527 1477193 1480074 1477883 1472890 1467937 1463635 1458742 1453278
61771 1453278 1449687 1450211 1454238 1459278 1464031 1469572 1477667 1488577 1500524 1511006 1518538 1523182 1525420
61758 1525420 1524897 1520705 1512580 1501174 1487334 1471846 1455708 1439563 1422656 1403315 1380946 1356854
61746 1356854 1332693 1308729 1283959 1257369 1228892 1199804 1172401 1148459 1127585 1107799 1088062
61735 1088062 1069513 1053832 1041222 1030547 1020740 1011498 1003169 996395 991344 987021 982067 976482 971736
61722 971736 968879 967536 967016 967182 967748 968065 968379 969965 973178 976817 980552 986392 996043 1008037 1019391
61707 1019391 1029382 1039789 1052092 1066395 1082675 1100942 1120065 1138337 1155526 1172879 1190864
61696 1190864 1208276 1223537 1235302 1241769 1241262 1234169 1222859 1209178 1193227 1174886 1154988 1134358
61684 1134358 1113142 1091852 1071762 1053374 1035630 1017609 1000066 984434 971142 959739 949835
61673 949835 941028 932578 923995 915498 907382 899629 892651 887465 884279 881676 878132 873784 869884 867042
61659 867042 864854 862773 860502 857883 855143 852892 851213 849100 845449 840203 834028 827435 820866 814920
61645 814920 809575 803683 796238 787837 780042 773709 768755 764940 761664 757482 751345 744373 738995 736073
61631 736073 734084 731376 727905 724218 720114 715299 710374 705966 701438 695678 689047 683490 680527 679807
61617 679807 679867 679720 679341 678994 678631 678065 677493 677512 678390 679517 679994 679870 680380 682732 686961 692258 698001 703989
61599 703989 709894 715180 719651 723549 726996 729745 731664 733073 734398 735757 737068 738228 739003 739198 739291
61584 739291 740492 743640 748259 753166 757843 762668 767971 773484 778784 783648 787784 790701 792049 791814
61570 791814 790048 786710 781750 775061 766484 756357 745878 736247 727502 718984 710848 704059 698721 693572
61556 693572 687702 681647 676148 670874 665341 660184 656346 653614 651027 648184 645133 641581 637469 633770
61542 633770 631339 629296 625926 620952 615500 610030 604072 598116 593900 592056 590951 588706 585249 581549
61528 581549 577932 574188 570579 567829 566565 567277 570093 573933 576660 576874 575104 572744 570618 569300 569875
61513 569875 573037 577624 581198 582228 581179 579572 578620 578753 579890 581956 585186 589825 595593 601906 608645
61498 608645 616006 623316 628922 631914 633367 635135 637818 640550 642339 642899 642465 641542 640730 640371 640590 641887
61482 641887 645026 649778 654505 657872 660386 663287 666416 668397 668732 668495 668881 670144 672132 674773 677586
61467 677586 679572 680164 679785 679218 678908 679084 679790 680359 679556 676881 673347 670384 668288 666459 664932 664818
61451 664818 666924 670501 673932 676392 678323 680340 682475 684884 688679 695077 703689 712466 719738 725817
61437 725817 732278 740184 749408 759207 768811 777671 785706 793270 800547 807108 812388 816457 820006 823721
61423 823721 827871 832257 836263 839259 841218 842626 843505 843092 840929 837751 834669 831992 829634 828107 828000
61408 828000 828634 828393 826543 823797 820960 818096 815379 813632 813166 812771 810844 807412 804390 803773 805872
61393 805872 809192 811812 812949 813553 815423 819669 825879 832609 838511 843209 847419 852159 857483 862156
61379 862156 865011 866538 868550 872244 877136 881921 885602 887618 887850 887218 887550 889912 893325 895954 897443
61364 897443 899237 902532 906758 910420 912791 914176 914866 914494 912534 909087 904854 900337 895218 888769 881037
61349 881037 873356 867275 862936 858902 853805 847859 842494 838796 836637 835070 833062 829894 825366 819828
61335 819828 813846 807868 802349 797920 794918 792911 791276 790163 790179 791207 792503 794143 797173 801796 806627
61320 806627 810683 814985 820948 828120 835108 842043 850145 859088 866922 873019 879128 886658 894651 901555
61306 901555 907551 913715 919895 924895 928138 929889 930302 929479 928199 927537 927916 929331 932033 936044 940329
61291 940329 943551 945526 947021 948331 949020 949029 948952 949056 948849 947842 946199 944553 943626 943885 945007 945827 945461
61274 945461 944302 943322 942745 942165 941631 941566 941749 941434 940633 940332 941224 942962 944787 946125 946542 946079 945958 948124
61256 948124 953560 961410 969884 977587 984184 990628 998845 1010286 1024438 1039409 1054085 1068925 1084408
61243 1084408 1099606 1112737 1122450 1128316 1130768 1130973 1130073 1128127 1124344 1118540 1111638 1104427 1096632 1087629
61229 1087629 1077339 1066031 1054056 1042155 1031134 1020660 1009386 997090 985798 977791 973278 971102
61217 971102 970962 973356 977673 982108 985865 989988 995229 1000174 1002672 1002698 1002749 1005172 1009939 1015513 1021433
61202 1021433 1029139 1039995 1053152 1066065 1076872 1085620 1093178 1099827 1105289 1109540 1113030 1116370 1120179
61189 1120179 1124896 1130316 1135469 1139273 1141257 1141666 1141296 1141331 1142668 1144922 1146553 1146439 1144889 1142596 1139228
61174 1139228 1134100 1128080 1123756 1123244 1126323 1131190 1136676 1143222 1151608 1161195 1169939 1176368 1181214 1186580
61160 1186580 1193703 1202207 1211498 1221788 1233018 1243628 1251613 1256733 1260740 1265312 1270553 1275694 1280457
61147 1280457 1285118 1289759 1294175 1298624 1304276 1312646 1324544 1339407 1355646 1371778 1387431 1403280
61135 1403280 1420013 1437352 1454117 1469185 1482316 1493976 1504408 1513025 1518860 1521616 1522238 1522407 1523389
61122 1523389 1525109 1526269 1525588 1523153 1520346 1518327 1516985 1515744 1514831 1514916 1515743 1516242 1516257 1517183 1520409 1525869
61106 1525869 1532741 1540724 1549735 1558985 1567684 1576572 1587524 1601215 1616182 1630888 1645993 1663573
61094 1663573 1684284 1706386 1727815 1748390 1769157 1790011 1808954 1823898 1834407 1841317 1845369 1846930
61082 1846930 1846509 1844547 1840676 1833931 1823894 1811101 1796323 1780123 1763302 1747089 1732418 1719311
61070 1719311 1707228 1695662 1684266 1672774 1661090 1649227 1637165 1625300 1615094 1608554 1606547 1607949
61058 1607949 1610765 1613744 1616730 1619942 1623453 1627155 1630973 1635185 1640490 1647180 1654208 1659844 1663556 1666471
61044 1666471 1669374 1670969 1668918 1662199 1651603 1638225 1622461 1604480 1584708 1563530 1541171 1518295
61032 1518295 1496166 1475543 1455578 1434523 1411774 1388805 1367622 1348671 1330991 1314248 1299436
61021 1299436 1287061 1275831 1264239 1252645 1242409 1233519 1224792 1216362 1210118 1207178 1206478 1206492 1206915 1207836
61007 1207836 1208726 1209503 1211590 1216569 1224395 1233891 1244392 1255963 1268719 1282941 1299342 1318285 1339196
60994 1339196 1361441 1385182 1410739 1438057 1467606 1500718 1537919 1577950 1619620 1663586 1710942
60983 1710942 1761153 1813182 1867773 1926703 1990239 2057174 2126949 2199963 2276338 2356445 2442349
60972 2442349 2536488 2638882 2747567 2861572 2981302 3106276 3235476 3370496 3515658 3673904
60962 3673904 3844923 4028472 4227339 4445530 4685279 4947174 5231873 5541167 5879758
60953 5879758 6257322 6686789 7179414 7743855 8391094 9137009 9998298 10989403 12125685
60944 12125685 13424609 14900071 16562362 18429820 20524594 22821920 25182457 27352014
60936 27352014 29069634 30209499 30832496 31112056 31224592 31304603 31456106 31737129 32093563
60927 32093563 32325047 32163405 31423884 30102012 28343371 26338223 24241107 22154868
60919 22154868 20146692 18258989 16512896 14915254 13467022 12165857 11005221 9975804
60911 9975804 9067976 8271603 7575051 6966322 6434402 5968411 5557044 5190706 4863373
60902 4863373 4570934 4308556 4071038 3854837 3658157 3479566 3317802 3172199 3041590
60893 3041590 2922913 2812268 2707416 2608346 2515638 2429317 2349059 2274290 2203944 2136997 2073284
60882 2073284 2013111 1956175 1901655 1849200 1798920 1750513 1703294 1657129 1612414 1569081 1526551
60871 1526551 1484839 1444814 1407139 1371792 1338862 1308875 1281734 1256038 1230203 1203977 1178490
60860 1178490 1155105 1134516 1116510 1100138 1084274 1068298 1052125 1035746 1019295 1003674 990294
60849 990294 979660 970817 962744 955850 951361 949542 949234 948986 947934 945696 942201 937907 933539 929364
60835 929364 925145 920943 917395 914845 912645 909742 905690 900692 895069 889196 883706 879025 874662 869563
60821 869563 863409 857157 852089 848615 846172 843886 841149 837903 834654 831932 829506 826580 823124 820460
60807 820460 819915 821222 822935 824072 824557 824307 823098 821468 820582 820609 820154 817955 814367 810507 806716 802738
60791 802738 798730 794994 791229 787191 783786 782164 781758 780377 776509 770548 763659 756519 749490 742909
60777 742909 736625 730040 723033 716112 709385 702391 695383 689577 685473 682041 678491 675679 674547 674289
60763 674289 673554 672658 672741 673233 672227 669507 667180 666644 666592 664995 661826 658718 656864 656419 657337 659607 662722
60746 662722 665691 667680 668421 668291 668158 668562 668639 666462 661092 653896 647319 642789 640340 639583 639961 640225
60730 640225 638800 635105 629993 624676 619588 614570 609860 606491 605450 606418 607557 606978 604350 600625 596414
60715 596414 591592 586615 582921 581161 580108 578546 577503 579112 583493 588298 591428 592894 593768 594687 596011
60700 596011 598129 600784 602923 604113 605388 607879 611325 614826 618426 622687 627043 629984 631138 632110
60686 632110 634784 639415 644787 649617 653269 655584 656688 656908 656450 655111 652635 649394 646443 644695 644047
60671 644047 643465 642040 639962 638341 637951 638290 638062 636563 634326 632373 631063 629891 628229 625900 622989
60656 622989 619429 615109 610341 605882 602336 599642 597298 594926 592417 589760 587129 585078 584065 583575
60642 583575 582261 579448 576131 573862 572859 571984 570549 569229 568828 568972 568803 568417 568751 570200 572203 574270
60626 574270 576622 579586 583043 586841 591235 596445 602097 607544 612506 617093 621442 625627 629630 633049
60612 633049 635159 635649 635038 634024 632775 631346 630260 629800 629008 626501 622462 618824 617043 616473 615598 614254
60596 614254 613826 615420 618561 621771 624004 625382 626852 629268 632714 636511 639759 641858 642727 642744 642347
60581 642347 641395 639142 635246 630719 627239 625428 624340 622814 620730 618650 616834 615180 613781 612946 612763
60566 612763 613079 613823 615050 616700 618531 620281 621798 623099 624304 625420 626280 626914 627768 629138 630564
60551 630564 631386 631718 632145 632574 632373 631746 631823 633072 634769 636584 639328 643241 646765 648294 648274 648218 648495
60534 648495 648664 649332 651763 655671 659222 661515 663513 666114 668822 671033 673288 676351 680026 683852 688163
60519 688163 693487 699439 705111 710198 714987 719622 724240 729602 736693 745585 755400 765596 776703 789325
60505 789325 802802 815502 826483 836267 845516 853394 858160 859441 859070 859172 860189 861365 862431 863899
60491 863899 866224 869797 875537 884280 895494 907476 919021 930218 941777 954504 969436 987481
60479 987481 1008667 1032523 1059183 1089166 1121943 1155808 1189288 1221616 1251704 1278049 1300055
60468 1300055 1318036 1331235 1337291 1334780 1325249 1311687 1295945 1278738 1261095 1244234 1228477 1213747
60456 1213747 1200940 1191463 1185462 1181570 1178474 1175906 1174317 1174737 1179040 1189084 1205028 1225168 1247889
60443 1247889 1273333 1302888 1337522 1377034 1420624 1467654 1517606 1569457 1621519 1672325 1721454
60432 1721454 1768814 1813157 1852269 1885174 1913394 1939372 1964170 1987304 2008025 2025566 2038317
60421 2038317 2043724 2039211 2022844 1993509 1951291 1897662 1834828 1765180 1691741 1618390 1548343 1482401
60409 1482401 1419527 1359132 1302085 1249597 1201988 1158648 1118591 1081142 1046720 1016681 991631
60398 991631 970119 949910 930281 911968 895213 879322 864220 850791 839223 828517 818307
60387 818307 809665 803069 796963 789851 782836 778299 776360 774385 770196 764400 759025 755008 751754 748510
60373 748510 745241 742270 739681 737313 735127 733319 731980 730767 729176 727285 725927 725875 726900 727931 728133
60358 728133 727711 727674 728893 731329 734141 736730 739668 744220 750725 757867 763890 768213 771375 773772 775275
60343 775275 776047 776863 778284 780178 782512 785990 791161 797217 802534 806456 809911 814119 819341 825075 830799
60328 830799 836023 840137 842996 845559 849275 854696 860998 866936 872001 876580 881261 886052 890229 893032
60314 893032 894647 896270 898958 902666 906687 910644 914463 917722 919881 921199 922653 924825 927504 930501
60300 930501 934057 938185 942386 946507 951275 957419 964692 972219 979505 986660 993864 1000869 1006888 1010980
60286 1010980 1012920 1013546 1013584 1012320 1008488 1002548 996736 992400 988618 984187 979588 975752 972131 967555 962213
60271 962213 957162 952406 947133 941556 936837 933137 929271 924484 919275 914274 909664 905996 904342 905199
60257 905199 908168 912897 919320 926870 934657 942689 951662 961273 970039 977285 983990 991234 999244 1008547
60243 1008547 1020287 1034079 1046881 1055634 1060246 1062596 1063321 1061100 1054665 1044003 1029729 1012690 994326
60230 994326 976240 959123 942857 927657 914284 903130 893974 886730 881600 878353 876233 874699 873442
60217 873442 871528 867615 861636 855481 851092 848228 844975 840381 835707 832780 831744 831081 829583 827525
60203 827525 825813 824694 823845 823116 822490 821643 820531 820291 822466 827074 832283 836336 838900 840256 840422 839933
60187 839933 840330 842549 845379 846839 846691 846381 846807 847596 848550 850189 852397 853950 854271 854657 856823 860956
60171 860956 866146 872099 879146 886762 893437 898535 903421 910040 918766 928279 937349 946090 955423 966045
60157 966045 978277 992239 1007291 1021582 1033252 1042536 1051918 1063587 1077144 1090379 1101888 1112235
60145 1112235 1122772 1134115 1145957 1157710 1168971 1179545 1189207 1197436 1203612 1207700 1210536 1213077
60133 1213077 1215494 1217259 1217878 1217174 1215240 1212652 1210361 1208601 1206156 1201644 1195500 1189721 1185550 1182413
60119 1182413 1179368 1176446 1173928 1171409 1168643 1166687 1167036 1169684 1172845 1174567 1174069 1171682 1168206 1164383
60105 1164383 1160459 1156159 1151394 1146783 1142993 1139729 1136034 1131574 1127083 1123443 1120804 1118714 1116666 1114443
60091 1114443 1112305 1110888 1110545 1110784 1110754 1110180 1109421 1108848 1108857 1110244 1113441 1117166 1119099 1118581 1117697 1118813 1121863
60074 1121863 1125099 1127780 1130639 1133932 1136685 1138395 1140233 1143705 1148796 1154147 1158621 1162024 1164650 1166971
60060 1166971 1169756 1173812 1179278 1185496 1191809 1198294 1205451 1213222 1220668 1226976 1232683 1239471 1248466 1259011
60046 1259011 1269353 1278236 1285457 1291215 1295621 1298913 1301573 1304039 1306525 1309050 1311278 1312537 1312666 1312705
60032 1312705 1313850 1315589 1315793 1313060 1308112 1302323 1295753 1287446 1277034 1265034 1251910 1237786 1223008
60019 1223008 1208192 1193672 1179449 1165598 1152144 1138779 1125453 1113146 1103249 1096042 1090455 1085395
60007 1085395 1080545 1075636 1069854 1062605 1054476 1046860 1040682 1035779 1031336 1026611 1021343 1015761 1010434 1006144
59993 1006144 1003640 1002989 1003044 1002125 999789 997524 997082 998412 1000037 1001233 1002794 1005411 1008309 1010061 1010224
59978 1010224 1009702 1009767 1011020 1012937 1014205 1013908 1012503 1011178 1010143 1008227 1004406 999020 993029 986798 980210
59963 980210 973390 966532 959515 952486 946389 941877 937868 932376 924987 917594 912231 909029 906839 904992
59949 904992 903421 901553 898417 894119 890157 887561 885284 881295 875023 868003 862178 858311 856096 854940
59935 854940 854176 853277 852590 853377 856384 860680 864699 868193 872328 878004 885064 893166 902250 911658 919772
59920 919772 925402 928965 931563 933342 933653 932671 931839 932321 933459 933223 930175 924953 919838 916825 916081 916330
59904 916330 916637 917406 919448 922437 924806 925192 923704 921662 920232 919458 918694 917845 917850 919671 922951 926157
59888 926157 928091 928855 929303 930071 931419 933452 935931 938223 940136 942631 946954 952931 958883 963693 968361
59873 968361 974834 983610 993246 1002175 1010035 1016932 1022327 1025557 1027071 1028195 1029675 1031138 1032052 1032572 1033387
59858 1033387 1035336 1039181 1045019 1051845 1058540 1065451 1074006 1084446 1094965 1103634 1110152 1115014 1118158
59845 1118158 1119545 1120152 1120970 1121521 1120540 1117691 1113516 1108273 1102154 1096171 1091349 1087330 1083234 1079595 1077865
59830 1077865 1078105 1078862 1079375 1080175 1081387 1082341 1083371 1086064 1090945 1096627 1102171 1108605 1116819 1125467 1132500
59815 1132500 1137783 1142687 1147773 1152284 1155544 1157688 1159246 1160747 1162407 1163629 1163373 1161600 1159708 1158967
59801 1158967 1159285 1160051 1161239 1162863 1164318 1165331 1166907 1170466 1176653 1185473 1196522 1208152 1217634 1223386
59787 1223386 1226218 1227393 1226733 1224061 1221120 1219917 1219951 1219274 1217844 1217499 1218572 1218910 1216926 1213726 1211332
59772 1211332 1210304 1209973 1209739 1209094 1207306 1204123 1200342 1197024 1194512 1192702 1191836 1192650 1195931 1202045 1210500
59757 1210500 1219938 1229122 1237997 1247335 1257312 1266987 1275206 1281436 1285658 1287985 1288514 1287136 1283545 1277874
59743 1277874 1271248 1265179 1260402 1256584 1252872 1248295 1242041 1234121 1225593 1217534 1209984 1202445 1194982 1188113
59729 1188113 1182016 1176652 1172279 1168963 1165972 1162593 1159130 1156045 1152648 1148067 1143221 1140238 1139834 1140793
59715 1140793 1142302 1145177 1150123 1156161 1161863 1167417 1174595 1184927 1198244 1212650 1225830 1236877 1246874
59702 1246874 1257203 1267662 1277096 1285446 1293833 1302722 1311497 1320116 1329741 1341121 1353435 1365178 1375139
59689 1375139 1382223 1385781 1386921 1388231 1391229 1394895 1397396 1398221 1397859 1396586 1394753 1393400 1393308 1393930 1394366
59674 1394366 1394898 1396438 1398860 1401032 1402336 1403135 1403824 1404466 1405424 1407377 1410334 1413301 1415368 1416730 1418349
59659 1418349 1420937 1424546 1428929 1433904 1439375 1445344 1452108 1460238 1470013 1480920 1492105 1503395 1515451
59646 1515451 1528849 1543622 1559830 1577636 1596279 1614052 1630331 1646875 1665841 1686980 1708015
59635 1708015 1727260 1744403 1759136 1770897 1780160 1788232 1795343 1800387 1803000 1804475 1806014 1807350 1807657
59622 1807657 1806491 1803352 1797779 1790572 1783529 1777113 1769761 1760412 1750363 1741618 1734814 1729948 1727584 1727632
59608 1727632 1728095 1726995 1725023 1724649 1727163 1732152 1739304 1748766 1759775 1770857 1781843 1794273 1809175
59595 1809175 1825381 1840493 1852757 1861729 1867879 1871938 1873963 1872691 1866225 1853672 1835796 1814048
59583 1814048 1789347 1762051 1732803 1702940 1673710 1645060 1615655 1584703 1553521 1524488 1498556
59572 1498556 1474806 1452472 1431916 1412957 1393717 1372369 1349159 1325565 1302304 1279436 1257628
59561 1257628 1237620 1218624 1198845 1177832 1157190 1138805 1123214 1109790 1097555 1085708 1074263
59550 1074263 1064460 1057793 1054279 1052199 1049792 1046846 1044596 1044307 1045864 1047451 1046926 1043973 1040630 1039265
59536 1039265 1040349 1042637 1044905 1046674 1047721 1047989 1047993 1048487 1049594 1050772 1051480 1051299 1049712 1046486 1042244 1038010
59520 1038010 1034313 1031142 1028309 1025088 1020034 1012312 1003165 995055 989237 984931 980803 976385 971970 967918
59506 967918 964358 961086 957799 954872 953563 954693 957404 960075 962185 964345 966833 969447 972760 977942
59492 977942 984863 991665 997008 1001833 1008148 1016773 1027029 1038140 1050226 1064086 1080449 1099321 1120013
59479 1120013 1142075 1165820 1190936 1214473 1231571 1239241 1239029 1235370 1231811 1229343 1227479 1225489 1222627
59466 1222627 1218394 1213215 1208255 1204033 1199723 1194391 1188667 1184325 1182036 1180193 1176431 1169876 1161374 1151993
59452 1151993 1142219 1132454 1123157 1114183 1104892 1095375 1086711 1079522 1073169 1067150 1062263 1059251 1057015 1053623
59438 1053623 1048893 1044702 1042676 1042647 1043458 1044313 1045135 1046474 1049289 1054156 1060667 1068275 1077398 1088526 1100258
59423 1100258 1109767 1115906 1120771 1127247 1135661 1143716 1149267 1152288 1154237 1156203 1157959 1158594 1157845 1156536
59409 1156536 1155577 1154944 1154209 1153729 1154403 1156228 1158069 1159172 1160089 1161684 1164088 1167303 1172077 1179172 1188007
59394 1188007 1196978 1205215 1213344 1222314 1231929 1240838 1247717 1252173 1254682 1255965 1256571 1256736 1256337 1254998 1252586
59379 1252586 1249692 1247295 1245757 1244479 1242825 1241124 1240475 1241840 1245634 1251883 1260248 1270047 1280694 1292055
59365 1292055 1304144 1316689 1329411 1342485 1356369 1371486 1388471 1408234 1431006 1455645 1480934
59354 1480934 1507577 1537716 1571666 1605531 1632795 1648557 1652439 1647852 1638878 1627873 1615698 1603602
59342 1603602 1594086 1589776 1591681 1598373 1606139 1609921 1605403 1591396 1570079 1544626 1517150 1489214 1462964
59329 1462964 1440291 1421303 1404942 1390950 1380077 1372454 1366995 1362669 1359451 1357801 1357955 1359907 1363425
59316 1363425 1368009 1373380 1379836 1387371 1394701 1400246 1404180 1408528 1415043 1423735 1433508 1443189 1451745 1458566
59302 1458566 1464045 1469267 1474787 1480344 1485886 1491986 1498897 1506035 1512943 1520122 1528339 1537609 1547398 1557634
59288 1557634 1569082 1582699 1598685 1616042 1633192 1649194 1664128 1678212 1691146 1702739 1713339
59277 1713339 1722711 1729207 1731263 1729362 1725265 1719625 1711653 1700938 1688073 1673384 1656652 1638464 1620404
59264 1620404 1603274 1586301 1568650 1550675 1533090 1515979 1499234 1483101 1467616 1452284 1436853
59253 1436853 1421771 1407446 1393774 1380718 1368669 1357965 1348740 1341340 1336093 1332704 1330930 1331797 1336785
59240 1336785 1345471 1355125 1362841 1366822 1365697 1358649 1347012 1333993 1321724 1309814 1297533 1285791
59228 1285791 1275958 1268373 1263336 1262046 1264931 1270217 1275749 1281326 1287877 1295498 1304039 1314625 1328546
59215 1328546 1345086 1362240 1379292 1397068 1415956 1435379 1455111 1475424 1495755 1514594 1530976
59204 1530976 1544990 1556786 1566133 1572955 1577250 1578512 1576349 1571602 1565723 1559039 1550697 1540314 1528477
59191 1528477 1515538 1501112 1485074 1467986 1450300 1432153 1414244 1397953 1384183 1372781 1363206
59180 1363206 1354841 1346545 1337109 1326761 1317308 1310141 1304707 1299435 1293499 1287192 1281208 1276093 1271848 1267515
59166 1267515 1261670 1253962 1245759 1238756 1233239 1228305 1223423 1219024 1215528 1212462 1208842 1204204 1199070 1194452
59152 1194452 1190862 1187757 1184065 1179400 1174595 1170751 1167905 1165024 1161309 1156991 1152553 1147740 1141989 1135655
59138 1135655 1129983 1125741 1122664 1120558 1120120 1121898 1125033 1128008 1130436 1133290 1137485 1143067 1149706 1157005
59124 1157005 1164164 1170150 1174546 1177748 1180275 1182480 1184685 1186641 1186768 1183134 1175584 1166101 1156732 1148059
59110 1148059 1139902 1132338 1125437 1118933 1112838 1107551 1102848 1097785 1092294 1087823 1085490 1084463 1083117 1080990
59096 1080990 1078601 1076150 1073534 1071059 1068887 1066293 1062741 1059353 1057871 1058089 1057499 1053948 1047978 1042161
59082 1042161 1038520 1036741 1034695 1030675 1025056 1019420 1014298 1008732 1002277 996188 991882 989359 988172 988947
59068 988947 992448 997707 1002583 1006147 1009345 1013438 1018953 1026149 1035403 1046824 1060233 1075541 1092429
59055 1092429 1109652 1125452 1138863 1150134 1160028 1169318 1178756 1188704 1198629 1207364 1213967 1218169 1220408
59042 1220408 1221757 1223197 1224383 1223697 1220285 1215474 1211363 1208554 1206219 1203812 1201495 1199192 1196577 1194032
59028 1194032 1192483 1192118 1192067 1191401 1189653 1186418 1181407 1175069 1168371 1161812 1155228 1148554 1142203 1136685 1132382
59013 1132382 1129487 1127542 1125360 1122103 1118181 1114395 1110568 1105924 1100460 1094869 1089304 1083317 1077001 1071181
58999 1071181 1066429 1062766 1060207 1058460 1056043 1050997 1043062 1034409 1027751 1024203 1023122 1023312 1024019 1025178
58985 1025178 1026992 1029230 1031159 1032469 1033803 1035715 1037490 1037787 1036309 1034093 1032275 1031284 1031136 1031715 1032641
58970 1032641 1033350 1033430 1032951 1032960 1035711 1043231 1055000 1068124 1080693 1093814 1109093 1125430 1140130 1152220
58956 1152220 1162529 1171106 1176967 1180352 1182860 1184977 1185593 1184515 1183246 1182354 1180144 1175452 1170217 1167543
58942 1167543 1168035 1169606 1170535 1171339 1173503 1177292 1181257 1183678 1184128 1183279 1181411 1178105 1173917 1171115 1171451
58927 1171451 1173893 1176056 1177289 1178636 1180337 1181701 1183576 1188558 1197886 1209983 1222976 1236986 1252870
58914 1252870 1270347 1288669 1307908 1328173 1348440 1367400 1384785 1400896 1415464 1427928 1438289
58903 1438289 1446836 1453549 1458370 1461470 1462653 1461149 1456617 1449687 1440987 1430410 1417888 1404038 1389339
58890 1389339 1373433 1356015 1337773 1319767 1302453 1285907 1270319 1255639 1241386 1227447 1214548
58879 1214548 1203390 1193903 1185847 1179498 1175217 1172939 1172505 1173763 1175918 1177645 1178489 1179382 1181183 1183431
58865 1183431 1185122 1185975 1186363 1186693 1187450 1188975 1190669 1191267 1190677 1190686 1193046 1197569 1202767 1207595 1211890 1216120
58849 1216120 1221629 1230247 1242456 1256497 1270298 1283738 1298135 1314102 1330992 1347974 1364606 1380711
58837 1380711 1396577 1412911 1429811 1446262 1461507 1476390 1492354 1509645 1527567 1546011 1565484
58826 1565484 1585887 1606584 1627480 1648757 1669408 1687392 1701770 1713800 1725369 1737045 1748099
58815 1748099 1757751 1765760 1772100 1776858 1780609 1784460 1789167 1794069 1797256 1797252 1794372 1789864 1783830 1774814 1761652
58800 1761652 1744890 1725785 1704677 1681238 1656007 1630760 1607131 1585257 1563875 1541623 1518267
58789 1518267 1494751 1472017 1450013 1428214 1406832 1386776 1368384 1350984 1333925 1317232 1300876
58778 1300876 1284127 1266295 1247784 1229969 1214168 1200826 1189369 1178889 1169396 1162137 1157979 1155772
58766 1155772 1153513 1151127 1150672 1153351 1157628 1161050 1162808 1163718 1164740 1166586 1169931 1174814 1180218 1185072
58752 1185072 1189195 1192528 1194191 1193352 1190731 1188145 1186532 1185107 1182439 1177842 1171873 1165906 1161172 1157820
58738 1157820 1154902 1151280 1146306 1139742 1131656 1122644 1113717 1105853 1100033 1097406 1098522 1102397 1107304 1112626
58724 1112626 1119043 1126979 1136071 1146349 1158564 1172842 1188124 1203349 1218093 1231784 1243638 1253696
58712 1253696 1262330 1268244 1268922 1264117 1257124 1251178 1246051 1239618 1231292 1222021 1212030 1200619 1187827 1174661
58698 1174661 1162018 1150568 1141112 1133684 1126776 1118829 1110119 1102045 1095067 1088552 1082159 1076054 1070164
58685 1070164 1064501 1059885 1057185 1056127 1055882 1056356 1057821 1059820 1061734 1063972 1067296 1071308 1074934 1078136
58671 1078136 1081847 1086380 1091157 1095899 1100895 1106085 1110919 1115097 1118563 1121069 1122750 1124900 1129026 1135121
58657 1135121 1141777 1147965 1153918 1160394 1167852 1176104 1184108 1190424 1194515 1197021 1198032 1195911 1188991 1177786
58643 1177786 1164230 1149208 1132153 1112766 1091716 1069736 1047262 1024972 1003641 983450 964230
58632 964230 946159 929358 913192 896994 881293 867451 856344 848047 842231 837971 833893 829562
58620 829562 826074 824308 823478 822664 822629 824329 826500 826944 825861 825840 828502 833115 838571 844727 851401 857859
58604 857859 863940 870236 876655 882075 885751 887763 887840 885241 880266 874462 868823 862992 856695 850537 844808
58589 844808 838862 832479 826630 821916 817243 811145 803744 796495 790427 785558 781615 778465 775748 772718
58575 772718 768777 764065 759465 756016 754395 755018 758233 763704 769615 773510 774454 773642 772488 771093 769297
58560 769297 768002 768306 770164 773129 777506 783189 788114 789806 788433 786753 786930 788775 791134 793517 796015
58545 796015 798853 802471 807200 812597 817821 822678 827546 832432 837018 841523 846446 851403 855200 857362
58531 857362 858949 861805 867426 876269 887474 899405 910994 922320 933606 944514 955099 966525
58519 966525 979815 994526 1009496 1024083 1037808 1049929 1060700 1072024 1085317 1099586 1113189
58508 1113189 1126656 1142020 1160086 1180275 1202640 1228011 1256173 1285508 1314327 1341344 1365434
58497 1365434 1386416 1405374 1422574 1435767 1442412 1442898 1439713 1434342 1427265 1420032 1414318 1409099 1401646
58484 1401646 1391456 1380512 1369444 1356374 1340168 1321982 1302536 1280469 1254959 1227921 1202019
58473 1202019 1177948 1154920 1132529 1110946 1090380 1071327 1054409 1039354 1025092 1011402 999302
58462 999302 989256 980079 970285 959689 949307 940419 933869 929480 925987 922266 918508 915462 913008
58449 913008 910456 907769 905431 903668 902815 903572 905614 907064 906873 906563 907889 910168 912066 914452 918670
58434 918670 923283 925828 927058 930055 935656 942218 949574 959404 971501 983388 994271 1005948 1019296
58421 1019296 1033320 1048305 1066124 1086264 1105124 1120658 1134463 1147872 1159252 1166832 1171078 1172558
58409 1172558 1170463 1165054 1158701 1152588 1145249 1136313 1128910 1125966 1126520 1127962 1129765 1132821 1137121 1142373
58395 1142373 1149236 1157960 1167299 1176286 1185308 1193957 1199958 1201835 1200584 1197108 1190331 1179819 1168055
58382 1168055 1157786 1148853 1139683 1130152 1120911 1111532 1101496 1091750 1083467 1076549 1070890 1067524 1066891 1067561
58368 1067561 1068391 1070388 1074807 1080932 1087383 1094052 1101097 1107545 1112531 1116428 1119304 1119757 1116914 1112147
58354 1112147 1107286 1102489 1097157 1091465 1085789 1080062 1074715 1070628 1067340 1063250 1058463 1055156 1054174 1053742
58340 1053742 1052757 1052687 1054746 1057798 1060737 1064454 1069644 1075065 1079753 1084621 1090250 1095588 1100553 1107254 1116768
58325 1116768 1127206 1136814 1146316 1156381 1165697 1173642 1181893 1191063 1198720 1203304 1207144 1212837 1219378
58312 1219378 1224691 1229368 1234949 1241005 1246920 1254187 1263980 1274622 1284239 1293688 1304228 1314854 1324775
58299 1324775 1335821 1349252 1362626 1373148 1381780 1390834 1399837 1407196 1413768 1421367 1429642 1437552 1445893
58286 1445893 1455318 1464071 1470847 1477652 1486730 1497085 1507237 1518790 1533734 1550709 1567621 1585506
58274 1585506 1606048 1627631 1647721 1666820 1686101 1703527 1716525 1726518 1736714 1747360 1757111 1766925
58262 1766925 1778379 1790002 1799415 1807385 1816118 1825696 1835977 1849436 1867705 1887666 1905473 1922282
58250 1922282 1941595 1963301 1985113 2007605 2032754 2059381 2084972 2110384 2138084 2167583 2197225
58239 2197225 2228345 2262808 2298468 2332174 2365293 2401190 2439181 2476160 2512269 2549764 2588185
58228 2588185 2625931 2664622 2706631 2750328 2793036 2836494 2883837 2933501 2982008 3030590 3083099
58217 3083099 3139489 3197392 3257901 3323495 3392546 3462478 3536289 3619151 3710494 3806121 3906109
58206 3906109 4013661 4128174 4246729 4370711 4503782 4644929 4790522 4941355 5100610
58197 5100610 5267116 5438109 5616316 5806326 6006004 6209514 6416794 6632182 6856279
58188 6856279 7087696 7330205 7589088 7862652 8146444 8443416 8760699 9099224 9456483
58179 9456483 9836679 10247641 10690285 11161734 11665739 12208579 12787757 13396895 14038840
58170 14038840 14721094 15441211 16190526 16970171 17789639 18651965 19554881 20504481 21512795
58161 21512795 22584164 23719516 24931611 26239811 27652679 29173166 30817885 32612244
58153 32612244 34568971 36690585 38989274 41482996 44176170 47068851 50183099 53556485
58145 53556485 57214264 61176657 65492486 70240251 75505612 81394588 88064828 95706672
58137 95706672 104501439 114644173 126400093 140080800 155954818 174210945 194972232
58130 194972232 218291940 244242270 273180142 305751794 341980139 379727806 414086914
58123 414086914 438922681 449760168 445747946 429344599 404501372 375009333 343797002
58116 343797002 312865766 283403340 255972798 230763273 207782502 186939449 168098600
58109 168098600 151141656 135977815 122500929 110573600 100055847 90813659 82695128
58102 82695128 75533591 69186284 63548330 58528265 54037522 50007959 46392870 43142478
58094 43142478 40198181 37514653 35066821 32830377 30774499 28877908 27133128 25529092
58086 25529092 24045283 22667011 21390675 20209565 19109083 18079995 17122537 16233496
58078 16233496 15402190 14622616 13896792 13222394 12589066 11990452 11428542 10902959 10406968
58069 10406968 9937188 9496431 9083642 8691088 8314683 7957617 7621011 7300279 6993245
58060 6993245 6702724 6428619 6166309 5914984 5678637 5456880 5243879 5038488 4846063
58051 4846063 4667737 4497192 4330897 4172344 4022944 3877713 3733958 3595740 3465439
58042 3465439 3338667 3212050 3089046 2973576 2864249 2759070 2659844 2567743 2479960 2394657
58032 2394657 2314337 2240937 2172335 2106705 2045603 1989977 1937736 1887724 1841468 1798826 1756757
58021 1756757 1714477 1674871 1638759 1603033 1566618 1532851 1503385 1475066 1445674 1417634 1393020
58010 1393020 1369710 1345664 1322511 1301767 1281694 1260946 1241352 1224186 1207496 1189937 1173386
57999 1173386 1159040 1144625 1128333 1111949 1097349 1083229 1067884 1052011 1036365 1019982 1003108
57988 1003108 988470 977142 966312 953509 939875 926958 913588 898619 883747 870901 859301
57977 859301 847368 835177 823170 811007 799386 790160 782988 774738 763871 752452 742321 732590
57965 732590 722662 714196 707876 701476 693373 684923 677307 669263 660199 652359 647458 644224 641549 640817
57951 640817 642463 643458 641312 637860 636130 635966 635610 635088 634903 633655 630154 626092 623724 622548 620966
57936 620966 619512 619729 621341 623017 624437 625366 624353 620815 616888 614914 614500 614150 614059 614892 615474 614316
57920 614316 612283 611315 611465 611311 610463 609800 610174 612300 616701 622381 627051 630058 633352 638052 642178 643663
57904 643663 643447 643284 642389 638871 633014 626508 619675 611979 604266 597993 592885 587365 580649 572801 563933
57889 563933 555146 548936 546491 545647 543645 540841 539488 539903 540354 540180 540612 542621 545919 550003 554540
57874 554540 558859 562459 565801 569424 572697 574599 575202 575309 575140 574266 572106 567843 560935 552440 544457
57859 544457 537359 529256 519306 509593 502070 495688 488766 482512 479447 479323 479336 478039 476705 476902 478714
57844 478714 481428 484312 486527 487446 487099 485567 482539 478337 474464 471913 469677 466147 461254 456019 450870
57829 450870 445734 440996 437019 433368 429814 427367 426993 427926 428483 427985 426870 425557 424143 422453 419721
57814 419721 415319 410542 408199 409364 412052 414235 416415 419700 423243 425676 427622 430590 434575 438869
57800 438869 444134 451372 459751 467755 475742 485095 495474 505184 513735 521765 528833 533704 536839 540322
57786 540322 544940 549062 550805 549968 547631 544913 542156 538670 533881 529274 527776 529880 532001 530715
57772 530715 527323 525763 527005 528288 527375 524723 521468 518022 515106 513709 513334 512130 509322 505868 502471
57757 502471 498835 495355 493600 494222 495703 495822 493444 488720 482810 477611 474513 473082 471883 470426 469164
57742 469164 467990 466356 464711 464198 464936 466268 468610 473041 478707 482631 482948 480984 479396 479445 480556
57727 480556 481301 480160 476478 471414 467284 465521 465725 466516 466444 464388 460450 456479 454431 454044 453324 451304
57711 451304 448910 446991 445039 442339 439120 436058 433592 431954 430714 428120 422326 413826 405573 400020
57697 400020 396768 393466 388174 380654 372395 365846 362747 362690 363813 364947 366429 368892 372241 376004 379902
57682 379902 383899 388301 393723 400236 406773 412103 416149 419598 422886 426520 431553 438187 444507 448450
57668 448450 450688 453664 457950 461805 464558 468115 474096 481306 487269 491091 493799 496722 500287 503754
57654 503754 505661 505256 503657 502710 502700 502221 500355 497658 494879 492131 489630 487847 486422 484192 480767
57639 480767 477081 474057 471884 470638 470224 469456 466763 462292 457946 454954 452803 450852 449413 448734 448528
57624 448528 449090 451369 455370 460126 465669 473231 482884 493138 503883 517531 535830 557539 580907
57611 580907 606660 636673 671382 710612 755322 805461 856387 899856 929019 941465 938190 921716
57599 921716 895300 862166 824891 785997 748471 714334 682982 652432 622176 593694 568443
57588 568443 546813 529050 515593 505937 498232 490682 482892 475690 470175 466941 465398 463730 460163
57575 460163 454565 448410 443166 439174 435960 432922 429462 424955 419038 411953 404540 397841 392436 388082
57561 388082 384120 380179 376124 371557 366185 360697 356351 353389 350745 347688 344664 341949 338640 334092
57547 334092 329509 326824 326351 326638 326394 325606 324949 324985 325853 326986 327201 325731 323105 320521 318593 317284
57531 317284 316652 316908 317798 318501 318081 315819 311608 306494 302170 299174 296113 291491 285806 280818 277133
57516 277133 273746 269877 265934 262260 257936 251518 242691 232823 224018 217563 213075 209159 204966 200730
57502 200730 196722 192447 187481 182422 178128 174489 170949 167893 166366 166436 166979 167279 167920 169675 172276
57487 172276 174721 176389 177529 178939 181231 184077 186232 186736 186005 185253 184935 184472 183458 182244 181079
57472 181079 179437 176797 173649 171115 169680 168705 167232 165084 163180 162819 164628 168126 172243 176106 179382
57457 179382 182245 185205 188631 192210 195212 197579 200249 203931 207996 211329 214008 217221 221540 226117
57443 226117 229899 232834 235344 237150 237310 235332 231647 226933 221421 215185 208869 203557 199772 196940
57429 196940 194165 191225 188353 185389 181951 178504 176284 175680 175299 173241 169027 163908 159655 157405 157156
57414 157156 157847 158238 158119 158294 159120 159783 159671 159664 160982 163154 164335 163577 161662 159539 157081 153967 150969
57397 150969 149519 150167 151918 153001 152095 148967 144285 138940 133574 128621 124430 121131 118596 116808 116104
57382 116104 116695 118112 119375 119688 118924 117643 116691 116357 115811 113891 110669 107596 105776 104873 104287 104469
57366 104469 106041 108177 109079 107839 104928 101112 96966 93181 90128 87077 82976 78067 73563 69664
57352 69664 65315 60417 56837 56256 57912 59564 60028 59781 59471 58933 57789 56303 55375 55877 57929 60609
57336 60609 62501 62748 61523 59519 57317 55271 53558 52093 50694 49426 48370 46963 44189 39792 34898
57321 34898 30964 28416 26616 24816 22789 20843 19696 20098 22101 24698 26514 26964 26630 26565 27294 28419
57305 28419 29163 29365 29747 30902 32301 32842 32284 31441 30822 29870 27853 24932 21895 19377 17762 17250 17431
57288 17431 17281 16243 14981 14453 14552 14372 13500 12200 10410 7530 3528 -381 -2695 -3042 -2544 -3174 -6671
57271 -6671 -13295 -21006 -26327 -27048 -24461 -22468 -23978 -28315 -32526 -34914 -36493 -38889 -41905 -44096 -45120
57256 -45120 -46162 -48026 -50149 -52003 -54223 -57406 -60683 -62759 -64029 -66366 -70679 -75659 -79297 -81011
57242 -81011 -81933 -83559 -86392 -89631 -91957 -92776 -92627 -92170 -91000 -88071 -83281 -78056 -74078 -71813 -70502
57227 -70502 -69267 -67924 -66773 -65797 -64254 -61298 -56992 -52155 -46951 -40248 -30992 -19634 -7276 6066
57212 20964 36391 49661 59170 66069 72629 80135 89210 100772 114870 129100 139965 146105 149153
57199 149153 151329 153373 155181 157210 160364 164993 170766 177235 183919 190010 194733 198235 201660 205928
57185 205928 210493 213784 215102 215709 217529 221063 225361 230050 236351 245480 256851 268730 280119 291102
57171 291102 301752 311875 321838 332651 344986 358880 374540 392535 412806 434242 455722 477071
57159 477071 498526 519745 540041 559654 580376 604578 633257 664988 697266 729273 762837
57148 762837 800055 840467 881559 921824 962217 1004547 1049524 1096696 1145252 1194408 1243856
57137 1243856 1294269 1346691 1401112 1456457 1512241 1569175 1627464 1685564 1741558 1795118 1847283
57126 1847283 1898833 1949868 2000615 2051601 2102962 2154214 2204748 2254107 2301796 2347209 2389926
57115 2389926 2430044 2468220 2505228 2541219 2575634 2608180 2639594 2670855 2702059 2732847 2763566
57104 2763566 2794810 2826026 2855898 2884108 2911483 2938351 2964311 2989791 3016283 3044543 3073872
57093 3073872 3103232 3131305 3155215 3171390 3178458 3177299 3167658 3147274 3115551 3075244 3028392 2972847
57081 2972847 2905283 2825761 2736651 2638503 2529833 2409946 2279119 2136270 1978861 1805045
57071 1805045 1614134 1405049 1175421 921351 636802 314461 -51239 -463062 -923955 -1439077
57061 -1439077 -2012979 -2647183 -3343605 -4108970 -4953267 -5885330 -6912707 -8044374 -9290771
57052 -9290771 -10662823 -12174249 -13843630 -15691141 -17734161 -19988502 -22472201 -25205686
57044 -25205686 -28211286 -31516998 -35159840 -39183648 -43637635 -48581208 -54086533 -60232219
57036 -60232219 -67099994 -74785235 -83409061 -93115810 -104061609 -116402302 -130267108 -145710319
57028 -145710319 -162670423 -180967853 -200336070 -220486091 -241236693 -262666319 -285081781
57021 -285081781 -308635958 -332787230 -356097638 -376645952 -392743127 -403367574 -408103113
57014 -408103113 -406880738 -399884882 -387633801 -371006152 -351100471 -329023806 -305736951
57007 -305736951 -281986499 -258298973 -235020490 -212385317 -190582510 -169797439 -150224523
57000 -150224523 -132053739 -115438285 -100464856 -87147245 -75438784 -65244605 -56430035
56993 -56430035 -48835723 -42298907 -36667991 -31806874 -27597303 -23941428 -20758995 -17980951
56985 -17980951 -15547530 -13410056 -11528660 -9866842 -8390972 -7074086 -5895335 -4834967
56977 -4834967 -3873555 -2996668 -2196349 -1466619 -800289 -190490 368712 885364 1369853
56968 1369853 1828292 2255386 2635626 2952921 3200909 3386451 3524852 3631697 3718138 3791455
56958 3791455 3856673 3916169 3969671 4016520 4057022 4090607 4114646 4127142 4129338 4123791 4111081 4090271
56946 4090271 4061132 4023470 3975170 3913350 3837053 3747024 3643769 3527790 3400685 3263613
56936 3263613 3115316 2953956 2780511 2598502 2411386 2222691 2037903 1863108 1701380
56927 1701380 1552526 1416272 1293426 1183988 1086481 999537 922172 852148 786032 721600
56917 721600 658969 599256 543307 491532 443443 397379 352061 308234 267428 229552 193252
56906 193252 158210 125329 94982 66973 42110 22018 7345 -2328 -7048 -6758 -3162 289 424
56893 424 -4694 -16118 -33571 -54929 -77755 -101169 -124936 -147646 -167852 -186259 -204336 -221063
56881 -221063 -233598 -241208 -246068 -249957 -252538 -253158 -251791 -247537 -238547 -224500 -207294 -188589 -168710
56868 -168710 -149031 -133571 -126723 -130208 -142758 -161469 -182937 -204557 -225672 -246699 -267039 -285120
56856 -285120 -300578 -314704 -328234 -340161 -349362 -356083 -361294 -365699 -369770 -373658 -376830 -378698 -379534
56843 -379534 -379687 -378480 -375365 -371464 -367831 -362678 -352891 -338266 -321674 -304805 -286540 -265970 -244020
56830 -244020 -221007 -195344 -166065 -134276 -100834 -65246 -28624 4732 31020 50435 65070 75038
56818 75038 78990 77262 72211 66061 60114 55379 52356 50768 50763 53726 60766 71305 84287 99902
56804 99902 118957 141618 168101 199734 237820 281643 328145 372611 409280 433198 443347 443217
56792 443217 437176 427081 413240 396973 380482 365304 352567 343884 340303 341129 345497 354540 370472
56779 370472 394095 424818 462541 507800 560228 618239 679763 741641 798428 843541 872229
56768 872229 882921 876261 854263 820484 779620 736137 693359 653485 617800 587020 561908 543272
56756 543272 531071 524253 522186 525722 536159 553663 577236 605592 637320 670779 704362 736182
56744 736182 762922 780027 784079 774709 753901 724447 689533 652445 615435 579421 545277 514234
56732 514234 486416 460578 436508 416268 401720 392210 386286 384419 388080 396992 409185 423180
56720 423180 438396 453849 467930 478921 484452 481484 468760 448733 425323 400308 373640 346449
56708 346449 321280 299333 279576 260805 242808 225368 207998 191121 175995 162987 151108
56697 151108 139541 128478 118301 109042 100773 93505 86745 80127 74267 69809 66046 61846 57677
56684 57677 55149 54650 54920 54816 53966 51879 48230 44211 41782 41234 41027 40382 40254 41228 42252 42429 42715
56667 42715 44689 48419 52397 55115 56318 57277 59916 64960 70978 76041 79917 83440 86142 86544 84974
56652 84974 84091 85752 88965 91813 93943 96036 98131 99849 101450 103422 105510 107190 108641 110344 112069
56637 112069 113065 113108 112708 112475 112815 114090 116549 120023 123884 127275 129475 130338 130507 130974 132322 134395
56621 134395 136465 137603 137392 136676 137117 139528 143043 146426 149490 152494 154970 156271 156703 156923 156611 155059
56605 155059 152767 151080 150381 149931 149395 149144 149025 148165 146100 142974 138702 133225 127482 122724 118810 114695
56589 114695 110545 107645 106066 104394 102346 101619 103096 104949 104917 103246 102004 102326 103725 105514 107576
56574 107576 109879 112125 113944 115008 115163 114690 114204 114140 114734 116432 119643 123910 127948 130616 131457 130489
56558 130489 128294 126226 125615 126636 128596 131042 133757 136074 137461 138551 140252 142034 142583 142059 141990
56543 141990 142754 142984 141929 140634 140087 139755 138911 138045 137959 138490 138935 139002 138790 138658 139278 140779 141882 141334
56525 141334 140274 141241 144488 147413 148482 149431 152151 155416 156672 155682 154412 154264 155263 157305 160402
56510 160402 163980 167380 170900 175346 180903 187312 194635 202713 210380 216342 220752 225203 231333 239821
56496 239821 250003 259794 266575 269110 268360 266183 263788 261703 260212 259069 257555 255401 252955 250121
56482 250121 246236 241557 237646 235343 233422 230257 226064 222558 221110 221967 224431 227031 228322 228318 228354 229041
56466 229041 229416 228788 228080 228316 228946 228850 228039 227265 226845 226948 228093 230204 231965 232163 230989 229277 227496
56449 227496 226286 226633 228346 229624 229384 228880 229648 231079 231501 230518 228752 226327 223280 220451 218242 215582
56433 215582 212031 209823 211553 216424 221069 223702 225165 226062 225417 222805 219784 218240 218509 219768 221278
56418 221278 222693 223878 224800 225298 225124 224582 224522 225101 225315 224622 224063 224679 225736 225987 225865 226769 228698 230223
56400 230223 230471 229615 227835 225465 223845 224275 226083 227306 227295 227215 228003 229273 230316 230801 230401 228975 227212
56383 227212 226001 225261 224442 223830 224102 225037 226213 228552 233223 239014 242855 243470 242799 243100 244245 244838
56367 244838 244773 245404 247611 250562 252423 252068 250213 248766 248912 250213 251719 253190 254706 256059 257392
56352 257392 259510 262449 264645 264879 264291 264952 267136 269635 272252 276061 281273 286512 290399 292608 293404
56337 293404 293433 293910 295736 298390 300653 302201 303508 304706 305790 307406 310035 312814 314517 315230 315702
56322 315702 315684 314609 313482 314269 317547 322161 326855 330808 333157 333674 333413 333119 331719 328246 324356 322654
56306 322654 323129 323675 323641 324191 325480 326262 326451 327332 328974 330049 330582 332201 335154 337726 339285 341268
56290 341268 344403 347603 350621 355054 361255 366566 368340 367018 364986 364109 365399 369096 373780 377126
56276 377126 378817 381036 385039 389138 391355 392137 392933 393910 394834 396685 400518 405710 410905 415788 420603
56261 420603 424903 428225 431296 435334 440618 446564 452542 458002 462608 466782 471305 476119 480636 485299
56247 485299 491215 497955 503670 508078 513280 520570 528400 534999 541222 548980 558187 567161 575364 584085
56233 584085 594737 607516 621414 634838 646811 658104 670566 685065 701014 718040 736632
56222 736632 756671 776925 796826 817312 838977 860785 881687 902348 924164 947529 972039
56211 972039 997693 1025137 1055410 1089792 1129018 1172274 1217914 1265270 1314818 1366927 1422065
56200 1422065 1482074 1549149 1623371 1703247 1788895 1882432 1984854 2095162 2213386 2341861
56190 2341861 2482183 2633069 2792570 2960318 3136132 3318339 3504899 3694468 3884889
56181 3884889 4072134 4251800 4420175 4573169 4706309 4816832 4903689 4964642 4995938 4996211
56171 4996211 4968158 4914775 4836582 4734583 4613459 4479240 4335371 4183100 4024006 3860122
56161 3860122 3693200 3525861 3361854 3203302 3049359 2899354 2755399 2619982 2493002
56152 2493002 2373385 2261655 2158419 2062064 1970575 1884217 1804001 1729005 1657739 1590748 1529214
56141 1529214 1472289 1418575 1369204 1326494 1290135 1257304 1226167 1196965 1170055 1145091 1121919
56130 1121919 1100434 1079870 1059784 1041177 1025229 1011710 1000098 991235 986184 984278 983755 983487 982861
56117 982861 981278 979266 978739 980636 983655 986691 990776 996900 1003837 1010133 1016434 1023626 1030485 1035751
56103 1035751 1041083 1049324 1060843 1073802 1086922 1100015 1113238 1128022 1147207 1171844 1199308 1226896
56091 1226896 1255808 1289029 1326940 1367896 1411903 1460735 1515431 1576502 1645765 1725251 1814844
56080 1814844 1913136 2019419 2132291 2247355 2358969 2463522 2558965 2642744 2713355 2773118
56070 2773118 2826541 2876097 2921485 2961768 2995850 3021897 3038859 3047960 3050934 3047962 3038918 3024478
56058 3024478 3003524 2971525 2924404 2862391 2787608 2700352 2601353 2495734 2390628 2289769 2193677
56047 2193677 2103724 2022186 1949160 1883085 1823902 1772746 1729363 1692660 1662774 1639685 1621026
56036 1621026 1604271 1589823 1579040 1570821 1563341 1557526 1555230 1555461 1555972 1557147 1560711 1565962 1570912 1575877
56022 1575877 1582460 1590481 1599363 1610766 1625989 1642519 1657174 1670987 1686985 1705036 1723271 1742723
56010 1742723 1765719 1791062 1815550 1839106 1863917 1889785 1914938 1940249 1968183 1998739 2030560
55999 2030560 2064300 2100492 2136194 2168673 2200414 2235369 2272354 2307592 2341612 2377755 2415807
55988 2415807 2453256 2491181 2532609 2576544 2619879 2663656 2710987 2760343 2807640 2853643 2902594
55977 2902594 2954886 3008018 3063424 3125163 3192963 3263730 3338716 3421814 3512000 3605000 3701185
55966 3701185 3804141 3912873 4023646 4138224 4261793 4393941 4530456 4672786 4826356
55957 4826356 4990499 5159749 5334494 5520539 5718609 5924288 6137820 6363558 6600063
55948 6600063 6841691 7090097 7353216 7632682 7923328 8225315 8545190 8884754 9240964
55939 9240964 9617301 10022783 10458993 10920633 11409320 11933455 12493945 13084332 13705980
55930 13705980 14367999 15070559 15803850 16565947 17366265 18209524 19093017 20022319 21012345
55921 21012345 22069691 23191574 24385344 25670663 27059484 28554120 30168950 31932465
55913 31932465 33862244 35958794 38228541 40690093 43353570 46220132 49309588 52663684
55905 52663684 56317131 60295150 64648467 69463503 74835558 80869272 87712292 95546816
55897 95546816 104539220 114847144 126692759 140382528 156245125 174606659 195825375
55890 195825375 220256387 248156658 279693334 314905975 353131405 391940517 426702374
55883 426702374 451860795 463392822 460532235 445490009 421813282 392918234 361520168
55876 361520168 329612498 298533608 269076100 241682981 216606488 193947639 173670839
55869 173670839 155664307 139782919 125837374 113599378 102852280 93416836 85123168
55862 85123168 77796700 71289870 65499591 60339393 55719714 51566615 47832627 44473671
55854 44473671 41435097 38670657 36153861 33859050 31750167 29798722 27994944 26330737
55846 26330737 24787516 23349761 22014426 20777191 19623559 18542370 17534741 16601333
55838 16601333 15733167 14922314 14169216 13472051 12820612 12207777 11635901 11105233 10607005
55829 10607005 10134458 9689956 9274618 8881131 8503416 8143759 7803959 7478609 7163355
55820 7163355 6861157 6574415 6299201 6032993 5780092 5543773 5320391 5106154 4902296
55811 4902296 4708962 4521608 4338203 4162799 3997671 3839091 3684860 3538329 3400710
55802 3400710 3267049 3134455 3007052 2888328 2775672 2666815 2564495 2470088 2379613 2290756
55792 2290756 2207113 2130875 2057910 1984680 1913576 1846859 1781951 1717458 1657397 1604363 1554496
55781 1554496 1504003 1454896 1409725 1366793 1325264 1288824 1259068 1231222 1201731 1174344 1153191
55770 1153191 1135440 1116672 1098255 1083297 1070002 1055217 1040330 1027637 1014644 997923 979278
55759 979278 962510 947195 931038 915307 902563 891648 879870 867686 856719 845945 834434
55748 834434 825059 820723 819401 817455 815415 815957 818549 820610 821957 823887 825880 827254 829839 834783
55734 834783 838627 836683 828821 818344 807078 795211 783958 774389 765058 754172 742576 731543
55722 731543 719685 705452 690797 678902 669969 662439 656468 652850 650330 647400 645207 645598 647914
55709 647914 650527 653476 656429 656264 650240 639905 628423 615883 600717 584032 568627 554948 541696
55696 541696 529550 520663 514878 509412 501990 492078 479946 466815 454957 445528 437380 429696 423907
55683 423907 420988 419050 416102 413062 411395 409977 407310 404614 403324 401433 396024 388101 381411 377472
55669 377472 374910 372579 370134 366494 360871 354516 348804 342721 334979 327205 322003 319116 316675 314983
55655 314983 315639 317947 319781 321440 325174 331197 337308 342302 346702 350279 351732 350930 348981 346170 342102
55640 342102 337546 333740 330169 325346 319491 314089 309195 303539 297130 291506 287532 284933 283801 284639
55626 284639 287087 290220 293705 297271 299916 301298 302935 306251 310419 313879 316736 319722 322182 323323
55612 323323 324220 326131 327967 327875 326299 325082 324582 324104 324004 324768 325208 324332 323822 325685 328522 329375 328449
55595 328449 328569 330303 331089 329266 325981 322935 320907 320498 321593 322049 319570 314944 310954 308215 304770
55580 304770 299693 294162 288685 282032 273562 264311 255357 247157 240642 236685 234382 232010 229719 228941
55566 228941 229275 228589 226492 225042 225455 226589 227267 227716 227946 227006 224745 222377 220487 218266 215430 213036
55550 213036 211545 209802 206859 203420 200586 198350 196111 193813 191980 191211 191782 193223 194582 195643 197033
55535 197033 198250 196866 191399 183961 178179 175283 174182 174407 176434 179545 182038 183555 185028 186400
55521 186400 186622 185882 185599 186100 186405 186391 187086 188796 191026 194222 199406 206003 212237 217799 223901 230500
55505 230500 235786 238787 240387 241271 240885 238808 235300 230253 223529 216453 210874 206476 201144 194247 187429
55490 187429 181806 176679 171557 167254 164249 161885 159924 159130 159745 160918 162041 163088 163600 163166 162876
55475 162876 164288 166894 168804 169897 171835 174691 176220 175009 171915 167859 162792 157591 154315 153462
55461 153462 153170 152032 150415 148212 143977 137554 131094 126033 121361 116354 112690 111969 113045 113705 113478
55446 113478 113108 112678 111896 111031 110167 108686 106627 105329 105665 107014 108910 112030 116299 119650 120285 118904
55430 118904 117412 116587 116265 116553 117495 118490 119213 120126 121231 121610 121161 121425 123544 126596 129004 130308 130607
55413 130607 129695 127917 126521 125936 125006 123049 121144 120049 118426 114803 110038 106117 103612 102038 101690
55398 101690 103126 105421 106870 107226 107730 109053 110519 111313 111376 111110 110999 111445 112378 113229 113679 114056 114705
55381 114705 115550 116538 117709 118480 117756 115280 112029 108972 106330 104291 103333 103387 103829 104684 106549 108938
55365 108938 110172 109578 108342 107447 106325 104564 103503 104833 108530 113078 116809 118442 117640 115853 115316
55350 115316 116319 116779 115306 113186 112252 112392 112514 112535 112876 113080 112509 111556 110943 110650 110639 111541 113375 114671
55332 114671 114264 113056 112665 113188 113566 113362 112850 112062 110912 109687 108486 107037 105833 106183 108112 109542
55316 109542 108981 107795 108319 110759 113526 115568 116700 116576 115135 113474 112670 112333 111777 111751 113226 115139
55300 115139 115301 113205 110231 107387 104729 102823 102844 104848 107474 109682 111572 113239 114098 113837 113065 112429
55284 112429 111615 109706 106438 103052 101660 103282 106520 109001 110214 111689 114101 115786 115078 112644 110179
55269 110179 108033 105723 103883 103855 105586 107298 107170 104583 100337 96525 95445 97433 100369 102215 103215
55254 103215 104591 106244 107312 108097 109554 111301 111869 110881 109558 109121 109776 111121 112490 113138 112984 112887
55238 112887 113383 113796 113443 112797 112291 110994 108042 104658 102994 103312 103943 103787 103342 103361 103839 104329 104198 102794
55220 102794 100332 98149 97005 95834 93494 91029 90551 92346 94783 96766 98538 100274 101637 102737
55206 102737 103918 104581 103822 102376 102277 104260 106898 108563 108900 108073 106022 103103 100371 98698 98250 99011
55190 99011 100851 102905 103908 103613 103117 103385 103994 103703 102022 100017 99513 101196 103519 104201 102913 101467
55174 101467 101142 101268 101147 101668 103606 105796 106666 106421 105938 104734 102149 99584 99120 100366 101061 100562 100359
55157 100359 101162 101870 101810 101824 102492 103067 102856 102193 101548 100932 100426 100032 99044 97070 95575 96638 99989 103032
55139 103032 104079 103918 103974 104661 105973 107948 110049 111583 112994 115105 116951 116404 113472 110880 110559 111424
55123 111424 111539 110608 109227 107431 105370 103986 103575 102857 100805 98426 97501 98318 99750 100805 101164 100899
55107 100899 100592 101066 102290 103203 103241 103267 104437 106983 110579 114928 119286 122398 123667 123649 122910 121410 119510
55090 119510 118311 118148 118003 117416 117772 120398 124281 127085 127759 126796 124499 120647 115821 111693 109585 109571
55074 109571 111045 113215 114768 114012 110345 105413 101958 101105 101161 99696 96604 94268 94665 97388 100961
55059 100961 104748 108445 110866 111002 109789 109126 109373 109457 109178 109491 110376 110389 108900 107175 106646 107585 109855
55042 109855 113323 116924 119049 119651 120473 122369 124065 124532 124785 125968 127210 127137 126362 126720 128685 131105
55026 131105 132949 133956 134020 133311 132795 133426 134946 136300 136970 137145 136971 136533 136228 136342 136520 136293 135850 135628
55008 135628 135635 135796 136475 137826 138996 138850 137345 135575 134588 134553 134825 134460 133050 131411 130966 131992 132975
54991 132975 132184 129540 126575 124904 125053 126248 127072 126740 125902 125700 126113 126126 125506 125165 125442 125414 124549 123780
54973 123780 124042 124865 125476 126238 127763 129341 129648 128594 127283 126354 125433 124149 122825 122079 122204 122918 123473
54956 123473 123340 122964 123366 124824 126576 128050 129497 130979 131671 130888 129073 127149 125515 124180 123197 122507
54940 122507 122100 122648 124917 128102 129986 129478 127862 126833 126600 126878 128244 131043 134082 135967 136958 138110
54924 138110 139381 140091 140492 141236 141888 141555 140588 140067 139985 139588 139244 140315 143064 146147 148188 148626 147211
54907 147211 144287 141642 141375 143461 145766 146871 147543 148847 150184 150191 148736 147004 146030 145886 146122 146421
54891 146421 146749 147157 147590 148114 149198 151260 153631 154697 153689 151809 150801 150938 151342 151821 153086 155174
54875 155174 156940 157526 157476 157996 159725 162573 166181 170093 173790 176923 179584 182351 185982 190807 196385
54860 196385 202164 208466 216048 224505 232056 237484 241341 244425 246005 244700 240456 234448 227546 220149
54846 220149 213173 207707 203727 200323 197253 195116 193858 192215 188948 183941 178066 172716 169371 168679
54832 168679 169854 171583 173377 175335 177113 178419 180234 183995 189368 194258 197453 200036 203629 208385
54818 208385 213427 218241 222732 226636 229750 232408 235123 237995 240806 243244 244659 244098 241122 236292
54804 236292 230487 224031 216960 209823 203691 199192 195770 192031 186990 181071 175714 171943 169516 167631
54790 167631 165928 164354 162469 159690 156153 152739 150174 148499 147342 146279 145052 143892 143496 144312 146080
54775 146080 148422 151348 154480 156289 155228 151701 148059 146465 147276 149375 151336 152198 151865 151003 150155
54760 150155 149017 147000 144282 141684 139735 138538 138221 138635 138816 137911 136751 137374 140586 144829 147919
54745 147919 149239 149802 150795 152547 154540 155930 156088 154904 152758 150541 149724 151519 155229 158189 158467
54730 158467 157328 157731 160518 163502 164553 164165 164239 165430 166787 167517 168096 169437 171413 172676 172351 171854
54714 171854 174113 180204 187552 192690 195433 198822 205087 213344 221547 228890 235382 240592 244208 246990
54700 246990 249873 252585 254123 254139 252898 250300 246019 240438 234423 228177 221255 213876 207308 202475 198822
54685 198822 195145 191211 187822 185398 183346 181236 179786 179774 180490 180593 180540 182523 187174 191841 193600 193078
54669 193078 193560 196799 201506 205878 209693 213455 217191 221029 225723 231710 238339 244648 250078 254040
54655 254040 255809 255526 254356 252971 250725 247046 242634 238291 233500 227398 220548 214390 209196 203845
54641 203845 197682 191515 186482 182717 179507 176264 173085 170644 169658 170155 171237 171732 171038 169162 166244
54626 166244 162518 158739 156145 155642 157013 158938 159877 159136 157286 155516 154592 154420 154437 154054 152841 150830
54610 150830 148867 148263 149771 152980 156703 159663 160804 159597 156544 153232 151457 152048 154340 156576 157011
54595 157011 155179 152308 150235 149767 150247 150646 150571 150086 149123 147595 145965 145193 145874 147545 149078 149858 150321
54578 150321 151000 151364 150377 148317 147079 148050 150447 152491 153550 154216 154867 155353 155770 156259 156170 154717 152569
54561 152569 151551 152369 153687 153813 152419 150309 148463 147683 148240 149333 149669 149087 148924 150412 153384 156801
54545 156801 159733 161441 161414 159910 157845 155749 153578 151770 151495 153272 156154 158775 160435 160764 159495
54530 159495 157273 155677 155510 155873 155734 155513 156199 157853 159993 162531 165077 166223 165126 163199 162547 163088
54514 163088 163057 162244 162613 165095 167621 167559 164912 161909 160269 160131 161157 163249 165989 168360 169486 169226
54498 169226 167889 165824 163564 161986 161827 163045 164823 166150 166358 165411 164074 163662 165084 167944 170929
54483 170929 173136 174632 175682 176101 175842 175640 176339 177832 179236 179948 180020 179774 179584 179781 180151 179817 178274
54466 178274 176300 175137 175084 175654 176669 178076 179105 179014 178720 180097 183273 185925 185973 183881 181631 180404
54450 180404 180070 180106 180107 179891 179786 180429 181795 182847 182594 181089 179145 177595 176937 176992 176785 175573 174206 174453
54432 174453 176720 179512 181561 183203 184947 185968 185189 183052 181175 180761 182007 184313 186358 186834 186027
54417 186027 185858 187437 189391 189770 188829 188614 190294 193250 196558 200093 204028 208218 212244 215531 217474
54402 217474 217924 217319 215973 213671 210404 206933 203973 201383 198807 196595 195355 194997 194809 194052 192135
54387 192135 189018 185965 184907 186278 188332 189366 189573 189823 189977 189750 190086 191912 194322 195738 196227 196973
54371 196973 197999 198320 197976 197945 198095 197152 194836 192266 190105 188060 186517 186791 189087 191807 193616 194856
54355 194856 196253 197503 198011 197935 197711 197353 196948 197117 198421 200856 204161 207906 211139 212956 213750 214930
54339 214930 217150 219751 222169 224634 226972 227963 226717 223875 220694 217761 215277 213907 214520 217384 221904
54324 221904 226663 229666 229557 227087 224577 223526 223517 223710 224202 225286 226499 227327 228056 229181 230648 232436
54308 232436 235035 238487 241680 243512 244152 244281 243856 242592 241037 239971 239164 237825 235992 234402 233295
54293 233295 232497 232464 233924 236363 238058 237988 236759 235219 233077 229569 224974 220782 218465 218326 219378 220116
54277 220116 219623 218119 216451 215118 213941 212501 210560 208198 206009 205077 206112 208366 209968 209766 208608
54262 208608 208378 209924 212258 213690 213409 211987 210663 210319 210939 211844 212438 212741 213214 214123 215266 216287
54246 216287 217007 217325 217105 216494 216112 216436 216977 216529 214465 211491 208996 207988 208698 210759 213381 215716
54230 215716 217477 219038 220731 222348 223546 224309 224544 223656 221266 218185 215956 215221 215033 213970 211683
54215 211683 209225 208024 208565 209983 211059 211657 212747 214787 216694 217084 216302 216358 218756 222976 227251 230260
54199 230260 231784 232181 231768 230723 229305 227899 226785 226090 226179 227790 231064 234492 235774 234238 231692
54184 231692 230277 230102 229742 228409 226637 225241 224690 225327 227014 228494 228158 225846 223153 221633 221330 221344
54168 221344 221227 221340 222088 223057 223005 220927 217378 214332 213252 213634 213959 213624 213155 212939 212779 212553 212325 211796
54150 211796 210662 209513 209373 210144 210469 209580 208450 208614 210345 212306 212770 211173 208891 208230 210068 212828
54134 212828 214559 215550 217580 220838 223234 223089 221038 218718 216981 216207 217125 220099 224261 228267 231418
54119 231418 233429 234000 233499 233360 234689 236778 237991 237894 237567 237887 238447 238336 237282 235586 233318 230140
54103 230140 225993 221632 218051 215391 212908 210275 208302 207788 208187 208289 207911 207936 208855 210357 212322 215093
54087 215093 218498 221695 224247 226405 228117 228904 229077 229843 231604 233220 233683 233477 233510 233655 233338 232831 232910
54070 232910 233649 234430 234914 235321 235903 236612 237085 236802 235707 234757 235198 237087 239278 240946 242195 243023 242969
54053 242969 242241 241889 242180 242099 241256 240964 242307 244411 245839 246577 247217 247357 246567 245998 246984 248503 248092 245317
54035 245317 242439 241431 242012 243019 244034 244873 244853 243717 242523 242568 243738 244648 244402 243718 244179 246509 249864
54018 249864 253065 256302 260851 266915 272721 276485 278514 280448 283022 285725 288229 290805 293253 294656
54004 294656 294582 293725 293051 292910 293207 293900 295129 297189 300337 304317 308232 311329 313681 315711 317526 319367
53988 319367 322132 326552 332116 337771 343418 349751 356868 364215 371859 380535 390245 399929 408879 417449
53974 417449 426054 434495 442820 451852 462121 472883 482830 491346 498596 504925 510749 516564 522488 527910
53960 527910 532038 534625 535957 536347 535899 534511 531902 527782 522147 515246 507328 498730 490157 482290 474935
53945 474935 467057 457928 447904 437983 429113 422232 418395 418108 420536 423826 426337 427509 427701 427470 426950
53930 426950 425655 422735 417682 410967 403965 397971 393175 388779 384152 379510 375166 370639 365273 359517
53916 359517 354584 350656 346427 341037 335666 332377 331832 332909 334226 335304 336334 337509 338708 339635 340345
53901 340345 341594 344075 347167 349368 350493 352385 356446 361325 364496 365654 367028 370337 374954 379415
53887 379415 383358 387264 391279 395249 399440 404496 410708 417664 424517 430586 435923 441429 448126 456233
53873 456233 464996 473373 480820 487773 495567 505346 516607 527307 536041 543664 552124 562171 573090
53860 573090 584199 595515 607175 619351 632718 647871 664070 679577 693441 706056 717855
53849 717855 728512 737786 746097 753700 760046 764481 767006 767921 767362 765605 763230 760486 756919 752034
53835 752034 745938 738962 730932 721097 708690 693679 677304 661591 647601 634327 620107 605078
53823 605078 591143 579397 568718 557440 545370 533432 522095 511008 499770 488363 477114
53812 477114 466784 458330 452081 447263 442606 437177 430683 423574 417145 412671 409913 407018 402529 396984
53798 396984 391850 387374 382429 376331 369895 364424 360268 356783 353474 350765 349538 350013 351215 351591 350147
53783 350147 347050 343417 340637 339454 339207 338229 335579 332328 330623 331461 333859 336176 337655 338581 339458
53768 339458 340341 340729 340132 338962 338663 340380 343614 346715 348686 349957 351497 353798 356757 359962 363078
53753 363078 366403 370896 377109 384400 391904 399797 408535 417178 424042 429150 434680 442601 453000 464999
53739 464999 477805 490282 500960 509570 517520 525862 533744 539924 544835 549881 555334 560286 564313
53726 564313 567870 570968 572532 571415 567503 561819 555816 550358 544978 538438 530340 521723 513623 505697
53712 505697 497020 487680 478649 470341 462219 453805 445298 437119 429461 422352 415755 409607 404188 400325
53698 400325 398717 398983 399710 399426 397369 393614 388957 384559 381272 379149 377771 376858 376280 375673 374540 372854
53682 372854 371303 370720 371159 371593 370765 368548 366201 365043 365192 366005 367225 368866 370407 371248 371816 372907
53666 372907 373857 372901 369979 367730 368683 372425 376570 379668 381975 384037 385822 387232 388559 390406 393463
53651 393463 397942 402824 406346 407952 409204 412105 417062 423147 429577 435950 441639 446146 449943 454116
53637 454116 459257 465242 471588 477407 481683 484533 487556 491883 496403 499110 499718 499581 499365 498453 496834
53622 496834 496011 497255 499790 501373 500277 496550 491855 488244 486687 486704 487579 489466 492685 496448 499180
53607 499180 499978 499009 496797 493973 491480 489935 488850 487433 486051 485966 487570 489803 491298 491317 489804 487607
53591 487607 486551 488061 491567 495237 498257 501240 504465 507201 509071 510726 512553 513900 514166 513607 512572
53576 512572 511041 509538 509331 510909 513151 514760 515680 516401 516919 517276 518222 520222 522537 524443 526833 531360
53560 531360 538212 545656 551671 555263 556643 557162 558991 563696 570740 577950 583674 588066 592293 597044
53546 597044 602043 606676 610870 615360 620904 627144 632571 635882 637083 637116 636925 637295 638949 641972 645266
53531 645266 647275 647298 645797 643601 641224 638791 636156 633281 630775 629700 630345 631554 631879 631124 630071
53516 630071 629006 627384 624865 621786 618499 615046 611637 608683 606128 603486 600859 599155 598863 599285 599493
53501 599493 599476 599691 600017 599945 599557 599531 600298 601838 604177 607298 610491 612686 613803 615186 618182 622720 627689
53484 627689 632294 636538 640708 645171 650586 657540 665665 673682 680713 687345 695087 704938 716709 729497
53470 729497 742511 755526 768910 783328 799239 816515 834533 852655 870642 888676 907076
53459 907076 926080 945980 967392 991039 1017013 1044519 1072731 1101788 1132397 1164461 1196781
53448 1196781 1228348 1259409 1290993 1323962 1358791 1395489 1432930 1468833 1501426 1531097 1559755
53437 1559755 1588827 1618660 1649527 1681759 1714543 1745932 1774981 1803036 1831947 1861600 1890433
53426 1890433 1918025 1945720 1974352 2002682 2029057 2053809 2078765 2104591 2129858 2153110 2174768
53415 2174768 2196102 2216977 2235736 2251280 2264145 2275129 2283731 2288692 2289573 2286977 2281429 2272959 2261890
53402 2261890 2249308 2236174 2222360 2207039 2189954 2171905 2153940 2136342 2118617 2100211 2080912
53391 2080912 2060641 2039365 2017478 1995857 1975009 1954373 1933013 1910942 1889209 1868744 1849852
53380 1849852 1832806 1817966 1804919 1792575 1780924 1771869 1767148 1765864 1765316 1764121 1763348 1764515 1767827
53367 1767827 1772942 1780267 1790339 1802443 1814977 1827291 1840506 1856291 1875360 1897337 1921613 1947817
53355 1947817 1975635 2004781 2035449 2068337 2103701 2140602 2177799 2215494 2255467 2299012 2345339
53344 2345339 2392709 2440759 2490842 2544109 2600147 2657836 2716878 2777888 2841254 2906594 2973519
53333 2973519 3042527 3114533 3189400 3265387 3340587 3414674 3488547 3562250 3634185 3702842 3768576
53322 3768576 3832889 3896436 3958429 4017592 4072721 4122555 4166179 4203893 4236953 4266037 4290322
53311 4290322 4308238 4318813 4322217 4319349 4310929 4296664 4275320 4245997 4209361 4167227 4120930 4070527
53299 4070527 4015660 3956712 3894943 3831806 3768357 3705132 3642355 3580067 3517962 3455437 3392503
53288 3392503 3330739 3272474 3218381 3166460 3113998 3060036 3005241 2950171 2894924 2840203 2787487
53277 2787487 2737914 2691818 2649194 2609690 2572233 2535808 2500849 2468919 2440823 2415851 2392829
53266 2392829 2370805 2348507 2324446 2298195 2270763 2243284 2216126 2189661 2164836 2142281 2121551
53255 2121551 2101816 2082686 2064016 2045770 2028653 2014049 2002632 1993716 1986500 1981144 1977967 1976467
53243 1976467 1976091 1977274 1980710 1986125 1992796 2000931 2011520 2025010 2041017 2059198 2079539 2101867 2125828
53230 2125828 2151403 2178760 2207459 2236314 2264116 2290266 2314889 2338640 2362051 2384671 2405125
53219 2405125 2422425 2436789 2448650 2457478 2462469 2464154 2464205 2463407 2460531 2453527 2441557 2425702 2407861
53206 2407861 2388837 2367324 2341146 2309874 2275819 2241948 2209192 2176420 2142542 2107492 2071362
53195 2071362 2033890 1995305 1956833 1919670 1883928 1849011 1814584 1780647 1746945 1712930 1678353
53184 1678353 1643619 1609529 1576744 1545288 1514404 1483044 1450832 1418553 1387486 1358215 1330306
53173 1330306 1303322 1277869 1255217 1235822 1218636 1202100 1185436 1168686 1151908 1134976 1117997
53162 1117997 1101226 1084518 1067399 1049599 1030911 1010621 987991 963511 938846 915254 892810
53151 892810 871384 851246 832138 812844 792732 773030 755478 740166 725641 710685 694947
53140 694947 678253 660653 643160 627212 613065 599589 585864 572157 559052 546502 534268
53129 534268 522658 512200 502880 494219 485995 478590 472511 467615 462947 457621 451949 447107 443342 439174
53115 439174 433173 426132 420426 417359 416120 415349 414575 413777 412700 411268 409858 408416 405968 401947 397543
53100 397543 394755 394167 394491 394361 393727 393172 392521 390902 388052 384925 382717 381579 380625 379122 377241 375547
53084 375547 374207 373055 372212 372135 373098 374931 377228 379517 381388 382825 384337 386295 388172 389067 389038 389274
53068 389274 390640 392613 394069 394639 394796 395082 395910 397832 401106 404927 407856 409371 410420 412064 414105
53053 414105 415642 416650 418222 421058 424308 426276 425995 423888 421079 418376 415858 413144 409994 406618
53039 406618 403313 399909 396022 392061 389420 388990 389712 389359 386907 383537 381018 379702 378523 376461 373341
53024 373341 369311 364419 359084 354517 351939 351295 351217 350608 349892 350173 351441 352514 352815 353159 354131 354589 352848
53007 352848 348937 344599 341266 339126 338040 338077 338824 339360 339518 340285 342334 344981 347296 349527 352531 356225
52991 356225 359470 361474 362680 364132 366217 368076 368323 366531 363855 361754 360327 358601 356323 354511
52977 354511 354133 355255 357621 360965 364431 366930 368629 370842 373856 376319 377609 379190 382079 384422
52963 384422 383658 380287 377361 376490 376388 375450 373837 372540 371979 372267 373675 376078 378673 380756 382303 383679
52947 383679 385392 387960 391139 393332 392864 390000 386757 384619 383452 382734 382643 383583 385604 388575 391968
52932 391968 394376 394545 393326 393294 395740 399111 401167 401616 401788 402682 404337 406309 407698 407303 404882 401988
52916 401988 400734 401906 404834 408546 412286 415387 417694 419895 422613 425312 426820 426814 426059 425328 424875 424853
52900 424853 425361 425902 425580 424091 422011 419898 417702 415303 413051 411319 409907 408432 407148 406911 408277
52885 408277 410933 413948 416207 416555 414153 409331 403971 400334 399164 399193 398718 397352 396088 396115 397976 401482
52869 401482 405739 409391 411418 411826 411263 410130 408504 406680 405112 403779 402179 400046 397640 395435 394033
52854 394033 394187 396048 398374 399447 398980 398206 397837 397091 395519 394641 396358 400146 403198 403550 402022 400776
52838 400776 400898 401965 403214 404166 404334 403340 401686 400656 400875 401320 400511 398578 397413 398529 401400 404237
52822 404237 405879 406472 406738 407136 407497 407128 405598 403748 403444 405827 410229 415192 419913 424117 427375 429624
52806 429624 431683 433929 434934 432910 428389 423830 420444 417040 412467 407611 404073 402087 400681 399047
52792 399047 396827 393784 390065 386247 382502 378289 373505 369267 366894 366553 367375 368234 367995 365938 362673
52777 362673 359878 358334 357016 354964 353071 352816 353967 355045 355671 356830 358787 360290 360297 359382 358786 358896
52761 358896 359338 359960 361050 362751 364753 366539 367756 368404 368759 369118 369617 370192 370514 369974 368180 365645
52745 365645 363491 362133 360694 358239 355148 352634 351205 350362 349664 349226 349021 348487 347316 346153 345970 346980
52729 346980 348603 350440 352720 355509 357793 358031 355809 352517 350025 348997 348907 349277 350107 351196 351978 352236
52713 352236 352301 352318 352058 351685 351901 352904 353983 354664 355419 356521 357003 355801 353519 352021 352389 354175 356625
52696 356625 359672 363498 367771 371702 374573 376062 376325 375876 375193 374465 373822 373664 374495 376477 379335 382624
52680 382624 386004 389366 392785 396187 399143 401251 402666 403820 404698 404860 404129 402605 400117 396574 392897
52665 392897 390484 389345 387889 385199 382470 381448 382431 384756 388185 392424 395995 397203 396120 394357
52651 394357 392948 391633 390259 389590 390286 391878 393183 393333 392292 390811 389879 389739 389587 388611 387047 385611
52635 385611 384283 382540 380591 379461 379762 381133 382959 384922 386703 387798 387875 386971 385295 383205 381237
52620 381237 379761 378732 378100 378127 378799 379324 378884 377724 376915 377235 378642 380404 381373 380852 379864 380690 384240
52603 384240 388756 392233 395111 398887 402968 405108 404845 404252 405055 407021 409577 412799 415862 416637 414382
52588 414382 411348 410189 410884 411625 411613 411271 410488 408568 405833 403764 403282 404005 405361 407455 410475 413914
52572 413914 416801 418525 419375 420479 422933 426616 430033 431685 431505 430636 430053 429698 428808 426772 423779 420780
52556 420780 418632 417220 415781 414121 412884 412486 412534 412709 413458 415137 417084 418386 419207 420454 422240 423466
52540 423466 423110 421430 419699 418946 418915 418232 415885 412589 410218 409644 409858 409675 409492 410407 412155 413219 412969
52523 412969 412583 413550 416112 419538 423142 426535 429384 431479 432755 432947 431535 428441 424527 421029 418674
52508 418674 417504 417147 416881 415830 413870 412248 412479 414380 415832 415040 412590 410737 410869 412317 413466
52493 413466 413313 411820 409524 407163 405250 403572 401555 399400 398256 398736 399811 400023 399503 399866 402063
52478 402063 405254 408032 410059 411962 414052 415843 416840 417493 419014 422029 425458 427227 426413 424390 423430
52463 423430 424439 426492 428293 429407 430205 431330 433344 436383 440021 443698 446995 449206 449296 447287 445257
52448 445257 445695 448837 452650 455445 457216 458260 458030 456091 453019 449582 445996 442653 440373 438998 436910
52433 436910 433251 429619 428083 428245 427947 426362 424579 423292 422021 420956 421535 424115 426566 426623 424759
52418 424759 423395 423876 425477 427080 428446 429730 430960 432456 434929 438558 442426 445370 447174 448599
52404 448599 450457 452890 455279 456763 457155 457545 459399 462648 465171 464893 462005 458416 455370 452628 449800
52389 449800 447176 444938 442668 440288 438514 437715 437177 436251 435331 434740 433540 430766 427274 424961 424397 424522
52373 424522 424499 424411 424155 423233 422074 422067 423584 425195 425699 425870 427111 429142 430339 430165 430127 432067 436133 440798
52355 440798 444679 448070 452558 459142 467019 474436 480483 485706 491321 498310 506917 516258 524596 530633
52341 530633 534356 536086 535390 532026 527326 523042 519052 514013 508314 504295 502945 502377 500709 498736 498280
52326 498280 499256 500006 499680 498801 498085 498030 499145 501409 503960 506313 509299 513820 519382 524884 530043 534905
52310 534905 538936 542138 546185 552524 559788 565062 567597 569413 572214 575667 579072 582742 586886 590753
52296 590753 593887 596987 600522 603598 605349 606642 609214 613558 618691 623764 628940 634694 641055 647794
52282 647794 654830 662126 669454 676746 684805 695176 708749 724491 740290 755225 770282 786539
52270 786539 803617 820685 838112 857035 877926 900833 926488 955693 987728 1020822 1054268
52259 1054268 1088681 1124079 1159293 1193747 1228332 1263750 1299221 1333704 1367343 1400762 1433828
52248 1433828 1466208 1498451 1531381 1564623 1596684 1626401 1653682 1678977 1702590 1724502 1744508
52237 1744508 1762555 1778963 1793921 1806677 1815829 1820631 1821570 1819606 1815651 1810891 1806389 1801707 1795056
52224 1795056 1785873 1776404 1769516 1765524 1762562 1759634 1757720 1757793 1759359 1761609 1764879 1770128 1777687 1787312
52210 1787312 1799009 1813013 1829162 1846920 1865911 1885961 1906626 1927102 1946774 1965628 1984196
52199 1984196 2003327 2023907 2046331 2069881 2092852 2113630 2131800 2148123 2163444 2177739 2190183
52188 2190183 2199911 2206657 2210797 2212762 2212231 2207972 2198911 2185554 2169832 2153192 2135309 2115306 2093884
52175 2093884 2073166 2054364 2036501 2017932 1998346 1978580 1959068 1939584 1920565 1903717 1890620
52164 1890620 1880971 1872654 1863558 1853171 1842500 1832910 1825287 1820044 1817263 1816489 1816727 1817077 1817426 1818306 1820190
52149 1820190 1823131 1826955 1831437 1836283 1841258 1846397 1851829 1857444 1863132 1869296 1876589 1884840 1892699 1898822
52135 1898822 1903339 1907805 1913661 1920930 1928302 1934254 1938064 1940102 1941404 1942852 1944268 1944087 1940381 1932827
52121 1932827 1923660 1915973 1910827 1906526 1900904 1893590 1885593 1877585 1869602 1861895 1854814 1847986 1840836 1833980
52107 1833980 1828899 1825887 1823545 1820867 1818613 1817696 1817307 1815986 1814014 1813239 1814577 1817003 1819276 1821532 1824587
52092 1824587 1828501 1832577 1836274 1839492 1842241 1844726 1847548 1851118 1854816 1857376 1858330 1858535 1858978 1859638 1860222
52077 1860222 1861696 1866014 1874031 1884405 1895197 1906162 1918808 1934417 1952804 1973174 1995559 2020921
52065 2020921 2050033 2082578 2117412 2153647 2191425 2231496 2273917 2317453 2360576 2402895 2445077
52054 2445077 2487410 2529055 2569016 2607289 2644526 2680701 2714608 2744724 2770368 2791918 2810082
52043 2810082 2825126 2836811 2845078 2850590 2854369 2856761 2856957 2853744 2846719 2836544 2823875 2808257 2788608
52030 2788608 2764954 2739216 2713646 2688671 2663111 2636604 2610833 2587773 2567532 2548917 2531686
52019 2531686 2517128 2506373 2499186 2494673 2492364 2492135 2493763 2497232 2503169 2512471 2525481 2541757 2560471
52006 2560471 2580882 2602542 2625194 2648437 2671601 2694175 2716272 2738271 2759978 2780477 2798893
51995 2798893 2814942 2828681 2840084 2848931 2854774 2856917 2854810 2848594 2838861 2825756 2808679 2787019
51983 2787019 2760790 2730495 2696918 2661333 2625484 2590831 2557814 2525884 2494042 2461446 2428071
51972 2428071 2394966 2363349 2333117 2302721 2270898 2238089 2205758 2174769 2145081 2116638 2089718
51961 2089718 2064284 2039702 2015429 1991508 1968067 1944666 1920715 1896467 1872926 1850427 1827792
51950 1827792 1803569 1777978 1752767 1728878 1705090 1679554 1651980 1623380 1594203 1563939 1532608
51939 1532608 1501397 1471428 1442796 1415282 1389243 1365156 1342777 1321307 1300095 1278862 1257590
51928 1257590 1236470 1215453 1193635 1169801 1144100 1118496 1094832 1072941 1051458 1030099 1010024
51917 1010024 991923 974821 957392 939947 924544 913100 905684 900764 897009 894647 894925 898375 904022
51904 904022 910301 916330 922112 927931 933977 940350 947055 954108 961838 970938 981954 994827 1009167
51891 1009167 1024799 1041714 1059349 1076069 1089424 1097084 1097818 1091854 1080495 1065676 1049817 1035451
51879 1035451 1024176 1015951 1009748 1004777 1000769 997611 995535 995288 996823 997867 995139 987450 976472 964078
51865 964078 950302 934697 918213 902245 886625 870055 852035 833139 813904 794952 777864
51854 777864 764213 753495 743484 733005 723087 715016 708673 703620 700494 700067 701611 703460 704934
51841 704934 706606 708730 710380 710352 708182 704020 698189 691254 684020 676928 669633 661644 653267 645554 639400
51826 639400 635039 632235 630380 628505 626034 623935 624298 628073 633839 639608 645258 652051 660130 667974
51812 667974 674393 679419 682767 683093 680030 675777 673153 672655 672681 672119 671291 670617 669931 669338 669469 670421 671359
51795 671359 671583 671252 670841 670710 671445 673590 676394 677623 675393 669880 662688 655081 647374 639551 631639
51780 631639 623618 615720 608778 603661 600312 597866 595789 594422 594213 594954 596139 597693 599839 602327 604283
51765 604283 604913 604092 602114 599236 595804 592613 590659 590309 590823 590820 589246 586087 582409 579729 579000 579940
51749 579940 581327 581997 581608 580641 579924 580106 581288 583059 585028 587271 590080 593360 596635 599582 602170
51734 602170 604228 605312 605107 603619 600887 597011 592658 588958 586496 584727 582827 580779 579158 578058
51720 578058 576838 574998 572873 571278 570736 571346 573274 576950 582438 588829 594798 599886 604757 610000 615391
51705 615391 620773 626814 633919 640887 645859 648467 649961 651248 651982 651582 649867 646492 641110 634514 628290
51690 628290 622750 616509 608843 601137 595056 590488 586374 582452 578919 575416 571876 569618 570064 572865
51676 572865 576733 581618 588346 596320 603326 607984 611053 613899 616750 619025 620630 622458 625744 630872
51662 630872 636444 640006 640371 638830 637396 636423 634909 632510 629882 627314 624434 621341 618743 616798 614926
51647 614926 612926 611357 610676 610870 611846 613183 613662 612315 610037 608758 608813 608402 606122 602806 600303 599425
51631 599425 599609 599622 598129 594457 589409 584627 580804 577308 573800 571167 570219 570361 570232 569166 567613 566669
51615 566669 567400 569969 573251 576016 578490 581839 586234 590825 595843 603121 613686 626047 637736 647400
51601 647400 654530 658435 658923 657291 655325 653603 651721 649849 649135 650733 654944 660906 666598 669756 669513
51586 669513 666769 662486 656367 647943 638110 628439 619360 610119 600366 590757 581925 573659 565348 556856
51572 556856 548835 542387 538282 536308 535451 534664 533128 530094 525501 520939 518869 520157 523135 525628 527023
51557 527023 527634 527060 524498 520334 516244 513697 512936 513192 513418 513125 513053 514699 518711 524164 529732 534964
51541 534964 539961 544727 549621 555674 563530 572599 581953 591351 600460 607969 612724 615274 617031 618370
51527 618370 618704 617971 616679 614823 612231 609924 609664 611993 616005 621238 628456 638087 649072 659956
51513 659956 670426 681242 693164 706166 719264 731030 740845 749597 758483 767399 775490 783222 792685
51500 792685 805541 821703 840355 861275 884545 909732 935881 961738 985614 1005794 1021610
51489 1021610 1033574 1042097 1046608 1046217 1040489 1029189 1012160 990167 965171 938968 911970 884070
51477 884070 856166 829809 805544 782605 760419 739628 721300 705686 692157 680054 669238
51466 669238 659932 652204 645523 638784 631143 623065 616199 611621 608319 604069 598034 591798 587410 585058
51452 585058 583443 581853 580655 579867 578560 576093 572881 569439 565676 561844 559226 558883 560182 561419 561497
51437 561497 560381 558530 556734 556005 556649 557762 558373 558576 558716 558128 555955 552827 550419 549432 549063 548322
51421 548322 546758 544170 540852 537978 536393 535050 532079 527426 522929 519659 516840 513812 511233 509558
51407 509558 507971 505975 504606 504842 505877 506320 506091 505819 505309 504252 503917 506439 512428 520565 529488 538705
51391 538705 547502 554433 558720 561493 564954 570542 578153 586740 595268 603143 610034 615497 618986 620183
51377 620183 619057 615779 611060 606527 603738 602372 600211 595622 589466 583770 579193 574859 570218 565704
51363 565704 561552 557285 552743 548697 545931 544360 543483 543099 543232 543872 545185 547441 550295 552691 554070
51348 554070 555317 557814 561685 565597 568318 570000 571812 574679 578502 582305 585043 586620 588369 592257
51334 592257 599199 608058 616465 622762 627215 631574 637614 645980 656085 666980 678378 690867 705170
51321 705170 721441 739500 759473 781717 806283 833063 862368 894224 926556 955055 976130
51310 976130 989936 999645 1007809 1014197 1016999 1014905 1007537 994877 977277 955832 932092 907280 881939
51297 881939 856192 830142 804123 778582 753551 728430 702822 677617 654680 635223 618957
51286 618957 604996 592948 582748 574001 566093 558680 551641 544790 537946 531070 524109 517168 511035
51273 511035 506956 505305 504943 504406 503257 501762 499981 498131 497284 498283 500029 500187 497949 494980 493138
51258 493138 492483 492338 493231 496325 501276 506051 509124 510853 512381 514080 515646 517057 518534 519764 519945
51243 519945 518783 516990 515608 515091 515123 514998 514023 511912 509138 506766 505599 505423 505136 503724 501253 499170
51227 499170 499490 503090 508540 513109 515386 516666 519332 524295 530501 536437 541140 543949 544651 544360 545222
51212 545222 548349 552490 555470 556588 556969 557867 559479 561400 563400 565409 567139 568053 567572 565373 561826
51197 561826 558261 556284 556412 557478 557655 556102 553433 550702 548268 545740 542644 538761 534008 528488 522836
51182 522836 518061 514732 512559 511038 510194 510297 511181 512406 513997 516313 519103 521329 522219 522054 521730 521927
51166 521927 522902 524580 526396 527474 527534 527582 529319 533734 540197 546744 551262 552906 552680 552372 552758 553200
51150 553200 553151 553380 555102 558256 561375 563103 563287 562688 562196 562426 563516 564997 566136 566595 566626 566557 566320
51133 566320 565559 564031 561910 559936 559166 560074 561605 561576 558536 553333 548519 546085 545975 546755 547263 547278 546962
51116 546962 546319 545353 544285 543250 542095 540748 539621 539393 540521 543111 546943 551343 555410 558837 562271
51101 562271 566448 571209 575813 579777 582718 583833 582694 580557 579626 580623 582033 582213 581274 580228 579235
51086 579235 577708 575632 573713 572378 571448 570759 570400 570350 570357 570249 570030 569773 569705 570162 571054 571651 571350 570475 569945
51067 569945 570320 571636 573825 576685 579590 581852 583385 584627 585897 587293 588973 591030 593221 595432
51053 595432 598223 602166 606653 610212 612241 613728 615879 618624 620953 622377 623449 624958 627101 629600
51039 629600 632352 635642 639598 643655 646883 648843 649813 650136 649908 649551 650128 652418 655941 659410 661981
51024 661981 663596 664464 664990 666012 668275 671562 674978 678170 681546 685186 688432 691043 694103 699086 706182
51009 706182 714062 721249 727521 734086 742562 753590 766301 779236 791888 805139 820090 836647
50997 836647 853372 868502 880895 890066 895753 897915 897316 895710 894769 894761 894854 894836 895712 898085 900745 901727
50981 901727 900218 896547 890853 883160 874690 867678 863417 861402 860637 860691 860871 859471 854987 847812 840102
50966 840102 834118 831020 830778 832710 836162 840915 846813 853189 859228 864923 871030 878043 885916 894703
50952 894703 904340 913628 920801 925743 930334 935677 940265 942271 942631 944214 948445 954425 961137 968826
50938 968826 978002 988534 1000160 1012779 1025853 1038515 1050672 1063217 1076880 1091775 1108325 1127568
50926 1127568 1150101 1175589 1203786 1235140 1269736 1306484 1344085 1382125 1420471 1458238 1494478
50915 1494478 1529856 1566906 1608549 1656532 1710986 1770963 1835467 1904373 1978410 2058273 2144147
50904 2144147 2235941 2333279 2434996 2539494 2646177 2755803 2868631 2982716 3094763 3202151
50894 3202151 3303336 3396821 3480929 3554609 3617645 3670152 3712521 3745564 3769758 3784589 3789836
50883 3789836 3787518 3781287 3773370 3763124 3749074 3731403 3711674 3690896 3668829 3644813 3618389 3589073
50871 3589073 3556057 3518328 3474944 3425383 3369747 3308513 3242101 3170958 3095877 3017611 2936173
50860 2936173 2851246 2763428 2674370 2585512 2497580 2411593 2329344 2252156 2179988 2112499 2050205
50849 2050205 1993731 1942608 1895800 1852813 1813346 1776525 1741724 1709678 1681459 1656619 1633738
50838 1633738 1612594 1594304 1579270 1566554 1555560 1546752 1540113 1534422 1528985 1524836 1523201 1523855 1526131
50825 1526131 1530560 1538146 1548563 1560471 1573260 1587220 1602297 1618201 1635856 1657206 1682898 1711223
50813 1711223 1740217 1770014 1802122 1836833 1872578 1908287 1945475 1987182 2034943 2087602 2143355
50802 2143355 2202299 2266363 2337218 2415200 2500251 2592946 2694259 2805124 2926586 3059598
50792 3059598 3204140 3359416 3525762 3705581 3901157 4111837 4334439 4566197 4806000
50783 4806000 5052709 5303777 5556162 5807305 6054042 6291222 6512630 6713185 6889511
50774 6889511 7038763 7158356 7247484 7308076 7343278 7355167 7344563 7313155 7265266 7207284 7145567
50763 7145567 7084768 7027441 6974519 6926132 6882219 6842314 6804537 6765073 6719084 6662308 6591850
50752 6591850 6505945 6403598 6284263 6147304 5991909 5818298 5628990 5428056 5219046 5004554
50742 5004554 4787956 4574209 4367859 4170896 3983395 3805773 3639595 3486654 3348115
50733 3348115 3224164 3113584 3014144 2924579 2845963 2779934 2725534 2679074 2637358 2599834 2567164
50722 2567164 2538972 2513947 2491180 2470212 2450130 2429794 2409004 2388545 2368845 2349155 2328360
50711 2328360 2306228 2283601 2261501 2240236 2219298 2198038 2176341 2154535 2132656 2110146 2086733
50700 2086733 2063472 2042442 2025104 2011206 1999573 1989753 1982579 1979313 1980802 1987445 1999211 2015193
50688 2015193 2033651 2053248 2074182 2097832 2125741 2159488 2200839 2250683 2307821 2370103 2437144
50677 2437144 2510764 2592417 2681573 2777514 2881274 2994152 3115051 3240909 3369561 3500744
50667 3500744 3634327 3769017 3903022 4034743 4162358 4283776 4397417 4501974 4594867 4671866
50657 4671866 4729246 4765919 4783065 4782197 4764332 4730737 4683906 4627791 4567269 4506997 4450274 4398892
50645 4398892 4353957 4316392 4286456 4263191 4244706 4228847 4213441 4196077 4173827 4143273 4101141
50634 4101141 4045413 3975890 3893516 3799576 3696056 3586271 3473938 3361457 3249897 3140736
50624 3140736 3036523 2939499 2850585 2770305 2699659 2639200 2588023 2544782 2509377 2482772 2465426
50613 2465426 2456788 2456098 2462699 2475556 2493363 2515363 2541291 2570151 2599816 2628505 2656358 2684810
50601 2684810 2714345 2743443 2770107 2794169 2817598 2842500 2869231 2896611 2923358 2948809 2972689
50590 2972689 2995107 3016986 3039863 3064951 3092671 3123130 3156520 3192912 3232225 3274702 3321046
50579 3321046 3371741 3426375 3483617 3541450 3597522 3650117 3699265 3746445 3792755 3837645 3879548
50568 3879548 3917207 3950123 3978303 4002021 4021135 4033917 4037073 4027983 4007124 3977956 3944548 3909757
50556 3909757 3875384 3843153 3814940 3792141 3775024 3762728 3753982 3747894 3743977 3741503 3739114 3735052
50544 3735052 3727362 3713775 3691920 3660029 3617328 3563695 3499457 3425694 3344233 3256983 3165639
50533 3165639 3072112 2978494 2886136 2795323 2706480 2621028 2540389 2464671 2393263 2326480 2265631
50522 2265631 2211495 2163494 2120557 2082126 2048286 2019458 1996154 1978403 1965184 1954930 1947082
50511 1947082 1942997 1944974 1954283 1970117 1990348 2013134 2037689 2063674 2090559 2118272 2148118 2181904
50499 2181904 2219770 2259783 2300209 2341369 2384624 2430451 2478559 2529089 2582184 2636645 2690496
50488 2690496 2743087 2795396 2848072 2900540 2952590 3005555 3060884 3118469 3177571 3239025 3305390
50477 3305390 3378878 3459917 3547704 3641369 3740352 3844263 3952976 4066676 4185598 4309809
50467 4309809 4439414 4574741 4715936 4862326 5012339 5164038 5315494 5464508 5608234
50458 5608234 5743483 5867409 5977734 6072353 6149097 6206088 6242216 6257198 6251181 6224189 6175825
50447 6175825 6105843 6015543 5908693 5790697 5666750 5541042 5417300 5299078 5189210 5089756
50437 5089756 5002952 4931523 4877335 4840101 4817955 4808896 4811205 4822961 4841757 4864446 4886435 4901688
50425 4901688 4904321 4890126 4856152 4799688 4719096 4615677 4493594 4357684 4211999 4060133
50415 4060133 3905474 3750579 3597255 3447754 3304936 3170619 3044602 2926213 2816319
50406 2816319 2716903 2628904 2551233 2481866 2419342 2363215 2313692 2271102 2235525 2206773 2184578
50395 2184578 2168542 2157858 2151502 2149097 2151311 2158963 2171826 2188768 2209079 2233107 2261358 2293418
50383 2293418 2328446 2366543 2408562 2453580 2496888 2531774 2554159 2565209 2569138 2569215 2566697 2562754
50371 2562754 2559490 2558331 2558633 2558950 2559292 2561319 2566514 2575021 2586397 2600838 2619299 2642511 2670149
50358 2670149 2701111 2734838 2772395 2815852 2866272 2922592 2983028 3047268 3116400 3190468 3267029
50347 3267029 3342933 3416947 3489738 3561452 3630488 3694788 3753134 3804513 3847260 3879976 3902674
50336 3902674 3915673 3917507 3905340 3877634 3835309 3780049 3712884 3635176 3549774 3459983 3367992
50325 3367992 3275271 3183960 3096767 3015821 2942626 2878833 2825943 2784138 2752271 2729203 2714561
50314 2714561 2708266 2709897 2718395 2731648 2746376 2759160 2767683 2770558 2766276 2753333 2731418 2701581
50302 2701581 2664967 2621924 2572285 2515839 2452564 2383281 2310192 2235930 2162001 2088960 2018042
50291 2018042 1951309 1889835 1833047 1780472 1732965 1691287 1654540 1621293 1591660 1566981 1547681
50280 1547681 1532546 1520046 1509453 1500670 1493962 1490010 1489378 1491475 1494668 1497900 1501761 1507387 1514498
50267 1514498 1521215 1526116 1530184 1536214 1546260 1560016 1575877 1592915 1611100 1629926 1647969 1664219
50255 1664219 1679039 1693186 1706460 1718084 1728118 1737690 1747755 1758252 1768648 1778950 1789942
50244 1789942 1802661 1817833 1835677 1855966 1878147 1901569 1925927 1951765 1980374 2012852 2049065
50233 2049065 2087385 2124962 2157884 2181653 2192705 2190194 2176130 2153804 2126437 2097068 2068561
50222 2068561 2042886 2020694 2002060 1987278 1976556 1969486 1965459 1964416 1966688 1972375 1981444 1994193
50210 1994193 2010827 2030432 2050859 2069901 2086487 2100922 2114332 2127744 2141158 2153448 2163591
50199 2163591 2172090 2180640 2190106 2199192 2205439 2207320 2205034 2199537 2191371 2180555 2167072 2151094 2132931
50186 2132931 2113257 2093399 2075000 2059074 2045528 2033581 2022345 2010746 1997261 1980354 1959385
50175 1959385 1935073 1909058 1882950 1857333 1831332 1803457 1773395 1742853 1714173 1688218 1664155
50164 1664155 1641165 1619438 1599185 1579438 1558757 1536997 1515745 1496720 1479891 1463360 1445128
50153 1445128 1424989 1404679 1386298 1370786 1357827 1346618 1336333 1326388 1317005 1309383 1304518 1301685
50141 1301685 1298640 1293619 1286753 1279479 1273047 1267817 1263522 1259751 1256201 1252631 1248706 1244206 1239634 1236200
50127 1236200 1234677 1234460 1234255 1233399 1231809 1229015 1224325 1218007 1211290 1205005 1199199 1194286 1191362 1190757 1191237
50112 1191237 1191501 1191765 1193145 1196125 1200472 1206075 1212920 1220553 1228547 1237417 1248346 1261948 1277925 1295914
50098 1295914 1316189 1339488 1366575 1397934 1433564 1473065 1516145 1562904 1613378 1666835 1721618
50087 1721618 1775462 1826030 1871868 1913347 1952346 1990471 2027619 2062477 2093946 2121544 2144526
50076 2144526 2161236 2169525 2167884 2156299 2136134 2109015 2075821 2036957 1993343 1946531 1897897 1848512
50064 1848512 1800033 1754813 1714506 1678946 1646735 1616502 1587403 1559234 1532702 1509164 1489450
50053 1489450 1473171 1459297 1446914 1435356 1424509 1415386 1409406 1406458 1404553 1402094 1399531 1397926 1396903
50040 1396903 1395250 1392731 1389807 1386092 1380746 1374366 1368949 1365730 1364225 1363777 1364911 1368623 1375089 1383691
50026 1383691 1393886 1405558 1418685 1432829 1447036 1460460 1473187 1486003 1499084 1511499 1522473
50015 1522473 1532495 1542547 1552915 1563391 1573757 1583058 1589406 1592034 1593010 1595131 1598272 1599506 1596980
50002 1596980 1592074 1587345 1583842 1581003 1577856 1573609 1568077 1562248 1557639 1554707 1552772 1551821 1553147 1557612
49988 1557612 1564407 1572336 1581371 1592094 1604535 1618584 1634865 1654118 1676038 1699533 1723859 1748896
49976 1748896 1774786 1802028 1831498 1863567 1897302 1931150 1964178 1996130 2026553 2054567 2079395
49965 2079395 2100715 2118496 2132885 2144092 2152168 2157059 2158871 2157476 2151622 2139108 2118479 2090181
49953 2090181 2055599 2015533 1970279 1920786 1868892 1816530 1765267 1716335 1670423 1627484 1587335
49942 1587335 1550419 1517525 1488969 1464592 1444340 1428102 1414986 1403532 1392801 1382740 1373322
49931 1373322 1364039 1354629 1345714 1337998 1330910 1322599 1311476 1297622 1282548 1267726 1253388 1238629
49919 1238629 1222459 1204676 1186010 1167706 1150936 1136239 1123291 1111275 1099618 1088333 1077701
49908 1077701 1067727 1057975 1047963 1037799 1028451 1021133 1016210 1012928 1010430 1008646 1007673 1006702 1004598 1001713
49894 1001713 1000281 1002428 1008239 1016108 1024428 1032411 1039752 1046384 1052582 1058748 1064881 1070563 1075449 1079480
49880 1079480 1082534 1084166 1083928 1081851 1078494 1074431 1069627 1063449 1055436 1046112 1036818 1028661 1021650 1014855
49866 1014855 1007306 998871 990497 983533 978442 974178 969227 963359 957982 954641 953599 954175 955930 958896
49852 958896 962765 966618 969826 972905 977020 982620 989005 995397 1002109 1010118 1019604 1029594 1039163 1048214
49838 1048214 1056573 1063055 1066404 1066938 1066424 1066375 1067096 1068136 1068629 1067173 1062523 1055009 1046662 1039533 1034355
49823 1034355 1030893 1028596 1026332 1022329 1015430 1006229 996433 987342 979310 972258 966066 960626 956017 952463
49809 952463 949858 947666 945760 944963 946179 949205 952995 956984 961588 967440 974647 982886 991806 1001200
49795 1001200 1011026 1021225 1031332 1040462 1048029 1054463 1060816 1067646 1074604 1081044 1086563 1090851 1093435
49782 1093435 1093955 1092505 1089459 1085038 1079326 1072707 1065934 1059500 1053077 1045974 1038283 1031300 1026455 1023900
49768 1023900 1022432 1020804 1018950 1017927 1018820 1021659 1025255 1028130 1029749 1030732 1031924 1033641 1036008 1039408
49754 1039408 1043994 1049091 1053840 1058296 1063170 1068601 1073861 1078214 1081216 1082171 1080206 1075296 1068562 1061260
49740 1061260 1054015 1047176 1041070 1035595 1030278 1025172 1020918 1017533 1013888 1009053 1003462 998009 992669 986877
49726 986877 980929 976024 972947 971428 970821 970787 971125 971350 970837 969545 968551 969427 972631 976740 980096 983104
49710 983104 987817 994990 1002741 1008853 1013317 1017590 1022184 1026302 1029468 1032267 1035396 1038832 1041898 1043479
49696 1043479 1042365 1038252 1032426 1026770 1022087 1018005 1014209 1010862 1007893 1004954 1002312 1000822 1000558 1000255
49682 1000255 998746 996447 994795 994432 994599 994315 993678 993714 995152 997662 1000427 1003114 1005926 1008935 1011977
49667 1011977 1015316 1019742 1025567 1032010 1038090 1043814 1050058 1057513 1066187 1075628 1085088 1093608 1100492 1105768
49653 1105768 1110040 1113928 1117715 1121110 1123129 1122735 1120040 1116525 1113656 1111577 1109459 1106625 1103037 1099358
49639 1099358 1097037 1097529 1100616 1104137 1106356 1108044 1111158 1115997 1120973 1125046 1128941 1133704 1139304 1145141
49625 1145141 1151091 1157480 1164623 1172754 1181951 1191868 1202014 1212520 1224237 1238007 1254117 1272237
49613 1272237 1291221 1309025 1323508 1333536 1339023 1340343 1338528 1335728 1334221 1334649 1336107 1338069 1341189
49600 1341189 1345908 1351326 1356024 1359116 1359854 1357091 1350086 1339436 1326404 1311620 1295111 1277397 1259891
49587 1259891 1244170 1231195 1221115 1213431 1207320 1202092 1197544 1194074 1192572 1193794 1197232 1200646 1201510
49574 1201510 1199272 1195731 1192849 1190595 1187229 1181297 1173053 1164243 1156779 1151271 1146522 1140695 1133173 1125016
49560 1125016 1117584 1111245 1105732 1101140 1097972 1096464 1096371 1097348 1099154 1101576 1104499 1107991 1111997 1115904 1118669
49545 1118669 1119617 1119175 1118643 1118971 1119750 1119838 1119144 1119253 1121661 1125846 1129849 1132568 1134526 1136486 1138453 1140324
49529 1140324 1142472 1145025 1147405 1149330 1151593 1155037 1159113 1162336 1163947 1164401 1164336 1163796 1162638 1161127 1159809
49514 1159809 1159121 1159291 1160466 1162812 1166521 1171713 1178215 1185474 1192775 1199761 1206908 1215481 1226551 1239654
49500 1239654 1252648 1263464 1271976 1279624 1287317 1294440 1300075 1304278 1307642 1310222 1311617 1311856 1311629 1311765
49486 1311765 1312794 1314817 1317447 1320100 1322649 1325544 1328962 1332218 1334530 1336228 1338740 1343368 1350295 1358715
49472 1358715 1367681 1377064 1388012 1402264 1420582 1441948 1464703 1488403 1514131 1543017 1574820 1607978
49460 1607978 1640508 1670547 1696403 1716709 1730944 1739874 1745315 1749191 1752625 1755900 1759255 1763420 1769144
49447 1769144 1776184 1782885 1786805 1785892 1779318 1767511 1751552 1732666 1712290 1692166 1673653 1656697
49435 1656697 1639971 1622482 1604764 1587892 1571610 1554417 1536029 1519007 1506802 1500147 1496277 1492059
49423 1492059 1487102 1483138 1481211 1480676 1480660 1481060 1481764 1482214 1482374 1483063 1484434 1485019 1483443 1480524 1478415 1478005
49407 1478005 1478366 1478626 1479109 1480417 1482461 1484857 1487496 1490315 1493009 1495321 1497230 1498777 1500093 1501507 1503140
49392 1503140 1504523 1505235 1505653 1506258 1506379 1504760 1501454 1498157 1496417 1496374 1497302 1498342 1498594 1497814 1497372 1499255
49376 1499255 1503592 1508491 1512976 1518643 1527398 1538838 1551207 1563745 1576494 1588689 1599344 1609130
49364 1609130 1619773 1631455 1642466 1651790 1660463 1669575 1678228 1684573 1688157 1690197 1691914 1693648 1695611
49351 1695611 1698616 1703550 1710511 1718952 1728610 1739912 1753366 1768896 1786139 1805172 1826570 1850727
49339 1850727 1877421 1905805 1934455 1961661 1986479 2009486 2031807 2053342 2072858 2089939 2105705
49328 2105705 2120896 2134230 2143576 2148200 2148950 2146763 2141948 2134673 2125124 2113275 2099335 2084466 2070305
49315 2070305 2057628 2046030 2034919 2024255 2014259 2004994 1996442 1988629 1981576 1975349 1970038 1965375 1960497
49302 1960497 1954574 1947623 1940313 1932965 1925105 1915990 1905243 1893023 1879939 1866801 1854170 1842134
49290 1842134 1830729 1820371 1811533 1804121 1797601 1791854 1787501 1785250 1785145 1786614 1789157 1792804 1797859 1804366
49276 1804366 1812134 1821295 1832168 1843968 1854029 1859247 1858416 1852454 1842422 1828500 1811292 1792963
49264 1792963 1776072 1761726 1749554 1738944 1729466 1720396 1710604 1698983 1684884 1668706 1652396 1638514
49252 1638514 1627990 1619242 1610244 1600950 1592854 1586732 1581913 1577583 1573740 1570770 1568884 1568122 1568325 1569091
49238 1569091 1570232 1572182 1575438 1579759 1584355 1588592 1592044 1594247 1595099 1595150 1594857 1593984 1592455 1591276 1591539
49223 1591539 1592867 1593954 1594486 1595347 1597091 1599449 1602451 1606699 1612228 1618306 1624887 1633087 1643505 1654991
49209 1654991 1665816 1675268 1683333 1689706 1694271 1698072 1702409 1706851 1709242 1708241 1705232 1703186 1704081 1708012
49195 1708012 1714282 1722221 1730812 1738751 1745802 1753268 1761928 1769873 1773830 1772703 1768511 1763590 1758323 1752114
49181 1752114 1745010 1737285 1728709 1719545 1711255 1704965 1700156 1696281 1694743 1697415 1703761 1711301 1718829 1727465
49167 1727465 1738480 1751641 1765878 1780160 1793572 1805993 1818996 1834710 1853362 1872988 1891674
49156 1891674 1908897 1924717 1939212 1953072 1967248 1981506 1994693 2006934 2020201 2036108 2054488
49145 2054488 2074764 2097258 2122203 2148703 2175746 2203360 2231851 2260826 2289788 2318724 2347302
49134 2347302 2374453 2399709 2424023 2448309 2472104 2494759 2517130 2540740 2565697 2590566 2614071
49123 2614071 2636178 2657978 2681261 2707657 2737296 2768670 2800552 2833577 2869278 2908345 2950702
49112 2950702 2996563 3046088 3098247 3151087 3202779 3251462 3294506 3329409 3355695 3375112 3389899
49101 3389899 3401573 3411291 3420315 3429721 3440143 3451937 3465093 3479025 3493028 3507120 3522104 3538822
49089 3538822 3557756 3579138 3602949 3628723 3655711 3683285 3711113 3739247 3768364 3799685 3834196
49078 3834196 3871915 3911920 3952880 3993665 4034004 4074661 4116415 4158793 4200547 4241491 4282855
49067 4282855 4325476 4368888 4412855 4458526 4506843 4556725 4606309 4655650 4706975 4762513 4822987
49056 4822987 4887977 4956869 5029915 5109387 5199368 5303383 5422616 5557544 5710943 5887909
49046 5887909 6092314 6322703 6569680 6816387 7045201 7249851 7441951 7640136 7846997
49037 7846997 8036400 8166950 8211138 8173586 8083437 7970443 7846333 7704453 7533375 7330361
49027 7330361 7104451 6870224 6640458 6423360 6223522 6043287 5883295 5742737 5619633
49018 5619633 5511427 5416177 5333335 5262610 5201847 5147041 5095215 5046651 5003474 4966517 4934416
49007 4934416 4905367 4878634 4854241 4832120 4811989 4793538 4776305 4759641 4743187 4727352 4713096
48996 4713096 4701162 4691386 4682716 4674054 4665356 4657811 4652621 4649428 4646160 4640587 4631938 4620896 4608357
48983 4608357 4594669 4580079 4565334 4551333 4538356 4525943 4513487 4500650 4487444 4474527 4463503
48972 4463503 4456229 4453312 4453455 4454590 4455540 4456467 4457956 4459856 4460906 4459546 4455494 4450466 4446738 4444769 4442949
48957 4442949 4440082 4437312 4436833 4439187 4442754 4445751 4447932 4450372 4454328 4460424 4468309 4476839 4484934 4492373
48943 4492373 4499663 4507266 4515124 4522599 4528592 4532191 4533732 4534835 4536759 4539058 4540464 4540536 4539531 4537122
48929 4537122 4532502 4525655 4517239 4507234 4495180 4482093 4470573 4462149 4455637 4449094 4442309 4436284 4431184
48916 4431184 4426363 4421900 4418474 4415818 4412830 4409508 4407239 4406473 4405437 4402383 4398293 4396020 4397112 4400842
48902 4400842 4406381 4414408 4425863 4440229 4456161 4473225 4491991 4512702 4534950 4558565 4583716 4609956
48890 4609956 4636261 4662569 4690410 4721327 4755307 4791342 4828875 4867894 4908251 4949837 4993106
48879 4993106 5038531 5085810 5134568 5185645 5240588 5299824 5362273 5426944 5493936 5563659 5636055
48868 5636055 5711114 5789319 5870952 5955553 6042633 6132228 6224036 6316634 6408567 6499995 6592210
48857 6592210 6685440 6778059 6868302 6955956 7041697 7125388 7206038 7283342 7358175 7431018 7500631
48846 7500631 7565239 7624849 7681440 7736512 7789051 7836461 7877214 7912293 7944290 7975384 8005862
48835 8005862 8034230 8058880 8079772 8098127 8114379 8127180 8134974 8137925 8137401 8134005 8127157 8116482
48823 8116482 8102455 8085256 8063977 8037592 8006236 7970901 7932161 7889749 7843307 7793057 7739600
48812 7739600 7683196 7623476 7559823 7491982 7420277 7345513 7269015 7192500 7117054 7041924 6965094
48801 6965094 6885827 6806288 6729833 6657869 6589094 6521761 6455794 6392517 6333023 6277371 6225052
48790 6225052 6175800 6129897 6087899 6050174 6016806 5987826 5963206 5942625 5925667 5912385 5903111
48779 5903111 5897575 5894901 5894879 5898386 5905873 5916253 5928209 5942005 5958936 5979489 6003151 6029582 6058527
48766 6058527 6088659 6117852 6144904 6170093 6194116 6217654 6241937 6268278 6296618 6325627 6354604
48755 6354604 6384151 6414537 6444661 6473344 6500758 6527874 6555216 6582747 6610275 6637494 6664293
48744 6664293 6691387 6719888 6749928 6780629 6811778 6844303 6878435 6912617 6945268 6976649 7007808
48733 7007808 7038433 7066973 7092476 7115113 7135109 7152212 7166262 7177540 7186545 7193749 7199235 7202126
48721 7202126 7200888 7194848 7184959 7172436 7157099 7137722 7113514 7084452 7050647 7012288 6969875 6923653
48709 6923653 6873153 6818310 6760708 6702551 6644179 6583559 6518474 6448750 6376397 6304315 6234861
48698 6234861 6168824 6105332 6043070 5981692 5921877 5864376 5809720 5758712 5712395 5671258 5634761
48687 5634761 5601632 5570435 5540278 5511631 5486199 5465309 5448524 5434529 5423118 5415338 5411752 5411676
48675 5411676 5414368 5419866 5427969 5437217 5445789 5453220 5460622 5469338 5479784 5491461 5503625 5515928 5528649
48662 5528649 5542459 5557925 5575158 5593706 5612525 5630255 5646015 5660066 5673403 5686591 5699273
48651 5699273 5710793 5720785 5728861 5734201 5736030 5734437 5730357 5724755 5718237 5711504 5705653 5701573 5699225 5698015
48637 5698015 5697814 5698983 5701143 5702619 5701875 5699373 5697326 5697601 5700314 5704386 5708745 5712943 5717382 5723260 5731616
48622 5731616 5742131 5753538 5765668 5780293 5799211 5822088 5847125 5873601 5902934 5937346 5978220
48611 5978220 6025779 6079664 6139447 6204585 6273548 6342557 6405500 6455776 6488298 6499533 6486367
48600 6486367 6446449 6380186 6291649 6186730 6070521 5946658 5818699 5691126 5568435 5453287
48590 5453287 5345987 5245969 5153433 5069018 4992233 4921329 4855118 4793978 4738320 4686811 4637243
48579 4637243 4588798 4542288 4498275 4456195 4415536 4376667 4339787 4303922 4267826 4231394 4195434
48568 4195434 4160391 4125978 4091773 4057511 4022973 3988428 3955185 3924738 3897077 3870594 3844088
48557 3844088 3818164 3794032 3771655 3750181 3729837 3712099 3697695 3685504 3673844 3661915 3649415
48546 3649415 3635752 3620639 3604879 3589567 3574878 3560491 3546735 3534265 3522942 3512076 3501636
48535 3501636 3492149 3483602 3475505 3467711 3459846 3450157 3436766 3420326 3403726 3388482 3373003 3355170
48523 3355170 3334976 3313485 3290753 3266470 3241699 3218172 3196209 3174763 3153375 3132992 3114888
48512 3114888 3099544 3086384 3074021 3061166 3048002 3036133 3026552 3018360 3010252 3002361 2995325 2988285
48500 2988285 2979301 2967545 2953752 2938675 2922455 2905611 2889345 2874449 2860730 2847690 2834974
48489 2834974 2822004 2808105 2793435 2779330 2767331 2757953 2750217 2742017 2731285 2717448 2701817 2686288
48477 2686288 2671859 2658547 2646140 2634433 2623101 2611866 2600657 2589617 2579610 2572656 2570593 2572789
48465 2572789 2576552 2580587 2586634 2596523 2608960 2620513 2628341 2630321 2624207 2609512 2589675 2569677 2551336
48452 2551336 2532980 2513628 2495120 2479736 2467992 2459554 2454419 2452236 2451960 2453182 2456633 2462741 2470811
48439 2470811 2480185 2490856 2502043 2511199 2515455 2513667 2506642 2495922 2482588 2466640 2447486 2425653
48427 2425653 2403726 2384515 2368301 2352973 2336844 2320199 2304167 2289477 2276463 2264935 2253665
48416 2253665 2241164 2227344 2213559 2201011 2190075 2180888 2173194 2165712 2157262 2148648 2141926 2137622 2134257
48403 2134257 2130792 2127852 2126063 2124702 2122613 2119274 2114669 2109300 2104349 2100427 2096193 2089841 2081923 2074886
48389 2074886 2069716 2065002 2059421 2052948 2045339 2035784 2024687 2013562 2002483 1989861 1975507 1961566
48377 1961566 1949444 1938122 1926515 1915143 1904254 1892746 1880495 1869515 1861201 1854360 1847360 1840102
48365 1840102 1832384 1822841 1811589 1801760 1795950 1792664 1788473 1782308 1775705 1770165 1766142 1763332 1760272 1755082
48351 1755082 1748219 1742867 1740952 1740636 1739527 1738310 1738868 1740694 1741724 1741286 1739833 1737181 1733505 1730853 1731177
48336 1731177 1733771 1736770 1739933 1743895 1748121 1751981 1756551 1763036 1770692 1778578 1787852 1799888 1813475
48323 1813475 1826520 1839170 1852723 1866941 1881146 1896587 1914824 1935050 1955984 1979209 2007711
48312 2007711 2042036 2080418 2121370 2163421 2203884 2240895 2275367 2308361 2338630 2365893 2394145
48301 2394145 2427722 2465984 2505935 2548108 2595471 2648336 2705323 2768014 2839702 2920519 3008572
48290 3008572 3105011 3213265 3334382 3467816 3615435 3779627 3958777 4150008 4355280 4579754
48280 4579754 4825984 5095390 5393563 5728535 6106744 6537231 7036242 7620176 8298496
48271 8298496 9082846 9998216 11074293 12331575 13788114 15470411 17400269 19585346
48263 19585346 22050927 24853602 27975010 31147563 33833064 35468368 35786570 34916960
48255 34916960 33211833 31018555 28587528 26093610 23660286 21359458 19222972 17266495
48247 17266495 15497484 13910739 12494305 11240567 10143457 9189182 8359382 7640468
48239 7640468 7021689 6487579 6020974 5611457 5253682 4939748 4660346 4411497 4193196
48230 4193196 4002413 3833246 3682633 3550243 3433717 3329299 3236216 3155483 3085176 3021570
48220 3021570 2964086 2914482 2871871 2833174 2798132 2769485 2748144 2732076 2719928 2712029 2707700 2705117
48208 2705117 2704167 2706489 2712462 2720706 2730083 2739269 2744669 2742018 2730498 2712877 2691753 2668237 2644116
48195 2644116 2622218 2603798 2587546 2571574 2554890 2537185 2519047 2502069 2487039 2472596 2457370
48184 2457370 2442342 2428897 2415862 2401374 2386681 2374534 2364146 2351422 2334701 2316924 2301191
48173 2301191 2287161 2272999 2258138 2242583 2225610 2206768 2186641 2165453 2142324 2116876 2090248
48162 2090248 2063579 2036691 2008961 1980283 1950467 1918852 1885184 1849977 1813664 1776440 1739042
48151 1739042 1702319 1665776 1628054 1589236 1551330 1516004 1483203 1452309 1423133 1395282 1368126
48140 1368126 1342053 1318317 1296934 1276246 1255353 1235449 1217731 1201447 1185355 1169929 1156547
48129 1156547 1145284 1134962 1125024 1116013 1108275 1101260 1094257 1087179 1080447 1074442 1069052 1063701 1057955
48116 1057955 1052137 1047090 1043426 1041369 1041017 1042074 1043498 1044222 1044181 1043879 1043248 1042012 1040970 1041404 1043027 1043976
48100 1043976 1043426 1042807 1043700 1045789 1047856 1049680 1051834 1054498 1057692 1062016 1067797 1073750 1077781 1079301 1079914
48085 1079914 1081598 1084767 1088242 1090703 1091946 1092820 1094085 1095568 1096820 1098332 1101269 1105755 1110301 1113574
48071 1113574 1116121 1119535 1124339 1129590 1134517 1139589 1145513 1151764 1156788 1159723 1161506 1164004 1168403 1174813
48057 1174813 1183104 1193183 1204235 1214715 1223885 1232775 1242807 1254087 1266050 1279205 1294796 1312849
48045 1312849 1332054 1351826 1373066 1396316 1420373 1443628 1465937 1488331 1511536 1535591 1560605
48034 1560605 1587104 1615602 1646082 1677797 1709644 1741132 1772782 1804891 1836119 1864418 1889613
48023 1889613 1913987 1939839 1967372 1995257 2022141 2047005 2069332 2089861 2110242 2130942 2150396
48012 2150396 2167273 2182657 2198535 2214834 2229640 2242167 2253875 2266364 2279502 2292043 2303054
48001 2303054 2312347 2320402 2328353 2337138 2346089 2352991 2356162 2356022 2354131 2351235 2346944 2340768 2332511 2321731
47987 2321731 2307798 2290861 2272066 2252321 2231299 2208269 2183621 2158762 2134452 2109859 2083496
47976 2083496 2054524 2023009 1989639 1955664 1922436 1890290 1858203 1825147 1791324 1757436 1723474
47965 1723474 1689306 1655908 1624418 1594045 1562581 1529534 1497253 1468134 1441947 1416965 1392686
47954 1392686 1369975 1349093 1329100 1309333 1290391 1273252 1258032 1243996 1230493 1217601 1205833
47943 1205833 1195253 1185088 1174552 1163961 1154517 1146927 1140840 1135736 1131595 1128323 1125276 1121918 1118413
47930 1118413 1115030 1111450 1107250 1102705 1098652 1095850 1094691 1094857 1094852 1092705 1087933 1082253 1077696 1074530 1071674
47915 1071674 1068379 1064480 1059655 1053802 1047991 1043844 1041850 1041102 1040672 1040311 1039851 1038926 1037560 1036269 1035377
47900 1035377 1034899 1035155 1036756 1039704 1043137 1046243 1048976 1051825 1055465 1060739 1068416 1078778 1091745 1107170
47886 1107170 1124346 1141538 1157088 1171282 1186161 1203108 1221463 1239927 1258359 1277345 1296692
47875 1296692 1315386 1332816 1349218 1364962 1380049 1394324 1407597 1419370 1428807 1435219 1438539 1439431
47863 1439431 1439046 1438416 1437678 1435899 1431903 1425178 1415828 1404062 1390324 1375765 1361738 1348517 1335188
47850 1335188 1321336 1308182 1297287 1288468 1279970 1270712 1261314 1252625 1244327 1235809 1227679 1221412 1217887
47837 1217887 1217085 1218791 1222528 1227039 1231107 1235028 1240283 1247533 1256046 1265284 1275786 1287874 1300589
47824 1300589 1312754 1324260 1335547 1346627 1357475 1368602 1380263 1391651 1401821 1410822 1418928 1425470
47812 1425470 1429653 1432107 1434124 1435487 1434456 1430055 1423141 1414860 1405155 1393342 1379404 1364082 1348180
47799 1348180 1332099 1315750 1298834 1281612 1265288 1251017 1238576 1226748 1214961 1203727 1193339
47788 1193339 1183167 1172766 1162899 1154838 1149030 1144965 1142006 1139927 1138858 1139140 1141194 1145253 1151076 1157899
47774 1157899 1164717 1170921 1176816 1183263 1190587 1198187 1205474 1212639 1220041 1227426 1234432 1241313 1248292 1254679
47760 1254679 1259641 1263528 1267402 1271611 1276023 1281219 1287943 1295420 1302014 1307934 1315627 1326795 1340443
47747 1340443 1354700 1369231 1384806 1401572 1418922 1436283 1453016 1468256 1481775 1494356 1506418
47736 1506418 1516939 1524640 1529498 1532076 1532143 1529315 1524613 1519939 1516033 1512067 1507343 1502336 1497915 1494408
47722 1494408 1491669 1489470 1487686 1486448 1485999 1485997 1485359 1483361 1480560 1477876 1475150 1471440 1466359 1460043 1452080
47707 1452080 1441788 1429669 1417406 1406077 1395387 1384979 1375416 1367268 1360226 1353925 1348896 1345798
47695 1345798 1344193 1342931 1341552 1340579 1340566 1341584 1343704 1347450 1353552 1362480 1374242 1388359 1403988 1420293
47681 1420293 1436851 1453703 1471134 1489522 1509270 1530656 1553599 1577539 1601582 1624980 1647729
47670 1647729 1670586 1694211 1718234 1741509 1763237 1783387 1801881 1817948 1830767 1840349 1847251 1851635
47658 1851635 1853164 1851742 1847701 1841041 1830994 1816697 1798190 1776666 1753997 1731959 1711390 1691735
47646 1691735 1671681 1650499 1628663 1607158 1586772 1568242 1552362 1539170 1527557 1516642 1507346
47635 1507346 1501552 1499657 1499988 1501032 1503245 1508075 1516064 1526669 1539324 1553802 1570014 1588308 1609612
47622 1609612 1634294 1661013 1687546 1712786 1737149 1761062 1783907 1804601 1822521 1837630 1850343
47611 1850343 1861429 1871373 1879507 1884344 1885089 1882446 1877665 1871234 1862720 1851407 1836720 1818422 1796895
47598 1796895 1773227 1748779 1724495 1700434 1675892 1650357 1624652 1600815 1580364 1562976 1547438
47587 1547438 1533306 1520709 1508881 1496412 1483200 1471009 1461535 1454861 1450221 1447237 1445690 1444989 1444761
47574 1444761 1445460 1447606 1450888 1454646 1458732 1463206 1467587 1471229 1474222 1477382 1481527 1487129 1494298 1502525
47560 1502525 1510688 1517800 1523588 1528109 1531269 1533066 1533686 1532766 1529044 1521393 1509990 1495971 1480245 1463002
47546 1463002 1443982 1422777 1399369 1374751 1350302 1326026 1300256 1272081 1243335 1217048 1194292
47535 1194292 1173800 1154407 1136432 1120431 1105843 1091569 1077251 1063380 1050529 1038849 1028155
47524 1028155 1018357 1009832 1003193 998449 994533 990018 984244 977613 971134 965859 962302 959950 957705 955129
47510 955129 952727 950681 948070 944058 939063 933868 928339 922203 916487 912662 910471 908054 904346 900135
47496 900135 896500 893346 889896 885651 880451 874447 868454 863563 859990 856943 853949 851536 850125 848917
47482 848917 846538 842628 838396 835691 835520 837195 838958 839727 839995 840639 841374 841275 840472 840174 840952 842070 842772
47465 842772 843227 843882 844828 846222 848362 850773 852004 851060 848658 846604 846383 848500 852410 856518 858835
47450 858835 858417 856082 853509 851869 851360 851495 851645 851757 852677 855301 859390 863777 867670 871004 873633 875288
47434 875288 876481 878215 880404 881736 881669 881413 882209 883798 885525 887911 891911 897272 902781 907612 911487
47419 911487 914164 916076 919003 924762 933174 942293 950571 957837 964327 969889 974418 978233 981731 985262
47405 985262 989312 994158 999207 1003352 1006109 1007927 1009404 1010845 1012614 1015192 1018580 1022182 1025521 1028692
47391 1028692 1031961 1035319 1038623 1041886 1045357 1049604 1055560 1064048 1075030 1087536 1100508 1113652 1127555
47378 1127555 1143052 1160372 1178701 1196855 1214607 1233156 1253969 1277278 1301984 1326656 1350143
47367 1350143 1371459 1389819 1404992 1417372 1427670 1436598 1444504 1450948 1455021 1456471 1456160 1454742 1451344
47354 1451344 1444490 1434230 1422356 1410326 1397922 1384271 1369328 1353726 1337831 1321704 1305750
47343 1305750 1290677 1276831 1264001 1251951 1240869 1231289 1223691 1218116 1214063 1210863 1208299 1206810 1206943
47330 1206943 1208548 1210593 1211953 1212684 1214571 1219978 1229700 1242042 1254401 1265601 1276308 1287455 1299066
47317 1299066 1310740 1322359 1333771 1344309 1353235 1360443 1366203 1370424 1372668 1372721 1370667 1366425 1359741
47304 1359741 1350671 1339725 1327444 1314086 1299604 1283535 1265112 1244202 1222197 1201140 1181567
47293 1181567 1161984 1141123 1119974 1100545 1083037 1065607 1047064 1028551 1012035 998188 986589
47282 986589 977096 969783 963845 957774 950851 943807 937939 934155 932781 933426 934874 935881 936505 938074 941443
47267 941443 945719 949101 950658 950982 951525 953706 958264 964714 971286 975880 977584 977420 977515 979283 982234
47252 982234 984691 985690 985816 985947 985749 984118 980825 976915 973539 971233 970376 971376 974087 977878 982730
47237 982730 989453 998307 1008143 1017629 1026883 1037250 1049856 1064998 1082547 1102221 1123595 1146332
47225 1146332 1170160 1194286 1217241 1237868 1256096 1272166 1285544 1295410 1302098 1307314 1312868 1319647
47213 1319647 1327561 1335824 1343358 1349680 1355528 1362041 1369196 1375537 1379568 1381002 1380535 1378937 1376668 1373949
47199 1373949 1370794 1366976 1362198 1356391 1349803 1342768 1335309 1327060 1317742 1307706 1297751 1288469 1280135 1273170
47185 1273170 1268048 1264466 1261171 1257003 1251824 1246245 1241048 1237258 1236014 1237609 1241004 1244931 1249181 1254274
47171 1254274 1260397 1267464 1275819 1285890 1297237 1308885 1320678 1333548 1348204 1364225 1380693 1397206
47159 1397206 1413968 1431149 1448371 1464689 1479146 1491378 1501488 1509226 1513860 1515282 1514692 1513561
47147 1513561 1512180 1509716 1505232 1498045 1487743 1474935 1461716 1450314 1441226 1433371 1425806 1418412 1411360
47134 1411360 1405190 1401269 1400723 1402684 1404920 1406617 1409390 1415166 1424323 1436440 1451502 1469372 1489107
47121 1489107 1509853 1531700 1554784 1578380 1602028 1626849 1654427 1684590 1715463 1745687 1775545
47110 1775545 1805771 1836092 1865139 1891198 1912954 1930107 1943451 1954006 1962128 1967793 1971379 1973264
47098 1973264 1972769 1968607 1960749 1950912 1940639 1929705 1917289 1904041 1891729 1880939 1870384 1858834
47086 1858834 1846653 1834748 1822948 1810589 1798270 1787701 1779715 1773537 1768304 1764266 1761997 1761396 1762234
47073 1762234 1764871 1769459 1775140 1781067 1787686 1795754 1804434 1811876 1817687 1823211 1828800 1832248 1831092 1825629
47059 1825629 1818479 1811516 1804224 1794902 1782547 1767372 1750100 1731212 1710727 1688612 1665431 1642429
47047 1642429 1620683 1600158 1579799 1558648 1536786 1515171 1494683 1475515 1457452 1440462 1424620
47036 1424620 1409641 1394996 1380663 1367318 1355569 1345472 1337052 1330637 1326174 1322877 1320319 1319358 1321022
47023 1321022 1324817 1329187 1333476 1338337 1344278 1351010 1358475 1367319 1377711 1388462 1397929 1405388 1411289
47010 1411289 1416691 1422600 1429120 1435089 1439282 1442116 1445313 1449700 1454423 1458712 1463217 1468791 1474963 1480670
46996 1480670 1485879 1491466 1497837 1504593 1511365 1518280 1525692 1533906 1543020 1552752 1562692 1572872 1583548
46983 1583548 1594331 1604395 1613961 1624569 1637186 1650873 1664174 1677093 1690787 1705862 1721932
46972 1721932 1738308 1754199 1768774 1782096 1795552 1810385 1826222 1841984 1857565 1873316 1888484
46961 1888484 1901888 1913952 1926119 1937941 1946597 1950185 1950140 1949367 1949064 1948437 1946748 1944202 1940901 1936047
46947 1936047 1928681 1918984 1908596 1899485 1892373 1886509 1881194 1877076 1875247 1875476 1876468 1877807 1880290 1883989
46933 1883989 1887370 1889381 1891489 1896421 1905213 1916384 1927774 1938316 1948233 1958491 1970256 1984294
46921 1984294 2000635 2018987 2039274 2061308 2084132 2106281 2126748 2145400 2162687 2179495 2197061
46910 2197061 2216113 2235885 2254673 2271737 2288169 2305481 2323779 2341774 2358212 2372704 2385258
46899 2385258 2395662 2403510 2408660 2411556 2413178 2414576 2416225 2417928 2419522 2421466 2424336 2427885 2431298 2434614
46885 2434614 2439388 2447394 2458736 2471568 2483681 2494266 2504292 2515420 2528553 2543261 2558586 2574235
46873 2574235 2590730 2608392 2626672 2644774 2662533 2680203 2697666 2714294 2729515 2743150 2755326
46862 2755326 2766292 2775975 2783314 2786530 2784731 2778934 2770695 2760054 2745868 2727977 2707802 2686588
46850 2686588 2664365 2641121 2617761 2595092 2572986 2551703 2533269 2520177 2512864 2509466 2507917 2507594
46838 2507594 2509267 2514506 2525015 2541461 2562593 2586165 2610959 2637561 2667342 2701268 2739422 2780767
46826 2780767 2823316 2865393 2906880 2948450 2989519 3027968 3062294 3093050 3121511 3147776 3171101
46815 3171101 3191591 3210398 3228213 3244443 3258236 3269897 3280941 3292911 3306331 3320773 3335794
46804 3335794 3351606 3368723 3387229 3406833 3427666 3450396 3475298 3501669 3528545 3555544 3582454
46793 3582454 3608423 3632378 3654201 3674631 3693777 3710470 3723512 3733002 3739869 3744561 3746903 3746922 3744902
46780 3744902 3740559 3733116 3722713 3711099 3700193 3690172 3679631 3667661 3655299 3644825 3637943 3634670
46768 3634670 3633709 3633850 3635263 3639492 3647966 3660576 3675913 3692774 3710889 3730111 3749576 3768183 3785693
$$ [...]
##END NTUPLES=NMR SPECTRUM
##END=
