
##TITLE=AC1005_Arabiga_6278800_ESOVnCKldA
##JCAMPDX= 6.0         $$ Bruker NMR JCAMP-DX V2.0
##DATA TYPE= NMR SPECTRUM
##DATA CLASS= NTUPLES
##ORIGIN= BRUKER
##OWNER= Administrator
$$ 1.72 TOPSPIN		Version 2.1
$$ 2012-06-07 04:10:47.218 -0500  Administrator@TOPSPIN
$$ Compression mode = diff/dup
##.OBSERVE FREQUENCY= 400.13188235
##.OBSERVE NUCLEUS= ^1H
##.ACQUISITION MODE= SIMULTANEOUS (DQD)
##.ACQUISITION SCHEME= undefined
##.AVERAGES= 8
##.DIGITISER RES= 22
##SPECTROMETER/DATA SYSTEM= spect
##.PULSE SEQUENCE= zg30
##.SOLVENT NAME= COFFEE_meoh
##.SHIFT REFERENCE= INTERNAL, COFFEE_meoh, 1, 14.98061
##AUDIT TRAIL= $$ (NUMBER, WHEN, WHO, WHERE, PROCESS, VERSION, WHAT)
$$ ##TITLE= Audit trail, TOPSPIN		Version 2.1
$$ ##JCAMPDX= 5.01
$$ ##ORIGIN= Bruker BioSpin GmbH
$$ ##OWNER= Administrator
$$ $$ C:\Bruker\TOPSPIN/data/COFFEE/nmr/AC1005_Arabiga_6278800_ESOVnCKldA/20/pdata/1/auditp.txt
$$ ##AUDIT TRAIL=  $$ (NUMBER, WHEN, WHO, WHERE, PROCESS, VERSION, WHAT)
(   1,<2012-06-07 04:10:38.468 -0500>,<Administrator>,<TOPSPIN>,<go>,<TOPSPIN 2.1>,
      <created by zg
	started at 2012-06-07 04:09:31.562 -0500,
	POWCHK enabled, PULCHK disabled,
       configuration hash MD5:
       D5 CA 7A 23 FE 6B EE E2 50 67 74 61 24 F7 5E 3B
       data hash MD5: 64K
       D2 6C 2D 80 BB 1C 3A A2 CA A0 E6 FF 9C 3F CF 57>)
(   2,<2012-06-07 04:10:42.703 -0500>,<Administrator>,<TOPSPIN>,<proc1d>,<TOPSPIN 2.1>,
      <Start of raw data processing
       efp LB = 0 FT_mod = 6 PKNL = 1 PHC0 = 0 PHC1 = 0 SI = 32K 
       data hash MD5: 32K
       5E 4B 29 2E 11 FD 44 CC 3E 70 39 49 C4 5F 9A 76>)
(   3,<2012-06-07 04:10:43.000 -0500>,<Administrator>,<TOPSPIN>,<proc1d>,<TOPSPIN 2.1>,
      <pk PHC0 = 207.8284 PHC1 = 0 
       data hash MD5: 32K
       E4 DE 0C CF 14 6A 09 25 99 43 D9 FA 0A 99 C6 47>)
(   4,<2012-06-07 04:10:43.062 -0500>,<Administrator>,<TOPSPIN>,<proc1d>,<TOPSPIN 2.1>,
      <abs ABSG = 1 
       data hash MD5: 32K
       ED DA AB 72 30 15 B1 48 53 C4 32 F2 C7 BF C4 3D>)
(   5,<2012-06-07 04:10:43.093 -0500>,<Administrator>,<TOPSPIN>,<proc1d>,<TOPSPIN 2.1>,
      <abs ABSG = 2 
       data hash MD5: 32K
       09 B9 0F 9B 55 84 D0 D9 42 A8 04 72 72 B7 2A 53>)
(   6,<2012-06-07 04:10:43.125 -0500>,<Administrator>,<TOPSPIN>,<proc1d>,<TOPSPIN 2.1>,
      <abs ABSG = 3 
       data hash MD5: 32K
       EC D1 90 2F 97 83 63 DF 62 E3 D5 36 BF 03 A1 AF>)
(   7,<2012-06-07 04:10:43.156 -0500>,<Administrator>,<TOPSPIN>,<proc1d>,<TOPSPIN 2.1>,
      <abs ABSG = 4 
       data hash MD5: 32K
       75 EE BB 97 43 86 F3 F1 9E 2E 40 D3 4C 86 DB D6>)
(   8,<2012-06-07 04:10:43.187 -0500>,<Administrator>,<TOPSPIN>,<proc1d>,<TOPSPIN 2.1>,
      <abs ABSG = 5 
       data hash MD5: 32K
       03 91 DE 33 3E 4B 6E 08 4A DB 48 4E 48 39 CA C1>)
$$ ##END=
$$ 
$$ $$ hash MD5
$$ $$ 99 AD 98 1A 33 E0 9E DF 57 24 86 31 FE 8D 01 BF
##$RELAX= 
##$RELAX= 
##$RELAX= 
##$RELAX= 
##$RELAX= 
##$RELAX= 
##$RELAX= 
$$ Bruker specific parameters
$$ --------------------------
$$ [...]
150 150 150 150 150 150 150 150
##$TP07= 0
##$TPNAME0= <>
##$TPNAME1= <>
##$TPNAME2= <>
##$TPNAME3= <>
##$TPNAME4= <>
##$TPNAME5= <>
##$TPNAME6= <>
##$TPNAME7= <>
##$TPOAL= (0..7)
0.5 0.5 0.5 0.5 0.5 0.5 0.5 0.5
##$TPOFFS= (0..7)
0 0 0 0 0 0 0 0
##$TUNHIN= 0
##$TUNHOUT= 0
##$TUNXOUT= 0
##$USERA1= <user>
##$USERA2= <user>
##$USERA3= <user>
##$USERA4= <user>
##$USERA5= <user>
##$V9= 5
##$VALIST= <valist>
##$VCLIST= <CCCCCCCCCCCCCCC>
##$VD= 0
##$VDLIST= <DDDDDDDDDDDDDDD>
##$VPLIST= <PPPPPPPPPPPPPPP>
##$VTLIST= <TTTTTTTTTTTTTTT>
##$WBST= 2048
##$WBSW= 25
##$XGAIN= (0..3)
0 0 0 0
##$XL= 0
##$YL= 0
##$YMAX_a= 511279
##$YMIN_a= -626924
##$ZGOPTNS= <>
##$ZL1= 120
##$ZL2= 120
##$ZL3= 120
##$ZL4= 120
##$ABSF1= 14.98061
##$ABSF2= -5.57192
##$ABSG= 5
##$ABSL= 3
##$ALPHA= 0
##$AQORDER= 0
##$ASSFAC= 0
##$ASSFACI= 0
##$ASSFACX= 0
##$ASSWID= 0
##$AUNMP= <proc_prof1d_extract_pilot.lims>
##$AXLEFT= 0
##$AXNAME= <>
##$AXNUC= <1H>
##$AXRIGHT= 0
##$AXTYPE= 0
##$AXUNIT= <>
##$AZFE= 0.1
##$AZFW= 0.1
##$BCFW= 0
##$BC_mod= 0
##$BYTORDP= 0
##$COROFFS= 0
##$CY= 15
##$DATMOD= 1
##$DC= 0
##$DFILT= <>
##$DTYPP= 0
##$F1P= 0
##$F2P= 0
##$FCOR= 0.5
##$FTSIZE= 32768
##$FT_mod= 6
##$GAMMA= 0
##$GB= 0
##$INTBC= 1
##$INTSCL= 1
##$ISEN= 128
##$LB= 0
##$LEV0= 0
##$LPBIN= 0
##$MAXI= 10000
##$MC2= 0
##$MEAN= 0
##$ME_mod= 0
##$MI= 0
##$NCOEF= 0
##$NC_proc= -8
##$NLEV= 6
##$NOISF1= 0
##$NOISF2= 0
##$NSP= 0
##$NTH_PI= 0
##$NZP= 0
##$OFFSET= 14.98061
##$PC= 1
##$PHC0= 207.8284
##$PHC1= 0
##$PH_mod= 1
##$PKNL= yes
##$PPARMOD= 0
##$PPDIAG= 0
##$PPIPTYP= 0
##$PPMPNUM= 2147483647
##$PPRESOL= 1
##$PSCAL= 4
##$PSIGN= 0
##$PYNMP= <proc.py>
##$REVERSE= no
##$SF= 400.13
##$SI= 32768
##$SIGF1= 0
##$SIGF2= 0
##$SINO= 400
##$SIOLD= 32768
##$SPECTYP= <>
##$SREGLST= <1H.CDCl3>
##$SSB= 0
##$STSI= 32768
##$STSR= 0
##$SW_p= 8223.68421052632
##$SYMM= 0
##$S_DEV= 0
##$TDeff= 65536
##$TDoff= 0
##$TI= <>
##$TILT= no
##$TM1= 0
##$TM2= 0
##$TOPLEV= 0
##$USERP1= <user>
##$USERP2= <user>
##$USERP3= <user>
##$USERP4= <user>
##$USERP5= <user>
##$WDW= 1
##$XDIM= 32768
##$YMAX_p= 462405943
##$YMIN_p= -727009
##$CURPLOT= <Network HP LaserJet P1505>
##$CURPRIN= <$Network HP LaserJet P1505>
##$DFORMAT= <normdp>
##$LAYOUT= <+/1D_H.xwp>
##$LFORMAT= <normlp>
##$PFORMAT= <normpl>
##$SURQMSG= 1
$$ End of Bruker specific parameters
$$ ---------------------------------
##NTUPLES= NMR SPECTRUM
##VAR_NAME=  FREQUENCY,     SPECTRUM/REAL,   SPECTRUM/IMAG
##SYMBOL=    X,             R,               I
##VAR_TYPE=  INDEPENDENT,   DEPENDENT,       DEPENDENT
##VAR_FORM=  AFFN,          ASDF,            ASDF
##VAR_DIM=   32768,         32768,           32768
##UNITS=     HZ,            ARBITRARY UNITS, ARBITRARY UNITS
##FACTOR=    0.250966925370066, 1,           1
##FIRST=     8223.43324360095, 240146,       -214000
##LAST=      0,             -2394,           -169439
##MIN=       0,             -727009,         0
##MAX=       8223.43324360095, 462405943,    0
$$ Real data points
##PAGE= N=1
##DATA TABLE= (X++(R..R)), XYDATA
$$ [...]
19548c7757r1616p7901E5169a21278F3175a35845L8155k87939l6523F3578G279
19536a74039E7816a30194A78354h8858A39365e0439l0750k4779E7635a60764n0553
19525b11317b7512p8428B0809J43386f2736K6490A81136C5452a56237A15931R3217
19514B09148a46562B01106b45431a652F3899e1774k08461L9855F2979a12772B0964
19502B63030q6807o3892b96972h3052j40366m5631G8777b41930i6995j2754n5261
19491a65010B40661m9834a27390D7950a7386m2744B16144J0751b5454A62880c8536
19479A8316e35255c5313L11j65935O5803A31473b45417A76266c22934k9009J58570
19468a93373k549B69397f4122A08242k1568a48480d7121F2117N5731R7068i8850
$$ plain form
19548 -37757 -129373 -207274 55169 -121278 63175 -135845 -97690 -385629 -422152 63578 7279
19536 -174039 57816 -130194 178354 -88858 139365 -50439 -81189 -105968 57635 -160764 -211317
19525 -211317 -27512 -105940 20809 164195 -62736 -36246 181136 35452 -156237 115931 209148
19514 209148 -146562 201106 -245431 -1652 63899 -51774 -260235 -220380 62979 -112772 20964
19502 263030 176223 112331 -296972 -83052 -223418 -269049 78777 -241930 -96995 -109749 -165010
19491 -165010 240661 190827 -127390 47950 -17386 -60130 216144 226895 -25454 162880 -38536
19479 18316 -535255 -35313 -35002 -200937 -135134 131473 -245417 176266 -322934 -351943 -193373
19468 -193373 -195922 269397 -64122 108242 86674 -148480 -47121 62117 117848 214916 -98850
19456g7603A8619b28959b6382B10305b82210d0874l40320D5629A365g1517j28774
19445b00291A12918b6274k39344I0262b54611i7836B11566a36578d2355r9486
19435a41841H9643b07504G4212a50811J2687A16607a80067A09398C7589b47679
19424a46134F6016H47b25330c9382k33339j2084C6777a48067D9070b35247K158
19413b33089e6758j66539o1819b6287k9682l0184C08968A25353a01331F5489a4530
19401c82317B40037r6639c45877A12787a83241R1151C11968E8095h5602Q483c3077
19389C22511a57157j65357i1598M5222G2083M8303c52303i9020A8257a38900e97
19377a5222H4481c1630D8084J76833b41290A02852m1991a9729I8150f1450B0002
$$ plain form
19456 -77603 18619 -228959 -26382 210305 -282210 -40874 -381194 45629 1365 -71517 -200291
19445 -200291 112918 -26274 -265618 90262 -254611 -97836 211566 -136578 -42355 -141841
19435 -141841 89643 -207504 74212 -150811 -138124 116607 -180067 109398 37589 -247679
19424 -146134 66016 847 -225330 -39382 -272721 -284805 36777 -148067 49070 -235247 -233089
19413 -233089 -56758 -223297 -285116 -26287 -55969 -86153 308968 125353 -101331 65489 -14530
19401 -382317 240037 143398 -345877 112787 -183241 -92090 311968 58095 -85602 -77119 -33077
19389 322511 -157157 -322514 -91598 -46376 72083 120386 -352303 -99020 18257 -138900 -597
19377 -15222 84481 -31630 48084 224917 -241290 102852 60861 -19729 98150 -61450 20002
19365c0021F4215J3381O1819a53111d311l8598A51015c25106A77443b4809j13870
19354a38679O634A98324e6141j22493e5368H4738a63656j7376g2269j7980j94275
19343b84524L4535a4429B7625Q2916b84247J39372r320A58557c1449B03606r4836
19332A08770b46919l19346G8917A8603b25968R22I8681e7506A50943c3196A15580
19320C249c6707D89019j89987a16442p5720M7692C612b0663l56303f671G8698
19308F2089a57831F7990b5508l00731a2093o475j36584M3256H6424b0513E1303
19296H6131a33767F543h6507j65428F2750A6071b4769n8567c0402n392F4606b19189
19283b8061E0854g1620n4625J0598A16638d14720A08576c38380G9851J52460C2435
$$ plain form
19365 -30021 64215 77596 139415 -153111 -4311 -42909 151015 -325106 177443 -24809 -138679
19354 -138679 -132045 198324 -56141 -178634 -55368 84738 -163656 -181032 -72269 -90249 -284524
19343 -284524 -249989 -14429 27625 110541 -284247 -144875 -154195 158557 -31449 203606 108770
19332 108770 -246919 -566265 78917 18603 -225968 -225046 98681 -57506 150943 -33196 115580
19320 3249 -36707 489019 299032 -116442 -192162 -144470 3612 -20663 -376966 -6671 78698
19308 62089 -157831 67990 -25508 -326239 -12093 -18568 -155152 -111896 86424 -20513 51303
19296 86131 -133767 6543 -86507 -251935 62750 16071 -24769 -83336 -30402 -35794 64606 -219189
19283 -28061 50854 -71620 -126245 -115647 116638 -414720 108576 -338380 79851 232311 32435
19271e3231l3375H2921f990m271k75214d4004a3706A15305b18185A62350a02559
19259c19337C9182b62640a30922O3443m3176j81507R779i8923j9090L2393c8405
19247a58462n3544G6954l2291B0736J62898f2735j83759B29504h4479r0343a7146
19235c35376A4848a74151c4146B31597b37784A59164c03464A68609n2354J74228
19225B90483a59760N9245d6834k18373A3185i7391j95790F8836b1968j33812O597
19214a49183j73721B0388a23842d7360J1895A16880d28291H7095a87882A34649
19203A5862h0582C02918a39121j27381h9394k89458a52427B03669a94720C02425
19192c34438F4219K04225F2269b86271A75352n03b39191h3811C12961a27728E3084
$$ plain form
19271 -53231 -86606 82921 -6990 -11261 -286475 -44004 -13706 115305 -218185 162350 -102559
19259 -319337 39182 -262640 -130922 -67479 -110655 -292162 -282383 -98923 -118013 -85620 -38405
19247 -158462 -212006 76954 44663 20736 183634 -62735 -246494 229504 -84479 -174822 -17146
19235 -335376 14848 -174151 -34146 231597 -237784 159164 -303464 168609 116255 290483
19225 290483 -159760 -100515 -46834 -265207 13185 -97391 -293181 68836 -21968 -155780 -149183
19214 -149183 -322904 20388 -123842 -47360 -35465 116880 -428291 87095 -187882 134649
19203 15862 -80582 302918 -139121 -266502 -89394 -378852 -152427 203669 -194720 302425
19192 -334438 64219 268444 62269 -286271 175352 174849 -239191 -83811 312961 -127728 53084
19180g7133k5544k36478i9632o6550j01789J23275A15076b62396i0590m0350H4224
19168e4180j09116A08350e8139A53430b34207J09157A32923A038b05200d2550
19157a74173p1674A49987C0206e81164I4492f6685B37120a00441j42622f5286
19146c5731B4344K08999c19403I0970a75775j75261f1535j51113c1507k46427
19136b77934O7350H467h6799a6726k54660H7033J49295f8653k0420A69536a39217
19124c42588J10584a70l4595G1400b18116R5373j06765M445g8288A19884n2600
19113F7284c5735k8624j22593B5242J95348a59138C4123a45341N6785n5814h037
19101e79744A99911C2556b70876R2287O5238j95880A6823b20097A16316d2475
$$ plain form
19180 -77133 -102677 -339155 -99632 -166182 -267971 -144696 115076 -262396 -90590 -130940 84224
19168 -54180 -163296 108350 -58139 153430 -234207 -125050 132923 1038 -205200 -42550
19157 -174173 -245847 149987 30206 -581164 94492 -66685 237120 -100441 -243063 -65286
19146 -35731 24344 233343 -319403 90970 -175775 -351036 -61535 -212648 -31507 -277934
19136 -277934 -210584 8467 -86799 -16726 -271386 87033 236328 -68653 -89073 169536 -139217
19124 -342588 -232004 -170 -34765 71400 -218116 -122743 -229508 -225063 -78288 119884 67284
19113 67284 -35735 -64359 -186952 25242 220590 -159138 34123 -145341 -88556 -144370 -8037
19101 -579744 199911 32556 -270876 -178589 -113351 -309231 16823 -220097 116316 -42475
19090f5578i867j64316B6134a78502e3249A60213P1908e17155E1074a08502D9297
19078a9416A51025e7123G2571j0756a67606A36387a3766B17700d34739b235j47916
19067a50151J9134M1978l19410b6101j06102B82833a52456K3335K0433B5448a51527
19055A7315J10530a31928L2453C2385L2214J77355b280D6546J16796A4652M8162
19044F2814d8673m24404B66148b29222q560A96048E1760A3619b84980I8704e4774
19032a70255G1406c11204B3724a1510C56207E7097a11923A81465o5268f5162A0230
19020E40043a24143f945B30873g4759n9464B08232J82192A3935N01375k47730
19010B67580c46661A3168b3058F6894K0021a2494A8642d4157l05197g4887B05118
$$ plain form
19090 -65578 -9867 -174183 26134 -178502 -53249 160213 232121 -517155 51074 -108502 49297
19078 -19416 151025 -57123 72571 61815 -167606 136387 -13766 217700 -434739 -2235 -150151
19067 -150151 -131017 -89039 -408449 -26101 -132203 282833 -152456 -129121 -108688 25448 -151527
19055 17315 127845 -131928 -99475 32385 64599 241954 -2280 46546 163342 14652 62814
19044 62814 -48673 -473077 266148 -229222 -237782 196048 51760 13619 -284980 98704 -54774
19032 -170255 71406 -311204 23724 -11510 356207 57097 -111923 181465 116197 -65162 10230
19020 540043 -124143 -6945 230873 -74759 -134223 208232 390424 13935 515310 267580
19010 267580 -346661 13168 -23058 66894 86915 -12494 18642 -44157 -349354 -74887 205118
18998g5160A37525d8925G7579a01663j41812H4802c910o2962j10295A47165J01012
18987B48177m7865L3274a65172L8200F2691f7760m108B1579O0341b72995C5165
18975b4377A0425b04610g8254j37320Q1589J960A03130M0418B1224f34268A1412
18963A24244a11283l49096J25352a39385O4760j23065E2070d08515a34765A9177
18952a25945A12260i8395o432B25722b02749A33576i112j51035B15415a00922
18941a04073j25917g8605j1591d0446k73467d0924A64919b66540n855C4537a50643
18929h8741j95466d036E0635a41643e6727C18165c5766A44204d99990a20983j0916
18918a31899b1131B25526b2402k16035l6380E8341c50573f4454A0824R2710J1378
$$ plain form
18998 -75160 137525 -48925 77579 -101663 -243475 84802 -3910 -66872 -177167 147165 248177
18987 248177 200312 233586 -165172 -126972 62691 -67760 -71868 21579 81920 -272995 35165
18975 -24377 10425 -204610 -78254 -215574 -133985 -132025 103130 143548 21224 -634268 11412
18963 124244 -111283 -460379 -335027 -139385 -74625 -197690 52070 -408515 -134765 19177
18952 -125945 112260 -98395 -104827 225722 -202749 133576 -9112 -160147 215415 -100922
18941 -104073 -229990 -78605 -90196 -40446 -313913 -40924 164919 -266540 -272395 34537 -150643
18929 -88741 -284207 -4036 50635 -141643 -56727 318165 -35766 144204 -499990 -120983 -131899
18918 -131899 -21131 225526 -22402 -238437 -274817 58341 -350573 -64454 10824 103534 114912
18907A14912b21299g2001D2171d4519a336D354a29887N467A54513D8860f6501
18895A02230d0881G4827a73355F7500h5761A11875a17945J0394A98832B1671a0457
18883a24516B1015O4410B0542J20217E8557H6K36569j00241a06436H7694c7221
18871C44a760j37499D5185c93372a25483m3647g9966e502j01984l989o854M6991
18859g1338h932r4844r4937B00490a7941p5474B12484a99673L3267j10052j1251
18848b87709J28495c7140D7649a08961B2788h9080B33171e8076A21356a5422G8537
18836A08362e170k08457L9786K3492e383k13406G478O9797h3405n1661E09964
18824f4306n5360m6254L1214A02831a29463k72925a03939A80618b2594E4201R0960
$$ plain form
18907 114912 -221299 -72001 42171 -44519 -1336 4354 -129887 -124420 154513 48860 -66501
18895 102230 -40881 74827 -173355 67500 -85761 111875 -117945 -107551 198832 21671 -10457
18883 -124516 21015 85425 20542 140759 58557 86 236655 136414 -106436 87694 -37221
18871 344 -1760 -139259 45185 -393372 -125483 -169130 -79966 -5502 -107486 -111475 -118329 -71338
18859 -71338 -8932 -103776 -198713 200490 -17941 -93415 212484 -199673 -166406 -276458 -287709
18848 -287709 -159214 -37140 47649 -108961 22788 -89080 233171 -58076 121356 -15422 78537
18836 108362 -5170 -213627 -173841 -150349 -5383 -218789 7478 77275 -83405 -135066 509964
18824 -64306 -119666 -165920 -134706 102831 -129463 -402388 -103939 180618 -22594 54201 145161
18813A45161c92585Q4893A00695N5693J07757J45209a37969E7672J50587q8842
18803A19417L80027a54941A1327a8495E5050D31R7845P5072b3689m4530j78941
18792b47160M9725B3428J80790b18324d1129I5604L5292M8179b12344j9043J02489
18781a28898d4845A75237D1339d2040o2399H9270a56645B10470D2671f7364l64390
18770d31754N4882G5812Q5280E5179c8225j56881g2867r4349A98531G0161O514
18759G6675a15903q0802B37874g6218a8903B03912c63465d7580F1616O3463h9724
18747C30825b25719A53321a22065k67738b2569j33680j61522a11702A76667a50138
18736A26563K7717o207b87865A57554b40390f0878j35213A14080a91313O4986
$$ plain form
18813 145161 -392585 -307692 100695 156388 264145 409354 -137969 57672 208259 119417
18803 119417 499444 -154941 11327 -18495 55050 431 98276 173348 -23689 -68219 -247160
18792 -247160 -197435 23428 204218 -218324 -41129 95604 130896 179075 -212344 -231387 -128898
18781 -128898 -44845 175237 41339 -42040 -104439 89270 -156645 210470 42671 -67364 -431754
18770 -431754 -376872 75812 161092 55179 -38225 -195106 -72867 -167216 198531 70161 76675
18759 76675 -115903 -196705 237874 -76218 -18903 203912 -363465 -47580 61616 125079 -89724
18747 330825 -225719 153321 -122065 -389803 -22569 -156249 -317771 -111702 176667 -150138
18736 126563 154280 148073 -287865 157554 -240390 -60878 -196091 114080 -191313 -126327
18726a26327C35305c14262J14861A32388b92620P7139b6897j31016g0437q2291
18716a52728L0303A13066c12824R9296K8099A06848J3955B5157g2723j97286A64181
18704a91848l06943D8037e7034J2377j02432c0544l38475a27841G2764K18043
18694B90807A42186J6582g7783l04158f5873j78540H8471h2578r4503e4393o0178
18683a14571M4172A05526D3060b92663p0632J50423k0400H1633A9041a5707j7404
18672c3111g362G2850L00087C553b71178C4117c93657i135B21624a31745A32603
18660i3064A71069b03375E5883d4765B077J25763a71486J4865e893B9773b38492
18648B1544L4033a21264B57621b17751g1824j49702A7837a83784B94594a1850
$$ plain form
18726 -126327 335305 -314262 -199401 132388 -292620 -215481 -26897 -157913 -70437 -152728
18716 -152728 -122425 113066 -312824 -213528 -185429 106848 120803 25157 -72723 -270009 164181
18704 -191848 -498791 48037 -57034 -44657 -147089 -30544 -369019 -127841 72764 290807
18694 290807 142186 158768 -77783 -381941 -65873 -244413 88471 -82578 -177081 -54393 -114571
18683 -114571 -70399 105526 43060 -292663 -363295 -212872 -233272 81633 19041 -15707 -33111
18672 -33111 -7362 72850 372937 3553 -271178 34117 -393657 -9135 221624 -131745 132603
18660 -93064 171069 -203375 55883 -44765 2077 127840 -171486 -156621 -5893 29773 -238492
18648 21544 55577 -121264 257621 -217751 -71824 -221526 17837 -183784 294594 -11850
18637A85790B3469a4527j80658j6214A25327b2158j35913q1509A970R9146R6857
18626A97973h0280k12118e1129A97920r6181a06566A20131c20057a42822B50893
18615a21700A06918b69594B21401a4730l18501g4207C11502f0923A81501c17226
18604D04359D406b66051L7683B5190L0704Q1729J15533b04606q0563a34452e2518
18592c38705b4643q850n3082B27609a78698A93587G1718b34611j795a15045A94577
18580b98476a33974g553A79418a81848A27921a78638h6424A86583f1363M37o8300
18569a29226B44978j05690D7778d7210B49847d61354A03173i0512j44784h539
18558A65880B3370a10386M1859r7425A7606K4824a80712L8740G6200a8549n4399
$$ plain form
18637 185790 23469 -14527 -195185 -211399 125327 -22158 -158071 -239580 1970 101116 197973
18626 197973 -80280 -292398 -51129 197920 101739 -106566 120131 -320057 -142822 250893
18615 -121700 106918 -269594 221401 -14730 -333231 -74207 311502 -60923 181501 -317226
18604 404359 4406 -266051 -228368 25190 55894 137623 253156 -204606 -285169 -134452 -52518
18592 -338705 -24643 -33493 -86575 227609 -178698 193587 71718 -234611 -236406 -115045 194577
18580 -298476 -133974 -7553 179418 -181848 127921 -178638 -86424 186583 -61363 -60926 -129226
18569 -129226 244978 139288 47778 -47210 249847 -461354 103173 -90512 -235296 -8539
18558 165880 23370 -110386 -68527 -165952 17606 42430 -180712 -141972 76200 -18549 -72948
18547g2948l3726j01452N412G5250C3786J9339F902d8620d512A19098P631m5776
18535H0953a4007j9556A58640C7673L449K86172g5568C20230b71364O3505d0847
18523b61037a09753H1935d9467H6089B2361d807j28535A45386a78998E7001h656
18511f9339B1587f8575k2465k9902n2262k1099B859h870j84329j10836g1974b30
18498A19522a315n8569A19764J25608a1590j51853g2900J8775m3482j16592B60834
18486A850d65451G2290a57387j06546A23881a51969E0201d1142A2694J62806O2834
18475B38334j11431J15864b17308B78945A6903b52267L7131D0555a95764A15413
18464a45307K8317d1657A5427b51503q6974j81906A97688b2609A00946B1458c47148
$$ plain form
18547 -72948 -106674 -208126 -202714 75250 33786 53125 6902 -48620 -4512 119098 126729 80953
18535 80953 -14007 -33563 158640 37673 41122 327294 -75568 320230 -271364 -207859 -40847
18523 -261037 -109753 81935 -49467 86089 22361 -4807 -133342 145386 -178998 57001 -8656
18511 -69339 21587 -68575 -91040 -120942 -173204 -194303 2859 -8870 -193199 -304035 -71974 -230
18498 119522 -1315 -59884 119764 245372 -11590 -163443 -72900 -54125 -97607 -214199 260834
18486 1850 -465451 72290 -157387 -263933 123881 -151969 50201 -41142 12694 175500 238334
18475 238334 126903 242767 -217308 278945 16903 -252267 -215136 40555 -195764 115413
18464 -145307 -116990 -41657 15427 -251503 -338477 -520383 197688 -22609 100946 21458 -347148
18452d2692I3548b1613j4838k1180n0585j99092a04498j68397j69613A03371A4812
18440A70417e9487E2284N2484c16819R7001e1381j29637O5576E7414K045a28096
18428A02065d0047A15179A6574a19266j14932A82959l0446o2982c43436G0952
18417b09917a080B29096q3830B6208g3930k81097J59151r637A2591K54440a05279
18405i9714n4711f8461m997I2061J18347a1729j31657A56277a39311M9608B27944
18393D9041A1793h521p1477A08042f6263q6889d7694k22395l9057A68884D9836
18381a02984B41359a02502c0079E0947L9285a58174N36E39628F9337b1389j88029
18370b09418A81348a34887B0634l494b67516B23515E5301A8901K3601e2684j59394
$$ plain form
18452 -42692 93548 -21613 -36451 -57631 -108216 -307308 -104498 -272895 -442508 103371 14812
18440 170417 -59487 52284 104768 -316819 -219818 -51381 -181018 -115442 57414 59459 -128096
18428 102065 -40047 115179 16574 -119266 -234198 182959 152513 89531 -343436 70952
18417 -209917 -1080 229096 145266 26208 -73930 -355027 -195876 -205513 12591 267031 -105279
18405 -99714 -154425 -68461 -73458 92061 210408 -11729 -143386 156277 -139311 -89703 227944
18393 49041 11793 -8521 -79998 108042 -66263 -153152 -47694 -270089 -309146 168884 49836
18381 -102984 241359 -102502 -30079 50947 90232 -158174 -157638 539628 69337 -21389 -209418
18370 -209418 181348 -134887 20634 17140 -267516 223515 55301 18901 42502 -52684 -212078
18359b12078B03296J1964h0170j3220I1478b76522a36044C42470F1941K60813
18349C22754f4893E43Q9803l4841J85948n0688m9727b58900I2283d00390j61557
18338e61947A49615i5493p244B6070p185e2349r7393Q897c3221B5469a23870A9034
18325f2350k00947A39011a19915K7362A12818f8835G2176A9940P1064k9957b74772
18313D84492a47544p6505E6452J9643a33927A1253Q6143K3591j9457a44681j9966
18302a64647A16156b90123A59144F4401g369A90888b30902j4986f4775j52245
18292b17020O4019J4905N6150l40302a80640A3958a3227k24231l1968C21365I7473
18280A58600a47531B60990E4502d09468g5601j76675B9901K26308F8271e3875
$$ plain form
18359 -212078 203296 215260 -80170 -93390 91478 -276522 -136044 342470 61941 322754
18349 322754 -64893 543 90346 55505 241453 190765 141038 -258900 92283 -400390 -561947
18338 -561947 149615 -95493 -102737 26070 18885 -52349 -149742 -140845 -33221 25469 -123870 19034
18325 -62350 -263297 139011 -119915 -92553 112818 -68835 72176 19940 91004 61047 -274772
18313 484492 -147544 -224049 56452 76095 -133927 11253 97396 120987 101530 -144681 -164647
18302 -164647 116156 -290123 159144 64401 -7369 190888 -230902 -245888 -64775 -217020
18292 -217020 -153001 -138096 -81946 -422248 -180640 13958 -13227 -237458 -269426 321365 97473
18280 158600 -147531 260990 54502 -409468 -75601 -252276 29901 256209 68271 -53875
18269D9109j6719b1057A09701J13519a73110n8729e1715j20669C79204B2014a80269
18257h3980P955m26646B7679b82925g0213A38840C8995b54578b3111A06635N1931
18246A58566d3740A04694i5394j70548C0675K0273f81k23477D0844a97002C29641
18234e589j93972j6178F1752L2672J31324Q5018F9819c49392a9040k46781Q1724
18223a84097M5069i213k92692q1446d3366A6257c34747C95392c16878c2165l8258
18212g0423j92368d1045j13966j46451B28388b5374j06647j05382A29896K04613
18202C34509A577e2659K4126k3931A59296a45604A6705a86037F8529F642O2620
18191F9262c32259J52229B38127c02694C61614g9431j93666M3046i1678D0195
$$ plain form
18269 49109 32390 -21057 109701 223220 -173110 -231839 -51715 -172384 379204 22014 -180269
18257 -83980 -76025 -502671 27679 -282925 -70213 138840 38995 -254578 -23111 106635 158566
18246 158566 -43740 104694 -95394 -265942 30675 50948 -681 -224158 40844 -197002 329641
18234 -5589 -199561 -215739 61752 94424 225748 310766 69819 -349392 -19040 -265821 -184097
18223 -184097 -139028 -9213 -301905 -383351 -43366 16257 -334747 395392 -316878 -32165 -70423
18212 -70423 -262791 -41045 -155011 -301462 228388 -25374 -132021 -237403 129896 334509
18202 334509 1577 -52659 -28533 -52464 159296 -145604 16705 -186037 68529 6642 69262
18191 69262 -332259 -180030 238127 -302694 361614 -79431 -273097 -230051 -91678 40195
18180g3280A66528h340k47995I6325J23909a79125H9483b93709a25773A86030
18169H611L57044a81479I3802q101a93861A06857l0572K55135a82110k40716l9975
18158d62801b07144k35128a14883m1161a9192A94259H1a00008M1918C05547D6481
18146C1007O0948a5836L7A5058J8340i4414a3149j63522B05576a17079A48722
18134g9190m4633O0220k9041j64273c0140j03689j475j51986B751a56886G1379
18122d9130r8674P196K5368B2150c05387H0116i6254n0518I0767c6033A65218
18110b47584I1307b12428j9662B21384N003B3098f7302j01194k7861D8511a31511
18098d82472D0720J23740a67008E8797a29253j03827a12378B31153I5301a54926
$$ plain form
18180 -73280 166528 -8340 -256335 96325 220234 -179125 89483 -293709 -125773 186030
18169 8611 365655 -181479 93802 85701 -193861 106857 76285 331420 -182110 -422826 -462801
18158 -462801 -207144 -442272 -114883 -156044 -19192 194259 81 -100008 -58090 305547 46481
18146 31007 91955 -15836 -15799 15058 33398 -94414 -13149 -176671 205576 -117079 148722
18134 -79190 -123823 -63603 -92644 -256917 -30140 -133829 -135304 -287290 2751 -156886 71379
18122 -49130 -147804 -140608 -115240 22150 -305387 80116 -96254 -146772 90767 -36033 165218
18110 -247584 91307 -212428 -232090 221384 226387 23098 -67302 -168496 -196357 48511 -131511
18098 -482472 40720 164460 -167008 58797 -129253 -233080 -112378 231153 95301 -154926
18087A0102L06690K5900b47255F0208b47782a20439G1561h5561a2795j1351k30189
18076b54335M8987L281G4231h0889a2513k61942F2189h5337m8332d2865I7361
18064G5728P1458C8759L124K41190B8514H103J63353A720a8622j82975k29773
18053d31370a46899A06024M971b07213R0838k30363A89201c39651P2640a8985
18042A69237a2321A68990J7931a67067B85928C8531M8975f0246C17368A8316a7124
18030B24361C1764b6045o1577j27021e3029n7284K3259K1058j3565A49513d252
18018b44187A77637b13436A39928J0983a10954J477M8393j99752C10917j26410
18008A84507i5473j35851J0330F4208P8260J56532c75804A11086e30966A69031
$$ plain form
18087 10102 316792 342692 -247255 60208 -247782 -120439 71561 -85561 -12795 -24146 -254335
18076 -254335 -205348 -202067 74231 -80889 -12513 -274455 62189 -85337 -133669 -42865 97361
18064 75728 147186 38759 41883 283073 28514 8103 171456 1720 -18622 -201597 -431370
18053 -431370 -146899 106024 110995 -207213 -116375 -346738 189201 -339651 -267011 -18985
18042 169237 -12321 168990 186921 -167067 285928 38531 87506 -60246 317368 18316 -17124
18030 224361 31764 -26045 -87622 -214643 -53029 -110313 -87054 -65996 -79561 149513 -4252
18018 -244187 177637 -213436 139928 150911 -110954 -109477 -61084 -260836 310917 184507
18008 184507 -95473 -231324 -220994 64208 142468 299000 -375804 111086 -530966 169031
17997C9500K40669i9138B00317c9204k73201J24523j32589D37418a03932A54307
17986f3695m61276b3887j85693n7566a22009N9957f904A79260a33202N4058A76782
17974g3990a465o046j95021B05212a86234C4944K03964e4390o0216A2855Q7190
17963A00045d1534k51069C1062P5624b62937K4123e456j08475A60746a04764E487
17951A68487i4914j09486A70972b49646c2404K104k37897A31769b28102A01661
17940a27613D1098K0499a60337G2112P4337a68432P602B2108L5698b25163k58541
17929d83704D2981a74409O4795j2539A6126N1859b43567e4363A98026E1672L9421
17918I1093a78844C19268A27188N0128i3190j82367C1420J39071C1611N0181h7754
$$ plain form
17997 39500 280169 -99138 200317 -39204 -312405 -187882 -320471 437418 -103932 154307
17986 -63695 -524971 -23887 -209580 -267146 -122009 -62052 -6904 179260 -133202 -79144 176782
17974 -73990 -1465 -7511 -202532 205212 -186234 34944 238908 -54390 -114606 12855 100045
17963 100045 -41534 -292603 31062 106686 -262937 -238814 -5456 -113931 160746 -104764 5487
17951 168487 -94914 -204400 170972 -249646 -32404 -30300 -268197 131769 -228102 101661
17940 -127613 41098 61597 -160337 72112 146449 -168432 -160830 22108 57806 -225163 -483704
17929 -483704 42981 -174409 -109614 -122153 16126 67985 -243567 -54363 198026 51672 91093
17918 91093 -178844 319268 127188 177316 -93190 -275557 31420 170491 31611 81792 -87754
17906I7354f7158k01567E5283a50769K7048B97837A42588n6848J20510f7532B5084
17894B93500A2272c1366C65643a97938c0862l7489j73055A24092D1983J5876k4563
17883C3296a53899j01279A89118b3620l34394B6531a67915B00149I4337K48619
17873C42956F5191a43243j17254C5671J78647a50007A82036n6177D2681K11347
17863B54028h5518j02913H4266a45031k039h445A9012h2144k09192b5490A05392
17851a86197M1927A60925b57885R214a3226A69622A285c1342A48985A184c84352
17839A8988f3087A7353a33187a3198A33267a70652l6810I0739c0903g365F1333
17827a67770E9908b69844p8168a00725j9225k28565A8577F671a34499H0392b10453
$$ plain form
17906 97354 -67158 -268725 55283 -150769 -123721 297837 142588 85740 206250 -67532 25084
17894 293500 12272 -31366 365643 -197938 -30862 -68351 -241406 124092 41983 57859 33296
17883 33296 -153899 -255178 189118 -23620 -358014 26531 -167915 200149 94337 342956
17873 342956 65191 -143243 -260497 35671 214318 -150007 182036 125859 42681 254028
17863 254028 -85518 -188431 84266 -145031 -147070 -8445 19012 -82144 -291336 -25490 105392
17851 -186197 -144270 160925 -257885 -248671 -13226 169622 1285 -31342 148985 1184 -384352
17839 18988 -63087 17353 -133187 -13198 133267 -170652 -207462 90739 -30903 -7365 61333
17827 -167770 59908 -269844 -348012 -100725 -119950 -348515 18577 6671 -134499 80392 -210453
17815a83115e6648B22571b42112I0284d80p5472J5601B3882K7454K97084c1108
17803E7527J35176a72348f2664A03579i4958A40989D9616b06575e196n727B49070
17791g6977G0321b14712f9934H171c22719A03991a52548i814n3739C97325a09772
17779e4841B50661p1229d3818j4758J9832j10393j7230E1313a75785G8394a6679
17767A74169D7867a32959A32278b25300P8804B31917H8696g5306B92499a80339
17756A8274f8938A45195J45724a64160A76261p7490D4335b23736d5502m4611a7280
17744d9831A51809g5049C44423a24050G0013J68324g6923l7365G0375g9190A45138
17732g0755C45701A760P1875E272J37158a81522P8836d0738A11422a49605B48744
$$ plain form
17815 -183115 -56648 222571 -242112 90284 -480 -75952 -60351 23882 51336 348420 -31108
17803 57527 192703 -172348 -62664 103579 -94958 140989 49616 -206575 -5196 -10923 249070
17791 -76977 70321 -214712 -69934 8171 -322719 103991 -152548 -9814 -63553 397325 -109772
17779 -54841 250661 179432 -43818 -58576 -38744 -149137 -166367 51313 -175785 78394 -16679
17767 174169 47867 -132959 132278 -225300 -146496 231917 88696 -75306 292499 -180339
17756 18274 -68938 145195 290919 -164160 176261 98771 44335 -223736 -45502 -90113 -17280
17744 -49831 151809 -75049 344423 -124050 70013 238337 -76923 -114288 70375 -79190 145138
17732 -70755 345701 1760 73635 5272 142430 -181522 -102686 -40738 111422 -149605 248744
17720C33908j33024c3409A91484J68974a76599k9002A9423h8505A84543d0315
17709a90529j7228g0020B8899J02965b25505H5163b74866H5573h5747B10658N511
17698B16169c28151A97093C9263K2839a90408K9701A97318d9630j66183B19583
17687b39325D9154a19392j47266b0168C01734b89230A73715e2914j74426b3326
17676H5689d4558C87235j65189l1155F5952J22342k2296n6728M7422J04965E1398
17664A57453J03253d9788A5488a34580b8615l07853C7510A4113P3080J43796c43209
17652A77170g0688k90983B07323a652G3365O9433a8206A51198J82422F5156L6009
17641A01165m9038b71728a34318A90957q6618J18829l8853a23750B82961n1576
$$ plain form
17720 333908 200884 -33409 191484 360458 -176599 -205601 19423 -88505 184543 -40315
17709 -190529 -207757 -70020 28899 131864 -225505 85163 -274866 85573 -85747 210658 216169
17698 216169 -328151 197093 39263 62102 -190408 -160707 197318 -49630 -215813 219583
17687 -239325 49154 -119392 -266658 -20168 301734 -289230 173715 -52914 -227340 -23326
17676 85689 -44558 387235 222046 190891 65952 188294 165998 109270 156692 261657 51398
17664 157453 260706 -49788 15488 -134580 -28615 -336468 37510 14113 87193 230989 -343209
17652 177170 -70688 -361671 207323 -1652 73365 142798 -18206 151198 333620 65156 101165
17641 101165 52127 -271728 -134318 190957 104339 223168 184315 -123750 282961 231385
17631B31385k948K6080a71926B6725O8477a19532A81087O7948I3002g2465A299
17619B20202D2853a46168c2119G0046G775L38709j66004e4562K4532A74021A548
17607H4974k1031e3353j71115J9967B05934o4674L5774F4388m9a60294g1697c1948
17594d7235A32637b00288p8154B6123b6415A55905f0925C8887R8142h7053F8753
17582d6095r6713e4830a301C4567h7223B11409b021A33300g4340B35398D7727
17570C29510A5237R9184N5951o5780J892F356J26042B6182a26966B92510f0854
17558a31288c0460B08002D8308J67879J24851A55362K152o8412a16094d6407K1781
17547b4626B85756q8905c1707A96903G7200b46242a12306j66943B20733k5784
$$ plain form
17631 231385 228437 254517 -171926 26725 95202 -119532 181087 249035 93002 -72465 1299
17619 220202 42853 -146168 -32119 70046 7775 346484 180480 -54562 -30030 174021 1548
17607 84974 63943 -53353 -224468 -204501 205934 141260 177034 64388 64339 -160294 -71697 -31948
17594 -47235 132637 -200288 -278442 26123 -26415 155905 -60925 38887 137029 -87053 68753
17582 -46095 -142808 -54830 -1301 34567 -87223 211409 -2021 133300 -74340 235398 47727
17570 329510 15237 114421 170372 104592 106484 6356 132398 26182 -126966 292510 -60854
17558 -131288 -30460 208002 48308 216187 341038 155362 157514 89102 -116094 -46407 -24626
17547 -24626 285756 196851 -31707 196903 77200 -246242 -112306 -279249 220733 194949
17537A94949p4760D391a09822c9098l0903l15480c2629j08191b0274C70645c3994
17525a42858C9221f804B12770a19945p376A96232a16214d1338j06543A00882J10526
17514B11408K9247e4052K3008j07865j15651B97238L3422b8993A68646C5835j181
17503C4654j6537Q4248L68126A59241B8595a55611C06850J42517H2928A6174a62542
17491a17590F8652L66201B16337E4888K28477J49552A11028J36024B709J38498
17481A41207D2286J71635j01215L16941B1316a8139A66014i2792D04597r0431
17471C14166A56069l1804C6524c36307D9594J17832R4977b12736C8323P9731j0550
17460A07504B9681e6567D31866b4389C21872J10052i2482F3437K56203O449q5761
$$ plain form
17537 194949 120189 4391 -109822 -39098 -70001 -385481 -32629 -140820 -20274 370645 -33994
17525 -142858 39221 -6804 212770 -119945 -127321 196232 -116214 -41338 -147881 100882 211408
17514 211408 240655 -54052 -31044 -138909 -254560 297238 330660 -28993 168646 35835 34654
17503 34654 18117 102365 470491 159241 28595 -155611 306850 449367 82928 16174 -162542
17491 -117590 68652 434853 216337 54888 283365 432917 111028 247052 2709 141207
17481 141207 42286 213921 112706 429647 21316 -18139 166014 -92792 404597 314166
17471 314166 156069 124265 36524 -336307 49594 167426 262403 -212736 38323 118054 107504
17460 107504 29681 -56567 431866 -24389 321872 431924 -92482 63437 319640 326089 240328
17449B40328F2272J09874Q1050F7827K93657a1052B3540K34796E1647A8715M01998
17438D20713c2596N057E3116M38191B04144J26835q3395J80563b30059H5213l494
17427H1719J0966J79711C5819b3366D26797A76582J57319i1060A47796N8159b29020
17415B08631q7701J63495n8039P1199j24159J53268L8131m8393a73295A58897
17404E8429h6678C56047O3175o0212q2177G7005a6034m8378B44451j03118A007
17392A06727e8442j37072B72158h3005B89172H904b5947m8625A35432o1987f0801
17380a4100B95543K1844q9972A05251N0721Q2682K4393O0173a33686C45998G4215
17368G9476N87268D8376K41404E7883M3510b45231B16042e8492p2081B73034A32460
$$ plain form
17449 240328 62272 172146 253196 67827 361484 -11052 23540 258336 51647 18715 420713
17438 420713 -32596 -27539 53116 491307 204144 330979 247584 428147 -230059 85213 81719
17427 81719 92685 272396 35819 -23366 426797 176582 333901 -91060 147796 205955 -229020
17415 208631 120930 284425 226386 297585 173426 326694 364825 316432 -173295 158897
17404 58429 -86678 356047 419222 359010 276833 77005 -16034 -64412 244451 141333 1007
17392 106727 -58442 -195514 272158 -83005 289172 8904 -25947 -74572 135432 73445 -60801
17380 -14100 295543 317387 227415 105251 155972 238654 263047 323220 -133686 345998 74215
17368 79476 666744 48376 289780 57883 101393 -245231 216042 -58492 -130573 273034 132460
17356c7830B4044L50533A4779K15571r2272l8553N4985a04029B4316a5646B09437
17344B26449a15866M5278D93178k20964i669E1315N3402K14053A10225J07744
17334B17969J78661a02217A65440M1956M1155h4631k36337C97941q0359C2704
17323C3704O2258L55287A58492p0564k6924N625j3869m251b7192B95023A9190
17311B10185K33583j14923L9293a0403C632M70984k28781A18644j8854J07779
17301B07569J9056H5714J48580k4864j6796Q3341D7983K3821L49553B03237b43494
17289b5599A89189i2207A82364j2435n1308B5490K94112J00N4533a35444A96002
17277E31487c7818B11678R6705p9452H7682P6344J1283J11806I6925j990Q436
$$ plain form
17356 -37830 24044 374577 14779 230350 138078 99525 154510 -104029 24316 -15646 209437
17344 226449 -115866 -70588 493178 272214 -9669 51315 104717 318770 110225 217969
17334 217969 396630 -102217 165440 207396 248551 -84631 -320968 397941 317582 32704
17323 33704 95962 451249 158492 87928 61004 66629 52760 48509 -27192 295023 19190
17311 210185 443768 328845 368138 -10403 3632 474616 245835 118644 99790 207569
17301 207569 226625 85714 234294 209430 192634 275975 47983 71804 421357 203237 -243494
17289 -25599 189189 -92207 182364 169929 118621 25490 319602 319702 374235 -135444 196002
17277 531487 -37818 211678 308383 228931 87682 164026 175309 287115 96925 94935 103371
17266A03371l2761K31028J71931A69584N1619b6974H2851J46901n0995G2480B2813
17254C17041A08843J47180c00917A56579G6578K24956a02349A38423C4780J78503
17244B13283n9210K73039B5891P6460J14324J45503p6596J88036A88138L00964
17234D89102B09419L6814D207J53995N0060L9510K72060i6984j3888B9251K81104
17223C10355L08030B91327r1326o7454j7351K6233K37972A89553K10654a53189
17212A68305J42442i394D12035j58508K37858j09395C8489J13526J83414j8820
17202C16609N3815F6768Q543R7606K101R9442j4969N5886l3886I353K72016k9760
17190B51609p399a9715B87086p0509p6086n128J7024L41389j96746l3523L67434
$$ plain form
17266 103371 70610 301638 473569 169584 221203 -26974 82851 229752 178757 72480 22813
17254 317041 108843 256023 -300917 156579 76578 301534 -102349 138423 34780 213283
17244 213283 154073 427112 25891 102351 216675 362178 285582 473618 188138 489102
17234 489102 209419 246233 4207 158202 208262 247772 519832 -96984 -110872 29251 310355
17223 310355 618385 291327 200001 132547 115196 141429 379401 189553 400207 -153189
17212 168305 310747 -9394 412035 253527 491385 381990 38489 152015 335429 316609
17202 316609 370424 66768 75311 172917 175018 274460 259491 315377 281491 9353 281369 251609
17190 251609 244210 -19715 287086 216577 140491 135363 152387 493776 297030 263507 630941
17179F30941k54951A52989J4908L53115a68409A85046J68182A61933J61352K812
17169C26097j02864K25515A43747m6658m5785L44269C7112K75531n6685m814P6813
17158C27957j42858N4816K90732N3669A40427J16940O2933m598p2075J53067N7235
17147D53929l034Q0128B43114Q4348l4995J41245A4994M49312j57657l6642M5992
17136C15999e5404C41861j21123J33073q3026a29625E19952k43183j25974P8771
17126B29566L22874j27367j68272o7255J55247M37224C08924j22713n1110M43769
17116E78870j43811J48660k61832J40427r0713J31821j8354O3322g0974D46376
17105B53186O3355K48534k72466P2331J1390O6563j98172j0579L37451j36252
$$ plain form
17179 630941 375990 152989 167897 521012 -168409 185046 353228 161933 323285 326097
17169 326097 223233 448748 143747 97089 51304 395573 37112 312643 255958 251144 327957
17158 327957 185099 239915 530647 584316 140427 257367 320300 315702 243627 396694 453929
17147 453929 450895 531023 243114 327462 292467 433712 14994 464306 306649 270007 315999
17136 315999 -55404 341861 220738 353811 270785 -129625 519952 276769 150795 229566
17126 229566 552440 425073 256801 189546 344793 782017 308924 186211 135101 578870
17116 578870 435059 583719 321887 462314 371601 503422 485068 548390 -70974 446376
17105 253186 316541 565075 292609 364940 376330 442893 244721 234142 571593 435341
17095D35341N13461m72631j84442L75801j94658j36093k2099N5643d3287D24680
17084D66401A30358K58808j40329J24854A66678K4699N1089Q9205M5426L3104
17074D10201k7172R8305J21128f668D61374P039j05221o8928K30541A89940m9006
17063A40934L08454r9624J24565J95860k86811J66883L5855c1276F19168k31914
17053C87254J37478H7374M94727B71243M97881l44595J93747j37195J64155j92803
17043D52433J12401B82075M98075j01489J6770k65740J32830N4190Q3075m7923
17033F51863l09563L57200k93551J37003N3931j15639j9841J93804K24110k78700
17023F00617J75346n7453k14666K16459j16454M7594k31962J12722J39061j71640
$$ plain form
17095 435341 948802 476171 291729 667530 472872 336779 314680 370323 -43287 424680
17084 466401 130358 389166 248837 373691 166678 191377 242466 331671 377097 410201
17074 410201 383029 481334 602462 -6668 461374 468413 363192 294264 524805 189940 140934
17063 140934 449388 349764 474329 670189 383378 550261 586116 -31276 619168 387254
17053 387254 524732 87374 582101 271243 769124 424529 618276 481081 645236 452433
17043 452433 564834 282075 780150 678661 695431 429691 562521 616711 699786 651863
17033 651863 342300 699500 405949 542952 596883 481244 461403 655207 879317 600617
17023 600617 775963 718510 503844 720303 603849 651443 419481 532203 671264 499624
17013D99624J89866J34575p2619r7569j73583M98577m01014l3314Q3296K07012
17003H34851l60974R026l521L3201J3347N9941K03466L7540K94667j95355K836
16992I29025l62614J59249J49841M3337J19888j00818k07221j59990J4073R4290
16982F79060o3075L87194N9620m07070k11609K66870K99231N9767M418D83485
16971A056281k22035j61248j50155J49426L54875Q6274l90073M93005m62301K30091
16961I84140l03126K83599j3190K00794p7092J66511k83663j75671K51175R5571
16951A129048j8217J6699J15177j78297K04864j53875k1868l56674L81080j93616
16941I24321p4196R518M15915l63583L40169J58454m36916J91030L27415m75180
$$ plain form
17013 499624 689490 824065 751446 653877 480294 978871 577857 544543 627839 834851
17003 834851 473877 482903 479382 512583 525930 585871 789337 826877 1121544 926189 929025
16992 929025 566411 725660 875501 918838 1038726 937908 730687 570697 584770 679060
16982 679060 615985 1003179 1062799 655729 444120 710990 1010221 1069988 1074406 483485
16971 1056281 834246 672998 522843 672269 1027144 1113418 723345 1216350 754049 984140
16961 984140 681014 964613 951423 1152217 1075125 1241636 957973 782302 1033477 1129048
16951 1129048 1110831 1127530 1242707 1064410 1269274 1115399 1093531 736857 1117937 924321
16941 924321 850125 859643 1275558 911975 1252144 1410598 973682 1164712 1492127 1016947
16931A016947R4438P6735m30440K88263M35258r7332K23820j88770p5101K1667
16921A365485l67354K65856J27105k16044K72034k16541R1623K30790l8146j2195
16911A502613j45383K41574r6041r6914j83266L30050Q8481l67344R8696K16682
16901A589148J6275L02997k18492K437n2690J22109j74790J2066n9787J74146
16891A713419j42080N14260n01142K87522j51988J53819k05622J82015p1674M74697
16881B253226m15553K0393J19477j48831K8268R5711L22996J33187j33148l73575
16871A902151K88809J91889o9095k7523k58595L41961p6650K920l8580L32409
16861B589696J0176j94100J00224M21013k37367j80140o1640M81165K958k2353
$$ plain form
16931 1016947 1111385 1188120 757680 1045943 1481201 1383869 1607689 1418919 1343818 1365485
16921 1365485 998131 1263987 1391092 1175048 1447082 1230541 1322164 1552954 1514808 1502613
16911 1502613 1357230 1598804 1502763 1405849 1222583 1552633 1641114 1273770 1372466 1589148
16901 1589148 1605423 1908420 1689928 1692365 1639675 1761784 1586994 1599060 1539273 1713419
16891 1713419 1571339 2085599 1584457 1871979 1719991 1873810 1668188 1850203 1778529 2253226
16881 2253226 1837673 1858066 1977543 1828712 1856980 1952691 2275687 2408874 2275726 1902151
16871 1902151 2190960 2382849 2313754 2286231 2027636 2369597 2292947 2295867 2257287 2589696
16861 2589696 2599872 2405772 2505996 2927009 2689642 2509502 2447862 2929027 2931985 2909632
16851B909632o2964K64869j86062J8964K15183j75150p8071J80558K24439K8006
16841C339404M8344Q323K48374j28637k19732M42134P6367j80091Q6829M8117
16831C769432R7491Q8722K27033L1144j22405k7531M9286L37693M2275N6133K37224
16820D786497l80945O18770j08726j08255J12525J50899k35770L42559J55866
16811E333420M63470m24443N2708K54420K22511L9433J01266J64661J64353l76206
16801E995593L05437K88565J57214N9569P09216o67381L55760M03320K37130J21265
16791G965688n1066L66130J50253O4085K96439J09547M10989K23688N09316j60922
16781I884147K33411L48339P09102J20895P1946M26035L41234J59672M86061L50205
$$ plain form
16851 2909632 2846668 3111537 2925475 2944439 3159622 2984472 2906401 3086959 3311398 3339404
16841 3339404 3387748 3396071 3644445 3515808 3296076 3738210 3814577 3634486 3721315 3769432
16831 3769432 3866923 3955645 4182678 4213822 4091417 4063886 4113172 4450865 4493140 4549273 4786497
16820 4786497 4405552 5024322 4915596 4807341 4919866 5070765 4834995 5177554 5333420
16811 5333420 5796890 5372447 5425155 5679575 5902086 5941519 6042785 6207446 6371799 5995593
16801 5995593 6301030 6589595 6746809 6806378 7515594 6848213 7203973 7607293 7844423 7965688
16791 7965688 7914622 8280752 8431005 8495090 8791529 8901076 9312065 9535753 10045069 9884147
16781 9884147 10117558 10465897 11174999 11295894 11367840 11793875 12135109 12294781 12780842 13131047
16771A3131047O75100K41834M49770K64926L14908J003485K10653K4028P88945
16762A7104696J019479K35267R59489M90322O23812L46849R12052P91907Q93579
16753B3377452Q39335J024828Q10607J173207J412078J061551J306455J378601
16745C2384114J308698J568877J358445J601068J944161J980641K296604J930840
16737D6373448K108453K543212K803037K663918K850195L141965L816850L134451
16729F9435529M168371L932783M444804M562223M636445M896721N188988N274361
16721A06540225N998221N696982N986256O309519N750279O056548N911979N108473
16713A53358482N492705M790507M344691L532720K706630J597243J173563k5009
$$ plain form
16771 13131047 13806147 14047981 14497751 14762677 15077585 16081070 16291723 16315751 17104696
16762 17104696 18124175 18359442 19318931 19809253 20433065 20779914 21691966 22483873 23377452
16753 23377452 24216787 25241615 26052222 27225429 28637507 29699058 31005513 32384114
16745 32384114 33692812 35261689 36620134 38221202 40165363 42146004 44442608 46373448
16737 46373448 48481901 51025113 53828150 56492068 59342263 62484228 66301078 69435529
16729 69435529 73603900 77536683 81981487 86543710 91180155 96076876 101265864 106540225
16721 106540225 112538446 118235428 124221684 130531203 136281482 142338030 148250009 153358482
16713 153358482 158851187 163641694 167986385 171519105 174225735 175822978 176996541 176971532
16705A76971532j144467k038170l144295l332177m817478m454895n458332o202101
16697A46379617o007756n920229o145633o205973o042900n996558n612227n291187
16689I9157154n401354n248081m722083m525845m346959m044987l837963l401347
16681F3628535l223105l257388k829997k982988k295991k874418k082408j775591
16673D2306649k670500j665328j385873j854986j431754j901764j098800j345233
16665B8952411j015837j335168q30544j263671j040187q48146j004996m29443
16657B1184419j041772n32106m59513o98994r07594o10251o91455l93439o83175
16648A5166120l98813n02539k80991o37236j16866l95787n54523j60648p11203
$$ plain form
16705 176971532 175827065 173788895 170644600 167312423 162494945 158040050 152581718 146379617
16697 146379617 140371861 134451632 128305999 122100026 116057126 110060568 104448341 99157154
16689 99157154 93755800 88507719 83785636 79259791 74912832 70867845 67029882 63628535
16681 63628535 60405430 57148042 54318045 51335057 49039066 46164648 44082240 42306649
16673 42306649 39636149 37970821 36584948 34729962 33298208 31396444 30297644 28952411
16665 28952411 27936574 26601406 25770862 24507191 23467004 22618858 21613862 21184419
16657 21184419 20142647 19610541 19151028 18452034 17544440 16934189 16242734 15849295 15166120
16648 15166120 14767307 14264768 13983777 13346541 13229675 12833888 12279365 12118717 11407514
16639A1407514m48085J59184k23610n79668l26013k49889k05615n05393q5378
16630H943047m17666J78205m05501j97775j22313m07690k41145J39629k97983
16621G170808m69655J97792m77618J42730m0837n92926L11601k43662r9060j51259
16611E747914j60014k08182o6602p9411j67715k16138k3688o6158J12825j48926
16601D723905k27029k94173L92339j64817J21326n62916J52346P5731k20173L39341
16591D335880o07674j98252K10484n3889l20693J89455j46762j8164l91099K83339
16581C282625j67457J0153K227k0694J76069j76307J81807n68054L19090k84328
16571B755131Q7280j62496N7351m2420j92900J79798r5608l8528l65441L7245
$$ plain form
16639 11407514 10959429 11118613 10895003 10315335 9989322 9739433 9533818 9028425 8943047
16630 8943047 8525381 8703586 8298085 8100310 7977997 7570307 7329162 7468791 7170808
16621 7170808 6701153 6898945 6421327 6564057 6523220 5930294 6241895 5998233 5899173 5747914
16611 5747914 5587900 5379718 5313116 5233705 5065990 4849852 4826164 4760006 4872831 4723905
16601 4723905 4496876 4202703 4595042 4430225 4551551 3988635 4140981 4216712 3996539 4335880
16591 4335880 3728206 3529954 3740438 3686549 3365856 3555311 3408549 3390385 2999286 3282625
16581 3282625 3115168 3125321 3127548 3106854 3282923 3106616 3288423 2720369 3039459 2755131
16571 2755131 2842411 2679915 2737266 2694846 2501946 2681744 2586136 2547608 2182167 2219412
16561B219412M12147l56617l12463L41536J498j32180l32368L18851J17524l64612
16551A912728J97113L0514n2493j07459j24029m3255P6685l03763N06730l34563
16541A758208P4742j05162n5938J94525l61623K44842o1165k58327R9427M0597
16531A570126L35107o24173L77581l97703K38519k69685Q4424K31960Q5544m85272
16521A146428j19084L31332k13580Q1524J23282j44438j08614J62356Q4536P6443
16511A420185k86951R7059R4343n2933j01613j85441m23R58K58181k39152O0843
16500A065056l71049P79698l94009Q894k34448K02294K22334m84300r7115K06791
16490I04146P5907K91221k32759M3318O6655j48244l77301M68548l32165K34951
$$ plain form
16561 2219412 2631559 2274942 1962479 2304015 2305513 2173333 1840965 2159816 2277340 1912728
16551 1912728 2109841 2140355 2087862 1980403 1856374 1813119 1889804 1586041 2092771 1758208
16541 1758208 1832950 1727788 1671850 1866375 1504752 1749594 1688429 1430102 1529529 1570126
16531 1570126 1905233 1281060 1658641 1260938 1499457 1229772 1314196 1546156 1631700 1146428
16521 1146428 1027344 1358676 1145096 1226620 1349902 1205464 1096850 1259206 1343742 1420185
16511 1420185 1133234 1230293 1324636 1271703 1170090 984649 984226 985184 1243365 1004213 1065056
16500 1065056 694007 1473705 1079696 1088590 854142 1056436 1278770 794470 697355 904146
16490 904146 980053 1271274 1038515 1081833 1148488 1000244 622943 1091491 759326 994277
16480I94277C93835M63171m731O5491k25410L39999j94660j50022j49763J45732
16470F83642K78017m16472M1499P8489R4959K88703j11650j15892k62050k76160
16460B83085N21212J94811r9823o9428Q4225K86m08774B05575L66448j98080J35823
16449E09766L01163o3884p0955j22579j6751K35321Q9965l39905J11464k61953
16439C71652L10137o6541P9629A23913K42078j20525M93122q1999B91805K29071
16429E20876J81375B61924J91204J11913j60872K97179l46514N615K23132J27109
16419G10690k88208j87187J51909A61396M45454j49028J093J08825p5861o8151
16409D23728J49934B01004J58082o9494l3620K14997R2516B61806p4600L99131
$$ plain form
16480 994277 393835 857006 852275 917766 692356 1032355 837695 687673 537910 683642
16470 683642 961659 545187 586686 665175 760134 1048837 937187 821295 559245 283085
16460 283085 804297 999108 899285 829857 914082 914368 505594 205575 572023 373943 509766
16449 509766 810929 747045 676090 553511 536760 772081 862046 522141 633605 371652
16439 371652 681789 615248 694877 123913 365991 245466 738588 656589 291805 520876
16429 520876 702251 261924 453128 565041 404169 701348 354834 360449 583581 710690
16419 710690 422482 235295 387204 161396 606850 457822 458915 567740 491879 423728
16409 423728 573662 201004 359086 289592 255972 470969 563485 261806 187206 586337
16399E86337J17416j77292k11494K37087k53985L0798M3623o1442j578J30213
16389D39683p9050J06654J22879j72575K27765O9543A67410m4635K55478j56502
16379B21751K41633k16522L44889J0547k88909K21788k15277N8959N9541j32573
16369C05827N2104r0224J41643o779j75485O3265E7864M02992I2863K72072A42945
16357B00501r5666K69102A58288J49183n9470J64210j73118R3567P6746B0636
16346A47034K31535c6443B20838o3163K2711K5609L43293A75428K007K13144A70697
16334A7319J29274J30631q2535q3517B1514L79421K5670A42349J25690k1720A01155
16322B05719K93604A51963k575e3275B58844J05572A18556i7135C70962k5145
$$ plain form
16399 586337 703753 526461 314967 552054 298069 328867 372490 311048 309470 439683
16389 439683 360633 467287 590166 417591 645356 714899 167410 122775 378253 221751
16379 221751 463384 246862 591751 602298 313389 535177 319900 378859 438400 305827
16369 305827 357931 267707 409350 402571 227086 290351 57864 460856 92863 364935 142945
16357 200501 104835 373937 158288 307471 248001 412211 239093 332660 409406 20636
16346 147034 378569 -36443 220838 157675 180386 205995 549288 175428 177435 390579 170697
16334 17319 146593 277224 194689 111172 21514 400935 426605 142349 268039 246319 101155
16322 205719 499323 151963 149388 -53275 258844 364416 118556 -97135 370962 345817
16312C45817j2007e911J438D18993j32999L9221I120L61864J05218G2352N2786
16301A25138P9797Q8162q4606I9557j6648P7127p3283J9690J91401j20081k1855
16290A55908n4830b6149D87751b66659C37225j10515j02139J13839n8477A0488
16279C03769c35818F9545J73977q6437P6094f587A25560c4533B91589A13880J28353
16268B42233A07137L30311A49938h0320A47922N9120n1152k4786L1438K01594
16258C64136j62377e2984N417C91095j54909l1386A01463P4649F8655J52089F5320
16246a16319q2848C35f0211C74217b1200A12867J8278J40653R4294B8467O6089
16235I4556j6808K84156L315A79179a02219h41p4175o025E1400L6784h4773b2328
$$ plain form
16312 345817 333810 -5911 -4473 418993 285994 325215 9120 370984 476202 72352 125138
16301 125138 204935 293097 208491 99557 82909 160036 86753 106443 297844 177763 155908
16290 155908 101078 -26149 487751 -266659 337225 226710 124571 238410 179933 10488
16279 303769 -335818 69545 243522 157085 233179 -6587 125560 -34533 291589 113880 242233
16268 242233 107137 437448 149938 -80320 147922 207042 155890 131104 162542 364136
16258 364136 201759 -52984 -47567 391095 236186 204800 101463 176112 68655 220744 65320
16246 -116319 -199167 335 -60211 374217 -21200 112867 131145 271798 366092 28467 94556
16235 94556 77748 361904 365219 179179 -102219 -841 -75016 -81041 51400 88184 -84773 -22328
16222A93225K1348J88038f7934K2097A69708b21569C181f1304I1763a41389G1337
16210B1148L2765K33781A462L4844b09448a3108p2889C2345K3068a0488A47627
16198D7477A1566e2256H4761a21430e6658A11660l7456a86066p5852E1482L0497
16187H1979P3194C2915J45386n7123J33505h0349l832j71787C19761g7066A24749
16175b27219J2270B59509i8459j5871o138C40550b76r6340m0681e0756C2082b61670
16162i7707D02997D4077a19561L8246C4514e0152N545j51909A2059A105c8824
16150c03290e664C59547b38965B89296g2672j49688A88747E5731j4848b11101
16139i8552c9912A96674I6862d7356A47619K3374e153B4914K25326a33837o817
$$ plain form
16222 193225 214573 402611 -67934 -45837 169708 -221569 3181 -61304 91763 -141389 71337
16210 21148 53913 287694 1462 36306 -209448 -13108 -85997 32345 55413 -10488 147627
16198 47477 11566 -52256 84761 -121430 -56658 111660 74204 -186066 -261918 51482 81979
16187 81979 155173 32915 178301 121178 254683 -80349 -84181 -255968 319761 -77066 124749
16175 -227219 -214949 259509 -98459 -114330 -120468 340550 -276 -96616 -137297 -50756 32082 -261670
16162 -97707 402997 44077 -119561 -81315 34514 -50152 -44607 -196516 12059 1105 -38824
16150 -303290 -5664 359547 -238965 289296 -72672 -222360 188747 55731 40883 -211101
16139 -98552 -39912 196674 96862 -47356 147619 170993 -5153 24914 250240 -133837 -140654
16128a40654A16610n4402j7552K43840j39962a83476i297B19140b09410B20317
16117A40821M7892K8979o1094a21917B1331a53787B9573Q9775d0903B22863r9824
16106A23039c4770C22800A32237n5193a13043A28843J32341I0926L0071b10970
16095H0138B1141b15363A64790i3615E7044g8928C5741K92050p1460B3504I268
16083A82750D2619L8476Q6346C0647f3449D27058A00377R9249a02172c6167D4867
16071D6330a47078l9498B85720E3319a50075H9003B7227A323a25280A73035p7108
16060I5927b13089A63728b30606I1143J04708C3777b64656D3703a07620I0589
16049I48c399k48341D5598e1024r8732M3362a2740N599B77537m6776b69333h5911
$$ plain form
16128 -140654 116610 62208 44656 288496 148534 -183476 -9297 219140 -209410 220317
16117 140821 188713 217692 156598 -121917 21331 -153787 29573 119348 -40903 222863 123039
16106 123039 -34770 322800 132237 77044 -113043 128843 261184 90926 120997 -210970
16095 80138 21141 -215363 164790 -93615 57044 -78928 35741 327791 256331 23504 9268
16083 182750 42619 81095 167441 30647 -63449 427058 100377 199626 -102172 -36167 44867
16071 46330 -147078 -186576 285720 53319 -150075 89003 27227 1323 -125280 173035 95927
16060 95927 -213089 163728 -230606 91143 195851 33777 -264656 43703 -107620 90589
16049 948 -3399 -251740 45598 -51024 -149756 -106394 -12740 -7141 277537 230761 -269333 -85911
16036F6668k4917b13940R084Q9684I5278b1077o3834J3512a0463B35313d2892
16024d3019J9252A03682f5109H0091d3266m55476A625L67229e76A0921Q240J60809
16012A79970G5683A3641b47834B8144J3385K78544a61524A1407d6056j04294N1940
16001i8410C9676O8396a9193k33079A73121L1727a54941M8361j93959h3393H0289
15989A35179C8135j73a76669g7D0565a44371L2411A53486a79935B14052D692f9343
15976D0024J06098k6357B3098M6997a54969B32167l6568L33923e5635C80860j28218
15965B52642G5784i5609J8922j20375Q7044K5496h357j19286R315F4054a7589
15953c4952M051j62638A96435b1522f667F4375N8215J4470J34205a12900A51519
$$ plain form
16036 66668 41751 -213940 -204856 -115172 95278 -21077 -84911 -71399 -10463 235313 -42892
16024 -43019 -23767 103682 -65109 80091 -43266 -498742 1625 368854 -576 10921 19161 179970
16012 179970 75683 13641 -247834 28144 41529 320073 -161524 11407 -46056 -150350 -98410
16001 -98410 39676 108072 -19193 -252272 173121 204848 -154941 -106580 -300539 -83393 80289
15989 135179 38135 37962 -176669 -77 40565 -144371 -111960 153486 -179935 214052 4692 -69343
15976 40024 146122 119765 23098 70095 -154969 232167 195599 529522 -55635 380860 252642
15965 252642 75784 -95609 -76687 -197062 -110018 -84522 -8357 -127643 -118328 64054 -17589
15953 -34952 -30901 -193539 196435 -21522 -6667 64375 122590 137060 271265 -112900 151519
15941A04312a7798A26378J69630g1953L2913r1830k4618C1022b50776o4200L9031
15930b75945a0841r4453F2628J21089e2836B40624A17532c62616H4940a41465
15919h713A1520a2663k43908j13617J41824i1993b3439m9020J8714H6978e5705
15907A41416a27620B69529i0641k21279A10872B6963J69534i5878q1640B69787
15896B7545a60109g6954j69j24652c5003j25630L9447B88107b52759B94335I3222
15884H5673i9610J4983J4365j83197h1353l7581A67764i399A15093K36133E1834
15872d852q3330b8851O843B3353a7528F8482a43874H1842O9513D2160c42453A07969
15859D6605h3662A48875J20979p6120a64069J0136A0659a58558N8075j12957G1449
$$ plain form
15941 104312 -17798 126378 296008 -71953 -39040 -130870 -155488 31022 -250776 -314976 -275945
15930 -275945 -10841 -105294 62628 183717 -52836 240624 117532 -362616 84940 -141465
15919 -8713 11520 -12663 -256571 -370188 -228364 -91993 -23439 -72459 -53745 86978 -55705
15907 141416 -127620 269529 -90641 -311920 110872 26963 196497 -95878 -177518 269787
15896 27545 -160109 -76954 -77123 -201775 -35003 -160633 -121186 288107 -252759 294335 93222
15884 85673 -99610 -84627 -70262 -253459 -81353 -118934 167764 -9399 115093 351226 51834
15872 -4852 -88182 -28851 -22008 23353 -17528 68482 -143874 81842 151355 42160 -342453 107969
15859 46605 -83662 148875 269854 193734 -164069 -153933 10659 -158558 -100483 -213440 71449
15847a35032f1813E5636a04962J9154J3279l89173L9833H8441J63996d973F515
15835g1964j61904A85010G5110g7405l679L3774k48224a08521A17548Q4572H4891
15823a79135C81691A65230q2265J87746c7526A51277N5298e5044j9771p5209C0141
15811A36198l7360f7245j40995D58822b40535a15098E2799J934J30247i7148j83379
15800b80527d7877A87951C6617j5380J27651O7973q8070K393P1871a60111P3568
15789h6543a6237H1837a81488P1807A56017f7663A47969n0885B2097j1040L97460
15778D08517j81737F250a02287j8385I3160a97956B81257j01911c10478C83581
15767a18983j33087B7688a17096k96287B5010M5451B5745b61018A61806h8653
$$ plain form
15847 -135032 -61813 55636 -104962 -85808 -72529 -461702 -421869 88441 252437 -4973 6515
15835 -71964 -233868 185010 75110 -77405 -81084 -47310 -295534 -108521 117548 202120 84891
15823 -179135 381691 165230 82965 270711 -37526 151277 206575 -55044 -74815 -150024 30141
15811 136198 98838 -67245 -208240 458822 -240535 -115098 52799 54733 184980 -97148 -280527
15800 -280527 -47877 187951 36617 21237 148888 216861 128791 131184 203055 -160111 -86543
15789 -86543 -16237 81837 -181488 -109681 156017 -67663 147969 97084 22097 11057 408517
15778 408517 226780 6250 -102287 -120672 93160 -197956 281257 179346 -310478 383581
15767 -118983 -252070 27688 -117096 -413383 25010 70461 25745 -261018 161806 -88653
15756A49669L0942c42926K1520C1374a97250I8892M3847a27479b9208j43923B50123
15744F9316a57452E1584i1865A44501O0166a724j93676P6520n6122r0740d7280
15732E9410Q3402N4158E367K04130g0861B25008f2414B8035a92496E1419P6491
15721A27910b67624a525n0216A69563H4367f2694r8071e7119A4211a21197j90455
15710c11652J07684j8565a7125j61894J1942A19856C9812g5257p4477I2163b91487
15698a41480M6639K7670m2770L88A22569g1134o0520q5988l4343I4625a85054
15686H6132A9470K32633i336o2145I5173Q530C8348K2349k6379M0935P3368a58228
15673A45691d7663m5790B94884A7032J32363a24679F9535P7990D7153J5514j3549
$$ plain form
15756 149669 180611 -342926 -321406 31374 -197250 98892 142739 -127479 -29208 -173131 250123
15744 69316 -157452 51584 -91865 144501 204667 -1724 -195400 -118880 -175002 -265742 -47280
15732 59410 142812 196970 5367 209497 -70861 225008 -62414 28035 -192496 51419 127910
15721 127910 -267624 -1525 -51741 169563 84367 -62694 -160765 -57119 14211 -121197 -311652
15710 -311652 -203968 -222533 -17125 -179019 -167077 119856 39812 -75257 -149734 92163 -291487
15698 -141480 -94841 -67171 -109941 -109553 122569 -71134 -131654 -217642 -251985 94625 -185054
15686 86132 19470 252103 -9336 -71481 95173 103703 38348 60697 34318 75253 148621 -158228
15673 145691 -47663 -93453 294884 17032 149395 -124679 69535 147525 47153 62667 49118
15662D9118j3357a62840a5048B71b41805H106a86586A72600H1783b09056Q9219
15651a19837A94256b09950a1980A46482n7314K2160b19915l0063J11775A44079
15640d6489A07629b0369n8780j91678h3474C2268i2178o4930A28050m2406M9330
15629A34974a93086D0005M0189k989j3190f7427l9276A6845e6737l58742a63584
15617A46509a54530F9287g2238B79148i9457o0028k89953J64597g889G009J85766
15606A92775A7187M04855a35027D510J5294K42183K4316f4957j56451A558O3409
15595F4967b10206A85999l4903a10752A98091o3313P302i0043A23300b04341H6367
15583A21262c2111k53493G2685O7153R204f3114p7358a7275r349C3279M3778C0792
$$ plain form
15662 49118 35761 -162840 -15048 271 -241805 8106 -186586 172600 81783 -209056 -119837
15651 -119837 194256 -209950 -11980 146482 89168 111328 -219915 -249978 -138203 144079
15640 -46489 107629 -20369 -79149 -270827 -83474 32268 -92178 -157108 128050 85644 134974
15629 134974 -193086 40005 80194 77205 64015 -67427 -106703 16845 -56737 -415479 -163584
15617 146509 -154530 69287 -72238 279148 -99457 -159485 -449438 -284841 -7889 7009 192775
15606 192775 17187 422042 -135027 4510 19804 261987 286303 -64957 -221408 1558 64967
15595 64967 -210206 185999 151096 -110752 198091 134778 142080 -90043 123300 -204341 86367
15583 121262 -32111 -285604 72685 139838 149042 -63114 -140472 -17275 -26624 33279 77057 30792
15570c7994G4211a9882I4850b5624D69002c46885A46586h1860K7712A8757a4560
15558a87775i0906G4493b9924A81186h0796k73094a41952N6974j33808C29973
15547b87817J0355K6189c988E4985K25543I5217K65863c75368I9970b36940I4413
15535A03563K88856a46869n3008G1587A2933R688R664b18624B56799b36783h8514
15523h6603L5371A71759K3429a45576e9929J5020j27707P5441K4491D4002J45315
15512A89317p8396b9792j06492c9172A87992C4804b43613b8484A80106L961r2003
15501I2064a46239C71369a34192j9885F2648b8979j13684e2734A13610a27049
15490h3512j08719B62273i3687j04142E1240J36166a10157A23784c4864k13130
$$ plain form
15570 -37994 74211 -19882 94850 -25624 469002 -346885 146586 -81860 -54148 18757 -14560
15558 -187775 -90906 74493 -29924 181186 -80796 -353890 -141952 -84978 -218786 329973
15547 -287817 -277462 -251273 -3988 54985 280528 95217 361080 -375368 99970 -236940 94413
15535 103563 392419 -146869 -199877 71587 12933 22621 32285 -218624 256799 -236783 -88514
15523 -86603 -51232 171759 195188 -145576 -59929 -44909 -172616 -97175 -72684 44002 189317
15512 189317 110921 -29792 -136284 -39172 187992 34804 -243613 -28484 180106 184067 92064
15501 92064 -146239 371369 -134192 -154077 62648 -28979 -142663 -52734 113610 -127049
15490 -83512 -192231 262273 -93687 -197829 51240 187406 -110157 123784 -34864 -247994
15480b47994J1962j12555a42286j63766J32241l9464B93524B8786a54500A80708
15469H0849a21822L8625k10811O1969f0226E1908M9634a54726R944j0766j99129
15458c54677D7417b20776B77481p6884k4871A7295G640f6437j23975g9814j70933
15447b50747f5892H0058K02483f9936q110J2255B25705g178m3038o6202A89652
15435G6150b17799B41209b70024C5609e3484j12246B21880r9756B2932J47460
15425A70392e4390B01465r2188L546e3609n0233N0365B49668A9938M07i3512j18298
15413b11810N9380A29565b45840D50851D1263K39378R5043a14252A11688b09144
15402a98083C57726c9960q9751j066n8648C0149o372c1080A84766f171A2712K57720
$$ plain form
15480 -247994 -236032 -348587 -142286 -306052 -173811 -213275 293524 28786 -154500 180708
15469 80849 -121822 -83197 -294008 -232039 -60226 51908 101542 -154726 -144782 -155548 -354677
15458 -354677 47417 -220776 277481 200597 175726 17295 7640 -66437 -190412 -79814 -250747
15447 -250747 -65892 80058 282541 -69936 -78046 -65791 225705 -7178 -50216 -116418 189652
15435 76150 -217799 241209 -270024 35609 -53484 -165730 221880 122124 22932 170392
15425 170392 -54390 201465 109277 112823 -53609 -103842 -53477 249668 19938 20345 -93512 -211810
15413 -211810 -152430 129565 -245840 450851 41263 280641 375684 -114252 111688 -209144
15402 -198083 357726 -39960 -129711 -130777 -189425 30149 23777 -31080 184766 -6171 12712 270432
15390B70432I8082K45906A17276a81271K0748d41A4442d8610D4486R5443J9924
15379A59853i6976j1533B47989A207K29886l8886k4603b96133D3047d68293D57
15367a78155G5123J23308c517A70060A3025a65266A3619R2389C8147a99598A83882
15355a6853j702l41963j74509A84014q6778B6426K9513a58830B35746g4125E8574
15343c36693d3139A01337B6666R1822k4188J62993b30629A10660J32939j333a22619
15331a70911B11216e7961k53608B15597a24197p3203I5912g2473I1516a6524k1367
15320c7891a7350j13856D77612a13826l08731F733N3672a16052q6871b047q1535
15309h3582b9056D1634J90578b2711C1861A0782b27628N729C8163R9634a15234
$$ plain form
15390 270432 98082 343988 117276 -181271 -160523 -441 14442 -48610 44486 139929 159853
15379 159853 -96976 -108509 247989 1207 231093 192207 167604 -296133 43047 -468293 457
15367 -178155 75123 198431 -3517 170060 13025 -165266 13619 106008 38147 -199598 183882
15355 -16853 -18555 -360518 -535027 184014 97236 26426 55939 -158830 235746 -74125 58574
15343 -336693 -43139 101337 26666 118488 94300 257293 -230629 110660 243599 242266 -122619
15331 -170911 211216 -57961 -311569 215597 -124197 -197400 95912 -72473 91516 -16524 -37891
15320 -37891 -17350 -131206 477612 -113826 -422557 6733 60405 -116052 -202923 -2047 -83582
15309 -83582 -29056 41634 232212 -22711 31861 10782 -227628 -221899 38163 137797 -115234
15297A47152l2278b68781A80606a77388K7321C9592K28307j18977h0163j9678
15287i9841k43685A98052b98748B5656J41615N6868o9500i141j34898n2358B34760
15275b18097A72041d2517B78073f9550D0394Q8007L49002D7259j0304f6646A6763
15263A64961q942j7256B8982R3571k9156L7215a04472q4732h5993B74763b23498
15251e2656A9207a74998D1561j6409f9329A40770a21107l3851f4921j70307B3542
15239D5777J57518L57826A36876L24541k11852M57694O30716r4552M4419n12616
15229G75226C35847A08815K26749O4503j81797k1186P0572A22970f0935A5022
15218A98351a15013A15899J52856I1702a36305A83135g8429l5686k8120j22203
$$ plain form
15297 147152 114874 -268781 180606 -177388 -150067 39592 267899 148922 -80163 -99841
15287 -99841 -343526 198052 -298748 25656 167271 224139 154639 -9141 -144039 -196397 234760
15275 -218097 172041 -42517 278073 -69550 40394 128401 477403 47259 36955 -66646 16763
15263 164961 156019 138763 28982 122553 93397 130612 -104472 -189204 -85993 274763 -223498
15251 -52656 19207 -174998 41561 25152 -69329 140770 -121107 -154958 -64921 -235228 23542
15239 45777 203295 561121 136876 461417 249565 707259 1337975 1243423 1287842 775226
15229 775226 335847 108815 335564 400067 218270 197084 267656 122970 -60935 15022
15218 198351 -115013 115899 268755 91702 -136305 183135 -78429 -114115 -142235 -264438
15208b64438H1038d7327m06679I9641j9079a20960A0605J09722J48760F6591J62941
15197B29532I5055H512J81198i3666B32980H1269a51519o7950e6604c490A65596
15185D35a37203D9294J17530a22364c2716B27476j11424m3515i6374B42710e3910
15173b23901P148d3180j50727F3828c4899k70622F3657K72920j53109b16383c1094
15161C28590a04774e0339C90067a59047A07387P9528P068a1741A62471n7795a32433
15149B98796b87391J36855c8689A33035a3637k9951F1859K03344a52663A23545
15138b0976C18735j36930K12590b1401C62615A35329A0070K47678b28365I6176
15127A43989A8836R4171c3031m4987B28591l2068a29037A63848c2806A21768g4134
$$ plain form
15208 -264438 81038 -47327 -454006 99641 80562 -120960 10605 120327 269087 66591 229532
15197 229532 95055 8512 189710 -93666 232980 81269 -151519 -219469 -56604 -3490 165596
15185 435 -137203 49294 166824 -122364 -32716 227476 116052 72537 -96374 242710 -53910
15173 -223901 -216753 -43180 -193907 63828 -34899 -305521 63657 336577 183468 -216383 -31094
15161 328590 -104774 -50339 390067 -159047 107387 186915 193983 -11741 162471 104676 -132433
15149 298796 -287391 -150536 -38689 133035 -13637 -43588 61859 265203 -152663 123545
15138 -20976 318735 181805 394395 -21401 362615 135329 10070 257748 -228365 96176
15127 143989 18836 113007 -33031 -78018 228591 196523 -129037 163848 -32806 121768 -74134
15115B14349c33261A37168l5329L70009B34882E1193J33312a3362B78283A03900
15104c09998C2816e7358k452C9920c3826B3998h266j31492B7658K37478f9708
15092I7293J04215E5063a89138I1858R4689F3958J34009a54308D52642b02573
15081A61416n4643D963R5388J03135r9346J40326b8076B29523d317B92294F4418
15069A27884P1341a09780C58354H8653J02314J47980j49715b07856B91112B0611
15058A00841K82738F4006M14261c618C68676j29160d3624A24522J28252O0002
15048C12776I3979K15304j32590Q8324A28899M7106C7356L85943A25977J15744
15038B41721N9556M3719J98774A67160a98802C17362d8920A53674J91609e757
$$ plain form
15115 214349 -333261 137168 101839 471848 234882 51193 184505 -13362 278283 103900
15104 -309998 32816 -57358 -59810 39920 -33826 23998 -8266 -139758 27658 265136 -69708
15092 97293 201508 55063 -189138 91858 186547 63958 197967 -154308 452642 -202573
15081 161416 106773 4963 100351 203486 104140 244466 -28076 229523 -4317 292294 64418
15069 127884 199225 -109780 358354 88653 190967 338947 189232 -207856 291112 20611
15058 100841 383579 64006 478267 -3618 368676 239516 -43624 124522 252774 312776
15048 312776 93979 309283 176693 265017 128899 176005 37356 423299 125977 241721
15038 241721 301277 344996 543770 167160 -198802 317362 -48920 153674 345283 -5757
15027C33647A8708M3541e6520B0416N4150b51408A46515p0055R1600N8190r1950
15016A34300J11052E3379J43050e0420C48312k2780k3557j7409N0841j45750K9186
15005B18843r4819L62520a5274B21870E7202L11232j14342A18910J14401E5474
14994A07892J19411J46882E5093K15487M5837r589j23902C873a03813A62999L55146
14983E18145B46979J06704A07801M2757a38025A86321L0474H0623K23030i6732
14972e7396B89427L0729j07437N2242A6853M72906a35400F5712L05075a8910A48207
14960A06384J1573d6964D2997K8782K0763Q3874R4750O8190j19979J32047M3411
14949C94835j53339J58123l5459K28719A01804P6734K3171q4350m293m7218k1092
$$ plain form
15027 333647 18708 62249 -56520 20416 74566 -251408 146515 76460 168060 226250 134300
15016 134300 245352 53379 196429 -50420 348312 325532 301975 284566 335407 189657 218843
15005 218843 124024 486544 -15274 221870 57202 368434 254092 118910 233311 55474
14994 107892 227303 374185 55093 270580 316417 306828 182926 3873 -103813 162999 518145
14983 518145 246979 353683 107801 150558 -138025 186321 216795 80623 303653 -96732
14972 -57396 289427 320156 212719 264961 16853 489759 -135400 65712 370787 -18910 148207
14960 106384 117957 -46964 42997 71779 92542 176416 271166 339356 219377 351424 394835
14949 394835 241496 399619 364160 592879 101804 178538 201709 117359 113066 65848 44756
14938D4756m631L62033A2614K32487j10390N2099E8206J30200J43044k5738Q9429
14927C95141a1393H1635J19085J17373J0341l39b6940B56440r4107K16232n3912
14916C24653j08292J63643A1897L70161r3968I2024J50758J2727H7459L28863
14906D16322j5389J12096F0174O5287n4134K69667r0047M98L9575j2364J0932
14895B89588A7392O9512J26779r2829l992L69550m9051A0965O86162O832l08606
14884C95353I2078L20732H1458M28826A97664d8281A89334J77349H7819R2395
14874A80214L39059A89646O4351F0973R7029J85408J77136k49916k5575P7457
14864C22512A28093Q2455p3894d3826B00133L36527k09417j27801r7287M14476
$$ plain form
14938 44756 40125 402158 12614 245101 134711 186810 58206 188406 331450 305712 395141
14927 395141 -11393 81635 200720 318093 328434 328095 -26940 256440 162333 378565 324653
14916 324653 216361 380004 11897 382058 288090 92024 242782 255509 87459 416322
14906 416322 400933 513029 60174 125461 71327 340994 250947 251445 291020 278656 289588
14895 289588 17392 86904 213683 120854 116862 486412 437361 10965 697127 703959 395353
14884 395353 92078 412810 81458 510284 197664 -48281 189334 366683 87819 180214
14874 180214 519273 189646 253997 60973 158002 343410 520546 270630 245055 322512
14864 322512 128093 210548 136654 -43826 200133 536660 327243 199442 102155 516631
14854E16631B38838L01440j23519k05979K67599r7511j53684j06848K00951M6707
14844C67994k3014K1970K95549A89619J38378j51369J04211C2698J67303K91436
14834D91437J069q5415j67887J37401j0438k6025j6318K96191H8287J31756K28909
14823D48952J25333L6654m9582j54376j65700L00490o9214A95163J29585m4639
14813B80109J24505m5678K6132j18677p1668K44847l5115P147K55125C30886M0724
14802C71610j33746L43698A99644O4473J19567J40094A87824m5152M47745k90302
14792C00115J53581L8500P8618j34729n6379J40715A73223L45616j09575J58625
14782E67889n6989r4150J68528J62481M8049A83564K58971J57722P643l02780
$$ plain form
14854 516631 238838 540278 416759 210780 478379 380868 227184 120336 321287 367994
14844 367994 344980 366950 662499 189619 327997 176628 280839 32698 200001 491437
14834 491437 492506 407091 239204 376605 366167 340142 323824 620015 88287 220043 448952
14823 448952 574285 610939 561357 406981 241281 541771 472557 195163 324748 280109
14813 280109 404614 358936 385068 266391 194723 439570 404455 411602 666727 330886 371610
14802 371610 237864 581562 199644 264117 383684 523778 187824 142672 590417 300115
14792 300115 453696 492196 570814 436085 379706 520421 173223 518839 409264 567889
14782 567889 510900 416750 585278 747759 795808 183564 442535 600257 607900 305120
14772C05120R8076O13063m99855L2805j77119j9400J01631o4894J73149k4859
14762E37717m892o2139R2535J63127B00357K27698P9447l1343j2608J37098L40039
14751I40688r9500j46113j75351j66535Q6108R6531K95560l95418J15616q1307
14741D70279J41966k00830Q5148Q6188J78989k01927L15422k29298q8118J3126
14731E70945m8545M2269l1355J84386J26226J9387k34015J26256j8931n7655Q273
14720F87241j94553K00619k0539n6742n1034j1348L25740k29125J39666k4770
14710G65155j31770K03407J19850l77618p4016J17720L61429k34595J71595m01028
14700E20129J38388J55124L7309J86020l18978J43870K17956m15951J43640j38068
$$ plain form
14772 305120 403196 1016259 516404 549209 372090 352690 454321 389427 562576 537717
14762 537717 532825 470686 563221 726348 200357 428055 507502 476159 463551 600649 940688
14751 940688 841188 695075 519724 353189 439297 535828 831388 435970 551586 470279
14741 470279 612245 411415 496563 582751 761740 559813 875235 645937 557819 570945
14731 570945 522400 564669 533314 717700 843926 863313 629298 755554 736623 678968 687241
14720 687241 492688 693307 672768 616026 564992 553644 879384 650259 789925 765155
14710 765155 633385 836792 956642 579024 505008 622728 984157 749562 921157 520129
14700 520129 658517 813641 850950 1036970 717992 861862 1079818 663867 807507 669439
14690F69439J43815p6525j49477L88044K8628n510k73443K41561l31964P4451
14680G09019K8364j97555M88061K12001n63063L77125k23811j39683j56799K98338
14670H31997j1565L1188p9863J04837j21156N67539l73400L5220j67162J09376
14660I27011l175k9141n916o7802K11210j14991j01672O5085j22596R0057J82370
14649A030440l66995L78225k29492L73859j36182k83209M73804l60005r7879J64530
14639I47096J91140l04283M3942K73620m06098K68070K4573m1293J58090j328
14629A153529Q4835P4236j90541L08662l01041q6725K73482j43054J7922j35825
14619A055480N01L94642j58567l50847O60230l97551k06416K47035k07418j3572
$$ plain form
14690 669439 813254 736729 587252 975296 1003924 998414 724971 966532 634568 709019
14680 709019 737383 539828 1027889 1239890 676827 1053952 830141 690458 533659 831997
14670 831997 820432 851620 771757 876594 755438 1322977 949577 984797 817635 927011
14660 927011 923836 894695 888779 820977 1032187 917196 815524 880609 758013 848070 1030440
14649 1030440 663445 1041670 812178 1186037 1049855 766646 1240450 880445 782566 947096
14639 947096 1138236 833953 877895 1151515 745417 1013487 1038060 996767 1154857 1153529
14629 1153529 1238364 1312600 1122059 1430721 1129680 1042955 1316437 1173383 1191305 1055480
14619 1055480 1055981 1450623 1292056 941209 1601439 1203888 997472 1244507 1037089 1023517
14609A023517P12774o68891K89766M12767l34704J04083l74486M31162q9600n2406
14599A453982k15443P14444l79762L144k63600J94656j51224K2838q0582K6116
14589A324569p5866L4761K41005J7319l10663K62629J75425K03412m89922R8212
14579A480881K60401J41047k00833m01386N15663O3676l29093K62693o1431r5730
14569A635888j20034m1745N05109N5633j74072k49661K45473R6964M2972Q3697
14559B080224k27740N1390K55926k23308L36435k23373P4102j06710O20960j88256
14549B449650j95707J40057K46619k8299k04504O61760R865p6713Q07765l46098
14539C464395K91332R13849N84866Q67281R04653K659760M016842O905535J1611646
$$ plain form
14609 1023517 1736291 1067400 1357166 1769933 1435229 1539312 1164826 1595988 1506388 1453982
14599 1453982 1238539 1952983 1573221 1576365 1312765 1507421 1356197 1379035 1298453 1324569
14589 1324569 1248703 1283464 1524469 1541788 1231125 1493754 1669179 1872591 1382669 1480881
14579 1480881 1741282 1882329 1681496 1280110 1795773 1859449 1530356 1793049 1731618 1635888
14569 1635888 1515854 1474109 1979218 2034851 1860779 1611118 1856591 1953555 1996527 2080224
14559 2080224 1852484 1903874 2159800 1936492 2272927 2049554 2123656 2016946 2637906 2449650
14549 2449650 2253943 2394000 2640619 2612320 2407816 3069576 3079441 3002728 3810493 3464395
14539 3464395 3755727 4669576 5254442 6121723 7026376 9686136 13702978 20608513 32220159
14530C2220159j103718j2427057p908118m676919j823165q81680n33560K5027
14522B890969k96199j46960l70006J79062J34400Q3345l68747K79053m48558J37296
14512B073655J11604J69372k44984l4751K90216j7877j18297k67654N78043k5483
14502B513844j21091N1208J12700k32288L55425k65581J73911j34126n6045L99279
14492B797236l24276K67999q5681n6461p4872J98193M09118k79261j21054j35940
14482B595001Q4743L60201l03084L74657J72638k76609Q4210N60168n18251L21908
14472C455582Q6385j84877J64577l47502N05093j19944L4200L7990j39221M8952
14462C541235o3045M52701K18353p3000J52234n85667K63467n362K54359l524
$$ plain form
14530 32220159 31116441 18689384 10781266 6104347 4281182 3399502 2865942 2890969
14522 2890969 2594770 2447810 2077804 2256866 2391266 2474611 2105864 2384917 1936359 2073655
14512 2073655 2185259 2354631 2109647 2074896 2365112 2347235 2228938 1961284 2539327 2513844
14502 2513844 2392753 2443961 2556661 2324373 2679798 2414217 2588128 2454002 2397957 2797236
14492 2797236 2472960 2740959 2655278 2598817 2523945 2722138 3131256 2851995 2730941 2595001
14482 2595001 2679744 3039945 2736861 3111518 3284156 3007547 3091757 3651925 3133674 3455582
14472 3455582 3541967 3357090 3521667 3174165 3679258 3559314 3593514 3631504 3492283 3541235
14462 3541235 3478190 3930891 4149244 4076244 4228478 3642811 3906278 3900916 4155275 4151751
14452D151751J37159P1188j82190J03723P6J58642j07653j1280J51048K77200
14442D749664K55029n92044j4826K25635N5503L53130j48164O0870J20088R1386
14432E156271M7528O4889j63001N10831m10935J02413L26005J88050j8721r3527
14422E709803k2108K81791k7782L87008K3786j87932R0196J53980J76602p1160
14412F514184L64438k00884j03687O50536n45763M38694L11543L33589k75196
14403G487454J8799M54669O4927Q5578j76463j81736M56629N81703m28874J34219
14393H496905K30292L03362M7032K05257K08446m04343J36818O30288J37756L51058
14383A0342871j81420M10113L6964n428N22940J84358J28054j01412M77984J54703
$$ plain form
14452 4151751 4288910 4360098 4177908 4281631 4281707 4440349 4332696 4321416 4472464 4749664
14442 4749664 5004693 4412649 4397823 4623458 4678961 5032091 4883927 4944797 5064885 5156271
14432 5156271 5203799 5268688 5105687 5616518 5205583 5307996 5634001 5822051 5803330 5709803
14422 5709803 5687695 5969486 5941704 6328712 6352498 6164566 6254762 6408742 6585344 6514184
14412 6514184 6878622 6677738 6574051 7224587 6678824 7117518 7429061 7762650 7487454
14403 7487454 7506253 7960922 8025849 8111427 7934964 7753228 8209857 8791560 8362686 8496905
14393 8496905 8727197 9030559 9077591 9282848 9491294 9086951 9223769 9854057 9991813 10342871
14383 10342871 10161451 10571564 10608528 10603100 11126040 11310398 11438452 11337040 11815024 11969727
14373A1969727M2509M61602J64762K23915J07189J81950K41004P0534P13118j47310
14363A4029000L19522P19220J85300L52328r1939M53695L22122K08239O94863
14354A7192350q167L26063P98052k4144N11803M49689M40385J92293O96027N06506
14344B1080857R7139N19811Q22254L04336Q56480M18334O21917Q44476M80550
14335B6046154O68082N32195N41196R90590Q16579M92385N78221Q73565J193973
14326C2732940J068869L88517J153263Q20929J297447J028453J334528J052445
14318D0877391J190570J355376J364025J617040J357115J509460J686376J920688
14310E2878041J900785J979668J576347K399779K163988K515843K619037K516725
$$ plain form
14373 11969727 12012236 12473838 12638600 12862515 12969704 13151654 13392658 13463192 14176310 14029000
14363 14029000 14348522 15067742 15253042 15605370 15513431 15967126 16289248 16497487 17192350
14354 17192350 17184183 17510246 18308298 18284154 18795957 19245646 19686031 19878324 20574351 21080857
14344 21080857 21177996 21697807 22520061 22824397 23680877 24099211 24721128 25565604 26046154
14335 26046154 26714236 27246431 27787627 28778217 29594796 30087181 30665402 31538967 32732940
14326 32732940 33801809 34190326 35343589 36164518 37461965 38490418 39824946 40877391
14318 40877391 42067961 43423337 44787362 46404402 47761517 49270977 50957353 52878041
14310 52878041 54778826 56758494 58334841 60734620 62898608 65414451 68033488 70550213
14302G0550213K663242K880241L153385L203944L487819L351619M126049L576178
14294I6992690M906072M439304M796990N276613N475630N946352O370413O773037
14286A40977101O924633P847527P971307Q461420R417818R217311J0048262J1024785
14278B11890164J1254844J2278213J2532941J3455766J3902821J4290349J4327908
14271C03933006J4610494J4489953J5161836J4338891J4119115J3497240J1959660
14264D02110195J1561028J1004098R552207Q900282P817407O912667L343466Q85587
14256D62086937J05165K13841m061355r120954n911750r865101j2992384j2621771
14248D07832628j3503836j4076550j4531330j5128025j5075716j4735822j4812464
$$ plain form
14302 70550213 73213455 76093696 79247081 82451025 85938844 89290463 93416512 96992690
14294 96992690 101898762 106338066 111135056 116411669 121887299 127833651 134204064 140977101
14286 140977101 147901734 155749261 163720568 172181988 181599806 190817117 200865379 211890164
14278 211890164 223145008 235423221 247956162 261411928 275314749 289605098 303933006
14271 303933006 318543500 333033453 348195289 362534180 376653295 390150535 402110195
14264 402110195 413671223 424675321 434227528 443127810 450945217 457857884 461201350 462086937
14256 462086937 462192102 462405943 458344588 449223634 443311884 433446783 420454399 407832628
14248 407832628 394328792 380252242 365720912 350592887 335517171 320781349 305968885
14241C05968885j3887498j3428315j3175178j2915120j2074595j1685488j1095777
14234B17706914j1266420j0602634j0578298r695967r001864q204088p996900
14227A50360743p418341p110790o688989n793313n577685m927242n088424m877972
14219A02877987m809905l931753l803552l653502l423043l045863l137490l321987
14211G3750892k711760k750828k668765k425277k509142j647034k030614j457753
14203E5549719j996281j839864j672786j514488j756978j164851j623734j514072
14195D2466665j156058p98699q97378j355661r30189j249053j101427j107629
14187C3870571q23435p44757o33778j064923q45964m00813r78028o46749m64945
$$ plain form
14241 305968885 292081387 278653072 265477894 252562774 240488179 228802691 217706914
14234 217706914 206440494 195837860 185259562 175563595 166561731 158357643 150360743
14227 150360743 142942402 135831612 129142623 123349310 117771625 112844383 107755959 102877987
14219 102877987 98068082 94136329 90332777 86679275 83256232 80210369 77072879 73750892
14211 73750892 71039132 68288304 65619539 63194262 60685120 59038086 57007472 55549719
14203 55549719 53553438 51713574 50040788 48526300 46769322 45604471 43980737 42466665
14195 42466665 41310607 40511908 39614530 38258869 37328680 36079627 34978200 33870571
14187 33870571 33047136 32302379 31668601 30603678 29757714 29356901 28378873 27732124 27267179
14178B7267179j205693k25441p75999o66739p39167m45656o53568m59534j41977
14169B1953405o96438o84368k20505l20625m47529k76076n04197n80207J05285
14160A8328745r72469k01765k16679m98719k29157j72797m15834l52220J3056
14151A5282161m40426m57709k24114J8320l21491n50384j27032q1065l08456j41386
14141A2648418n14012m8124q7466j73630k13299K09554m91260j62617k84217l34816
14131A0548531j30707R6907j59110k82683j80534m17627j84936K43735N6895m25282
14121I165189j15320J36659m66137J32798j26291l41076j81917K12212l70729
14112H045388j58573k63478P2680j18067o2026j91488p291k24296q7216L08837
$$ plain form
14178 27267179 26061486 25836045 25060046 24393307 23654140 23208484 22554916 22095382 21953405
14169 21953405 21256967 20572599 20352094 20031469 19583940 19307864 18803667 18223460 18328745
14160 18328745 17356276 17154511 16937832 16439113 16209956 16037159 15621325 15269105 15282161
14151 15282161 14841735 14384026 14159912 14178232 13856741 13306357 13179325 13098260 12789804 12648418
14141 12648418 12134406 12086282 11998816 11825186 11611887 11821441 11330181 11167564 10883347 10548531
14131 10548531 10417824 10514731 10355621 10072938 9892404 9474777 9289841 9533576 9590471 9165189
14121 9165189 9049869 9186528 8720391 8853189 8726898 8385822 8203905 8416117 8045388
14112 8045388 7886815 7623337 7696017 7577950 7515924 7324436 7317145 7092849 7005633 7314470
14102G314470m69722K45217r2216o1074n44073O1040l64005N19417L1750m08750
14092F232054P7847l74221K11562k49496K17799n64599J27525l4503j20536K61468
14082E784900l69865Q1653n8313O8731k78331k68301m613J74317k68706N2366
14072D913838N9051j18918J81404n55588K05843l3438m10659O22311o71541K66109
14062D458412J01274k97038K82121k29942J02960k60027L65247m88569n8356j52978
14052C823104J61859j8907k53771K33517Q7428m78500R8258K58752K9638P1828
14042D013206j59701n7305N7264k26904q7241l8779l61502K42229M604k74590
14032C111281L55135j71355m4698l33762L52312l27732K15677p076j16699J2587
$$ plain form
14102 7314470 6844748 7089965 6997749 6936675 6392602 6453642 6089637 6609054 6640804 6232054
14092 6232054 6309901 5935680 6147242 5897746 6115545 5550946 5678471 5643968 5523432 5784900
14082 5784900 5415035 5496688 5438375 5507106 5228775 4960474 4955861 5130178 4861472 4913838
14072 4913838 4972889 4853971 5035375 4479787 4685630 4652192 4241533 4863844 4192303 4458412
14062 4458412 4559686 4262648 4544769 4314827 4417787 4157760 4523007 4034438 3976082 3823104
14052 3823104 3984963 3966056 3712285 3945802 4033230 3554730 3652988 3911740 3941378 4013206
14042 4013206 3853505 3796200 3853464 3626560 3539319 3500540 3139038 3381267 3385871 3111281
14032 3111281 3466416 3295061 3250363 2916601 3268913 2941181 3156858 3149782 3033083 3045670
14022C045670k56087J87565J33937j94755J14471M116l34058L49245j29483M9917
14012B970538l16491K73267k62676J69230l35774L02859l44993J94487l45579
14003B304868M03304l64227L2280M7297M8944j34921J49788j30569k89435L40564
13993B407893k77287J03485J35378k96027J12934O5887n5529j75595J00954K11135
13983B333228j53780q4376M77186j56122J45401p0646O25662M84566R71041J497740
13973F069900L356452O203569J1397725M851943j0907488p568387m415838k136920
13965F850956j742107o36356k66509m29673m04772j20712n03057N7970j06282
13956B699458j84259J27803k02720k44436J73703j0j95015K7274J74400l5576
$$ plain form
14022 3045670 2789583 2977148 3111085 2916330 3030801 3034917 2700859 3050104 2920621 2970538
14012 2970538 2654047 2927314 2664638 2833868 2498094 2800953 2455960 2650447 2304868
14003 2304868 2708172 2343945 2376225 2423522 2472466 2337545 2487333 2356764 2067329 2407893
13993 2407893 2130606 2234091 2369469 2073442 2186376 2252263 2196734 2021139 2122093 2333228
13983 2333228 2179448 2095072 2572258 2416136 2561537 2490891 3116553 3601119 4572160 6069900
13973 6069900 9426352 15629921 27027646 31879589 20972101 13403714 8987876 6850956
13965 6850956 5108849 4472493 4205984 3776311 3371539 3250827 2747770 2805740 2699458
13956 2699458 2515199 2643002 2440282 2195846 2369549 2369539 2174524 2201798 2376198 2340622
13946B340622m18724K14518j55987P785k32096J35533k22785M3488J63714r7367
13936A778701l92486N35831j706k08624q995k7830L7476J80727R675P5641k04100
13925A774310J0926j76375j51498M93474j50707k95712j4507Q5218j49150p4471
13915A351508L51902k67073J75875l15129J32763L65626q3138l87132J06999J39832
13905A572033m00119L46148k72572L29242j57432R654k36877P5854k5230K17825
13895A458526j65437p9939K58782l65925K18190J96836k08527o1068J38209l70910
13885A018737L76138l33327K80253j31127n127j17925r6186K33030P6609j18471
13875A182604j36356j00116J28550Q7878j23720L33727j73924J87074k10955k39621
$$ plain form
13946 2340622 1921898 2136416 1980429 1988214 1756118 1891651 1668866 1712354 1876068 1778701
13936 1778701 1386215 1922046 1920340 1711716 1702721 1674891 1712367 1893094 1902769 1978410 1774310
13925 1774310 1785236 1608861 1457363 1950837 1800130 1504418 1489911 1575129 1425979 1351508
13915 1351508 1703410 1436337 1612212 1297083 1429846 1795472 1712334 1325202 1432201 1572033
13905 1572033 1171914 1518062 1245490 1574732 1417300 1426954 1190077 1265931 1240701 1458526
13895 1458526 1293089 1213150 1471932 1106007 1324197 1521033 1312506 1251438 1389647 1018737
13885 1018737 1394875 1061548 1341801 1210674 1205547 1087622 991436 1224466 1301075 1182604
13875 1182604 1046248 946132 1074682 1162560 1038840 1372567 1198643 1385717 1174762 935141
13865I35141K76184M11j93675J15130K28067m07887L85307n2355j15916K13414
13855A383821k83361R8962k36677J661J1962j9726j6378K93213N4351m54146L52556
13844A186238m78825M40284n01222O30320l23484N6785K85808m93411M11206j64276
13834A049423l33350N90526m21291N9966j71974j69848J32575j08693L81281l6534
13824I72081Q902o7413m8402j50410k19667L18678j5953L75082k61660J15938
13814A027176M6297j87475j37801R2852o067j76180M15757q9195k33954k79057
13804D72353O37931l21428J19325p5749P0560J98297m55740j92244K07831N46448
13794A207584l84159J18122k56296L95878D59333J49129k04431M58606O8805k74969
$$ plain form
13865 935141 1211325 1211736 1018061 1133191 1361258 953371 1338678 1286323 1170407 1383821
13855 1383821 1100460 1199422 962745 964406 976368 956642 940264 1233477 1287828 833682 1186238
13844 1186238 707413 1147697 646475 1276795 953311 1010096 1295904 802493 1213699 1049423
13834 1049423 716073 1306599 885308 945274 773300 603452 736027 627334 1008615 972081
13824 972081 980983 913570 865168 714758 495091 813769 797816 1172898 911238 1027176
13814 1027176 1073473 885998 748197 841049 834982 658802 1074559 985364 751410 472353
13804 472353 1110284 788856 908181 832432 902992 1101289 645549 453305 661136 1207584
13794 1207584 823425 941547 685251 1081129 459333 608462 404031 862637 931442 656473
13784F56473M73888m12534L70109l31403J68298D29854J23650J25171j64752K51861
13774G65784J22642j94569l38726L52017J61472j78121R1699r704P2882O4689
13764I10065j00136p3583K44983k46770j7632l43401M93365k58340K16228l51770
13754D73009K16367J35002l10900J71643j3975j23860J3744r157L077j99125K39328
13743E95153K29693l16868Q0643K79584j46891K36806l85977J36418K42661j875
13733I49347k31712k18019K56034l10041r2052K73820l6105R8102r3110j77517
13723D18747K60912J230r5133N9623N5694M3669k05239L43286l95366k8389K84566
13712G43600l53420o038J01760K89001j11194r1393Q7259l5058A00227L81999
$$ plain form
13784 656473 1130361 717827 1087936 756533 924831 429854 553504 678675 513923 765784
13774 765784 888426 693857 355131 707148 868620 690499 782198 772494 845376 910065
13764 910065 809929 736346 981329 734559 716927 373526 866891 608551 824779 473009
13754 473009 689376 824378 513478 685121 671146 547286 561030 551873 554950 355825 595153
13743 595153 824846 507978 588621 868205 721314 958120 572143 708561 951222 949347
13733 949347 717635 499616 755650 445609 353557 627377 591272 689374 596264 418747
13723 418747 679659 680889 585756 645379 701073 744742 539503 882789 487423 459034 743600
13712 743600 390180 384142 485902 774903 663709 572316 659575 624517 100227 482226
13702D82226P3470j85316J36634J03421B78775N2086J97962n1289K07764j15654
13692E69644j60891K36474k04125L839k5560p1418N9206j07572L1453K81545j30717
13681D81878r7825K37559j93427A56212J73838K60119k19959n7793K22238K08887
13671G43542B91194M49557l22463o4985j50365M14575k35439K01446k17351K4975
13661C91144j726J74531j42268p0230L3581N6898F7057K56272K22426M8618O3880
13650F58253k46156n9849M05209J32662C71518j07040K69907B09694N7073J03188
13640C69955r6996J17864j90121J32349L8242L68911l64977J35548J66880B24490
13629F52570k06371Q5364j55514K38674l0619j20512K60747C09556J03221o7614
$$ plain form
13702 482226 555696 370380 507014 610435 278775 330861 528823 477534 685298 569644
13692 569644 408753 645227 441102 444941 419381 347963 407169 299597 331050 612595 481878
13681 481878 384053 621612 428185 156212 330050 590169 370210 312417 534655 743542
13671 743542 291194 740751 418288 353303 202938 617513 382074 583520 366169 391144
13661 391144 389418 563949 421681 351451 385032 441930 67057 323329 545755 594373 658253
13650 658253 412097 352248 757457 890119 371518 264478 534385 209694 266767 369955
13640 369955 272959 390823 200702 333051 371293 740204 375227 510775 677655 224490
13629 652570 446199 531563 376049 614723 584104 463592 724339 309556 412777 345163
13619C45163O5483J025J42940I5209N14647B53242P1808K22643A71660K18631
13609C90291m6996o6011L31080k64134M5694r2230J22213Q7118j36383O9609k9216
13598D11035J38448k22064H2877J57142J0501J36037L3761B04164H9074P3591
13588A62665K3591L45431m9945O0155B47607O6873J9627j06734F1385L30695N5712
13577D47792m5231K990N5901K2406A37717R5706K32804K80701I2410K63870K8507
13566C84787A13150K72313j47168O8551j5557L2360Q4101n6550f991A65052j0271
13555A54781O5598L97638j17345a2444D17949j50843R1894r209j3527J5617j4867
13544C37014j30065J50494n401A69725L38152m9853A73587P9693Q959K80449j29638
$$ plain form
13619 345163 410646 411671 554611 95209 609856 253242 325050 547693 171660 390291
13609 390291 343295 277284 608364 344230 389924 297694 419907 507025 370642 440251 411035
13598 411035 549483 327419 82877 240019 250520 386557 420318 204164 89074 162665
13588 162665 186256 531687 481742 541897 247607 314480 334107 227373 61385 392080 447792
13577 447792 402561 405551 461452 483858 137717 233423 466227 746928 92410 356280 384787
13566 384787 113150 385463 238295 306846 291289 323649 407750 351200 -6991 165052 154781
13555 154781 220379 618017 500672 -12444 417949 267106 359000 349791 336264 351881 337014
13544 337014 206949 357443 352042 169725 507877 458024 173587 253280 262239 542688 413050
13533D13050j38222J35213K37134B32061b7374B47562K44376I146K29826J17870
13523C56842A40509J96833K07886H4872L24409j94936p5098K9980J73186j51406
13513A91007J30603A13641K34688l7989J09496A52786D1135K25409H8597N7175
13503A45772J09911K47493D9752K85885M8991A29524K63380A40661J61167n4565
13493B47263A05159O0039L3498B9183L00951m0021J529j9317J7580o3480J80458
13482D06883a571B76126J38624p68b0947B16800J73826j85419p550D2925K11071
13471B53996J40805j1671P0038L9643d120C92247J73833D0120O3707d0515D83470
13459C45852A59994J5183a51693C44191j0726b3626A73158n4178Q0337O6519p8569
$$ plain form
13533 413050 274828 410041 647175 232061 -27374 247562 491938 9146 238972 356842
13523 356842 140509 337342 545228 84872 409281 214345 139247 169227 342413 191007
13513 191007 321610 113641 348329 310340 419836 152786 41135 266544 88597 145772
13503 145772 255683 503176 49752 335637 384628 129524 392904 140661 301828 247263
13493 247263 105159 165198 198696 29183 330134 290113 291642 272325 289905 226425 406883
13482 406883 -1571 276126 414750 413982 -20947 216800 390626 205207 197657 42925 253996
13471 253996 394801 383130 453168 492811 -4120 392247 566080 40120 103827 -40515 483470
13459 345852 159994 175177 -151693 344191 333465 -23626 173158 118980 199317 265836 187267
13448A87267p6115O9049N7125a17770B04331D1811e4505B323K31912K6568m5768
13437B15035J46843A66831o3346B5824K98599K6596K5156j07491j2948G9923Q2763
13426A62686C9041J52230m6083J30106J41360I9373j3001O8839L96708B64348
13415B37993G9183L67488B5137N08373A30110j2499l9275K16025K41436B39681
13404d7523A17501j8460K46836P831a38519B60020Q8853j25645r4287K87213H4113
13392D58796B18208a54332j3917B32787N3404J31500o4830A65003k8297n1488
13382H5218B0241J42330J8761P0186A18015R5396r8494J3962J70653j44107K94962
13371D50387c6745B37620A06184C0239M92898H9737K69991Q9372r2499A75017
$$ plain form
13448 187267 111152 180201 237326 -117770 204331 41811 -54505 2323 234235 260803 215035
13437 215035 361878 166831 103485 25824 324423 351019 376175 268684 255736 79923 162686
13426 162686 39041 191271 145188 275294 416654 99373 86372 155211 551919 264348
13415 237993 79183 446671 25137 533510 130110 117611 78336 294361 535797 239681
13404 -47523 117501 99041 345877 353708 -138519 260020 348873 223228 128941 416154 84113
13392 458796 218208 -154332 -168249 232787 286191 417691 352861 165003 136706 85218
13382 85218 20241 162571 181332 251518 118015 213411 114917 128879 299532 155425 450387
13371 450387 -36745 237620 106184 30239 523137 89737 359728 449100 356601 175017
13360A95043k8568F0484O65807A60818E7176K41098O9251A40895C7966d8671E19926
13348B1142J92611B6975K50960b13758A83981L8806g0683C68251A62324j182L9374
13337B00516B4242J33934J0952L31468A54544J3818k715K65851d5988j8278A49782
13325H2097K98276f0069A81049k7683K74159j89343N627L8369F6084L39219a8887
13313B80969R254L8611j44151A6750N61573d1064A36124C7745J99467p4701o2445
13302A00066K65201j24284h0627G6602K09581h0182A96L33338g4384a8310C50364
13290C83822A43621b0747B08079q6226a83253A47172L35411G8880N6197J69198
13280C04275K6228o3115d6165G395e4165K2696A05834P2179J77182A22453K5611
$$ plain form
13360 195043 166475 60484 726291 160818 57176 298274 367525 140895 37966 -48671 519926
13348 21142 213753 26975 277935 -213758 183981 222787 -70683 368251 162324 161142 200516
13337 200516 24242 158176 169128 500596 154544 168362 165647 431498 -45988 -64266 149782
13325 82097 380373 -60069 181049 153366 427525 238182 243809 282178 66084 405303 -18887
13313 280969 290223 328834 184683 16750 578323 -41064 136124 37745 237212 162511 100066
13302 100066 365267 240983 -80627 76602 286183 -80182 196 333534 -74384 -18310 350364
13290 383822 143621 -20747 208079 121853 -183253 147172 482583 78880 135077 304275
13280 304275 330503 267388 -46165 7395 -54165 -31469 105834 178013 355195 122453 148064
13269A48064J18136n8322O1706A5317P1307J10748J68534o0307I5038O7607M09
13258A63054E6453a11724E5416K81184b18233b5971B76123H6349J54352q8815
13248A51886e1640n0810B32045g0785A71790J15920E7352J18987Q5614J01688
13238C63641A05470J16416K7555q7706h170B65144P8933j00129K15404k02495
13228B56857m45a29661B05123q7790d9659j12919C24159A03311A4576J45185b81571
13216f5433B48576b99541B09170O6394P3609a56493L752d7408h46D28541j96474
13205B32067q5456B4724a37514D7780e9740K7810A16289K34832q7787j18908P0815
13194B15241Q5507A34576a16170C6163E225O0992k2271b62127C13722a6928C8405
$$ plain form
13269 148064 266200 207878 269584 15317 86624 197372 365906 305599 95038 162645 163054
13258 163054 56453 -111724 55416 336600 -218233 -25971 276123 86349 240701 151886
13248 151886 -51640 -102450 232045 -70785 171790 287710 57352 176339 261953 363641
13238 363641 105470 221886 249441 161735 -8170 265144 344077 243948 459352 256857
13228 256857 256412 -129661 205123 117333 -49659 -162578 324159 103311 14576 159761 -281571
13216 -65433 248576 -299541 209170 275564 349173 -156493 -152741 -47408 -846 428541 232067
13205 232067 146611 24724 -137514 47780 -59740 -31930 116289 351121 263334 144426 215241
13194 215241 300748 134576 -116170 36163 5225 66217 43946 -262127 313722 -16928 38405
13182A44212k1053Q3534k518A2806J3480K12437c9689B20700a7627B86507K7861
13171C14368C6283Q338J97005J46170A85338J30302K10598a74294G7766a93766
13160b6675C80338I6603j0146f5022C17059A06856c14341g8845A00789g4795B52268
13148B55221g881G9516J09188E0967B3232a83911d3162j7433k1403B88255O74
13137B88929A5510P2829L9863a63696D03227H774a69730b1777j34775A96805D7343
13125a59684C05871A1223K04132J06072j54692M1071K12402C8428L47808a00821
13114a49768I5163J32979F4007M90M3884P8068J28133A29545m5820a92364A44168
13102a00115F7191R8915a69016I4164C1740N4948d7909j047E1214c1652A9717
$$ plain form
13182 144212 123159 206693 204175 12806 26286 238723 -39689 220700 -17627 286507 314368
13171 314368 36283 44621 241626 387796 185338 315640 526238 -174294 77766 -193766
13160 -26675 380338 96603 86457 -65022 317059 106856 -314341 -78845 100789 -74795 252268
13148 255221 -7881 79516 188704 50967 23232 -183911 -43162 -60595 -81998 288255 288929
13137 288929 15510 88339 128202 -163696 403227 8774 -169730 -21777 -156552 196805 47343
13125 -159684 305871 11223 215355 321427 166735 207806 420208 38428 386236 -100821
13114 -149768 95163 228142 64007 64497 108381 186449 314582 129545 83725 -192364 144168
13102 -100115 67191 166106 -169016 94164 31740 86688 -47909 -48956 51214 -31652 19717
13090B22307p9175l1669K17286M5805B4812d6962A0735h1316k04668A03844a13153
13078A34560b14791P8932A81169k3066a0874B39039b2319r3558A9763c15560e9354
13066a20053E6301J10968b85858D7193K05276d3128C18166q9128B0722M9729J21830
13055A92281R1497I2640C8033i7456C39128G3058j3796L8209K17624j16074K76872
13044D75893a55715k6795C18421a37880A28380h6318B93515k2970J55373A70957
13033G205J15135K39412E2850K99142C2306A2805k786J44948B283c7351E90b77906
13020E7924e673B91396r4978g5590l0985B38634a75109A94326N4688a09370C6830
13008i7827c5738B71087b0773j95916C83245g3813B28745K2281H7163a73931a4419
$$ plain form
13090 222307 143132 111463 328749 374554 24812 -46962 10735 -81316 -285984 103844 -113153
13078 134560 -214791 -135859 181169 158103 -10874 239039 -22319 -115877 19763 -315560 -59354
13066 -120053 56301 167269 -285858 47193 252469 -43128 318166 229038 20722 70451 192281
13055 192281 283778 92640 38033 -97456 339128 73058 59262 97471 315095 199021 475893
13044 475893 -155715 -182510 318421 -137880 128380 -86318 293515 270545 425918 170957
13033 7205 122340 361752 52850 351992 32306 12805 10019 154967 2283 -37351 590 -277906
13020 57924 -5673 291396 196418 -75590 -106575 238634 -175109 194326 249014 -109370 36830
13008 -97827 -35738 271087 -20773 -216689 383245 -73813 228745 251026 87163 -173931 -14419
12996B64015e0443I8634B5553J10028a77948e7936C27799i6710D7942a136j5493
12985a6629j2349j15541B29476l9947A3465J12979C5751c1682H6475J8843M8255
12974A53573B1676K06521K3346L0353J45215B02508p1817K10109k8151a15760
12963h7000C38323b3702j46463H8511c7702M919A75297a92424F7912P4447J3307
12952A55666c98259A97308f6680A01466G729L9646J33148i1456A34148f603A83506
12940B52106l6162o4953n3219K79532A84587O1645H8173A7386b75281P957A40639
12928a51407f1206A5081L10853j21581d7941j09643B57964n5715b8758B09155
12917b08473Q2645G3789C1359h7411A13717G118a72854C1003L14907d0055A24596
$$ plain form
12996 264015 -50443 98634 25553 135581 -177948 -57936 327799 -96710 47942 -1136 -16629
12985 -16629 -28978 -144519 229476 189529 13465 126444 35751 -31682 86475 105318 153573
12974 153573 21676 228197 251543 281896 427111 202508 130691 340800 312649 -115760
12963 -87000 338323 -23702 -170165 88511 -37702 -32783 175297 -192424 67912 142359 155666
12952 155666 -398259 197308 -66680 101466 7729 47375 180523 -91456 134148 -6603 183506
12940 252106 215944 150991 97772 377304 184587 246232 88173 17386 -275281 -267324 140639
12928 -151407 -61206 15081 325934 204353 -47941 -157584 257964 202249 -28758 209155
12917 -208473 -125828 73789 31359 -87411 113717 7118 -172854 31003 345910 -40055 124596
12905a08558O30A06422b41705O7008H4360N5685D1784a82455m443B86190b10545
12893A20880K5499m4085b20414A75952h9272k3370d5876A0420L30749j47140G869
12881A44279a93281l2443A27974a80344B9268P2215a04846A45738J40192G3113
12870a24879j43034P8230C37710B4106J5351K81640A39988g044j95023B74491
12859F6395c8659E181O7856A9125K67474L0582A07058N9915C1080d72835D0532
12847B07672r2120a82406D4892a59241D00921j59061o9477h8297B0467M741R2987
12836A18195C3805a08489H5697a256p9749B3185m120d9497j36075O7146I5053
12824A15894M0304a49532l6560A18271i5352B18449c20504G8327b98226A32396
$$ plain form
12905 -108558 -107928 106422 -241705 -174697 84360 140045 41784 -182455 -186898 286190 -210545
12893 120880 146379 102294 -220414 175952 -89272 -112642 -45876 10420 341169 194029 7869
12881 144279 -193281 -225724 127974 -180344 29268 101483 -104846 145738 285930 73113
12870 -124879 -267913 -189683 337710 24106 39457 321097 139988 -7044 -202067 274491
12859 66395 -38659 5181 73037 19125 286599 317181 107058 166973 31080 -472835 40532
12847 207672 115552 -182406 44892 -159241 400921 241860 172383 -88297 20467 25208 118195
12836 118195 33805 -108489 85697 -1256 -81005 23185 19065 -49497 -185572 -118426 95053
12824 115894 156198 -149532 -186092 118271 -95352 218449 -320504 78327 -298226 132396
12813C2999J60264D7348J83202c71176B56823G6438b11788A51869i4327b4100
12802F0156q608B1677L7843N4117a5538B45527a62562j4806r9083A99405B8030
12790a11136L0949B18926j4066d01416i8560L8771B13207p2083m0276a7119n0866
12779f7985k10611A99957b87201D159g9660a0878k54965l1464A71541k076a44225
12767E6812K05522C3987N9284J22R1831A2099J71942L2333A04715g3535p4362
12756a47897r639C74590j62816C2889a13598j3454p9998I2660M3940F3780h5500
12744F3423L0111i3555l49841C79255H5763b91527h5031A22099d1631A20013b0106
12732h7470C60304C8384d8071j98438h2471L001L7900A5914O8652L39138o6050
$$ plain form
12813 32999 193263 47348 230550 -371176 256823 76438 -211788 151869 -94327 -24100
12802 60156 51548 21677 59520 113637 -15538 245527 -162562 -177368 -276451 199405 28030
12790 -111136 -80187 218926 204860 -401416 -98560 -59789 213207 141124 100848 -17119 -67985
12779 -67985 -278596 199957 -287201 4159 -79660 -10878 -265843 -297307 171541 169465 -144225
12767 56812 262334 33987 93271 93393 185224 12099 184041 216374 104715 -73535 -147897
12756 -147897 -157536 374590 211774 32889 -113598 -127052 -207050 92660 136600 63780 -85500
12744 63423 93534 -93555 -443396 379255 85763 -291527 -85031 122099 -41631 120013 -20106
12732 -87470 360304 38384 -48071 -246509 -82471 -79470 -41570 15914 84566 423704 357654
12721C57654b1138k85509C13330D5907j2120P7281J36030o6268b0349j29401F7164
12709C36285a6346j89121A79557i2360j2614d5144k1070b665A83768h9336M4287
12698d5049j44260h5143G7062A2258M36451A39262O153O2619A117N49481b21794
12686E0063J1456K42740f5303b2580j29661A34788O652e6912C1271a62382k79455
12675d41837a33296b5811A6014J14417B155b20544f7748D24911d8792C58227d3338
12663A96693J45727A32919m8818L0620M8767J72561j48763a47176A0483a1200
12652A82279o0369n2175C14J01408B5510b4605F4724g6535B70100J0915q2478
12641A98537e0717C27395F4528J49021K0075j8114L4795A8245h4184o7008B39150
$$ plain form
12721 357654 -21138 -306647 313330 45907 33787 111068 247098 180830 -20349 -149750 67164
12709 336285 -16346 -205467 179557 -92360 -104974 -45144 -66214 -2665 183768 -89336 -45049
12698 -45049 -189309 -85143 77062 12258 448709 139262 145415 208034 1117 550598 -221794
12686 50063 61519 304259 -65303 -22580 -152241 134788 141440 -56912 31271 -162382 -441837
12675 -441837 -133296 -25811 16014 130431 2155 -220544 -67748 424911 -48792 358227 -43338
12663 196693 342420 132919 84101 114721 163488 336049 187286 -147176 10483 -11200
12652 182279 121910 69735 314 101722 25510 -24605 64724 -76535 270100 281015 198537
12641 198537 -50717 327395 64528 213549 233624 215510 250305 18245 -84184 -151192 239150
12629A70149a59424A08120f2562J4718B18188b99725A22796b15604A48555e8834
12618D48170a15382b5508m3734D41909k09861n4565J4042E003L05670d0523l9292
12607g9815B87406j7153D1690K03769q1480l1258C5568c20208J2655A11436a56304
12595D5611l2d5674j06873B3071K18041j2153p0190a57567g6173A05093n0739
12584E4354f4670A63965a4717A70482n6093K12988H0498C0165L27096m6996i2082
12572D0252O8467A9996K02412o2225j6281F8612a38257F421b8900j54347c2910
12560b33234h5390N128F2075R4829b4865b070j89529I9884A1463a31243B44619
12548a02519N079c9223C76884E1846H657a56169B91579F0079b1190A56060L03301
$$ plain form
12629 170149 -159424 108120 -62562 -47844 218188 -299725 122796 -215604 148555 -58834
12618 448170 -115382 -25508 -69242 441909 232048 177483 191525 5003 310673 -40523 -79815
12607 -79815 287406 270253 41690 245459 163979 132721 35568 -320208 -307553 111436 -156304
12595 45611 45579 -45674 -152547 23071 241112 228959 158769 -157567 -76173 105093 54354
12584 54354 -64670 163965 -14717 170482 114389 327377 80498 30165 357261 310265 -92082
12572 40252 108719 19996 222408 160183 143902 68612 -138257 6421 -28900 -183247 -32910
12560 -233234 -85390 -80262 62075 156904 -24865 -2070 -191599 99884 11463 -131243 244619
12548 -102519 -97440 -39223 376884 51846 8657 -156169 291579 60079 -21190 156060 459361
12537D59361G364Q9019a50549j57806a6101A7848c48400a5507P668j51312n4651
12526b13802B84807j04733f5831q1111B21085H3691e2004j55087A41001P3289
12516B14290A03567f9941j89292B21955H8188c19637D11492j63105R8698G4627
12505A23600E5617j9443J34207a20620K6152A30481D7362L48662a20098j77662
12495b97760a15690F3194e2046j4670D3941J19006F2629O8404R5226r1985c7385
12483A88758J25555b59657d5358B67103a13976J3345G5723J08627J90713a11286
12472A91475C7811a30633B6984J03971c91374N7536e6327C5158J7764P7473d7104
12460H6296a38092A1428J15961a01217j28252A54586B9866K8389a67984B19219
$$ plain form
12537 459361 7364 96383 -150549 -308355 -16101 17848 -348400 -15507 -7839 -159151 -213802
12526 -213802 284807 180074 -65831 -146942 221085 83691 -52004 -207091 141001 214290
12516 214290 103567 -69941 -259233 221955 88188 -319637 411492 248387 347085 74627
12505 123600 55617 36174 170381 -120620 -94468 130481 47362 396024 -120098 -297760
12495 -297760 -115690 63194 -52046 -66716 43941 162947 62629 131033 226259 134274 -37385
12483 188758 314313 -259657 -45358 267103 -113976 -100631 75723 184350 375063 -111286
12472 191475 37811 -130633 26984 130955 -391374 -333838 -56327 35158 52922 130395 -47104
12460 86296 -138092 11428 127389 -101217 -229469 154586 29866 58255 -167984 219219
12449a97102F5553a15489l57560K23362A01708C3555J6391B3354J76217c6268
12438F1479J0586L2606C038J79961a24545C27829g1933L2366A03407b32566a01459
12426a35076d346o1454B65439I4626a47862D7157f3895A97983h4206C15654a84974
12414I294e3792A70076J76344I5526d2298B03535O0341a46266d9666i408j50037
12403a59445O0010j37226A77364e4243l28310a10046H7691e4189f338j91641h6807
12391F4173c65521l5874I6087a5988o7184B72954c8738k51094A02300D3522J49408
12380A92930D5587b20570l3630A30584a56684c3093m9256F2157f3158A9778J31447
12369A51225b0485l1613R448H7009L1113a87919O269A4257K32914C9050a00059
$$ plain form
12449 -197102 65553 -115489 -473049 -249687 101708 33555 49946 23354 199571 -36268
12438 61479 72065 104671 3038 182999 -124545 327829 -71933 -39567 103407 -232566 -101459
12426 -135076 -4346 -65800 265439 94626 -147862 47157 -63895 197983 -84206 315654 -184974
12414 9294 -53792 170076 346420 95526 -42298 203535 263876 -146266 -49666 -9408 -159445
12403 -159445 -99435 -236661 177364 -54243 -382553 -110046 87691 -54189 -6338 -197979 -86807
12391 64173 -365521 -401395 96087 -15988 -83172 272954 -38738 -289832 102300 43522 192930
12380 192930 45587 -220570 -254200 130584 -156684 -33093 -82349 62157 -63158 19778 151225
12369 151225 -20485 -52098 -42650 87009 118122 -187919 -181650 14257 247171 39050 -100059
12357A60821a61251J4584e9587p0644I5800A8632c65002C92000G7620b0380j55774
12346a76154B76962N8936a10108B89843D6129K55638i4108K647k49149A33260
12335d27710B98851A01246a77668D64398i1601H7254R6079m1415h7960A941N0603
12324E2544B0303d7799K2367A25821a99154f4317C14666F6263P1758a1106B26222
12312c22501J44789A12587E4054J28601q9102a47116j4703G1031B050c418A03562
12300F3390K30417q2879o8574K31159a61413b5600r8450F6523a00393j3133o4596
12289a78122B5704L38782c9361k5082A39378J5701M1652I4423J45830m0794a69661
12277B9814K2376k0176J78598d8428b3059B19197m9937o7386J73130j28991C0983
$$ plain form
12357 160821 -161251 -146667 -59587 -130231 95800 18632 -365002 392000 77620 -20380 -176154
12346 -176154 276962 335898 -110108 289843 46129 301767 -94108 -91461 -340610 133260
12335 -427710 298851 101246 -177668 464398 -91601 87254 183333 141918 -87960 1941 52544
12324 52544 20303 -47799 -25432 125821 -199154 -64317 314666 66263 138021 -11106 226222
12312 -322501 -177712 112587 54054 182655 93553 -147116 -161819 71031 2050 -3418 103562
12300 63390 293807 210928 142354 373513 -161413 -25600 -124050 66523 -100393 -113526 -178122
12289 -178122 25704 364486 -39361 -64443 139378 155079 196731 94423 240253 199459 -169661
12277 29814 52190 32014 210612 -48428 -23059 219197 169260 101874 275004 146013 30983
12265a20645B73283A12464c1339o6898l2150O2582B62173O9421g4871H9827N3221
12254A43048k6828p917J21018E6544A7202Q5873a69947B18220a72250l84514g0912
12242A05928K0079P2719q6461a5214A41678k7536K44716H8035C8251A4879J57127
12231A72006P1414b61834I1965B0059d26827D7885N4023B6437J0142K01541O1770
12220B99890E3761J16970p4859I769c4415A92086J1758L2856B0085K40463G5291
12208D51001q785A57477P3645A9549a70151A31073K77801A40886G0281J40250
12198B10531A4171L18576m9605c1928G0811a36169D12603o9519j11570M4236d3663
12186B8657Q5452a32129H7809L6939b0366G2844K18130l4561P6887h51j55997
$$ plain form
12265 -120645 273283 112464 -31339 -98237 -130387 -67805 262173 331594 -74871 89827 143048
12254 143048 116220 108303 229321 56544 17202 103075 -169947 218220 -172250 -556764 -70912
12242 105928 126007 198726 112265 -15214 141678 114142 358858 88035 38251 14879 172006
12231 172006 243420 -261834 91965 20059 -426827 47885 101908 26437 36579 238120 299890
12220 299890 53761 170731 95872 9769 -34415 192086 203844 236700 20085 260548 75291
12208 451001 442216 157477 231122 19549 -170151 131073 408874 140886 70281 210531
12198 210531 14171 332747 283142 -31928 70811 -136169 412603 343084 231514 275750 -43663
12186 28657 114109 -132129 87809 124748 -20366 72844 290974 256413 333300 -851 -156848
12175a56848B16382l5294a32452c3431F3830M6285k5244N7777o2572R1470c5603
12163a91200C27461j27793c8162A06514K61695j36699A07154K04074a36660D8349
12152B44876E8569J80893F6450J09849H4896K6603L47366A01371J1883b34474
12141a29902B09300m3413K07367i2295c1157A34806R9102o7671K17594H6947L09876
12130C96823b30197d6260C3202N3059K20432j25891J01364j29088g6085A53976
12119b98234a8551G9454a45867G5856K28149j37094b52968B05961F5575d2420
12108a03823M2353j94996a2001j54519B19285c9004H7714P4294e6781D02770a69759
12096I624g3976A47714b28775A34614e0805K1799A14425R096K3789E3193L4753
$$ plain form
12175 -156848 216382 181088 -132452 -33431 63830 110115 84871 142648 80076 171546 -35603
12163 -191200 327461 199668 -38162 106514 368209 231510 107154 311228 -136660 48349
12152 244876 58569 239462 66450 176299 84896 111499 458865 101371 113254 -234474
12141 -129902 209300 165887 373254 -92295 -31157 134806 233908 166237 383831 86947 396823
12130 396823 -230197 -46260 33202 86261 306693 180802 282166 153078 -76085 153976
12119 -298234 -18551 79454 -145867 75856 304005 166911 -252968 205961 65575 -42420
12108 -103823 -61470 -256466 -12001 -166520 219285 -39004 87714 162008 -56781 402770 -169759
12096 9624 -73976 147714 -228775 134614 -50805 -29006 114425 123521 147310 53193 87946
12085H7946R0731C4972J31090d5941j32909A14660m0467J57197A08189c6731j76618
12074b13349a0739A23216b12470B67142F766J66956J46545J7969m1392M96241
12064G93085O60067k7540D79283q7981G9750a34256I4881m2359K0417L4094h1643
12052C04435d56258A83998L25872a85415f782C95662A31658L9711J19494a25013
12041C8647b09724A81123F3191P4916O3516D1516f0281k7773m7852J9319p4844
12030a91431B06273b46329Q0325l14946B24591O5677I5569a83684A36971D142
12019H979K1425K74116c78389G7869a31330N8920r0800A45254G0654j0873J86649
12008B46430a48184A88867J36069G4233c2414A74075e0448C18749b54094B23661
$$ plain form
12085 87946 178677 34972 166062 -45941 -178850 114660 74193 231390 108189 -36731 -213349
12074 -213349 -10739 123216 -212470 267142 6766 173722 320267 338236 296844 793085
12064 793085 1453152 1425612 479283 391302 79750 -134256 94881 52522 72939 107033 -81643
12052 304435 -456258 183998 509870 -185415 -6782 395662 131658 171369 290863 -125013
12041 38647 -209724 181123 63191 138107 201623 41516 -60281 -88054 -135906 -116587 -191431
12030 -191431 206273 -246329 -166004 -480950 224591 290268 95569 -183684 136971 4142
12019 8979 30404 304520 -378389 77869 -131330 -72410 -163210 145254 70654 59781 246430
12008 246430 -148184 188867 324936 74233 -32414 174075 -50448 318749 -254094 223661
11997g2344C63121c0689C1557e1643p7588A43643O3644e3285j32882A32682A2185
11985A15367I122J38500b78003j6162a25923B21977a02942n58C26233A60094b4238
11973b67890A55687a38036e5436j22587b7106j34668B37782a9338A19764D7385
11962B10420g3110A52298G3543N6348c54657i6628J4162l8602j83435a42945A5244
11950B38219J3529K51118B24974E2232K35552b30888r811A80898M9792H5144a56468
11938f3639k51219A49208c327k23880A01362L55579B01794H5769b15845P4709
11928a41136f238k29657A72734F1040B865R7486K19837f9815A44861a69381O2526
11917a06855B81679j28856h7721l3056G6849h248A91739a51638b6282I0914b52933
$$ plain form
11997 -72344 363121 -30689 31557 -51643 -129231 143643 207287 -53285 -186167 132682 12185
11985 115367 9122 147622 -278003 -294165 -125923 221977 -102942 -103500 326233 160094 -24238
11973 -267890 155687 -138036 -55436 -178023 -27106 -161774 237782 -19338 119764 47385
11962 210420 -73110 152298 73543 129891 -354657 -96628 -82466 -121068 -304503 -142945 15244
11950 238219 251748 502866 224974 52232 287784 -230888 -240699 180898 230690 85144 -156468
11938 -63639 -314858 149208 -3327 -227207 101362 456941 201794 85769 -215845 -141136
11928 -141136 -6238 -235895 172734 61040 2865 100351 320188 -69815 144861 -169381 -106855
11917 -106855 281679 152823 -87721 -120777 76849 -8248 191739 -151638 -26282 90914 -252933
11905B3692a45710a8243R33H0780F780a84014A88129c82597f1675k2087l76360
11894d60122J95998C1154i0184B8690a09848k66764O3394c2606q269k94995A45008
11882B966J23354c41182C197d5721j34326b5015j22079A9440a88346h0175o2767
11871a42942A95762a68196B49155a70907A24988R6811c44218a07671K9149O257
11861g2265o8826M3751L356j7149o8139c4759j80408A27247c18042J11755C66744
11849E0172a33523A69015D2355J12234K06060j51469b49956d5508A21729C9953
11838B5794J68944e3027A47551d8173A351a10911j92482g2862l1988o075A0585
11826A14957Q0476c06770H1990j4091f7082a4020l5300l45687f9776A124d77861
$$ plain form
11905 23692 -145710 -18243 -17310 80780 6780 -184014 188129 -382597 -61675 -83762 -460122
11894 -460122 -264124 31154 -90184 28690 -109848 -376612 -313218 -32606 -40875 -335870 145008
11882 2966 126320 -341182 3197 -45721 -180047 -25015 -147094 19440 -188346 -80175 -142942
11871 -142942 195762 -168196 249155 -170907 124988 221799 -344218 -107671 -78522 -72265
11861 -72265 -141091 -97340 -93984 -111133 -179272 -34759 -215167 127247 -318042 -206287 366744
11849 50172 -133523 169015 42355 154589 360649 209180 -249956 -45508 121729 39953
11838 25794 194738 -53027 147551 -48173 1351 -110911 -303393 -72862 -104850 -110925 10585
11826 114957 195433 -306770 81990 67899 -67082 -14020 -49320 -395007 -69776 1124 -477861
11814C64124I9410N3103d2585b0784j02424p2973e7712j37664A24962G639b50486
11802b25916A78522a56177G2473N777J53531a23739D8518J24587i5932k9437A62018
11790g7776j9741C37683a42697j8819N4386B355i6429F7904A0242Q1733c31207
11778a19044C30489A3956k54M1105f922I4174L5571M1831c0203A32327e6711A41656
11765d18128D694i5203j40083A13427L6224A8459J7097c36363A5040J19259E1230
11753E1556b45763A14026K74958f3538m6999M3646j46849I6050j1482a57842M8942
11742a08900H6847O7608h3325p602a1856E0765i5122I1503N481A2095c9928k06655
11730b46583B23397C857b72535a3348k60626o4609H7391e9836D3555b49661A41271
$$ plain form
11814 364124 99410 152513 -42585 -20784 -123208 -196181 -57712 -195376 124962 7639 -250486
11802 -225916 178522 -156177 72473 78250 231781 -123739 48518 173105 -95932 -125369 162018
11790 -77776 -97517 337683 -142697 -161516 -107130 2355 -96429 67904 10242 91975 -331207
11778 -119044 330489 13956 13702 54807 -6922 94174 129745 171576 -30203 132327 -56711 141656
11765 -418128 4694 -95203 -235286 113427 149651 18459 35556 -336363 15040 134299 51230
11753 51556 -245763 114026 388984 -63538 -110537 -66891 -213740 96050 84568 -157842 -108900
11742 -108900 86847 154455 -83325 -90927 -11856 50765 -95122 91503 96984 12095 -39928 -246583
11730 -246583 223397 3857 -272535 -13348 -273974 -338583 87391 -59836 43555 -249661 141271
11718I9372J57375g1957j06549d2676A08249M9534k4789J95995a04796F2055i2087
11706c34500a13362k1216a2081j8394E7673K50090d7119l60999A02330D8617a30325
11694a42713k81674J20705B35110a85592g9526c4100C8461J68805e3081A49232
11683h7051G6516g8801G1407a5115A04530K92431f666B16356G2911g9577j28583
11672b08160D9984J45346o4818b17958f499B07961p494a67095b5433A24525f3056
11660a61550B44975H194J24084h2017H5761E277N7565P7199a9005B19366D1843
11648B26478K22920F0485A4170b17647g3792D4623M6889A2037J23946K33914c36002
11636a1651A14036A6273J22746g8416j25738Q3981C16065k6948j28078h9563A1992
$$ plain form
11718 99372 256747 -71957 -178506 -42676 108249 157783 132994 328989 -104796 62055 -92087
11706 -334500 -113362 -134578 -12081 -30475 57673 307763 -47119 -408118 102330 48617 -130325
11694 -142713 -424387 -303682 235110 -185592 -79526 -34100 38461 207266 -53081 149232
11683 -87051 76516 -78801 71407 -15115 104530 396961 -6666 216356 72911 -79577 -208160
11672 -208160 49984 195330 130512 -217958 -6499 207961 200467 -167095 -25433 124525 -63056
11660 -161550 244975 8194 132278 -82017 85761 5277 62842 140041 -19005 219366 41843
11648 226478 449398 60485 14170 -217647 -73792 44623 91512 12037 135983 369897 -336002
11636 -11651 114036 16273 139019 -78416 -204154 -120173 316065 289117 161039 -89563 11992
11624F9879a00812d2973B79343A8314J00504N5458c57496B12906l5587h4061C01153
11612f3055C17580m9370f6753m5423c6996A30513b01034D37064a66184A48967
11601A21353b18203R826P6722D1326A6590M52899G1012J36194i477k7546A94816
11589g859j51593c465j7347A39975C6206J80140r1823J14344J85155H8432M44963
11578E33395E8850J39024A8752e00207D39275q3783a40993B5132K46852F0164
11567B61974p2417b14810A24164m1537O9396E9522B5847J53635p8907e438E1500
11555A38771a1623I593J80479K7418b9082J0154A58698f6876n6453A30146j2816
11544A17330A3273a5180A27206J14666e3358A11393M0098a68864j68971E2470
$$ plain form
11624 69879 -100812 -42973 279343 18314 118818 174276 -357496 212906 177319 -84061 301153
11612 -63055 317580 268210 -66753 -112176 -36996 130513 -201034 437064 -166184 148967
11601 121353 -218203 -208377 -131655 41326 16590 469489 71012 207206 -9477 -37023 194816
11589 -7859 -159452 -3465 -20812 139975 36206 216346 124523 238867 424022 88432 533395
11578 533395 58850 197874 18752 -500207 439275 355492 -140993 25132 271984 60164
11567 261974 189557 -214810 124164 82627 152023 59522 25847 179482 100575 -5438 51500
11555 138771 -11623 9593 190072 217490 -29082 -18928 158698 -66876 -123329 130146 117330
11544 117330 13273 -15180 127206 241872 -53358 111393 151491 -168864 -337835 52470
11533c1091A0773i6228D85231R5698a32848A02817J23554C8895O6746e3797A64699
11521a35607A73921D1570a59233I5642K00068F9885K1026Q2801b7134D64185j84416
11510B79769a06604B50503K8059a44935a1657F4258k8202J88610o3595l7001K2189
11499A46259j7114K8026a6762p3224C58317M3730j34647n8726N7455I7546a9062
11487A68536c01479B74886A28851C8734d7525C15680d148B69533F0614F116N6595
11476F2711c3299I2520J30461C982J95612F3567K07746A8808Q1081O4892k3235
11465A41546j7629n8856J13403r401c9800G2241K9094M3029g2923A46171K20460
11454C66631A45211c9034D28889A50839B2547Q5763C9623F106Q2924l5751K40625
$$ plain form
11533 -31091 10773 -96228 485231 580929 -132848 102817 226371 38895 105641 -53797 164699
11521 -135607 173921 41570 -159233 95642 295710 69885 90911 173712 -27134 464185 279769
11510 279769 -106604 250503 278562 -144935 -11657 64258 36056 224666 161071 124070 146259
11499 146259 129145 157171 -16762 -89986 358317 402047 267400 208674 266129 97546 -19062
11487 168536 -301479 274886 128851 38734 -47525 315680 -4148 269533 60614 6116 62711
11476 62711 -33299 92520 222981 3982 199594 63567 271313 18808 99889 164781 141546
11465 141546 123917 65061 178464 169063 -39800 72241 101335 144364 -72923 146171 366631
11454 366631 145211 -39034 428889 150839 22547 108310 39623 6106 89030 53279 293904
11443B93904h2295k0868C44902E3727L2095e5665D1670c8212A470i7387K3710
11432g3677A50566b5418A56273Q885O2210r3653k6086j1597J19858a69903I925
11420a7596l5667C78977B8696g5391r3599A61032n4126a4857B55322M3477B319
11408A92112L7344J33233b2285C8310d0429m3237G2082Q3496a00368A03918a02568
11396g7999l5968j4157c7917k26735K5210B7629a12495j48936f3225D34157A07433
11384i2632r1982A47383a02922B0979J02230a34526M357e8551k5628A43539n6266
11373H7273b85769B04741o36c78058a72856f896C7912f4192k8361C0645J56672
11362A87317K61737A43085M9164a4386j89411C9243K38605j07456L3117b11901
$$ plain form
11443 293904 -82295 -103163 344902 53727 85822 -55665 41670 -38212 1470 -97387 -73677
11432 -73677 150566 -25418 156273 165158 227368 133715 107629 96032 215890 -169903 9925
11420 -17596 -53263 378977 28696 -75391 -168990 161032 106906 -14857 255322 298799 2319
11408 192112 229456 362689 -22285 38310 -40429 -83666 72082 155578 -100368 103918 -102568
11396 -77999 -113967 -128124 -37917 -264652 -239442 27629 -112495 -261431 -63225 434157 107433
11384 -92632 -184614 147383 -102922 20979 123209 -134526 -130169 -58551 -84179 143539 87273
11373 87273 -285769 204741 204105 -378058 -172856 -6896 37912 -64192 -92553 30645 187317
11362 187317 449054 143085 192249 -14386 -203797 39243 277848 170392 203509 -211901
11351c0777k732D7001K94842A13335a37875c2445j32668j81491h6099A46037g6924
11339A3952b00709o881h4625B42725H675J39974a34286r5454B3540a66076h925
11327c2907j10051G637J27037a4579A44576a83475A01062a78423P5251E2942J89531
11316B42473b20618A1264a19579G0482h9875o5956g5957G6270H68d5556A956K10876
11304B12832c98618a19768b3947j2209k67399H0364C2616i2041d4726n3917k42092
11293c40735J46672A43956a29958f3546N027B03169c72939J48666b1259C1388
11282e2895j05039b1570A05662N3912b02847n223G928O5059J25075B3564J6886
11271D0450J36674c47691h8664A61811a8931k9407A53190J92946b46123B04351
$$ plain form
11351 -30777 -33509 47001 341843 113335 -137875 -32445 -165113 -346604 -86099 146037 -76924
11339 13952 -200709 -207590 -84625 242725 8675 148649 -134286 -229740 23540 -166076 -8925
11327 -32907 -142958 7637 134674 -14579 144576 -183475 101062 -178423 -103172 52942 242473
11316 242473 -220618 11264 -119579 70482 -89875 -155831 -75957 76270 868 -45556 1956 212832
11304 212832 -398618 -119768 -23947 -36156 -303555 80364 32616 -92041 -44726 -98643 -340735
11293 -340735 -194063 143956 -129958 -63546 -58519 203169 -372939 -224273 -21259 31388
11282 -52895 -157934 -21570 105662 159574 -202847 -208070 7928 72987 198062 23564 40450
11271 40450 177124 -347691 -88664 161811 -18931 -48338 153190 346136 -246123 204351
11260B272g8396c4681j59618f9778C90821F9617J14235E4838O0035a96488R5934
11249a00554A8105Q6391K65320h7090d2372A03028D8530L0752a01884A26144c84458
11237b19053A00605a42023B65684b53768F4159i2139B01652D1254K95423a14761
11226A3375d15209A40112a10059F620a25554r0710F225b32254A29604a18509H5729
11214d542k6663A13713C8497b13579c7478r4773I3993b36994g1265g828k59923
11203b67751G9096c25426f5230j9446j64709C208L27021b20604D36621b32882
11192b21741a05314M4036j34343d3047j57813K4629l56232h1519l65476c3675
11181C1224J36091B6479a50053j22438a33096b7118k08852C3411c29872C9417
$$ plain form
11260 2272 -78396 -34681 -194299 -69778 390821 69617 183852 54838 114873 -196488 -100554
11249 -100554 18105 104496 369816 -87090 -42372 103028 48530 79282 -101884 126144 -384458
11237 -219053 100605 -142023 265684 -253768 64159 -92139 201652 41254 336677 -114761
11226 13375 -415209 140112 -110059 6620 -125554 -216264 6225 -232254 129604 -118509 85729
11214 -4542 -31205 113713 38497 -213579 -37478 -132251 93993 -236994 -71265 -7828 -267751
11203 -267751 79096 -325426 -65230 -84676 -249385 3208 330229 -220604 436621 -232882
11192 -221741 -105314 -61278 -195621 -43047 -200860 -176231 -532463 -81519 -446995 -33675
11181 31224 167315 26479 -150053 -272491 -133096 -27118 -235970 33411 -329872 39417
11170b8494A19108C9251J64317b0687A3835a97122O5886I8493b81646B43202I291
11158F8005R1906k3775a38635G6539B8839G892J20714Q6884G1430c94236O202
11147c88034a6149F5664L2940e025m305k87895K8160J19280B82666A34335N4718
11136A89053a39809G077K12304a75506C3884e44159A28478g2797B3061K0064c961
11124b5724A8481a5283E4922e7982A61776o2612a56936I9204l495J45923o4502
11113A77130l4314A1036J32107E533a34694B74851f7689A70422J43444h4228b2993
11101d3147G2080d18808B95769b25038A17418o076D9466d53635C2866J43567Q0242
11090B56675o0491I4656C0385K32445B5299d6204D8480a42127A85695K11061c9519
$$ plain form
11170 -28494 119108 39251 203568 -20687 13835 -197122 -131236 98493 -281646 243202 9291
11158 68005 159911 136136 -138635 76539 28839 7892 128606 215490 71430 -394236 -388034
11147 -388034 -16149 65664 98604 -5025 -9330 -297225 -269065 -149785 282666 134335 189053
11136 189053 -139809 7077 219381 -175506 33884 -544159 128478 -72797 23061 43125 -3961
11124 -25724 18481 -15283 54922 -57982 161776 99164 -156936 99204 95709 241632 177130
11113 177130 142816 11036 143143 5533 -134694 274851 -67689 170422 313866 -84228 -22993
11101 -43147 72080 -418808 295769 -225038 117418 111342 49466 -453635 32866 176433 256675
11090 256675 196184 94656 30385 262830 25299 -46204 48480 -142127 185695 396756 -39519
11078A53890Q1170f3202A22244K65105E3780J32218l7639H845K69031A23748K16385
11067C40133N764A19265e354B30142J9197I9282J60634c96274C05137Q9392j78276
11056B16253K14261j66014J36069j45308K24492j92919K64953B67531L82528A97416
11045C41599K16264r8295A78485K29800L1120N93883l25833j16245j8566J78681
11035G51325k35217M13719l56477k4488p5887A53839O54908l04583J96019k09156
11025D91027K08791N5881k17171j08255M88110l25213K17456J10531m21881R9253
11015E98529K33938k71138J18175j44330J19520k27757J71791j93066K00362k09080
11005C96944K23571j38247K26097j84616K13473A01573M05763K5812k40538Q8965
$$ plain form
11078 153890 235060 -63202 122244 387349 53780 185998 148359 8845 277876 123748 340133
11067 340133 345897 119265 -5354 230142 249339 99282 259916 -396274 305137 394529 216253
11056 216253 430514 264500 400569 255261 479753 286834 551787 267531 650059 197416
11045 341599 557863 459568 178485 408285 439405 1033288 707455 591210 572644 751325
11035 751325 516108 929827 573350 548862 472975 153839 808747 504164 700183 491027
11025 491027 699818 755699 538528 430273 918383 593170 810626 921157 499276 598529
11015 598529 832467 561329 679504 535174 654694 426937 598728 405662 606024 396944
11005 396944 620515 482268 708365 523749 737222 101573 507336 533148 292610 381575
10995C81575N7223Q0271o9126j2439M21991l2315C23080K69789k83205M19657
10985G29321J43361l43919o948m8984K35529n8150o7058K87620C97850K13691
10975F11541j3638j15420K40032n4788J82637j04127k51520M89297j87234N76026
10965A372806Q1778j47837K08674j10797L50987P7098J57044o7724K97388J21295
10955B340712k18514L79065l62472J86814j92021k73058l8407p8214j83607p1190
10945A489108j2126J32118J26606K32448j0516l88800j49115Q1560p558j00720
10935A393005l13515k30928r1549k59961J73403k78996M965H5934j4368J48669
10925B20235D3057K85770q4691F9575J02169L8896a6665B91627F5401a8753B06473
$$ plain form
10995 381575 438798 519069 449943 437504 859495 827180 323080 592869 309664 729321
10985 729321 872682 528763 521815 472831 708360 650210 583152 870772 397850 611541
10975 611541 597903 482483 722515 667727 850364 746237 494717 984014 796780 1372806
10965 1372806 1454584 1306747 1515421 1404624 1755611 1832709 1989753 1922029 2219417 2340712
10955 2340712 2122198 2501263 2138791 2325605 2133584 1860526 1822119 1743905 1560298 1489108
10945 1489108 1476982 1609100 1735706 1968154 1957638 1568838 1419723 1501283 1493725 1393005
10935 1393005 1079490 848562 757013 497052 670455 391459 396424 85934 71566 220235
10925 220235 43057 328827 244136 69575 171744 210640 -16665 291627 65401 -18753 206473
10913A8878K03942j05860l5051i3069C2869M224g2643B32664I1112A8415a5782
10901a71911L1835C279K23689a91r3467A67056a63602A12776b30462i5385A76697
10889A8642Q9307b62210a3358j7759j62641A15766O0993H2499j5352M3709K68798
10878C79654a8345j40713N8709J3033j77021A35604F4721b4863F0850a89846J5391
10867a74455A13289c15991L7678a09352c5252a6419A05385k6128o03b10107l6110
10856b46217L7C19029H0491g9180j11864d1297D4825j9134N0420K099a40434B9053
10843a9879A77384a13977k01569i543l01633a05233d1517f815C7012a06778q1451
10832a88229J5482L4618A33502d3837F7854b22945h2037C8121O8505a91742l4660
$$ plain form
10913 18878 222820 116960 81909 -93069 32869 37093 -72643 232664 91112 18415 -15782
10901 -171911 -140076 3279 226968 -191 -93658 167056 -163602 112776 -230462 -95385 176697
10889 18642 107949 -262210 -13358 -31117 -193758 115766 176759 82499 67147 110856 379654
10878 379654 -18345 -159058 -100349 -87316 -264337 135604 64721 -24863 60850 -189846 -174455
10867 -174455 113289 -315991 -278313 -109352 -35252 -16419 105385 79257 78654 -210107 -246217
10856 -246217 -246180 319029 80491 -79180 -191044 -41297 44825 25691 76111 78210 -140434 29053
10843 -19879 177384 -113977 -315546 -9543 -311176 -105233 -41517 -6815 37012 -106778 -188229
10832 -188229 -172747 -138129 133502 -43837 67854 -222945 -82037 38121 106626 -191742 -226402
10821b26402e6057j03872r4031g259m58421F1085M5004d03880Q4500D500L78449
10810C82949j51649i5366M100B35599a18484p3002q1597b6150C9700N5609c00898
10798b4008B45084j14286a12448B45329c8786r3892N4238j56658D3564J7041L3142
10787I3747b90090r3534g2963o5061C7275b21012A05656j1607e6891A90301i0714
10775a91152B1064i9487D9127b64463B7241b9841j10085A58650f9167A29396a3046
10763a2822r4661E8699N8941J19101j13813a46116A73096b26240F7348P688l0210
10752D4826A1695a35019E4858f6489j9129l03864a21016A65692k7466K5654J22256
10741B86136C8343e6827l24539A00354b09650G5933a64355a5313A69595c20111
$$ plain form
10821 -226402 -56057 -159929 -253960 -7259 -465680 61085 106089 -403880 -319380 4500 382949
10810 382949 231300 -95366 -91266 235599 -118484 -191486 -273083 -26150 39700 95309 -300898
10798 -24008 245084 130798 -112448 245329 -38786 -132678 -78440 -235098 43564 60605 93747
10787 93747 -290090 -383624 -72963 -138024 37275 -221012 105656 94049 -56891 190301 -90714
10775 -191152 21064 -99487 49127 -264463 27241 -29841 -139926 158650 -69167 129396 -13046
10763 -12822 -107483 58699 117640 236741 122928 -146116 173096 -226240 67348 75036 44826
10752 44826 11695 -135019 54858 -66489 -85618 -389482 -121016 165692 138226 163880 286136
10741 286136 38343 -56827 -381366 100354 -209650 75933 -164355 -15313 169595 -320111
10730C0224b08921f0104K0181C142L8526a0795q7263r0419A63312a2104r6967
10719a09071M9534m5706j91552a22908A83178f8601b6773A24709a86111j35056
10709c21167H4250B9914b28311K5338E2657a10843C1095g6518d690j09683I2611
10697b80668B9410J8909b0511j9818j10572K8189j17963H3837C9694A8350b1141
10685e2112B37103m7870F9697g3959o7414j78653n3422J57527D8015a79998j8526
10674a98524C8732m970c61667A4002J06978c20990b6141j86732F3578K53643I075
10662f9775a9241k5442a1178l5875q0869q4164m6286d2730d297q1458r7925A30066
10649F1582i2226n336j02621d5855l13436A11733a14508D8799m723J13390a53619
$$ plain form
10730 30224 -208921 -60104 -39923 3142 41668 -10795 -98058 -188477 163312 -12104 -109071
10719 -109071 -59537 -105243 -296795 -122908 183178 -68601 -26773 124709 -186111 -321167
10709 -321167 84250 29914 -228311 -202973 52657 -110843 31095 -76518 -4690 -114373 92611
10697 -280668 29410 48319 -20511 -40329 -150901 -122712 -240675 83837 39694 18350 -21141
10685 -52112 237103 189233 69697 -73959 -141373 -320026 -373448 -215921 48015 -179998 -198524
10674 -198524 38732 33762 -361667 14002 120980 -320990 -26141 -212873 63578 317221 9075
10662 -69775 -19241 -44683 -11178 -47053 -127922 -212086 -258372 -42730 -4297 -85755 -183680 130066
10649 61582 -92226 -97562 -200183 -45855 -359291 111733 -114508 48799 44076 157466 -153619
10637f82B18117b80238J19314j02172J01764C02486d11800i863I3667M1685m0245
10626I5107Q0356c02514a26494B01345a22987j11152e227B89439I06K9317c37554
10614a48580n3123h49A5981f9176c1923j00482A75478b47529D0651b50371C71739
10602a1200j41253M4887c9561A3554L01209b5784k117k57057o8736a25678R268
10591a16410I6283b9767k43831A10248a73977C3898a77356j4329A92062a09948
10580b14096O5920C75429A66108a14427G2742g3240A8757J18111c05061a22346
10569i4121K9731q2130E9741l530n155J8440O269e9601r3139c9484A03272J28544
10557B31816b80621i1076k03548A73830b58371o3487a25973L5595E206b6470j54605
$$ plain form
10637 -682 218117 -280238 -160924 -263096 -161332 302486 -411800 -9863 93667 135352 95107
10626 95107 175463 -302514 -126494 201345 -122987 -234139 -5227 289439 906 30223 -337554
10614 -148580 -201703 -849 15981 -69176 -31923 -132405 175478 -247529 40651 -250371 371739
10602 -11200 -152453 -107566 -39561 13554 314763 -25784 -27901 -284958 -353694 -125678 -116410
10591 -116410 96283 -29767 -273598 110248 -173977 33898 -177356 -191685 192062 -109948
10580 -214096 -148176 375429 166108 -114427 72742 -73240 18757 136868 -305061 -122346
10569 -94121 -64390 -146520 59741 56211 51056 69496 75765 -59601 -152740 -39484 103272 231816
10557 231816 -280621 -91076 -294624 173830 -258371 -321858 -125973 -90378 5206 -26470 -181075
10546a81075l3083a4886k08638g658j94722A07383l2552a31776c7032l38043b019
10534a66920O1935c7793J0978G075J9404b7217p2233G3079l0278J96922j16161
10523A23562a96365C0496c01051H2678d3632A46906b43368R2918G5773f3816H5945
10511a91814A21428K03315b32227E2503J92345j1784A15902E1868h1511B95943
10500B58337i172r1872j39681R3298q329B316b21700k3949M4660j3668a8674A79146
10487D4847c7272j43560j4877B32767E9010L5242D860Q1560a46340f6533B43171
10475e4496H5649c59660A93633A4576K5154b75537g2089l8206A97496M20622B81649
10463A55325K39226A91384J64303l871A40078g7409k0616A77171j7604a76232
$$ plain form
10546 -181075 -214158 -14886 -223524 -7658 -202380 107383 74831 -131776 -37032 -375075 -2019
10534 -166920 -104985 -37793 -26815 7075 26479 -27217 -99450 73079 42801 239723 123562
10523 123562 -196365 30496 -301051 82678 -43632 146906 -243368 -150450 75773 -63816 85945
10511 -191814 121428 324743 -232227 52503 244848 233064 115902 51868 -81511 295943
10500 258337 -9172 -101044 -240725 -147427 -155756 2316 -221700 -245649 -200989 -214657 -18674 179146
10487 44847 -37272 -180832 -195709 232767 59010 94252 4860 86420 -146340 -66533 243171
10475 -54496 85649 -359660 193633 14576 39730 -275537 -72089 -110295 197496 618118 281649
10463 155325 394551 191384 355687 351816 140078 -77409 -98025 177171 159567 -176232
10452a68825p4352D6303b81468A2190J36225N2274c289k23424B4690J6480M24962
10441D66132C1063J03277b9267j71960I6247d66385e6512j37503j99333i0418
10430I3110J09784a56819I5901L5331d0964P87q118p7782l4717B6012b66653H2034
10417i4621B5244A2322a75482B3485a48304R295N9061A42655m0887m1391a6389
10405B62907g0772a5946A72112m9902d81464b9673j8012H3832C5055d8831j50447
10394a99278E6209c0734H2816j9065a12518J5990k3043r7019B03592a9672A9654
10382c19233E8518L3651J44772b6475j43248A41153O7357a51941q9540C12815
10371F693K12449a06757A01361a55715A75836J22143A9355R8427K37325j57214
$$ plain form
10452 -168825 -243177 46303 -281468 12190 148415 200689 -3289 -226713 24690 41170 466132
10441 466132 31063 134340 -29267 -201227 96247 -466385 -56512 -194015 -393348 -90418
10430 93110 202894 -156819 95901 131232 -40964 -40177 -48295 -126077 -160794 26012 -266653 82034
10417 -94621 25244 12322 -175482 23485 -148304 -139009 -79948 142655 101768 60377 -16389
10405 262907 -70772 -15946 172112 122210 -481464 -29673 -47685 83832 35055 -48831 -199278
10394 -199278 56209 -30734 82816 63751 -112518 -96528 -119571 -216590 203592 -19672 19654
10382 -319233 58518 92169 236941 -26475 -169723 141153 208510 -151941 -241481 312815
10371 6693 219142 -106757 101361 -155715 175836 297979 19355 117782 355107 197893
10361A97893a65748D40509G6767a47937C22765d9386A34596n1838K6567J39065
10351B48390i018D44260A21151J77794K13920j24287J58659k10680h5420C01609
10340i0644B5523e0793A67778l1296O1558K4359C4139J76555L25728j6145B35354
10328C53880M5168A04704L23502k09582j0942G2943O9895b53936D66947C8415
10317B1852J389K66830l1180a4350j47790B8503L44406A70939A2431L03276J62051
10306D77758A51279K5959K09169A48881p8g3150F2929J65981a00615I9421J93567
10295B92988J09802D3880K1347F431L08195b13237a5701j84191A964K52473B4945
10283D2290A75c9427a5067k30623E1298i9618l19790A67495D6244a73270j47063
$$ plain form
10361 197893 -165748 440509 76767 -147937 322765 -49386 134596 82758 109325 248390
10351 248390 -9018 444260 121151 298945 512865 388578 547237 336557 -85420 301609
10340 -90644 25523 -50793 167778 136482 198040 222399 34139 210694 536422 520277 235354
10328 353880 399048 104704 428206 218624 207682 72943 142838 -253936 466947 38415
10317 21852 23241 290071 258891 -14350 -162140 28503 372909 170939 12431 315707 477758
10306 477758 151279 177238 386407 148881 148803 -73150 62929 228910 -100615 99421 292988
10295 292988 402790 43880 65227 6431 314626 -213237 -15701 -199892 1964 254437 24945
10283 42290 175 -39427 -15067 -245690 51298 -99618 -419408 167495 46244 -173270 -320333
10272c20333J07587E5114b70278B98440a48092n7330F0326b52533a2851l66499
10262c79350a27415B77013a85372A70757G6138O7527a40312A41710g1075G1052
10251a71742A78799b77571A55556a70934O9056A84808g9633a2328B36705J78521
10241D15226b5033A8112G120P3523J40629I8213a16088C20116a362H2955a45054
10229a89305A48791K9278b51143p4022a03604b4502l73995M8864A85455a23481
10218A1709b51996A2078d1617k73177o2934F7022d1467j91996a09014b3890J1808
10207a2082G2585b07178J3035A19733a87649j31683F8910a29994B67c69110f9173
10195a660l03908r6163a38552e7467B10497b62452J05009m0289N029O4248k23297
$$ plain form
10272 -320333 -212746 55114 -270278 298440 -148092 -205422 60326 -252533 -12851 -379350
10262 -379350 -127415 277013 -185372 170757 76138 143665 -140312 141710 -71075 71052
10251 -171742 178799 -277571 155556 -170934 -101878 184808 -79633 -12328 236705 415226
10241 415226 -25033 18112 7120 80643 221272 98213 -116088 320116 -1362 82955 -145054
10229 -189305 148791 178069 -251143 -325165 -103604 -24502 -398497 -349633 185455 -123481
10218 11709 -251996 12078 -41617 -314794 -377728 67022 -41467 -233463 -109014 -23890 -12082
10207 -12082 72585 -207178 -194143 119733 -187649 -319332 68910 -129994 267 -369110 -69173
10195 -1660 -305568 -401731 -138552 -57467 210497 -262452 -157443 -197732 -192703 -128455 -351752
10184c51752b2818q9135B17983a5454A38546L3789b39750A83809n2357c54394
10173a45195G0861P4566D4051b35200J7122A7738e9552E689a68645l83908B52681
10161a78696A72499i5886j112C8545r93i9462l4305n848j38049R7461h0163j8141
10149i8304G9061J8855A3494a04628k33905J65131A9923O6134d0650A60698a67929
10137b45161b410O7m10040a17680c343k91184a45059k94473a55173j82990h544
10125b63725R3201b1122j93522C1048b29327B07552J56581a5755A53899N7116
10115B11015f7045n7396A2511P0096a31749F2592B1774K4317a70696P0513A23553
10103B2278b65125c9298k84409B84308q108a82539k74310a54744n9636H9869K81387
$$ plain form
10184 -351752 -22818 -111953 217983 -15454 138546 172335 -239750 183809 131452 -354394
10173 -145195 70861 145427 44051 -235200 -218078 17738 -59552 5689 -168645 -552553 252681
10161 -178696 172499 -95886 -96998 38545 37552 -99462 -133767 -139615 -277664 -180203 -80163 -98304
10149 -98304 79061 97916 13494 -104628 -338533 -173402 19923 86057 -40650 160698 -167929
10137 -245161 -2410 -2343 -412383 -117680 -3343 -294527 -145059 -439532 -155173 -338163 -8544
10125 -263725 -170524 -21122 -214644 31048 -229327 207552 364133 -15755 153899 211015
10115 211015 -67045 -124441 12511 82607 -131749 62592 21774 46091 -170696 -100183 123553
10103 22278 -265125 -39298 -323707 284308 276200 -182539 -456849 -154744 -214380 89869 371256
10092C71256a10487J6594B95339h5866m9229j83766J12317J5715k1049a562q1240
10081h2802k17355g2555E8499h2951A41332n6370b61256k28203g5826j54882A83634
10069C4084b44333J17500k72778J19264J4727A83485L771b56474d3120m7042j53877
10058b44039b1314I1343a88637k17507A9158a09592o2857B33900g2107j00073
10048a72180j17320B26252d6143g639B3926a0282j09723L6866E8903b52101A18538
10036a04205l97710g3833B61473a61422f8383E3626a58491k4799I5782D6634J40302
10025A86936a98710E0235J63154I1121A383J64813c693n8701c0057m0275A99417
10013g838A47993d7642I4310Q0510C3925a09361j30876K7374Q5670B07225M988
$$ plain form
10092 371256 -110487 -93893 295339 -85866 -135095 -318861 -206544 -190829 -211878 -1562 -82802
10081 -82802 -300157 -72555 58499 -82951 141332 84962 -261256 -489459 -75826 -230708 183634
10069 34084 -244333 -126833 -399611 -280347 -265620 183485 187256 -256474 -43120 -90162 -244039
10058 -244039 -21314 91343 -188637 -406144 19158 -109592 -172449 233900 -72107 -172180
10048 -172180 -289500 226252 -46143 -7639 23926 -10282 -120005 -83139 58903 -252101 118538
10036 -104205 -501915 -73833 261473 -161422 -68383 53626 -158491 -183290 95782 46634 186936
10025 186936 -198710 50235 213389 91121 1383 166196 -3693 -62394 -30057 -70332 199417
10013 -7838 147993 -47642 94310 174820 33925 -109361 -240237 -212863 -127193 207225 212213
10002B12213I7971a82910l45188b11798l1655P123L0636H0595k9497f8077j97291
9991b65368j59731G6527a33714k113j16075a01917n2634G4797J18409b34579R9991
9980a34588j02842a17231k13865P7008a11900a3269k6315j30226O8096C6605R0659
9969A27264e7580l7933G1791L4499Q6057d18265J26788A7573a96377j62903G7889
9957A3125a6618d85A88459a58257j88452d7771r7732D60639I714J7129a76631
9945b07546N0996f5830A82133c22403B71978N2130b91842E279b41784J4734A22938
9933a87032A0560b52549l505A38968O274h5131l58867b9371k17706N123j03865
9922c45819B98342A16603n6959g0793j1871A76975h5632E11442b48667E2924A9150
$$ plain form
10002 212213 97971 -182910 -528098 -211798 -243453 -236330 -205694 80595 51098 -68077 -265368
9991 -265368 -425099 76527 -133714 -135827 -251902 -101917 -154551 74797 193206 -234579 -134588
9980 -134588 -237430 -117231 -331096 -254088 -111900 -13269 -39584 -169810 -101714 36605 127264
9969 127264 -57580 -95513 71791 106290 192347 -418265 -291477 17573 -196377 -359280 77889
9957 13125 -16618 -485 188459 -158257 -346709 -47771 -145503 460639 9714 26843 -176631
9945 -207546 -156550 -65830 182133 -322403 271978 324108 -291842 5279 -241784 -227050 122938
9933 -187032 10560 -252549 -256054 138968 145242 -85131 -443998 -29371 -247077 -241954 -345819
9922 -345819 298342 116603 59644 -70793 -82664 176975 -85632 511442 -248667 52924 19150
9910A04556i2014j13257R3061l6851b938E5661b98870a47197f325B10526I3407
9898A5223c81074b9843j51511Q4708j84017Q6010C29851c77784F9123k1666J63708
9887B11165e0624M654q6819F8261F51e5867k23980J8936B03530a04547k9938f5105
9874a27274B30268a80345e3187D6519a62633m6446A56243E2092a11000E579d34879
9862h174j56707A07072a69863k345O8975k60571A76259c47293o6730A64920o9969
9851I4951M0777b54818i8545A455a15280r4750J03084B75057b84878D4753a96063
9839A82529B7597b3911j41476N0770C1843Q280J74082c88374A17385d6063A17119
9827A98060k9592c3281q8584B60163c8353j05430j05171f4195A0216i4406B57093
$$ plain form
9910 104556 -92014 -205271 -112210 -149061 -2938 55661 -298870 -147197 -6325 210526 93407
9898 15223 -381074 -29843 -181354 -96646 -280663 -194653 329851 -377784 69123 47457 211165
9887 211165 -50624 -45970 -132789 68261 651 -55867 -279847 -260911 203530 -104547 -134485 -65105
9874 -127274 230268 -180345 -53187 46519 -162633 -209079 156243 52092 -111000 5579 -434879
9862 -8174 -164881 107072 -169863 -172208 -103233 -363804 176259 -347293 -414023 164920 94951
9851 94951 135728 -254818 -98545 1455 -115280 -210030 -106946 275057 -284878 44753 -196063
9839 182529 27597 -23911 -165387 -114617 31843 40123 214205 -388374 117385 -46063 117119
9827 198060 168468 -33281 -121865 260163 -38353 -143783 -248954 -64195 10216 -94406 257093
9815b44505A52688r990a19309N7143C51b6851A88067b66419A49950a40789e2422
9803a24953A3468J29825b79391n9262i3245j47839D3395A4650d6650E3292J23441
9792A76733h3059j89928h0989F9194c39580a9344E0529a6046j32973j47835H194
9780a58771G7107R7924b41128c6761c48o3219j70519E7629a52953k9926L7372
9769a45507f4252K0533k78346a23389C79920c24330I033c42454H0340J16168e52335
9757a5168O933k5460A01749l5157i0719m6423B62692l4740b03018O9140M2862
9746i1016R228l44507A10159F821L1117a69890p2019A5571K22680a96396A23579
9734A60667p5403A7697d0044j49303i0096r4277m1121G0917b3952k4062j8350
$$ plain form
9815 -244505 152688 142698 -119309 -62166 351 -26851 188067 -266419 149950 -140789 -52422
9803 -124953 13468 143293 -279391 -338653 -93245 -241084 43395 14650 -46650 53292 176733
9792 176733 -83059 -272987 -80989 69194 -339580 -19344 50529 -16046 -149019 -296854 8194
9780 -158771 77107 175031 -241128 -36761 -348 -63567 -234086 57629 -152953 -182879 -145507
9769 -145507 -64252 -43719 -322065 -123389 379920 -324330 9033 -342454 80340 196508 -552335
9757 -15168 -8235 -33695 101749 66592 -90719 -137142 262692 227952 -203018 -133878 -91016
9746 -91016 -81788 -426295 110159 6821 37938 -169890 -241909 15571 238251 -196396 123579
9734 160667 85264 17697 -40044 -189347 -90096 -184373 -225494 70917 -23952 -48014 -66364
9723f6364J7499J8287l90801d592j53377G8249g7131D1834a9798F6098b7505E5070
9710b44392A8131J50437K644A2567O3013d6053A25262a89296j01200a24098B31320
9698a4777A00919l9091j4780A2821K28536a50101k5887N0581b5070A82877b18289
9686d685A71173d6354B11836c9294p9078j52162D74057a61882P5164j39052H8487
9674i3689r5956c7215p7088B37401I3776c07411k91213a22762A032b39142m7297
9663b86439F2461a65760I70c09025J31644C5104Q3887c56125J62804D8410P3429
9652A21839e81862b00612d5859A25241a75237D7443a54819k66383I3846d22242
9641c1879B32890b42305R6083B95794G1384b70030j15933a63020A93619a76874
$$ plain form
9723 -66364 -48865 -30578 -421379 -4592 -157969 78249 -77131 41834 -19798 66098 -27505 55070
9710 -244392 18131 168568 171212 12567 75580 -46053 125262 -189296 -290496 -124098 231320
9698 -14777 100919 61828 47048 12821 241357 -150101 -175988 -125407 -25070 182877 -218289
9686 -4685 171173 -46354 211836 -39294 -118372 -270534 474057 -161882 -86718 -225770 88487
9674 -93689 -189645 -37215 -114303 237401 93776 -307411 -598624 -122762 1032 -239142 -286439
9663 -286439 62461 -165760 970 -309025 -177381 35104 118991 -356125 -193321 48410 121839
9652 121839 -581862 -200612 -45859 125241 -175237 47443 -154819 -421202 93846 -422242
9641 -31879 232890 -242305 -146222 295794 71384 -270030 -385963 -163020 193619 -176874
9630b20858e9177r5813A9150b04099k25742C03371c5268m1361J727A46899p3315
9619G3584J81691b99344G6168h4704C21786B4604a378j9778I1240a36320A08654
9607b27810B7330g9779j76530J6552C974c42193J6503C3735a39894C73869d72659
9595e2064j88959c5785j27540G6280k7001b19897B46126G1838k2276A259a75869
9583d2879j6302H7980i2522C39434I6739c05431A01956P972i9592b0547m8827
9572f9374C3688i6713B2155d3498j54227K1277Q0389q6364j7229e7249H700K23527
9560B32227E3075k0019f4434j65616I4769d709k74471q9371Q4565P2716c7851
9548G117b59888g3699m7222A70501E8546h6911G6218h61A4673b66163m49C13730
$$ plain form
9630 -220858 -59177 -154990 19150 -204099 -429841 303371 -35268 -76629 -74902 146899 73584
9619 73584 255275 -299344 76168 -84704 321786 24604 -1378 -21156 91240 -136320 108654
9607 -227810 27330 -79779 -256309 -239757 3974 -342193 -325690 33735 -139894 373869 -472659
9595 -52064 -241023 -35785 -163325 76280 49279 -219897 246126 71838 49562 1259 -175869
9583 -42879 -59181 87980 -92522 339434 96739 -305431 101956 109928 -99592 -20547 -69374
9572 -69374 33688 -96713 22155 -43498 -197725 -176448 -96059 -182423 -199652 -57249 8700 232227
9560 232227 53075 33056 -64434 -230050 94769 -4709 -279180 -368551 -283986 -211270 -37851
9548 7117 -259888 -73699 -120921 170501 58546 -86911 76218 -861 14673 -266163 -266612 313730
9535d18948c7664B5227b12398m393A98804b81479f8558a7642n8849m7503M7034
9524g6960A59488m3348P0341h6455C8950a56053j38781j51479a1430p4178n8330
9513a43938G3319b30904C5241e9878k38166c8196j67809A03138b77917a29854
9502b10877p349J9527N8508k23307a43033n2536A8912K6350d00455a29393f0107
9490g1402j62421O4758j42046d2616r9117a8392k43442i2780r9521B4502f5693
9478h6376q064k69390A39317a2205A2417M1977b55488c3177o1070b0347A43470
9466c21229A48035f4367D2237K6314b79949J36499N7281C348J63993o5808a3056
9454A53590i6761k594C3436O4812A2306J72019f9762I3971d2075H5019a05535
$$ plain form
9535 -418948 -37664 25227 -212398 -216791 198804 -281479 -68558 -17642 -76491 -123994 -76960
9524 -76960 159488 116140 186481 -86455 38950 -156053 -294834 -446313 -11430 -85608 -143938
9513 -143938 73319 -230904 35241 -59878 -298044 -38196 -206005 103138 -277917 -129854
9502 -210877 -218226 -198699 -140191 -363498 -143033 -195569 18912 45262 -400455 -129393 -60107
9490 -71402 -233823 -169065 -311111 -42616 -141733 -18392 -261834 -92780 -192301 24502 -65693
9478 -86376 -94440 -363830 139317 -12205 12417 54394 -255488 -33177 -94247 -20347 143470
9466 -321229 148035 -64367 42237 68551 -279949 -143450 -86169 3348 167341 101533 -13056
9454 153590 -96761 -99355 33436 98248 12306 184325 -69762 93971 -42075 85019 -105535
9442a92852e3845j97387B22129a04338A30302e2946G2514a83104A10829b50798
9431d8647m556j53555P8489D8974a25482F5868h3733p822k6478j63273d4164r7430
9419a41594a8957C2428L07649b34205O0705B0197a70449q4484E0716i4749K4741
9408g0008A04874N5632L4522b230j41044O7059A82334h1846K2168A0473c38739
9396C0178a74094L35I1576J65608a13816l3401A68545c8637o9345o940j91612
9385c06534a38144k42353d7292C22895b69376B1558J31509a83301m088D4039O5695
9374A09734a38287r5672J6750L8249Q2712b7368l47497g4242I3811a05073B33903
9362C16606b9023k47668l0942C5296b15991A40828j8593a39246l78010D7208N0461
$$ plain form
9442 -192852 -53845 -251232 222129 -104338 130302 -52946 72514 -183104 110829 -250798
9431 -48647 -53203 -206758 -128269 48974 -125482 65868 -83733 -91555 -118033 -281306 -44164 -141594
9419 -141594 -18957 32428 340077 -234205 -173500 20197 -170449 -254933 50716 -94749 -70008
9408 -70008 104874 160506 195028 -2230 -143274 -76215 182334 -81846 -59678 10473 -338739
9396 30178 -174094 -173759 91576 257184 -113816 -147217 168545 -38637 -107982 -114922 -306534
9385 -306534 -138144 -380497 -47292 322895 -269376 21558 153067 -183301 -187389 44039 109734
9374 109734 -138287 -233959 -217209 -178960 -96248 -27368 -374865 -74242 93811 -105073 233903
9362 316606 -29023 -276691 -307633 35296 -215991 140828 122235 -139246 -517256 47208 97669
9351I7669M4223e0812j63054I5466k3795b12514h1702k51115J30734j37912I2788
9339b72022c6803D05839c52396B43796i1362k35926f1333M928j42239j88663j157
9328c88464P9163B3411b09745F6333a58852O4785I9520R4138c4817j45283k56849
9317d36949a83583c1066C8602b47909A54131a2039j47876C9227f001j8637H0733
9305a88094A58014d8612f192j2799j22229l5242b1018K755j60444J2369D1314
9293B19053f4296k26216a08438D6047A0046b59986C6541b70596A40084a385j68450
9282a69835j23634A14285a30677j20832O9050m0270e4459k98919a11455K4118
9272h7337J5780j7877C00395A02122g707j82746L9983A18850i9203G8568j5819
$$ plain form
9351 97669 141892 -50812 -213866 95466 71671 -212514 -81702 -332817 -202083 -339995 92788
9339 -272022 -36803 405839 -352396 243796 -91362 -327288 -61333 -56405 -198644 -387307 -388464
9328 -388464 -309301 23411 -209745 66333 -158852 -94067 99520 193658 -34817 -180100 -436949
9317 -436949 -183583 -31066 38602 -247909 154131 -12039 -159915 39227 -6001 -24638 80733
9305 -188094 158014 -48612 -6192 -18991 -141220 -176462 -21018 -18263 -178707 -166338 41314
9293 219053 -64296 -290512 -108438 46047 10046 -259986 36541 -270596 140084 -1385 -169835
9282 -169835 -293469 114285 -130677 -251509 -182459 -222729 -54459 -353378 -111455 -87337
9272 -87337 -71557 -89434 300395 102122 -7707 -190453 -150470 118850 -99203 78568 62749
9261F2749h7922C1628c33100A60906a40639O931d3520j08747f7784j25667b4023
9249C60382A47176o9211Q0444d9529F7679a60961L4961E0805K2227j4292c409
9237c72797I3230a92301C15658a31397o8288Q301N1501k7A5499Q8110a10500r3238
9225b03738R7777j14089f9678G7075a29847A74563A0976J98647h063j54272g5912
9213F7460b93182P6178O7496O315A80806E565J0594J14321a93010A887h349m25559
9201d33908a22207G3063a55160a0093A89742K0678a98914J5775A5886c5189J7047
9190a8142j17827m33C734d27610B7962a54389B31756b42358h1578A50258b73815
9178b35536c1698B7353g1207k33081a07954B61135D2729A8130h2655p7404B51372
$$ plain form
9261 62749 -87922 31628 -333100 160906 -140639 -133708 -43520 -152267 -67784 -193451 -24023
9249 360382 147176 77965 158409 -49529 67679 -160961 -126000 50805 73032 58740 -3409
9237 -372797 93230 -192301 315658 -131397 -199685 -191384 -139883 -139910 15499 103609 -110500 -203738
9225 -203738 -105961 -220050 -69678 77075 -129847 174563 10976 209623 -8063 -162335 -75912
9213 67460 -293182 -217004 -149508 -143193 180806 5565 16159 130480 -193010 1887 -8349 -433908
9201 -433908 -122207 73063 -155160 -10093 189742 210420 -198914 -183139 15886 -35189 -18142
9190 -18142 -135969 -136402 3734 -427610 27962 -154389 231756 -242358 -81578 150258 -273815
9178 -235536 -31698 27353 -71207 -304288 -107954 261135 42729 18130 -82655 -160059 251372
9166d72442b19402j6782A83289G2916A8088a55993K8751H7209a57699E9403j3620
9155D5783h3306l4568a1127j57876A56023A6512d37973A00499J06421a97757k64858
9144d62615a6476o0280e837j90702P2151D0522b3536k10349j0791F9148a08210
9132b63478h2542B13066B5518f9766j25210d0932j88608m4424C5610f0054o1479
9121a21533B85492d31802a01307A03180c57588C2852K2435b35729M6592C2968
9110c15609C0952J66920a62567F4863k3035c06965a24505K7417M7273I2549a25900
9098b1520A36519A853a07562K4207q4591p6312a20994C2677b54697C743e6165
9086E8663J14713a04779D9096b40230L7868i6962B75453q6200h9538r4268a0294
$$ plain form
9166 -472442 -219402 -236184 183289 72916 18088 -155993 -127242 87209 -157699 59403 45783
9155 45783 -83306 -117874 -11127 -169003 156023 16512 -437973 100499 206920 -197757 -462615
9144 -462615 -16476 -76756 -5837 -196539 -124388 40522 -23536 -233885 -244676 69148 -108210
9132 -263478 -82542 213066 25518 -69766 -194976 -40932 -229540 -273964 35610 -60054 -121533
9121 -121533 285492 -431802 -101307 103180 -357588 32852 55287 -235729 -189137 32968
9110 -315609 30952 197872 -162567 64863 41828 -306965 -124505 -97088 -49815 92549 -125900
9098 -21520 136519 1853 -107562 -83355 -167946 -244258 -120994 32677 -254697 3743 -56165
9086 58663 173376 -104779 49096 -240230 -202362 -96962 275453 189253 -89538 -183806 -10294
9074a2501e873o3692A76920a77547j92684J79977A94484E8531g3097A05652J83138
9063B88790a62784F1354a10437I9187h0548c1716q4885d3473B84981d1153A6505
9051c34652B78729f7929E9862A5010P9560a15271E7661J4562b49229C2350P5844
9040A08194p113k8504c68574G2154c74127d4804B55797a85977A32039c02990b4794
9028a54367D5533a55797N8683j36747a10859l015j15520j05895c5083G4896a4400
9016B38510a38293B18994l9403d9726G7512J01401a07371M3599C2116c0220A27329
9004f0570k00691H190c3293m64105b48663c3307j73947A72508b577I1291d58255
8992a14507e6047n009A10575a08831E6989j7332a21966B92800e8359J8001C15437
$$ plain form
9074 -12501 -5873 -69565 176920 -177547 -370231 -190254 194484 58531 -73097 105652 288790
9063 288790 -162784 61354 -110437 99187 -80548 -31716 -116601 -43473 284981 -41153 16505
9051 -334652 278729 -67929 59862 15010 94570 -115271 57661 72223 -249229 32350 108194
9040 108194 101081 72577 -368574 72154 -374127 -44804 255797 -185977 132039 -302990 -24794
9028 -154367 45533 -155797 -97114 -233861 -110859 -113874 -229394 -335289 -35083 74896 -14400
9016 238510 -138293 218994 179591 -49726 77512 178913 -107371 -63772 32116 -30220 127329
9004 -60570 -261261 8190 -33293 -497398 -248663 -33307 -207254 172508 -2577 91291 -458255
8992 -114507 -56047 -61056 110575 -108831 56989 39657 -121966 292800 -58359 -40358 315437
8980A3111b41349I2784i578m0990k24207r5967a72083b1462j42161b4230A23602
8968b9232G4821j0827a26832Q758H2420J04241r1779J80899L7464A09146K205
8957A11351k8177c08849B0597b4099k21190A71087a44082D2130a27215A32861
8946d2799m5903K5537o1970m4053J0907H5895J71495G537a51502I8326a32411
8934B62333b69530P080G9692a01791L2579C0461g0069j40828F4583R3693B6743
8922C0764M1764A0474K1140L2192K16795L585K3418J01759A84415C2093J01157
8911A33250O6865J12760N32940M46628J026374K359158M535338D362211j621133
8902B741078A090882l06985k44231c8500o9142I2284J49909H9567J36158D5217
$$ plain form
8980 13111 -241349 92784 -9578 -50568 -274775 -370742 -172083 -21462 -163623 -24230 123602
8968 -29232 74821 63994 -126832 -118074 82420 186661 94882 275781 313245 109146 111351
8957 111351 83174 -308849 20597 -24099 -245289 171087 -144082 42130 -127215 132861
8946 -42799 -88702 -63165 -125135 -169188 -158281 85895 257390 7537 -151502 98326 -132411
8934 262333 -269530 -262450 79692 -101791 -69212 30461 -70069 -210897 64583 158276 26743
8922 30764 72528 10474 31614 63806 280601 284186 307604 409363 184415 32093 133250
8911 133250 200115 312875 845815 1292443 2318817 4677975 9213313 4362211 2741078
8902 2741078 1090882 783897 539666 -38500 -107642 92284 242193 89567 225725 45217
8891B15901a44649G437L4586A1632R66J99235c37773E1446d1479A24519a76188
8879b68905B89349c88320a79679Q1607H022a68929A43442C7677e5700k27700A45033
8867A438J82988c9681q0567o6843a9888H8141a50872F2022J05276g1408D0203
8855G4965b63758J24725A44951i151k07057n5565d7672K1111p3333h59A69853
8843D09422G3313B5790a86334A88289d72439g7637j4135A04012P8176g8348k66969
$$ plain form
8891 215901 -144649 7437 42023 11632 12598 211833 -337773 51446 -41479 124519 -176188
8879 -268905 289349 -388320 -179679 -98072 8022 -168929 143442 37677 -55700 -283400 145033
8867 1438 184426 -39681 -120248 -187091 -19888 88141 -150872 62022 167298 -71408 40203
8855 74965 -263758 -139033 144951 -9151 -216208 -271773 -47672 -26561 -99894 -859 169853
8843 409422 73313 25790 -186334 188289 -472439 -77637 -91772 104012 182188 -78348 -345317
$$ [...]
##END NTUPLES=NMR SPECTRUM
##END=
