
##TITLE=AC1005_Arabiga_6278800_ESOVnCKldA
##JCAMPDX= 6.0         $$ Bruker NMR JCAMP-DX V2.0
##DATA TYPE= NMR SPECTRUM
##DATA CLASS= NTUPLES
##ORIGIN= BRUKER
##OWNER= Administrator
$$ 1.72 TOPSPIN		Version 2.1
$$ 2012-06-07 04:23:50.031 -0500  Administrator@TOPSPIN
$$ Compression mode = diff/dup
##.OBSERVE FREQUENCY= 400.13188235
##.OBSERVE NUCLEUS= ^1H
##.ACQUISITION MODE= SIMULTANEOUS (DQD)
##.ACQUISITION SCHEME= undefined
##.AVERAGES= 64
##.DIGITISER RES= 22
##SPECTROMETER/DATA SYSTEM= spect
##.PULSE SEQUENCE= noesygpps1d.comp
##.SOLVENT NAME= COFFEE_meoh
##.SHIFT REFERENCE= INTERNAL, COFFEE_meoh, 1, 14.96711
##AUDIT TRAIL= $$ (NUMBER, WHEN, WHO, WHERE, PROCESS, VERSION, WHAT)
$$ ##TITLE= Audit trail, TOPSPIN		Version 2.1
$$ ##JCAMPDX= 5.01
$$ ##ORIGIN= Bruker BioSpin GmbH
$$ ##OWNER= Administrator
$$ $$ C:\Bruker\TOPSPIN/data/COFFEE/nmr/AC1005_Arabiga_6278800_ESOVnCKldA/22/pdata/1/auditp.txt
$$ ##AUDIT TRAIL=  $$ (NUMBER, WHEN, WHO, WHERE, PROCESS, VERSION, WHAT)
(   1,<2012-06-07 04:23:44.843 -0500>,<Administrator>,<TOPSPIN>,<go>,<TOPSPIN 2.1>,
      <created by zg
	started at 2012-06-07 04:12:14.765 -0500,
	POWCHK enabled, PULCHK disabled,
       configuration hash MD5:
       D5 CA 7A 23 FE 6B EE E2 50 67 74 61 24 F7 5E 3B
       data hash MD5: 64K
       BF 09 3C 09 A9 71 EF 54 09 9F 95 9F 1C 84 AF A7>)
(   2,<2012-06-07 04:23:47.625 -0500>,<Administrator>,<TOPSPIN>,<proc1d>,<TOPSPIN 2.1>,
      <Start of raw data processing
       efp LB = 0.3 FT_mod = 6 PKNL = 1 PHC0 = 0 PHC1 = 0 SI = 128K 
       data hash MD5: 128K
       F5 AE D1 AB 9E 05 C4 20 9A 4E 6C 43 03 E0 E7 D5>)
(   3,<2012-06-07 04:23:48.921 -0500>,<Administrator>,<TOPSPIN>,<proc1d>,<TOPSPIN 2.1>,
      <pk PHC0 = 29.96521 PHC1 = 0 
       data hash MD5: 128K
       B4 E0 DD 5B 48 EF 7E B1 E1 D5 D4 D9 C8 95 A8 46>)
(   4,<2012-06-07 04:23:49.687 -0500>,<Administrator>,<TOPSPIN>,<proc1d>,<TOPSPIN 2.1>,
      <abs ABSG = 1 
       data hash MD5: 128K
       26 93 C0 1A BE D7 9C 47 6D 99 6B 2B 21 1C 17 2C>)
(   5,<2012-06-07 04:23:49.765 -0500>,<Administrator>,<TOPSPIN>,<proc1d>,<TOPSPIN 2.1>,
      <abs ABSG = 2 
       data hash MD5: 128K
       D5 C6 F7 0E 52 3B DD 37 1D 5F BA 7C A9 06 9E 91>)
(   6,<2012-06-07 04:23:49.828 -0500>,<Administrator>,<TOPSPIN>,<proc1d>,<TOPSPIN 2.1>,
      <abs ABSG = 3 
       data hash MD5: 128K
       AC 83 9C 24 C5 50 67 5F DC A1 86 42 0E 82 0E E1>)
(   7,<2012-06-07 04:23:49.890 -0500>,<Administrator>,<TOPSPIN>,<proc1d>,<TOPSPIN 2.1>,
      <abs ABSG = 4 
       data hash MD5: 128K
       C5 AB 8D 80 5C DE 8C 2F A2 2C 67 31 0B 87 A3 03>)
(   8,<2012-06-07 04:23:49.953 -0500>,<Administrator>,<TOPSPIN>,<proc1d>,<TOPSPIN 2.1>,
      <abs ABSG = 5 
       data hash MD5: 128K
       B6 0A A8 35 31 57 FB 37 87 01 8E 69 A0 EB 2D A6>)
$$ ##END=
$$ 
$$ $$ hash MD5
$$ $$ F7 68 DE ED 07 84 51 56 76 F9 61 87 F2 6F A3 2C
##$RELAX= 
##$RELAX= 
##$RELAX= 
##$RELAX= 
##$RELAX= 
##$RELAX= 
##$RELAX= 
##$RELAX= 
$$ Bruker specific parameters
$$ [...]
##$TP07= 0
##$TPNAME0= <>
##$TPNAME1= <>
##$TPNAME2= <>
##$TPNAME3= <>
##$TPNAME4= <>
##$TPNAME5= <>
##$TPNAME6= <>
##$TPNAME7= <>
##$TPOAL= (0..7)
0.5 0.5 0.5 0.5 0.5 0.5 0.5 0.5
##$TPOFFS= (0..7)
0 0 0 0 0 0 0 0
##$TUNHIN= 0
##$TUNHOUT= 0
##$TUNXOUT= 0
##$USERA1= <user>
##$USERA2= <user>
##$USERA3= <user>
##$USERA4= <user>
##$USERA5= <user>
##$V9= 5
##$VALIST= <valist>
##$VCLIST= <CCCCCCCCCCCCCCC>
##$VD= 0
##$VDLIST= <DDDDDDDDDDDDDDD>
##$VPLIST= <PPPPPPPPPPPPPPP>
##$VTLIST= <TTTTTTTTTTTTTTT>
##$WBST= 2048
##$WBSW= 25
##$XGAIN= (0..3)
0 0 0 0
##$XL= 0
##$YL= 0
##$YMAX_a= 13179360
##$YMIN_a= -6865341
##$ZGOPTNS= <>
##$ZL1= 120
##$ZL2= 120
##$ZL3= 120
##$ZL4= 120
##$ABSF1= 14.96711
##$ABSF2= -5.585421
##$ABSG= 5
##$ABSL= 3
##$ALPHA= 0
##$AQORDER= 0
##$ASSFAC= 0
##$ASSFACI= 0
##$ASSFACX= 0
##$ASSWID= 0
##$AUNMP= <proc_prof1d_extract.lims>
##$AXLEFT= 0
##$AXNAME= <>
##$AXNUC= <1H>
##$AXRIGHT= 0
##$AXTYPE= 0
##$AXUNIT= <>
##$AZFE= 0.1
##$AZFW= 0.1
##$BCFW= 0
##$BC_mod= 0
##$BYTORDP= 0
##$COROFFS= 0
##$CY= 15
##$DATMOD= 1
##$DC= 0
##$DFILT= <>
##$DTYPP= 0
##$F1P= 0
##$F2P= 0
##$FCOR= 0.5
##$FTSIZE= 131072
##$FT_mod= 6
##$GAMMA= 0
##$GB= 0
##$INTBC= 1
##$INTSCL= 1
##$ISEN= 128
##$LB= 0.3
##$LEV0= 0
##$LPBIN= 0
##$MAXI= 10000
##$MC2= 0
##$MEAN= 0
##$ME_mod= 0
##$MI= 0
##$NCOEF= 0
##$NC_proc= -2
##$NLEV= 6
##$NOISF1= 0
##$NOISF2= 0
##$NSP= 0
##$NTH_PI= 0
##$NZP= 0
##$OFFSET= 14.96711
##$PC= 1
##$PHC0= 29.96521
##$PHC1= 0
##$PH_mod= 1
##$PKNL= yes
##$PPARMOD= 0
##$PPDIAG= 0
##$PPIPTYP= 0
##$PPMPNUM= 2147483647
##$PPRESOL= 1
##$PSCAL= 4
##$PSIGN= 0
##$PYNMP= <proc.py>
##$REVERSE= no
##$SF= 400.130005403752
##$SI= 131072
##$SIGF1= 0
##$SIGF2= 0
##$SINO= 400
##$SIOLD= 131072
##$SPECTYP= <>
##$SREGLST= <1H.CDCl3>
##$SSB= 0
##$STSI= 131072
##$STSR= 0
##$SW_p= 8223.68421052632
##$SYMM= 0
##$S_DEV= 0
##$TDeff= 65536
##$TDoff= 0
##$TI= <>
##$TILT= no
##$TM1= 0
##$TM2= 0
##$TOPLEV= 0
##$USERP1= <user>
##$USERP2= <user>
##$USERP3= <user>
##$USERP4= <user>
##$USERP5= <user>
##$WDW= 1
##$XDIM= 131072
##$YMAX_p= 304756500
##$YMIN_p= -11225
##$CURPLOT= <Network HP LaserJet P1505>
##$CURPRIN= <$Network HP LaserJet P1505>
##$DFORMAT= <normdp>
##$LAYOUT= <+/1D_H.xwp>
##$LFORMAT= <normlp>
##$PFORMAT= <normpl>
##$SURQMSG= 1
$$ End of Bruker specific parameters
$$ ---------------------------------
##NTUPLES= NMR SPECTRUM
##VAR_NAME=  FREQUENCY,     SPECTRUM/REAL,   SPECTRUM/IMAG
##SYMBOL=    X,             R,               I
##VAR_TYPE=  INDEPENDENT,   DEPENDENT,       DEPENDENT
##VAR_FORM=  AFFN,          ASDF,            ASDF
##VAR_DIM=   131072,        131072,          131072
##UNITS=     HZ,            ARBITRARY UNITS, ARBITRARY UNITS
##FACTOR=    0.0627417313425165, 1,          1
##FIRST=     8223.62146879498, 3655,         -57253
##LAST=      0,             4615,            -56549
##MIN=       0,             -11225,          0
##MAX=       8223.62146879498, 304756500,    0
$$ Real data points
##PAGE= N=1
##DATA TABLE= (X++(R..R)), XYDATA
$$ [...]
61623C80067l457l065k085j149n97n82j052j624j763j297o15k98n83j166j474
61608C59260j153l39N32J147J486J673J826K064K452K830K849K378J736J365J316
61593C81422J281J069P78M95R1m47p47l85N25J400J842K008K218K474K558K443
61577C99025K301K152J785J143M97P5k96j012k173l404m153m118l493k851k666
61562C82812k888l055k956k852l001l147k845k130j504j335j589k117k787l292
61548C47314l235k635k015j779j794j784j849k259k910l351l272k711j923j277
61534C14520j133j476j793j580r73n00l49k46n2L7mJ29M80N71K6q17j358j487
61516C03995j506j487j241p60k44L45J201K131K567K303J773J405J085N68R3Q5
$$ y = [380067, 376610, 373545, 371460, 370311, 369714, 369132, 368080, 366456, 364693, 363396, 362781, 362483, 361900, 360734, 359260, 358107, 357768, 358300, 359447, 360933, 362606, 364432, 366496, 368948, 371778, 374627, 377005, 378741, 380106, 381422, 382703, 383772, 384550, 385045, 385136, 384689, 383942, 383557, 384082, 385482, 387324, 389332, 391550, 394024, 396582, 399025, 401326, 403478, 405263, 406406, 406903, 406978, 406682, 405670, 403497, 400093, 395940, 391822, 388329, 385478, 382812, 379924, 376869, 373913, 371061, 368060, 364913, 362068, 359938, 358434, 357099, 355510, 353393, 350606, 347314, 344079, 341444, 339429, 337650, 335856, 334072, 332223, 329964, 327054, 323703, 320431, 317720, 315797, 314520, 313387, 311911, 310118, 308538, 307565, 307065, 306716, 306470, 306418, 306455, 306451, 306580, 307060, 307631, 307657, 306840, 305482, 303995, 302489, 301002, 299761, 299001, 298757, 299102, 300303, 302434, 305001, 307304, 309077, 310482, 311567, 312135, 312228, 312313]
61500C12313N27R78J167J194J214J242J219J082Q06N73P03J168J356P64j91n40
61484C25575K6Q14J081Q79P77J138J864K540K631J892P78J32K50N89N84L77L75
61467C42302O06Q54J092J285J070K29p74j228j038o37k26L04Q19R37O60M04L34
61450C46993K16L9K19Q98J583J754J424R08M42K70O42J420K023K082J873J871
61434C64657K194K730L371L840L635K610J333N12K81L60O35J111J528J545J197
61419C91539Q07M65j2o96j400j844j737r05L21J086Q57J23k93l73p74j568j980
61402C83616j585j033j089j515j497q82k32J52N97J255J659J434J026J155J799
61387C84860K287K381K580L113L300K505J272Q03J390K154K381K404K787L304
$$ y = [312313, 312840, 313818, 314985, 316179, 317393, 318635, 319854, 320936, 321742, 322315, 323018, 324186, 325542, 326306, 326115, 325575, 325601, 326415, 327496, 328375, 329152, 330290, 332154, 334694, 337325, 339217, 339995, 340127, 340377, 340966, 341550, 341927, 342302, 342908, 343762, 344854, 346139, 347209, 347438, 346664, 345436, 344398, 343761, 343535, 343839, 344658, 345595, 346255, 346659, 346993, 347209, 347248, 347467, 348365, 349948, 351702, 353126, 354034, 354476, 354746, 355388, 356808, 358831, 360913, 362786, 364657, 366851, 369581, 372952, 376792, 380427, 383037, 384370, 384882, 385163, 385523, 386158, 387269, 388797, 390342, 391539, 392346, 392811, 392799, 392103, 390703, 388859, 387122, 386217, 386538, 387624, 388481, 388604, 388311, 387938, 387164, 385596, 383616, 382031, 380998, 379909, 378394, 376897, 376015, 375783, 375935, 376532, 377787, 379446, 380880, 381906, 383061, 384860, 387147, 389528, 392108, 395221, 398521, 401026, 402298, 403101, 404491, 406645, 409026, 411430, 414217, 417521]
61373D17521L230K347J143K00k14r6L85J012J725K539L176L161K483J775J468
61358D41855J246P69L68M54O08R7r21j582j650j773k278k534j918p61R2K25j62
61341D32135o81j046j144j146j274j450j458j434j743k257k387j989j676j823
61327D10627j933j439o33j12K59J049K106K535J949J105R34J451J983K177K298
61312D24356K666L173L482L383K850J962J074Q18J491K464K646J836J074J333
61298D54608K314L053L297L488L701L541L157L280L984M281L556K567K319K605
61284D99751K470J711R57N11L7n52p37k04N72Q80N05k39r53j347j332j056p82
61267E00192o09m75l29j77N8M32Q13J037J245J790K755L825M666N242N754O458
$$ y = [417521, 420751, 423098, 424241, 424441, 424227, 424131, 424516, 425528, 427253, 429792, 432968, 436129, 438612, 440387, 441855, 443101, 443870, 444238, 444692, 445300, 445397, 444476, 442894, 441244, 439471, 437193, 434659, 432741, 431980, 432072, 432297, 432135, 431454, 430408, 429264, 428118, 426844, 425394, 423936, 422502, 420759, 418502, 416115, 414126, 412450, 410627, 408694, 407255, 406622, 406510, 406769, 407818, 409924, 412459, 414408, 415513, 416447, 417898, 419881, 422058, 424356, 427022, 430195, 433677, 437060, 439910, 441872, 442946, 443764, 445255, 447719, 450365, 452201, 453275, 454608, 456922, 459975, 463272, 466760, 470461, 474002, 477159, 480439, 484423, 488704, 492260, 494827, 497146, 499751, 502221, 503932, 504889, 505400, 505437, 504885, 504148, 503944, 504516, 505396, 505901, 505662, 504709, 503362, 502030, 500974, 500192, 499583, 499108, 498779, 498602, 498660, 499092, 499905, 500942, 502187, 503977, 506732, 510557, 515223, 520465, 526219, 532677]
61251E32677P482Q638R411R400Q824Q314Q217Q276P999P062N347L052Q57l46l32
61236F24878K1m58k040l898n182n922o731p743q300p831o708n877n698n600m973
61221E47938l967l121k570k046j429q31k11O10J441J705J132J95l58k22L63J075
61205E39704J835K670L505M157M539M733M796M561L823K696J616R49Q00J167J938
61190E83489K616K582J872J273J267J338R12M45Q06J789K231J680R94R75J274
61175F05543J136O15L46N34Q29R73J108J502K305L434M500N015N005N068N604
61160F43517O261O519O425O312O096N530M888M738M954M746L811K924K969L813
61146G13503M517M549M339M686N790P051P745P856Q048Q813R808J0236R648Q246
$$ y = [532677, 540159, 548797, 558208, 567608, 576432, 584746, 592963, 601239, 609238, 616300, 621647, 624699, 625556, 625210, 624878, 624899, 624441, 622401, 618503, 613321, 607399, 600668, 592925, 584625, 576794, 570086, 564209, 558511, 552911, 547938, 543971, 540850, 538280, 536234, 534805, 533974, 533763, 534373, 535814, 537519, 538651, 538846, 538488, 538266, 538629, 539704, 541539, 544209, 547714, 551871, 556410, 561143, 565939, 570500, 574323, 577019, 578635, 579584, 580384, 581551, 583489, 586105, 588687, 590559, 591832, 593099, 594437, 595349, 595794, 596600, 598389, 600620, 602300, 603294, 604269, 605543, 606679, 607294, 607640, 608174, 609003, 609976, 611084, 612586, 614891, 618325, 622825, 627840, 632845, 637913, 643517, 649778, 656297, 662722, 669034, 675130, 680660, 685548, 690286, 695240, 699986, 703797, 706721, 709690, 713503, 718020, 722569, 726908, 731594, 737384, 744435, 752180, 760036, 768084, 776897, 786705, 796941, 806589, 814835]
61132H14835O522M953L864L170K273O64j316k687k871k227j546j391k021l402
61118H18820n011o031o123n826n829o101o055n410m533l945l841m028m106l696
61104G48285k760j739j179j113r34m1J445K715L200L403M503O899R478J0778J0699
61089G93639J0386J0455J0213R030P626P194P759Q381Q713R353J0604J1845J2457
61076I17655J2661J2990J3526J4077J4624J5159J5438J5306J5023J4856J4610
61065A075925J3956J3009J2101J1242J0246R303Q888R064R259Q873P857O590N433
61052A201746M444L345J746m26k666m229m882n243o255q328j0979j3321j4948
61039A140004j6202j7524j8671j9071j8843j8957j9999k1296k1716k1069k0096
$$ y = [814835, 821357, 826310, 830174, 833344, 835617, 836281, 834965, 832278, 829407, 827180, 825634, 824243, 822222, 818820, 813809, 807778, 801655, 795829, 790000, 783899, 777844, 772434, 767901, 763956, 760115, 756087, 751981, 748285, 745525, 743786, 742607, 741494, 740560, 740519, 741964, 744679, 747879, 751282, 755785, 762684, 772162, 782940, 793639, 804025, 814480, 824693, 833723, 841349, 848543, 856302, 864683, 873396, 882749, 893353, 905198, 917655, 930316, 943306, 956832, 970909, 985533, 1000692, 1016130, 1031436, 1046459, 1061315, 1075925, 1089881, 1102890, 1114991, 1126233, 1136479, 1145782, 1154670, 1163734, 1172993, 1181866, 1189723, 1196313, 1201746, 1206190, 1209535, 1211281, 1210855, 1208189, 1203960, 1199078, 1193835, 1187580, 1179252, 1168273, 1154952, 1140004, 1123802, 1106278, 1087607, 1068536, 1049693, 1030736, 1010737, 989441, 967725, 946656, 926560]
61028I26560j9268j8296j6959j5728j5183j5147j4789j3522j1572r719q607q189
61016G59581p758o668n078l827l474l638l442k455j003L43J303J883K172K394
61002G30333L017M402O272P766Q374Q527Q999R891J0724J1481J2789J4897J7130
60989H54602J8801K0130K1642K3172K4213K4976K6298K8412L0632L2397L3989
60978A139264L5846L7785L9329M0556M2202M4911M8632N2673N6322N9451O2479
60967A659450O5732O9071P2351P5961Q0508Q6132R2571R9793J08050J17398J27661
60956B654678J38897J51572J66478J84954K08621K38025K71820L08512L48942
60947D672499L95735M50432N12991N84320O66661P60240Q62481R72288J089168
$$ y = [926560, 907292, 888996, 872037, 856309, 841126, 825979, 811190, 797668, 786096, 776377, 767770, 759581, 751823, 745155, 740077, 736250, 732776, 729138, 725696, 723241, 722238, 722581, 723884, 725767, 727939, 730333, 733350, 737752, 744024, 751790, 760164, 768691, 777690, 787581, 798305, 809786, 822575, 837472, 854602, 873403, 893533, 915175, 938347, 962560, 987536, 1013834, 1042246, 1072878, 1105275, 1139264, 1175110, 1212895, 1252224, 1292780, 1334982, 1379893, 1428525, 1481198, 1537520, 1596971, 1659450, 1725182, 1794253, 1866604, 1942565, 2023073, 2109205, 2201776, 2301569, 2409619, 2527017, 2654678, 2793575, 2945147, 3111625, 3296579, 3505200, 3743225, 4015045, 4323557, 4672499, 5068234, 5518666, 6031657, 6615977, 7282638, 8042878, 8905359, 9877647, 10966815]
60938A0966815J198623J258078J210694J028852P48385M53448K21996Q4894L2241
60929A7204026M2964R2826J37698J12142l3885k92123n95153q61222j041045j129406
60919A3636822j146663j117732j062562r94000r18056q37043p53782o72210n94740
60910E540034n21506m52873l90899l37583k93119k56540k26879k02860j82556
60901B675219j64395j48021j33574j20659j08719r7812q8323q0119p2644o5692
60891A595261n9656n5004n1716m9229m6853m4338m2032m0306l8927l7298l5231
60880A094671l3057l1070k9239k7550k6110k4885k3706k2647k1939k1454k0718
60869H12296j9566j8353j7408j6632j5861j5200j4807j4584j4279j3644j2524
$$ y = [10966815, 12165438, 13423516, 14634210, 15663062, 16411447, 16864895, 17086891, 17171785, 17204026, 17246990, 17339816, 17477514, 17589656, 17555771, 17263648, 16668495, 15807273, 14766228, 13636822, 12490159, 11372427, 10309865, 9315865, 8397809, 7560766, 6806984, 6134774, 5540034, 5018528, 4565655, 4174756, 3837173, 3544054, 3287514, 3060635, 2857775, 2675219, 2510824, 2362803, 2229229, 2108570, 1999851, 1902039, 1813716, 1733597, 1660953, 1595261, 1535605, 1480601, 1428885, 1379656, 1332803, 1288465, 1246433, 1206127, 1167200, 1129902, 1094671, 1061614, 1030544, 1001305, 973755, 947645, 922760, 899054, 876407, 854468, 833014, 812296, 792730, 774377, 756969, 740337, 724476, 709276, 694469, 679885, 665606, 651962, 639438]
60858F39438j1003r536q598q205q021p831p572p054o225n567n607o039n931m934
60844E37315l657k748k282k230k772l773m581m821m816m850m521l395j912j000
60830D89957j006j461j699j420q02l72n58j165j574j625j836k474k970k693j904
60815D66398j348j201j029n99j31J83L77M27J70m01j020j324j074k96N56Q85N94
60798D61167J82L5o2l37m50o6M26L85j05n21r78k158l970n221n047m049l472l701
60780D32058m158m427m754n396o003n959n148m140l574l457l225k459j453q87
60766C77018r75j243j186r11q54j103j346j414j465j503j192m06L95O84N12K27
60750C65238j92q86j385r53K52J119R79L41j24n35j097j282n89L78N84K4n15q34
$$ y = [639438, 628435, 618899, 610301, 602096, 594075, 586244, 578672, 571618, 565393, 559826, 554219, 548180, 542249, 537315, 533658, 530910, 528628, 526398, 523626, 519853, 515272, 510451, 505635, 500785, 496264, 492869, 490957, 489957, 488951, 487490, 485791, 484371, 483569, 483197, 482639, 481474, 479900, 478275, 476439, 473965, 470995, 468302, 466398, 465050, 463849, 462820, 462221, 462090, 462273, 462650, 463077, 463247, 462846, 461826, 460502, 459428, 459132, 459688, 460573, 461167, 461349, 461384, 461322, 460985, 460535, 460469, 460895, 461280, 461175, 460654, 459676, 457518, 453548, 448327, 443280, 439231, 435759, 432058, 427900, 423473, 418719, 413323, 407320, 401361, 396213, 392073, 388499, 385042, 381817, 379358, 377905, 377018, 376043, 374800, 373614, 372703, 371849, 370746, 369400, 367986, 366521, 365018, 363826, 363420, 363815, 364499, 365011, 365238, 365046, 364160, 362775, 361822, 362074, 363193, 364172, 364513, 364389, 363854, 362757, 361475, 360886, 361264, 361848, 361872, 361357, 360523]
60732C60523j355j916j780r62m43p37j296j640k019k530k630k135j713j699j398
60717C36270l39O06M44m17q82r11j300k073k305j550m44K92O23Q16R20Q46N40
60700C31136K6m10k33O68J622J960J917K143K556K464J726J033R45J321J771K100
60684C52745K134J693Q62L4m20k86M02J070P49p86k292k301r58K03K25l53o65
60667C52056o33o45q92j446k288k944k627j164O71J945K263J605K05j196j748
60652C43162j514j447j999k464k162j528j385j786k276k731l150l073k048m98
60638C15101O42J011Q87M27l85j128j144m07M50J040J546J966J871J127L64K25
60622C23593O31J084J425J806K206K401K407K550L013L483L407K546J229N6o53
$$ y = [360523, 359168, 357252, 355472, 354510, 354067, 353330, 352034, 350394, 348375, 345845, 343215, 341080, 339367, 337668, 336270, 335931, 336537, 336981, 336564, 335682, 334771, 333471, 331398, 329093, 327543, 327099, 327391, 328014, 328830, 329750, 330596, 331136, 331162, 330752, 330519, 331187, 332809, 334769, 336686, 338829, 341385, 343849, 345575, 346608, 347553, 348874, 350645, 352745, 354879, 356572, 357434, 357468, 357048, 356762, 357164, 358234, 358983, 358197, 355905, 353604, 352646, 352849, 353074, 352721, 352056, 351423, 350778, 349886, 348440, 346152, 343208, 340581, 339417, 340088, 342033, 344296, 345901, 346106, 344910, 343162, 341648, 340201, 338202, 335738, 333576, 332048, 330663, 328877, 326601, 323870, 320720, 317647, 315599, 315101, 315743, 316754, 317641, 318068, 317683, 316555, 315411, 315004, 315454, 316494, 318040, 320006, 321877, 323004, 323368, 323593, 324224, 325308, 326733, 328539, 330745, 333146, 335553, 338103, 341116, 344599, 348006, 350552, 351781, 351837, 351184]
60607C51184j033j302j445j363j207j219j308j102m24M45J104J326J117P22O41
60592C46136J237K156K529J986J179R42J234J330R02L24m0l39q57j585k351l085
60576C51698l652l732l116k032r39j62J86K12L61J095K182K582J601p6j005o43
60560C44560J39K21n50j451j731j165o8R49J392J265R65Q44R96J354J703J693
60544C51116J194O02M31O19O98N77O70J154J690K051K398K785K912K682K448K382
60528C76409K179J713J367J333J157N62J11L82J014J272J131J115J383J792K530
60513C95450L852N312O095O051N759N614N593N740O190O664O677O187N444M322
60499D74950K588P64j67m0L27L69L56N44P10Q20J360K473L491L807L725L929M598
$$ y = [351184, 350151, 348849, 347404, 346041, 344834, 343615, 342307, 341205, 340781, 341226, 342330, 343656, 344773, 345495, 346136, 347373, 349529, 352058, 354044, 355223, 356165, 357399, 358729, 359631, 359955, 359915, 359576, 358719, 357134, 354783, 351698, 348046, 344314, 341198, 339166, 338227, 338065, 338251, 338463, 338824, 339919, 342101, 344683, 346284, 346208, 345203, 344560, 344699, 344920, 344370, 342919, 341188, 340023, 339955, 340904, 342296, 343561, 344526, 345370, 346366, 347720, 349423, 351116, 352310, 352912, 353343, 353962, 354660, 355237, 355907, 357061, 358751, 360802, 363200, 365985, 368897, 371579, 374027, 376409, 378588, 380301, 381668, 383001, 384158, 384720, 384831, 385213, 386227, 387499, 388630, 389745, 391128, 392920, 395450, 399302, 404614, 410709, 416760, 422519, 428133, 433726, 439466, 445656, 452320, 458997, 465184, 470628, 474950, 477538, 478302, 478135, 478095, 478422, 478791, 479147, 479691, 480401, 481221, 482581, 485054, 488545, 492352, 496077, 500006, 504604]
60482E04604N477O411P381Q387R606J1304J3238J4642J5111J5134J5327J5510
60470F42132J4917J3051J0049O509L157M25j879m110n971o763o586o533p233p894
60456F43271p422n920m382l257k093m80J333K770L489L685M069N400P728J0356
60442F58547J2826J5494J8748K2113K4733K6470K7874K9180K9924K9538K7943
60431I23390K5567K3101K1066J9280J6932J3572R841O728M279J522k453p688j3536
60418A041601j9135k3867k7739l1231l4456l6683l7190l6294l4909l3335l1205
60407F95557k8570k6067k3876k1407j8449j5890j4628j4271j3612j2179j0616
60396D95992r560q800p779o543n715n579n573m922l612k439k040k229k426k480
$$ y = [504604, 510081, 516492, 523873, 532260, 541866, 553170, 566408, 581050, 596161, 611295, 626622, 642132, 657049, 670100, 680149, 686658, 689815, 690240, 688361, 684251, 678280, 671517, 664931, 658398, 651165, 643271, 635849, 629929, 625547, 622290, 620197, 619717, 621050, 623820, 627309, 630994, 635063, 640463, 648191, 658547, 671373, 686867, 705615, 727728, 752461, 778931, 806805, 835985, 865909, 895447, 923390, 948957, 972058, 993124, 1012404, 1029336, 1042908, 1052749, 1059477, 1063756, 1065278, 1062825, 1055137, 1041601, 1022466, 998599, 970860, 939629, 905173, 868490, 831300, 795006, 760097, 726762, 695557, 666987, 640920, 617044, 595637, 577188, 561298, 546670, 532399, 518787, 506608, 495992, 486432, 477632, 469853, 463310, 457595, 452016, 446443, 441521, 437909, 435470, 433430, 431201, 428775, 426295]
60382D26295k647k964l050k629j874j150o87o21j033j698j993j398r4J057J339
60367D06853Q54L28K38L47J90k34n40n63m43r4Q40K216L094K727J595R09J160
60350D19477J664J621J130R40J453K236K473J848R47O72J226J888J987J761J893
60335D43216K407K665K404K170K453K931L006K748K740L067L100K479J826K000
60321D79212K841L226K564J632J542K182K392J626O72M78R42J369J596J916K217
60306E06407J994J335J077J708K670L161L215L452M026M422M388M541N612P339
60292E55347Q453P935O041L937K441J347m1j923l737m789m981m799m712m699m495
60277E51325m162m097m417m676m437l877l468l263k917k331j797j473j207j003
$$ y = [426295, 423648, 420684, 417634, 415005, 413131, 411981, 411294, 410673, 409640, 407942, 405949, 404551, 404457, 405514, 406853, 407707, 408035, 408273, 408620, 408810, 408576, 408036, 407473, 407030, 406936, 407776, 409992, 413086, 415813, 417408, 418317, 419477, 421141, 422762, 423892, 424832, 426285, 428521, 430994, 432842, 433789, 434461, 435687, 437575, 439562, 441323, 443216, 445623, 448288, 450692, 452862, 455315, 458246, 461252, 464000, 466740, 469807, 472907, 475386, 477212, 479212, 482053, 485279, 487843, 489475, 491017, 493199, 495591, 497217, 497889, 498367, 499309, 500678, 502274, 504190, 506407, 508401, 509736, 510813, 512521, 515191, 518352, 521567, 525019, 529045, 533467, 537855, 542396, 548008, 555347, 563800, 571735, 577776, 581713, 584154, 585501, 585460, 583537, 579800, 575011, 570030, 565231, 560519, 555820, 551325, 547163, 543066, 538649, 533973, 529536, 525659, 522191, 518928, 516011, 513680, 511883, 510410, 509203, 508200]
60263E08200j123j498j483n54J010K466L438M164N036O133P134P570P247O490
60249E54230N756N087M232L270K711K872L551M384N009M816L237O20j769l124
60235E94882l966n198o772p941q430q578q544q142p420o816o544o332n854n151
60221D99194m534m232m138l816k996k128k034k783l506l578l422l554l528k718
60207D52227j598j146j216p40L95R69K89o17l70R56K119K345J888J292P75L69
60191D57937J62K69P43J522K336K731K366J348K00n13n41o1N49J003J173R96N55
60174D72775K64N75J342J889J936K010K584L309L674L928M610N384N321M321L483
60159E17405L787N036O309P005P148P170P484Q048Q216P474O215N354N185N229
$$ y = [508200, 507077, 505579, 504096, 503542, 504552, 507018, 510456, 514620, 519656, 525789, 532923, 540493, 547740, 554230, 559986, 565073, 569305, 572575, 575286, 578158, 581709, 586093, 591102, 595918, 599155, 599775, 598006, 594882, 590916, 585718, 578946, 571005, 562575, 553997, 545453, 537311, 529891, 523075, 516531, 510199, 504345, 499194, 494660, 490428, 486290, 482474, 479478, 477350, 475316, 472533, 469027, 465449, 462027, 458473, 454945, 452227, 450629, 449483, 448267, 447527, 447922, 448891, 449180, 448563, 448193, 449149, 451268, 453613, 455501, 456793, 457568, 457937, 458099, 458368, 459111, 460633, 462969, 465700, 468066, 469414, 469614, 469101, 468560, 468499, 469048, 470051, 471224, 472220, 472775, 473039, 473614, 474956, 476845, 478781, 480791, 483375, 486684, 490358, 494286, 498896, 504280, 509601, 513922, 517405, 521192, 526228, 532537, 539542, 546690, 553860, 561344, 569392, 577608, 585082, 591297, 596651, 601836, 607065]
60145F07065N184N280N606N776N605N378N156M444L063J669R13N14k03j236j957
60130F52257j992j541j042r36j586k923m237m784m520l993l588l306l092k985
60116F11732k883k571k023j431r65p06q27j432k176k402j825r12l60l54n79p86
60100E89500j034j317j380j074o45l58r6K79L64l37j453j883j209k67k5l18l26
60083E78421K28R38J492J898K152K260K463K910L275L245L125L366L753L774L492
60068F16792L297K959K010R12P46J563K149J827J449J981L047L598L330K735K232
60053F50627J985K153K676L023K733K043J582J639K036K426K443J861R46L50L32
60038F78855M50K86O0J53M45N44L24j87j062k252l377m196m898n587n911n652
$$ y = [607065, 612249, 617529, 623135, 628911, 634516, 639894, 645050, 649494, 652557, 654226, 655139, 655653, 655450, 654214, 652257, 650265, 648724, 647682, 646746, 645160, 642237, 638000, 633216, 628696, 624703, 621115, 617809, 614717, 611732, 608849, 606278, 604255, 602824, 601859, 601153, 600326, 598894, 596718, 594316, 592491, 591579, 591219, 590865, 590286, 589500, 588466, 587149, 585769, 584695, 584050, 583692, 583596, 583875, 584239, 583902, 582449, 580566, 579357, 579090, 579065, 578747, 578421, 578649, 579587, 581079, 582977, 585129, 587389, 589852, 592762, 596037, 599282, 602407, 605773, 609526, 613300, 616792, 620089, 623048, 625058, 625970, 626716, 628279, 630428, 632255, 633704, 635685, 638732, 642330, 645660, 648395, 650627, 652612, 654765, 657441, 660464, 663197, 665240, 666822, 668461, 670497, 672923, 675366, 677227, 678173, 678523, 678855, 679305, 679591, 679651, 679804, 680249, 680793, 681117, 680930, 679868, 677616, 674239, 670043, 665145, 659558, 653647, 647995]
60022F47995n283n339n574n433n114n382o411p408p540o826n905n305n016m649
60008E66810l954l197k894l132l446l447l231k997k695k316k094k141k186j996
59994E27084j673j217l42Q69J677J593J188J335K025K593K818K967L007K583J847
59979E48354J470J711K021J804J067J72o52j384k121k979l868m356m169l737l851
59964E29482m705n645n899n271m120l039k539k726l165l360l271l197l226l142
59950D76177k810k267j545q27o76j521k861l510k911j698p11LP74J361J186M38
59934D58602J38P78J519J369P31R48K259L219K624J261Q37J726K774L105K895
59919D84785K296R22j047k374k211j322j012j407j749j803j946k107j657m66P55
$$ y = [647995, 642712, 637373, 631799, 626366, 621252, 615870, 609459, 602051, 594511, 587685, 581780, 576475, 571459, 566810, 562856, 559659, 556765, 553633, 550187, 546740, 543509, 540512, 537817, 535501, 533407, 531266, 529080, 527084, 525411, 524194, 523852, 524721, 526398, 527991, 529179, 530514, 532539, 535132, 537950, 540917, 543924, 546507, 548354, 549824, 551535, 553556, 555360, 556427, 556599, 555947, 554563, 552442, 549463, 545595, 541239, 537070, 533333, 529482, 524777, 519132, 513233, 507962, 503842, 500803, 498264, 495538, 492373, 489013, 485742, 482545, 479319, 476177, 473367, 471100, 469555, 468728, 468052, 466531, 463670, 460160, 457249, 455551, 454840, 454843, 455617, 456978, 458164, 458602, 458740, 459518, 461037, 462406, 463137, 464085, 466344, 469563, 472187, 473448, 474285, 476011, 478785, 481890, 484785, 487081, 488003, 486956, 484582, 482371, 481049, 480037, 478630, 476881, 475078, 473132, 471025, 469368, 468902, 469657]
59904D69657J326J263R55P31P65J009J139R21N40K72N2k75m65j85L66O94P61R27
59886D80453J298J629J794J855J724J331R74J011J257J261J090J186J635K212
59872E00710L012M233N313N216L785K010P44j66j069j710j731j429j318j282p14
59857E15604N63K008K885K917K482K243K547L073L274L073K809K592K192J519
59843E49781P54j02j254k491l074k582j512p09m32k59K79J212K092K346J851J243
59827E47143J387K424L586M052L714L100K796L083L741M169L939L292K808K614
59813E91848K342J802J224P15J10m97o69l84l07q52j459j364o40Q5O39J352K115
59796E96060K260J580Q85J085K049K893L284L838N018O099N844M053J934Q24R93
$$ y = [469657, 470983, 472246, 473201, 473932, 474697, 475706, 476845, 477766, 478306, 478578, 478630, 478355, 477890, 477705, 478071, 478765, 479526, 480453, 481751, 483380, 485174, 487029, 488753, 490084, 491058, 492069, 493326, 494587, 495677, 496863, 498498, 500710, 503722, 507955, 513268, 518484, 522269, 524279, 525023, 524857, 523788, 522078, 520347, 518918, 517600, 516318, 515604, 516167, 518175, 521060, 523977, 526459, 528702, 531249, 534322, 537596, 540669, 543478, 546070, 548262, 549781, 550535, 550433, 549179, 546688, 543614, 541032, 539520, 538811, 538379, 538120, 538399, 539611, 541703, 544049, 545900, 547143, 548530, 550954, 554540, 558592, 562306, 565406, 568202, 571285, 575026, 579195, 583134, 586426, 589234, 591848, 594190, 595992, 597216, 597931, 598041, 597544, 596875, 596491, 596184, 595332, 593873, 592509, 591869, 591954, 592593, 593945, 596060, 598320, 599900, 600785, 601870, 603919, 606812, 610096, 613934, 618952, 625051, 630895, 634948, 636882, 637706, 638699]
59781F38699J852K785L409L495L135K703K311J595M80l31l01l4m81j501k152k256
59765F53408k539l106l085k159j412j808k724k794j725m45J44j83j230k539l387
59750F24416l345k825k599k814k963k757k463k281j945j160j75L65L0j073k417
59735E95994l387l549k877j784r01o37q08q23l71J83K54k24p32p93m03J00L87
59718E79629L28J33J99O05Q90O19Q2O6R90K538M025M685L960K161P35R84K446
59701F05075L364K954K342K832M142N081N275N323N584N733N482N044M699M404
59687F67334M018L581L223K926K541K008J572J617K152K555K172J195N27P46J555
59672F99722K384K964L215L047K658K501K613K411J532N27J51L88O53O80O08M51
$$ y = [638699, 640551, 643336, 646745, 650240, 653375, 656078, 658389, 659984, 660464, 660133, 659832, 659798, 659317, 657816, 655664, 653408, 650869, 647763, 644678, 642519, 641107, 639299, 636575, 633781, 632056, 631611, 631755, 631572, 630342, 627803, 624416, 621071, 618246, 615647, 612833, 609870, 607113, 604650, 602369, 600424, 599264, 599089, 599454, 599484, 598411, 595994, 592607, 589058, 586181, 584397, 583496, 582859, 582051, 581228, 580857, 581040, 581294, 581070, 580338, 579545, 579142, 579242, 579629, 579957, 580090, 580289, 580894, 581784, 582403, 582485, 582551, 583541, 586079, 590104, 594789, 598749, 600910, 601645, 602629, 605075, 608439, 611393, 613735, 616567, 620709, 625790, 631065, 636388, 641972, 647705, 653187, 658231, 662930, 667334, 671352, 674933, 678156, 681082, 683623, 685631, 687203, 688820, 690972, 693527, 695699, 696894, 697421, 698167, 699722, 702106, 705070, 708285, 711332, 713990, 716491, 719104, 721515, 723047, 723574, 723725, 724113, 724766, 725446, 726054, 726505]
59656G26505J33m9L74J294K041K237K227K468K887L125L107L144L532M279N126
59641G62430N773O083O150O211O433O733O802O346N410M414L773L481L181K588
59627H35808J763R88M98K89O0m97j245j721j844k138k917l657l799l735m229n056
59611H08568n261m746m484m827m736l321j290L1M38P42J348J878K079K238K617
59596G91274L110L498L665L506K946K067R45n17k335m181n722p072q498r880j0776
59581G62030j1016j0893j0808j0941j1186j1198j0608r458q265p563p412p497
59569F45185p460p074o379n838o013o880p775q216q333q304p913p056o243n980
59555E45721n993n598m604l357k119r51o4K95K26M5j07j56K08J129K034K035J001
$$ y = [726505, 726638, 726589, 726963, 728257, 730298, 732535, 734762, 737230, 740117, 743242, 746349, 749493, 753025, 757304, 762430, 768203, 774286, 780436, 786647, 793080, 799813, 806615, 812961, 818371, 822785, 826558, 830039, 833220, 835808, 837571, 838559, 839057, 839346, 839406, 838909, 837664, 835943, 834099, 831961, 829044, 825387, 821588, 817853, 813624, 808568, 803307, 798561, 794077, 789250, 784514, 781193, 779903, 779934, 780372, 781114, 782462, 784340, 786419, 788657, 791274, 794384, 797882, 801547, 805053, 807999, 810066, 811011, 810494, 808159, 803978, 798256, 791184, 782686, 772806, 762030, 751014, 740121, 729313, 718372, 707186, 695988, 685380, 675922, 667657, 660094, 652682, 645185, 637725, 630651, 624272, 618434, 612421, 605541, 597766, 589550, 581217, 572913, 565000, 557944, 551701, 545721, 539728, 534130, 529526, 526169, 524050, 523099, 523035, 523330, 523556, 523601, 523494, 523338, 523546, 524675, 526709, 528744, 529745]
59538E29745k67r24q17l05K02M54M87O31J091J497J168m4j452k124j677m99N96
59521E27762R29L23q44k005k757k952k658k100j498r06l65r2k57n94o30l94l66
59504E10596o50p14j98N10Q37O82K49k25l08M75J844K661K233J291J125K103L550
59487E26061M706N241N294N480O503Q157R310R460R689J1041J2589J2298R592
59474F35421N866K532j30k086k855k335j378q65q11q23r29j355j956k310k199
59459F23787j723j251j408k661m618o089o195n230m239l995m479n099n158m425
59445E67217l398k879l115l568l550k965k279j932j851j528n82O97J578J773J741
59430E45359J958K233K154J928K168L006L926M412M356L861L148K551K255K035
$$ y = [529745, 529478, 528554, 527737, 527432, 527634, 528088, 528575, 529206, 530297, 531794, 532962, 532918, 531466, 529342, 527665, 527166, 527762, 528691, 529014, 528170, 526165, 523408, 520456, 517798, 515698, 514200, 513294, 512929, 512837, 512580, 511986, 511356, 510962, 510596, 509946, 509232, 509034, 509544, 510381, 511063, 511312, 511087, 510779, 511254, 513098, 515759, 517992, 519283, 520408, 522511, 526061, 530767, 536008, 541302, 546782, 553285, 561442, 570752, 580212, 589901, 600942, 613531, 625829, 635421, 641287, 643819, 643689, 641603, 638748, 636413, 635035, 634170, 633359, 632536, 631607, 630252, 628296, 625986, 623787, 622064, 620813, 619405, 616744, 612126, 606037, 599842, 594612, 590373, 586378, 581899, 576800, 571642, 567217, 563819, 560940, 557825, 554257, 550707, 547742, 545463, 543531, 541680, 540152, 539570, 540267, 541845, 543618, 545359, 547317, 549550, 551704, 553632, 555800, 558806, 562732, 567144, 571500, 575361, 578509, 581060, 583315, 585350]
59416E85350J667J406J592J929J770J105O22P52J192J483J566J583J610J732K033
59401F07392K360K450K368K497K999L604M027M312M646N078N434N444M972M184
59387F61767L371K528J535P57Q08J419J343M7j257j153j1O58L92R2L58Q88J509
59370F75051K533L815M631M841N141N812O332O587P334Q847J0256J0948J1606
59357G63734J2960J4445J5199J5597J6486J7224J5938J1834O252J147k629n227
59345H82960o758p040o184m756l243j690k17L41j160m835r292j2847j4988j6165
59331G94126j6550j5781j3937j1822j0069q499o707m743k942j527n65J9N13J107
59317G02623J506J404J261J912L221M011L609K725K357K512K589K450K441K640
$$ y = [585350, 587017, 588423, 590015, 591944, 593714, 594819, 595441, 596193, 597385, 598868, 600434, 602017, 603627, 605359, 607392, 609752, 612202, 614570, 617067, 620066, 623670, 627697, 632009, 636655, 641733, 647167, 652611, 657583, 661767, 665138, 667666, 669201, 669958, 670766, 672185, 673528, 673575, 672318, 671165, 671154, 671812, 672204, 672296, 672654, 673542, 675051, 677584, 681399, 686030, 690871, 696012, 701824, 708156, 714743, 722077, 730924, 741180, 752128, 763734, 776694, 791139, 806338, 821935, 838421, 855645, 871583, 883417, 889669, 890816, 888187, 882960, 876202, 869162, 862978, 858222, 854979, 853289, 853072, 853413, 852253, 847418, 838126, 825279, 810291, 794126, 777576, 761795, 747858, 736036, 725967, 717468, 710761, 706018, 703076, 701549, 700984, 701003, 701516, 702623, 704129, 705533, 706794, 708706, 711927, 715938, 719547, 722272, 724629, 727141, 729730, 732180, 734621, 737261]
59303G37261K760K591K238J982K184K981L955M451M388M373M854N686O659P826
59289G94189Q969R430Q934Q083P575P379P100O627N982N012L739K563J562J31
59275H77275k136m613o325p172p797q557r261r756j0102j0247j0047r606r202
59262G72454q914q627q330q047p676p173o743o563o519o448o375o253n759m712
59248F74315l378k100r28M1M57L66O29K132M637O943Q027P621N896L209J37k637
59232G05367m641n668n705n029m137l335k537j651q35j77N77J670K972M304N693
59217F86868P042P916Q159Q363R166J0342J1041J0821R997R106Q457Q058P664
59204H03000O996O097N261M404K971P63j591l391m679n809o701p127p376p942
$$ y = [737261, 740021, 742612, 744850, 746832, 749016, 751997, 755952, 760403, 764791, 769164, 774018, 779704, 786363, 794189, 803158, 812588, 821522, 829605, 837180, 844559, 851659, 858286, 864268, 869280, 873019, 875582, 877144, 877275, 875139, 870526, 864201, 857029, 849232, 840675, 831414, 821658, 811556, 801309, 791262, 781656, 772454, 763540, 754913, 746583, 738536, 730860, 723687, 716944, 710381, 703862, 697414, 691039, 684786, 679027, 674315, 670937, 668837, 667909, 667950, 668407, 668773, 669402, 671534, 676171, 683114, 691141, 698762, 704658, 707867, 708004, 705367, 700726, 695058, 689353, 684324, 680187, 676852, 674315, 672664, 671829, 671652, 672229, 673899, 676871, 681175, 686868, 693910, 701826, 709985, 718348, 727514, 737856, 748897, 759718, 769715, 778821, 787278, 795336, 803000, 809996, 816093, 821354, 825758, 828729, 829492, 827901, 824510, 819831, 814022, 807321, 800194, 792818, 784876]
59190G84876q754r317r404r068q233o957n811n343n243m787l958l399l315l213
59176F98074k835k513k422k146j456r57j477l002m605n288m829l835l099k877
59162F56733k822k628k430k460k604k666k758l014l201l046k784k783k856k475
59148F18206j680j106j088j310j497j868k587l188k964j821n10J1n60j511j725
59133E94802p91N62J306J202Q01O14O95R26J243J499J528J391J264J056N17k19
59117F08396o08l88K2Kn90j364j902k052j851j352o15K00P69P73J62p64j497j668
59099E95673j262p29p17j496k557l092k819k184j747j684j923k363k818l083l239
59084E63960l612m262m852n109n066m746m043l130k524k409k331j816r36L1R88
$$ y = [784876, 776122, 766805, 757401, 748333, 740100, 733143, 727332, 721989, 716746, 711959, 708001, 704602, 701287, 698074, 695239, 692726, 690304, 688158, 686702, 685745, 684268, 681266, 676661, 671373, 666544, 662709, 659610, 656733, 653911, 651283, 648853, 646393, 643789, 641123, 638365, 635351, 632150, 629104, 626320, 623537, 620681, 618206, 616526, 615420, 614332, 613022, 611525, 609657, 607070, 603882, 600918, 599097, 598587, 598598, 598038, 596527, 594802, 594011, 594573, 595879, 597081, 597882, 598496, 599191, 600117, 601360, 602859, 604387, 605778, 607042, 608098, 608615, 608396, 607788, 607400, 607422, 607424, 606834, 605470, 603568, 601516, 599665, 598313, 597698, 597898, 598667, 599440, 599602, 598838, 597341, 595673, 594411, 593682, 592965, 591469, 588912, 585820, 583001, 580817, 579070, 577386, 575463, 573100, 570282, 567199, 563960, 560348, 556086, 551234, 546125, 541059, 536313, 532270, 529140, 526616, 524207, 521876, 520060, 519124, 519155, 520143]
59069E20143J742J886J478J443K633M692O382O939O681O416O641P294P909Q057
59055E90336P806P663P916Q244Q167P558O567N377M201L204K258J143J29k35m8
59040F60286j72j040k037k515k734l155l437k937j823r62q45j240j687j846j618
59025F32238j344j587k366l006l108l096l333l430l021k624k862l422l668l679
59011E91692l780l517k296p49k12r74j997k426k392k334k410k678l054l072k413
58996E57388j605j390j596j456r49p97j086j009k20N40N59O9l33m96n58n73o49
58979E45839r68j373j376p79R9Q88J459J765J816J909K421L281M042M471M663
58964E68157M697M645M799N343N948O113N804N231M341L070J853J119O50R4k10
$$ y = [520143, 521885, 523771, 525249, 526692, 529325, 534017, 540399, 547338, 554019, 560435, 567076, 574370, 582279, 590336, 598142, 605805, 613721, 621965, 630132, 637690, 644257, 649634, 653835, 657039, 659297, 660440, 660569, 660334, 660286, 660114, 659074, 657037, 654522, 651788, 648633, 645196, 642259, 640436, 639474, 638629, 637389, 635702, 633856, 632238, 630894, 629307, 626941, 623935, 620827, 617731, 614398, 610968, 607947, 605323, 602461, 599039, 595371, 591692, 587912, 584395, 582099, 581350, 581138, 580164, 578167, 575741, 573349, 571015, 568605, 565927, 562873, 559801, 557388, 555783, 554393, 552797, 551341, 550392, 549595, 548509, 547500, 547280, 547820, 548379, 548448, 548115, 547619, 547061, 546488, 545839, 544871, 543498, 542122, 541343, 541442, 542330, 543789, 545554, 547370, 549279, 551700, 554981, 559023, 563494, 568157, 572854, 577499, 582298, 587641, 593589, 599702, 605506, 610737, 615078, 618148, 620001, 621120, 621770, 621864, 621654]
58949F21654J32N09L7q42p82M53J645J971J959K250K626K792L018L391L331K577
58933F46721J868J909K308K240J665J170R48P07L85M13J223K777M597O067O822
58918F81820O951O839O885P413Q542R908J0834J1111J1140J0999J0020P977O019
58905G96458N376N604N200L766K303J455P04n22k072l697n429p100q296r056r786
58890G74908j0401j0443j0060r914j0012r688q850q109p512o362m598l186k683
58877F73090k570k436k527k681k005l87Q46O71j54k73M61J213J458J199M96m32
58861F65969j050j084q09m65mL84L84M47J512L391M654M717M764N755O798O711
58845G02074O047O191P279Q398R232J0090J0768J0770J0429J0497J0805J0512
$$ y = [621654, 621786, 622295, 622332, 621490, 620708, 621161, 622806, 624777, 626736, 628986, 631612, 634404, 637422, 640813, 644144, 646721, 648589, 650498, 652806, 655046, 656711, 657881, 658829, 659536, 659921, 660334, 661557, 664334, 668931, 674998, 681820, 688771, 695610, 702495, 709908, 718450, 728358, 739192, 750303, 761443, 772442, 782462, 790439, 796458, 801834, 807438, 812638, 816404, 818707, 820162, 820866, 820344, 818272, 814575, 809146, 802046, 793750, 784694, 774908, 764507, 754064, 744004, 734090, 724078, 714390, 705540, 697431, 689919, 683557, 678959, 675773, 673090, 670520, 668084, 665557, 662876, 660871, 660484, 661330, 662001, 661847, 661574, 662035, 663248, 664706, 665905, 666401, 665969, 664919, 663835, 663026, 662561, 662557, 662941, 663325, 663772, 665284, 668675, 673329, 678046, 682810, 688565, 695363, 702074, 708121, 714312, 721591, 729989, 739221, 749311, 760079, 770849, 781278, 791775, 802580, 813092]
58833H13092R641R181R654J0537J1228J1646J1788J1530J1058J0737J0443R628
58821I40163Q206O756N657M607L183J479k1r37j217j202j473k359l504m167m017
58806I51154l486l351m051n424o974q311r291r837r952j0020j0634j1768j2532
58793H45523j2335j1790j1770j1945j1333j0036r197r244r377r088q914r216r428
58780G11850r148q892r008q841p782o343n318m601l689k779k375k274j815q90
58766F38095j2M41N91Q19J438K315K743K160J129Q63J629K466K602K218J621P52
58750F61870j27m47n38j443l007l630k759k106l107m657m922m185m087m855n206
58735F16794m568l580k676j690q96q93j350j216k31Q43J576K338L292M133M878
$$ y = [813092, 822733, 831914, 841568, 852105, 863333, 874979, 886767, 898297, 909355, 920092, 930535, 940163, 948369, 955125, 960782, 965389, 968572, 970051, 970030, 969093, 967876, 966674, 965201, 962842, 959338, 955171, 951154, 947668, 944317, 940266, 934842, 927868, 919557, 910266, 900429, 890477, 880457, 869823, 858055, 845523, 833188, 821398, 809628, 797683, 786350, 776314, 767117, 757873, 748496, 739408, 730494, 721278, 711850, 702702, 693810, 684802, 675961, 668179, 661836, 656518, 651917, 648228, 645449, 643074, 640800, 638985, 638095, 638083, 638524, 639115, 639934, 641372, 643687, 646430, 648590, 649719, 650582, 652211, 654677, 657279, 659497, 661118, 661870, 661743, 661296, 660758, 659315, 656308, 652678, 649919, 647813, 644706, 640049, 635127, 630942, 626855, 622000, 616794, 612226, 608646, 605970, 604280, 603384, 602491, 601141, 599925, 599694, 600537, 602113, 604451, 607743, 611876, 616754]
58720F16754N880O833O808N635M334L761L542K788J323k83j490k304l156m382
58706F46043n738o520o335n571m888m547m461m584m832m907m519l647k418j021
58692E82055R2M40J02l64o28o87k96Q32K112K458J877J657K509L607M030M021
58676F03817M126M183M017M113M649M859M264L549L285K910J986J396J965K912
58662F52031L056K667K686K955K782K575L267M513N076M629L813K776J116r16
58648F93026k515l565m623n897p279q996j1059j2476j2297j1154j0505j0689j0956
58635E81015j0964j0899j0406q933p029n956n963o155n966n579n076m324l645
58622D90120l408l176k330j319j096j529j592r28o0P65J686K434K625K717L459
$$ y = [616754, 622634, 629467, 636275, 641910, 646244, 650005, 653547, 656335, 657658, 657375, 655885, 653581, 650425, 646043, 640305, 633785, 627450, 621879, 616991, 612444, 607983, 603399, 598567, 593660, 589141, 585494, 583076, 582055, 582147, 582587, 582689, 582325, 581697, 581010, 580714, 581546, 583658, 586116, 587993, 589650, 592159, 595766, 599796, 603817, 607943, 612126, 616143, 620256, 624905, 629764, 634028, 637577, 640862, 643772, 645758, 647154, 649119, 652031, 655087, 657754, 660440, 663395, 666177, 668752, 672019, 676532, 681608, 686237, 690050, 692826, 693942, 693026, 690511, 686946, 682323, 676426, 669147, 660151, 649092, 636616, 624319, 613165, 602660, 591971, 581015, 570051, 559152, 548746, 539813, 532784, 526828, 520865, 514710, 508744, 503165, 498089, 493765, 490120, 486712, 483536, 481206, 479887, 478791, 477262, 475670, 474742, 474682, 475447, 477133, 479567, 482192, 484909, 488368]
58607D88368M613N352N591N798N879N466M849M296L050M75k316l699l929m510
58593E19283n553n727m725l738l408l184k916l212l897l881k928j966j338m38
58579D72372O42Q37j4p11o02m87j067j890k380k579k434j703r58j263k427k946
58563D52390k159j044n05k31J88M27K92K48N60J009J719L046M400M602L796L522
58547D72260M449N477N589N187M950M734M234L586K774J542L56K08J054J737J864
58532E20001K412L940N499O047N790N512N627O274P381Q289Q327P937Q118Q727
58518F09881Q704P989P611P785P619P019P083Q126R105R514J0191J1620J3098
58505G25345J4227J5517J6927J7468J7006J6677J6789J6044J3720J0810Q165N257
$$ y = [488368, 492981, 498333, 503924, 509722, 515601, 521067, 525916, 530212, 533262, 533737, 531421, 527722, 523793, 519283, 513730, 508003, 503278, 499540, 496132, 492948, 490032, 486820, 482923, 479042, 476114, 474148, 472810, 472372, 473014, 473851, 473837, 473126, 472524, 472037, 470970, 469080, 466700, 464121, 461687, 459984, 459026, 457763, 455336, 452390, 450231, 449187, 448682, 448451, 448639, 449066, 449358, 449606, 450166, 451175, 452894, 455940, 460340, 464942, 468738, 472260, 476709, 482186, 487775, 492962, 497912, 502646, 506880, 510466, 513240, 514782, 515138, 515346, 516400, 518137, 520001, 522413, 526353, 531852, 537899, 543689, 549201, 554828, 561102, 568483, 576772, 585099, 593036, 601154, 609881, 618585, 626574, 634185, 641970, 649589, 656608, 663691, 671817, 680922, 690436, 700627, 712247, 725345, 739572, 755089, 772016, 789484, 806490, 823167, 839956, 856000, 869720, 880530, 888695, 893952]
58493H93952J843r57k467l630n179o155n640m550m340n134o400q170j0366j2053
58479H20754j2708j3198j4370j5722j6448j6702j6745j6032j4274j2374j1174
58468F61007j0271r044p839p151o654n982n499n389n091m451m253m718m751l620
58454E76294k207j596j601j602j607j485n08J218K156J374M4k90J63K49k59p16
58438E69627o87K4J510L095L610L058K861L653M331M161M277N829Q016R398R974
58423F32737J0548J1053J0912J0303R899R942J0342J0895J0865R355O690M213
58411G47754K317J59k242l508l251k964l529l844l078k304k416k334r00J142K729
58396G23731M304O365P787P466O259N481M701K864L65j663l133m496n563o206
$$ y = [893952, 895795, 894838, 892371, 888741, 883562, 877407, 871767, 867217, 862877, 857743, 851343, 843173, 832807, 820754, 808046, 794848, 780478, 764756, 748308, 731606, 714861, 698829, 684555, 672181, 661007, 650736, 641692, 633853, 626702, 620048, 614066, 608567, 603178, 598087, 593636, 589383, 584665, 579914, 576294, 574087, 572491, 570890, 569288, 567681, 566196, 565688, 566906, 569062, 570436, 570480, 570190, 570353, 570602, 570343, 569627, 568940, 568964, 570474, 573569, 577179, 580237, 583098, 586751, 591082, 595243, 599520, 605349, 613365, 622763, 632737, 643285, 654338, 665250, 675553, 685452, 695394, 705736, 716631, 727496, 736851, 743541, 747754, 750071, 750230, 747988, 744480, 741229, 738265, 734736, 730892, 727814, 725510, 723094, 720760, 719860, 721002, 723731, 728035, 734400, 742187, 749653, 755912, 761393, 766094, 768958, 769323, 767660, 764527, 760031, 754468, 748262]
58382G48262p022p999p852o162m616m604n056m294k615j329n84J03M77L93Q12
58367F97914K273L701M183M431M982M683K742O05j81l97j417k711l179l412m293
58352G09924m821l717j973j478k179k818l261l884l840k348n53N8J04R42K057
58337F82213K184J872K499L575L519K381J494J142P18N61J416K733L404L593M028
58322G17332M390M171M098M877N571N126M381M655N475N631N342N484N831N924
58308G88288O368P471Q062P507P250Q425R693R574Q973R146R107P642N955N594
58294H99055N602M529L409L807M637M051K831K844L656L804L899N341P253P885
58280I62603P746Q473R836J0748J1637J3109J3986J3511J3423J4829J5439J3247
$$ y = [748262, 741240, 733241, 725389, 719227, 714611, 710007, 704951, 700657, 698042, 696713, 696129, 696232, 696709, 697102, 697914, 700187, 703888, 708071, 712502, 717484, 722167, 724909, 725514, 725333, 724936, 723519, 720808, 717629, 714217, 709924, 705103, 701386, 699413, 697935, 695756, 692938, 689677, 685793, 681953, 679605, 679052, 679110, 679214, 680156, 682213, 684397, 686269, 688768, 692343, 695862, 698243, 699737, 700879, 701597, 702158, 703574, 706307, 709711, 713304, 717332, 721722, 725893, 729991, 734868, 740439, 745565, 749946, 754601, 760076, 765707, 771049, 776533, 782364, 788288, 794656, 802127, 810189, 817696, 824946, 833371, 843064, 852638, 861611, 870757, 879864, 887506, 893461, 899055, 904657, 909186, 912595, 916402, 921039, 925090, 927921, 930765, 934421, 938225, 942124, 947465, 954718, 962603, 970349, 978822, 988658, 999406, 1011043, 1024152, 1038138, 1051649, 1065072, 1079901, 1095340, 1108587]
58268A108587J0479R997J0304Q409N394M452N258N129M310N172P325Q278Q062
58255A201156Q793J0421J1202J1418J2507J3700J3629J3821J6255J9004J8996
58244A350902J7493J7922J9818K0128J9129J9587K1173K1188K0018K0391K1975
58233A569724K2157K1382K2334K4496K5087K4675K6312K9684L1652L2039L3266
58222A862808L5071L5220L4734L6642M0157M2020M2685M5169M8748N0188N0385
58211B323827N3156N8147O1645O3744O7771P3288P6867P9278Q4484R1889R7095
58200C131191J00028J04690J11071J15229J17330J21600J28202J33250J36851
58191D199442J42964J51293J57752J62922J71347J82484J91496J98893K09969
$$ y = [1108587, 1119066, 1129063, 1139367, 1147776, 1153170, 1157622, 1162880, 1168009, 1172319, 1177491, 1184816, 1193094, 1201156, 1209949, 1220370, 1231572, 1242990, 1255497, 1269197, 1282826, 1296647, 1312902, 1331906, 1350902, 1368395, 1386317, 1406135, 1426263, 1445392, 1464979, 1486152, 1507340, 1527358, 1547749, 1569724, 1591881, 1613263, 1635597, 1660093, 1685180, 1709855, 1736167, 1765851, 1797503, 1829542, 1862808, 1897879, 1933099, 1967833, 2004475, 2044632, 2086652, 2129337, 2174506, 2223254, 2273442, 2323827, 2376983, 2435130, 2496775, 2560519, 2628290, 2701578, 2778445, 2857723, 2942207, 3034096, 3131191, 3231219, 3335909, 3446980, 3562209, 3679539, 3801139, 3929341, 4062591, 4199442, 4342406, 4493699, 4651451, 4814373, 4985720, 5168204, 5359700, 5558593, 5768562]
58182E768562K24532K37160K47911K62569K81738L00204L17819L40071L66921
58173H347487L92015M14124M38383M65350M90347N14504N44337N79637O14148
58164A2800332O48861O91267P40830P89521Q37655Q94223R60518J029268J101079
58155B0493554J184616J279151J375042J473374J586118J715134J851676J998783
58147C2957448K171912K375329K602607K864079L187780L589129M065936M624336
58139E8438556N277615O019265O837600P761941Q850695J0127994J1579086J3204701
58131A28097453J5009800J6938482J8913881K0923401K2837995K3988213K3116818
58124B69826043J9143856J2166395L620206m619960j1282725j5992845j8908427
$$ y = [5768562, 5993094, 6230254, 6478165, 6740734, 7022472, 7322676, 7640495, 7980566, 8347487, 8739502, 9153626, 9592009, 10057359, 10547706, 11062210, 11606547, 12186184, 12800332, 13449193, 14140460, 14881290, 15670811, 16508466, 17402689, 18363207, 19392475, 20493554, 21678170, 22957321, 24332363, 25805737, 27391855, 29106989, 30958665, 32957448, 35129360, 37504689, 40107296, 42971375, 46159155, 49748284, 53814220, 58438556, 63716171, 69735436, 76573036, 84334977, 93185672, 103313666, 114892752, 128097453, 143107253, 160045735, 178959616, 199883017, 222721012, 246709225, 269826043, 288969899, 301136294, 304756500, 300136540, 288853815, 272860970, 253952543]
58117B53952543k0346794k0668812k0232779j9306369j8047466j6579108j5025446
58110A23745769j3469540j1941570j0472798r120154p925114o888280n998273
58103E7930040n251763m633288m107956l649900l255412k919512k623812k356703
58095B9131694k123162j924853j749760j589412j447849j325856j213539j105853
58087A6651410j009608r28245q54394p83648p21398o70016o22729n76031n35498
58078I949843n03857m75204m45939m19883l98012l74627l48264l25308l08326
58069F350423k91501k71926k54748k42704k30885k16471k03788j95055j85673
58060D257672j73426j63212j57844j52791j44734j37092j32508j27736j20512
$$ y = [253952543, 233605749, 212936937, 192704158, 173397789, 155350323, 138771215, 123745769, 110276229, 98334659, 87861861, 78741707, 70816593, 63928313, 57930040, 52678277, 48044989, 43937033, 40287133, 37031721, 34112209, 31488397, 29131694, 27008532, 25083679, 23333919, 21744507, 20296658, 18970802, 17757263, 16651410, 15641802, 14713557, 13859163, 13075515, 12354117, 11684101, 11061372, 10485341, 9949843, 9445986, 8970782, 8524843, 8104960, 7706948, 7332321, 6984057, 6658749, 6350423, 6058922, 5786996, 5532248, 5289544, 5058659, 4842188, 4638400, 4443345, 4257672, 4084246, 3921034, 3763190, 3610399, 3465665, 3328573, 3196065, 3068329, 2947817]
58051B947817j14082j10515j06621j00512r5420r3153r0529q5825q2067q0494
58041A988599p7604p2068o7764o6349o3682n7335n1079m8004m5634m1789l9059
58030A358232l9252l9182l6168l2415l0192k7905k4546k2748k3681k4043k1698
58019A036402j9460j9773k0552j9723j9081k0099k0553j8765j6840j6435j5689
58008H29432j3368j1673j1924j1889j0278r347j0146r963p558o130p806r845r754
57995F99751r510j1028j2036j0377q245q175q714p900p257q424r461q352o871
57982E83401p186p976p496p166q370q971o893m187l703m472m102l077l035l292
57968E03475k657k369l822n578n877n778o742p470o327m598m134m051k875j769
$$ y = [2947817, 2833735, 2723220, 2616599, 2516087, 2420667, 2327514, 2236985, 2151160, 2069093, 1988599, 1910995, 1838927, 1771163, 1704814, 1641132, 1583797, 1532718, 1484714, 1439080, 1397291, 1358232, 1318980, 1279798, 1243630, 1211215, 1181023, 1153118, 1128572, 1105824, 1082143, 1058100, 1036402, 1016942, 997169, 976617, 956894, 937813, 917714, 897161, 878396, 861556, 845121, 829432, 816064, 804391, 792467, 780578, 770300, 760953, 750807, 740844, 733286, 727156, 719350, 709505, 699751, 690241, 679213, 667177, 656800, 648555, 640380, 631666, 623766, 616509, 608085, 598624, 590272, 583401, 576215, 568239, 560743, 553577, 545207, 536236, 529343, 525156, 521453, 516981, 512879, 509802, 506767, 503475, 500818, 498449, 494627, 489049, 483172, 477394, 470652, 463182, 456855, 452257, 448123, 444072, 441197, 439428]
57954D39428k460l936m278l843l810l621k618k156l236m161l258j777j432j365
57940C97477m03J29j097k346j501K10M52j99J85J116P98l66o96l85p60j480j333
57923C89801p78j028j643j473r58j155j698j815k115l191l905l203k086j703j172
57908C61878M18J639Q70q35j517j396j732k177j833j437k005k601k008j201j708
57893C44355k861l092k650k553k282r98K37P3n48Q4J492K073J960K375L199L563
57877C44427L784M508N007M528M061M595M949L645J527J79q35k653m508n077n122
57862C63015o091p255p013n938n769o320o068m962m022l130j770r55j744k775
57848B99203k036j59P40N95R05J520R22p65j896k057k207k410j990j412j542j624
$$ y = [439428, 436968, 433032, 428754, 424911, 421101, 417480, 414862, 412706, 409470, 405309, 402051, 400274, 398842, 397477, 397074, 397203, 396106, 393760, 392259, 392469, 392921, 392722, 392907, 394023, 394821, 394455, 393759, 393374, 392614, 391134, 389801, 389023, 387995, 386352, 384879, 383921, 382766, 381068, 379253, 377138, 373947, 370042, 366839, 364753, 363050, 361878, 362296, 363935, 364805, 363970, 362453, 361057, 359325, 357148, 355315, 353878, 351873, 349272, 347264, 346063, 344355, 341494, 338402, 335752, 333199, 330917, 329919, 330156, 330229, 329681, 329765, 331257, 333330, 335290, 337665, 340864, 344427, 348211, 352719, 357726, 362254, 366315, 370910, 375859, 379504, 381031, 381210, 380375, 377722, 373214, 368137, 363015, 356924, 349669, 342656, 336718, 330949, 324629, 318561, 313599, 309577, 306447, 304677, 303722, 301978, 299203, 297167, 297008, 297748, 298343, 299248, 300768, 301690, 300925, 299029, 296972, 294765, 292355, 290365, 288953, 287411, 285787]
57832B85787m49J053J027q4k83N83R33N39O65J314J141J22l35O3K38JJ94O57M62
57813B93628N0O56J785J735O27L71J534K715L167L677M535M929M696M583M602
57798C33290M159L805M735O415O933N851M572L814K860J550P98P89O12k4n75j175
57782C78409k434l731l792l010l007l811l771k481j495j668j977j567r50n99k08
57767C43908J18k78j107j203m09J91J51L0j49q73j465n49J481K539J790N14l96
57750C44293j590l271m188l643k678k304k135j652j360j684k096k114k009j881
57736C11688j240j13N54K21n33j013j160j034n69j05r8k24J60P80Q83P80J469
57719C10446K756L292K615J635R39J39q88j540j600j505j398j085r43j551k455
$$ y = [285787, 285338, 286391, 287418, 287334, 287051, 287634, 288567, 289106, 289771, 291085, 292226, 292348, 292013, 292076, 292314, 292315, 292509, 293166, 293628, 293678, 294334, 296119, 297854, 298481, 298852, 300386, 303101, 306268, 309945, 314480, 319409, 324105, 328688, 333290, 337449, 341254, 345989, 352404, 359337, 365188, 369760, 373574, 376434, 377984, 378782, 379571, 380183, 380159, 379584, 378409, 375975, 372244, 368452, 365442, 362435, 358624, 354853, 352372, 350877, 349209, 347232, 345665, 344715, 344116, 343908, 344026, 343748, 342641, 341438, 341029, 341220, 341371, 341401, 341252, 340379, 338914, 338365, 339846, 342385, 344175, 344689, 344293, 342703, 339432, 335244, 331601, 328923, 326619, 324484, 322832, 321472, 319788, 317692, 315578, 313569, 311688, 310448, 310335, 310889, 311110, 310577, 309564, 308404, 307370, 306801, 306696, 306598, 306374, 306534, 307314, 308197, 308977, 310446, 313202, 316494, 319109, 320744, 321683, 321822, 320934, 319394, 317794, 316289, 314891, 313806, 312863, 311312, 308857]
57704C08857k654k213j999k008j479m95R2K02L93M83p9p00l58N26P66N92J079
57687C01005J742J116m22r04J5O74M25N13J436K009J745J739K391K570J865J420
57671C19339J699J702J248J692L364M589M380L889L960L506J790J26k60j77o47
57656C50200r82l63K59l41j681k632l249l965m221l456k456k237k516k553k538
57641C17269k886l063k412j311n36j33J56K44K34O55J465J860J722J954K741K972
57625C20931K273K060L392N221O074O236O850Q034R288J0822J2994J5302J7176
57612D26653J9129K1865K4942K7484K9650L2075L4305L4665L1480K3984J2715
57601G18947k39j2016k0769k6428k9696l1103l1234l0759k9706k7615k4710k1841
$$ y = [308857, 306203, 303990, 301991, 299983, 298504, 298009, 298101, 298303, 298696, 299179, 299100, 298400, 298042, 298568, 299334, 299926, 301005, 302747, 303863, 303441, 302537, 302552, 303226, 303651, 304164, 305600, 307609, 309354, 311093, 313484, 316054, 317919, 319339, 321038, 322740, 323988, 325680, 329044, 333633, 338013, 341902, 345862, 349368, 351158, 351284, 351024, 350847, 350200, 349218, 348855, 349114, 348773, 347092, 344460, 341211, 337246, 333025, 329569, 327113, 324876, 322360, 319807, 317269, 314383, 311320, 308908, 307597, 307061, 306928, 307084, 307328, 307562, 308217, 309682, 311542, 313264, 315218, 317959, 320931, 323204, 325264, 328656, 333877, 339951, 346187, 353037, 361071, 370359, 381181, 394175, 409477, 426653, 445782, 467647, 492589, 520073, 549723, 581798, 616103, 650768, 682248, 706232, 718947, 718708, 706692, 685923, 659495, 629799, 598696, 567462, 536703, 506997, 479382, 454672, 432831]
57589D32831j9127j6019j2928j1144j0694r970q146o314n431m894m109l760m245
57576C16050m511l757k881k909l235k900k327k407k858k871k479k060j432n75
57562B78848l07j079k003k122j727j483j336j260j836l018l542k715j660j543
57548B53217j793j334m39K7J34L29L69O4L3M63K66j192k664k819k244k174k373
57531B37870k010j578k049k933l030k491k380k670k458j778j603k151k631k497
57517B05611j851r29j89m38j778k997l023k330j909j697j198q09j135j708j760
57502A81860j576j787j971j438p03p37j292j390r79p18n82p3O61J177J748K672
57486A74872L159K305P48K0N51J576K564L442L846L397K454J543N35o21j083k74
$$ y = [432831, 413704, 397685, 384757, 373613, 362919, 352949, 344803, 338489, 333058, 328164, 324055, 320295, 316050, 311539, 307782, 304901, 301992, 298757, 295857, 293530, 291123, 288265, 285394, 282915, 280855, 279423, 278848, 278541, 277462, 275459, 273337, 271610, 270127, 268791, 267531, 265695, 262677, 259135, 256420, 254760, 253217, 251424, 250090, 249651, 249678, 249812, 250141, 250510, 250574, 250607, 251070, 251336, 250144, 247480, 244661, 242417, 240243, 237870, 235860, 234282, 232233, 229300, 226270, 223779, 221399, 218729, 216271, 214493, 212890, 210739, 208108, 205611, 203760, 202831, 202642, 202204, 200426, 197429, 194406, 192076, 190167, 188470, 187272, 186463, 185328, 183620, 181860, 180284, 178497, 176526, 175088, 174385, 173648, 172356, 170966, 169987, 169269, 168687, 168614, 169275, 170452, 172200, 174872, 178031, 180336, 181084, 181104, 181655, 183231, 185795, 189237, 193083, 196480, 198934, 200477, 201012, 200391, 199308, 199034]
57470A99034Q39Q91m5r99j707k364k506j703p14n26p72n37n1r8m25k89J1j62k75
57451A87602M62J239O87o92j056o2P94O53K60L24N15M05M6n00j114j187l63N52
57433A88565O14K13K07J81p71k042k143j147o57j299k022k007j592j101l43M09
57417A75065M00l34r01r21q49q62o60l31k80l54k25l39j230k187k061j156p63
57400A62012j037r67l17P7m0r9q9n68j196r27J40P63N81N19R63J171P98M25K26
57381A62435k80q56m91Q16J738J580J122J065J090R24R22J044P09J46N27K018
57365A74509L119K642J228J45l52o47p56n12j01K04L74L90K14J45M92R41R60P80
57347A83775J029J497J319L31p10j290j527j472j069o44m30J25J419K466J993
$$ y = [199034, 199873, 200764, 200719, 199720, 198013, 195649, 193143, 191440, 190726, 190200, 189428, 188891, 188840, 188742, 188317, 188028, 188039, 187877, 187602, 188064, 189303, 189990, 189298, 188242, 188180, 188974, 189627, 189887, 190211, 190726, 191131, 191177, 190677, 189563, 188376, 188013, 188565, 189179, 189392, 189599, 189780, 189009, 186967, 184824, 183677, 183020, 181721, 179699, 177692, 176100, 174999, 174656, 175065, 175465, 175131, 174230, 173309, 172460, 171598, 170938, 170607, 170327, 169973, 169748, 169409, 168179, 165992, 163931, 162775, 162012, 160975, 160008, 159691, 159768, 159728, 159629, 159540, 158972, 157776, 156849, 156989, 157752, 158333, 158852, 159815, 160986, 161784, 162209, 162435, 162155, 161299, 160808, 161624, 163362, 164942, 166064, 167129, 168219, 169143, 170065, 171109, 171818, 171964, 172491, 174509, 177628, 180270, 181498, 181643, 181291, 180644, 179888, 179376, 179275, 179479, 179853, 180243, 180457, 180602, 181094, 182035, 182995, 183775, 184804, 186301, 187620, 187951, 187241, 185951, 184424, 182952, 181883, 181239, 180809, 180934, 182353, 184819, 186812]
57332A86812M95l43o5L70N78J110J781J611O90K92P47R08K96lP82J916K478K495
57314B02950K138J229J65l9O97J198Q76N60Q42J033M53l59n59j54M08Q61R02L50
57296B13551j38M42J868K753K479J904J821J952J918J906J882J327L78J6O34J449
57280B36142J727J650J550J364J203J421J876K019J884J916J927J406P87R94J808
57265B59674K246K401L152M060L644J959Q75J278K030K296K830M084N043M957
57251C00529M575M639M798M877N613P144Q330Q579Q818R688J0341J0065R607R744
57237D07347R932R500Q886Q604Q217P398O808O912P044O663O415P017Q090Q904
57223E17737R304R258Q593P749P597Q065Q209P968Q332R300R533Q673Q147Q836
$$ y = [186812, 187307, 186964, 186899, 187269, 187847, 188957, 190738, 192349, 193039, 193331, 194078, 194986, 195282, 195279, 196061, 197977, 200455, 202950, 205088, 206317, 206482, 206443, 207140, 208338, 209214, 209774, 210616, 211649, 212102, 211743, 211184, 211030, 211438, 212299, 213201, 213551, 213413, 213855, 215723, 218476, 220955, 222859, 224680, 226632, 228550, 230456, 232338, 233665, 234043, 234059, 234693, 236142, 237869, 239519, 241069, 242433, 243636, 245057, 246933, 248952, 250836, 252752, 254679, 256085, 256872, 257866, 259674, 261920, 264321, 267473, 271533, 275177, 277136, 278011, 279289, 281319, 283615, 286445, 290529, 295572, 300529, 305104, 309743, 314541, 319418, 325031, 332175, 340505, 349084, 357902, 367590, 377931, 387996, 397603, 407347, 417279, 426779, 435665, 444269, 452486, 459884, 466692, 473604, 480648, 487311, 493726, 500743, 508833, 517737, 527041, 536299, 544892, 552641, 560238, 568303, 576512, 584480, 592812, 602112, 611645, 620318, 628465, 637301]
57209F37301R749R931R909J0268J0581J0812J2004J4360J6336J6834J6740J7095
57197G91920J7405J6962J6257J5877J5551J5382J6284J8088J9055J8535J8213
57186I79529J9259K0235J9588J8353J8439J9807K1272K2742K4652K6428K7344
57175A217648K7925K8912K9960L0813L2441L5376L8237L9640M0330M1699M3503
57164A606484M4864M6290M8730N1594N3635N4989N6612N8416N9728O0808O2383
57153B204533O4293O5975O7575O9268P0383P0556P0844P2332P4474P5998P6680
57142B982911P7056P7351P7734P8670Q0011Q0845Q1042Q1698Q3179Q4289Q4336
57131C869122Q4289Q4822Q4988Q4181Q3589Q4306Q5615Q6515Q7307Q8323Q8878
$$ y = [637301, 647050, 656981, 666890, 677158, 687739, 698551, 710555, 724915, 741251, 758085, 774825, 791920, 809325, 826287, 842544, 858421, 873972, 889354, 905638, 923726, 942781, 961316, 979529, 998788, 1019023, 1038611, 1056964, 1075403, 1095210, 1116482, 1139224, 1163876, 1190304, 1217648, 1245573, 1274485, 1304445, 1335258, 1367699, 1403075, 1441312, 1480952, 1521282, 1562981, 1606484, 1651348, 1697638, 1746368, 1797962, 1851597, 1906586, 1963198, 2021614, 2081342, 2142150, 2204533, 2268826, 2334801, 2402376, 2471644, 2542027, 2612583, 2683427, 2755759, 2830233, 2906231, 2982911, 3059967, 3137318, 3215052, 3293722, 3373733, 3454578, 3535620, 3617318, 3700497, 3784786, 3869122, 3953411, 4038233, 4123221, 4207402, 4290991, 4375297, 4460912, 4547427, 4634734, 4723057, 4811935]
57120D811935Q8801Q9242R0594R1580R1689R2308R4109R5590R5898R6611R8886
57109E837243J01292J02512J03771J06403J09343J11401J13748J17812J22735
57100F826260J27199J31636J36469J40492J43130J45895J49290J50986J49453
57091H100810J46606J44277J41113J35850J30500J26973J23508J18001J12009
57082I279647J07833J04479J00247R6478R4684R2715Q8044Q2327P8553P6242P3712
57071A0274961P2364P4101P6896P7423P5676P2693O6675N6132M3988L3613K3641
57060A0948163J1778L39p588j4219k3197l2767l9092m3220m8206n2425n2716n0964
57048A0595886n0409m8554m1121k9437j6017L380L4752P7170J28310J94146K82915
$$ y = [4811935, 4900736, 4989978, 5080572, 5172152, 5263841, 5356149, 5450258, 5545848, 5641746, 5738357, 5837243, 5938535, 6041047, 6144818, 6251221, 6360564, 6471965, 6585713, 6703525, 6826260, 6953459, 7085095, 7221564, 7362056, 7505186, 7651081, 7800371, 7951357, 8100810, 8247416, 8391693, 8532806, 8668656, 8799156, 8926129, 9049637, 9167638, 9279647, 9387480, 9491959, 9592206, 9688684, 9783368, 9876083, 9964127, 10046454, 10125007, 10201249, 10274961, 10347325, 10421426, 10498322, 10575745, 10651421, 10724114, 10790789, 10846921, 10890909, 10924522, 10948163, 10959941, 10960280, 10952692, 10938473, 10915276, 10882509, 10843417, 10800197, 10751991, 10699566, 10646850, 10595886, 10545477, 10496923, 10455802, 10426365, 10410348, 10413728, 10448480, 10525650, 10653960, 10848106, 11131021]
57037A1131021L94249N25678O85032Q84097J125591J410182J749207K153215K614457
57028B2672729L119812L672008M273897M902765N530701O145422O674469O871514
57020F3863317O372771M974145K867358N59784j447779k901156l784678m194983
57012F6308779m267025m153866l989411l844185l725899l614761l486557l318709
57004C5908366l101221k845510k572839k296736k024013j765349j532798j329850
56996A8440050j153213j001509q74472p67042o72462n89245n18768m58661m04929
56987A1999749l57898l19826k88722k60197k33428k09954j88670j67458j48028
56978I825568j33839j24403j16189j07965j00758r3917q5669p6828o9761o4242
$$ y = [11131021, 11525270, 12050948, 12735980, 13620077, 14745668, 16155850, 17905057, 20058272, 22672729, 25792541, 29464549, 33738446, 38641211, 44171912, 50317334, 56991803, 63863317, 70236088, 75210233, 78077591, 78637375, 77189596, 74288440, 70503762, 66308779, 62041754, 57887888, 53898477, 50054292, 46328393, 42713632, 39227075, 35908366, 32807145, 29961635, 27388796, 25092060, 23068047, 21302698, 19769900, 18440050, 17286837, 16285328, 15410856, 14643814, 13971352, 13382107, 12863339, 12404678, 11999749, 11641851, 11322025, 11033303, 10773106, 10539678, 10329724, 10141054, 9973596, 9825568, 9691729, 9567326, 9451137, 9343172, 9242414, 9148497, 9062828, 8986000, 8916239, 8851997]
56968H851997n7952n0586m4305m0878m1350m7435n9769p5357q9738j01243j10725
56957H132659j18202j22836j25481j28153j31145j33213j34329j35818j38034
56948F965448j40182j42290j45320j49537j54527j60480j67698j75322j82287
56939E547805j89079j96916k05506k13108k18186k19710k16669k09042j98652
56930C680937j87522j75963j63599j51298j40213j29822j18928j08231r9926r4942
56920B310493r2251r0732q9946q9101q6964q3201p8629p3927o9122o4354o0105
56909A432161n6485n3050m9425m5540m1405l7235l3541l0518k7593k4141k0392
56898A012836j7116j4753j3345j2988j3917j6345k0338k5270k9419l1095l0475
$$ y = [8851997, 8794045, 8743459, 8699154, 8658276, 8616926, 8569491, 8509722, 8434365, 8344627, 8243384, 8132659, 8014457, 7891621, 7766140, 7637987, 7506842, 7373629, 7239300, 7103482, 6965448, 6825266, 6682976, 6537656, 6388119, 6233592, 6073112, 5905414, 5730092, 5547805, 5358726, 5161810, 4956304, 4743196, 4525010, 4305300, 4088631, 3879589, 3680937, 3493415, 3317452, 3153853, 3002555, 2862342, 2732520, 2613592, 2505361, 2405435, 2310493, 2218242, 2127510, 2037564, 1948463, 1861499, 1778298, 1699669, 1625742, 1556620, 1492266, 1432161, 1375676, 1322626, 1273201, 1227661, 1186256, 1149021, 1115480, 1084962, 1057369, 1033228, 1012836, 995720, 980967, 967622, 954634, 940717, 924372, 904034, 878764, 849345, 818250, 787775]
56887G87775k9362k8774k7819k5512k2437j9790j7702j5548j3135j0657q080n278
56875E63681k415M06L396O505R198J0936J1192Q956L456m275j1711j7156k0726
56862E61443k2842k3325k2574k1932k1838k0966j8366j5166j3028j2012j1149
56851C58245j0077q874p300n391m041l801l906l486k864k633k328j279R8J040
56837C03403J739K721L700M212M627N491O508P329Q499J0502J2631J3978J4654
56824C99994J4768J3132Q691K661k404n381p025q032q192p395o037m374k492p88
56810C87126N55K338N440R386J2905J5726J8671K2146K5717K9213L2861L5981
56798E98065L6562L2748K4478J3585K667o226j2364j6041j7573j7051j5070j2806
$$ y = [787775, 758413, 729639, 701820, 676308, 653871, 634081, 616379, 600831, 587696, 577039, 568959, 563681, 561266, 561672, 565068, 571573, 580771, 591707, 602899, 611855, 615311, 611036, 599325, 582169, 561443, 538601, 515276, 492702, 470770, 448932, 427966, 409600, 394434, 381406, 369394, 358245, 348168, 339294, 331994, 326603, 322562, 318761, 314855, 311369, 308505, 305872, 303544, 302265, 302363, 303403, 305142, 307863, 311563, 315775, 320402, 325893, 332401, 339730, 348229, 358731, 371362, 385340, 399994, 414762, 427894, 436585, 439246, 436842, 431461, 424436, 416404, 408212, 400817, 394780, 390406, 387914, 387126, 387681, 390019, 395459, 404845, 417750, 433476, 452147, 474293, 500010, 529223, 562084, 598065, 634627, 667375, 691853, 705438, 708105, 701879, 689515, 673474, 655901, 638850, 623780, 610974]
56786F10974j0729q046m074N48M865R039J3900J9649K5958L2675L9482M5415M9704
56773H29360N2415N3110M9678M0054K4935P573q932k2974l3642m0323m3291m3518
56761H64445m1623l7899l3206k8631k4170j8827j2290n484P35O500J2294J8190
56749G00034K4020K9544L4086L6363L4915K8622J7334K695j2043k3947l2180l7452
56737H01991m0266m0626l9010l6389l3191k9273k4867k0640j6728j2671q338m093
56725D95899j4M140Q210J1666J4361J6222J6265J3101O692j296r187j6298k2112
56712E37649k5804k7215k7375k7232k6612k5062k2945k0947j9103j7139j5319
56701B82896j4047j2958j1320r260p774p360p342o855n983n454n495n525m983
$$ y = [610974, 600245, 592199, 588125, 588673, 593538, 602577, 616477, 636126, 662084, 694759, 734241, 779656, 829360, 881775, 934885, 984563, 1024617, 1049552, 1057125, 1048193, 1025219, 991577, 951254, 907963, 864445, 822822, 784923, 751717, 723086, 698916, 680089, 667799, 662315, 663050, 669550, 681844, 700034, 724054, 753598, 787684, 824047, 858962, 887584, 904918, 907613, 895570, 871623, 839443, 801991, 761725, 721099, 682089, 645700, 612509, 583236, 558369, 537729, 521001, 508330, 499992, 495899, 495885, 500025, 508235, 519901, 534262, 550484, 566749, 579850, 586542, 585246, 576059, 559761, 537649, 511845, 484630, 457255, 430023, 403411, 378349, 355404, 334457, 315354, 298215, 282896, 268849, 255891, 244571, 235311, 227537, 220177, 212835, 205980, 199997, 194543, 189048, 183523, 178540]
56688A78540m002l126k604k311k080j851j533j186j195j849k703k954k501k067
56674A46578k060k007j508j012j053j186n44Q26J901J903J012q9q57j015n59J81
56658A40511P40Q38N17M9j98j8L04K79j15l40r1K53K06j81n57p22n91j50K99L34
56638A41367J45M55J311J699R73j6l7Q48J615J878K097K397K267J537P41L17M9
56621A59643l67p96r76r19p64m86o5K81K15l13r01j026o19j89k29o27r07r30q94
56602A49131q75q35r54j306j378o83K06K22n44q55j97N47O68O92J206J717J568
56585A48330J044P03N14M02Q04J759K267J601M57j27k37m11m18P6M42Kn61j68
56567A56479P76R54K53j95N1K56l3l42l42l77o00o14k33J39J29k11p38j369j873
$$ y = [178540, 174538, 171412, 168808, 166497, 164417, 162566, 161033, 159847, 158652, 156803, 154100, 151146, 148645, 146578, 144518, 142511, 141003, 139991, 138938, 137752, 137208, 138034, 139935, 141838, 142850, 142761, 141904, 140889, 140330, 140511, 141251, 142089, 142606, 142655, 142457, 142439, 142743, 143022, 142907, 142567, 142476, 142729, 142935, 142754, 142197, 141475, 140884, 140734, 141033, 141367, 141512, 141967, 143278, 144977, 145950, 145934, 145897, 146745, 148360, 150238, 152335, 154732, 156999, 158536, 159277, 159594, 159643, 159276, 158480, 157504, 156585, 155821, 155335, 155270, 155551, 155766, 155453, 154552, 153526, 152907, 152718, 152489, 151862, 150955, 150025, 149131, 148256, 147421, 146467, 145161, 143783, 143100, 143306, 143528, 142984, 142129, 141932, 142479, 143147, 143839, 145045, 146762, 148330, 149374, 150077, 150591, 150993, 151797, 153556, 155823, 157424, 157881, 157754, 157517, 157106, 156688, 156764, 157206, 157208, 156647, 156479, 157255, 158209, 158462, 158267, 158318, 158574, 158541, 158199, 157857, 157480, 156880, 156266, 156033, 156172, 156301, 156090, 155352, 153983, 152110]
56548A52110k069k119k131j790r12j1L99O34J241J994K232J881J325P62L85O09
56532A54540J272J339M30k19N28J771J858R27M41P36Q58N64O31J100J097N99O14
56515A69086J332J759J578J724K582L225L080K893L279L732L837M182N220O303
56501B13812O736O784O858O627N724M540L530K584J677J359J816K207J643K98
56487B66195j059k006k417k169j528j250j701k386k720k710k565k291k066k263
56473B37064k747k868k507k310k444k174j252p33j450k545k569j460l49J74M28
56458B12258M49l14j883l201l241k224j249r50r02m48L03O23K32k63k43J06K61
56441A99314K13L23N25M11j4l05k32oJ88K77J55r6oN97R96M15p80j479j311q25
$$ y = [152110, 150041, 147922, 145791, 144001, 143089, 143078, 143477, 144111, 145352, 147346, 149578, 151459, 152784, 153546, 153931, 154540, 155812, 157151, 157581, 157362, 157890, 159661, 161519, 162446, 162887, 163623, 164481, 165045, 165676, 166776, 167873, 168472, 169086, 170418, 172177, 173755, 175479, 178061, 181286, 184366, 187259, 190538, 194270, 198107, 202289, 207509, 213812, 220548, 227332, 234190, 240817, 246541, 251081, 254611, 257195, 258872, 260231, 262047, 264254, 265897, 266195, 265136, 263130, 260713, 258544, 257016, 255766, 254065, 251679, 248959, 246249, 243684, 241393, 239327, 237064, 234317, 231449, 228942, 226632, 224188, 222014, 220762, 220029, 218579, 216034, 213465, 212005, 211656, 211830, 212258, 212707, 212393, 210510, 207309, 204068, 201844, 200595, 199645, 198743, 198295, 198598, 199221, 199453, 199190, 198947, 199053, 199314, 199527, 199850, 200375, 200786, 200772, 200467, 200235, 200229, 200417, 200694, 200849, 200753, 200747, 201344, 202340, 202755, 201975, 200496, 199185, 198360]
56421A98360m67k43k94p67j172q85k69k31o56m87M30Q91J60r06j167o78k09o4
56403A91346k0J19L95P54Q73N00LM1N60Q14N33K60L91O95R76J382J808J831J504
56384B04765J416J688J697J089L27o1j09LK38L79P5n57r54q81n42o2M30M28l11
56365B09058r92o58K52N02N6O3Q13J290R81N86M85P1p91j166o43j79n36j093j064
56346B07035p07n25l94k68o34j389j446l42Q68J193J122J437J761J406P49N91
56330B10457Q25R04R41J253J450R56O0n24o67p15p64p62q20q60n06K27P87J093
56312B13335J808L034L698L049J839J210J216J315J472J850K129K060K060K373
56298B42448K386J628Q15Q68J501J722J288P52N09N24O73P48N64M81J167K322
$$ y = [198360, 197893, 197650, 197356, 196589, 195417, 194532, 194263, 194032, 193376, 192889, 193319, 194210, 194370, 193464, 192297, 191619, 191410, 191346, 191326, 191445, 191840, 192594, 193467, 193967, 193970, 194011, 194571, 195385, 195918, 196178, 196569, 197264, 198240, 199622, 201430, 203261, 204765, 206181, 207869, 209566, 210655, 210982, 210921, 210812, 210815, 211053, 211432, 211507, 210950, 209996, 209115, 208573, 208511, 208941, 209369, 209058, 208066, 207408, 207660, 208162, 208218, 208281, 209094, 210384, 211365, 211951, 212436, 212507, 211716, 210550, 209907, 209728, 209192, 208099, 207035, 206328, 205803, 205409, 205141, 204507, 203118, 201672, 201330, 202198, 203391, 204513, 205950, 207711, 209117, 209866, 210457, 211282, 212186, 213127, 214380, 215830, 216786, 216846, 216322, 215655, 214940, 214176, 213414, 212594, 211734, 211228, 211455, 212242, 213335, 215143, 218177, 221875, 224924, 226763, 227973, 229189, 230504, 231976, 233826, 235955, 238015, 240075, 242448, 244834, 246462, 247277, 248145, 249646, 251368, 252656, 253408, 253917, 254441, 255114, 255862, 256426, 256907, 258074, 260396]
56282B60396K575J321j54k57R84K359L071L058K470J773J760K547L165K895K321
56267B90284K276K542K521K423K678K841K224J191P53J220K059K796L195K998
56253C22001K323J893K172K657K678K440K601L280M169N087N826N992N652N552
56239C74323O074O585O406N824N542N776O480P671Q905R221Q380P465P602Q693
56225D74947J0005J1179J2079J2436J2386J2625J3447J4358J5082J5986J7107
56214F21637J7869J8313J9333K1063K2371K2777K3448K5364K7812K9801L1621
56203H81409L3923L6523L9286M2900M7545N2073N5852O0156O6234P3220P9543
56192A468664Q5291R1541R8299J04705J10547J16035J20782J24315J26847J28244
$$ y = [260396, 262971, 264292, 264138, 263881, 264865, 267224, 270295, 273353, 275823, 277596, 279356, 281903, 285068, 287963, 290284, 292560, 295102, 297623, 300046, 302724, 305565, 307789, 308980, 309733, 310953, 313012, 315808, 319003, 322001, 324324, 326217, 328389, 331046, 333724, 336164, 338765, 342045, 346214, 351301, 357127, 363119, 368771, 374323, 380397, 386982, 393388, 399212, 404754, 410530, 417010, 424681, 433586, 442807, 451187, 458652, 466254, 474947, 484952, 496131, 508210, 520646, 533032, 545657, 559104, 573462, 588544, 604530, 621637, 639506, 657819, 677152, 698215, 720586, 743363, 766811, 792175, 819987, 849788, 881409, 915332, 951855, 991141, 1034041, 1081586, 1133659, 1189511, 1249667, 1315901, 1389121, 1468664, 1553955, 1645496, 1743795, 1848500, 1959047, 2075082, 2195864, 2320179, 2447026, 2575270]
56182B575270J27107J22301J14476J04820R3222P9040O2711M5050K5942N314j5400
56171C339853l4299n0879o5652p8721q9938r9443j06880j11215j12518j12614
56161B477694j12670j11676j08785j05259j02254r8560r2857q6517q1568p7345
56151A500203p1981o6023o1547n8492n4958n0615m6818m3670l9800l5162l1375
56140I39762k9082k7321k5589k4333k3295k1547j9196j7192j5508j3446j1468
56129G11785j0643j0532r749q275p187o396m991l466l139l538k890j198k50m70
56115F39061l10R10K005K271K537L355M167M810N854P061P385O893O904P872Q864
56100G09639R317R648R964R972J0197J1537J3565J5108J6317J8296K0910K3060
$$ y = [2575270, 2702377, 2824678, 2939154, 3043974, 3137196, 3216236, 3278947, 3323997, 3349939, 3355253, 3339853, 3305554, 3254675, 3189023, 3110302, 3020364, 2920921, 2814041, 2702826, 2590308, 2477694, 2365024, 2253348, 2144563, 2039304, 1937050, 1838490, 1745633, 1659116, 1577548, 1500203, 1428222, 1362199, 1300652, 1242160, 1187202, 1136587, 1089769, 1046099, 1006299, 971137, 939762, 910680, 883359, 857770, 833437, 810142, 788595, 769399, 752207, 736699, 723253, 711785, 701142, 690610, 680861, 672586, 665399, 659003, 654012, 650546, 647407, 643869, 640979, 639781, 639531, 639061, 638751, 639661, 641666, 643937, 646474, 649829, 653996, 658806, 664660, 671721, 679106, 685999, 692903, 700775, 709639, 718956, 728604, 738568, 748540, 758737, 770274, 783839, 798947, 815264, 833560, 854470, 877530]
56088H77530K5064K8466L3434L8549M3267M8434N4213N9674O4617O9545P3546
56077A416339P4378P1140O5090N7694M9736M2353L6772L2733K8970K5189K1727
56066A922121J7614J1349L593l274q314j2543j6498j9804k3326k9039l7192m5752
56054A758935n3029n8863o3090o4988o4612o2735n9437n4527m9060m4405m0165
56043A144024l5175k9939k5788k2293j8126j3833j0908q800n895k843j659j988
56031I66777j665n83m14p70M88L095M399L804L498M425N285N838P406R605J0316
56016A021504R564R746J1448J2714J2967J3823J5454J6055J5558J6007J7615J8379
56004A190834J8198J9257K1617K2668K1780K1189K1449K0490J8170J7205J8322
$$ y = [877530, 902594, 931060, 964494, 1003043, 1046310, 1094744, 1148957, 1208631, 1273248, 1342793, 1416339, 1490717, 1561857, 1626947, 1684641, 1734377, 1776730, 1813502, 1846235, 1875205, 1900394, 1922121, 1939735, 1951084, 1954677, 1951403, 1943089, 1930546, 1914048, 1894244, 1870918, 1841879, 1804687, 1758935, 1705906, 1647043, 1583953, 1518965, 1454353, 1391618, 1332181, 1277654, 1228594, 1184189, 1144024, 1108849, 1078910, 1053122, 1030829, 1012703, 998870, 987962, 979162, 973267, 970424, 968765, 966777, 965112, 964529, 964115, 963345, 963833, 966928, 971327, 975131, 978629, 983054, 988339, 994177, 1001583, 1011188, 1021504, 1031068, 1040814, 1052262, 1064976, 1077943, 1091766, 1107220, 1123275, 1138833, 1154840, 1172455, 1190834, 1209032, 1228289, 1249906, 1272574, 1294354, 1315543, 1336992, 1357482, 1375652, 1392857, 1411179]
55993A411179J9075J8710J9586K2321K4257K4296K4669K6332K7308K7222K8637
55982A673592L1962L3893L3040L2425L4197L6516L7881L9833M3097M5565M6539
55971B088540M8488N2470N6140N8401O1481O6356P0868P4259P8686Q4427Q8744
55960B828860R1340R5571J02224J07820J11142J15459J22032J27624J31081J35952
55950C969105J43759J51105J56484J63391J73533J83542J91738K01450K14215
55941E548322K26587K37186K49894K66550K83702L00099L19731L43684L66961
55932H142716L87387M09424M35220M60582M84138N11292N44438N78718O12329
55923A2566244O51041O97274P45229P92348Q44710R05391R69317J035511J111733
$$ y = [1411179, 1430254, 1448964, 1468550, 1490871, 1515128, 1539424, 1564093, 1590425, 1617733, 1644955, 1673592, 1705554, 1739447, 1772487, 1804912, 1839109, 1875625, 1913506, 1953339, 1996436, 2042001, 2088540, 2137028, 2189498, 2245638, 2304039, 2365520, 2431876, 2502744, 2577003, 2655689, 2740116, 2828860, 2920200, 3015771, 3117995, 3225815, 3336957, 3452416, 3574448, 3702072, 3833153, 3969105, 4112864, 4263969, 4420453, 4583844, 4757377, 4940919, 5132657, 5334107, 5548322, 5774909, 6012095, 6261989, 6528539, 6812241, 7112340, 7432071, 7775755, 8142716, 8530103, 8939527, 9374747, 9835329, 10319467, 10830759, 11375197, 11953915, 12566244, 13217285, 13914559, 14659788, 15452136, 16296846, 17202237, 18171554, 19207065, 20318798]
55914B0318798J200200J292358J385159J488187J606989J735239J872345K031757
55906C2931032K221925K437868K683681K984370L362269L820601M360899M991980
55898E9794625N709231O496469P368328Q379822R573497J0952345J2520811J4294182
55890A35089310J6233722J8241570K0249874K2149540K3430314K2977572J9595650
55883B77967552J3024884M441182m166712j1163110j5923206j8649951j9857655
55876B25672984k0041466j9575408j8689009j7497388j6087720j4569820j3040572
55869A06171601j1547163j0117086q795115p624169o614071n753677n034644m443225
55861D6242451l947935l517768l141848k817362k532484k275657k048325j853798
$$ y = [20318798, 21518998, 22811356, 24196515, 25684702, 27291691, 29026930, 30899275, 32931032, 35152957, 37590825, 40274506, 43258876, 46621145, 50441746, 54802645, 59794625, 65503856, 72000325, 79368653, 87748475, 97321972, 108274317, 120795128, 135089310, 151323032, 169564602, 189814476, 211964016, 235394330, 258371902, 277967552, 290992436, 295433618, 291266906, 280103796, 264180590, 245530639, 225672984, 205631518, 186056110, 167367101, 149869713, 133781993, 119212173, 106171601, 94624438, 84507352, 75712237, 68088068, 61473997, 55720320, 50685676, 46242451, 42294516, 38776748, 35634900, 32817538, 30285054, 28009397, 25961072, 24107274]
55853B4107274j684064j529698j391896j273197j166712j065608r73701q96041
55845A4126357q27870p62860p03564o54055o10242n66806n26356m92871m62941
55836H518792m31833m01734l76108l52264l27019l03515k85261k69306k52160
55827E519592k36464k25019k14176k00075j85894j76112j68840j60488j52913
55818C799611j49147j46681j41601j35285j30826j26849j20795j14496j10709
55809B623222j07710j02781r7512r4417r1824q7258q2418p9810p7820p3929o9476
55798A658267o6602o3795n9079n4257n1438m8783m4185l9739l8017l7248l4870
55787A120254l2444l2312l2585l0384k7139k5798k5464k3591k0999k0068k0124
$$ y = [24107274, 22423210, 20893512, 19501616, 18228419, 17061707, 15996099, 15022398, 14126357, 13298487, 12535627, 11832063, 11178008, 10567766, 10000960, 9474604, 8981733, 8518792, 8086959, 7685225, 7309117, 6956853, 6629834, 6326319, 6041058, 5771752, 5519592, 5283128, 5058109, 4843933, 4643858, 4457964, 4281852, 4113012, 3952524, 3799611, 3650464, 3503783, 3362182, 3226897, 3096071, 2969222, 2848427, 2733931, 2623222, 2515512, 2412731, 2315219, 2220802, 2128978, 2041720, 1959302, 1879492, 1801672, 1727743, 1658267, 1591665, 1527870, 1468791, 1414534, 1363096, 1314313, 1270128, 1230389, 1192372, 1155124, 1120254, 1087810, 1055498, 1022913, 992529, 965390, 939592, 914128, 890537, 869538, 849470, 829346]
55776H29346j9129j7750j7572j7469j5811j3993j3840j3850j2023r889r645r834
55764F58541q175o227o724q505q630p602p921r197r203q242q149q354p133n370
55750E49109m980m923k932M2J170M58J50N76L93%P87J905J442j6m87l31j302k942
55732E38119l490l445m563o189o252n112m816n249m726l743m316o020o351m876
55718D68971l484k678j078J381L091L843N115P048P984P132N061J688l507r153
55704D91414j2658j3391j2949j2423j1717j1242j1681j2170j1095q687o704n792
55692C60905n284n045n292n184l995l017l795n274n297m182l882m304l679k179
55678C00496j858l024l882l929m522n761n923m632l710m139m787m834m971n465
$$ y = [829346, 810217, 792467, 774895, 757426, 741615, 727622, 713782, 699932, 687909, 678020, 668375, 658541, 650366, 644139, 637415, 628910, 620280, 612678, 604757, 595560, 586357, 578115, 569966, 561612, 554479, 549109, 544129, 539206, 536274, 536316, 537486, 537944, 538094, 538670, 539063, 539063, 539850, 541755, 543197, 543181, 542694, 542363, 541061, 538119, 534629, 531184, 526621, 520432, 514180, 509068, 504252, 499003, 494277, 490534, 486218, 480198, 473847, 468971, 465487, 462809, 461731, 463112, 466203, 470046, 475161, 482209, 490193, 497325, 502386, 504074, 500567, 491414, 478756, 465365, 452416, 439993, 428276, 417034, 405353, 393183, 382088, 373401, 366697, 360905, 355621, 350576, 345284, 340100, 336105, 333088, 329293, 324019, 318722, 314540, 310658, 306354, 302675, 300496, 298638, 295614, 291732, 287803, 283281, 277520, 271597, 266965, 263255, 259116, 254329, 249495, 244524, 239059]
55664B39059n356m398l645l418k710j243j14J72L49O53L67l14NJ714L426M019
55648B28566L799L183J932K34j018j538j923k371k498k511l072l936m294m360
55634B10193m922n465m698k935j874j858j433j6J110J065O97R42J536K075K804
55619A97221L676L953L404K712K310J889J283O45k59j639k590j962l19N47J21
55604B10992m07l11j89m03m14n4O0j45Q1Q64J361J208R63Q88N79L4k17l14j033
55585B13543k422l674m428m905m898m109l361l769m736m561l137k153k365k644
55571A62381k128j490j392j364r25m37k22r7j71q34j641j626r37p05j136j299
55555A45977j022j247k119k523k065j748k127k414k122j878j896j317R4J062N70
$$ y = [239059, 233703, 229305, 225660, 222242, 219532, 218289, 218175, 218347, 218696, 219349, 219716, 219402, 219407, 221121, 224547, 228566, 232365, 235548, 237480, 237714, 236696, 235158, 233235, 230864, 228366, 225855, 222783, 218847, 214553, 210193, 205271, 199806, 195108, 192173, 190299, 188441, 187008, 186992, 188102, 189167, 189864, 190806, 192342, 194417, 197221, 200897, 204850, 208254, 210966, 213276, 215165, 216448, 217093, 216834, 215195, 212605, 210643, 210324, 210871, 210992, 210585, 210274, 210085, 209682, 209268, 209214, 209274, 209129, 209210, 210074, 211435, 212643, 213606, 214494, 215073, 215107, 214890, 214576, 213543, 211121, 207447, 203019, 198114, 193216, 189107, 185746, 181977, 177241, 172680, 169543, 167390, 165025, 162381, 160253, 158763, 157371, 156007, 155082, 154645, 154423, 154326, 154155, 153321, 151680, 150054, 149117, 148412, 147276, 145977, 144955, 143708, 141589, 139066, 137001, 135253, 133126, 130712, 128590, 126712, 124816, 123499, 123593, 124655, 125225]
55540A25225p81j932k644k934k502j524p86m73Q5R53J259P40K13m4q01k129k797
55523A09128k181j310j081r23k17L98K72j4K37O02M65J66J74J51j79j87N87J463
55505A07551J649J414J304J088M39j80k91l33r21j724j975j521p16J56P66P18
55489A07424K14M4M70Q25O99O15J044J651K034K323K524K202J417R94J153R61
55473A26594j59j291j304m27K88L96J63j64m66o08p74j355k149k333j587n49K39
55456A14514R06J419J157m8j414k271k832l334l369k693j902j573j542j545j802
55441I3671k361k696k467k022j665j200o33l66l35N2P14P10j22n41L20J540J736
55424H4335Q51j39o09n53j78J42J4l32k12L73O87N35O26J194J446R10J69k95p85
$$ y = [125225, 124444, 122512, 119868, 116934, 114432, 112908, 112122, 111649, 111734, 112687, 113946, 114686, 114899, 114855, 114054, 111925, 109128, 106947, 105637, 104556, 103633, 103416, 103814, 104086, 104072, 104309, 104911, 105376, 105542, 105716, 105867, 105688, 105501, 106088, 107551, 109200, 110614, 111918, 113006, 113445, 113265, 112974, 112641, 111720, 109996, 108021, 106500, 105784, 105940, 106706, 107424, 107638, 107682, 108152, 108977, 109676, 110291, 111335, 112986, 115020, 117343, 119867, 122069, 123486, 124480, 125633, 126594, 126435, 125144, 123840, 123413, 123701, 124097, 124260, 124096, 123630, 123022, 122248, 120893, 118744, 116411, 114824, 114275, 114514, 115420, 116839, 117996, 117948, 116534, 114263, 111431, 108097, 104728, 102035, 100133, 98560, 97018, 95473, 93671, 91310, 88614, 86147, 84125, 82460, 81260, 80627, 80261, 79926, 79978, 80692, 81402, 81280, 80739, 81059, 82599, 84335, 85186, 85047, 84438, 83885, 83707, 83849, 83863, 83531, 83319, 83692, 84379, 84914, 85540, 86734, 88180, 89090, 89259, 88964, 88179]
55405H8179j337j237l78K15j3k31J65L72l21j099r48l26k11m20k06K68L12j8k02
55386H2564k55m19m84k78k50p00j088r87q20q95n90M66J390J296O92M95N27K38
55368H0902L1M95J011N93m31r47q27q80j329j556j185l86N74J292J173K83l22
55351G8491K8N75M18K5K74Q15P22J93R9K94q7r47j283q67m65m41l36K7J25m17
55331G7243j332k082k137j178L16J122P04Q4M39J384J651R30q8r97j790k138j748
55314G0383j141r12n99N05J849K244J705J244J169R45O37R04J565J591P37o3j85
55297H2578J2J51L38M59J20n06p52o07p20j187j312q71m86m89m10L1L98L82L13
55278G7442M32M13J15jM05R46J085Q22N05L36K73J51k29p75j016p22m00o44j212
$$ y = [88179, 86842, 85605, 85227, 85442, 85429, 85198, 85363, 85735, 85414, 84315, 83367, 83041, 82830, 82410, 82204, 82472, 82784, 82766, 82564, 82309, 81890, 81406, 81128, 80878, 80178, 79090, 78103, 77283, 76388, 75798, 76264, 77654, 78950, 79642, 80137, 80664, 80902, 80933, 81428, 82439, 83032, 82601, 81654, 80827, 79947, 78618, 77062, 75877, 75491, 76065, 77357, 78530, 78813, 78491, 78519, 79094, 79512, 79537, 79811, 80626, 81348, 81541, 81640, 81934, 81847, 80900, 79617, 78750, 78285, 77844, 77508, 77535, 77660, 77243, 75911, 73829, 71692, 70514, 70830, 71952, 72656, 72740, 73179, 74563, 76214, 77144, 77056, 76059, 74269, 72131, 70383, 69242, 68330, 67731, 68236, 70085, 72329, 74034, 75278, 76447, 77392, 78029, 78933, 80498, 82089, 82826, 82763, 82578, 82590, 82741, 83079, 83538, 83658, 83152, 82400, 81793, 81073, 79886, 78574, 77703, 77217, 76728, 76318, 76349, 76747, 77129, 77442, 77874, 78287, 78402, 78401, 78806, 79752, 80837, 81659, 82164, 82500, 82773, 82924, 82695, 81920, 80904, 80182, 79782, 79138, 77926]
55259G7926j360r03k71L05Q89J266J051L72k79p00r31p32P6Q94Q80J15n67q36
55241G7195j078j423j492j163p49k86N20J509J990J688J079O23K39k64p47q79
55225G6762m55M01J093R35M9o33o75q07j587k168j413K97J558J782J394O48m03
55208G6778j047n39M75N80l77j168j203j128j284j035r5Q61J387J874K369K071
55192G8519O59q86j513j278p69k28J66K5n48p82k92L24M14J22j16k13j74P0K08
55173G3708k83j163j463q84j89J46O32J517J962J382N71M95P56L99m05o88l65
55156G6128l23r39j576j660j329q51j47P34J268J020K63l13l62j27M2J27K86M20
55138G2661K30k30m12M0P64J135J035P75N33K71Q5N3l4l41n36k85pl63j199j653
$$ y = [77926, 76566, 75663, 75392, 75697, 76586, 77852, 78903, 79275, 78996, 78296, 77365, 76633, 76709, 77603, 78483, 78598, 78031, 77195, 76117, 74694, 73202, 72039, 71290, 71004, 71524, 73033, 75023, 76711, 77790, 78413, 78652, 78388, 77641, 76762, 76307, 76708, 77801, 78736, 78785, 78152, 77477, 76670, 75083, 72915, 71502, 71799, 73357, 75139, 76533, 77181, 76778, 75731, 75192, 75667, 76247, 75870, 74702, 73499, 72371, 71087, 70052, 69957, 70818, 72205, 74079, 76448, 78519, 79178, 78292, 76779, 75501, 74732, 74504, 74670, 74695, 74147, 73365, 73073, 73397, 73811, 73933, 73817, 73604, 73430, 73500, 73708, 73425, 72262, 70799, 69915, 69726, 69872, 70504, 72021, 73983, 75365, 75936, 76431, 77187, 77586, 77181, 76493, 76128, 75805, 74866, 73290, 71630, 70301, 69450, 69303, 70037, 71305, 72325, 72588, 72275, 71913, 71786, 71828, 71955, 72241, 72661, 72891, 72661, 72249, 72289, 73053, 74188, 75223, 75998, 76531, 76802, 76887, 76940, 76906, 76565, 76029, 75744, 75737, 75374, 74175, 72522]
55118G2522j333o65k5O71J390J745J606J364J285J141O70k9o56q99m74M98J331
55101H0142J482J298J402J537R60j77q27n82j84k76n59n40l07j84k53m97q64r69
55083H0602m74J91K10l47n27O0P27Q91P84O67K92l13n27j70k5o48j417j425p31
55064G7820m6K79L63L14K12K03K40J27k1J17L13p6r55j288n51M45P21M48M01P63
55044G9829J163J407J480J245P21L55M59P48P53L96j48o81p62Q3J552K596K616
55027I3812K088J597J043L01j37N3K74j54q69r61k75N47R64R05N04L2j44ML8k11
55007I9411k37L72J135J190L42q53j713j842j249m92k45m81n38j77O1r7j30K69
54989I4726M53j18q28p46l4M27L32L2l30q67j341j332r28n40k21K43P11P87M40
$$ y = [72522, 71189, 70524, 70499, 71170, 72560, 74305, 75911, 77275, 78560, 79701, 80371, 80342, 79686, 78787, 78313, 78811, 80142, 81624, 82922, 84324, 85861, 86821, 86644, 85817, 85235, 85051, 84775, 84216, 83676, 83369, 83185, 82932, 82435, 81571, 80602, 80128, 80319, 80529, 80182, 79655, 79715, 80442, 81333, 82117, 82784, 83076, 82763, 82236, 82066, 82041, 81393, 79976, 78551, 77820, 77774, 78053, 78416, 78730, 78942, 79145, 79385, 79512, 79491, 79608, 79921, 79845, 78890, 77602, 77051, 77496, 78217, 78665, 79066, 79829, 80992, 82399, 83879, 85124, 85845, 86200, 86659, 87407, 88160, 88556, 88408, 87727, 86965, 87048, 88600, 91196, 93812, 95900, 97497, 98540, 98841, 98704, 98757, 99031, 98877, 98008, 97047, 96772, 97319, 98283, 99188, 99692, 99724, 99580, 99584, 99622, 99411, 99174, 99546, 100681, 101871, 102213, 101360, 99647, 97805, 96556, 96064, 95819, 95338, 94800, 94623, 94684, 94587, 94457, 94726, 95179, 95061, 94233, 93487, 93453, 93880, 94212, 94244, 93914, 93047, 91706, 90374, 89446, 88906, 88685, 88928, 89639, 90426, 90866]
54970I0866k4m41p51p29k96J81L71N19Q87J048M92l73n93m8L84J23l18j53N65
54951I1710R76M47p07j538j461q04k42N6L68P01P59N92O26R11J002P51M59J67
54933I4773m43j191j361r15p09j042j064k80M65M00J53N72J184J125Q30J333K298
54916I6128K332J118j20m12p3J73J12j95o65r58o80L8O47R55J177J357J331J178
54898A03443J053P55J35k55J89R53Q25l93j459j279j77O56M73n56j621j816q50
54881A00076N17J123O17k24m40J66J036J517J428J145J133J371J513J616K182
54866A14776L215L878L628L140L407M369N118N137M608L809K930K210J566L90
54852A62181j575l411m015l581l250l496l820l893l953l954l412k353j600j653
$$ y = [90866, 90842, 90401, 89650, 88921, 88625, 88806, 89177, 89696, 90583, 91631, 92123, 91750, 91157, 91109, 91493, 91616, 91298, 91145, 91710, 92686, 93133, 92426, 90888, 89427, 88623, 88381, 88437, 88805, 89506, 90265, 90857, 91483, 92394, 93396, 94147, 94606, 94773, 94330, 93139, 91778, 90863, 90154, 89112, 88048, 87768, 88233, 88633, 88786, 89358, 90542, 91667, 92497, 93830, 96128, 98460, 99578, 99458, 99046, 98973, 99146, 99258, 99063, 98398, 97440, 96760, 96798, 97445, 98400, 99577, 100934, 102265, 103443, 104496, 105251, 105386, 105131, 105320, 106273, 107098, 106705, 105246, 103967, 103790, 104446, 104919, 104363, 102742, 100926, 100076, 100593, 101716, 102333, 102109, 101669, 101835, 102871, 104388, 105816, 106961, 108094, 109465, 110978, 112594, 114776, 117991, 121869, 125497, 128637, 132044, 136413, 141531, 146668, 151276, 155085, 158015, 160225, 161791, 162181, 160606, 157195, 153180, 149599, 146349, 142853, 139033, 135140, 131187, 127233, 123821, 121468, 119868, 118215]
54838A18215j966j688p18K58M76k10j122j272m22O47J176J386J864K507K810K800
54822A24741K869K981K930L098L918M857M971M348L824L378K113m1j907k696k910
54807A56474l156l221k928k870l489m201m243l732l261k899k383j841j624j668
54793A14958j553j143p89r35j693k593k828k067r92n21o00l94K88O78L02k81m30
54776I9407l47m62n69k26M52R95J154Q03k37j622k215j240M89J373R65L68N17
54759I9605Q90M47p75j676j557q37k46J07M39N88K62k22k07K83N10K43K15R30
54741I8999J765J842J258P02L70N5r7K20P16Q21O40Q08J427J947K048J907J526
54724A16954O38n97j418j248k20J065J912J869J276J228K277L483L538K612K028
$$ y = [118215, 116249, 114561, 113843, 114101, 114577, 114367, 113245, 111973, 111551, 112198, 113374, 114760, 116624, 119131, 121941, 124741, 127610, 130591, 133521, 136619, 140537, 145394, 150365, 154713, 158537, 161915, 164028, 163987, 162080, 159384, 156474, 153318, 150097, 147169, 144299, 140810, 136609, 132366, 128634, 125373, 122474, 120091, 118250, 116626, 114958, 113405, 112262, 111473, 110538, 108845, 106252, 103424, 101357, 100365, 99844, 99244, 98850, 99138, 99816, 100118, 99837, 99407, 99060, 98598, 98029, 97803, 98255, 99250, 100404, 101207, 100970, 99348, 97133, 95893, 96382, 97755, 98720, 99088, 99605, 100495, 100942, 100167, 98491, 96934, 96097, 95851, 95958, 96397, 96985, 97247, 97025, 96818, 97101, 97611, 97854, 98069, 98999, 100764, 102606, 103864, 104566, 104936, 104991, 104894, 105114, 105830, 106651, 107291, 108099, 109526, 111473, 113521, 115428, 116954, 117592, 116995, 115577, 114329, 114109, 115174, 117086, 118955, 120231, 121459, 123736, 127219, 130757, 133369, 135397]
54709A35397K279K600K522K597L129L462L152K830L066L163K004l10k480l536
54695A59875l742l921m351m439l588k184j385j662k104j746j009q98j289j160
54681A26397m32j64p62j248p67L08J243J899K261J968J076M73Q57J840K605K837
54665A40391K599J980J400J534K376K968K585J581O78Mn89r69j081j299j912k667
54649A49579l276l804m215m183l699l223k841k074r18j95l40p41q89j230k070
54634A15881k626k160j188n79j76N10R61L17j004j620j010J19R99J392J182M63
54618A11461j05L7L14k61j491k093j552p96p45j081r25j02P37R17L52m19p09l60
54600A03179J21K58J61J32J10k5jM18P76N14j29m16k27q3j67j81p9k02n30n84
$$ y = [135397, 137676, 140276, 142798, 145395, 148524, 151986, 155138, 157968, 161034, 164197, 166201, 165891, 163411, 159875, 156133, 152212, 147861, 143422, 139834, 137650, 136265, 134603, 132499, 130753, 129744, 128846, 127557, 126397, 125965, 125801, 125039, 123791, 123024, 123332, 124575, 126474, 128735, 130703, 131779, 132252, 133109, 134949, 137554, 140391, 142990, 144970, 146370, 147904, 150280, 153248, 155833, 157414, 158092, 158096, 157507, 156538, 155457, 154158, 152246, 149579, 146303, 142499, 138284, 134101, 130402, 127179, 124338, 122264, 121346, 121151, 120811, 120070, 119181, 117951, 115881, 113255, 111095, 109907, 109328, 109152, 109662, 110623, 110940, 109936, 108316, 107306, 107425, 108424, 109816, 110998, 111461, 111356, 111393, 111707, 111446, 109955, 107862, 106310, 105514, 104769, 103688, 102763, 102661, 103398, 104315, 104667, 104248, 103539, 103179, 103300, 103558, 103719, 103851, 103961, 103936, 103935, 104353, 105129, 105643, 105514, 105098, 104871, 104788, 104621, 104440, 104361, 104159, 103629, 103045]
54580A03045k36M0l3j27L2J74rl39m54k79j2J66J39j28m84o69n49j15O08J370
54560A02140J558Q09k81o30kO42M05m22q46m47L15Q29R78R64R29Q43O63L59j02
54541A08704o03q03m72P4K38o1k06J27L76n7o88o00Q1L14j71m07K07R05P81J70
54521A07909l2K00K17j32l64k02J67N54Q21P11K02j93p2J69j6k43L30J555K195
54502A13776J522K48m95n17m79p66r68n78K02O27L91J26N04J097Q37l84j337j024
54484A12782J09R84J256J229J045O69L38K28O1m01p80o97n13p08r41o14k3N8l00
54465A13782l05J77M38K13P8L06L33k02o90m43K45M81m6q00j102q38m17j99p4
54446A10937K74P16P01J22l37j57K39K35N7L04P85P67K15j36M1K65J71J9J25L94
$$ y = [103045, 102809, 102849, 102816, 102689, 102721, 102895, 102886, 102547, 102093, 101814, 101802, 101968, 102107, 101979, 101495, 100826, 100277, 100162, 100770, 102140, 103698, 104507, 104226, 103596, 103594, 104236, 104641, 104219, 103373, 102926, 103241, 104070, 105048, 106012, 106941, 107784, 108447, 108806, 108704, 108101, 107298, 106826, 106900, 107138, 107077, 106871, 106998, 107374, 107317, 106629, 106029, 106110, 106424, 106253, 105846, 106053, 106958, 107739, 107909, 107877, 108077, 108294, 108162, 107798, 107596, 107763, 108317, 109138, 109849, 110051, 109858, 109786, 109955, 109939, 109696, 110026, 111581, 113776, 115298, 115546, 115051, 114534, 114055, 113289, 112321, 111743, 111945, 112572, 112963, 113089, 113593, 114690, 115527, 115143, 113806, 112782, 112891, 113875, 115131, 116360, 117405, 118074, 118412, 118640, 118701, 118300, 117520, 116823, 116310, 115602, 114661, 114047, 114024, 114082, 113782, 113477, 113654, 114092, 114305, 114383, 114689, 115022, 114820, 114130, 113687, 113932, 114413, 114367, 113567, 112465, 111627, 111210, 111011, 110937, 111211, 111927, 112628, 112750, 112413, 112256, 112495, 112730, 112787, 113091, 113876, 114643, 114858, 114722, 114763, 115028, 115199, 115218, 115343, 115737]
54426A15737O42Q23Q08M99J92L26P71R96Q55O91O76O89P63R98J037M84k28k55
54408A26504L53O67L51J11M19P39N45J57L6m3m37q91r51o73l53NM32O32L01m21
54388A27483j172j665j565n67R43J890J563M00o53j134j085o02J40P83J104J184
54372A27047R86K30r25j613j237l38J20l0k55l05m24o54n97j8P72J269J258R09
54354A26195O11O80J020J156P72J27k66k57q5R0L93R24J474J634J246O35L24M95
54336A37168Q37J035J161J375J487J246Q26N64L35k30r34j096n51L8J22j0K22
54319A43595Q48J364J341Q09L01M89J428K235K080J409J441K316K705J628j82
54304A63807j330j532j536j777j883j458o59l3k6o30j341j658j701j960k369k247
$$ y = [115737, 116379, 117202, 118010, 118509, 118701, 119027, 119798, 120794, 121649, 122340, 123016, 123705, 124468, 125466, 126503, 126987, 126759, 126504, 126857, 127524, 127875, 127986, 128405, 129144, 129689, 129846, 129882, 129839, 129402, 128511, 127560, 126887, 126534, 126539, 126971, 127603, 127904, 127483, 126311, 124646, 123081, 122514, 123457, 125347, 126910, 127310, 126657, 125523, 124438, 123836, 123976, 124759, 125863, 127047, 128033, 128263, 127338, 125725, 124488, 124150, 124270, 124240, 123985, 123680, 123256, 122602, 122005, 121987, 122759, 124028, 125286, 126195, 126806, 127486, 128506, 129662, 130434, 130561, 130295, 130038, 129953, 130043, 130436, 131360, 132834, 134468, 135714, 136349, 136673, 137168, 138005, 139040, 140201, 141576, 143063, 144309, 145135, 145699, 146034, 145804, 144870, 143774, 143223, 143261, 143383, 143373, 143595, 144443, 145807, 147148, 147957, 148258, 148747, 150175, 152410, 154490, 155899, 157340, 159656, 162361, 163989, 163807, 162477, 160945, 159409, 157632, 155749, 154291, 153632, 153599, 153573, 152943, 151602, 149944, 148243, 146283, 143914, 141667]
54288A41667j381n00k91n52p95r92j166r19j11N33L48k11k94j5r3m75m38M2J51
54269A34508l54o48j31O39P67J70n04o53q9Q63J418R22k51r17m87K88L86k39r05
54250A34783j300j633j901j764j145m16J91Q20J433J530Q46N2J62J194K013J666
54234A36531N77n2K47P45N71k12p67n07L33R72Q53J75k73M0P33R40L65l67n28
54215A40376j22L03M14L58M01O00P65O34J77j60K16J250K001J561J30j116j252
54198A46536m71K79K97k68o72l83L41P40M25k15n68m68j47K48O89R27N59m29j491
54179A45929k033j906j301m17N04R66N00o40j381q49N27J279N53q47j426p29K81
54162A39010N69J10m72q22j033j176j149r19o39m07j48J96M89N19L65L89Q05J240
$$ y = [141667, 140286, 139786, 139495, 138943, 138148, 137156, 135990, 135071, 134960, 135493, 135841, 135630, 135336, 135321, 135228, 134753, 134315, 134357, 134508, 134154, 133506, 133375, 134014, 134781, 134951, 134447, 133794, 133705, 134568, 135986, 136908, 136657, 135740, 135253, 135541, 135927, 135688, 134783, 133483, 131850, 129949, 128185, 127040, 126624, 126815, 127635, 129068, 130598, 131444, 131496, 131658, 132852, 134865, 136531, 137108, 137056, 137303, 138048, 138619, 138407, 137640, 137133, 137466, 138438, 139291, 139466, 139193, 139233, 139966, 140906, 141271, 140904, 140376, 140254, 140557, 140971, 141329, 141730, 142330, 143095, 143729, 143906, 143746, 143962, 145212, 147213, 148774, 148904, 147788, 146536, 146065, 146344, 146641, 146373, 145701, 145318, 145659, 146399, 146824, 146609, 146041, 145573, 145426, 145674, 146363, 147290, 147849, 147420, 145929, 143896, 141990, 140689, 140272, 140776, 141742, 142242, 141602, 140221, 139372, 139899, 141178, 141731, 140884, 139458, 138729, 139010, 139579, 139689, 139217, 138395, 137362, 136186, 135037, 134118, 133479, 133072, 132924, 133120, 133609, 134128, 134493, 134882, 135687, 136927]
54144A36927J061K24n48o49l86m40q30r48n57j25j00l74o23o79l96L23J111J304
54126A34295Q22M90J040K115K720K375J438N27L3O5M59Q44R86J014J066R20K94
54109A51503n73j046q88n67p34j484k268k423j742o22L26P63P81O14L41r2o52
54092A41237j034p55L87J844K571K046Q73Q6M6L40N43N71L95J0l43l68j33J46
54074A48462O01J351J835J351L14n9N10Q95L52k58K21J572K657K922K546J643
54058A66915L60o14n98M8L22q9o16q53r86j091q66k69J95J02m15j003j451j613
54040A57478j406j019p88p53o73n32o04q89r23m14L03O81O26M91N61P74Q97Q31
54022A54641P58R65J473J870J704J059N99Q74J652K081J624O94K57P37J568J889
$$ y = [136927, 137988, 138212, 137664, 137015, 136629, 136189, 135359, 134411, 133854, 133729, 133629, 133255, 132632, 131953, 131557, 131880, 132991, 134295, 135117, 135607, 136647, 138762, 141482, 143857, 145295, 145822, 145855, 145920, 146379, 147223, 148209, 149223, 150289, 151209, 151503, 150930, 149884, 148996, 148429, 147695, 146211, 143943, 141520, 139778, 139156, 139482, 140245, 141026, 141640, 141981, 141889, 141237, 140203, 139448, 139835, 141679, 144250, 146296, 147169, 147255, 147301, 147641, 148184, 148755, 149150, 149160, 148817, 148449, 148316, 148462, 149063, 150414, 152249, 153600, 153914, 153855, 154365, 155260, 155612, 155354, 155575, 157147, 159804, 162726, 165272, 166915, 167275, 166661, 166063, 166111, 166433, 166344, 165728, 164875, 163889, 162798, 161932, 161663, 161858, 161960, 161545, 160542, 159091, 157478, 156072, 155053, 154265, 153512, 152839, 152307, 151703, 150814, 149891, 149477, 149780, 150461, 151087, 151578, 152139, 152913, 153810, 154641, 155399, 156364, 157837, 159707, 161411, 162470, 163069, 163943, 165595, 167676, 169300, 169994, 170251, 170988, 172556, 174445]
54006A74445J519R73P23P53P70N29nn08m62J89P44N80J38L64J306K051K123K089
53988A88321K466K909K930K732K781L100L528M135M931N611N996O260O413O168
53974B48281N656N505N792N736N001M366M329M112L005J851J836K542K601J852
53960C02465J381J628J851J518R21K66o63j742k503l010l760m571m645l936l389
53945B81811l561m013m304m491m353l362j881j225j823k412j849p70m64r35j167
53930B45201p87k41L62J496L164M479M484K988M99k223m448n721o012n627m958
53915B32656m372l997l567k709j566q19q60j292j509j396j191r49o05l38m29p43
53899B06314p63k00O53J229J289J144J304J890K437K414J901J523J774K551L361
$$ y = [174445, 175964, 176937, 177660, 178413, 179183, 179712, 179707, 179199, 178737, 178926, 179670, 180250, 180388, 180752, 182058, 184109, 186232, 188321, 190787, 193696, 196626, 199358, 202139, 205239, 208767, 212902, 217833, 223444, 229440, 235700, 242113, 248281, 253937, 259442, 265234, 270970, 275971, 280337, 284666, 288778, 291783, 293634, 295470, 298012, 300613, 302465, 303846, 305474, 307325, 308843, 309764, 310030, 309367, 307625, 305122, 302112, 298352, 293781, 289136, 285200, 281811, 278250, 274237, 269933, 265442, 261089, 257727, 255846, 254621, 252798, 250386, 248537, 247767, 247303, 246368, 245201, 244414, 244173, 244535, 246031, 249195, 253674, 258158, 261146, 261645, 259422, 254974, 249253, 243241, 237614, 232656, 228284, 224287, 220720, 218011, 216445, 215626, 214766, 213474, 211965, 210569, 209378, 208429, 207824, 207486, 207057, 206314, 205551, 205351, 206004, 207233, 208522, 209666, 210970, 212860, 215297, 217711, 219612, 221135, 222909, 225460, 228821]
53884B28821L779L712L376L108L024K983K990L417M491N713O174N511M242L157
53870B84498K636K574K690K919L546M759O039O437N800N183N480O213O407O211
53856C51392O626P754Q485Q062P027O326O255O548O760O300M848L008J846J545
53842D32782J236M10m00p31j112k196l736n041n908o428o438n875n299n345n945
53827C79974o592p116p593p850p672p328p328p690p954p729o946n705m330l427
53813B84714l455m221n031n284m872m201l894m166m428l879k628j676j615j900
53799B33464j824j529j546j800j834j646j653j946k173k122j889j519r80m52k83
53784B10268n84j102j442j284n62L20P15M04j27l34k56k43l34k67KK13J83L8O1
$$ y = [228821, 232600, 236312, 239688, 242796, 245820, 248803, 251793, 255210, 259701, 265414, 271588, 277099, 281341, 284498, 287134, 289708, 292398, 295317, 298863, 303622, 309661, 316098, 321898, 327081, 332561, 338774, 345181, 351392, 358018, 365772, 374257, 382319, 389346, 395672, 401927, 408475, 415235, 421535, 426383, 429391, 431237, 432782, 434018, 434428, 434028, 433297, 432185, 429989, 426253, 421212, 415304, 408876, 402438, 396563, 391264, 385919, 379974, 373382, 366266, 358673, 350823, 343151, 335823, 328495, 320805, 312851, 305122, 298176, 292471, 288141, 284714, 281259, 277038, 272007, 266723, 261851, 257650, 253756, 249590, 245162, 241283, 238655, 236979, 235364, 233464, 231640, 230111, 228565, 226765, 224931, 223285, 221632, 219686, 217513, 215391, 213502, 211983, 211003, 210551, 210268, 209684, 208582, 207140, 205856, 205294, 205614, 206329, 206733, 206606, 206272, 206016, 205773, 205439, 205172, 205174, 205387, 205570, 205608, 205669]
53765B05669M33J013J395J344J137J198J457J531J456J642K036K045J533J139
53751B25028J315J752K191K970M141M870M568L997M279N268N839N604N282N370
53737B82474N432M952M150L699L960M689N186M783L473K001J064N75N6o33j283
53722C24578j813k259k515k590k856l498m049m025l789m092m960n740o046n993
53708B70353n611m787l831l357l488l739l722l397k719j695q32p55j310j671j491
53693B27948j261j412j738j894j825j496q50k63l81j151j732j636j342j319j192
53678B08456n22J79Q8o30r79m94L33R97J657K560L321L274K286R72J08oL76P43
53660B22719P25L60J07M52J359K209K465K278K177K234J974J244O50Q23J585K281
$$ y = [205669, 206102, 207115, 208510, 209854, 210991, 212189, 213646, 215177, 216633, 218275, 220311, 222356, 223889, 225028, 226343, 228095, 230286, 233256, 237397, 242267, 246835, 250832, 255111, 260379, 266218, 271822, 277104, 282474, 287906, 292858, 297008, 300707, 304667, 309356, 314542, 319325, 322798, 324799, 325863, 326438, 326494, 325861, 324578, 322765, 320506, 317991, 315401, 312545, 309047, 304998, 300973, 297184, 293092, 288132, 282392, 276346, 270353, 264742, 259955, 256124, 252767, 249279, 245540, 241818, 238421, 235702, 234007, 233175, 232420, 231110, 229439, 227948, 226687, 225275, 223537, 221643, 219818, 218322, 217472, 217209, 216828, 215677, 213945, 212309, 210967, 209648, 208456, 207934, 208113, 208201, 207571, 206592, 206098, 206431, 207428, 209085, 211645, 214966, 218240, 220526, 221498, 221606, 221600, 221976, 222719, 223444, 223804, 223911, 224363, 225722, 227931, 230396, 232674, 234851, 237085, 239059, 240303, 240953, 241776, 243361, 245642]
53644B45642K633K804K848K644K310K160K213K214K155K342K867L365L484L247
53630B82928K859K398J854J229N16k74r86j410j476j229o92P2P34Q98M57l91j339
53613B86148j984j821p31O12J226Q24Pn16n60l31q3N8J66N33J211J716J506P79
53595B88760K89L41M47J73k03j64K81O91Q26Q49J006J323J618J700J593J574J794
53578C02898J997J772J131N57M70Q12J208J348J220J078J176J377J213N75Q5M12
53562C19329J400K315K789K990K984K602J975J582J563J573J476J642K277L003
53548C49500L395L499L502L374L129K967K798K132R10m7k4N63P63M65M05Q76J237
53531C79444Q38j13r19j172r19m27l6n8m67q73r72r28j092j480j834k036k184
$$ y = [245642, 248275, 251079, 253927, 256571, 258881, 261041, 263254, 265468, 267623, 269965, 272832, 276197, 279681, 282928, 285787, 288185, 290039, 291268, 291784, 291510, 290524, 289114, 287638, 286409, 285717, 285789, 286523, 287421, 287878, 287487, 286148, 284164, 282343, 281612, 282224, 283450, 284274, 284281, 283765, 283205, 282874, 282791, 282849, 283015, 283548, 284759, 286475, 287981, 288760, 289049, 289390, 289837, 290010, 289807, 289643, 289924, 290615, 291441, 292290, 293296, 294619, 296237, 297937, 299530, 301104, 302898, 304895, 306667, 307798, 308355, 308825, 309637, 310845, 312193, 313413, 314491, 315667, 317044, 318257, 318832, 318917, 319329, 320729, 323044, 325833, 328823, 331807, 334409, 336384, 337966, 339529, 341102, 342578, 344220, 346497, 349500, 352895, 356394, 359896, 363270, 366399, 369366, 372164, 374296, 375206, 375159, 375135, 375698, 376461, 376926, 377331, 378207, 379444, 380282, 380169, 379250, 378078, 377159, 376732, 376696, 376638, 376171, 375298, 374326, 373398, 372306, 370826, 368992, 366956, 364772]
53514C64772k190j711p47R8K16k29n63n45n81r17j110o61K26Q55Q85N70L15L00
53496C58983M64N77L99K1o0M87J318J784J724J516J453J443J385J401J590J934
53480C76419K480L316M241M780M738M475M507M968N619O186O566O773O897P111
53466D49076P623Q503R461R980R946J0023J0975J2537J3575J3605J3474J4047
53454E82825J4956J5408J5706J6779J8558J9930K0371K0450K0477J9893J8517
53443G83870J7406J7597J8639J9240J8921J8296J7934J7746J7396J6740J5907
53432I79692J5322J5511J6430J7141J6684J5326J4413J4847J6003J6507J5732
53421A153608J4317J3238J2751J2492J2245J2155J2091J1335R385O797M729L709
$$ y = [364772, 362582, 360871, 360124, 360222, 360438, 360209, 359646, 359101, 358520, 357603, 356493, 355832, 356058, 356913, 357798, 358368, 358683, 358983, 359447, 360024, 360423, 360444, 360384, 360871, 362189, 363973, 365697, 367213, 368666, 370109, 371494, 372895, 374485, 376419, 378899, 382215, 386456, 391236, 395974, 400449, 404956, 409924, 415543, 421729, 428295, 435068, 441965, 449076, 456699, 465202, 474663, 484643, 494589, 504612, 515587, 528124, 541699, 555304, 568778, 582825, 597781, 613189, 628895, 645674, 664232, 684162, 704533, 724983, 745460, 765353, 783870, 801276, 818873, 837512, 856752, 875673, 893969, 911903, 929649, 947045, 963785, 979692, 995014, 1010525, 1026955, 1044096, 1060780, 1076106, 1090519, 1105366, 1121369, 1137876, 1153608, 1167925, 1181163, 1193914, 1206406, 1218651, 1230806, 1242897, 1254232, 1263617, 1270414, 1275143, 1278852]
53409A278852L249K558J204q74l385n661p068p612p840q168q689r457j0425j1111
53395A205573j1091j0855j1430j2940j4261j4446j3789j3126j2787j2711j2888
53384A065249j3128j2850j1754j0332r242q526p875p185o351n053l315j832j094
53371I66712n81M59J848K840L358L998N015O087P037Q002Q891R450R964J1114
53357A044194J3014J5003J6565J7801J8888J9679K0185K0820K1848K3017K4042
53346A255056K5018K6053K6949K7581K8241K9231L0479L1916L3829L6336L8771
53335A589460M0240M0738M1153M2059M2997M3236M2810M2403M2369M2291M1615
53324B051371M0335L8888L7510L5979L3984L1577K9108K6809K4557K2146J9627
$$ y = [1278852, 1282101, 1284659, 1285863, 1284989, 1281604, 1275943, 1268875, 1261263, 1253423, 1245255, 1236566, 1227109, 1216684, 1205573, 1194482, 1183627, 1172197, 1159257, 1144996, 1130550, 1116761, 1103635, 1090848, 1078137, 1065249, 1052121, 1039271, 1027517, 1017185, 1007943, 999417, 991542, 984357, 978006, 972953, 969638, 967806, 966712, 966131, 966590, 968438, 971278, 974636, 978634, 983649, 989736, 996773, 1004775, 1013666, 1023116, 1033080, 1044194, 1057208, 1072211, 1088776, 1106577, 1125465, 1145144, 1165329, 1186149, 1207997, 1231014, 1255056, 1280074, 1306127, 1333076, 1360657, 1388898, 1418129, 1448608, 1480524, 1514353, 1550689, 1589460, 1629700, 1670438, 1711591, 1753650, 1796647, 1839883, 1882693, 1925096, 1967465, 2009756, 2051371, 2091706, 2130594, 2168104, 2204083, 2238067, 2269644, 2298752, 2325561, 2350118, 2372264, 2391891]
53313B391891J7192J4643J1319O908K185j632m452p563j1979j7036k1368k4779
53301B355329k8170l1740l4437l5597l6083l7093l8552l9505l9630l9455l9311
53290A955756l8942l8196l7294l6292l4952l3432l2502l2581l2990l2600l1132
53279A574843k9372k8200k7650k7086k6004k4448k2764k1188j9775j8487j7216
53268A312653j5849j4521j3628j3300j3038j2264j1231j0876j1591j2570j2670
53257A171115j1680j0398r687r716r974r737q605o778m861l316k216j377n04P82
53243A083048K565M296N254N521N968P024Q131Q781R503J1072J3167J4699J5315
53230A194344J5718J6486J7284J7568J7406J7174J6842J6081J4835J3410J1979
$$ y = [2391891, 2409083, 2423726, 2435045, 2441953, 2444138, 2442506, 2438054, 2430491, 2418512, 2401476, 2380108, 2355329, 2327159, 2295419, 2260982, 2225385, 2189302, 2152209, 2113657, 2074152, 2034522, 1995067, 1955756, 1916814, 1878618, 1841324, 1805032, 1770080, 1736648, 1704146, 1671565, 1638575, 1605975, 1574843, 1545471, 1517271, 1489621, 1462535, 1436531, 1412083, 1389319, 1368131, 1348356, 1329869, 1312653, 1296804, 1282283, 1268655, 1255355, 1242317, 1230053, 1218822, 1207946, 1196355, 1183785, 1171115, 1159435, 1149037, 1139350, 1129634, 1119660, 1109923, 1101318, 1094540, 1089679, 1086363, 1084147, 1082770, 1082266, 1083048, 1085613, 1089909, 1095163, 1100684, 1106652, 1113676, 1121807, 1130588, 1140091, 1151163, 1164330, 1179029, 1194344, 1210062, 1226548, 1243832, 1261400, 1278806, 1295980, 1312822, 1328903, 1343738, 1357148, 1369127]
53219A369127J0395Q559O710N109L569J622q41l278n075o204p181q540j0514j2937
53205A350521j5181j6460j6713j6973j8236k0082k1187k1138k0911k1326k2023
53194A140291k2354k2427k2608k2694k2351k1810k1425k1022k0409k0040k0320
53183I02831k0631k0065j8871j8158j8239j8289j7701j6867j6282j5724j4780
53172G07224j3537j2335j1317j0561j0260j0337j0269r711q991q671q793q920
53160E83522q821q758r045r610j0113j0422j0727j1168j1510j1425j0963j0455
53148D60505r988r386q692q260q220q320q416q630q763q284p200o355o273o389
53134C47329o087n835o415p442p693o746n371m386l963m016m377m541m076l307
$$ y = [1369127, 1379522, 1388081, 1394791, 1399900, 1403469, 1405091, 1404250, 1400972, 1395897, 1389693, 1382512, 1373972, 1363458, 1350521, 1335340, 1318880, 1302167, 1285194, 1266958, 1246876, 1225689, 1204551, 1183640, 1162314, 1140291, 1117937, 1095510, 1072902, 1050208, 1027857, 1006047, 984622, 963600, 943191, 923151, 902831, 882200, 862135, 843264, 825106, 806867, 788578, 770877, 754010, 737728, 722004, 707224, 693687, 681352, 670035, 659474, 649214, 638877, 628608, 618897, 609906, 601235, 592442, 583522, 574701, 565943, 556898, 547288, 537175, 526753, 516026, 504858, 493348, 481923, 470960, 460505, 450517, 441131, 432439, 424179, 415959, 407639, 399223, 390593, 381830, 373546, 366346, 359991, 353718, 347329, 341242, 335407, 328992, 321550, 313857, 307111, 301740, 297354, 293391, 289375, 284998, 280457, 276381, 273074]
53120B73074k942k997k891k576k564k780k463j526r77j423k113k113j720j854
53106B42135k556k951k504j558p03j26K70N24M75m5q96j591j730j423j065q05
53090B25451n80n70j011j602j672j077l91l6K07O14J008J109R58P25M90M22P39
53073B24784J246J399J047O55O10P56Q21Q42Q49P50P15J160K026K660K714K572
53057B45606K543K307J630R55P14O08K23j77j95j43n46j178j398j205j148j395
53041B47201j590j583j586j649j632j623j768j804j380p82o00p51o02j40j81j115
53025B28415k202k558k210j698j144l38M95P70L52j66k43q4l40j194k002j967
53009B13886j073j65q6p97j461j369o25L3N0l68m87P2Q27R80L91k33k00M56J169
$$ y = [273074, 270132, 267135, 264244, 261668, 259104, 256324, 253861, 252335, 251358, 249935, 247822, 245709, 243989, 242135, 239579, 236628, 234124, 232566, 231863, 231737, 232007, 232531, 233006, 232961, 232065, 230474, 228744, 227321, 226256, 225451, 224871, 224301, 223290, 221688, 220016, 218939, 218548, 218512, 218719, 219333, 220341, 221450, 222408, 223133, 223623, 224045, 224784, 226030, 227429, 228476, 229131, 229741, 230497, 231318, 232160, 233009, 233759, 234474, 235634, 237660, 240320, 243034, 245606, 248149, 250456, 252086, 253041, 253755, 254363, 254586, 254409, 254214, 254071, 253525, 252347, 250949, 249744, 248596, 247201, 245611, 244028, 242442, 240793, 239161, 237538, 235770, 233966, 232586, 231804, 231204, 230453, 229851, 229711, 229530, 228415, 226213, 223655, 221445, 219747, 218603, 218265, 218760, 219530, 219882, 219716, 219473, 219389, 219049, 217855, 215853, 213886, 212813, 212648, 212562, 211765, 210304, 208935, 208310, 208343, 208393, 208025, 207538, 207610, 208437, 209417, 209808, 209575, 209375, 209831, 211000]
52990B11000J470J252O95J69n9j12k67l52J66J222J826J229j1p13n49j76m2R7
52972B16845M47O79N08J77N6J69L64N72O39K41n96j266j235p63n56q13j085r86
52954B13397n86m9O76J467J729R77l20r70l72O60Q20j36j080q92K29J127J082
52937B17759M85J58M03R10J297J484J518J413J216J061J034J048J015J011J106
52922B32918J102O96k8n63n78k71N3M65J138J799J927J479R91Q47Q26N46Q1j80
52904B43248q4R2L8k29m53m88m82n99o95m65K6K73j2m76o41n82o79q92q45n01
52884B35554l13n71j082j556j851j816j320n87q0R6L01P59J186J237R05L59k80
52867B30941q08r78q00n21k28J25L46J96K9M56J250J326K71q81j037m76k27n23
$$ y = [211000, 212470, 213722, 214417, 214586, 214527, 214415, 214148, 213796, 213962, 215184, 217010, 218239, 218228, 217515, 216966, 216790, 216748, 216845, 217292, 217971, 218479, 218656, 218712, 218881, 219245, 219817, 220456, 220697, 220101, 218835, 217600, 216837, 216281, 215468, 214383, 213397, 212811, 212762, 213438, 214905, 216634, 217611, 217291, 216321, 215949, 216609, 217429, 217293, 216213, 215321, 215550, 216677, 217759, 218244, 218402, 218805, 219715, 221012, 222496, 224014, 225427, 226643, 227704, 228738, 229786, 230801, 231812, 232918, 234020, 234716, 234688, 234125, 233547, 233276, 233329, 233794, 234932, 236731, 238658, 240137, 241128, 241975, 242801, 243347, 243428, 243248, 243164, 243256, 243294, 243065, 242612, 242124, 241642, 241043, 240348, 239883, 239909, 240182, 240170, 239694, 239053, 238471, 237792, 236900, 236055, 235554, 235241, 234670, 233588, 232032, 230181, 228365, 227045, 226458, 226378, 226474, 226775, 227534, 228720, 229957, 230862, 231221, 230941, 230133, 229155, 228355, 227834, 227606, 227731, 228077, 228273, 228302, 228758, 230008, 231334, 231605, 230724, 229687, 229211, 228984, 228461]
52849B28461p25m76p8J50K00J09l1J23P54J307R59k86j450j640q90J12P28P73
52831B28100N44N26Q70J183J052N56L4m32q92j131q91l76m7N4K74O87R36Q53P64
52812B32664J016J545J963J949J460Q24N22O78Q31M99j58o02p34r81j608k338
52796B37530k687k468j917j551j786k424k737k330j642j196p29K01J056P45o96
52781B17369j830j607o83l80r38j445j188m37J15J27k22n18m65k3O32J237J490
52764B11234J149L47l19l44P3K79R4j6K21L76K2m81l30O99K002K807K796K085
52746B22694J003o5q53j430k075k787l058k363r18L63P44L97%j62l55p65j093
52729B09277j006m96L18J381K317K330J041p86j833j595p30j11O3P7J17P4j97
$$ y = [228461, 227736, 227260, 227182, 227332, 227532, 227641, 227610, 227733, 228487, 229794, 230753, 230467, 229017, 227377, 226487, 226599, 227327, 228100, 228644, 229170, 230040, 231223, 232275, 232831, 232865, 232433, 231541, 230410, 229519, 229143, 229096, 229150, 229424, 230111, 231047, 231900, 232664, 233680, 235225, 237188, 239137, 240597, 241421, 241943, 242621, 243452, 243951, 243793, 243191, 242457, 241476, 239868, 237530, 234843, 232375, 230458, 228907, 227121, 224697, 221960, 219630, 217988, 216792, 216063, 216264, 217320, 218065, 217369, 215539, 213932, 213249, 212869, 211931, 210486, 209298, 208861, 208976, 209103, 208881, 208363, 207898, 207875, 208507, 209744, 211234, 212383, 212730, 212411, 212067, 212140, 212419, 212513, 212497, 212718, 213094, 213116, 212635, 212305, 213004, 215006, 217813, 220609, 222694, 223697, 223632, 222779, 221349, 219274, 216487, 213429, 211066, 210148, 210511, 211255, 211652, 211652, 211490, 211135, 210370, 209277, 208271, 207775, 208093, 209474, 211791, 214121, 215162, 214376, 212543, 210948, 210218, 210107, 210170, 210247, 210364, 210438, 210241]
52712B10241o10q50p09m12l78n67m43J91P25N54pj53K30N09M35N17J159J914K011
52693B14357J324M88J93N61J121J346J227J193J404J475J124P53Q99J360J509
52678B30334J284J189J361J372J055Q33R90J182J008O14L13O9l23p62r34p74o53
52661B38158j014j839k409j939o48K53L2n22k40P03J151Q04M52M10O1p48j175
52644B31490q64p21j307j645p17P55J303Q59N29O17L36n58j190r16j92K77L84
52627B28440K53j85q33j194r58m36j32k16n59q51o23L41J447J726J051K85J8j84
52609B27390q05j387j249o88n22o57j14J374K688K681J607O54M58P03J018J516
52593B34667K333L060L005J922K70j161j786j587j058p76r01j181j394j537j509
$$ y = [210241, 209631, 208781, 208072, 207660, 207282, 206715, 206272, 206463, 207188, 207742, 207735, 207582, 207812, 208321, 208756, 209273, 210432, 212346, 214357, 215681, 216169, 216362, 216923, 218044, 219390, 220617, 221810, 223214, 224689, 225813, 226566, 227465, 228825, 230334, 231618, 232807, 234168, 235540, 236595, 237428, 238418, 239600, 240608, 241222, 241535, 241604, 241281, 240519, 239585, 238811, 238158, 237144, 235305, 232896, 230957, 230309, 230562, 230594, 230072, 229832, 230535, 231686, 232490, 232942, 233352, 233413, 232665, 231490, 230626, 229905, 228598, 226953, 226236, 226991, 228294, 229153, 229682, 230299, 230635, 230077, 228887, 227971, 227779, 228056, 228440, 228693, 228508, 227675, 226481, 225523, 225087, 224955, 224739, 224180, 223329, 222706, 223047, 224494, 226220, 227271, 227556, 227574, 227390, 226585, 225198, 223949, 223261, 222739, 222082, 221968, 223342, 226030, 228711, 230318, 230972, 231430, 232133, 233151, 234667, 237000, 240060, 243065, 244987, 245257, 244096, 242310, 240723, 239665, 238889, 237988, 236807, 235413, 233876, 232367]
52578B32367r58J98J320J571R27K16J45O25J172J611K048K391K272J448J72r42
52562B46583j391j176p54n67o54q36j055j388j759j974k005j906j527o68M23J120
52546B30466J166R61R24R33P09L71K22K64K88L38O10J024J246J101P24K63k34
52529B41376o74q51o54j51M95J077J396J401J266J144R33M75j13n44p31q39r33
52512B44073q41m55M3L65M21K82J7l51p28q96o69p9N49P68L44m87j164j234p62
52493B39196k48j49m21o42m92o8K92L58J13k63l95O2R16J401R59mn83n07l78p22
52473B38425j252j363r23k49M01R60J281J164O88K60K08M23M88J65k59k34L92
52456B40575J060J103N87K81P31J663K350K353J781J065O65P45J026J042O30j7
$$ y = [232367, 231409, 231607, 232927, 234498, 235425, 235641, 235786, 236411, 237583, 239194, 241242, 243633, 245905, 247353, 247525, 246583, 245192, 244016, 243262, 242695, 242041, 241205, 240150, 238762, 237003, 235029, 233024, 231118, 229591, 228923, 229346, 230466, 231632, 232593, 233517, 234450, 235159, 235530, 235752, 236016, 236304, 236642, 237252, 238276, 239522, 240623, 241347, 241610, 241376, 240702, 239851, 239197, 239046, 239541, 240618, 242014, 243415, 244681, 245825, 246758, 247233, 247120, 246576, 245845, 245006, 244073, 243232, 242777, 242820, 243185, 243606, 243888, 243905, 243554, 242826, 241930, 241261, 241182, 241731, 242499, 242843, 242356, 241192, 239958, 239196, 238948, 238799, 238378, 237736, 237244, 237176, 237468, 237826, 237939, 237676, 237281, 237343, 238259, 239660, 240619, 240615, 240032, 239525, 239147, 238425, 237173, 235810, 234887, 234638, 235039, 235999, 237280, 238444, 239132, 239392, 239600, 240023, 240511, 240676, 240417, 240183, 240575, 241635, 242738, 243325, 243606, 244337, 246000, 248350, 250703, 252484, 253549, 254214, 254959, 255985, 257027, 257657, 257640]
52440B57640p02j330j687j522j047q41j086j232p73jM07K61j06n03j021j614j949
52423B42894j814j322p17j40L56P64J087J186Q26J33k03M41J700K427J981J037
52407B50636Q14J641K610K672J774P67L80N90R40J120J043O35q0p59r67p06m63
52390B62647o47j180j691j891j717j297q37m44j06P8j50p33j041n54K82M64k63
52373B50920j155j544j509j227m89O59J484J475J217J622K512K742J705J02q99
52358B57615q07M0J017J667J774J362P31M67J098K457L599L803L572M006N170
52343B87571N788M907L120J576N05n81j702k377k560k761l175l420l229k801k361
52328B78500j823j125m87j61j24j08K39J072K098K666K426J702J069P32O45Q72
$$ y = [257640, 256938, 255608, 253921, 252399, 251352, 250511, 249425, 248193, 247420, 247419, 247826, 248087, 247981, 247478, 246457, 244843, 242894, 241080, 239758, 239041, 238901, 239257, 240021, 241108, 242294, 243120, 243253, 243050, 243491, 245191, 247618, 249599, 250636, 251450, 253091, 255701, 258373, 260147, 260914, 261294, 261884, 262824, 263944, 264987, 265622, 265542, 264783, 263816, 263110, 262647, 262000, 260820, 259129, 257238, 255521, 254224, 253387, 252943, 252837, 252915, 252765, 252032, 250991, 250437, 250719, 251183, 250920, 249765, 248221, 246712, 245485, 244996, 245655, 247139, 248614, 249831, 251453, 253965, 256707, 258412, 258514, 257615, 256808, 256848, 257865, 259532, 261306, 262668, 263399, 263866, 264964, 267421, 271020, 274823, 278395, 282401, 287571, 293359, 298266, 301386, 302962, 303467, 302886, 301184, 298807, 296247, 293486, 290311, 286891, 283662, 280861, 278500, 276677, 275552, 275065, 274904, 274780, 274672, 274911, 275983, 278081, 280747, 283173, 284875, 285944, 286676, 287321, 288193]
52312B88193J442K079K514K840L163L178K634J925J647J740J703J433J269J303
52298C17063J367J551J995K288J901J231J260K042K428J716P09N54J216J790J886
52283C40997J963K488L331M033M292M196M101M348M925N518N869O017O208O729
52269D05015P670Q717R341R523R969J1220J2740J3532J3407J3026J2801J2591
52257E39552J2480J2856J3522J3668J3174J3068J4048J5366J5935J5875J6097
52246F95641J6746J7029J6478J5466J4469J3534J2702J2322J2574J2917J2416
52235H52294J0664Q304O459N540M795L321J336j49q05j357k209k684k250j691
52221H81568k113l234l739l094k004j102k80N55J106J482K449M257N926O454O201
$$ y = [288193, 289635, 291714, 294228, 297068, 300231, 303409, 306043, 307968, 309615, 311355, 313058, 314491, 315760, 317063, 318430, 319981, 321976, 324264, 326165, 327396, 328656, 330698, 333126, 334842, 335551, 336105, 337321, 339111, 340997, 342960, 345448, 348779, 352812, 357104, 361300, 365401, 369749, 374674, 380192, 386061, 392078, 398286, 405015, 412685, 421402, 430743, 440266, 450235, 461455, 474195, 487727, 501134, 514160, 526961, 539552, 552032, 564888, 578410, 592078, 605252, 618320, 632368, 647734, 663669, 679544, 695641, 712387, 729416, 745894, 761360, 775829, 789363, 802065, 814387, 826961, 839878, 852294, 862958, 871262, 877721, 883261, 888056, 891377, 892713, 892564, 891759, 890402, 888193, 885509, 883259, 881568, 879455, 876221, 872482, 869388, 867384, 866282, 866002, 866557, 867663, 869145, 871594, 875851, 881777, 888231, 894432]
52206H94432O271O888P271P052O901P519Q682R700J0324J0763J1069J1110J0998
52193A008980J1069J1287J1101J0066Q451O904N686M484L010J503M58m8n45j573
52179A080833l067m473n456o250p187q155q744q797q505q063p593p390p782q552
52165I80819q953q540p665o869o154n251m264l514k938k223j459j073j039o96
52151I20181M00J933L253L983L991L213J947J024J165K144K981K958K350J969
52137I53492K244K896L468L889M346M749M690L981L023K394K241K177J671M28
52123I95689j372l049l892l849l621l820m355m835n206n538n569n027m323m180
52109I37053m581m625l600j790p8R23J168R84P85Q12J052J407J793K000J730J081
$$ y = [894432, 900703, 907591, 914862, 921914, 928815, 936334, 945016, 954716, 965040, 975803, 986872, 997982, 1008980, 1020049, 1031336, 1042437, 1052503, 1060954, 1067858, 1073544, 1078028, 1081038, 1082541, 1082999, 1082951, 1082406, 1080833, 1077766, 1073293, 1067837, 1061587, 1054400, 1046245, 1037501, 1028704, 1020199, 1012136, 1004543, 997153, 989371, 980819, 971866, 963326, 955661, 948792, 942638, 937387, 933123, 929609, 926671, 924448, 922989, 921916, 920877, 920181, 920581, 922514, 925767, 929750, 933741, 936954, 938901, 939925, 941090, 943234, 946215, 949173, 951523, 953492, 955736, 958632, 962100, 965989, 970335, 975084, 979774, 983755, 986778, 989172, 991413, 993590, 995261, 995689, 994317, 991268, 987376, 983527, 979906, 976086, 971731, 966896, 961690, 956152, 950583, 945556, 941233, 937053, 932472, 927847, 924247, 922457, 922379, 923302, 924470, 925454, 926239, 927051, 928103, 929510, 931303, 933303, 935033, 936114]
52093I36114O11O05N95J98n3N58J618J947J233M12K73N91Q37R99J241J542J973
52076I51294K693L375L366K765K647L694N236O263O760P443Q657J0188J1827J3467
52062A039675J4877J5881J6627J7310J7865J8218J8516J8772J8695J8214J7743
52051A232393J7563J7385J6927J6353J5765J4784J3266J1795J0852R997Q630P062
52039A392772N962N143L897K214O61q49k990n717q010r237r871j0522j1099j1343
52025A341011j1472j1715j1702j0953r671q537p892p435o699n536m227l172k449
52012A239551j624j86J819L811N294O208O713P015P428Q263R387J0220J0373J0067
51998A324339R777R693R714R768R798R508Q423O333L642J098q36k339l903n693
$$ y = [936114, 936725, 937330, 937925, 938123, 938070, 938628, 940246, 942193, 943426, 943838, 944111, 944702, 945539, 946538, 947779, 949321, 951294, 953987, 957362, 960728, 963493, 966140, 969834, 975070, 981333, 988093, 995536, 1004193, 1014381, 1026208, 1039675, 1054552, 1070433, 1087060, 1104370, 1122235, 1140453, 1158969, 1177741, 1196436, 1214650, 1232393, 1249956, 1267341, 1284268, 1300621, 1316386, 1331170, 1344436, 1356231, 1367083, 1377080, 1385710, 1392772, 1398734, 1403877, 1407774, 1409988, 1410649, 1409800, 1406810, 1401093, 1393083, 1383846, 1373975, 1363453, 1352354, 1341011, 1329539, 1317824, 1306122, 1295169, 1285498, 1276961, 1269069, 1261634, 1254935, 1249399, 1245172, 1242000, 1239551, 1237927, 1237741, 1239560, 1243371, 1248665, 1254873, 1261586, 1268601, 1276029, 1284292, 1293679, 1303899, 1314272, 1324339, 1334116, 1343809, 1353523, 1363291, 1373089, 1382597, 1391020, 1397353, 1400995, 1402093, 1401257, 1398918, 1395015, 1389322]
51984A389322p410q790r980j1233j2426j3201j3477j3554j3667j3748j3654j3485
51972A244697j3444j3508j3404j3018j2693j2876j3416j3494j2612j1356j0805
51961A104071j1219j1836j1985j1846j1854j1884j1477j0552r553r010r178r874
51949I73803j0542j0738j0730j1290j2693j4358j5630j6448j6880j6594j5368
51938H22532j3746j2621j2286j2311j2163j1638j0992j0913j1931j3526j4350
51927F86055j3829j2930j2743j2957j2563j1544j0802j0696j0745j0625j0430
51916E56191r987q901p402o193n308m069k371j031m81o0Q74J922K363K261K194
51901E20002K296K260K072K107K510K917K849K239J577J578K574M269O109P791
$$ y = [1389322, 1381912, 1373122, 1363142, 1351909, 1339483, 1326282, 1312805, 1299251, 1285584, 1271836, 1258182, 1244697, 1231253, 1217745, 1204341, 1191323, 1178630, 1165754, 1152338, 1138844, 1126232, 1114876, 1104071, 1092852, 1081016, 1069031, 1057185, 1045331, 1033447, 1021970, 1011418, 1001865, 992855, 983677, 973803, 963261, 952523, 941793, 930503, 917810, 903452, 887822, 871374, 854494, 837900, 822532, 808786, 796165, 783879, 771568, 759405, 747767, 736775, 725862, 713931, 700405, 686055, 672226, 659296, 646553, 633596, 621033, 609489, 598687, 587991, 577246, 566621, 556191, 546204, 537303, 529901, 523708, 518400, 514331, 511960, 510929, 510448, 510388, 511262, 513184, 515547, 517808, 520002, 522298, 524558, 526630, 528737, 531247, 534164, 537013, 539252, 540829, 542407, 544981, 549250, 555359, 563150]
51887E63150R230J0315J1027J1464J1318R696O194J970j129k506l092l693m068
51874F19876l947l932m673n809o452o367o139o329o945p611q031q365r097j0310
51860E25869j1297j1403j1041j1110j1426j0782q778o565n309m829m426m037l803
51847D21063l268k105r87p58j029p03L47J119R35J32p97j818k928l807m255m489
51831C96652m665m549l908k938k044j342n94M12J432J817J203K12J07J428L294
51816C86517M363M239L556K984K679K539K411K076J419O82J68j81o18j117j434
51801D10283j526j504j308r04n99o32o13j1Q47J030L32m42p84j296k654m367n320
51784C90532n244m857m717m602m209l787l685l588k818j289J92P80M87Lj65o3
$$ y = [563150, 572380, 582695, 593722, 605186, 616504, 626200, 632394, 634364, 633235, 630729, 627637, 623944, 619876, 615929, 611997, 607324, 601515, 595063, 588696, 582557, 576228, 569283, 561672, 553641, 545276, 536179, 525869, 514572, 503169, 492128, 481018, 469592, 458810, 450032, 443467, 438158, 433329, 428903, 424866, 421063, 417795, 415690, 414703, 413945, 412916, 412213, 412560, 413679, 414614, 414746, 413949, 412131, 409203, 405396, 401141, 396652, 391987, 387438, 383530, 380592, 378548, 377206, 376612, 377024, 378456, 380273, 381476, 381688, 381795, 383223, 386517, 390880, 395119, 398675, 401659, 404338, 406877, 409288, 411364, 412783, 413465, 413633, 413452, 412834, 411717, 410283, 408757, 407253, 405945, 405041, 404442, 403810, 403197, 403186, 404033, 405063, 405395, 404953, 404169, 402873, 400219, 395852, 390532, 385288, 380431, 375714, 371112, 366903, 363116, 359431, 355843, 353025, 351736, 351928, 352708, 353195, 353198, 353033, 352970]
51768C52970Q5K16K58Rn07q41o21r6J42q2m50p17r53j132r68l99Q7L9k79j89M43
51747C47015R63P72J16k92k22r7k77n32m11J58R01J576K080K317K231J881J242
51730C59421J39j273k267k257j625j252j283j077m64k16q59j753j917j202r8J184
51714C43201K582L548L447K545J903K126K845L472L842L916L484K553J594J046
51700C82104P79M03j58o64j072j632k473l269l504l081k542k586l270l868l637
51685C51530k650j673j297j422j486j031M0J428K623L258L368L282L239L223L156
51670C65588L056K969K847K621K321K153K304K651K703K016O99o98j757k412k614
51655C84447k210j351o36n20q25j123j288j391j358j158j038j113r81k80N79Q32
$$ y = [352970, 353055, 353271, 353529, 353538, 353031, 352190, 351569, 351473, 351615, 351533, 351083, 350366, 349413, 348281, 347313, 346914, 347001, 347040, 346761, 346572, 347015, 347978, 348750, 348866, 348574, 348352, 348255, 347978, 347446, 347035, 347193, 348094, 349670, 351750, 354067, 356298, 358179, 359421, 359560, 358287, 356020, 353763, 352138, 350886, 349603, 348526, 348062, 347846, 346987, 345234, 343317, 342115, 342017, 343201, 345783, 349331, 352778, 355323, 357226, 359352, 362197, 365669, 369511, 373427, 376911, 379464, 381058, 382104, 382883, 383286, 383128, 382464, 381392, 379760, 377287, 374018, 370514, 367433, 364891, 362305, 359035, 355167, 351530, 348880, 347207, 345910, 344488, 343002, 341971, 342011, 343439, 346062, 349320, 352688, 355970, 359209, 362432, 365588, 368644, 371613, 374460, 377081, 379402, 381555, 383859, 386510, 389213, 391229, 391928, 391230, 389473, 387061, 384447, 382237, 380886, 380250, 379730, 378905, 377782, 376494, 375103, 373745, 372587, 371549, 370436, 369455, 369175, 369754, 370586]
51639C70586M04j04m33r25j671k174k113j865j804j692j160m51j75n75j353j988
51623C52507j969j059K55R14L81o18q91j76P82J343J603J803J795J415J043J330
51607C60458K468L985N257O002O258O030N143L476J302p62k185k858k976k662
51593C88936j898p51N74J874L025L791L766K728R31j045k763m090n038n646o063
51578C78331o456o739o627o065n384m837m194l167k087j620j809j879j255l72
51564C25840j20o89j405j633j439j296j385j400j025m72l63r48j548j175J90J357
51548C12489J274L09k60J86J075J631J839K210L023M059M960N634O326P287Q298
51533C60340Q595P540N339K844P25q20j684j711j154o92o49n25K41J372K083K188
$$ y = [370586, 370990, 370886, 370453, 369528, 367857, 365683, 363570, 361705, 359901, 358209, 357049, 356598, 356423, 355848, 354495, 352507, 350538, 349479, 349734, 350648, 351029, 350411, 349520, 349344, 350126, 351469, 353072, 354875, 356670, 358085, 359128, 360458, 362926, 366911, 372168, 378170, 384428, 390458, 395601, 399077, 400379, 399617, 397432, 394574, 391598, 388936, 387038, 386287, 386861, 388735, 391760, 395551, 399317, 402045, 402976, 401931, 399168, 395078, 390040, 384394, 378331, 371875, 365136, 358509, 352444, 347060, 342223, 338029, 334862, 332775, 331155, 329346, 327467, 326212, 325840, 325720, 325031, 323626, 321993, 320554, 319258, 317873, 316473, 315448, 314976, 314613, 313665, 312117, 310942, 311132, 312489, 313763, 314072, 313812, 313998, 315073, 316704, 318543, 320753, 323776, 327835, 332795, 338429, 344755, 352042, 360340, 368935, 376475, 381814, 384658, 385383, 384563, 382879, 381168, 380014, 379322, 378673, 378148, 378389, 379761, 381844, 384032]
51517C84032K330L126M454N716O516O921P207P540P779P612O973O252N913N949
51503D68320O006O015O440P742R826J2193J4398J6100J6949J6706J5504J3684
51491F09883J1506R182P118N605M270K190j132n127q737j1472j3607j5483j6965
51478E77231j7669j7509j6840j6098j5392j4490j3297j2208j1767j1834j1514
51467D18613j0141q156o582n814n361m685l800k929k089j314r07j136j788k345
51453C61566k457k152j705j457j586j849j746j111m39l78r89j615j512n06P93
51438C42857J482J181M72K41N87O71j16j299j916j656j038o58p07j097j593j870
51422C35541j799j714k038k590k656j948j138j184k193l276l518k880k019j369
$$ y = [384032, 386362, 389488, 393942, 399658, 406174, 413095, 420302, 427842, 435621, 443233, 450206, 456458, 462371, 468320, 474326, 480341, 486781, 494523, 504349, 516542, 530940, 547040, 563989, 580695, 596199, 609883, 621389, 630571, 637689, 643294, 647564, 649754, 648622, 643495, 634758, 623286, 609679, 594196, 577231, 559562, 542053, 525213, 509115, 493723, 479233, 465936, 453728, 441961, 430127, 418613, 408472, 400316, 393734, 387920, 382559, 377874, 374074, 371145, 369056, 367742, 366835, 365699, 363911, 361566, 359109, 356957, 355252, 353795, 352209, 350360, 348614, 347503, 347064, 346686, 345697, 344082, 342570, 342064, 342857, 344339, 345520, 345992, 346233, 346820, 347491, 347375, 346076, 344160, 342504, 341466, 340808, 340101, 339004, 337411, 335541, 333742, 332028, 329990, 327400, 324744, 322796, 321658, 320474, 318281, 315005, 311487, 308607, 306588, 305219]
51408C05219q22k42J32J78L55J039J646J204j58j118q63m6M35Q22J798L070L656
51391C16305L387L163L643M479N030N164N142N165N235N159M639L641K677K262
51377C75091K171J659M42j004k065k524k542k562l171m444n565n610m768m041
51363C41067l830l578k899k217j941j773j326p49k95J58O87R70Q62Q38J309J976
51347C29259K368K610L081L587L564K904K065J487J347J714K506L369L970M290
51333C68121M430M405M412M845N670O193O026N880O761Q644J0553J1810J2511
51320D60261J3065J3908J5522J7932K0225K1353K1329K0886K0015J7841J4168
51309F56505J0032O303K620j569n717q807j0841j2797j5240j7693j9336j9807
$$ y = [305219, 304397, 304155, 304287, 304465, 304820, 305859, 307505, 308709, 308551, 307433, 306570, 306524, 306959, 307781, 309579, 312649, 316305, 319692, 322855, 326498, 330977, 336007, 341171, 346313, 351478, 356713, 361872, 366511, 370152, 372829, 375091, 377262, 378921, 379363, 378359, 376294, 373770, 371228, 368666, 365495, 361051, 355486, 349876, 345108, 341067, 337237, 333659, 330760, 328543, 326602, 324829, 323503, 322754, 322459, 322617, 323304, 324274, 325136, 325974, 327283, 329259, 331627, 334237, 337318, 340905, 344469, 347373, 349438, 350925, 352272, 353986, 356492, 359861, 363831, 368121, 372551, 376956, 381368, 386213, 391883, 398076, 404102, 409982, 416743, 425387, 435940, 447750, 460261, 473326, 487234, 502756, 520688, 540913, 562266, 583595, 604481, 624496, 642337, 656505, 666537, 672840, 675460, 673891, 668174, 659367, 648526, 635729, 620489, 602796, 583460, 563653]
51297E63653j9321j8488j7993j8046j8063j7237j5447j3355j1632j0417r494q648
51285C85512p842p216o928o849o546n831n128m920m966m574l588k604k088j848
51271C14584j574j355j323j205p16j13J34L9l0m2l81j120j714j560o69L75R69
51254C04299R67Q33J238K241K993K555J083k82p58o71o90q33o53p7M95P36N88
51237C14064L4q37j537j486p29L9L31L57N40P88P56N03N27J041J594J682J500
51220C19167J776K782L817L964L122K012J255Q00L99J33J70L16K87J86L69Q56
51204C41411J287J423J365J207Q44K05n74j325j947k304k255j865j399j025p66
51189C34282o69q13j100j407j926k901l897l859k363m56L06l90j373j462p75k74
$$ y = [563653, 544332, 525844, 507851, 489805, 471742, 454505, 439058, 425703, 414071, 403654, 394160, 385512, 377670, 370454, 363526, 356677, 350131, 344300, 339172, 334252, 329286, 324712, 321124, 318520, 316432, 314584, 313010, 311655, 310332, 309127, 308411, 308298, 308432, 308471, 308441, 308399, 308018, 306898, 305184, 303624, 302955, 303330, 304299, 305266, 306099, 307337, 309578, 312571, 315126, 316209, 315927, 315169, 314498, 313808, 312975, 312322, 312245, 312740, 313476, 314064, 314098, 313261, 311724, 310238, 309509, 309548, 309879, 310236, 310776, 311564, 312320, 312823, 313350, 314391, 315985, 317667, 319167, 320943, 323725, 327542, 331506, 334628, 336640, 337895, 338695, 339094, 339227, 339397, 339713, 340000, 340186, 340555, 341411, 342698, 344121, 345486, 346693, 347537, 347742, 347168, 345843, 343896, 341592, 339337, 337472, 336073, 335048, 334282, 333613, 332800, 331700, 330293, 328367, 325466, 321569, 317710, 315347, 314891, 315197, 314807, 313434, 311972, 311197, 310923]
51173C10923m19p30n97j41k6n37j171j227o01J36M47L61L14N64R55J199J271J444
51155C12165J900K421K603K352K011J924K024K000J740J411J148Q70M84J37J66
51140C35356O74J260J346Q62L54K10O4n74j309j214k48N27M10j7JJ41l40j194
51122C36309j474r40l53l09o65j138j680k119k057j411n10L31R21Q98J24o59l98
51105C24870Q07J669J381O02L62P72J357J911K404K553K180J591J069L23q56j840
51089C41155j786r08l96j023k275k994k542j261n3M48L40J55J94L42M47M76L78
51072C30697J82K47Q75J613J617Q66K85M36P96P60N56O13P61P30P62J060J117
51055C43973M93l14n26k08J46O66J751K912L137K321J422J056Q76M92J49K48Q11
$$ y = [310923, 310504, 309774, 309177, 309036, 309010, 308473, 307302, 306075, 305474, 305610, 306057, 306418, 306732, 307296, 308251, 309450, 310721, 312165, 314065, 316486, 319089, 321441, 323452, 325376, 327400, 329400, 331140, 332551, 333699, 334569, 335053, 335190, 335356, 336030, 337290, 338636, 339498, 339852, 340062, 340126, 339552, 338243, 337029, 336781, 337308, 337718, 337701, 337702, 337843, 337503, 336309, 334835, 333895, 333542, 333233, 332568, 331430, 329750, 327631, 325574, 324163, 323653, 323984, 324905, 325803, 325927, 325268, 324870, 325677, 327346, 328727, 329329, 329691, 330463, 331820, 333731, 336135, 338688, 340868, 342459, 343528, 343851, 342995, 341155, 339369, 338461, 338065, 337042, 334767, 331773, 329231, 327970, 327917, 328365, 328705, 328860, 329054, 329396, 329843, 330319, 330697, 330879, 331126, 332001, 333614, 335231, 336097, 336382, 336818, 337614, 338374, 338930, 339543, 340304, 341034, 341796, 342856, 343973, 344466, 344152, 343626, 343418, 343564, 344230, 345981, 348893, 352030, 354351, 355773, 356829, 357705, 358197, 358346, 358594, 359405]
51038C59405J587K237K298J618Q17P62J459K069K047J638J205P57L48K73O42J193
51022C80355J714K194K503K479K384K637L022K856K057J376J314J550J739K174
51008D10354L177M446N504O357P188P836Q005P874P978Q719J0068J1502J2059
50995E11067J0958Q468N754L697K205J004L93P13J462J648Q67l88j456k103k532
50980E41757l063l772m268m040l175k391k225k461k712l109l982n063n573n062
50966D90861l814k428j296m50K63R81J697K399L228M283N258N621N293M818M662
50951E21376M667M388L662K628J546P67N94Q47R92Q85J003J633K376K812L213
50936E53389L987M885N366N471N654O019O360O771P508Q409R198J0242J2216J4828
$$ y = [359405, 360992, 363229, 365527, 367145, 367962, 368724, 370183, 372252, 374299, 375937, 377142, 377899, 378247, 378520, 379162, 380355, 382069, 384263, 386766, 389245, 391629, 394266, 397288, 400144, 402201, 403577, 404891, 406441, 408180, 410354, 413531, 417977, 423481, 429838, 437026, 444862, 452867, 460741, 468719, 477438, 487506, 499008, 511067, 522025, 530493, 536247, 539944, 542149, 543153, 543546, 544259, 545721, 547369, 548236, 547848, 546392, 544289, 541757, 538694, 534922, 530654, 526614, 523439, 521048, 518823, 516362, 513650, 510541, 506559, 501496, 495923, 490861, 487047, 484619, 483323, 482873, 483136, 484117, 485814, 488213, 491441, 495724, 500982, 506603, 511896, 516714, 521376, 526043, 530431, 534093, 536721, 538267, 539034, 539628, 540475, 541467, 542352, 543355, 544988, 547364, 550176, 553389, 557376, 562261, 567627, 573098, 578752, 584771, 591131, 597902, 605410, 613819, 623017, 633259, 645475, 660303]
50922F60303J6803J7367J7066J6767J6532J6039J5554J5789J6979J8678K0379
50911H48256K2015K3908K6442K9730L3360L6589L9068M1176M3440M5739M7452
50900A237175M8280M8545M8626M8448M7620M5923M3454M0454L7112L3487K9516
50889A708640K5172K0696J6484J2716R205N792K809Q46L1k63q33j999l568n266
50875A790462o965q650j0486j2804j5724j8770k1222k2969k4724k7203l0329l3433
50863A557183l6012l8027l9637m0877m1647m1830m1427m0575l9427l7972l6156
50852A123596l4171l2337l0646k8751k6588k4536k2714k0554j7705j4972j3554
50841H57068j3428j3259j2060j0226q613p363o161n029m160l345k268j208p11
$$ y = [660303, 677106, 694473, 711539, 728306, 744838, 760877, 776431, 792220, 809199, 827877, 848256, 870271, 894179, 920621, 950351, 983711, 1020300, 1059368, 1100544, 1143984, 1189723, 1237175, 1285455, 1334000, 1382626, 1431074, 1478694, 1524617, 1568071, 1608525, 1645637, 1679124, 1708640, 1733812, 1754508, 1770992, 1783708, 1792913, 1798705, 1801514, 1802360, 1802391, 1802128, 1801295, 1799296, 1795728, 1790462, 1783497, 1774847, 1764361, 1751557, 1735833, 1717063, 1695841, 1672872, 1648148, 1620945, 1590616, 1557183, 1521171, 1483144, 1443507, 1402630, 1360983, 1319153, 1277726, 1237151, 1197724, 1159752, 1123596, 1089425, 1057088, 1026442, 997691, 971103, 946567, 923853, 903299, 885594, 870622, 857068, 843640, 830381, 818321, 808095, 799482, 792119, 785958, 780929, 776769, 773424, 771156, 769948, 769237]
50828G69237n73J03J608L108L701L589L696M523N800P057Q145R175J0316J1628
50814H41113J2993J4137J4890J5349J5782J6475J7719J9646K1906K3861K5340
50803A039211K6904K9057L1479L3557L5417L7815M1136M5075M9351N4096N9315
50792A482413O4600O9678P4823Q0408Q6326R2138R7462J02026J05674J08502J10646
50781B474696J11735J10973J07990J03190R6945Q9018P9151O7802N5767M3485
50771C340752L1217J9481Q775q24r158j5489j9209k0726k0959k0229j8424j6058
50759C259149j4132j3070j2727j3515j6455k1827k8711l6236m4499n3707o3264
50748B941006p2300q0514q7847r3844r7968j00190j00761r9714r7128r3498q9302
$$ y = [769237, 768664, 768767, 770375, 773483, 777184, 780773, 784469, 788992, 794792, 801849, 809994, 819169, 829485, 841113, 854106, 868243, 883133, 898482, 914264, 930739, 948458, 968104, 990010, 1013871, 1039211, 1066115, 1095172, 1126651, 1160208, 1195625, 1233440, 1274576, 1319651, 1369002, 1423098, 1482413, 1547013, 1616691, 1691514, 1771922, 1858248, 1950386, 2047848, 2149874, 2255548, 2364050, 2474696, 2586431, 2697404, 2805394, 2908584, 3005529, 3094547, 3173698, 3241500, 3297267, 3340752, 3371969, 3391450, 3400225, 3399401, 3390243, 3374754, 3355545, 3334819, 3313860, 3293631, 3275207, 3259149, 3245017, 3231947, 3219220, 3205705, 3189250, 3167423, 3138712, 3102476, 3057977, 3004270, 2941006, 2868706, 2788192, 2700345, 2606501, 2508533, 2408343, 2307582, 2207868, 2110740, 2017242, 1927940]
50737A927940q4444p8647p2128o5434n8801n2265m6146m0910l6598l2803k9171
50726A330593k5557k1911j8437j5657j3874j2689j1485j0273r491r115q665q136
50714A165303q158r008r969j0125r416q542q072q101q631r715j1128j2197j2281
50701A039960j1349r928q509p119n531l666j677K84K123L711M955O077P556R636
50687A026523J2035J4271J6214J8158K0362K2684K4732K6421K8248L0878L4404
50676A274930L8272M2018M5735M9558N2986N5313N6590N7503N8298N8506N7858
50665A847567N6780N5555N3703N0742M7045M3169L8637L2314K4007J4979O607
50654B271105q76p952j4554j9809k2994k4311k4453k3722k1877j8854j5243j1766
$$ y = [1927940, 1843496, 1764849, 1692721, 1627287, 1568486, 1516221, 1470075, 1429165, 1392567, 1359764, 1330593, 1305036, 1283125, 1264688, 1249031, 1235157, 1222468, 1210983, 1200710, 1191219, 1182104, 1173439, 1165303, 1157145, 1148137, 1138168, 1128043, 1118627, 1110085, 1102013, 1093912, 1085281, 1075566, 1064438, 1052241, 1039960, 1028611, 1018683, 1010174, 1003055, 997524, 993858, 992181, 992465, 994588, 998299, 1003254, 1009331, 1016887, 1026523, 1038558, 1052829, 1069043, 1087201, 1107563, 1130247, 1154979, 1181400, 1209648, 1240526, 1274930, 1313202, 1355220, 1400955, 1450513, 1503499, 1558812, 1615402, 1672905, 1731203, 1789709, 1847567, 1904347, 1959902, 2013605, 2064347, 2111392, 2154561, 2193198, 2225512, 2249519, 2264498, 2271105, 2270229, 2262277, 2247723, 2227914, 2204920, 2180609, 2156156, 2132434, 2110557, 2091703, 2076460, 2064694]
50642B064694q598n641l382k905m795q479j2905j7629k2893k8889l5259m1323
50630A871996m6496n0454n3079n4300n4017n2227m9170m5295m1053l6822l2822
50619A356261k8923k4695j9980j5248j1020p168l241O58L971O593Q934J1012J2334
50606A289488J2938J3656J4827J5583J5070J3845J3210J3578J4271J4702J5046
50595A446214J5698J6681J7595J7840J7034J5603J4708J5262J7133J9603K2221
50584A635592K4816K7106K8893L0487L2322L4321L6019L7187L7839L7922L7437
50573A999941L6599L5436L3531L0733K7768K5471K3669K1505J8633J5227J1003
50562B279516N226k081r601j5672j9356k0663k0294j9257j8159j6808j4849j2592
$$ y = [2064694, 2056096, 2050455, 2047073, 2044168, 2039373, 2030894, 2017989, 2000360, 1977467, 1948578, 1913319, 1871996, 1825500, 1775046, 1721967, 1667667, 1613650, 1561423, 1512253, 1466958, 1425905, 1389083, 1356261, 1327338, 1302643, 1282663, 1267415, 1256395, 1249227, 1245986, 1246644, 1250615, 1257208, 1266142, 1277154, 1289488, 1302426, 1316082, 1330909, 1346492, 1361562, 1375407, 1388617, 1402195, 1416466, 1431168, 1446214, 1461912, 1478593, 1496188, 1514028, 1531062, 1546665, 1561373, 1576635, 1593768, 1613371, 1635592, 1660408, 1687514, 1716407, 1746894, 1779216, 1813537, 1849556, 1886743, 1924582, 1962504, 1999941, 2036540, 2071976, 2105507, 2136240, 2164008, 2189479, 2213148, 2234653, 2253286, 2268513, 2279516, 2284742, 2282661, 2273060, 2257388, 2238032, 2217369, 2197075, 2177818, 2159659, 2142851, 2128002, 2115410]
50550B115410j0629q865o748m403k715k251k977n075r096j4947k1547k7866l3677
50537A964614l8998m3596m7434n0800n3509n4706n4072n2553n1244n0023m8036
50526A419643m5086m1764l8448l5020l1493k8194k5228k2235j8871j5271j1941
50515A106092r348p534n947l809r09K111M531O434Q443J0708J2596J3587J4087
50502A151042J5063J6890J8843J9944K0136K0335K1308K2862K4364K5616K6722
50491A383125K7412K7233K6458K6067K6565K7385K7736K7587K7473K7754K8567
50480A683362L0166L2724L5850L8832M1543M4687M8925N3924N8607O2304O5395
50469B196319O8618P2137P5666P9334Q3566Q7968R1079R1814R0621Q8552Q5725
$$ y = [2115410, 2104781, 2095916, 2089168, 2084765, 2082050, 2079799, 2076822, 2071747, 2062651, 2047704, 2026157, 1998291, 1964614, 1925616, 1882020, 1834586, 1783786, 1730277, 1675571, 1621499, 1568946, 1517702, 1467679, 1419643, 1374557, 1332793, 1294345, 1259325, 1227832, 1199638, 1174410, 1152175, 1133304, 1118033, 1106092, 1096744, 1089210, 1083263, 1079454, 1078545, 1080656, 1085187, 1091621, 1100064, 1110772, 1123368, 1136955, 1151042, 1166105, 1182995, 1201838, 1221782, 1241918, 1262253, 1283561, 1306423, 1330787, 1356403, 1383125, 1410537, 1437770, 1464228, 1490295, 1516860, 1544245, 1571981, 1599568, 1627041, 1654795, 1683362, 1713528, 1746252, 1782102, 1820934, 1862477, 1907164, 1956089, 2010013, 2068620, 2130924, 2196319, 2264937, 2337074, 2412740, 2492074, 2575640, 2663608, 2754687, 2846501, 2937122, 3025674, 3111399]
50458C111399Q1503P5700O8621O0152M9976L8615K7117J5503K750j1257k4871
50447C495208l6500m6253n5037o2771o8400p1147p0938o7935o2549n5696m8305
50436B849677m0635l2515k4015j5460p132N07O648J0698J2678J2514R381K577
50424B784923p260j8606l0528m2889n5157o6126p5009q1989q7311r0572r1363
50413B138113r0059q7401q3696p9014p3848o8901o4227n9160n3308m7249m1849
50402A389401l7203l2644k7791k3088j9106j5713j2367q940n748k878m3K822N402
50389A212104P583R687J1900J3897J5319J6243J6969J7691J8572J9606K0109J8942
50377A398622J5754J1573P658M213Q20k254m020m008k853j551o37p8M05J105K152
$$ y = [3111399, 3192902, 3268602, 3337223, 3397375, 3447351, 3485966, 3513083, 3528586, 3531336, 3520079, 3495208, 3458708, 3412455, 3357418, 3294647, 3226247, 3155100, 3084162, 3016227, 2953678, 2897982, 2849677, 2809042, 2776527, 2752512, 2737052, 2729920, 2730427, 2737075, 2747773, 2760451, 2772965, 2782346, 2784923, 2777663, 2759057, 2728529, 2685640, 2630483, 2564357, 2489348, 2407359, 2320048, 2229476, 2138113, 2048054, 1960653, 1876957, 1797943, 1724095, 1655194, 1590967, 1531807, 1478499, 1431250, 1389401, 1352198, 1319554, 1291763, 1268675, 1249569, 1233856, 1221489, 1212549, 1206801, 1203923, 1203880, 1206702, 1212104, 1219687, 1229374, 1241274, 1255171, 1270490, 1286733, 1303702, 1321393, 1339965, 1359571, 1379680, 1398622, 1414376, 1425949, 1433607, 1437820, 1438640, 1436386, 1432366, 1428358, 1425505, 1423954, 1423317, 1423239, 1423644, 1424749, 1426901]
50362A426901L565N510Q237J1521J4553J6799J8717K1110K4154K7471L0978L4831
50350A644347L8753M2048M4328M5663M6063M5427M4048M2426M0436L7314L2736
50339B103589K7352K1953J6626J0956M638k525j0682j9527k8035l5121m0532m4821
50327B003871m8450n1216n2467n1669m8844m4576l9702l4767k9802k4530j8844
50316A559004j3094p867l500K15L617O469P892P193M560Q24l305p575j2032j6812
50302A525589k1824k6397k9494l0836l1579l3340l6528m0026m2446m3209m2411
50291A147499m0351l7448l4225l1057k8117k5580k3523k1512j8851j5466j2224
50280H59145r963q474o847m721k780j881j893j699m58J332K375K224J869K465
$$ y = [1426901, 1430466, 1435976, 1444213, 1455734, 1470287, 1487086, 1505803, 1526913, 1551067, 1578538, 1609516, 1644347, 1683100, 1725148, 1769476, 1815139, 1861202, 1906629, 1950677, 1993103, 2033539, 2070853, 2103589, 2130941, 2152894, 2169520, 2180476, 2185114, 2182589, 2171907, 2152380, 2124345, 2089224, 2048692, 2003871, 1955421, 1904205, 1851738, 1800069, 1751225, 1706649, 1666947, 1632180, 1602378, 1577848, 1559004, 1545910, 1538043, 1534543, 1534758, 1538375, 1544844, 1552736, 1559929, 1564489, 1565313, 1562008, 1554433, 1542401, 1525589, 1503765, 1477368, 1447874, 1417038, 1385459, 1352119, 1315591, 1275565, 1233119, 1189910, 1147499, 1107148, 1069700, 1035475, 1004418, 976301, 950721, 927198, 905686, 886835, 871369, 859145, 849182, 840708, 833861, 829140, 826360, 824479, 822586, 820887, 820429, 821761, 824136, 826360, 828229, 830694]
50266H30694L870N042N553N907O492P032P304P611Q121Q346P793O749N876N298
50252I21688M597L617K757K521L033M055N174O106O829P482Q027Q274Q333Q715
50238A001208R738J1047J2061J2659J3034J2970J1736Q729M038j529o791j0617
50226A078283j2565j3182j3406j3514j2967j1384r241p324n762m045j955j2J191
50213I74117J770K431L679N459P471R432J0969J1590J1189J0387R986J0093J0068
50200A078641R450Q501P685O976O100N155M443L716K303J74j740k775l631n499
50186A119499q292j0559j1229j0660r653q234o107l796k421k450l500n262p840
50173A029496j0978j3720j5266j5677j5369j4513j3326j2447j2345j2604j2460
$$ y = [830694, 834564, 839606, 845159, 851066, 857558, 864590, 871894, 879505, 887626, 895972, 903765, 910514, 916390, 921688, 926285, 929902, 932659, 935180, 938213, 942268, 947442, 953548, 960377, 967859, 975886, 984160, 992493, 1001208, 1010946, 1021993, 1034054, 1046713, 1059747, 1072717, 1084453, 1093182, 1097220, 1095691, 1088900, 1078283, 1065718, 1052536, 1039130, 1025616, 1012649, 1001265, 992024, 984700, 978938, 974893, 972938, 972926, 974117, 975887, 978318, 981997, 987456, 994927, 1004359, 1015328, 1026918, 1038107, 1048494, 1058480, 1068573, 1078641, 1088091, 1096592, 1104277, 1111253, 1117353, 1122508, 1126951, 1130667, 1132970, 1133144, 1131404, 1128629, 1124998, 1119499, 1111207, 1100648, 1089419, 1078759, 1069106, 1060872, 1054765, 1050969, 1048548, 1046098, 1042598, 1037336, 1029496, 1018518, 1004798, 989532, 973855, 958486, 943973, 930647, 918200, 905855, 893251, 880791]
50162H80791j1928j1771j2236j2486j1601r860q555q567r436r966r616q934q623
50149G47212q609q329p672p057o732o528o313o093n589m411k859j877j893k272
50135F70978k279j998j803j622j310j225j688k311k527k433k385k192j523p62
50121F44920n51p14n69k08m12j324k122k175j644q19K39J264J860K216K913L779
50105F46653L935L348L287M594O371P281P396P830Q990J0269J1324J2702J4892
50092G48872J7491J9591K0817K1620K2626K3816K4516K4253K3359K2446K1511
50081I90918K0078J8173J6470J5382J4531J3328J1509Q911N362J115l199p327
50069A105251j1540j5778j9303k1639k3118k4005k3878k2537k0791j9484j8311
$$ y = [880791, 868863, 857092, 844856, 832370, 820769, 810909, 802354, 793787, 784351, 774385, 764769, 755835, 747212, 738603, 730274, 722602, 715545, 708813, 702285, 695972, 689879, 684290, 679879, 677020, 675143, 673250, 670978, 668699, 666701, 664898, 663276, 661966, 660741, 659053, 656742, 654215, 651782, 649397, 647205, 645682, 644920, 644369, 643655, 643086, 642878, 642466, 641142, 639020, 636845, 635201, 634382, 634621, 635885, 637745, 639961, 642874, 646653, 650588, 653936, 657223, 661817, 668188, 675469, 682865, 690695, 699685, 709954, 721278, 733980, 748872, 766363, 785954, 806771, 828391, 851017, 874833, 899349, 923602, 946961, 969407, 990918, 1010996, 1029169, 1045639, 1061021, 1075552, 1088880, 1100389, 1109300, 1114662, 1115777, 1112578, 1105251, 1093711, 1077933, 1058630, 1036991, 1013873, 989868, 965990, 943453, 922662, 903178, 884867]
50058H84867j6616j4814j3822j3427j2429j0573q994q475q311p516o249n378n158
50045G53105n080m712m078l333k576k049k135k978m169m933m731l789k876k484
50031G03182k307j772p76L55J461K583L540M006M106M360M908N321N392N548O163
50016G46070O872P015O495N811N439N517N908O202N866M741L392K532K225J997
50002H16082J601J203R04N53J64K4J69J88j69n81o37m04j52K01R05J843K602L094
49984H27590L620M436N605P172Q995J0418J0757J0248R987J0717J2180J3886J5825
49971I51436J7955J9601K0018J9294J8087J6717J5104J3297J1448R370O816M233
49959A123376K508J837J357L5k429n679r251j2807j6176j9251k1766k3345k4000
$$ y = [884867, 868251, 853437, 839615, 826188, 813759, 803186, 794192, 785717, 777406, 769890, 763641, 758263, 753105, 748025, 743313, 739235, 735902, 733326, 731277, 729142, 726164, 721995, 717062, 712331, 708542, 705666, 703182, 700875, 699103, 698327, 698682, 700143, 702726, 706266, 710272, 714378, 718738, 723646, 728967, 734359, 739907, 746070, 752942, 759957, 766452, 772263, 777702, 783219, 789127, 795329, 801195, 805936, 809328, 811860, 814085, 816082, 817683, 818886, 819790, 820343, 820507, 820531, 820700, 820888, 820719, 820138, 819501, 819097, 818945, 819146, 820051, 821894, 824496, 827590, 831210, 835646, 841251, 848423, 857418, 867836, 878593, 888841, 898828, 909545, 921725, 935611, 951436, 969391, 988992, 1009010, 1028304, 1046391, 1063108, 1078212, 1091509, 1102957, 1112327, 1119143, 1123376, 1125884, 1127721, 1129078, 1129113, 1126684, 1121005, 1111754, 1098947, 1082771, 1063520, 1041754, 1018409, 994409]
49946I94409k4290k4597k4523k3551k1953k0331j8589j6249j3633j1674j0454
49935G84565r066p168n534m756m434m222m519n443o113n920n633o238p404q185
49921F99930q585r225r886r771q982q484q504q151o885n338m358m005l859l680
49907F00217l423l138l061l291l359k711j665j166j386j397n13Q09J832K627L633
49892E84008M724N392N618N800O005N823N041L966K996K224J508P13k93j620l120
49877F28785m280m609m243m009m579n661o316o186n901o066o255n602m062k542
49863E58474j772j690j938k304k474j974p29O80J584J806J496Q40K22K49J126
49848E53596K274K984L333L965N043N941O120N845N748N898N680M623L063J838
$$ y = [994409, 970119, 945522, 920999, 897448, 875495, 855164, 836575, 820326, 806693, 795019, 784565, 775499, 768331, 762797, 758041, 753607, 749385, 744866, 739423, 733310, 727390, 721757, 715519, 708115, 699930, 691345, 682120, 672234, 662463, 653481, 644997, 636493, 628342, 621457, 616119, 611761, 607756, 603897, 600217, 596794, 593656, 590595, 587304, 583945, 581234, 579569, 578403, 577017, 575620, 575107, 575916, 577748, 580375, 584008, 588732, 594124, 599742, 605542, 611547, 617370, 622411, 626377, 629373, 631597, 633105, 633818, 633525, 631905, 628785, 624505, 619896, 615653, 611644, 607065, 601404, 595088, 588902, 583001, 576935, 570680, 565078, 561016, 558474, 556702, 555012, 553074, 550770, 548296, 546322, 545593, 546273, 547857, 549663, 551159, 551999, 552221, 552470, 553596, 555870, 558854, 562187, 566152, 571195, 577136, 583256, 589101, 594849, 600747, 606427, 611050, 614113, 615951]
49834F15951J422J531J467O79r33k956m594n171m801m373m609n266n545n133m518
49819E73151m245m229l952l133k035j232j065j272j246p33j43N8j4J20N60J035
49803E51625J489K202L188M010M369M515M758N029N132N216N526N890N822N146
49789F13917M183L335K689K094J355L45r07k122k882l048k988l234l843m303m154
49774F00437l645l443l737l921l327k108j092q28r80p53J75J266J704J367R93
49759E82108J259J960K453K690L162L818L830K889J931J934K509K498J644P61
49745F15446L40l3p21j356j592j857k777m157n051m914m245m046m725n677n967
49730E68668n364m457l741l059k146j264p95n17RO25P97N69N19P67Q13N43N98
$$ y = [615951, 617373, 618904, 620371, 621050, 620117, 617161, 612567, 607396, 602595, 598222, 593613, 588347, 582802, 577669, 573151, 568906, 564677, 560725, 557592, 555557, 554325, 553260, 551988, 550742, 550009, 549866, 549924, 549910, 550030, 550590, 551625, 553114, 555316, 558504, 562514, 566883, 571398, 576156, 581185, 586317, 591533, 597059, 602949, 608771, 613917, 618100, 621435, 624124, 626218, 627573, 627918, 627011, 624889, 622007, 618959, 615971, 612737, 608894, 604591, 600437, 596792, 593349, 589612, 585691, 582364, 580256, 579164, 578336, 577356, 576603, 576778, 578044, 579748, 581115, 582108, 583367, 585327, 587780, 590470, 593632, 597450, 601280, 604169, 606100, 608034, 610543, 613041, 614685, 615446, 615786, 615753, 615032, 613676, 612084, 610227, 607450, 603293, 598242, 593328, 589083, 585037, 580312, 574635, 568668, 563304, 558847, 555106, 552047, 549901, 548637, 547842, 547325, 547334, 547959, 548756, 549325, 549844, 550611, 551424, 551967, 552565]
49713E52565J412K568L433L915M165M110L690L108K477J623O26O6L04R02J207
49698E86171J091O82r5j184k001k107k037k665l899m723m562l890l356k961k390
$$ y = [552565, 553977, 556545, 559978, 563893, 568058, 572168, 575858, 578966, 581443, 583066, 583692, 583758, 584062, 584964, 586171, 587262, 587944, 587849, 586665, 584664, 582557, 580520, 577855, 573956, 569233, 564671, 560781, 557425, 554464, 552074]
$$ [...]
##END NTUPLES=NMR SPECTRUM
##END=
